##TITLE=1H_LY-8Dix.5.B
 CD3CN, 8 sc, 
 13.05.2021
##JCAMPDX= 6.0         $$ Bruker NMR JCAMP-DX V2.0
##DATA TYPE= NMR FID
##DATA CLASS= NTUPLES
##ORIGIN= UXNMR, Bruker Analytische Messtechnik GmbH
##OWNER= root
$$ XWIN-NMR		Version 3.5
$$ Thu May 13 09:57:06 2021 Russian Standard Time (UT+4h)  she@DPX200
##.OBSERVE FREQUENCY= 200.131506
##.OBSERVE NUCLEUS= ^1H
##.DELAY= (6, 6)
##.ACQUISITION MODE= SIMULTANEOUS
##.ACQUISITION SCHEME= undefined
##.AVERAGES= 8
##.DIGITISER RES= 18
##SPECTROMETER/DATA SYSTEM= spect
##.PULSE SEQUENCE= zg30
##.SOLVENT NAME= CD3CN
##.SHIFT REFERENCE= (INTERNAL, CD3CN, 0, 15.7039)
##AUDIT TRAIL= $$ (NUMBER, WHEN, WHO, WHERE, WHAT)
$$ ##TITLE= Audit trail, XWIN-NMR		Version 3.5
$$ ##JCAMPDX= 5.01
$$ ##ORIGIN= Bruker BioSpin GmbH
$$ ##OWNER= she
$$ F:/spectra/data/she/nmr/H-F/1/audita.txt
$$ ##AUDIT TRAIL=  $$ (NUMBER, WHEN, WHO, WHERE, WHAT)
(   1,<2021-05-13 09:54:59.68 +0400>,<she>,<DPX200>,
      <created by zg, POWCHK disabled, PULCHK disabled
       configuration hash MD5:
       00 E9 B6 7A A2 85 ED C7 34 08 36 98 17 FE 4E 26
       data hash MD5: 16K
       AE 7F C9 BA 11 1C 1E B8 24 63 54 A1 AB FD 11 11>)
$$ ##END=
$$ 
$$ hash MD5
$$ 78 61 24 32 AB 27 59 54 B2 F9 8E E9 54 E2 43 D4
##$RELAX= 
##$RELAX= 
##$RELAX= 
##$RELAX= 
##$RELAX= 
##$RELAX= 
$$ Bruker specific parameters
$$ --------------------------
##$DU= <F:/spectra>
##$EXPNO= 1
##$NAME= <H-F>
##$PROCNO= 1
##$TYPE= <nmr>
##$USER= <she>
##$AMP= (0..31)
100 100 100 100 100 100 100 100 100 100 100 100 100 100 100 100 100 100 
100 100 100 100 100 100 100 100 100 100 100 100 100 100 
##$AQSEQ= 0
##$AQ_mod= 1
##$AUNM= <au_zg>
##$AUTOPOS= <>
##$BF1= 200.13
##$BF2= 200.13
##$BF3= 200.13
##$BF4= 200.13
##$BF5= 200.13
##$BF6= 200.13
##$BF7= 200.13
##$BF8= 200.13
##$BYTORDA= 1
##$CFDGTYP= 0
##$CFRGTYP= 5
##$CHEMSTR= <none>
##$CNST= (0..31)
1 1 145 1 1 1 1 1 1 1 1 1 1 1 1 1 1 1 1 1 1 1 1 1 1 1 1 1 1 1 1 1 
##$CPDPRG= <>
##$CPDPRG1= <>
##$CPDPRG2= <>
##$CPDPRG3= <>
##$CPDPRG4= <mlev>
##$CPDPRG5= <mlev>
##$CPDPRG6= <mlev>
##$CPDPRG7= <mlev>
##$CPDPRG8= <mlev>
##$CPDPRGB= <>
##$CPDPRGT= <>
##$D= (0..31)
0 1.2 0 0 0 0 0 0 0 0.06 0 0.03 0 0 0 0 0.0002 0 0 0 0 0 0 0 0 0 0 0 0 
0 0 0 
##$DATE= 1620885299
##$DBL= (0..7)
120 120 120 120 120 120 120 120 
##$DBP= (0..7)
150 150 150 150 150 150 150 150 
##$DBP07= 0
##$DBPNAM0= <>
##$DBPNAM1= <>
##$DBPNAM2= <>
##$DBPNAM3= <>
##$DBPNAM4= <>
##$DBPNAM5= <>
##$DBPNAM6= <>
##$DBPNAM7= <>
##$DBPOAL= (0..7)
0.5 0.5 0.5 0.5 0.5 0.5 0.5 0.5 
##$DBPOFFS= (0..7)
0 0 0 0 0 0 0 0 
##$DE= 6
##$DECBNUC= <off>
##$DECIM= 32
##$DECNUC= <off>
##$DECSTAT= 4
##$DIGMOD= 1
##$DIGTYP= 9
##$DL= (0..7)
0 120 120 120 120 120 120 120 
##$DP= (0..7)
150 150 150 150 150 150 150 150 
##$DP07= 0
##$DPNAME0= <>
##$DPNAME1= <>
##$DPNAME2= <>
##$DPNAME3= <>
##$DPNAME4= <>
##$DPNAME5= <>
##$DPNAME6= <>
##$DPNAME7= <>
##$DPOAL= (0..7)
0.5 0.5 0.5 0.5 0.5 0.5 0.5 0.5 
##$DPOFFS= (0..7)
0 0 0 0 0 0 0 0 
##$DQDMODE= 0
##$DR= 18
##$DS= 0
##$DSLIST= <SSSSSSSSSSSSSSS>
$$ [...]
##$SUBNAM2= <"">
##$SUBNAM3= <"">
##$SUBNAM4= <"">
##$SUBNAM5= <"">
##$SUBNAM6= <"">
##$SUBNAM7= <"">
##$SUBNAM8= <"">
##$SUBNAM9= <"">
##$SW= 16.9725357007746
##$SWIBOX= (0..15)
0 0 2 0 0 0 0 0 0 0 0 0 0 0 0 0 
##$SW_h= 3396.73913043478
##$TD= 16384
##$TD0= 1
##$TE= 0
##$TE2= 300
##$TE3= 300
##$TEG= 300
##$TL= (0..7)
0 120 120 120 120 120 120 120 
##$TP= (0..7)
150 150 150 150 150 150 150 150 
##$TP07= 0
##$TPNAME0= <>
##$TPNAME1= <>
##$TPNAME2= <>
##$TPNAME3= <>
##$TPNAME4= <>
##$TPNAME5= <>
##$TPNAME6= <>
##$TPNAME7= <>
##$TPOAL= (0..7)
0.5 0.5 0.5 0.5 0.5 0.5 0.5 0.5 
##$TPOFFS= (0..7)
0 0 0 0 0 0 0 0 
##$TUNHIN= 0
##$TUNHOUT= 0
##$TUNXOUT= 0
##$USERA1= <user>
##$USERA2= <user>
##$USERA3= <user>
##$USERA4= <user>
##$USERA5= <user>
##$V9= 5
##$VALIST= <valist>
##$VCLIST= <CCCCCCCCCCCCCCC>
##$VD= 0
##$VDLIST= <DDDDDDDDDDDDDDD>
##$VPLIST= <PPPPPPPPPPPPPPP>
##$VTLIST= <TTTTTTTTTTTTTTT>
##$WBST= 1024
##$WBSW= 4
##$XGAIN= (0..3)
0 0 0 0 
##$XL= 0
##$YL= 0
##$YMAX_a= 987992
##$YMIN_a= -931836
##$ZGOPTNS= <>
##$ZL1= 120
##$ZL2= 120
##$ZL3= 120
##$ZL4= 120
##$ABSF1= 10
##$ABSF2= 0
##$ABSG= 5
##$ABSL= 3
##$ALPHA= 0
##$AQORDER= 0
##$ASSFAC= 0
##$ASSFACI= 0
##$ASSFACX= 0
##$ASSWID= 0
##$AUNMP= <proc_1d>
##$AZFE= 0.1
##$AZFW= 0.1
##$BCFW= 1
##$BC_mod= 2
##$BYTORDP= 1
##$COROFFS= 0
##$CY= 11.3945322036743
##$DATMOD= 1
##$DC= 2
##$DFILT= <>
##$DTYPP= 0
##$F1P= 15.9154993809931
##$F2P= -4.1035820241983
##$FCOR= 0.5
##$FTSIZE= 0
##$FT_mod= 4
##$GAMMA= 1
##$GB= 0.15
##$INTBC= 1
##$INTSCL= 1
##$ISEN= 128
##$LB= 0.24
##$LEV0= 0
##$LPBIN= 0
##$MAXI= 10000
##$MC2= 0
##$MEAN= 0
##$ME_mod= 0
##$MI= 1.114404
##$NCOEF= 0
##$NC_proc= 0
##$NLEV= 6
##$NOISF1= 3.799351
##$NOISF2= 2.8
##$NSP= 1
##$NTH_PI= 0
##$NZP= 0
##$OFFSET= 15.70392
##$PC= 1
##$PHC0= -11121.79
##$PHC1= 9.801003
##$PH_mod= 1
##$PKNL= yes
##$PPARMOD= 0
##$PSCAL= 0
##$PSIGN= 0
##$REVERSE= no
##$SF= 200.130013532006
##$SI= 16384
##$SIGF1= 3
##$SIGF2= 2
##$SINO= 400
##$SIOLD= 16384
##$SREGLST= <1H.CDCl3>
##$SSB= 0
##$STSI= 0
##$STSR= 0
##$SW_p= 3612.71676300578
##$SYMM= 0
##$S_DEV= 0
##$TDeff= 0
##$TDoff= 0
##$TI= <>
##$TILT= no
##$TM1= 0
##$TM2= 0
##$TOPLEV= 0
##$USERP1= <user>
##$USERP2= <user>
##$USERP3= <user>
##$USERP4= <user>
##$USERP5= <user>
##$WDW= 1
##$XDIM= 8192
##$YMAX_p= 0
##$YMIN_p= 0
$$ End of Bruker specific parameters
$$ ---------------------------------
##NTUPLES= NMR FID
##VAR_NAME=  TIME,          FID/REAL,        FID/IMAG
##SYMBOL=    X,             R,               I
##VAR_TYPE=  INDEPENDENT,   DEPENDENT,       DEPENDENT
##VAR_FORM=  AFFN,          ASDF,            ASDF
##VAR_DIM=   8192,          8192,            8192
##UNITS=     SECONDS,       ARBITRARY UNITS, ARBITRARY UNITS
##FACTOR=    0.0002944,     1,               1
##FIRST=     0,             0,               0
##LAST=      2.4114304,     0,               0
##MIN=       0,             -931836,         0
##MAX=       2.4114304,     987992,          0
$$ Real data points
##PAGE= N=1
##DATA TABLE= (X++(R..R)), XYDATA
$$ [...]
3544B255o640J719O952J354o159l502M398N607k007o564j862O138M422m544o663
3559e096J290P822J748p806n540O009Q114l420j0083J53R525L611p970o895N202
3574c336Q782j513r087j956Q027N689n160p766J566R133K482p624n701M814Q683
3589G033j306r002k762Q375O418o263r208K418J0251K186r937o557P596R298m173
3604D367j1144k14J0739M607r494q181N930J0241j763j0475l076R244O393n465
3618A709q817J280R715L139q756o810N928J0035j467j1208k797J0400P157q034
3632A474r946L732J2006N81j0810n365Q755Q759n084j0825O03J0245M165q208
3646H2q006N160R647p53j1069l280R209P422o118r935K107J0502K251r700o003
$$ plain form
3544 2255 -4385 -2666 4286 5640 -519 -4021 377 5984 3977 -2587 -4449 1689 6111 1567 -5096
3559 -5096 -3806 4016 5764 -2042 -7582 -1573 6541 3121 -6962 -6809 2716 6327 -1643 -8538 -3336
3574 -3336 5446 3933 -5154 -7110 917 6606 1446 -6320 -4754 4379 6861 -763 -6464 -1650 7033
3589 7033 5727 -3275 -6037 2338 8756 2493 -6715 -4297 5954 8140 -1797 -8354 -758 8540 4367
3604 4367 -6777 -6991 3748 8355 -1139 -9320 -3390 6851 5088 -5387 -8463 781 7174 1709
3618 1709 -7108 -5828 3887 7026 -1730 -8540 -2612 7423 5956 -5252 -8049 2351 9508 1474
3632 1474 -8472 -4740 7266 7847 -2963 -8328 427 9186 4102 -6723 -6120 4125 8290 82
3646 82 -7924 -2764 6883 6130 -4939 -8219 990 8412 2294 -7641 -5534 4968 7219 -2481 -8484
3661h484O745Q812k936r978j281R539N178p126q068L714R436M68q906m065P125
3676A73P108l937q907O9Q642L936o890p023L906Q699j41q990l450P458O660n204
3692B109q360J594R211J765q476m703O183O811l351p411K87O404L230m716n400
3707d823K132O051J147n900l664M161N860j584p298r07O576M012n374o160K923
3722b848P400k86p243k612O041M539l823n941J588O215J060n695k732L737M322
3737C722j786m710q38M943K359l087l420J089M175P01l692k451K522L758j106
3752B179m116j081M442K215l712l293K116M218r92l889q48L819J462k945k117
3767b542J478J958j9k232k61J192J258q40j122j74J332O84j035q11N93J247l25
$$ plain form
3661 -8484 -1739 7073 4137 -5841 -7122 2417 7595 469 -7599 -3885 5551 6019 -2887 -6952 173
3676 173 7281 3344 -5563 -5494 3148 7084 194 -6829 -2923 5776 5635 -3355 -6805 653 7313 2109
3692 2109 -6251 -4657 4554 6319 -2157 -6860 -677 6134 2783 -4628 -4341 2063 5293 577 -4823
3707 -4823 -2691 3360 4507 -1393 -5057 -896 4964 3380 -3918 -4825 1751 5763 389 -5771 -2848
3722 -2848 4552 4266 -2977 -5589 452 4991 1168 -4773 -3185 3030 4090 -1605 -4337 -600 3722
3737 3722 1936 -2774 -3612 1331 3690 603 -2817 -1728 2447 3148 -544 -2995 -473 3285 2179
3752 2179 -1937 -3018 1424 3639 -73 -3366 -1250 2968 1976 -1913 -2761 1058 2520 -425 -2542
3767 -2542 -1064 894 875 -1357 -1618 -426 832 -8 -1130 -1304 28 712 -323 -1134 -541 706 381
3784C81j199K77J314j75r34N54J094k27r75o0J094K02j427n61J343Q64j332j320
3802a087P15J865k15k330q19J979J615j514k510L00K672M97k185k393K253K634
3818A477m59l428p92L661K378k901l570J338N015Q54n245k468M574N044l490n697
3834c709J034O828N33n778k880M805M719k906n520q4N478K266m394m292J989N273
3850C362P95n968l497M281N712k845o750m97P329L219o854n662M365Q007j763
3865C234q075j664P820M709n394p338L300Q102M35p761l296O254O672l307p645
3880c954j1Q034K837o109n795L672P417m05p923l317O615N979m221q418K52R028
3896C681K832q405o233O106Q147k907r501j235Q793N124o645p301K884Q639P36
$$ plain form
3784 381 -818 -541 773 598 -336 218 1312 1085 110 50 1144 1346 -81 -642 701 1565 233 -1087
3802 -1087 -372 1493 1278 -1052 -1871 108 1723 209 -2301 -2001 671 1168 -1017 -3410 -1157 1477
3818 1477 1018 -2410 -3202 459 2837 -64 -3634 -2296 2719 3573 -1672 -4140 434 5478 1988 -3709
3834 -3709 -2675 4153 4686 -1092 -3972 833 5552 2646 -2874 -2958 2520 4786 392 -3900 -1911 3362
3850 3362 4157 -1811 -5308 -1027 4685 1840 -4910 -5407 1922 5141 -1713 -7375 -3010 4997 3234
3865 3234 -4841 -6505 1315 6024 630 -6708 -3408 4694 5129 -2632 -5928 326 6998 3691 -3954
3880 -3954 -3965 4069 6906 797 -4998 -1326 6091 5686 -2237 -5554 1061 7040 2819 -5599 -5347 3681
3896 3681 6513 -1892 -8125 -2019 6128 3221 -6280 -7515 1278 6402 -243 -7544 -4660 3979 4715
3911D715p789m298O213P575k975r020QR086M511p507p548M370R645k73r963k359
3927e609Q220N863n534q300J590Q894K148q131n515N552P461k219r233j938Q136
3942A385N710o780p888L001R004Q55q937n285P134P942l933r371Q13R088L644
3957F382p672o719N058R033j123r289j798Q431M908n425o742K261Q192O29o798
3972f72l989N470N785k053p019j913O592M812n348p146K324P674J006p915m845
3987g237O572O365m406p647J321P194J666o120m466M365N843j802o148o31N352
4002B21L880l323n062J118N668J534m658k727L328M235q06m924j451N210L553
4017E796l943m433J402M838J102m523l770L980M394l033m928Q07M253J163l650
$$ plain form
3911 4715 -3074 -7372 -1159 6416 3441 -5579 -5571 3515 8026 519 -7029 -2659 6986 6713 -3250 -5609
3927 -5609 2611 8474 2940 -5360 -3770 5124 7272 -859 -6374 -822 6639 4420 -4813 -6751 1385
3942 1385 7095 315 -7573 -4572 4432 5287 -3650 -8935 -1801 6141 2208 -7163 -6350 2738 6382
3957 6382 -1290 -8009 -2951 6082 4959 -4330 -6128 2303 7211 1786 -4956 -2695 5497 6126 -672
3972 -672 -4661 809 6594 4541 -2478 -4391 2201 7013 1665 -5481 -3157 4517 5523 -2392 -7237
3987 -7237 -665 5700 1294 -6353 -5032 2162 3828 -2292 -6758 -2393 3450 1648 -4500 -5131 221
4002 221 4101 778 -4284 -3166 2502 4036 -622 -3349 -21 4214 3408 -1516 -2967 2243 5796
4017 5796 1853 -2580 -1178 3660 4762 239 -3531 449 4843 1810 -3118 -2311 1942 3105 -545
4032e45l560K276L619r14l626p67K328K504j170l451j64L724J464l112j800J840
4048a354K871J5l160n07L158J385k351j215J196K249R19k095j743J411J682o20
4064A841q96q69P32J522q42k307L19K049m36j654p96M95J426m82j842M05J342
4081Gp52j186N31N76m6k09l72P52N07j232j05J831m8j133j45J490O80o39j289
4100g82P18K290p69k120P12J857K11n15j593m00J936N06j475o31J18J295N90k209
4118b61k569K487L014j962m144N57L697J666m017l724L512M400k546m400R59M466
4134A135J425l473l721K598N132p40m841n35L979L300k056n098J99O233J612n422
4150b73l179L278N092n29o040k051O348L386n418m896K143O260J067p318m361
$$ plain form
4032 -545 -4105 -1829 1790 876 -2750 -3517 -1189 1315 145 -3306 -3470 254 1718 -1394 -3194 -1354
4048 -1354 1517 1532 -1628 -2135 1023 2408 57 -1158 38 2287 3206 1111 -632 779 2461 1841
4064 1841 945 76 808 2330 1488 -819 -500 1549 1113 -541 -1337 -842 584 102 -1740 -1335 7
4081 7 -745 -1931 -1400 -824 -870 -1079 -1451 -699 -192 -1424 -1529 302 254 -879 -1024 466 1146 507 -782
4100 -782 -64 2226 1457 -663 49 1906 2117 1602 9 -391 1545 2051 576 -55 63 1358 1948 -261
4118 -261 -2830 -343 2671 709 -3435 -2878 819 2485 -1532 -5256 -1744 2656 110 -4290 -3331 1135
4134 1135 2560 -913 -4634 -2036 3096 2356 -2485 -3020 959 4259 2203 -2895 -2696 3537 5149 -273
4150 -273 -3452 -174 4918 4389 -1651 -3702 2646 6032 614 -4282 -2139 4121 5188 -2130 -6491
4165f491N869N829l848o908Q60O961K154n651n533M211P098k346p039q70O040
4180C36N049l796p310J477Q525J010p664l600N631O942k550q169m37Q537K918
4195F899o951n224L739O936P6p584l273O708N459m236p133p3P151L981o398p010
4211f933M940P590k208q591j808P820N814n937q285L085R128K13q044l760N732
4226a244P053k720q461M79Q674K737o974n529L820P461L86q129k825O594N584
4241F906m053p263k64P924L791o993o821N185Q261k051q862k383Q119N505o807
4256A94p809M448Q675o46q221l378N897N866k916p415Q51P433J803n241n453L197
4272b715P198J32p954k504P068N043m050o681M68P408K263o914m432N618O008
$$ plain form
4165 -6491 -622 5207 1359 -5549 -4689 2272 4426 -1225 -6758 -2547 4551 2205 -4834 -5704 336
4180 336 5385 1589 -5721 -4244 4281 5291 -2373 -5973 -342 6600 4050 -4119 -4556 3981 6899
4195 6899 -52 -5276 -1537 5399 5475 -2109 -5382 1326 6785 2549 -4584 -4657 2494 6475 77 -6933
4211 -6933 -1993 5597 3389 -5202 -7010 810 6624 687 -7598 -4513 4615 4828 -3216 -6976 -1244
4226 -1244 5809 3089 -5372 -4893 3781 6518 -456 -5985 -2165 5296 5682 -2447 -5272 1322 6906
4241 6906 2853 -4410 -4674 3250 7041 48 -6773 -1588 6673 4622 -4240 -6623 1496 7001 194
4256 194 -7615 -3167 5508 4862 -3359 -6737 -840 5026 2110 -5305 -4454 2979 4782 -459 -5912 -2715
4272 -2715 4483 4615 -3339 -5843 1225 6268 2218 -4463 -3995 3413 5676 -1238 -5670 -52 5956
4287E956k291o923j063O293L886n114o034L497O257m19o115k510M350M773k897
4302A646o080J055N814J327m396l519K032N228m71n936q12M878L106l003m324
4317c455Q56M925J039m732j892L555K824j638l071o02L295J782k772k729J120
4332a495L416R40k731k915J720L786j471m011N39L541J054k416k481J709K936
4347B121q71k949K44K071N57j017j114J33J344N46j683n63M00J317P05j043j317
4364a119Q24J293n41j302p8J189Q03q00j569P25J697j61j650j74P45N90j90o08
4382c26O71L14q73n12R80K44j422R66J082k83j516l72J395J064j812r24J515J549
4400A740j084j127j89J228N82j115q65l32J753N97p60j642j48K271M79k722j113
$$ plain form
4287 5956 3665 -3258 -4321 1972 5858 744 -5290 -1793 4464 4045 -2070 -4580 -230 4543 1646
4302 1646 -4434 -3379 2435 3762 -634 -4153 -2121 3107 2636 -3300 -4112 766 3872 869 -3455
4317 -3455 -2599 2326 3365 -1367 -3259 296 3120 1482 -1589 -2191 1104 2886 114 -2615 -1495
4332 -1495 1921 2861 130 -2785 -1065 2721 1250 -2761 -2222 1319 2373 -43 -2524 -815 2121
4347 2121 1250 -1699 -1455 616 1173 156 -958 -825 519 1065 -618 -1181 -781 536 1241 198 -1119
4364 -1119 -295 998 457 -845 -923 266 1069 269 -1300 -575 1122 961 -689 -863 -118 472 282 -326
4382 -326 345 659 -214 -726 254 498 -924 42 1124 841 -675 -1047 348 1412 -400 -1324 191 1740
4400 1740 656 -471 -660 568 1150 35 -830 -1162 591 1188 428 -1214 -1362 909 1388 -1334 -2447
4417b447K414K370j774k613m27L409J593l158k682K465K908l10l150j223L183
4432E58K920k957l940J875M563O81m375k665L438L897j631n265K75N228J830m269
4448A63m303K222N920o08o017k074N178L924l432n592J164O356R94n984l605M481
4464a213N171j704n706j306N621L635m133n303J809O900J473p183m186N944O853
4479F672l544q445Q54Q496K630p323m871M715P140k507p674o75P022L824m943
4494A371o423K115P353O08o901l873M757O048k128p658j043P382L978n634o769
4509f817K907P743N65p653l740P039O299m278q878J685R027K638p790n447N921
4524g79P465k543q222l16P343L792n422o128K645P282O28p042m005M990N983k047
$$ plain form
4417 -2447 -33 2337 563 -2050 -2477 932 2525 -633 -3315 -850 2058 1748 -1402 -2625 558
4432 558 3478 521 -3419 -1544 3019 3700 -675 -3340 98 3995 2364 -2901 -2626 2602 4432 163
4448 163 -4140 -1918 4002 3394 -2623 -4697 481 4405 973 -4619 -3455 2901 3895 -2089 -5694 -1213
4464 -1213 3958 2254 -3452 -4758 863 4498 365 -4938 -3129 3771 5244 -1939 -6125 -181 6672
4479 6672 3128 -5317 -4463 4033 6663 -660 -5531 -816 6324 3817 -3857 -4532 2490 6314 1371
4494 1371 -5052 -2937 4416 5024 -1877 -5750 -993 5055 2927 -4731 -5774 1608 5586 -48 -6817
4509 -6817 -3910 3833 4398 -3255 -6995 44 6343 2065 -6813 -5128 3899 6537 -1253 -6700 -779
4524 -779 6686 4143 -4079 -4395 2948 6740 1318 -4810 -2165 5117 5745 -1297 -5302 -312 5671 3624
4540C624p928o64P531L625o308o804L648P812l52q119k871P193N067m838o935
4555f319J813P142K102o666m696M706O920j602p229j477O898M371m916o292K941
4570b304P411L45p321l140N698N486k836o903L93O605K757n944m770L330N973
4585D780j120o496j950N672L862l753n710J075N647J229n119l567L330N364j355
4600A889n807j383N409L852m038n180K406O428j57n790j418N142L168l179m215
4615b873J454M797L93l580k127K591K866j127k759j210K695K227j651l448K47
4630a505L455Q95l364k778J875L349q83l686n9K599J375k560k094J506K474j92
4646D07k510m14K031J256j339r43N60J671r5p34L45J02K73N26l28m22m3Q88P13
$$ plain form
4540 3624 -4304 -4968 2563 6188 -120 -6924 -3276 4536 4184 -3935 -6806 387 5454 616 -6319
4555 -6319 -4506 2636 4738 -1928 -6624 -1918 5002 3400 -3829 -5306 1592 5963 1047 -5245 -2304
4570 -2304 5107 5452 -1869 -5009 689 6175 3339 -3564 -3171 3434 6191 247 -4523 -1193 4780
4585 4780 3660 -2836 -4786 886 4748 995 -4715 -3640 2007 3236 -1883 -5450 -2120 3244 1889
4600 1889 -3918 -5301 108 3960 -78 -5258 -2852 3576 3419 -2371 -3789 1353 4521 1342 -2873
4615 -2873 -1419 3378 3771 191 -1936 655 3521 2394 -365 -1575 1120 3347 1696 -1752 -1505
4630 -1505 1950 2845 -519 -3297 -1422 1927 1044 -2642 -2701 -102 1273 -1287 -3381 -1875 599 407
4646 407 -2103 -2517 -486 770 -569 -1512 -952 719 624 -110 235 337 610 1136 808 386 343 1231 1944
4665A944p56r82O99Q65k46j182m1O73n6o96l31M66l44k35J58j32r23j29N67L77
4685c04r53j006J219R16n36j387L37J521M64j210o55P58J301K81j141n68J439
4702D76J513l12k197l75K589J363j647k469J213K579J48k866j184K214J905j530
4718A420l078ML056J017k863k360J718K744m52l384j270K933K272j739l248o5
4734c295L634J701l016l301K073M656J08m923k202N136M143l345n407J597O376
4749C935N84n383k817M720M360k638n419N34N346J636m135m176K389M963k33n261
4765a595k941M304N026k720o546l12O454K935n982n439L915O995r00q018j888
4780f712P443M668n310o534K465P916P49o725l939O116O001l102p302L47P273
$$ plain form
4665 1944 1188 206 905 1770 1524 342 301 974 918 222 -109 357 13 -222 -64 -196 -1119 -1248 -681 -304
4685 -304 -1257 -2263 -1044 -128 -664 -2051 -1714 -193 271 -939 -1594 -836 465 746 -395 -963 476
4702 476 1989 1677 -520 -895 1694 3057 1410 -1059 154 2733 2881 15 -1169 1045 2950 1420
4718 1420 -1658 -1654 1402 2419 -444 -2804 -1086 1658 1206 -2178 -3448 -515 1757 18 -3230 -3295
4734 -3295 339 2040 -976 -4277 -2204 2452 2560 -2363 -4565 571 4714 1369 -4038 -2441 3935
4749 3935 4519 -864 -3681 1039 5399 2761 -2658 -2124 3222 4858 723 -3453 -1064 3899 3666 -1595
4765 -1595 -4536 -232 4794 2074 -4472 -4784 1670 4605 -1377 -6816 -2901 4094 3194 -4824 -6712
4780 -6712 731 5399 89 -6445 -3980 3936 4685 -2040 -5979 137 6138 3036 -4266 -3919 3354
4795C354L392o126n359L614O702l88o998l044O054N747l732q079M12Q289K625
4810F463p395n717N060P420k549q462j104Q000L967o168o788L114P932N16p423
4825c134l725N818O166k890p538j44P940L567o143o528M449Q187j131q129k117
4840e352P473M969m948o791J637P776J491p093m459N006O182k013p446j512O979
4855A899M361n520o711K411P491O03p146l960N254O455l015p594k52P534L284
4870E094o361n708M259P815j163p878j654P125M337m860n998K658O368L95n355
4885i26k979L622M897j244n604j301N146L862l940n908J800O466P46o713l205
4900e281N219N081l247o261R02O277J166n465l203L559M644j691m999m31M344
$$ plain form
4795 3354 6746 620 -4739 -1125 5577 5189 -1809 -4853 1201 6948 3216 -4863 -4451 3838 6463
4810 6463 -932 -6649 -1589 5831 3282 -5180 -6284 1716 5683 -485 -7273 -4159 3773 4289 -3134
4825 -3134 -6859 -1041 5125 2235 -5303 -5447 2493 6060 -83 -6611 -2162 6025 4894 -3235 -5352
4840 -5352 2121 7090 2142 -4649 -3012 4764 6255 -838 -5297 -291 5891 3878 -3568 -5080 1899
4855 1899 6260 740 -5971 -3560 3931 4534 -2612 -6572 -1318 5137 2122 -5472 -5724 1810 5094
4870 5094 -1267 -6975 -2716 5099 3936 -3942 -5596 1529 5866 1006 -4992 -2334 4034 4429 -926
4885 -926 -3905 -283 4614 3370 -2234 -3535 1611 5473 1533 -4375 -2575 3891 4637 -2076 -5281
4900 -5281 -62 5019 1772 -4489 -3587 2690 3856 -1609 -4812 -1253 3391 1700 -3299 -3730 614
4915F14K723l268l735J519M070N12l890j605K669L431j144l616m24L279J643k309
4931D69k718J672L368j83l461j369L172K168k380k765J234K410J30k437q49J711
4947A72J213j392j288K80J208J06n27r50J07J162J36n43q18O81Q73l51q15M82
4965b64O40k97m70J97N29j76o36P24Q01q30q20N24J300p72j081M88J243j45j056
4984a01p28P59P77J13j199n71Q50J082k36j415k85J170J105j432j731Q93K410
5001A461K26k521j302J738K555j411k866J48L176J201k761k589K562L147j389
5016A375l774j05L716J655k655k589J593K853k61k912j160J722K796m71l217j017
5032b451K811K890k441m113R31N208N05m946k617M532M160k578n584M59N246J935
$$ plain form
4915 614 3337 69 -3666 -2147 1923 2435 -1455 -3060 -391 3040 1896 -1720 -2144 1135 2778 469
4931 469 -2249 -577 2791 2608 -853 -2222 950 3118 738 -2027 -793 1617 1747 -690 -1539 172
4947 172 1385 -7 -1295 -1015 193 299 -228 -1178 -1071 91 227 -316 -1134 -453 420 69 -746 -264
4965 -264 376 79 -391 -194 335 159 -477 247 1048 218 -602 -78 1222 450 -631 -143 1100 955 -101
4984 -101 -829 -70 707 820 -379 -950 -100 982 746 -669 -954 216 1321 -111 -1842 -949 1461
5001 1461 1687 -834 -2136 -398 2157 746 -2120 -1972 1204 2405 -356 -2945 -383 2764 1375
5016 1375 -2399 -2504 1212 2867 212 -2377 -784 2069 1808 -1104 -2264 -542 2254 1783 -1434 -2451
5032 -2451 360 3250 809 -3304 -2373 2835 3340 -1606 -4223 309 4469 1891 -3693 -3234 2012 3947
5048C947m104l469K740M687j133n005j653M729L546k849n587J133N741J539n108
5063h46l928L398N039r59n836j285N476L777m319n728J669O714J348o351l362
5078e193N037N820k955p179Q1P138K860n490n516L751O897o93p083k567N707N128
5094E743l748o936R34P884K508p249n872N121P462k337q105p41P349M081n983
5109A11o329L376P088j21p299l117N513O181k914p418r0P171L381n799o222M042
5125b446P900l16q260k507P077N434m800p587K090Q243J591p749m548N755O645
5140F522k739q094n89P215L919n863n716K764O869p38o291l093N203N284k528
5155B125o832p66O822L627n541o130L308P451M15p575k770O742N157m915o849
$$ plain form
5048 3947 -157 -3626 -886 3801 2668 -2337 -3990 739 4285 1436 -4151 -3018 2723 4262 -846
5063 -846 -4774 -1376 3663 2704 -3132 -4417 1059 4836 517 -5211 -3542 3172 4520 -1831 -5193
5078 -5193 -156 5664 2709 -4470 -4389 2749 5609 119 -5397 -1646 5251 4558 -2525 -5092 615 5743
5094 5743 1995 -4941 -4007 3877 6385 -864 -6736 -1615 5847 3510 -4595 -5336 2013 6094 111
5109 111 -6218 -2842 4246 4125 -3174 -6291 -778 5403 2489 -4929 -5019 2152 5533 -266 -6488 -2446
5125 -2446 5454 5138 -3122 -5629 1448 6882 2082 -5505 -3415 4828 6419 -1330 -5878 -123 6522
5140 6522 3783 -4311 -4900 2315 6234 371 -5345 -2581 4288 3550 -2741 -5834 -631 4653 2125
5155 2125 -4707 -5473 1349 4976 -565 -6695 -3387 4064 4479 -3096 -5866 876 6033 1118 -5731
5170e731K539P513O84o274l213N033M959k497o087k87N595L313m086n037J599
5185a977N667Q31n391l512M122M756k407n695k68O302K149n258m556K790N453
5200C006p57n324j276M369L607l425m837J710N170O97m665k573L643M112j488
5215A969m357k50L964K107k641k983J686L839J15m184j409L184K816j843l596
5230a583N38L680M39l648j868K531J942r71k721m44K157Q86j203j597Q4J490K86
5247bj445r00R37K282q11k270J01K363P54j474q72J416J070q85q97J203P01o84
5265E87n80L30J143n43n37K73Q40k49j311L86Q49J87j062q12O72P82l73j928L01
5284a045J521J71j259j111M18J319K12j687p98R54J373j84j810p10K656J680j844
$$ plain form
5170 -5731 -3192 4321 5005 -1269 -4482 551 5510 3013 -3074 -3361 2234 5547 1461 -3576 -1977
5185 -1977 3690 4521 -870 -4382 -260 4496 2089 -3606 -3874 2428 4577 -681 -5237 -2447 3006
5200 3006 2249 -3075 -4351 18 3625 200 -4637 -2927 2243 2940 -1725 -4298 -655 3457 1969
5215 1969 -2388 -2638 1326 3433 792 -2191 -505 3334 3449 -735 -2144 1040 3856 2013 -1583
5230 -1583 -1045 2635 3074 -574 -2442 89 2031 1060 -1661 -2105 52 938 -265 -1862 -1778 -288 -2
5247 -2 -1447 -2347 -1410 872 61 -2209 -2108 255 1009 -465 -1337 79 1149 264 -633 570 1271 587
5265 587 7 337 1480 937 400 673 1513 1264 -47 339 1188 1375 313 -499 173 955 582 -1346 -1045
5284 -1045 476 647 -612 -1723 -1305 14 226 -1461 -2259 -1305 68 -116 -1926 -2636 20 1700 -144
5301a44l021J605L655K09l361j206L427K704k762l242J789M136m22l815j164K589
5317I77L110j715l587l99L052J833k490l286J136L986n8m798k080L922L089k083
5333F09m617L70M786J631m568l177L057M400q20m792j580N002L661l247m499J396
5349b388N263Q31m459k956M072M864k117n533n73N503L014l861n156J757N869
5364D130O55o081l064N257M242l183o042K7O913J960n790m624L352N173q56n508
5380c439k269N300M496l522n734L81O329K985n853n197M370P412j569p853o30
5395d793P216L888n240o632L275Q126p1p275k672N174N027k954o630K12P468K266
5411F385o194n555L692O237k97p153l511O296N572m317o865R19P139K202o679
$$ plain form
5301 -144 -3165 -1560 2095 2304 -1057 -2263 1164 3868 1106 -2136 -347 3789 3367 -448 -1612 977
5317 977 4087 2372 -1215 -1614 1438 3271 781 -2505 -1369 2617 2559 -2239 -4319 -397 2692 609
5333 609 -4008 -3638 1148 2779 -1789 -4966 -1909 2491 1671 -3121 -4701 301 3962 715 -3784 -2388
5349 -2388 2875 3706 -753 -3709 363 5227 3110 -2423 -2996 2507 5521 1660 -3496 -1739 4130
5364 4130 4785 -1296 -4360 897 5139 1956 -4086 -4059 2854 4814 -976 -5600 -2248 2925 2069 -3439
5380 -3439 -5708 -408 4088 566 -5168 -4787 1542 4527 -1326 -6523 -2153 5259 3690 -4163 -4793
5395 -4793 2423 6311 1071 -5561 -2286 5840 5769 -1506 -4178 996 6023 3069 -3561 -3349 4119 6385
5411 6385 191 -5364 -1672 4565 4268 -2885 -6396 -100 5472 1155 -5710 -4791 2348 4550 -2129
5426b129n520M870Q181k745p609j173P410M550o437o493M093Q243j115p187j699
5441d760N935M634l329o271M42P134J930n029m555L173N974q7p320l000O642M821
5457F334m307o592J334O692J315o284m786N155N834k919o226k63N697L064m395
5472c47n516K479O169K51n646k406M235N036k512o079K97O774J572m519l596K688
5488a120N195l42n575j635N598K773l321m320J225N148J096n279l198L636L646
5503C527j871l851k71L155K512l060m160J679M190K82l722k542K803M348j740
5518A279n175N52M750R90l930j949K858L483j065m284J66L604M87j807q75Q46
5534g0J870M22k118j165J724J503m92j950p47J646K034k035k013J278J577o39
$$ plain form
5426 -2129 -7649 -2779 5402 2657 -4952 -6125 1285 5835 -602 -7095 -3002 5241 4126 -3061 -4760
5441 -4760 1175 5809 2480 -3791 -3349 3785 5715 686 -3869 -696 5278 5191 -2129 -5129 1513 6334
5457 6334 2027 -4565 -3231 3461 4776 -1508 -6294 -1139 4695 1776 -4450 -4713 984 4048 -347
5472 -347 -5863 -3384 2785 3036 -2610 -5016 -781 4255 1743 -4336 -4039 2735 4307 -212 -3808 -1120
5488 -1120 4075 3733 -1842 -3477 2121 4894 1573 -2747 -1522 3626 4722 -557 -3755 -119 3527
5503 3527 1656 -2195 -2466 689 3201 141 -4019 -2340 1850 2132 -1590 -4132 -1329 3019 1279
5518 1279 -3896 -3344 1406 2396 -1534 -3483 -625 2858 1793 -2491 -2325 1279 1766 -41 -916 -70
5534 -70 1800 2222 104 -1061 663 2166 1674 -276 -1023 623 2657 622 -1391 -113 1464 825
5550H25j563o94J405J491j140k096R23J338q08j033k0J261P38j193r60J282O20
5567C76j171m22J392J73o69k90O06J051k34j673M95J494l75q97K46N09O07L5j455
5586b02n11J175J154r56j439j4J800Q76k374j865K249K233k068k436M83K917J102
5603B124k950k407K399K640j246k302m56K316K419j951l596J422L565K69l551
5618a305j648K786L447j245m908N19M555J050l716k805K621M039k73n226j332
5633c441M761K378l082l866J556M234J092m930k701L694L685j853m178p20M204
5648H33K767k997m585J615N244M20n155k871M302N064k438o359L24O636J612n134
5664g22m041L629N556j359o080q99N398K689l604m115J017M955J794m831l797
$$ plain form
5550 825 -738 -1432 -27 1464 324 -1772 -849 489 -319 -1352 -1372 -111 627 -566 -1526 -244 376
5567 376 -795 -1217 175 348 -321 -611 -5 1046 812 -861 -366 1128 753 -144 102 611 1218 1253 -202
5586 -202 -713 462 1616 660 -779 -793 1007 1883 -491 -2356 -107 2126 58 -2378 -1895 1022 2124
5603 2124 -826 -3233 -834 1806 560 -1742 -2198 118 2537 586 -3010 -1588 1977 2246 -1305
5618 -1305 -2953 -167 3280 2035 -2873 -2354 2201 3251 -465 -3270 -649 3390 3117 -2109 -3441
5633 -3441 1320 3698 616 -3250 -1694 2540 3632 -1298 -3999 -305 3380 1527 -2651 -3371 833
5648 833 3600 603 -3982 -2367 2877 3297 -1858 -4729 -427 4637 2199 -4160 -3836 2800 4412 -722
5664 -722 -4763 -1134 4422 3063 -3017 -3916 1482 4171 567 -3548 -2531 2424 4218 -613 -4410
5679d410L563M649j065n471j774N378M373m199n741J966O179O34n894l396M779
5694d29N603k708o802N15O502K231n460m538L345O417r19o627j338N007L488l099
5710A188n331O17N905K142n437m134L635N616r00o292k386O522M417m340o820
5725e598K359P221M59o306l693N336N549k829o537M21O086K455m628n133K566
5740b272O432P5o346k574N234M778l147o425N00P059J411n903l963M231N282j645
5756B727o095j012N519L451m519m602K103N297M60n132l016L965M843k226n525
5771c762K41N241K800m348m387K314N544K25n897j901M516M158k697n298N04N641
5787B894J614n214k790L352M040j877m552k21M282J631l140k856J142L249O88
$$ plain form
5679 -4410 -847 3802 2737 -2734 -4508 870 5243 1044 -4697 -2731 3448 4082 -1812 -5208 -429
5694 -429 5174 2466 -4336 -3821 2681 4912 -548 -5086 -1741 4676 3757 -2870 -4208 799 4287 1188
5710 1188 -4143 -3526 2379 4521 -916 -5050 -1415 4201 3301 -2991 -5377 1145 5562 1222 -5598
5725 -5598 -3239 3982 4441 -1865 -5558 -222 5327 2498 -4039 -3618 2468 4923 295 -4838 -2272
5740 -2272 4160 4235 -2111 -4685 549 5327 2180 -4245 -3745 3314 4725 -1178 -5141 -910 4372 2727
5756 2727 -3368 -4380 1139 4590 71 -4531 -2428 2869 3329 -1803 -4819 -854 3989 1763 -3762
5771 -3762 -3521 1720 4520 172 -4215 -1901 3643 3868 -2029 -3930 586 4744 2047 -3251 -2747 2894
5787 2894 4508 -706 -3496 -144 3896 2019 -2533 -2754 1528 3159 19 -2837 -1695 1554 2242
5802B242l076k365K117L309p54m025p68L665K471k710l906J896M412l60l932j270
5818c054L369K342j656l341J059L085M56k630j199J599K394o95k336n12K283J196
5834B360j529j793L45J861N47j688j465J278J514q31j656m79J766J076j682j652
5850b028P80J939n34j774oJ420M63r90q31J054O38k62n27N11L40j28K22J04j84
5869B07M37J39mk34J87K83n26q1O07L86j135n78J182O24j417j102L78J937o25
5888F65j820l75J949P18k064j143J012J780m28k019o16J914J498j364j690J19
5904a864K342J026k211j779J891K712l78k993p03L033K043k290k836J317L973
5919C283J69m147k042L401L473k245m650N73N102Q23m744k368L364L164j960m323
$$ plain form
5802 2242 -834 -3199 -1082 2227 1473 -2552 -3320 345 2816 106 -3800 -1904 2508 2148 -1784 -3054
5818 -3054 315 2657 1001 -2340 -1281 1804 2260 -370 -1569 30 2424 1729 -607 -1119 1164 2360
5834 2360 831 -962 -617 1244 1791 103 -1362 -84 1430 599 -1057 -1536 230 1306 -376 -2028
5850 -2028 -1248 691 157 -1617 -1623 -203 260 -730 -1561 -507 131 -131 -658 -147 193 65 287 391 207
5869 207 644 783 779 545 732 1015 489 408 1015 1401 266 -312 870 1494 77 -1025 -647 1290 665
5888 665 -1155 -1530 419 1137 -927 -2070 -1058 722 294 -1725 -2341 -427 1071 -293 -1983 -1864
5904 -1864 478 1504 -707 -2486 -595 2117 1739 -1254 -1957 1076 3119 829 -2007 -690 3283
5919 3283 3452 -695 -2737 664 4137 1892 -2758 -2185 2917 3740 -1004 -3372 -8 3156 1196 -3127
5935c127J61L564K071l046l132R63L949P32m088k510L183L565n97n123p51N525
5951A339L152n440l294L732M037j4n366k055N130M119l803m752J330O144N18n158
5967c81k873L653M242j775n713L0M816K740m560m319K108N512k92n441k732M039
5983i46M565k608n430J21N757K152n100m059L431N655r89o063j103N530L614l710
5999H17m904J440N971J139n357l095L973N149j515o052j118N948L275m302n270
6014c901K502O262m42o250k639N164M130l088n892O62N581J503m690l962K742
6029b318M934n95n445j709M948L838k987n759R07O467J577m999l720L883N608
6044D630j648o007o63O034K866m555m849L139N649m61n870j721M977L493l329
$$ plain form
5935 -3127 -2966 598 2669 -377 -3509 -2546 1403 2135 -1953 -4463 -1280 2285 1688 -3435 -4186 1339
5951 1339 4491 -949 -4243 -511 3526 3512 -1854 -3909 1221 5340 1537 -3215 -1885 4259 4777 -381
5967 -381 -3254 399 4641 2866 -2847 -2817 1999 4739 179 -4140 -2032 3480 3188 -2253 -4985 -946
5983 -946 3619 1011 -4419 -4298 1459 3611 -1489 -5548 -2117 3538 2549 -3514 -4617 913 4527 817
5999 817 -4087 -2647 3324 4463 -894 -3989 -16 5133 3618 -2434 -3552 2396 5671 1369 -3901
6014 -3901 -1399 4863 4421 -1829 -4468 696 4826 1738 -4154 -3492 2089 3592 -1098 -5060 -2318
6029 -2318 2616 2021 -3424 -5133 -185 3653 666 -5093 -4186 2281 3858 -1141 -4861 -978 4630
6044 4630 2982 -3025 -3688 2346 5212 657 -4192 -1053 4596 4135 -1735 -3456 1521 5014 1685
6059A685m748R38N115R85m308l042K497L867p76m591j366L870L315k873m891M34
6075c889N738J281m852l302L780M413k139m772L48M900J431l868k586K822L956
6090C261q31l920q82L328K404j676l326O19L194J205k819k528K046K998p33l405
6106a065p24K801J905k470k758Q54K816M52l225j402J821K197p89k756o7K425
6122A5J141k146j345J121K149n83j521o33J536J599r72j180l02J941R28j108j410
6139g70Q01J484j69j493L8J318O86j343r16P42N51p9n40l05J89q2R3k03o07J30
6159d75L20K15j037J15L38O36p20m51M08J27j14l90O66M09m48j47N69J89r62J88
6179e64O79R44m62j344N58J510L30j789j20J001R36j068j416Q78J946m62j986
$$ plain form
6059 1685 -3063 -2125 2990 3975 -333 -3375 -878 2989 2213 -2378 -3744 126 3441 568 -4323 -3889
6075 -3889 1849 3130 -1722 -5024 -1244 3169 1030 -3742 -3394 1506 2937 -931 -3517 -695 3261
6090 3261 2430 -1490 -2372 956 3360 1684 -1642 -1023 2171 3376 557 -1971 75 3073 2340 -1065
6106 -1065 -1789 1012 2917 447 -2311 -1457 1359 1811 -1414 -2816 -995 1202 413 -2343 -2410 15
6122 15 1156 -990 -2335 -1214 935 352 -1169 -1802 -266 1333 361 -819 -1121 820 1748 640 -770
6139 -770 31 1515 1346 -147 -109 1209 1895 552 -364 378 929 850 310 5 194 112 205 2 -605 -475
6159 -475 -155 60 -977 -862 -524 112 -608 -1059 -651 -524 -638 -1028 -362 47 -401 -548 21 210 -752 -564
6179 -564 115 1059 597 -747 -189 1321 1651 -138 -258 743 1679 611 -805 73 2019 1557 -429
6196d29r41J732J002q06j653M3J506O42j365j629P54J568O92k012j860K077K545
6213A866p41l463l37L509J593l199k285K480L662j212m101j8L563J665k618k744
6229b380J487L618m2l410j583K833K962j734m085k69M468J961l768l216J844M266
6245B952o88m921o77M448K555k956m365J124M733J055m787k980L661M355j762
6260A747n198J59M900K222m212l869K568N131k05n027j840M367L445k769n067
6275c648Q47N726J506m991l736L522N153j570n817n86N206K687m401l933K386
6290a649N025j09n113k061L314M021j670m642m01M665K434l772m276K275N380
6305C421k17n621j843N010L871l372n337J461N488O94m529k953L770M222j713
$$ plain form
6196 -429 -1370 362 1364 558 -1095 -1052 454 1096 -269 -1898 -1144 424 1116 -896 -2756 -679 1866
6213 1866 1125 -2338 -2675 834 2427 -772 -3057 -577 3085 1873 -2228 -2246 1317 2982 364 -2380
6229 -2380 -893 2725 2683 -727 -2310 523 3485 1751 -2334 -2603 1865 3826 58 -3158 -1314 2952
6245 2952 2264 -2657 -3334 1114 3669 713 -3652 -2528 2205 3260 -1527 -4507 -846 3509 1747
6260 1747 -3451 -3292 1608 3830 -382 -4251 -1683 3448 3243 -1784 -3624 743 4188 1419 -3648
6275 -3648 -2801 2925 4431 -560 -4296 -774 4379 2809 -3008 -3594 1612 4299 -102 -4035 -1649
6290 -1649 3376 3267 -1846 -3907 -593 3428 1758 -2884 -3285 1380 3814 42 -4234 -1959 3421
6305 3421 3204 -2417 -4260 750 4621 1249 -4088 -2627 2861 3555 -974 -3927 -157 4065 2352
6320B352m946p64M713K521l309l897J507M678K02m276k318L124M080j570m945
6335b848n68M863K811l916m500K268N025j18n091j926M845L538l330m887J037
6350b797N571P16m799k272K893M131j538m039p47L816K259k909l434R91M583Q70
6366C295m096k897L236L761j559m447j25M467K113m060k970K063M124j061l643
6381a799q39L169K562k071l549Q18L644O89l303k156K490L340j087l251o80K906
6397H83J581k506k179J390K552M54l330j189K250K038j315k728J8K976Q33j983
6413b55j587J224J851l66k040n00J794J099n36j814N9J533R81j345j428Q23J924
6430A417J74k215l58J695J253j536j415O34J292k33r23O5O34L05r43k9p0J97K67
$$ plain form
6320 2352 -2594 -3358 1355 3876 567 -3330 -1823 2855 3057 -1219 -3537 -413 3667 2097 -2848
6335 -2848 -3416 1447 4258 342 -4158 -1890 3135 3017 -2074 -4000 845 4383 1053 -3834 -2797
6350 -2797 2774 3490 -1309 -3581 -688 3443 1905 -2134 -2881 935 3194 285 -3149 -2158 2425 3295
6366 3295 -801 -3698 -462 3299 1740 -2707 -2832 1635 3748 -312 -3282 -1219 2905 1844 -1799
6381 -1799 -2638 531 3093 1022 -2527 -1709 1935 2624 -679 -2835 -345 2995 1908 -1343 -2023 883
6397 883 2464 -42 -2221 -831 1721 2175 -1155 -2344 -94 1944 629 -2099 -2081 895 1728 -255
6413 -255 -1842 -618 1233 867 -1173 -1673 121 1220 684 -1130 -1071 462 1443 98 -1330 -507 1417
6430 1417 1591 -624 -982 713 1966 430 -985 -351 941 708 -215 -150 484 789 -154 -183 -253 -56 211
6449B11o4n74j55L15L37j40m49l8K15L33m46j78K71N58k14l11m1j26M21J92QK69
6471C94k80j08N83j60l32j55N04Q33o48q94J79J381k24j195p29J444Q45r17j592
6490a071O44J259j11j464r05J071J109l55j179n57J344Q82q51j779P53J849N74
6507A213j933j479J839K022n54l015K9K694J339j937j727J020K396Qk769j127
6523a981K664J964j293k810j57L343J158k860k396J884L373j048l723p27L328
6538G19K079k610l434J065L840M96l693k127L159L144j701m233p1M520J582l463
6554g28k763K255M158n30l922j478L496K913j905m264Q02M787J401m152l654L167
6570d17M715j238n178q39N123K352m440l818K282M746m59m922j800M262K927k791
$$ plain form
6449 211 147 -427 -582 -267 70 -70 -519 -557 -342 -9 -455 -633 -362 196 -18 -329 -370 -496 -75 117 125 394
6471 394 114 6 589 429 97 -58 446 1279 631 -263 -84 1297 1073 -122 -851 593 1438 521 -1071
6490 -1071 -427 832 721 -743 -1648 -577 532 177 -1002 -1559 -215 667 -184 -1963 -1210 639 1213
6507 1213 -720 -2199 -360 1662 1108 -1907 -1878 816 2155 218 -1509 -489 1907 1915 -854 -1981
6523 -1981 683 2647 1354 -1456 -1613 1730 2888 28 -2368 -484 2889 1841 -1882 -2609 719
6538 719 2798 188 -3246 -2181 1659 2155 -1538 -3665 -506 2638 937 -3296 -3367 1153 2735 -728
6554 -728 -3491 -1236 2922 2392 -1530 -3008 488 3401 1496 -2768 -1966 2821 4222 70 -3584 -417
6570 -417 4298 3060 -2118 -2957 2166 4518 78 -3740 -1458 3288 2829 -2093 -3893 369 3296 505
6586E05m115P33M463J114m084l121K766M608o87m955j358M441L531l311m123J210
6602b383N191R39m709k689L466M346j606n244J63N124J781l830l701K477M466
6617C791q54m590j075L776K726k332m230O10M139J153l799k886K372L621o46m636
6633b860j303M529K741l301l898J296M644O08m027k356L537L340j728l976L12
6648b442M125J585k929k959J704M060j13l866j573L517K434j622l898L77M024
6663B424J037l504k525K180L008p89l764m30K968K081k728l095J242L173N11l287
6679a498j802K484K566j298k991K12K758J296k042k530J597L025J19l120q65K328
6695B39K577j536k917N01L378K39k617j288J970K045j280k098k2K437K15j895
$$ plain form
6586 505 -3610 -2877 1586 2700 -1384 -4505 -1739 2869 2182 -2773 -4131 310 3841 530 -3593 -2383
6602 -2383 2808 3747 -962 -3651 -185 4161 2555 -2689 -2526 2598 4379 549 -3152 -675 3791
6617 3791 2937 -1653 -2728 1048 3774 1442 -2788 -2178 1961 3114 -685 -3571 -1199 2422 1776 -2860
6633 -2860 -4163 366 3107 -194 -4092 -2796 1848 2456 -1571 -3927 -390 2950 1222 -2754 -2442
6648 -2442 1683 3268 339 -2620 -916 3144 3031 -835 -2408 1109 3543 1921 -1977 -1600 2424
6663 2424 3461 -43 -2568 -388 2620 1831 -1933 -2363 605 2686 -42 -3137 -1895 1278 1789 -1498
6679 -1498 -3300 -816 1750 452 -2539 -2327 431 1727 -315 -2845 -1248 1777 1896 -1224 -2089 239
6695 239 2816 1280 -1637 -1136 2242 2481 -136 -1424 546 2591 1311 -787 -809 1628 1843 -52
6711e2j071R86Q93L95j555p55N64J462n19j594n34J358J171q92j691P09J792m53
6729B14j474l03J159J261q85j076N98J343m32n02k8N01L40o2m82L03O96n34n9
6748E78K9J72o04M02J21p0l93j06M12N8m72o31M06K86m82j54l10K60J88K96n70
6769e84l67J97O43R1q91m58J063J009p71j446R85J177J44j117n79J209J072o64
6787G13j311M41J101L04r81o00K06J943j55j847n14J213J423p26k278k7K278Q2
6805A265j772j123J283J523m01k281n45K103J120j739j650Q03K147L81k042j620
6821b548J985K369j070k186l30K255J594j320k498N57L682J5l208j483K310L036
6837C160j491l712K08M185R10l441k025K030K846r22l580n15L126J658k259k738
$$ plain form
6711 -52 -1123 -137 756 1151 -404 -1159 -595 867 348 -1246 -1780 -422 749 -143 -1834 -1125 667 214
6729 214 -1260 -1563 -404 857 -28 -1104 -506 837 405 -97 -125 376 716 654 172 475 1171 637 578
6748 578 607 779 175 577 698 628 235 129 541 599 127 -504 -98 188 -294 -448 -758 -498 -310 -14 -584
6769 -584 -951 -754 -111 -20 -911 -1369 -306 703 -68 -1514 -529 648 792 -325 -904 305 1377 713
6787 713 -598 -157 944 1248 267 -333 -127 1816 1661 -186 -700 513 1936 1210 -1068 -1095 1183 1265
6805 1265 -507 -1630 -347 1176 775 -1506 -2051 52 1172 -567 -2217 -1414 733 1114 -928 -2548
6821 -2548 -563 1806 736 -1450 -1780 475 2069 749 -1749 -1192 2490 2505 -703 -2186 124 3160
6837 3160 1669 -2043 -1835 2350 3260 -181 -2206 -176 2670 1748 -1832 -2347 779 2437 178 -2560
6853b560O01L238N84k515k978K671L430j022m093o81L664K729k774l920J890M562
6869B826j52m497j561L625L489k297m350O77M575J484m125k851K588M058q52m671
6885b034p65M120K557l400l215R84M227O87m317k582L362L847j901m268o29M341
6901A014K579m037l995K932M610j148m354j192L815L450l078m193J525M591N13
6916C032l548k782K671L928r42m671o79M654K036l170l437J518M445J24m445j860
6932c126L786K855k547l202K18L626J434l616k553K173L107l40l474j248L081
6947A74K660k104l595N81M030Q76l434k421K208L768q93m339m1L747J744k433
6963E28l323J643L473J1l941q51L368J929k038k710M54K733J008k730j940J934
$$ plain form
6853 -2560 -1959 1279 1863 -652 -3630 -959 2471 1449 -2644 -3325 339 3068 294 -3626 -1736 2826
6869 2826 2674 -1823 -3384 241 3730 1433 -2917 -2240 2335 3819 -306 -3157 -569 3489 2637 -2034
6885 -2034 -2799 1321 3878 478 -2737 -1753 2474 3161 -1156 -3738 -376 3471 1570 -2698 -3327 1014
6901 1014 3593 -444 -4439 -1507 3103 1955 -2399 -3591 224 3674 596 -3597 -2072 2519 3032
6916 3032 -516 -3298 -627 3301 2359 -2312 -2991 1663 3699 529 -2908 -1390 3055 3179 -1266 -3126
6932 -3126 660 3515 968 -2234 -2016 1610 3044 -572 -3125 -952 2155 1815 -1659 -2907 174
6947 174 2834 730 -2865 -2284 1746 2622 -812 -3233 -1025 2743 1850 -2489 -2530 1217 2961 528
6963 528 -2795 -1152 2321 2332 -1609 -2460 908 2837 799 -1911 -1457 1276 2284 -446 -2386 -452
6979d52K029K1k422j168K060K285j690k933P21K810P63k182k279J766L091j130
6995A290l381L20K707J019j998j738J087J985j67j986o84K032Q22p59j726J61
7011a016J602P96j675j100J111J207J49j848l66J109J128q97j005O31O75J69o45
7028B5j236J112J428j160r35M48J054j39p65j67J82Q84l23p90M08K46j30j32j58
7047a48j56J55K35k64k29L36j66J88k15J32P7N9m31N38K64n99n66P94M47m58p22
7068g29L07J211j24j445J55J328K9p88o94J25J320M10q35j174J065Q18l59r44
7086c24q30J226J364p30j825L96J662Q20k125j216Q92J963m50k328j31K268Q12
7103A444j746j809Q42K321r3k500j40K205R32j580j656O84K127N83j815j523J376
$$ plain form
6979 -452 1577 1598 -824 -1992 68 2353 663 -2270 -1549 1261 2024 -158 -2437 -671 2420 1290
6995 1290 -2091 -1771 936 1955 -43 -1781 -694 1291 1124 -862 -1546 486 1308 549 -1177 -1016
7011 -1016 586 1382 -293 -1393 -282 925 1074 -774 -1140 -31 1097 200 -805 -174 501 670 25
7028 25 -1211 -99 1329 169 -766 -318 736 597 -168 -335 -153 731 408 -382 26 272 142 10 -148
7047 -148 -304 -149 86 -178 -407 -71 -237 -49 -264 -132 -55 4 -427 111 375 -224 -790 4 451 -7 -729
7068 -729 -422 789 665 -780 -625 703 732 -56 -750 -625 695 1105 270 -904 161 979 620 -324
7086 -324 -1154 72 1436 706 -1119 -723 939 1759 -366 -1582 -690 1273 823 -1505 -1636 632 1444
7103 1444 -302 -2111 -1269 1052 959 -1541 -1681 524 1456 -124 -1780 -1096 1031 1614 -201 -1724 -348
7120c48J758nj712j417J817K176j135k626L48K897P80k617k353K102L019j072
7136A612l629q7L100J180k047k590J314K966k71k945j277K642J957j236k887k32
7152b430L172J678l123k260J781L291j78l489j305L025K480j733l109L73L743
7167A916J366l295k636K366L735j086m191p39L814K475l055l274J166L867l2l651
7183a254j935L057L178j743l974n68M540J510l411l569K524M228m89m693q77L999
7199E23K630l092l697J535L817J207l757k122K099M002j242l907l92L855K507
7214C966l000l864J435M650R2m326k169L737L358k294m179N84M075J010l817k618
7230c360K462L625r25m108p44L509J810k701k908J189L615M28l231j709K287L208
$$ plain form
7120 -348 1410 1405 -307 -1724 93 2269 1134 -1492 -1144 1753 2533 -84 -2437 -335 2684 1612
7136 1612 -2017 -2104 996 2176 129 -2461 -1147 1819 1548 -1397 -2674 -32 1925 689 -2198 -2430
7152 -2430 742 2420 -703 -2963 -1182 2109 1931 -1558 -2863 162 2642 909 -2200 -1827 1916
7167 1916 3282 -13 -2649 -283 3452 2366 -1825 -2564 1250 3725 670 -2604 -1438 2429 2397 -1254
7183 -1254 -3189 -132 3046 1303 -2671 -3239 1301 2811 -600 -4169 -1645 2583 2094 -2599 -3476 523
7199 523 3153 61 -3636 -2101 1716 2923 -834 -2956 -857 3145 1903 -2004 -2396 1459 3966
7214 3966 966 -2898 -1463 3187 3279 -1047 -3216 521 3879 1585 -2594 -2010 2065 3075 -742 -3360
7230 -3360 -898 2727 1802 -2306 -3050 459 2269 -432 -3340 -2151 1464 1892 -1339 -3048 -761 2447
7246B447j262l574k30L039K392k721k720J539L718J49l739j815L354K664j971
7261A270l143Q46L521K08l020j868K464K563j256k760o76K592J411j660k625L90
7277a743K485M45k142j579J914K307j043l057q2K794J174j740k134J369K162o5
7293A065k094o29J846J451r30j895M69K197L08j336j453J168J627l56j727k70
7309e59J708P70j233j625N52J489Q1j479p76J139J040r68j206k7J252Q4j069l97
7327a224L54R87m69l86j50M49J1J80k82j39M69N23k57l64k3J015m0q99j2P78L91
7348I12n91p7O06J0m83k43O65R5o32j03N30L91j143l79L76P86m17j142J85O99
7368D5J60r24o38N59J012n82p18k99J419L32r33n96R9J351o0l50n99N10J224j95
$$ plain form
7246 2447 1185 -2389 -2619 420 2812 91 -2629 -1090 2628 2777 -962 -2777 577 3241 1270
7261 1270 -1873 -1027 2494 2702 -318 -2186 278 2841 1585 -1175 -1851 741 2152 492 -2133 -1743
7277 -1743 742 1187 -955 -2534 -620 1687 644 -2413 -2495 299 1473 -267 -2401 -1032 1130 1065
7293 1065 -1029 -1658 188 1639 709 -1186 -717 1480 1788 452 -1001 167 1794 1438 -289 -559
7309 -559 1149 1919 686 -939 -387 1102 1183 -296 -1072 67 1107 139 -1067 -1094 158 242 -827 -1224
7327 -1224 -870 117 -352 -738 -888 -439 -428 -248 -530 -669 -200 323 66 -298 -321 694 654 -245 -257 521 912
7348 912 321 244 850 860 377 134 799 894 262 159 689 1080 -63 -442 -66 720 303 -839 -654 45
7368 45 205 -719 -1357 -798 214 -368 -1086 -1385 34 366 -567 -1163 -1064 287 227 -123 -722 -212 1012 817
7388H17j319m73J722J125r13j889O48K186R0k289r84J705J918j646j886O01K507
7405A920n3k314j199J487J949j097k404l06K255J131j657k297Q94K612K43k520
7421a356j246K107K094j176k540K50K355J417k224k055J655K816j72k803j127
7436b005K611K142j477k889O36K851R21k802j904J859K794p98l162q70L074J933
7452B914k196l298R63L158J74l283j746K729K752j239l572Q0L037J598k657k475
7468c061J667L518k77l291j304K521K586j134l474J51L704J713k696l096J638
7483h35L936l16m362j133L968K784k969l817J284L929K81l892j523K671K987j772
7499A221l705K97L404J557l084k925J440L915q8l713j707K913L188j794l981L08
$$ plain form
7388 817 -502 -975 747 1872 959 -930 -282 1904 1994 -295 -1279 426 2344 698 -1188 -587 1920
7405 1920 1867 -447 -1646 -159 1790 693 -1711 -2017 238 1369 -288 -2585 -1691 921 1164 -1356
7421 -1356 -2602 -495 1599 423 -2117 -1867 488 1905 -319 -2374 -719 2097 1925 -878 -2005
7436 -2005 606 2748 1271 -1618 -982 1869 2790 -12 -1916 -57 2737 1939 -1223 -2093 981 2914
7452 2914 718 -2580 -1617 1541 1715 -1568 -3314 -585 2167 928 -2644 -2564 473 2071 -586 -3061
7468 -3061 -1394 2124 1847 -1444 -2748 -227 2359 1225 -2249 -2098 1606 3319 623 -2473 -835
7483 -835 3101 2785 -1577 -2710 1258 4042 1073 -2744 -1460 2469 2750 -1142 -2665 6 2993 1221
7499 1221 -2484 -2187 1217 2774 -310 -3235 -1795 2120 2032 -1681 -3388 -475 2713 919 -3062 -2754
7515b754M313J646l786k712K241L949p79m219p75L983K638k910l827J681M402
7530C091j61l857j836L302K806j947l339J25L640Q92k747k971J769L502j62l384
7546a277j923L031K851k000l647N76L842R20l519k053K710K906j096l277l86L002
7562F60J742j903k730J043K999K22k999j336K296K603j473k862J9L211J085k854
7578b77j617J602K250o06k499n78K278J706j919k254O50K337K62j934j132J356
7594c75J844q68j638k99J606R75j297j824Q89J996nj652j012J623J317p12j829
7611a261J79J911R31j913j168J392J258n85j470K05J225O7q82n63P61L44m3m38
7629e0j59J79M58J08n94m28J83O25l16q18L38R76J27q25k36L02L65k70k37L79
$$ plain form
7515 -2754 1559 3205 -581 -3293 -1052 2897 2118 -2101 -2876 1107 3745 835 -2992 -1311 3091
7530 3091 2930 -927 -2763 539 3345 1398 -1941 -1816 1824 2716 -31 -3002 -1233 2269 2107 -1277
7546 -1277 -3200 -169 2682 682 -2965 -2389 1453 2373 -1146 -3199 -489 2417 1321 -1956 -2342 660
7562 660 2402 499 -2231 -1188 1811 2033 -966 -2302 -6 2597 1124 -1738 -1719 1492 2577 -277
7578 -277 -1894 -292 1958 1352 -1147 -1725 553 2259 340 -1914 -1264 1073 1335 -599 -1731 -375
7594 -375 1469 601 -1037 -1336 270 1245 -52 -1876 -987 1009 1004 -648 -1660 -37 1280 568 -1261
7611 -1261 -1082 829 1760 -153 -1321 71 1329 744 -726 -521 704 771 -111 -674 87 431 388 -50
7629 -50 -209 -30 428 536 -58 -486 -303 322 6 -812 -474 502 629 -196 -432 -130 235 -35 -272 107
7649A07K0l13k0J47K28k09m34N71L29l47n12J80Q34l0o52o69P74P30o04q44N34
7670a80O27R8r27l37O95O30J8r63k41O79O23j88j348L02J169K81j430q82J599
7689B25J470j126j974M12J771O04j637j173J101J528m31j868m07J788J445j369
7705C59k039M45K082P80k242j440J616K454j261k925M29K752J072k221k126J797
7721d68K261l30k857m77K217K153j806k871J064K829N63k706j876K092K925j358
7737A355k594m76K633J452k035k284N23L185L04k973j581J988K827j285l621L49
7753b233L355J286k959k501K172L265q64l433n41L014J853j931k394N65K904N96
7769B154k505k056J953K850m53l424o79L101K221k473l111J125L634K14l440j768
$$ plain form
7649 107 127 -186 -206 -59 169 -40 -474 97 426 79 -433 -253 581 551 -101 -770 4 734 130 -714 -180
7670 -180 447 545 -382 -719 -24 606 624 -339 -580 99 722 534 -814 -512 657 938 -492 -1374 225
7689 225 1695 569 -1405 -993 778 1382 -255 -1428 -327 1201 770 -1098 -1505 283 1728 359
7705 359 -1680 -1235 847 1627 -615 -2055 -439 2015 754 -2171 -1742 1010 2082 -139 -2265 -468
7721 -468 1793 1463 -1394 -1871 346 2499 693 -2178 -1114 1715 2278 -428 -2304 -212 2713 1355
7737 1355 -1239 -1715 918 2370 335 -1949 -1426 1759 2063 -910 -2491 -503 2324 1039 -2582 -2233
7753 -2233 1122 2408 -551 -3052 -880 2385 1521 -1912 -2453 561 2414 483 -1911 -1346 1558 2154
7769 2154 -351 -2407 -454 2396 1943 -1481 -2160 941 3162 689 -2422 -1297 2337 2551 -889 -2657
7785b657K658K675j359l622l5L518J481k986k800J948L175kl583j338K852K501
7801B426j991l048N52L323J181l028k301J868L263o50l368n99L366K126k261l312
7817b453J353L705K13l703j506K888K528j682l171K80K892J516k558k749J474
7832i73L370r0l632j484K938K425j732l786Q36L566O45l218j992K416K890j165
7848A014l266l30L307J630k211k612J519K731m2k434j322K014K429j010k688Q0
7864a191K600R87k272j930J329K962n68k703r20K231J955j827k665P72K728L46
7880A834k596j333J823J917j341k300K89K141N57j593j183P59J795l6j378p63
7896a408P45J520q4j674l60J749J069j365j579J137J850k29k190n6J751Q49j238
$$ plain form
7785 -2657 1 2676 1317 -2305 -2340 1178 2659 -327 -3127 -1179 1996 1994 -1589 -2927 -75 2426
7801 2426 435 -2613 -2061 1262 2443 -585 -2886 -1018 2245 1595 -1773 -2372 994 3120 859 -2453
7817 -2453 -1100 2605 2818 -885 -2391 497 3025 1343 -1828 -1548 1344 2860 302 -2447 -973
7832 -973 2397 2307 -1325 -2809 129 2554 822 -2964 -2128 1438 2083 -1135 -3127 -711 2179 1014
7848 1014 -2252 -2582 725 2355 144 -2468 -949 1782 1740 -694 -2016 -2 2427 1417 -1271 -1191
7864 -1191 1409 2396 124 -1806 -477 2485 1917 -786 -1706 525 2480 653 -2012 -1240 1488 1834
7880 1834 -762 -2095 -272 1645 304 -1996 -1707 434 991 -602 -1785 -1026 769 733 -645 -1408
7896 -1408 -663 857 773 -901 -1261 488 1557 192 -1387 -250 1600 1371 -819 -875 876 1725 487
7913D87j234P89J223q7j115o17P05N93m3j178l2P44K98p66l00L8M11n4l02m81
7933i21K62M26j22k94m08R99k16o6q4J37K74K37l92JM34R3k92M42J40l98O5J80
7955D97K11k12l53P1P22j4o79j65K41J57J58q28n8M25L35l79j122J64R27M81j321
7976g42r65J019J363p10j538M95J315L19j292r36J238J431o73j336J9J554P63
7993A324p05j632P58J564L23j440j041J134J750k98k463l39J852J547j723k075
8009a464R13K178M0k852r07K002K013j458k807N55K989K56k750j471K117K042
8025A396r29k348j81K593J117k031k246J472K423M74k374j474K009L000j408l262
8041a769L0L421J336k663k502J951L167q50l225r79L126J969k263k888Q29L381
$$ plain form
7913 487 -747 42 1265 1178 63 -554 151 744 701 -477 -509 235 533 -233 -533 -495 -84 -138 -440 -921
7933 -921 -659 -233 -355 -649 -1057 -58 -274 -340 -424 -287 -13 224 -168 -167 267 360 68 510 650 252 317 497
7955 497 708 496 143 214 936 922 243 78 319 476 634 -194 -252 173 508 129 -993 -829 98 579 -742
7976 -742 -1707 -688 675 -35 -1573 -1078 237 556 -736 -1672 -434 997 324 -1012 -993 561 1324
7993 1324 619 -1013 -255 1309 1632 192 -849 285 2035 1737 -726 -1065 787 2334 611 -1464
8009 -1464 -551 1627 1667 -1185 -2092 -90 1923 465 -2342 -1787 1202 1458 -1292 -2763 -646 1396
8025 1396 467 -1881 -2062 531 1648 -383 -2629 -1157 1266 1740 -634 -2108 -99 2901 1493 -1769
8041 -1769 -1739 1682 3018 355 -2147 -196 2971 2121 -1104 -2083 1043 3012 749 -2139 -1310 2071
8057B071J59l012j766J985K723j321l096m2L086J258k752k343J448L050j72k860
8073a584j252K577K381j518k909K51L279J380k647k209J781L255n54l550p63L233
8089A151J923k137k965O82L817L03l119j809J872K483m61l347o70L271J741k720
8105A5l086J445L292Nl349j516L023K384j733k782J42K966R52k282k021J400L065
8122A920k56k677j328K441K325j333l354O48L365J006k897k153K087L005j043
8137A756l514Q1L099J577k539k540J169L098j83l340j095K829J666j565k550K81
8153a770K561Q27k138j924J437K381l75k462o42J879J985j204k770M29L047N50
8169A811k363j677J986K604j202k496q9K910K64j666j616J262K045j59k198o49
$$ plain form
8057 2071 2230 -782 -2548 -563 2160 839 -2257 -2299 787 2045 -707 -3050 -1602 1448 1276 -1584
8073 -1584 -2836 -259 2122 604 -2305 -2054 1225 2605 -42 -2251 -470 2785 2231 -1319 -2082 1151
8089 1151 3074 937 -2028 -1346 2471 2774 -345 -2154 -282 2201 1740 -1607 -2277 994 2735 15
8105 15 -3071 -1626 1666 1671 -1678 -3194 -171 2213 480 -2302 -2160 806 1758 -524 -2545 -1145 1920
8122 1920 1664 -1013 -2341 100 2425 1092 -2262 -1614 1751 2757 -140 -2293 -206 2799 1756
8137 1756 -1758 -1677 1422 2999 460 -2080 -911 2187 2004 -1336 -2431 398 2064 499 -2051 -1770
8153 -1770 791 1618 -520 -2444 -1007 1374 999 -1463 -2105 -226 1759 555 -2215 -1786 1261 1811
8169 1811 -552 -2229 -243 2361 1159 -1337 -1426 1484 1748 82 -1534 -272 1773 1614 -584 -1233
8185a233J592J340j177j319rJ671
$$ plain form
8185 -1233 359 1699 522 -797 -806 865
8191H65
$$ Imaginary data points
##PAGE= N=2
##DATA TABLE= (X++(I..I)), XYDATA
0@%%%%%%%Qj6J6j6K4l2M0n4O8q4J02j20J44j78K17k57L01l58M23m89N65o56P59
30D07q68R88j130J284j448J634j841K067k316K587k884L209l564L950m371M835
46B539n343N894o495P160p889Q686r570J0557j1654J2879j4265J5847j7671J9796
60A0471k2309K5342k9085L3839m0112M8810o1768Q3346j27759L74916q30679l96848
72i31836J534900J72962j119095l17722R04794J78630n65980r6350L23029k21291
82a37959p9000M82937o2443q32567J89800J077410j89302j227517J56138J220725
92E98222l1137j165307n8929J070035J53014q69580q1276O15927l7943l33201
102a40175K18389P8318l78689J47190N81200k68798p49555K90209Q92222k51261
$$ plain form
0 0 0 0 0 0 0 0 0 8 -8 8 -8 16 -16 24 -30 38 -46 56 -64 80 -98 119 -138 163 -195 228 -261 304 -352 407
30 407 -461 527 -603 681 -767 867 -974 1093 -1223 1364 -1520 1689 -1875 2075 -2296 2539
46 2539 -2804 3090 -3405 3755 -4134 4552 -5018 5539 -6115 6764 -7501 8346 -9325 10471
60 10471 -11838 13504 -15581 18258 -21854 26956 -34812 48534 -79225 295691 -534988 -931836
72 -931836 603064 776026 -343069 -660791 244003 422633 -143347 -239697 83332 -137959
82 -137959 -216959 265978 203535 -629032 -439232 638178 448876 -778641 -622503 598222
92 598222 567085 -598222 -657151 412884 565898 -303682 -384958 230969 193026 -140175
102 -140175 78214 156532 -222157 -74967 506233 237435 -512120 -221911 670311 419050
112D19050j008890J76114J041749j45150r66079J40386P74749j69438n74075J59062
122a52522L35487k13476j34179L20467l2159m82517J26617O25920k06157p62589
132e75108K55920Q33682k77415q05957K76320P27779k26627o12674J89357M94540
142B79817j88299l30253K81374J86277l72168j8226M74967j23492n56501K35665
152a30839O27695k70787o43098K65001O34943k41649o19938K17432N57108k42987
162A52881m54547K74768K94183l15281j39586L29001k1776l85958J12441M33815
172B79941j71754m80164K03648N06230k45226n24666K79789M97248k99651m03825
182c58430L11304K95102k88846j70891K91775P6871l12356J9143L67212r2383
$$ plain form
112 419050 -589840 -413726 628023 482873 -483206 -342820 431929 262491 -311584 -152522
122 -152522 182965 -30511 -164690 155777 123618 -358899 -232282 393638 187481 -575108
132 -575108 -319188 514494 237079 -568878 -292558 435221 208594 -404080 -214723 279817
142 279817 91518 -238735 42639 228916 -143252 -161478 313489 189997 -366504 -130839
152 -130839 496856 226069 -417029 -152028 482915 241266 -378672 -161240 395868 152881
162 152881 -301666 -26898 267285 -47996 -187582 141419 119643 -266315 -153874 279941
172 279941 108187 -371977 -168329 337901 92675 -431991 -152202 345046 45395 -358430
182 -358430 -47126 247976 -40870 -211761 80014 156885 -155471 -136328 230884 138501
192A38501l94873J90788M25433k69269m29700L25436M02207l47584l44100L53279
202E0118K86312l55944k42615L57356J75505l90470j01216M11852J245m29172
212b37029P9928M12137j52163l92966J87071L45449k24373l06705K59227K76451
222B47027k96718k40048L35882J73363l75914q4260M09524J8497m06317L2924
232a86040L95889n3835l65836Q6734L42223j15899k97395J67303K50613k11597
242A2160j72344K64749Q0684l16775N41L56525n2313l86355P4821M07010r6424
253A72279m36238J01599M28490j19345l92629J28856L10137j52247k19629J69603
263i124J16796j98866l1109K36831m0827k90547J03097L60796j47500m17134J75057
$$ plain form
192 138501 -256372 -65584 359849 90580 -339120 -13684 388523 40939 -303161 50118
202 50118 336430 -19514 -262129 95227 270732 -119738 -220954 190898 192143 -237029
212 -237029 -157101 255036 102873 -290093 -103022 242427 18054 -288651 -29424 247027
222 247027 -49691 -289739 46143 219506 -156408 -240668 168856 187353 -218964 -186040
232 -186040 209849 156014 -209822 -123088 219135 103236 -194159 -26856 223757 12160
242 12160 -160184 104565 185249 -131526 -130985 225540 173227 -213128 -138307 268703 172279
253 172279 -263959 -162360 266130 146785 -245844 -116988 193149 40902 -178727 -9124
263 -9124 107672 -91194 -122303 114528 73701 -216846 -113749 247047 99547 -317587 -142530
274a42530M43359j72076m16417J66740L73392j45384l05476J31241K28422j24108
284C7163j28928J50866K6474k02132P5513K68398j60461l31084K11741L73666
294C21216k26656m01542K08443M08574j78048l97297J36501L38996j12535k51669
304a54017J03058J36923j14148k0122J34122r4155j76020J79619K32089k27882
314e33k93749K42464L45348k30775l66630K05479L50479j64865k89934J25164
324g7552K08204q0593r7345O0033k2157p1131J38163J21180k29115j84785K97238
335F2140K51245l35283l06897L31923L37649k94271l42000K27876L08991j56897
345H4476k43787R3592J38939o5006k0662O2220j03514q3448K19225J26097l07878
$$ plain form
274 -142530 300829 128753 -287664 -120924 252468 107084 -198392 -67151 161271 37163
284 37163 -91765 59101 85575 -116557 -41044 227354 66893 -264191 -52450 321216
294 321216 94560 -306982 -98539 310035 131987 -265310 -128809 210187 97652 -154017
304 -154017 -50959 85964 -28184 -48306 85816 -8339 -184359 -4740 227349 -533
314 -533 -294282 -51818 293530 62755 -303875 -98396 252083 87218 -202716 -77552
324 -77552 130652 50059 -47286 12747 -9410 -80541 57622 178802 -50313 -235098 62140
335 62140 313385 -21898 -328795 3128 340777 46506 -295494 -67618 241373 84476
345 84476 -159311 -65719 73220 8214 -12448 49772 -53742 -137190 82035 208132 -99746
356i9746j86981L50923K49803l48119k98370L15592L26271k56225l16428J84506
366g8774K66851j10558j77617M9082O3570o576O5049j431j84233k5776K77277
377A36864P3651l43118j34006L79674J95974l72874k42571L23067K55694k47607
387B4748k32000J61968J74312q0955q7983K0880j6835J0215J26792j4212k33164
398a46234q545L19224N3461l66327j04658L70256J45830l42960j72042K87214
408C5219J76118k12630j46220J35161Q4096o8740m29J8012r4730J1797J87302
419A24956j5952k64592j974L19364L2538l48614p1022L43700J01445l06332j09083
430a95566K50114R3267j88922n6949J24702L356o5313O5369K6541j34851o756
$$ plain form
356 -99746 -286727 64196 313999 -34120 -332490 -16898 309373 53148 -263280 -78774
366 -78774 188077 77519 -100098 -51016 12554 5978 71027 69596 -114637 -140413 136864
377 136864 210515 -132603 -266609 113065 309039 -63835 -306406 16661 272355 24748
387 24748 -207252 -45284 129028 48073 -39910 -19030 -35865 -25650 101142 86930 -146234
398 -146234 -154779 164445 217906 -148421 -253079 117177 263007 -79953 -251995 35219
408 35219 211337 -1293 -147513 -12352 71744 3004 2575 20587 -74143 -62346 124956
419 124956 109004 -155588 -157562 161802 194340 -154274 -225296 118404 219849 -86483 -195566
430 -195566 54548 147815 -41107 -98056 26646 30002 -35311 30058 56599 -78252 -85008
441h5008K01894Q744k52882k0817K80549L9158k78795n0904K57938N5345k20764
452f5542n0095J67800K5370j12773J3205O2978o3737k6722J13792l583j66551
463a05858J5913K04772k1226k28872J7555K34442j3412k23021J3788J95528k2742
474F6867j57141M3382J21127o7352p9765J02625M4016j38091j4145J73604N58
485I5685j95622J0995K11476j7269k13603K6084K03162l5532j83358M6956J56921
496A05895o3531j27023Q3356R2280j09161o5654J27452L9773j44899k1481J54271
507G1278r98j61617J6754J55600l7241j45487N4965J30707p6760j13750R9084
518g465R6186j17777p7079J34314O2562j41365m3244J48544L0185j40857q965
$$ plain form
441 -85008 116886 125630 -127252 -148069 132480 171638 -107157 -158061 99877 155222 -65542
452 -65542 -115637 52163 77533 -35240 -22035 40943 -22794 -49516 64276 60693 -105858
463 -105858 -89945 114827 93601 -135271 -117716 116726 103314 -119707 -105919 89609 66867
474 66867 -90274 -46892 74235 6883 -72882 29743 73759 -64332 -78477 95127 95685
485 95685 -99937 -88942 122534 105265 -108338 -82254 120908 85376 -97982 -51026 105895
496 105895 42364 -84659 -1303 90977 -18184 -83838 43614 83387 -61512 -82993 71278
507 71278 70280 -91337 -74583 81017 43776 -101711 -46746 83961 7201 -106549 -7465
518 -7465 88721 -29056 -106135 28179 90741 -50624 -93868 54676 84861 -55996 -64961
529f4961J30728j0048j10582L9250R6349o7078p8472R8970O4863j27760n5395
540h4136J50027M8569j68176m7593J70820M1153j66866l8355J42870K2528j20113
551d9272n570Q6346k6624n7940O2356K8154j05968j1206J46799M473j81518o419
563a16389K08785J7605k15665k7129K10538M2102j83454m0994J50579L4636j01266
574b0652p895N7563k4584j4872P1337j0914j19172K4387J64955k3034j98879P050
586i4710K14140J2483k14357l6855J88312M7826j50853n4882R3664M0125m0419
597D474j4996j5075l2239N3116Q2205q0980j35016Q6069J78913p4075k07197N0858
609a03943K17131j8283j99699n590J67844K8161j12040k5856N5659J1884R647
$$ plain form
529 -64961 65767 55719 -54863 -15613 80736 13658 -64814 34156 99019 -28741 -84136
540 -84136 65891 114460 -53716 -101309 69511 110664 -56202 -94557 48313 70841 -49272
551 -49272 -54842 31504 4880 -53060 9296 37450 -68518 -79724 67075 71548 -109970 -116389
563 -116389 92396 110001 -105664 -132793 77745 119847 -63607 -104601 45978 80614 -20652
574 -20652 -28547 29016 4432 -10440 60897 49983 -69189 -44802 120153 97119 -101760 -94710
586 -94710 119430 131913 -82444 -119299 69013 116839 -34014 -88896 4768 44893 4474
597 4474 -10522 -25597 -57836 -4720 77485 -3495 -138511 -52442 126471 52396 -154801 -103943
609 -103943 113188 94905 -104794 -110384 57460 85621 -26419 -52275 3384 15268 24915
620B4915K7047n7232p1529R4509J25577j04716j72593R7201K07202p4271k24985
631a28875L8814K15408p146j88209k4330J32894L1534p3843l0661M243K334N0211
643B2374L4413r6596q7918J18212J37645j21719j80759J04276K07430o8826k08690
654a40158L2448J89622P737j42521k9926Q7310M3313j7258k6467m3591k168J00655
666E8996N1363j34125r8676J47656J45871j33793j78997J02655J92151o3155j85034
677i5088J7606J48964J5570j00288l9681L1544L7219L2337k5879r6844q996J38635
689E5099M8999j66324r8039J66005J37877j48663j63836J15620J69191p2149j48037
700a04257L3830J13673L434n7421j9293N70K5527O5041k230j12383k6950J50388
$$ plain form
620 24915 51962 -5270 -76799 17710 143287 38571 -134022 -36821 170381 96110 -128875
631 -128875 -90061 125347 118201 -70008 -94338 38556 70090 -3753 -34414 -30171 -27837 22374
643 22374 56787 -39809 -127727 -9515 128130 6411 -174348 -70072 137358 68532 -140158
654 -140158 -107710 81912 89649 -52872 -82798 4512 47825 30567 4100 -39491 -41659 58996
666 58996 110359 -23766 -122442 25214 171085 37292 -141705 -39050 153101 89946 -95088
677 -95088 -77482 71482 87052 -13236 -52917 -21373 15846 48183 22304 -74540 -83536 55099
689 55099 104098 -62226 -160265 5740 143617 -5046 -168882 -53262 115929 43780 -104257
700 -104257 -70427 43246 46680 -10741 -30034 -29464 -3937 61104 58874 -53509 -80459 69929
712F9929O9246j63736j04403J59746J33358j35916j48217R8165J42449o0070j23996
723f3445K0130Q2017K619l6740j9531j9739J4937O5432o085j10226j9519J31340
735D1190M5369j37498p1501J26692Q6444j06938q9552Q1914Q2542m9036n5957
746d6331K3515K4260J169J9709o946n6129P474R2057Q134j11461j9761J27132
758F2822L6683j28879m7656J18981N2369r8931m6395P4575L0544n5614j3171L4193
770A9521j5209k6588L8896J8141o7580k1203Q3459K0228r8343k6158R7240K4367
782D6771r3622k2671Q5822J9540p3320r809O0508m590m5962K7334M1955m0912
794h956l0926N7676K9058o3551k1518P1728K0014p1496j2194P3190Q517o7945
$$ plain form
712 69929 139175 -24561 -128964 30782 164140 28224 -119993 -21828 120621 60551 -63445
723 -63445 -43315 38702 41321 4581 -14950 -34689 -19752 45680 39595 -70631 -90150 41190
735 41190 86559 -50939 -122440 4252 90696 -16242 -105794 -23880 58662 9626 -46331
746 -46331 -22816 1444 2613 22322 15376 -40753 -33279 58778 66912 -44549 -64310 62822
758 62822 99505 -29374 -77030 41951 94320 -4611 -51006 23569 54113 -1501 -14672 19521
770 19521 4312 -22276 16620 34761 -32819 -54022 29437 49665 -48678 -74836 22404 46771
782 46771 -46851 -69522 16300 35840 -37480 -47289 13219 8629 -37333 -9999 31956 -8956
794 -8956 -39882 17794 46852 -16699 -38217 33511 53525 -17971 -30165 43025 51542 -16403
806a6403N51O0579j5585n6303K6579M9719l7114m6069M0953L6502m8979l5741
818d1311M6979K4838m9053j5217M5361j129m4355J5382L9346l3105l9712M7300
830d676M1383n7096m0896O7396M5480o9714m6701O8843M5651n7210l1750N2322
842A3032J9522l9865L10L3944j9335k8794M2137L1781o1473l6266P8594M7324
854H0911q9145o0909Q4187O4849p5725o6405N9002O0014m3193n1839J9432K6916
866H095o288j114n167l0894O001N9140K16q3247j4296R6275L0163r7618m3798
879h2532R1753O0548o9404o1770M5138N3959j7397l1844m115Q650K6570K7314
891D6870l4679o2721L0705R4342j5866j15457n341J22639K8619j16558m8466R6700
$$ plain form
806 -16403 -15852 44727 29142 -27161 -582 49137 12023 -34046 6907 43409 -5570 -41311
818 -41311 5668 30506 -18547 -33764 11597 10468 -33887 -18505 20841 -12264 -51976 -4676
830 -4676 36707 -20389 -61285 6111 51591 -18123 -64824 4019 49670 -7540 -39290 13032
842 13032 32554 -7311 -7001 26943 7608 -21186 20951 52732 -8741 -45007 33587 80911
854 80911 -8234 -69143 15044 79893 4168 -62237 -3235 56779 13586 -38253 -18821 8095
866 8095 1807 693 -4474 -35368 -29367 29773 29989 -53258 -67554 28721 58884 -38734 -82532
879 -82532 9221 69769 365 -61405 -16267 37692 20295 -11549 -15664 -7014 19556 46870
891 46870 12191 -50530 -19825 74517 58651 -56806 -62147 60492 89111 -27447 -75913 20787
903B0787N6371p4130o1270L8522N0559k748k7492k6933r705L8788M4605m4223
915C131q0082L7298J07967j9018j24176m365J26993K8708j14768m7949Q9509O0673
927F3921n1630n4916J8474M0234J4970j2526m0717k2536N5951O4185n0115r4447
939f9152L4296J15439j4223j23808j1924J17031L6307r7002n4512O3993N9070
950E5515k7089n2249j4752K6419M2886M495n8998l7941O3144O8331n9499r6941
962h6679M0354J12488j3440j10360j1436R5684L2697o7394m2596L1046M1878Q059
974C0301k5918l8859L175O5719L1331p8419o6956P5073R5360n8472j12650L7425
986d2890J20216j1023j14260j6572Q9064L4239n5343m0861J8374L3354J6161j5332
$$ plain form
903 20787 77158 3028 -58242 -19720 30839 28091 599 -26334 -36039 2749 47354 3131
915 3131 -76951 -39653 68314 49296 -74880 -79245 47748 76456 -38312 -86261 3248 63921
927 63921 12291 -42625 -24151 16083 31053 18527 -22190 -44726 11225 75410 25295 -69152
939 -69152 -34856 80583 66360 -57448 -69372 47659 83966 -13036 -67548 -3555 55515
950 55515 28426 -23823 -38575 -12156 30730 35225 -23773 -61714 1430 69761 10262 -86679
962 -86679 -46325 66163 52723 -57637 -69073 26611 59308 -8086 -50682 -19636 22242 30301
974 30301 4383 -34476 -31301 34418 65749 -12670 -79626 -4553 90807 32335 -80315 -42890
986 -42890 77326 66303 -47957 -64529 24535 58774 3431 -37430 -19056 14298 30459 15127
998A5127m6107j1862O2782L8747o9333o7002O4754R2064m6751j05453J9587J01255
1010D7808N513q4581k4251O1320L7515k9158m0108n787L1872L8433j4158o2645
1022c8227r472P7255L8778p7820o2167O7158P7142n0642q2830K9105P9473o159
1034D1594o2506j1650L5875J9309r178j9480j7978J1927M2257K182o1092k0850
1046d9590O9331L9004o7817n5105N7411O3121m1419o0139K6951N0943j4393l8487
1058b0189L341K0350M307L631l258k6007m317M1496J4115n0443k4923N3623L3939
1071D5665n2552l9931M7474M1355l9714l9107K8829L0077j9394j7060J5606N072
1083F320j3519N665J2761j6022j4106K5900J8678k9523k0350L0234J8488k8433
$$ plain form
998 15127 -30980 -42842 19940 58687 -10646 -77648 -12894 79170 32419 -73034 -53447 47808
1010 47808 53321 -31260 -55511 5809 43324 14166 -25942 -31729 143 38576 24418 -38227
1022 -38227 -47699 29556 68334 -9486 -71653 -4495 72647 22005 -60825 -31720 47753 41594
1034 41594 -20912 -32562 3313 22622 13444 -6036 -24014 -12087 30170 32352 -28740 -49590
1046 -49590 19741 58745 -9072 -64177 -6766 56355 14936 -45203 -18252 32691 18298 -20189
1058 -20189 -16848 3502 7809 11440 8182 -17825 -22142 19354 33469 -16974 -41897 11726 45665
1071 45665 -6887 -46818 656 42011 2297 -36810 -7981 22096 2702 -14358 1248 6320
1083 6320 -7199 -1534 11227 -4795 -18901 6999 25677 -3846 -24196 6038 24526 -3907
1095c907j4561K6499J0786k5025n480K2696m73k0243O753J8019j5213j9067K0804
1108A588J8359k1737j5028K0860P531k3698j922K6297k683k8924Q199L1446j5423
1121D865l5423K1942L8540k4318m1081K3919M1819j8889l8053J5192L2046j1458
1133I101k3997J0874J3835r303Q38J4032j4057k0349K3022K7107k6561l3066K7583
1146i41M0208k5408m6482J7387M6703r004m0869j587K5606P396q375j0066j0205
1159a5637O386K3060j532l6489r616M7127K5463n0492m1584M5547N0622l3504
1171I351n0657J9241M6574j025l4104j1864J9801K0553J830k0817k3653J5081
1183i689M6354m86o0730j4559O5835K9229o3505m3942N0914N5544l1750n9386
$$ plain form
1095 -3907 -18468 8031 18817 -6208 -11688 11008 10535 -9708 -2955 15064 -149 -19216 1588
1108 1588 19947 -1790 -16818 4042 11573 -12125 -14047 12250 9567 -19357 -11158 20288 4865
1121 4865 -30558 -8616 29924 5606 -35475 -11556 30263 11374 -26679 -11487 20559 9101
1133 9101 -14896 -4022 9813 510 1348 15380 1323 -19026 3996 31103 4542 -28524 -941
1146 -941 39267 13859 -32623 -15236 31467 22463 -18406 -19993 5613 13009 4634 -5432 -15637
1159 -15637 -9251 13809 12277 -24212 -33828 13299 38762 -11730 -53314 -7767 42855 9351
1171 9351 -41306 -22065 24509 23484 -10620 -22484 -2683 17870 19700 -1117 -24770 -9689
1183 -9689 36665 36179 -24551 -39110 26725 55954 -7551 -51493 -579 54965 23215 -36171
1195c6171R654M9594O232l3824k0529Q414K7548J7905k9929m3920K1451O2687
1207C9112o429p5435j7754P6792M2594o7382n7406N2183O3511l2098o0293Q512
1219c4093N0989J8781k9489l4245O211M1082K0405l3542m4872J9677O5629P59
1231D7292p3657j8922P2213L5316n9362n0811L4533N6642q353n3202j5686L8168
1243D171L0490j7900m5285j3708M7870M2222m3116o5357K8449P5706q631p7500
1255d2589j5335O9210L5246n3713m4694L6839M7049j1383l5919j3669J6947L5392
1267B3381Q751m0747k7585L8813M8112k5737o3982P275P4647J2200p3746k7321
1279d5939O2301L8402m1191m5073J1947M0055J0182l1588k7747J3792L6754Q020
$$ plain form
1195 -36171 -26517 23077 29309 -4515 -25044 -16630 10918 28823 -1106 -45026 -23575 39112
1207 39112 32683 -42752 -60506 16286 58880 -8502 -65908 -13725 49786 17688 -42605 -34093
1219 -34093 16896 35677 6188 -28057 -21846 19236 39641 6099 -38773 -19096 46533 47292
1231 47292 -26365 -45287 26926 62242 2880 -47931 -13398 43244 34891 -18311 -33997 4171
1243 4171 34661 16761 -28524 -42232 5638 47860 4744 -60613 -32164 43542 34911 -42589
1255 -42589 -57924 11286 46532 -7181 -51875 -15036 32013 20630 -15289 -28958 -12011 23381
1267 23381 32132 -8615 -36200 2613 50725 24988 -38994 -31719 42928 55128 -18618 -45939
1279 -45939 16362 54764 13573 -31500 -19553 20502 30684 -904 -28651 -14859 21895 29915
1291B9915m1036l6976L3233N5819k4125o5114R992O3794P965n5121k6847L9697
1303h804L9061k0641l9979K971L2460J8971j1663l3329q022M2813K7144m1905
1315i23l7860L6553N1079j8098n7623j703N6560J6888m7746k4203L0405K5793
1327B9122q651k4012j5152J5131K9506q349m0504q809M0758K7182l6989m6375
1339d7142K7127N3714k0798n5043J0332M8051L199l3057j4803J8915J9645m540
1351E600j5162m882P114J7690R125k3860k0526L1299K9999k9637l4398K1915L7670
1364C1947o278l4692m529L1245P986k6469r406J5097P398j613o194j3342K710
1377f140J9066k133k3484n342J8668J0718j5909j7615J4749J8858j7754j6141
$$ plain form
1291 29915 -11121 -48097 -14864 40955 16830 -48284 -38292 25502 33467 -21654 -48501 -8804
1303 -8804 30257 9616 -30363 -27392 5068 24039 12376 -20953 -28975 13838 40982 -923
1315 -923 -38783 -2230 48849 30751 -26872 -28575 27985 44873 -2873 -27076 3329 29122
1327 29122 20471 -3541 -18693 -3562 25944 17595 -22909 -31718 9040 36222 -767 -47142
1339 -47142 -20015 33699 12901 -42142 -31810 16241 19440 -13617 -28420 -9505 10140 5600
1351 5600 -9562 -14444 -7330 10360 19485 -4375 -24901 6398 36397 6760 -27638 -5723 31947
1364 31947 25669 -9023 -13552 17693 25679 -790 -10196 4901 12299 10686 4492 -8850 -6140
1377 -6140 12926 10793 -12691 -18033 635 11353 -4556 -22171 -7422 11436 -6318 -22459
1389b2459J5826P973j1710J644Q931m398n600O209O821n369q618R873J5319j1470
1403B972j4286J7781J2277j8444n705J8596P51j5285P54J5732K768j8926o015
1416g030K0506K905k4449j117K1469k088j6049m26M841l11O33k592n442k032N813
1431e369R530o804j9413Q894K6889j1178k9318J0573K8596k155k1363n001J7157
1444A038J2832j0174j3132N669J0722N071m24j4763p942K4673J5267k7420k0038
1457a8621K1698K5365j2013l0592J087L1729N608l0239j2309J7727J3272k387
1469A0325j4371j6369J0714K7327p063l4791m078L4557J8890l2527l4269K7899
1481a3756M4576j9428m5105Q644L8469O491k4704j6485J2928K4753J916k2299
$$ plain form
1389 -22459 -6633 1340 -10370 -8726 205 -4193 -9793 -3584 3237 -2132 -10750 -877 14442 2972
1403 2972 -11314 6467 18744 300 -5405 13191 13942 -1343 -589 15143 17911 -1015 -7030
1416 -7030 13476 16381 -8068 -9185 12284 10196 -5853 -6279 -1438 -1749 -1116 -3708 -9150 -11182 -5369
1431 -5369 4161 -2643 -22056 -13162 13727 2549 -26769 -16196 12400 10245 -11118 -16119 1038
1444 1038 13870 3696 -9436 -3767 6955 12026 11602 -3161 -11103 13570 28837 1417 -18621
1457 -18621 3077 28442 16429 -14163 -13076 18653 24261 -5978 -18287 -560 12712 10325
1469 10325 -4046 -20415 -9701 17626 10563 -24228 -28306 6251 25141 -7386 -41655 -13756
1481 -13756 30820 11392 -33713 -25069 13400 19891 -4813 -21298 -8370 16383 18299 -4000
1493d000j4088J3551K8637L510l7341j8550M1650L0992l7693l9008K4114M3725
1505C5499n989m6390j3012M0559K5050l0201l3196R804L1286J1479k8869l2251
1517c6231K0928M4196j0081m9602o991M5392K5767l5199m0075K2936M6609p907
1529A9742m1999o916L0514K3134j1385l3385n697L7698K4317k9613l7833J5112
1541a6311M8898M625n3594k1187N1585L4324m1066m1459K1739M2547j311l9146
1553a0356j7612K8713K7630j4662l2584o469K8589K6293k2589m3090J0684N0788
1565B5335K244m8972j8057L8957L2465k5969m0814J2193M1936L079l2136j6023
1577b5762J7257K7548K101l1488j6850K9863L0183j8668l7810M292M1349J2392
$$ plain form
1493 -4000 -18088 -4537 24100 27610 -9731 -28281 13369 44361 6668 -32340 -8226 35499
1505 35499 29510 -16880 -29892 10667 35717 5516 -27680 -17876 13410 24889 -3980 -36231
1517 -36231 -15303 28893 18812 -30790 -37781 7611 33378 -1821 -41896 -18960 27649 19742
1529 19742 -22257 -29173 1341 24475 13090 -20295 -25992 11706 36023 6410 -31423 -16311
1541 -16311 32587 37212 -16382 -37569 14016 48340 7274 -34185 -12446 30101 28790 -10356
1553 -10356 -27968 745 28375 13713 -18871 -25340 3249 29542 6953 -36137 -25453 25335
1565 25335 27579 -21393 -39450 -493 31972 6003 -34811 -22618 19318 22397 -9739 -25762
1577 -25762 -8505 19043 21144 -10344 -27194 2669 32852 14184 -23626 -19334 22015 34407
1589C4407m0092k5052L2398L1877j9150l2690J295K7648J4675k0644k7316Q809
1601a3835L1372M329l0164k0618K2616L3062j4265m0882L799M0656O212l2871
1613a0589j5660K0626K2727p803k3316l639J8655J3603o989j9827o681K4189K0873
1626B6169k2297l0803J7140L6237o082l6515o120L3817J6717k7856k2525J8827
1638c291K3085p475j9768n033J2746J4833n435k0266l767J9528J1919j5681k0395
1651a9000Q345K5249j408k6318m627K1821R180j4019j2484M819J3970M250j2328
1664b550j0131P190J5209N41j6619q682J7774J5400j5654j8162J2166J8574p319
1677G737j6175J416J3720J920r973l148N654J887j313L18l742l738P617N186q952
$$ plain form
1589 34407 -5685 -30737 1661 33538 14388 -18302 -17007 10641 25316 4672 -22644 -13835
1601 -13835 17537 21866 -8298 -28916 -6300 26762 12497 -28385 -24586 16070 22282 -10589
1613 -10589 -26249 -5623 17104 9301 -14015 -17654 1001 14604 7615 -12212 -18893 5296 26169
1626 26169 3872 -26931 -9791 26446 20364 -16151 -22271 11546 28263 407 -22118 -3291
1638 -3291 19794 12319 -7449 -12482 264 15097 9662 -10604 -14371 5157 17076 1395 -19000
1651 -19000 -10655 14594 13186 -13132 -17759 4062 13242 -777 -13261 -8442 5528 9778 -2550
1664 -2550 -12681 -5491 9718 10259 -6360 -15042 2732 18132 2478 -15684 -3518 15056 7737
1677 7737 -8438 -7022 6698 8618 -1355 -4503 1151 3038 1725 2043 -1699 -5437 2180 7366 -1586
1692a586o411Q040P538p292q391O066Q590n463q441O992O649p767m253P445K653
1707D369p390j898O742K603n574l056M792K309m012p12J874k078R22N708k332
1722B267r025L026J0512j614j2257j151J3642N269j3412q024J0872R841o337j0528
1736f919q7R167O540n377j1764J771J4482L617j5488j0852J4085J7737j0077k1631
1750a4796N217K1654P43j9263o507J2874J1206n452j2022k696R448J0299m017
1763F688j6927n034K0082J3899j9489k1560J5167K7890q573l0992j503K9600J1332
1776B0580k3829j7297J5172K1056m462k0326o390J6612J6345q782k2274p33K5359
1789A1031J2136k2438k1784J4184K8095m750k9204n243K5653J4855j8293k2841
$$ plain form
1692 -1586 -7997 43 7581 289 -8102 -2036 6554 1091 -7350 -358 6291 -1476 -5729 1716 4369
1707 4369 -3021 -4919 1823 4426 -1148 -4204 588 2897 -1115 -1827 47 -2031 -1109 4599 2267
1722 2267 -6758 -3732 6780 5166 -7091 -8242 5400 10669 -2743 -10767 105 9946 3609 -6919
1736 -6919 -7006 2161 8701 3324 -8440 -6669 7813 11430 -4058 -14910 -825 16912 6835 -14796
1750 -14796 -9579 12075 12818 -6445 -12952 -78 11128 5676 -6346 -9042 406 10705 6688
1763 6688 -10239 -15273 4809 18708 -781 -22341 -7174 20716 12143 -18849 -20352 9248 20580
1776 20580 -3249 -20546 -5374 15682 11220 -9106 -15496 1116 17461 8679 -13595 -14328 11031
1789 11031 23167 729 -21055 -6871 21224 16474 -12730 -17973 7680 22535 4242 -18599
1801a8599N641K5550N960k2902j8512J5496K7604n382l2858p843L1884J9905k6647
1814g03k9129J7246L4114l902l2922r204K6664J9064j5673k4742L549K7616J1490
1827B3468k3488k3798J4346L2615j317l5653j1412L3241K3827k5390l1457J3838
1839a1180L4570j609l3220j0991K5351K1384j3301k7656k016K5765J5454k0677
1851A874k7470J0305L3994K159l5088j6312L0244K6889k1488l3806R118L5362
1863A5781M842l0823j6075K2692K4837r552k8313l691K7979J7869k0203k6186
1875b0843J0350L0539J478k9570j1860K4919K0994j5817k6072M250K5523P025
1887B0916k0693j8068J0004K3194J267k4623j3478K0460K2044j4920k9669M866
$$ plain form
1801 -18599 -12958 12592 18552 -4350 -22862 -7366 20238 14856 -18002 -25845 6039 25944 -703
1814 -703 -29832 -12586 21528 17626 -15296 -24500 2164 21228 5555 -19187 -15638 11978 23468
1827 23468 -20 -23818 -9472 23143 21826 -13827 -25239 8002 31829 6439 -25018 -11180
1839 -11180 23390 21781 -11439 -22430 2921 24305 11004 -16652 -18668 7097 22551 1874
1851 1874 -25596 -15291 18703 20862 -14226 -30538 -294 26595 5107 -28699 -19581 15781
1863 15781 20623 -10200 -26275 -3583 21254 11702 -16611 -20302 7677 25546 5343 -20843
1875 -20843 -10493 20046 21524 -8046 -19906 5013 26007 10190 -15882 -11632 13891 20916
1887 20916 223 -17845 -7841 15353 16620 -8003 -21481 -1021 21023 6103 -23566 -18700
1899a8700L1813N469k8949j5557K2644K0750j3104k2628L306K0647O719j3948
1911a538j2733O198J6797M354j5170j2948J1619K0121m158k2041k572K2222J0496
1924B0647j8881j5977J1655J9499k684j8862n709J3793J1106q033j5213k93J5195
1937F243O704j4489j3939R504J7176l902j9501l823J6254Q611j1046j1384N063
1950h529J1975M13r539n876O632J1335l22j1857n025J2277J0500q399j2928N490
1964c853J5385n33j3439k710J1176N865o996o719K143N315J708l458n254L17O049
1979D996J880q431o946P260Q989n674j1036K016R811q26r330l48P000L25n505
1994e819m85M688R85k999K87J903j515l60L414K070j576j052J281J290L41k64
$$ plain form
1899 -18700 13113 18582 -10367 -25924 -3280 17470 4366 -18262 -14956 5691 12410 -1538
1911 -1538 -14271 -8073 8724 13078 -2092 -15040 -3421 16700 12542 -9499 -12071 10151 20647
1924 20647 1766 -14211 -2556 16943 14259 -4603 -10312 3481 14587 6554 -8659 -8952 6243
1937 6243 12947 -1542 -15481 -5977 11199 7297 -12204 -16027 227 8838 -2208 -13592 -8529
1950 -8529 3446 3859 -5680 -11556 -4924 6411 6089 -5768 -10793 1484 11984 3585 -9343 -3853
1964 -3853 11532 10999 -2440 -5150 6026 11891 4895 -1824 319 5634 7342 3884 -1370 -1053 4996
1979 4996 6876 -1555 -8501 -1241 7748 2074 -8962 -6946 2865 2039 -7291 -7639 -639 -314 -5819
1994 -5819 -6304 -1616 -631 -3630 -3343 -1440 -2955 -3315 99 2169 593 -459 822 2112 2453 2189
2010B189K39j74J212K430q53l915M18M740M66n577k197L490K980k103m105r99
2026a759K533K114k713o701p31Q360N088r496j0866P301J3337m601j5526R87J6173
2041C500L689j4699p058J3122J1122p375j1911J405J1836O043n801q787J663J1609
2055H358M312j1166j0567R473J6231l704j9268k440J8663Q032j6739j4372R964
2068c223J6934k880j8362n758J4836J2266j0500j8561K38J9566P780j7369j5114
2081b0147J3028K0157o342k3139k700K1829J2447j5609j7844Q258K1265K579j9187
2094e405j0904J4556J8990o183k2535j249K4557J2037k1046k0338J2548K5295
2106B0323k753k5421o292K1646J4193j4910k0562K995K1295O634j9430j7905J2299
$$ plain form
2010 2189 2428 2254 3466 5896 5043 1128 1546 6286 6752 1175 -1022 2468 5448 3345 -760 -1759
2026 -1759 774 2888 175 -6526 -7257 1103 6191 -3305 -14171 -6870 6467 1866 -13660 -12673 3500
2041 3500 7189 -7510 -14568 -1446 9676 2301 -9610 -8205 3631 9674 3873 -4914 -3251 8358
2055 8358 12670 1504 -9063 410 16641 12937 -6331 -8771 9892 17924 1185 -13187 -3223
2068 -3223 13711 10831 -7531 -13289 1547 13813 3313 -15248 -15010 4556 12336 -5033 -20147
2081 -20147 -7119 13038 6696 -16443 -19143 2686 15133 -476 -18320 -10062 11203 13782 -5405
2094 -5405 -16309 -1753 17237 11054 -11481 -12730 11827 23864 2818 -17520 -4972 20323
2106 20323 17570 -7851 -14143 7503 21696 6786 -13776 -10781 10514 17148 -2282 -20187 -7888
2119g888K4098k699k8058r645K5149J9264k0082k7320J1495L1625P02k9882j2416
2132b5657K3375K0769j3076k4029L541K5525Q771j9660j8261J2305K5241q30k6641
2145h627j0444K4147K1044j4546k7215L539K7820O428k5639j6923J8868K4657
2157B3109q182k9317n369K6590J6020k1228k6136J1055L0093J86k9893j1683K4577
2170a78K0251j7313k6003O122K7007N846k1500j4306J3879K0627m077k2529o394
2183a8568K1417J8234j3504k3881L665K7499O689k5547j5003K0140K1550j1359
2195A1332k4537K321K4522O717k1242j5564J1667J9737j926j9976p614J5696J4005
2208A5138j1001k0037K269K1419N155j8998j2495J3283J7763o201j9158k030J6797
$$ plain form
2119 -7888 16210 13511 -14547 -24192 957 20221 139 -27181 -15686 15939 16641 -13241 -25657
2132 -25657 -2282 18487 5411 -18618 -15077 10448 19219 -441 -18702 -6397 18844 18014 -8627
2145 -8627 -19071 5076 26120 11574 -15641 -12102 15718 22146 -3493 -20416 -1548 23109
2157 23109 14927 -14390 -19759 6831 22851 1623 -24513 -13458 16635 16821 -13072 -24755 -178
2170 -178 20073 2760 -23243 -17121 9886 15732 -5768 -20074 -6195 14432 10355 -12174 -18568
2183 -18568 2849 21083 7579 -16302 -12637 14862 21551 -3996 -18999 1141 22691 11332
2195 11332 -13205 -10884 13638 20355 -887 -16451 -4784 14953 13027 -6949 -14563 1133 15138
2208 15138 4137 -15900 -13631 7788 12943 -6055 -18550 -5267 12496 6295 -12863 -14893 1904
2221A904Q894j0981j3271N784J6706J998j5203q839J1267J4014m826j4619k96
2234g468J5180N506j1997j0284P466J2138j524j1224n114Q766R452m752j1678
2247e533j681J0639N394r281r766P205J2026l409j3816j641J1228M800q159o557
2261h551M792O857j089n543j808K964L553P01m139l188M310O934k067p768o67
2276d709P908L191o898m347O022O464l570o515P57N517O30l860j733J893K321
2291C071j031k645K69J573l50j874j120J448K63n74O67R90j912k633J113L835
2307A090m99l419l11L967Q30l467j205K689K106j193j694K41M96K442J544k854
2323G63m313K091O563q60p703q69Q640L771q493p111O516Q852l547r348m34Q766
$$ plain form
2221 1904 10798 -183 -13454 -7670 9036 11034 -4169 -13008 -1741 12273 7447 -7172 -7468
2234 -7468 7712 13218 1221 -9063 -1597 10541 9017 -2207 -7321 1445 10897 6145 -5533
2247 -5533 -7214 3425 8819 -462 -10228 -3023 9003 5594 -8222 -9863 1365 6165 -1994 -8551
2261 -8551 -3759 3098 2009 -3534 -5342 -2378 1175 1876 -2263 -5451 -1141 5793 3726 -4042 -4709
2276 -4709 3199 6390 -508 -4855 1167 7631 4061 -2454 -1697 3820 4450 590 -1143 750 3071
2291 3071 2040 -605 -336 1237 887 -987 -2107 -659 -396 -970 -303 687 -1225 -3858 -2745 1090
2307 1090 591 -2828 -3139 828 1658 -1809 -3014 -325 1781 588 -1106 -865 -369 2073 3617 763
2323 763 -3550 -1459 5104 4244 -3459 -4328 4312 8083 -410 -7521 -1005 7847 4300 -5048 -5482 3284
2339C284L881o770p377L263R037J380r750o740Q214J0991l617j3676j560J2960
2353C520O326j1133j0256Q149J3577k811j4821l876J3369R620q724j3441K840
2366g661J5170L335j3348r905J0585J4152n201j6615j554J6292Q851j2684j4155
2379a2738O570J6071P78j6240q335J3597J4869p710j9338n06K0267Q726j7445
2392a434j5531J2078K0388m750k1953k900J9784J0708j5132j6208P157J9127J766
2405A3100j7154r988J1302J5380m095j8364m244J8143J2235j3785j9590O490K3061
2418A2491K092k2625j0846J8544J8155j1248k1968K496K2779O736j9666j4836
2430a7896J3496K0701l992k2238n038J9791J3270j4481j8934O313K1871L123k0100
$$ plain form
2339 3284 7165 395 -6982 -3719 5318 6698 -3052 -9792 -1578 9413 5796 -7880 -9440 3520
2353 3520 9846 -1287 -11543 -3394 10183 7372 -7449 -11325 2044 11664 2940 -10501 -7661
2366 -7661 7509 10844 -2504 -12409 -1824 12328 7127 -9488 -11042 5250 14101 1417 -12738
2379 -12738 -6168 9903 10681 -5559 -13894 -297 14572 6862 -12476 -12982 7285 16011 -1434
2392 -1434 -16965 -4887 15501 10751 -11202 -14102 5682 16390 1258 -14950 -7793 11334 13100
2405 13100 -4054 -14042 -2740 12640 8545 -9819 -14063 4080 16315 2530 -17060 -10570 12491
2418 12491 14583 -8042 -18888 -344 17811 6563 -15405 -12909 9870 16606 -3060 -17896
2430 -17896 -4400 16301 12309 -9929 -14967 4824 18094 3613 -15321 -9008 12863 15986 -4114
2443d114j1978J3712J8821n848k1843m249K0177J2985j5123j9963P450K3492J496
2456A5015k3884j1383K0039J9122j2511k3671L309K3610N845k0307j4034J4147
2468d703J9385m985k0503m515J8994J3012j2799j9767N224K2561M327k0572j2067
2481a6408J5989J9075r017k2251j69K2304Q592j7614j4881R867J8541j884j9464
2494g320p011J6417J3122j0891j7782K590J8798N196j7138j3014J1574J7059m800
2507F800j8027k571J6606R948j3309j4826P226J7601O23j6288o430J3142J2395
2520A2890p554j5422K971J5463L081j2691p749R037J1150l171j1939k430R684
2533C320N987n569q665L84R482M245r110r077N714J0451j516j1665l293J0527
$$ plain form
2443 -4114 -16092 -2380 16441 10593 -11250 -15499 4678 17663 2540 -17423 -9973 13519 15015
2456 15015 -8869 -20252 -213 18909 6398 -17273 -13964 9646 15491 -4816 -18850 -4703
2468 -4703 14682 9697 -10806 -15321 3673 16685 3886 -15881 -10657 11904 16231 -4341 -16408
2481 -16408 -419 18656 9639 -12612 -12781 9523 18115 501 -14380 -4513 14028 12144 -7320
2494 -7320 -14331 2086 15208 4317 -13465 -10875 7923 13119 -4019 -17033 -5459 11600 6800
2507 6800 -11227 -13798 2808 12756 -553 -15379 -8153 9448 10071 -6217 -12647 495 12890
2520 12890 5336 -10086 -7115 8348 11429 -1262 -9011 26 11176 8005 -3934 -6364 3320
2533 3320 9307 3738 -4927 -4543 4939 9184 74 -9003 -3289 7162 5646 -6019 -9312 1215
2547A215O682r123r174N596R364k103q605j146O777M320l770n879K010M916L85
2562A465k071k203J402M073J115l756k087K889L335j88l276j719L811L079k576
2577C293l811J004K590O86l003k346K141K868k231l218N44J343o70p21n88l8J56
2594b001n40N63K61j904m74L248O27k920p74K729J692j7k381k00K688J650j474
2611G73r79L86J957K497j326m508R41N729K35m730k816L787N029k600p294L29
2627b590P190P74o249l083K388N073k50p008l189N538M619l037o736r86P486M857
2643D797p543p736N022J0296j522r491l073Q820R491o571j2336M505J3342J380
2657I381j1259o401R316J1595n123j3915Q33J3988L684j0451q287N026J1908k19
$$ plain form
2547 1215 7897 -1226 -10400 -4804 4560 2457 -6148 -7294 -517 3803 33 -5846 -3836 1080 1465
2562 1465 -606 -2809 -1407 2666 3781 25 -2062 827 4162 3974 698 -1021 2790 5869 3293
2577 3293 -518 486 3076 3762 759 -1587 554 3422 1191 -2027 -1483 -140 -810 -1531 -2119 -2157 -2001
2594 -2001 -2541 -1978 -1717 -3621 -4095 -847 -220 -3140 -3914 -1185 507 490 -1891 -2091 597 2247 773
2611 773 -206 180 2137 4634 3308 -1200 -259 5470 5705 975 -1841 1946 6975 4375 -2919 -2590
2627 -2590 4600 5374 -875 -3958 -1570 3503 3253 -3755 -6944 -1406 3213 176 -6560 -7546 -60 4797
2643 4797 -2746 -10482 -5460 4836 3314 -6177 -9250 -430 9061 2490 -9846 -5341 8001 9381
2657 9381 -1878 -8279 1037 12632 7509 -6406 -5573 8415 12099 1648 -6639 -1613 10295 10076
2671A0076j3523n715J0980Q684n996j2750j954J3833P690j3665j3375R020J5808
2684I113k697j7119n408J6677J2183j3207j6594Q000J8005k73j5273p079J2786
2697h86J4351p413j6669J921J6455N345j1645j2122O856J7445l15j7905o331J4735
2711C822J2175q626j6870N42J8284P123j7996j3251J2002J6210m534j8896n290
2724a5305J8250J1710j5073j6836P657J7914J075j7029r470J3519J5765p855j8418
2737a4096J545J7279O918j1885j4190P157J9978k01j9856n408J6280J2907q950
2750G478j7844J767K0627N403j8501j1144J2324J4746m279j7103m945J6277J1383
2763A6189j3542j5822N041J6667L246j6487j2654J3020J7880q061j9803L9J7894
$$ plain form
2671 10076 -3447 -9162 1818 10502 4506 -8244 -10198 3635 11325 -2340 -15715 -6695 9113
2684 9113 6416 -10703 -16111 566 12749 -458 -17052 -9052 8953 8680 -6593 -13672 -886
2697 -886 13465 6052 -10617 -8696 7759 13104 1459 -10663 -3807 13638 13323 -4582 -10913 3822
2711 3822 15997 7371 -9499 -8957 9327 16450 -1546 -14797 -2795 13415 8881 -10015 -15305
2724 -15305 2945 14655 -418 -17254 -9597 8317 9392 -7637 -17107 -3588 12177 4322 -14096
2737 -14096 -12551 4728 11646 -239 -14429 -7272 12706 12505 -7351 -12759 3521 16428 7478
2750 7478 -10366 -8599 12028 17431 -1070 -12214 110 14856 10577 -6526 -11471 4806 16189
2763 16189 2647 -13175 -8134 8533 11779 -4708 -17362 -4342 13538 5477 -14326 -14287 3607
2776C607Q664j4686j5617J0057J9754l148j9280l432J5987J0637q727j6027L342
2789h869J8848K927j5947p616J0468J2640k509j5610l621J5086R463j1693j3039
2802i472M987J4463K791j5259j0514J2875J4596q825j7056J714J5251N450j3877
2815b876j2180J0669J4638o279j4971K30J2199N936q036j0999M729J2519j93j0458
2829e072l099P206P652j798j0291j703J2164M611q600o805M462R170Q97j0541
2843a747m218R666O555p261p754K914P194J456p556n306O039O024m816n697R79
2858c528M044K162l829n176K747N490j139m038p77J707K642j3l845K66M916n36
2874A093k725J42J202J321R50k761J46K884k82j142J287N1j779J030P19o27J43
$$ plain form
2776 3607 12271 -2415 -18032 -7975 11779 8631 -10649 -14081 1906 12543 3816 -12211 -8869
2789 -8869 9979 12906 -3041 -10657 -189 12451 9942 -5668 -9289 5797 15260 3567 -9472
2802 -9472 -4485 9978 12769 -2490 -13004 -129 14467 5642 -11414 -9700 5551 11001 -2876
2815 -2876 -15056 -4387 10251 3972 -10999 -10769 1430 7366 -670 -11669 -6940 5579 5386 -5072
2829 -5072 -8171 -965 6687 4889 -5402 -7105 5059 9670 1070 -5735 -1273 7897 8794 -1747
2843 -1747 -5965 3701 10256 2995 -4759 -1845 5349 6805 -751 -6057 -18 6006 1190 -4507 -3528
2858 -3528 516 2678 -1151 -6327 -3580 1910 771 -3267 -4044 -2337 305 292 -3553 -3287 1629 1093
2874 1093 -1632 -1490 -288 1033 1983 -778 -632 2252 1970 828 2115 2166 387 1417 2136 1509 1652
2891A652q43p1K049j034k822P12J574q18m41m12j155J715R96k582j194M65J582
2908f27J190k339l206K969N301k812n492P06M951J929l600m210M533O521l435
2923B379o716J759N399J827l570m515K426O294j37n711j740L053L217k55n720
2938b010k287O762M510n456o680J314P255K620q235o698P860Q981n176j0128M48
2953f920R610M065q632q240O753J0915l194j0390q08Q506N407n758r810L185J1404
2968F093J938r340o296N468R670q54j1763l485J1942P700q903j0787M000J2732
2982H115K075j4164q223J2159J1688o463j3415J58J2991N696j1986j1139Q281
2995d227J4081k615j3928l836J1426J0105p877j5044L230J5831K845j3398q509
$$ plain form
2891 1652 809 738 2787 1753 -1069 -357 1217 399 -42 -454 -1609 106 1102 -1480 -2674 -2209 -627
2908 -627 563 -1776 -4982 -2013 3288 476 -5016 -4310 641 2570 -1030 -5240 -707 5814 2379
2923 2379 -4337 -2578 2821 4648 1078 -3437 -1011 5283 5146 -565 -2305 748 3965 3710 -2010
2938 -2010 -4297 2465 6975 1519 -5161 -3847 3408 6028 -2207 -8905 -1045 7936 2760 -7368 -6920
2953 -6920 2690 6755 -1877 -10117 -3364 7551 4357 -6033 -6841 1665 7072 1314 -8496 -5311 6093
2968 6093 8031 -1309 -7605 -2137 7533 6679 -5084 -8569 3373 11073 2170 -8617 -4617 8115
2982 8115 10190 -3974 -12197 -38 11650 5187 -8228 -8070 4921 10617 -1369 -12508 -4227
2995 -4227 9854 7239 -6689 -10525 901 11006 3129 -11915 -8685 7146 9991 -3407 -11916
3008a1916R727J3822m332j6688j592J5237Q001j1494j1359N886J4392K47j5858
3021e927o099J2900J1064o971j3949L5J4407O713j2350j2349P920J4381j392j4952
3035f569n301J3864J1896j0344j6162L392J7594L216j5157q793J0846J4135n793
3048F824j6459m15J5176O075j1275j0344N572J3328N91j3734n924J0092J0301
3061I808n387j2852q92J4113P342j1842j2877O872J4840j00j5002n911J3532J1384
3075A3028r952j4597M188J5882K054j4094q325J0483J2989n032j4000j216J2625
3088D033N696q931j0022M478J3098J008j2724o609R090J0489m592j2577j025J2913
3102D325O402j1065j0436O491J2821j463j3614m079J1617R124q319j1419L699
$$ plain form
3008 -11916 -2189 11633 7301 -9387 -10979 4258 12259 765 -10594 -4708 9684 9931 -5927
3021 -5927 -12026 874 11938 4967 -8982 -8947 5460 12173 -177 -12526 -4606 9775 8383 -6569
3035 -6569 -11870 1994 13890 3546 -12616 -9224 8370 11586 -3571 -12364 -1518 12617 6824
3048 6824 -9635 -10050 5126 11201 -74 -10418 -4846 8482 9073 -4661 -10585 -493 9808
3061 9808 4421 -8431 -9323 4790 12132 290 -12587 -5715 9125 9025 -5977 -11888 1644 13028
3075 13028 3076 -11521 -7333 8549 10603 -3491 -11816 -1333 11656 6624 -7376 -8592 4033
3088 4033 9729 798 -9224 -4746 8352 9360 -3364 -9973 -883 9606 5014 -7563 -8588 4325
3102 4325 10727 -338 -10774 -4283 8538 7075 -6539 -10618 999 10123 1804 -9615 -5916
3115e916J1706Q52j0911n762Q928R728m405j0822n05J0216N040p133q284L793
3129c475J0359J49r798l583Q411O541n572r073J619R890J818q306m763N436O022
3144E675k983p025l04O113L196m787n251K199N455M85n394l042M096M594k233
3159G94n148O74N388J679m839l464L579M468j428l753O52L783K36l188j024K764
3175A173J853j425j860J048J155m68n13O53J64j461p79J214J452j230j362K72
3191a14M25m24j130O4J097J20o39q79q92L44J646J27k099j428K569L104k388l593
3209d090J465N029O42n584j460N427L919l599n099K106O141k93n794j633N185
3224B362M386l298o049J58N649J982m400m431K166N425m42o053k865N031N162
$$ plain form
3115 -5916 5790 6642 -4269 -10031 -1103 8625 4220 -6602 -7107 3109 8149 1016 -7268 -3475
3129 -3475 6884 7033 -2765 -6348 2063 8604 3032 -6041 -4422 5468 7286 -1020 -5783 -347 5675
3144 5675 2692 -4333 -4637 1476 4672 -115 -5366 -3167 2288 2773 -2621 -5663 -1567 3027 794
3159 794 -4354 -3680 1708 3387 -1452 -4916 -1337 3131 1703 -2050 -1398 2385 2621 -567 -1591 1173
3175 1173 3026 1601 -259 789 1944 1476 963 1616 1780 319 -460 754 2206 976 -386 -114
3191 -114 311 -113 -1243 -1179 -82 38 -601 -1480 -2372 -2028 -382 -255 -2354 -3782 -1213 1891 -497 -4090
3209 -4090 -2625 2404 3046 -2538 -3998 1429 5348 1749 -3350 -1244 4897 4604 -1190 -2823 2362
3224 2362 6748 3450 -2599 -2441 3208 5190 790 -3641 -1475 3950 3508 -2545 -5410 -379 4783
3239D783l675p384L66P494L569o882o458M433P517j182q431j766Q476N640o125
3254C75p658K675R321J289q083m848O761P702k585q992j006R409N368p444q871
3269f587L642J0878J052j0600n165Q138Q433n931j0894J355J1467L007j0255q134
3283i594O098J0110j689j1466l448R142P872o147j0489J883J1633L328j1076q318
3297a2161Q482J2701k894j3958j868J3391P767j0627j1000O260J4243j77j3750
3310c591n123J2210R423p759j2590J962J3225L185j1446q021P271J0929k483j3189
3324e997l602J0531Q689o996j2509J898J2744L465j2445r071R368J2972m880j4492
3338a0325j080J5000O698j1471j1677P329J3774j285j2952l477J1962Q529p605
$$ plain form
3239 4783 1108 -6276 -5910 1584 5153 -1729 -8187 -3754 3763 2581 -5850 -7616 860 6500 375
3254 375 -7283 -4608 4713 6002 -2081 -6929 -168 7534 4949 -4043 -5049 4360 9728 2284 -6587
3269 -6587 -2945 7933 8985 -1615 -6780 1358 9791 3860 -7034 -5679 5788 8795 -1460 -9594
3283 -9594 -3496 6614 4925 -6541 -9989 -847 7025 878 -9611 -7728 3905 7233 -3843 -12161
3297 -12161 -3679 9022 6128 -7830 -9698 3693 11460 833 -10167 -3907 10336 10159 -3591
3310 -3591 -8714 3496 12919 5160 -7430 -5468 7757 10942 -504 -8525 -1254 9675 7192 -5997
3324 -5997 -9599 932 9621 2625 -9884 -7986 4758 8223 -4222 -13293 -3925 9047 4167 -10325
3338 -10325 -11405 3595 10293 -1178 -12855 -5526 8248 6963 -5989 -9466 2496 11025 3420
3351C420j1401K372J2411L820j0185p997O715J1356k024j2333l603J1009Q014
3364A1574q256j1384K810J2795K163j2510p490Q495J0063m761j2134l23J1492
3377B534N285r524r380N089J1016j21j1025m077R161Q290n186r846J309J0465
3391C990L527q783p102O414J0942j532j0831l007R463O895o780q987L095J0317
3405G621J270j0210m812O678P635l532r356p80P979M600o565p367K441Q299M40
3420D341q387n064O925P946l965r310L14R561K421p979n186O266P625k942p679
3435e113j4P676L334n430m774K599N996P98n270k527M346M110k087n432o12N213
3451B813L044m136m544K015M769k98n207k012L885L271l269m940J950M614k56
$$ plain form
3351 3420 -7981 -5609 6802 10622 437 -7560 -845 10511 8487 -3846 -7449 3560 11574
3364 11574 3318 -8066 -5256 7539 9702 -2808 -10298 -1803 8260 3499 -8635 -8958 2534
3377 2534 7819 -1705 -11085 -5996 5020 4899 -6126 -10203 -1042 7248 2062 -7784 -6475 3990
3391 3990 7517 -1266 -8368 -1954 8988 7456 -3375 -6382 3081 9976 3196 -5791 -2696 7621
3405 7621 8891 -1319 -6131 547 8182 4650 -4706 -5486 2493 7093 528 -6839 -4398 3901 4341
3420 4341 -4046 -9110 -2185 5761 1796 -7514 -7200 2361 4782 -3197 -8383 -2117 5508 2566 -5113
3435 -5113 -5127 2549 5883 453 -4321 -1722 4274 5072 -198 -2725 1621 5731 3644 -1788 -2400 2813
3451 2813 5857 1721 -2823 -808 3961 3663 -1544 -3556 329 3600 331 -4609 -2659 1955 1699
3466A699m915j554L858J858k704k183K214K345j244j951M08J862L43o32J59Q44
3482D07J90k36K83O57l65J08L72j54P7N15L19r19O8L68r4j165p07J811J036k318
3502B53k403J914K201j178l517J9L237R21l109k418K550L583j676m077m20L967
3518a53K574l451l427J963N127l07m955j716M878M008k763m956O01O091J827n367
3534b6l962M087N841j723o664j183O835L483n585n780K653O733k49o758k801N619
3550E20M667l745o336K22O266L208n682n830K887P426K11p825l527P139O557m701
3566A457q844K071J0118K054q997n552P088Q054l242r009j94Q943L635o484o688
3581e590L284Q317M36q161m518O423P297l436q997o59Q677M652p629q266M621
$$ plain form
3466 1699 -3216 -4770 -912 946 -1758 -3941 -1727 618 -626 -2577 -2169 -307 36 -596 -437 407
3482 407 597 361 644 1301 936 1044 1416 1262 1339 1854 2173 1254 1322 1690 1596 431 -276 1535 2571 253
3502 253 -2150 -236 1965 787 -2730 -2711 526 1447 -1662 -4080 -1530 2053 377 -3700 -4120 -153
3518 -153 2421 -1030 -4457 -2494 2633 2326 -2629 -4345 533 4541 1778 -3178 -2577 3514 5341 -26
3534 -26 -3988 99 5940 4217 -2447 -3630 3205 6688 1103 -4677 -2024 4709 4460 -2298 -5099 520
3550 520 5187 1442 -4894 -4672 1594 4802 -880 -6710 -3823 3603 3814 -4011 -7538 -399 6158 1457
3566 1457 -7387 -5316 4802 6856 -2141 -7693 -605 7449 4207 -4802 -4996 3947 7582 1098 -5590
3581 -5590 -2306 6011 6447 -1714 -6232 191 7488 4052 -4945 -5604 3073 7725 96 -8170 -3549
3596c549R779p2j0662m522R071P768n746j0495K075J1297K441j0451o731Q101
3610a696R450l724j0536o63J0253M760p335q034L798R689P49r047n285P668Q967
3625I014m058j1027q37J1232M999r165q700N421J1480j744j1572l185J0034P399
3639I291p321j0322K878J0766J963r825o218O680R374l258j0422j201J0133N627
3653H145p517r060L984J0864j4r902m396P934Q134n108r445Q58R823L366q718
3668a052o564N608Q733j251r571k545Q522N759n902q192K145Q738J935p976n346
3683f959N334Q126k190r091j839Q620N352o585p804L678Q965k41q640l538P512
3698G00N721m799p238J760P346J584o149m049L162N896l76o051k401M990M989
$$ plain form
3596 -3549 6230 6158 -4504 -9026 45 7813 2067 -8428 -6353 4944 7385 -3066 -9797 -1696
3610 -1696 7754 4030 -6506 -7169 3084 7844 509 -7525 -3727 5962 6711 -2336 -7621 47 9014
3625 9014 4956 -6071 -6908 4324 9323 158 -8542 -3121 8359 6615 -4957 -8142 1892 9291
3639 9291 1970 -8352 -5474 5292 7255 -2570 -8788 -2108 7266 4008 -6414 -7615 2518 8145
3653 8145 628 -8432 -4448 6416 6402 -3500 -7896 38 8172 3064 -6381 -5523 4300 7666 -1052
3668 -1052 -7616 -2008 6725 5474 -4097 -6642 1880 7639 1737 -6455 -4310 4428 6363 -1613 -6959
3683 -6959 -1625 6501 4311 -4780 -6619 2001 7353 768 -7036 -3358 5607 5366 -3274 -6812 700
3698 700 6421 1622 -5616 -3856 3490 5074 -1075 -5124 -1962 3934 3558 -2493 -4894 96 5085
3713E085k954o706L59P078K682o164n411M630O820j946p139j111O815L365n073
3728C30n363K964O352j92o030k504N052L747k639n047N64N131J276l412l624K290
3744a105L566N4l835j718K924L361j742m384K68M079J696l843l311K804L973j429
3760A358m192K52L716J100l193j980K240K131o21k128J68J595R08j136r23K66
3776d39J252N10r21j045J125R38l84j351L08J252n11q71K65J256o28j364J6J478
3794H86k23j767k71J760M20j321j277J013J438m50k212k84K440J258j751k404
3810b745J317K702J14k780j086K424K280r30l118j77L778J712l303l287K300M728
3826C929l95n192j477M972L493l790n637K314O014ko584j862N371L684m084n192
$$ plain form
3713 5085 2131 -4575 -4216 2862 5544 -620 -6031 -1401 5419 3473 -3666 -4777 2038 5403 330
3728 330 -5033 -2069 4283 4091 -1939 -4443 609 4356 1717 -3330 -2766 2365 3641 229 -3395 -1105
3744 -1105 2461 2515 -1320 -3038 -114 3247 1505 -2879 -2611 1468 3164 -679 -3990 -1186 2787 1358
3760 1358 -2834 -2582 1134 2234 -959 -2939 -699 1432 811 -1317 -1149 446 1354 218 -705 -439
3776 -439 813 1323 402 -643 482 1420 1036 -315 -7 1245 734 -137 128 1384 756 -608 -592 886
3794 886 663 -1104 -1375 385 805 -516 -1793 -780 658 208 -2004 -2288 152 1410 -341 -2745
3810 -2745 -1428 1274 1388 -1392 -2478 -54 2226 1296 -1822 -1999 1779 3491 188 -3099 -799 3929
3826 3929 3534 -1658 -3135 1837 5330 1540 -4097 -1783 4231 4229 -2355 -4217 1154 4838 754 -4438
3842d438J362N451R56n054l185L107M824p28n742k244N227M769l544o236J378
3857d097P195K200p546m314O048P245l308q101O1Q194L572o625o073M356P618
3872F425j251q084j932P172M694m972p545K021P875J081p157m314M686O616j956
3887C359p861j895P477M687n608p548K605Q784J055q565m687P100P645m781q665
3902f898J263R010L528p614o279N014Q454j540p940k674P479O360m971q221J271
3917c758R282K381q286o331O136Q559k527j0012j495R186M172p451p232L473Q938
3932E035J47r250l906O948O831m168q538J38R182L718p620o975M993R252j202
$$ plain form
3842 -4438 -3076 2375 3331 -1723 -4908 -1801 3023 2295 -3447 -5691 -464 4305 761 -5475 -4097
3857 -4097 3098 5298 -2248 -6562 -514 6731 3423 -4678 -4617 3577 7149 524 -5549 -1193 6425
3872 6425 5174 -2910 -4842 2330 7024 2052 -5493 -3472 4403 5484 -1673 -5987 -1301 5315 3359
3887 3359 -4502 -6397 1080 5767 159 -7389 -4784 4000 5055 -3510 -8197 -1097 6548 1767 -6898
3902 -6898 -5635 3375 6903 -711 -6990 -1976 6478 4938 -3002 -5676 1803 8163 3192 -5029 -3758
3917 -3758 5524 7905 -381 -6712 -576 7983 5456 -4556 -6051 3135 7307 -144 -7376 -3903 5035
3932 5035 5182 -4068 -7974 -1026 5805 1637 -6901 -6763 2419 6137 -1483 -8458 -3465 5787 4585
$$ [...]
8191H86
##END NTUPLES=NMR FID
##END=
