##TITLE=1H_LY-8Dix.4.B
 CD3CN, 8 sc, 
 13.05.2021
##JCAMPDX= 6.0         $$ Bruker NMR JCAMP-DX V2.0
##DATA TYPE= NMR FID
##DATA CLASS= NTUPLES
##ORIGIN= UXNMR, Bruker Analytische Messtechnik GmbH
##OWNER= root
$$ XWIN-NMR		Version 3.5
$$ Thu May 13 09:46:04 2021 Russian Standard Time (UT+4h)  she@DPX200
##.OBSERVE FREQUENCY= 200.131506
##.OBSERVE NUCLEUS= ^1H
##.DELAY= (6, 6)
##.ACQUISITION MODE= SIMULTANEOUS
##.ACQUISITION SCHEME= undefined
##.AVERAGES= 8
##.DIGITISER RES= 18
##SPECTROMETER/DATA SYSTEM= spect
##.PULSE SEQUENCE= zg30
##.SOLVENT NAME= CD3CN
##.SHIFT REFERENCE= (INTERNAL, CD3CN, 0, 15.7039)
##AUDIT TRAIL= $$ (NUMBER, WHEN, WHO, WHERE, WHAT)
$$ ##TITLE= Audit trail, XWIN-NMR		Version 3.5
$$ ##JCAMPDX= 5.01
$$ ##ORIGIN= Bruker BioSpin GmbH
$$ ##OWNER= she
$$ F:/spectra/data/she/nmr/H-F/1/audita.txt
$$ ##AUDIT TRAIL=  $$ (NUMBER, WHEN, WHO, WHERE, WHAT)
(   1,<2021-05-13 09:45:10.51 +0400>,<she>,<DPX200>,
      <created by zg, POWCHK disabled, PULCHK disabled
       configuration hash MD5:
       00 E9 B6 7A A2 85 ED C7 34 08 36 98 17 FE 4E 26
       data hash MD5: 16K
       2B 86 E7 CA D3 97 60 EE 42 9D A9 EF EC 9B 1C 39>)
$$ ##END=
$$ 
$$ hash MD5
$$ 5E 0F 05 C0 6F E7 11 B5 47 3A 35 36 B5 B5 8F 0E
##$RELAX= 
##$RELAX= 
##$RELAX= 
##$RELAX= 
##$RELAX= 
##$RELAX= 
$$ Bruker specific parameters
$$ --------------------------
##$DU= <F:/spectra>
##$EXPNO= 1
##$NAME= <H-F>
##$PROCNO= 1
##$TYPE= <nmr>
##$USER= <she>
##$AMP= (0..31)
100 100 100 100 100 100 100 100 100 100 100 100 100 100 100 100 100 100 
100 100 100 100 100 100 100 100 100 100 100 100 100 100 
##$AQSEQ= 0
##$AQ_mod= 1
##$AUNM= <au_zg>
##$AUTOPOS= <>
##$BF1= 200.13
##$BF2= 200.13
##$BF3= 200.13
##$BF4= 200.13
##$BF5= 200.13
##$BF6= 200.13
##$BF7= 200.13
##$BF8= 200.13
##$BYTORDA= 1
##$CFDGTYP= 0
##$CFRGTYP= 5
##$CHEMSTR= <none>
##$CNST= (0..31)
1 1 145 1 1 1 1 1 1 1 1 1 1 1 1 1 1 1 1 1 1 1 1 1 1 1 1 1 1 1 1 1 
##$CPDPRG= <>
##$CPDPRG1= <>
##$CPDPRG2= <>
##$CPDPRG3= <>
##$CPDPRG4= <mlev>
##$CPDPRG5= <mlev>
##$CPDPRG6= <mlev>
##$CPDPRG7= <mlev>
##$CPDPRG8= <mlev>
##$CPDPRGB= <>
##$CPDPRGT= <>
##$D= (0..31)
0 1.2 0 0 0 0 0 0 0 0.06 0 0.03 0 0 0 0 0.0002 0 0 0 0 0 0 0 0 0 0 0 0 
0 0 0 
##$DATE= 1620884710
##$DBL= (0..7)
120 120 120 120 120 120 120 120 
##$DBP= (0..7)
150 150 150 150 150 150 150 150 
##$DBP07= 0
##$DBPNAM0= <>
##$DBPNAM1= <>
##$DBPNAM2= <>
##$DBPNAM3= <>
##$DBPNAM4= <>
##$DBPNAM5= <>
##$DBPNAM6= <>
##$DBPNAM7= <>
##$DBPOAL= (0..7)
0.5 0.5 0.5 0.5 0.5 0.5 0.5 0.5 
##$DBPOFFS= (0..7)
0 0 0 0 0 0 0 0 
##$DE= 6
##$DECBNUC= <off>
##$DECIM= 32
##$DECNUC= <off>
##$DECSTAT= 4
##$DIGMOD= 1
##$DIGTYP= 9
##$DL= (0..7)
0 120 120 120 120 120 120 120 
##$DP= (0..7)
150 150 150 150 150 150 150 150 
##$DP07= 0
##$DPNAME0= <>
##$DPNAME1= <>
##$DPNAME2= <>
##$DPNAME3= <>
##$DPNAME4= <>
##$DPNAME5= <>
##$DPNAME6= <>
##$DPNAME7= <>
##$DPOAL= (0..7)
0.5 0.5 0.5 0.5 0.5 0.5 0.5 0.5 
##$DPOFFS= (0..7)
0 0 0 0 0 0 0 0 
##$DQDMODE= 0
##$DR= 18
##$DS= 0
##$DSLIST= <SSSSSSSSSSSSSSS>
$$ [...]
##$SUBNAM2= <"">
##$SUBNAM3= <"">
##$SUBNAM4= <"">
##$SUBNAM5= <"">
##$SUBNAM6= <"">
##$SUBNAM7= <"">
##$SUBNAM8= <"">
##$SUBNAM9= <"">
##$SW= 16.9725357007746
##$SWIBOX= (0..15)
0 0 2 0 0 0 0 0 0 0 0 0 0 0 0 0 
##$SW_h= 3396.73913043478
##$TD= 16384
##$TD0= 1
##$TE= 0
##$TE2= 300
##$TE3= 300
##$TEG= 300
##$TL= (0..7)
0 120 120 120 120 120 120 120 
##$TP= (0..7)
150 150 150 150 150 150 150 150 
##$TP07= 0
##$TPNAME0= <>
##$TPNAME1= <>
##$TPNAME2= <>
##$TPNAME3= <>
##$TPNAME4= <>
##$TPNAME5= <>
##$TPNAME6= <>
##$TPNAME7= <>
##$TPOAL= (0..7)
0.5 0.5 0.5 0.5 0.5 0.5 0.5 0.5 
##$TPOFFS= (0..7)
0 0 0 0 0 0 0 0 
##$TUNHIN= 0
##$TUNHOUT= 0
##$TUNXOUT= 0
##$USERA1= <user>
##$USERA2= <user>
##$USERA3= <user>
##$USERA4= <user>
##$USERA5= <user>
##$V9= 5
##$VALIST= <valist>
##$VCLIST= <CCCCCCCCCCCCCCC>
##$VD= 0
##$VDLIST= <DDDDDDDDDDDDDDD>
##$VPLIST= <PPPPPPPPPPPPPPP>
##$VTLIST= <TTTTTTTTTTTTTTT>
##$WBST= 1024
##$WBSW= 4
##$XGAIN= (0..3)
0 0 0 0 
##$XL= 0
##$YL= 0
##$YMAX_a= 686304
##$YMIN_a= -635518
##$ZGOPTNS= <>
##$ZL1= 120
##$ZL2= 120
##$ZL3= 120
##$ZL4= 120
##$ABSF1= 10
##$ABSF2= 0
##$ABSG= 5
##$ABSL= 3
##$ALPHA= 0
##$AQORDER= 0
##$ASSFAC= 0
##$ASSFACI= 0
##$ASSFACX= 0
##$ASSWID= 0
##$AUNMP= <proc_1d>
##$AZFE= 0.1
##$AZFW= 0.1
##$BCFW= 1
##$BC_mod= 2
##$BYTORDP= 1
##$COROFFS= 0
##$CY= 11.3945322036743
##$DATMOD= 1
##$DC= 2
##$DFILT= <>
##$DTYPP= 0
##$F1P= 15.9154993809931
##$F2P= -4.1035820241983
##$FCOR= 0.5
##$FTSIZE= 0
##$FT_mod= 4
##$GAMMA= 1
##$GB= 0.15
##$INTBC= 1
##$INTSCL= 1
##$ISEN= 128
##$LB= 0.24
##$LEV0= 0
##$LPBIN= 0
##$MAXI= 10000
##$MC2= 0
##$MEAN= 0
##$ME_mod= 0
##$MI= 1.114404
##$NCOEF= 0
##$NC_proc= 0
##$NLEV= 6
##$NOISF1= 3.799351
##$NOISF2= 2.8
##$NSP= 1
##$NTH_PI= 0
##$NZP= 0
##$OFFSET= 15.70392
##$PC= 1
##$PHC0= -11120.13
##$PHC1= 9.801003
##$PH_mod= 1
##$PKNL= yes
##$PPARMOD= 0
##$PSCAL= 0
##$PSIGN= 0
##$REVERSE= no
##$SF= 200.130013532006
##$SI= 16384
##$SIGF1= 3
##$SIGF2= 2
##$SINO= 400
##$SIOLD= 16384
##$SREGLST= <1H.CDCl3>
##$SSB= 0
##$STSI= 0
##$STSR= 0
##$SW_p= 3612.71676300578
##$SYMM= 0
##$S_DEV= 0
##$TDeff= 0
##$TDoff= 0
##$TI= <>
##$TILT= no
##$TM1= 0
##$TM2= 0
##$TOPLEV= 0
##$USERP1= <user>
##$USERP2= <user>
##$USERP3= <user>
##$USERP4= <user>
##$USERP5= <user>
##$WDW= 1
##$XDIM= 8192
##$YMAX_p= 0
##$YMIN_p= 0
$$ End of Bruker specific parameters
$$ ---------------------------------
##NTUPLES= NMR FID
##VAR_NAME=  TIME,          FID/REAL,        FID/IMAG
##SYMBOL=    X,             R,               I
##VAR_TYPE=  INDEPENDENT,   DEPENDENT,       DEPENDENT
##VAR_FORM=  AFFN,          ASDF,            ASDF
##VAR_DIM=   8192,          8192,            8192
##UNITS=     SECONDS,       ARBITRARY UNITS, ARBITRARY UNITS
##FACTOR=    0.0002944,     1,               1
##FIRST=     0,             0,               0
##LAST=      2.4114304,     0,               0
##MIN=       0,             -635518,         0
##MAX=       2.4114304,     686304,          0
$$ Real data points
##PAGE= N=1
##DATA TABLE= (X++(R..R)), XYDATA
$$ [...]
$$ plain form
3383 7992 3650 -5737 -6058 2748 6885 -1176 -9567 -5244 5610 5590 -6015 -10055 -299 7127 252
3398 252 -9633 -6152 4390 5642 -3527 -8121 -979 6682 3666 -4865 -5702 2471 7701 2083 -5314
3413 -5314 -2368 6543 7306 -1521 -5587 1669 8613 3877 -4246 -2975 4881 6740 -169 -5384 -567
3428 -567 5518 3581 -3414 -5264 808 4969 301 -6274 -4591 2040 2775 -3597 -6295 -1130 3342
3443 3342 247 -5261 -4750 819 3046 -1022 -4435 -1773 3124 2886 -1475 -2870 1591 4710 1412
3458 1412 -2115 46 4244 3924 -272 -1093 1973 3029 963 -126 820 1599 1397 291 -388 -528 239
3475 239 446 -273 -1564 -1368 89 -518 -2208 -1798 -552 -931 -2355 -2116 -531 -614 -1712 -1267 128 -188
3493 -188 -1995 -1364 900 1572 -426 -1374 746 2330 1537 -833 -423 2515 3315 282 -1613 1323 3966
$$ packed form
3383G992m342r387l21Q806M137q061q391M323J0854k0j1605m040R756P426o875
3398B52r885L481J0542J252r169m594P142P661l016q531q37Q173N230n618p397
3413e314K946Q911P63q827m066P256O944m736q123J271P856J859o909n215M817
3428e67O085j937o995j850O072M161m668o575J683O631P35o372k698N165M472
3443C342l095n508N11N569K227m068l413K662M897k38m361j395M461L119l298
3458A412l527K161M198l20m196q21L066J056k066j089R46P79k02j106o79j40P67
3475B39K07p19j291J96J457o07j690M10J246l79j424K39J585q3j098M45J395l16
3493a88j807O31K264O72j998r48K120J584p93k370M10K938Q00l033j895K936K643
$$ plain form
3510 3966 2733 -1376 -1611 2409 3539 204 -2475 -108 2795 1845 -1971 -3263 108 2355 278
3525 278 -3769 -3430 558 2493 -1657 -5435 -2332 3014 1601 -4591 -4875 1207 4580 -308 -5506 -2522
3541 -2522 3865 3672 -1875 -3830 1152 5506 2812 -2872 -2692 3232 6471 1188 -4731 -1428 5671
3556 5671 5303 -2558 -5107 1555 6661 1573 -5669 -3478 3896 5054 -2200 -6695 -1600 4641 2813
3571 2813 -4772 -6098 903 5774 213 -7117 -4245 4260 5085 -3189 -7646 -643 6655 2783 -5565
3586 -5565 -5396 3327 7237 7 -7000 -2334 6918 6361 -3350 -6562 1998 8507 2720 -6320 -3914
3601 -3914 6246 7347 -1872 -7131 -547 7232 3912 -5260 -6407 2104 6846 819 -7188 -4805 4711
3616 4711 6233 -3466 -8986 -1450 8232 3280 -7876 -7401 4192 8052 -1640 -9069 -2311 7504 5428
$$ packed form
3510C966j233m109k35M020J130l335k679K367K903r50l816j292L371K247k077
3525B78m047L39L988J935m150l778L103N346j413o192k84O082L373m888n198K984
3541b522O387j93n547j955M982M354k694n684J80N924L239n283n919L303P099
3556E671l68p861k549O662N106n088p242K191P374J158p254m495N095O241j828
3571B813p585j326P001M871n561p330K872Q505Q25q274m457P003P298l872q348
3586e565J69Q723L910p230p007M666R252n57r711l212Q560O509n787r040K406
3601c914J0160J101r219n259O584P779l320r172j147Q511M742o027q007K383R516
3616D711J522r699n520P536R682m952j1156M75J1593L860r692p429O758R815k076
$$ plain form
3631 5428 -5238 -7318 2359 8390 1812 -6913 -4459 5203 7474 -1781 -7235 -675 8225 4581 -5459
3646 -5459 -6274 3185 8119 732 -7067 -3594 5602 5954 -2915 -7689 -280 7555 3403 -6386 -6316 3950
3662 3950 7174 -1438 -8220 -2576 6489 4646 -5047 -6857 1845 6850 1270 -6367 -4536 4408 6151
3677 6151 -1366 -6850 -1652 6457 4375 -4769 -6226 2685 7299 710 -6621 -2750 5570 5162 -2978
3692 -2978 -5761 658 6032 2465 -4194 -4195 2472 5535 -272 -5604 -2744 4564 4597 -2888 -5993 661
3708 661 6188 1886 -5728 -4020 4022 5238 -1720 -5612 -514 5275 3068 -3904 -4039 1803 5518
3723 5518 113 -5050 -2489 3937 3449 -2242 -4605 235 4126 1152 -3655 -2729 1807 3369 -354
3738 -354 -4010 -1611 2841 3264 -1661 -3676 390 4307 1397 -3569 -2245 2956 3837 -1572 -3728 635
$$ packed form
3631E428j0666k080R677O031o578q725K454R662K271r255n454O560Q900l644j0040
3646e459q15R459M934p387p799L473R196L52q869m774P409P835m152r789P0J0266
3662C950L224q612o782N644R065j843r693j810Q702N005n580p637J831Q944J743
3677F151p517n484N198Q109k082r144j457Q911M614o589p331L871Q320m08q140
3692b978k783O419N374l567o659jO667L063n807n332K860P308L3p485l105O654
3708F61N527m302p614J708Q042J216o958l892N098N789k207o972j35N842L715
3723E518n405n163K561O426m88n691k363M840L891k974m807R26M536J562l723
3738c54l656K399M452M23m925k015M066L917k910m966J324N201Q81n409k156M363
$$ plain form
3754 635 3668 1120 -2607 -1280 2251 2168 -473 -1864 -571 1677 1098 -1073 -1566 62 1304 -92
3770 -92 -1700 -1286 496 835 -1143 -1665 -310 786 -181 -1142 -604 395 61 -929 -652 120 471 -246 -160
3789 -160 388 801 51 -394 275 1490 674 -623 -8 1469 1521 -488 -1265 844 2505 557 -1768 -148
3807 -148 2301 1862 -973 -1986 279 2198 121 -2426 -2034 864 2121 -847 -3741 -1785 2268 1368
3823 1368 -3249 -4102 910 3307 -734 -4428 -1710 3317 2330 -2242 -3160 1178 4191 1625 -2515 -2078
3839 -2078 2595 4276 605 -3528 -677 4768 4231 -1937 -4093 1716 5543 1225 -4782 -2669 4271
3854 4271 4530 -2941 -5522 -163 5126 1903 -4952 -4897 1963 4446 -1298 -6397 -2444 4164 2857 -3949
3870 -3949 -6070 445 5245 1104 -5225 -3756 3138 4976 -859 -5395 -1198 5734 4672 -3091 -4997
$$ packed form
3754F35L033k548l727J327L531q3k641j391J293K248n79k171m93J628J242j396
3770i2j608M14J782L39j978n22J355J096r67r61N38R99l34r90K77P72L51p17Q6
3789a60N48M13p50m45O69J215q16j297O15J477N2k009p77K109J661j948k325J620
3807a48K449m39k835j013K265J919k077k547L92K898J257k968k894J956M053r00
3823A368m617q53N012K397m041l694K718N027r87m572r18M338L013k566m140M37
3839b078M673J681l671m133K851N445n37o168k156N809L827m318o007K113O940
3854D271K59p471k581N359N289l223o855N5O860K483n744n099L953O608j307o806
3870c949k121O515M800m141o329J469O894J838n835m536M197O932j062p763j906
$$ plain form
3885 -4997 2334 7384 2175 -5572 -3136 6399 6715 -2347 -5965 1342 7317 2691 -5614 -4735 3582
3900 3582 6234 -906 -6324 -2578 4709 4031 -4346 -7506 -192 6104 857 -7282 -5651 3627 5675
3915 5675 -2298 -8169 -1987 6104 3495 -5016 -5673 2531 6964 1236 -5914 -3011 6188 6943 -1895
3930 -1895 -5799 1214 8134 4006 -4877 -4588 4698 7708 -309 -6490 -1169 6415 4966 -4047 -6821
3945 -6821 1004 6513 1011 -7058 -4775 4053 5450 -3373 -8342 -1648 5802 2139 -6452 -5974 1848
3960 1848 5187 -642 -6548 -2884 4580 4110 -2693 -5633 -2 6035 3049 -4277 -4317 4136 7090 376
3976 376 -5155 -446 7062 5069 -2863 -4631 3242 6797 1031 -4543 -2235 4012 4820 -1668 -5374
3991 -5374 -687 4294 1546 -4335 -4756 711 3566 -461 -5931 -3618 2466 2106 -3100 -5265 -784
$$ packed form
3885d997P331N050n209p747K436R535L16r062l618P307N975m626q305Q79Q317
3900C582K652p140n418L746P287o78q377l160P314O296n247q139J631R278K048
3915E675p973n871O182Q091k609q511o57Q204M433n728p150K903R199P55q838
3930a895l904P013O920m128q883K89R286L010q017o181N321P584j449r013k774
3945f821P825N509n502q069K283Q828J397q823m969O694P450l663q591M78P822
3960A848L339n829n906L664P464m70o803k940N631O037k986p326m0Q453K954o714
3976C76n531M709P508j993p932j768P873L555n766n574K308O247Q08o488l706
3991e374M687M981k748n881m21N467K855m027n470K313O084l60n206k165M481
$$ plain form
4006 -784 3460 1626 -4181 -3942 2087 4233 -34 -4040 -1397 4275 4185 -1561 -3192 2191 5204 1266
4022 1266 -2699 -737 3802 4245 -332 -2728 645 3559 2040 -1238 -2397 356 3009 481 -3537
4037 -3537 -2436 1564 1991 -1864 -4105 -1269 2045 199 -3836 -3135 699 952 -1608 -2991 -1621 1218
4053 1218 1378 -1713 -2143 481 1595 970 -809 -724 1788 2912 305 -1068 1540 2879 1626 29
4069 29 -39 1598 2355 757 -298 893 1390 379 86 -258 133 579 -325 -1249 -627 -544 -1317 -1306 -752 -796
4089 -796 -1247 -1682 -1013 -128 -614 -2046 -964 507 -629 -853 -684 -142 710 683 -541 -410 1142 1788
4107 1788 1095 -297 -143 2657 3242 -447 -1833 1843 3873 780 -2183 -813 3162 2969 -1528 -3092
4123 -3092 1120 2735 -232 -3041 -2063 1294 2275 -1430 -4325 -1634 2325 830 -3075 -3731 -61 3142
$$ packed form
4006g84M244j834n807K39O029K146m267m006K643N672r0n746j631N383L013l938
4022A266l965J962M539M43m577k396L373K914j519l278j159K753K653k528m018
4037c537J101M000M27l855k241K836L314j846m035P01L834K53k560j383J370K839
4053A218J60l091m30K624J114o25j779Q5K512J124k607j373K608J339j253j597
4069B9o8J637P57j598j055J191M97j011k93l44L91M46r04r24O22Q3p73J1N54m4
4089g96m51m35O69Q85m86j432J082J471j136k24J69N42Q52k7j224J31J552O46
4107A788o93j392J54K800N85l689j386L676K030l093k963J370L975j93m497j564
4123c092M212J615k967k809R78L357R81l705k895K691L959j495l905o56L670L203
$$ plain form
4139 3142 -102 -4820 -2560 2810 2245 -2273 -4068 -142 4311 2232 -3267 -3003 3121 4983 181
4154 181 -3733 -520 5459 4742 -2397 -4044 2643 5812 883 -4099 -1682 3868 4439 -2025 -4785 -5
4170 -5 4221 1328 -4250 -4851 830 4745 -325 -6339 -3168 3968 2593 -3840 -6219 -227 5210 1186
4186 1186 -5833 -3608 3576 4606 -1288 -5057 -1157 5048 4142 -2777 -4281 2299 6024 1904 -4449
4201 -4449 -3276 4703 6392 -1616 -5558 847 6695 3089 -4512 -4528 2878 6414 -505 -6414 -1908
4216 -1908 4781 3905 -3227 -6289 -253 5422 921 -6151 -4176 3485 4706 -1853 -6412 -2284 5032
4231 5032 3558 -4169 -5269 1446 5560 1334 -5294 -3799 4582 5995 -2009 -5950 726 7236 3777
4246 3777 -4280 -4535 3870 6687 -891 -5674 -716 5625 3890 -2989 -5254 802 5572 1155 -5339
$$ packed form
4139C142l244m718K260N370n65m518j795L926M453k079n499K64O124J862m802
4154A81l914L213N979p17p139j647O687L169m929m982K417N550N71o464k760M780
4170eM226k893n578o01N681L915n070o014L171P136j375o433k379N992N437m024
4186A186p019K225P184J030n894l769L900O205r06o919j504O580L725m120o353
4201d449J173P979J689q008l942O405N848l606p601j6P406L536o919n909M506
4216a908O689q76p132l062O036N675m501p072J975P661J221o559m559M128P316
4231E032j474p727j100O715M114m226o628J495Q381J413q004l941O676O510l459
4246C777q057k55Q405K817p578m783M958O341j735o879k265O056M770m417o494
$$ plain form
4261 -5339 -3462 3090 4461 -1361 -6307 -2062 5006 2817 -4637 -5360 1536 5229 312 -5592 -3126
4276 -3126 4112 3792 -2960 -5101 548 5121 2411 -3755 -3831 2901 4871 -458 -4684 -734 4372 3291
4292 3291 -2077 -3675 1392 4574 885 -3906 -2169 2868 3496 -662 -4155 -805 4103 2027 -3081
4307 -3081 -3481 1420 3733 329 -4165 -2036 2921 2205 -2194 -3182 -118 2201 845 -2621 -2506 1429
4323 1429 2914 -271 -2964 -1350 1897 2909 -903 -2953 373 3318 435 -2489 -1247 1986 2642
4338 2642 -463 -2157 104 2169 1272 -1388 -1361 291 1578 707 -1615 -1411 1214 1431 -929 -1822 -697
4355 -697 1319 961 -1079 -1437 709 1389 -200 -1371 -633 740 1202 -439 -1448 222 1501 365
4371 365 -1181 -777 455 654 -627 -686 510 591 -572 -439 177 -467 -501 59 304 -56 -487 -117 442
$$ packed form
4261e339J877O552J371n822m946M245P068k189p454p23O896L693m917n904K466
4276c126P238l20o752k141N649M573k710o166p6O732J970n329m226L950N106j081
4292C291n368j598N067L182l689m791J737N037O28m158l493L350M908k076n108
4307c081m00M901K313l404m494K129M957p16m399r88L064K319j356l466J15L935
4323A429J485l185k693J614L247J012l812k050L326K945k883k924J242L233O56
4338B642l105j694K261K065q97k660K7J652J287q71k322K04K625K17k360q93J125
4355f97K016l58k040l58K146O80j589j171P38J373M62j641j009J670J279j136
4371C65j546M04J232J99j281n9J196Q1j163J33O16o44l4N60K45l60m31L70N59
$$ plain form
4390 442 369 -654 -466 524 258 -251 207 -112 35 522 388 -419 -511 482 1348 661 -1108 -709 1539 1508
4410 1508 -1052 -1367 670 1646 352 -1999 -1229 1156 1832 -851 -2364 -378 1943 1291 -2013 -2640
4426 -2640 757 2814 -605 -3102 -1447 2489 2091 -1556 -2939 510 3230 868 -2950 -2063 2002
4441 2002 2997 -614 -3302 -202 4149 2811 -2589 -2690 1824 4501 566 -3561 -1182 4266 2873
4456 2873 -2402 -3898 85 3603 1968 -3126 -3199 2153 4112 -788 -5298 -2522 4039 3254 -3636 -5348
4472 -5348 1378 4929 -93 -5318 -2872 3363 4075 -2403 -5131 -134 4700 2059 -4219 -2956 2686
4487 2686 4984 4 -4133 -1464 3796 3926 -1805 -4744 805 6043 1972 -4123 -2815 3497 5040
4502 5040 -592 -5530 -854 4948 2810 -3021 -5480 1518 5333 229 -5115 -3247 3626 3759 -3864
$$ packed form
4390D42p3j023J88R90k66n09M58l19J47M87j34q07r2R93Q66o87j769L99K248l1
4410A508k560l15K037R76j294k351P70K385O76k683j513J986K321o52l304o27
4426b640L397K057l419k497J655L936l98l647j383L449K720k362l818Q87M065
4441B002R95l611k688L100M351j338n400j01M514K677l935m127K379N448j393
4456B873n275j496L983L518j635n094p3N352J959m900m510K776O561p85o890j712
4472e348O726L551n022n225K446O235P12o478k728M997M834k641o278J263N642
4487B686K298m980m137K669N260J30n731k939N549N238m071o095J308O312J543
4502E040n632m938M676N802k138n831k459O998L815n104n344J868O873J33p623
$$ plain form
4517 -3864 -6080 -396 5133 1496 -4286 -3065 2605 4737 -254 -4271 -1754 4393 3646 -2438 -4815
4532 -4815 790 5694 2973 -3961 -2688 4983 5877 -1042 -4690 -109 5366 3491 -3220 -4339 2086
4547 2086 5132 68 -4555 -2690 3154 4032 -2473 -5770 -737 4412 1418 -5368 -4769 1975 4168
4562 4168 -1321 -5732 -1873 3604 2713 -3156 -4757 557 4661 1235 -4003 -2698 3406 4655 -1007
4577 -1007 -3997 440 5052 2770 -2689 -2795 2840 4806 750 -3365 -1352 3734 3577 -1263 -3639
4592 -3639 226 4156 1481 -3500 -3364 1778 3294 -1211 -4845 -1788 2912 1228 -3312 -3467 712
4607 712 2609 -996 -3841 -1784 1597 1626 -1231 -2692 -638 2122 1654 -1433 -2176 1274 3310 1110
4623 1110 -2001 -563 2956 2941 -374 -1495 919 2985 1432 -1037 -445 1727 2769 172 -1721 -900
$$ packed form
4517c864k216N684N529l637n782J221N670K132m991m017K517O147p47o084k377
4532d815N605M904k721o934J273P671Q94o919l648M581N475j875o711j119O425
4547B086L046n064m623J865N844Q78o505l297N033N149k994o786N99O744K193
4562D168n489m411L859N477q91n869j601N314M104l426n238J305O104J249n662
4577a007k990M437M612k282n459j06N635J966m056m115K013N086j57m840k376
4592c639L865L930k675m981J36N142J516m505l634L057M700j684m540j55M179
4607G12J897l605k845K057L381K9k857j461K054K760m68l087p43L450K036k200
4623A110l111J438L519j5l315j121K414K066j553k469N92K172J042k597j893Q21
$$ plain form
4639 -900 1366 667 -1114 -1838 -26 528 -592 -2005 -1272 -305 -197 -1467 -1622 -1179 -279 60 -626 -1477
4657 -1477 -688 412 371 -481 -883 648 1446 166 -363 506 1453 1061 523 573 1060 1027 799 1113 954 392
4677 392 922 933 738 -157 354 522 777 -64 -917 -395 -125 -338 -717 -1135 -1084 -441 -549 -841 -1815 -1046 81
4698 81 -290 -1654 -1673 -67 857 -714 -1726 -173 1316 1134 -583 -762 677 2037 1236 -640 -95
4715 -95 2342 2757 510 -916 195 2727 1807 -485 -1125 1111 2428 580 -2089 -1560 1511 2107 -1072
4732 -1072 -3266 -1240 2050 816 -3132 -3425 345 2472 -1066 -4385 -1695 2256 1645 -2762 -3193 493
4748 493 3042 432 -2801 -1859 2166 3279 162 -2856 -330 3895 3352 -1470 -2936 1761 5068 1677
4764 1677 -3555 -1528 4092 4214 -1621 -3819 503 4683 1739 -3826 -3426 1922 3863 -1022 -5117
$$ packed form
4639i00K266o99j781p24J812N54j120j413P33R67J08j270j55M43R00L39o86q51
4657a477P89J100m1q52m02J531P98j280n29Q69R47l92n38N0M87l3k28L14j59n62
4677C92N30J1j95q95N11J68K55q41q53N22K70k13l79m18N1O43j08k92r74P69J127
4698H1l71j364j9J606R24j571j012J553J489j82j717j79J439J360q01j876N45
4715i5K437M15k247j426J111K532r20k292o40K236J317j848k669N29L071N96l179
4732a072k194K026L290j234l948k93L770K127l538l319K690L951o11m407m31L686
4748D93K549k610l233R42M025J113l117l018K526M225n43m822j466M697L307l391
4764A677n232K027N620J22n835k198M322M180k944n565M00N348J941m885m095
$$ plain form
4779 -5117 -2100 3270 2307 -3532 -5116 85 4047 133 -4986 -3295 2536 3499 -1776 -4583 -841
4794 -841 4449 2629 -3444 -3785 1738 5245 1010 -4244 -1657 4977 4775 -1788 -4101 1336 5685 2117
4810 2117 -3582 -2575 3423 4653 -564 -4520 -923 4143 2800 -2937 -4700 776 4616 544 -5215
4825 -5215 -3642 2779 3750 -2628 -5847 -930 4501 1701 -4618 -4179 1760 4023 -423 -4853 -1747
4840 -1747 3662 3520 -1886 -4093 793 5137 2316 -3450 -2833 3190 5242 -224 -4254 -444 4953
4855 4953 3543 -2523 -3585 1489 4958 714 -4092 -2280 3213 4028 -1827 -4885 -553 4146 1501
4870 1501 -4483 -3681 1574 3449 -850 -4671 -2131 2885 2050 -2379 -4017 -71 3223 1522 -3192
4885 -3192 -2881 2017 4038 -363 -4098 -833 4183 3265 -2613 -2923 1981 4119 343 -3065 -779 3263
$$ packed form
4779e117L017N370r63n839j584N201L962l914n119J691N831R63n275k807L742
4794h41N290j820o073l41N523L507m235n254K587O634k02o563k313N437M349l568
4810B117n699J007N998J230n217l956L597N066j343n737j763N476L840m072n759
4825e215J573O421R71o378l219M917N431k800o319M39N939K263m446m430L106
4840a747N409j42n406k207M886M344k821n766O17O023K052n466m030L810N397
4855D953j410o066j062N074L469m244m806J812N493Q15n855l058M332M699k645
4870A501n984Q02N255J875m299l821K540N016q35m429j638L946L294j701m714
4885c192L11M898K021m401l735L265N016r18n878l10M904K138l776l408K286M042
$$ plain form
4901 3263 2676 -1273 -2956 662 2966 1251 -2692 -2527 1111 2640 -453 -3250 -1248 2051 1268 -2209
4917 -2209 -2713 113 2250 32 -2637 -1622 1217 1728 -647 -2517 -461 1762 1198 -1449 -1630 873
4933 873 2060 59 -1681 -222 1581 1283 -497 -935 597 1481 552 -753 -625 763 1258 151 -771
4950 -771 -363 925 737 -336 -788 271 750 -101 -1014 -277 358 -98 -632 -594 -48 -384 -340 -11 58 -430
4970 -430 -449 165 50 -230 -504 461 535 41 -241 77 265 407 394 209 -144 117 659 567 -454 -143 891
4991 891 949 -517 -1218 -252 1298 358 -634 -1141 324 1051 -134 -1483 -643 1121 974 -906 -1812 233
5009 233 1690 436 -1535 -952 878 1202 -423 -1388 -625 1158 840 -849 -1476 106 1703 579 -1738
5026 -1738 -1768 1283 2551 -324 -2672 -491 2582 1553 -2288 -2307 1264 2866 27 -2428 -999 2029
$$ packed form
4901C263n87l949j683L618K304j715l943J65L638J529l093k797K002L299p83l477
4917b209n04K826K137k218k669J015K839N11k375j870K056K223n64k647j81K503
4933H73J187k001j740J459J803k98j780m38J532Q84r29j305J28J388M95j107r22
4950g71M08J288j88j073m52J059M79q51r13P37O35m56n34L8N46l36M4L29O9m88
4970d30j9O14j15k80k74R65P4m94k82L18J88J42j3j85l53K61N42r2j021L11J034
4991H91N8j466p01R66J550r40r92n07J465P27j185j349Q40J764j47j880r06K045
5009B33J457j254j971N83J830L24j625r65P63J783l18j689o27J582J597j124k317
5026a738l0L051J268k875k348K181L073j029l841j9L571J602k839k455J429L028
$$ plain form
5042 2029 1990 -1108 -2328 159 2811 1323 -1833 -2445 1054 3233 218 -3137 -1175 2711 2570 -1567
5058 -1567 -3189 507 3132 1108 -2983 -2049 2228 3347 -489 -3731 -928 3051 2212 -2645 -3740
5073 -3740 1245 3965 122 -4029 -2105 2776 2793 -2059 -4252 -239 3367 1673 -3080 -2947 1813 3995
5089 3995 -365 -4379 -1582 3998 3562 -2054 -4021 1073 4676 906 -3854 -2070 3382 3896 -1138
5104 -1138 -4033 75 3976 2252 -2832 -3537 1065 3689 611 -4321 -2496 3057 3426 -2334 -4948
5119 -4948 -264 4239 1445 -4245 -3412 2529 3975 -1035 -4719 -1234 3753 2789 -2805 -3930 1238
5134 1238 4572 889 -3712 -2112 2999 4114 -859 -3663 158 4319 2220 -2705 -2951 1706 4322
5149 4322 898 -3573 -2034 3322 3525 -1357 -4025 -67 3915 1359 -3999 -3137 2133 3572 -1375
$$ packed form
5042B029l9l098j220K487K652j488l156o12L499K179l015l355J962L886j41m137
5058a567j622L696K625k024m091R34M277J119l836l242K803L979q39m857j095
5073c740M985K720l843m151J924M881J7m852k193M013L606j694m753J33M760K182
5089C995m360m014K797N580m36n616j967N094L603l770m760J784N452N14n034
5104a138k895M108L901j724n084p05M602K624l078m932J825N553L69n760k614
5119d948M684M503k794n690Q33N941J446n010l684L485M987r64n594j125N168
5134A238L334l683m601J600N111J115m973k804L821M161k099m925k46M657K616
5149D322l424m471J539N356K03m882k668L958L982k556n358Q62N270J439m947
$$ plain form
5164 -1375 -4569 -1106 2857 1376 -2935 -3198 812 3219 239 -3278 -1949 2080 2999 -759 -3421
5179 -3421 -350 3620 2394 -2258 -2601 1949 3878 542 -2794 -735 3502 2857 -1113 -2625 489
5194 489 3077 1267 -2432 -2249 1601 2978 -459 -3188 -1032 2542 1217 -2338 -2918 37 2256 -476
5210 -476 -3088 -1537 1456 1513 -1460 -2985 -365 2056 663 -1969 -1846 1219 2235 -355 -2013 -495
5226 -495 2361 1786 -635 -927 1224 1830 688 -717 -288 1301 1625 342 -517 -164 1367 1029 -555
5243 -555 -1265 182 1397 -25 -1751 -701 456 59 -1351 -1675 102 157 -1088 -1419 -317 -80 -529
5260 -529 -688 -484 -567 -295 -244 249 75 244 136 478 607 801 512 367 805 951 897 362 503 1171 907
5281 907 148 -176 579 1071 834 -324 -421 0 258 -139 -1175 -1202 432 813 -970 -2126 -650 877
$$ packed form
5164a375l194L463L963j481m311k63M010K407k980l517J329M029R19l758k662
5179c421L071L970j226m652l43M550J929l336l336K059M237o45l970j512L114
5194D89K588j810l699J83L850J377l437k729K156L574j325l555n80K955K219k732
5210d76k612J551K993N7k973j525K620K421j393k632J23L065J016k590j658J518
5226d95K856n75k421k92K151O06j142j405M29J589L24j283q59L53J531l38j584
5243e55p10J447J215j422j726J050J157l97j410l24J777N5j245l31J102K37m49
5260e29j59K04q3K72N1M93j74J69j08L42J29J94k89j45M38J46n4n35J41O68k64
5281I07p59l24P55M92k37j158r7M21K58l97j036k7J634L81j783j156J476J527
$$ plain form
5299 877 -188 -2118 -1619 586 807 -1308 -1923 -268 1441 294 -1295 -1346 643 1798 444 -1058
5315 -1058 -498 1533 1929 -238 -1584 491 3183 1680 -1311 -983 1980 2772 21 -1580 -96 2192
5331 2192 1841 -1214 -1953 277 1894 535 -2418 -2194 877 1796 -1058 -3262 -1639 1851 985 -2731
5347 -2731 -3406 218 2750 -243 -3130 -1757 1564 1970 -892 -3126 -309 3430 1936 -1871 -2024 1975
5363 1975 4269 612 -2654 -870 3439 3082 -687 -2129 714 3280 2078 -2476 -2204 2124 3079 -131
5379 -131 -3089 -1260 2685 2706 -2659 -4434 455 3775 24 -4710 -2477 2243 2991 -2366 -4441 -594
5395 -594 3122 1347 -3013 -3072 1355 3227 -121 -3878 -1707 4203 3870 -1078 -3200 1189 4702 2057
5411 2057 -2575 -2174 3104 4417 -87 -3473 -301 4631 3096 -2622 -3588 1633 4321 464 -4327
$$ packed form
5299H77j065j930M99K205K21k115o15J655J709j147j589n1J989J155j354j502
5315a058N60K031L96k167j346K075K692j503k991L28K963P92k751j601J484K288
5331B192l51l055p39K230J617j359k953K24L071R19k854k204J623L490q66l716
5347b731o75L624K532k993k887J373L321M06k862k234K817L739j494l807j53L999
5363A975K294l657l266J784M309l57l769j442K843K566j202m554K72M328R55l210
5379a31k958J829L945K1n365j775M889L320l751m734K233M720P48n357k075L847
5395e94L716j775m360n9M427J872l348l757K171N910l33m948k122M389L513k645
5411B057m632M01N278J313m504l386L172M932j535n718r66N221K688l857m791
$$ plain form
5426 -4327 -2477 2400 3377 -2214 -4829 14 3418 -74 -3833 -3408 1245 3402 -1110 -4017 -1850
5441 -1850 3257 2096 -2225 -3302 446 3930 1139 -3177 -2269 3314 3899 -903 -2691 521 4351
5456 4351 2538 -2173 -2512 2231 3847 656 -3146 -1171 2882 3691 -1434 -3733 262 3202 1267
5471 1267 -3164 -2681 1565 3302 -927 -4779 -935 3046 1124 -3097 -3032 559 2608 216 -3025 -1445
5487 -1445 1873 1979 -1241 -2893 -139 2834 2210 -1951 -2171 1772 3103 804 -1751 -503 2673 2776
5503 2776 -795 -1982 497 2889 1389 -1459 -1634 1230 2874 -260 -2946 -359 2407 834 -2239
5518 -2239 -2385 516 1835 -790 -2611 -824 791 358 -1137 -1966 -310 1119 871 -988 -1343 316
5534 316 1040 33 -1444 -656 1343 1519 -733 -1001 744 1734 55 -440 -295 1390 1364 -233 -94 441
$$ packed form
5426d327J850M877R77n591k615M843L404l492l759M25M653K157m512k907K167
5441a850N107j161m321j077L748L484k791m316R08N583N85m802j788L212L830
5456D351j813m711l39M743J616l191l802J975M053Q09n125k299L995K940j935
5471A267m431M83M246J737m229l852L844L981j922m221O5L591K049k392l241J580
5487a445L318J06l220j652K754K973o24m161k20L943J331k299k555J248L176J03
5503B776l571j187K479K392j500k848j75K864J644l134k686K587K766j573l073
5518b239j46K901J319k625j821J787J615m33j495q29J656J429k48j859l55J659
5534C16P24j007j477P88J999J76k252k68J745R90j679m95J45J685k6j597J39N35
$$ plain form
5552 441 461 -25 -340 -489 428 809 -276 -1324 201 314 -817 -435 160 -87 -217 -169 6 438 -313
5571 -313 -1045 -634 700 -493 -420 -298 176 465 132 -213 -404 861 606 -181 -560 95 1312 820 -808
5590 -808 -268 1418 1306 -387 -911 100 1487 784 -1077 -1124 757 1052 -175 -834 -822 843 1292 -752
5608 -752 -2027 -203 1631 420 -2010 -1987 919 1691 -863 -2556 -357 2044 868 -1675 -1776 749
5624 749 2235 179 -2008 -1068 1930 1767 -809 -2125 42 2377 1391 -1867 -1817 1566 2430 -18 -2048
5641 -2048 -906 1817 2356 -1301 -2508 589 2562 1021 -2344 -1684 1609 2880 -504 -3339 -451
5656 -451 2807 1228 -2286 -2458 857 2476 -387 -2250 -1377 1895 2073 -909 -2488 -394 2227 1848
5672 1848 -1830 -2302 1104 3154 291 -3763 -1603 2861 2927 -1765 -3428 486 3308 708 -2734 -3009
$$ packed form
5552D41K0m86l15j49R17L81j085j048J525J13j131L82N95k47j30M8J75M32p51
5571c13p32M11J334j193P3J22M74K89l33l45j91J265k55p87l79O55J217m92j628
5590h08N40J686j12j693n24J011J387p03j861m7J881K95j227o59J2J665M49k044
5608g52j275J824J834j211k430K3K906P72k554j693K199K401j176k543j01K525
5624G49J486k056k187R40K998j63k576j316K167K335r86l258N0L383Q64k448k030
5641b048J142K723N39l657j207L097J973j541l365O60L293J271l384k835K888
5656d51L258j579l514j72L315J619k863j863Q73L272J78k982j579K094K621l79
5672A848l678m72L406K050k863m054K160M464O6m692j663L914K822k600l442k75
$$ plain form
5688 -3009 2213 3384 -780 -3318 -565 3241 2178 -2271 -3276 663 3697 518 -4049 -1695 2379
5703 2379 3030 -1179 -3421 -305 3303 1844 -2516 -2745 1653 3508 93 -3423 -1635 3057 2711 -2289
5719 -2289 -3356 342 3562 999 -3341 -2714 1885 3301 -874 -3722 -1018 2992 2016 -1735 -3246
5734 -3246 596 3777 708 -3527 -2018 2729 3167 -1037 -3384 153 4016 1555 -2703 -2151 2089
5749 2089 2985 -224 -2815 -736 2572 2228 -1587 -2782 619 3257 579 -2355 -1830 1659 2875 -511
5765 -511 -3112 -1332 2727 1909 -2339 -2532 1038 2850 -1 -3060 -1672 1931 2495 -1283 -3092 15
5781 15 2975 1146 -2083 -1945 1600 2672 -181 -2341 -641 2459 1759 -1020 -1593 510 2355 998
5797 998 -1612 -1175 1448 2237 -423 -2140 -671 1927 1554 -1754 -2370 644 2051 -87 -2333 -1197
$$ packed form
5688c009N222J171m164k538K753L806j063m449j005L939L034l179m567K354M074
5703B379O51m209k242L116L608j459m360k29M398J855l415l516J788M692l46n000
5719b289j067L698L220k563m340O27M599J416m175k848K704M010r76l751j511
5734c246L842L181l069m235J509M747M38m204k347L537L863k461m258N52M240
5749B089Q96l209k591K079L308l44l815j195L401K638k678k934N25L489J216l386
5765e11k601J780M059q18m248j93L570J812k851l059J388L603N64l778j809L107
5781A5K960j829l229J38L545J072k853k160J700L100p00k779n73K103J845j357
5797I98k610M37K623P89k660j717J469K598l73l308o16L014J407k138k246J136
$$ plain form
5813 -1197 1100 1090 -1182 -2098 -355 1216 629 -1471 -1270 556 1157 -42 -1753 -551 1546 1057 -559
5830 -559 -1065 479 1639 606 -687 -82 1326 1336 -17 -567 99 928 952 -266 -528 436 663 14
5848 14 -537 -310 426 222 -543 -683 -87 131 -274 -681 -650 -301 -143 -415 -693 -542 -118 -352 -467 -483 189
5869 189 92 -341 -225 555 482 -100 -498 889 963 -289 -234 891 1333 199 -468 330 1668 534 -519
5888 -519 -278 1036 1063 -71 -786 -103 720 418 -400 -1294 -529 836 -44 -1597 -1645 166 1054 -766 -1989
5907 -1989 -827 1120 853 -1633 -1985 152 1888 262 -1608 -994 1666 2061 -406 -1941 399 2817
5923 2817 1225 -1519 -843 1901 2712 416 -1678 -56 2223 1780 -832 -1564 643 2221 746 -1689
5939 -1689 -1466 1108 2074 -1020 -2872 -847 2322 1231 -2417 -2833 451 2078 -586 -3262 -1468 1596
$$ packed form
5813a197K297j0k272r16J743J571n87k100K01J826O01j199j711J202K097m89j616
5830e59n06J544J160j033j293O05J408J0j353n50O66Q29K4j218k62R64K27o49
5848A4n51K27P36k04p65j40N96K18m05m07L1L49J58k72k78J51M24k34j15j6O72
5869A89r7m33J16P80p3n82l98J387P4j252N5J125M42j134o67P98J338j134j053
5888e19K41J314K7j134p15O83Q23l02q18q94P65J365q80j553m8J811Q88j820j223
5907a989J162J947k67k486l52K137J736j626j870O14K660L95k467j535K340K418
5923B817j592k744O76K744Q11k296k094J622K279m43k612p32K207J578j475k435
5939a689K23K574R66l094j852K025L169j091l648m16L284J627k664k676J794L064
$$ plain form
5955 1596 1566 -1478 -2867 -427 2427 897 -2180 -2211 1382 3012 143 -2363 -532 3125 2858 -1511
5971 -1511 -1996 1459 3645 1047 -2288 -1245 2319 2712 -543 -2433 -432 2670 1518 -1859 -2641 595
5987 595 2511 -137 -3490 -2059 1680 1991 -1954 -3382 -516 2271 723 -3121 -2919 796 2982 -278
6003 -278 -3344 -1411 2618 2398 -1730 -3227 835 4039 1029 -2457 -1337 2801 3265 -483 -2513 462
6019 462 3396 1926 -1424 -2171 1352 3270 693 -2647 -1653 2204 2812 -1389 -3570 -589 3171 952
6035 952 -3148 -2817 1138 2574 -1065 -4089 -1047 2335 1612 -2374 -3181 227 2698 623 -2670 -1511
6051 -1511 2250 2853 -861 -2609 -21 2997 1934 -1889 -1723 1602 3216 642 -2093 -555 2623
6066 2623 2569 -626 -2112 110 2969 1226 -2304 -1868 1343 2163 -916 -2929 -1082 1899 1174 -2162
$$ packed form
5955A596l0l044j389K440K854j530l077l1L593J630k869k506J831L657k67m369
5971a511m85L455K186k598l335J043L564L93l255j890K001L102j152l377p82L236
5987E95J916k648l353J431L739L11l945j428K866K787j548l844K02L715K186l260
6003b78l066J933M029k20m128j497M062L204l010l486J120M138M64l748k030K975
6019D62K934j470l350p47L523J918k577l340R94L857O08m201k181K981L760k219
6035I52m100L31L955J436l639l024L042L382p23l986q07L408K471k075l293J159
6051a511L761O03l714j748K588L018j063l823J66L325J614k574k735J538L178
6066B623n4l195j486K222K859j743l530M36L211Q20l079k013J847K981p25l336
$$ plain form
6082 -2162 -2744 265 1704 -212 -2356 -1780 1063 1638 -1084 -2680 -786 1819 1024 -1697 -1643 1169
6098 1169 2376 -56 -1746 -241 1912 1524 -412 -899 1030 1883 996 -816 -598 1228 1549 435
6114 435 -1139 -343 1524 1231 -1030 -1329 332 1498 -41 -1612 -1236 608 723 -969 -1700 -572 636
6131 636 -126 -1389 -1403 288 477 -570 -1333 -611 602 460 -463 -450 279 769 716 35 418 552 701 593
6151 593 176 324 710 667 344 -208 308 740 465 -392 -243 396 228 -456 -594 320 -47 -666 -372 47
6171 47 -311 -799 -651 119 171 -640 -1043 -97 144 -383 -696 -302 372 278 -348 -517 135 827 509 -397 -542
6192 -542 905 1344 326 -446 135 1151 879 -584 -871 522 1406 486 -1020 -762 645 1406 -324
6209 -324 -1355 -287 1521 916 -1507 -1377 688 1282 -534 -2012 -995 1267 1073 -1000 -1967 -41
$$ packed form
6082b162n82L009J439j916k144N76K843N75k722j596J894K605p95k721N4K812
6098A169J207k432j690J505K153l88j936m87J929Q53q87j812K18J826L21j114
6114D35j574P96J867k93k261k99J661J166j539j571L76J844J15j692p31J128J208
6131F36p62j263j4J691J89j047p63P22J213j42r23J3P29M90n3o81L83J34J49j08
6151E93m17J48L86m3l23n52N16M32k75q57J49O39j68o84j38R14l67o19K94M19
6171D7l58m88J48P70N2q11m03R46K41n27l13L94O74r4o26j69O52O92l18r06j45
6192e42J447M39j018p72N81J016k72j463k87J393Q84r20j506K58J407P61j730
6209c24j031J068J808o05k423J30K065N94j816j478J017K262j94k073r67J926
$$ plain form
6225 -41 1383 491 -2062 -1455 1316 2007 -446 -2204 -168 2319 1584 -1615 -1858 1518 2614 50 -2169
6242 -2169 -673 2350 1792 -966 -1940 394 2237 878 -1485 -1606 976 2121 -298 -2682 -852 1988
6258 1988 1531 -1673 -2577 347 2622 446 -2756 -1769 1918 2227 -1001 -2871 -265 2781 1114 -1874
6274 -1874 -2279 1233 2756 210 -2728 -1011 2223 2086 -1485 -2380 660 2797 963 -1853 -1653 1620
6290 1620 2185 -154 -2429 -811 2348 2090 -1267 -2420 496 2821 820 -2539 -1865 1800 2488 -1266
6306 -1266 -2649 -126 2549 758 -2215 -2148 957 2382 7 -2683 -1149 1883 2246 -1201 -2671 -44
6322 -44 2596 1187 -2392 -1983 1508 2538 -234 -2795 -731 2218 1652 -1423 -2283 706 2659 759
6338 759 -2767 -1468 1699 2471 -532 -2784 -402 2613 1328 -1813 -2147 1018 2251 132 -2324 -985
$$ packed form
6225d1J424q92k553O07K771O91k453j758K036K487p35l199k43L376J096k564k219
6242b169J496L023n58k758r74K334J843j359k363j21K582J145k419k384J830K840
6258A988m57l204r04K924K275k176l202R87L687L09l228j870K606L046j667k988
6274a874m05L512J523k546k938J717L234j37l571q95L040K137j834k816K00L273
6290A620N65k339k275J618L159k58l357j153K916K325k001l359O74L665O88l754
6306a266j383K523K675j791k973O7L105J425k375k690J534L032L63l447j470K627
6322d4K640j409l579M09L491J030k772k561K064K949n66l075q60K989J953j900
6338G59l526J299L167P72l003k252K382L015j285l141l34L165J233k119k456J339
$$ plain form
6354 -985 2094 1950 -1041 -2401 15 2539 1068 -2020 -1953 1490 2442 -290 -2403 -432 2018 1172
6370 1172 -1506 -1791 714 2362 393 -1697 -1157 1068 1511 -598 -2002 -338 1918 1172 -1329 -1828
6386 -1828 817 2040 6 -2126 -605 1788 1476 -1134 -1475 423 1871 426 -1260 -915 868 1299
6402 1299 -249 -1054 -463 1171 737 -795 -1208 302 1252 250 -1029 -815 747 1173 -410 -1013 -418
6419 -418 885 803 -764 -848 263 1097 137 -1461 -882 688 823 -523 -913 53 721 184 -606 -333 611
6438 611 647 32 -124 -103 406 375 -81 -213 127 539 296 -230 -245 411 426 -324 -482 -258 265 -2 -84 -66
6460 -66 -60 -361 -410 24 -254 -492 -383 70 -96 -256 -427 -13 -57 -127 -276 -248 -361 172 192 25 -264 -62 776
6483 776 158 -221 36 685 693 -389 -512 165 1102 397 -462 -254 502 834 -219 -756 146 1126 385 -959
$$ packed form
6354i85L079j44k991j360K416K524j471l088O7L443R52k732k113J971K450q46
6370A172k678k85K505J648j969k090N40K225M43k109j404J664K256p46k501m99
6386a828K645J223k034k132J521K393l12k610l41J898J448j445j686L45J783M31
6402A299j548q05N91J634m34j532m13J510R50j002j279K14J562M26j583o03N95
6419d18J303q2j567q4J111Q34r60j598N79J570J35j346l90R66O68n37p90K73R44
6438F11L6o15j56K1N09l1m56j32L40M12k43n26j5O56J5p50j58K24N23k67q2J8
6460f6Ol01m9M34k78k38J09M53j66j60j71M14m4p0j49K8j13N33K0j67k89K02Q38
6483G76o18l79K57O49Qj082j23O77R37p05q59K08P56L32j053n37R02R80p41j344
$$ plain form
6503 -959 -932 255 1185 -370 -1399 -496 680 144 -977 -1523 -310 1004 124 -1274 -1176 401 1108 -198
6521 -198 -1690 -914 1428 1345 -776 -1412 851 2198 624 -1540 -587 1962 2007 -603 -1295 481 2363
6538 2363 783 -1457 -1149 1327 2089 -54 -1934 -575 1821 1377 -1265 -2348 -233 1849 0 -2151
6554 -2151 -1620 1226 1561 -990 -2671 -549 1644 868 -1877 -2127 743 2179 -153 -2506 -898 2269
6570 2269 1987 -1366 -2068 677 2870 967 -1708 -893 1771 2699 -36 -2001 17 2238 1638 -1350
6586 -1350 -2126 811 2558 453 -2563 -1470 1744 2019 -1289 -2704 -387 2098 532 -2584 -2074 668
6602 668 2051 -643 -2676 -1258 1323 1225 -1114 -2429 92 2535 931 -1931 -1372 1522 2392 -280
6618 -280 -1844 -112 2848 1694 -1191 -1848 1214 2665 711 -1764 -865 1865 2138 -443 -2017 189
$$ packed form
6503i59K7J187R30j555j029R03J176n36j121n46J213J314q80j398R8J577P07j306
6521a98j492P76K342q3k121o36K263J347j574k164R53K549M5k610o92J776J882
6538B363j580k240L08K476P62k143j880J359K396m44k642j083K115K082j849k151
6554b151N31K846L35k551j681K122K193p76k745k50K870J436k332k353J608L167
6570B269k82l353p02K745K193j903k675Q15K664R28k735j965K018K221o00k988
6586a350p76K937J747k105l016J093L214K75l308j415K317K485j566l116N10K742
6602F68J383k694k033J418K581r8k339j315K521K443j604k862N59K894Q70k672
6618b80j564J732K960j154k885o57L062J451j954k475Q99K730K73k581j574K206
$$ plain form
6634 189 1955 1033 -1920 -1720 1011 1788 -572 -2573 -1248 1154 1114 -1317 -2325 -185 1912 501
6650 501 -2130 -1970 902 1944 -510 -2348 -601 2262 1386 -1523 -1823 860 2107 209 -1437 -387
6666 -387 1740 1662 -245 -1028 47 1961 1131 -940 -1466 763 2093 126 -1884 -743 1442 1113 -1015
6683 -1015 -1956 -162 1375 -10 -1841 -1269 408 667 -1049 -1959 -795 973 511 -1453 -1488 312 1326
6700 1326 -84 -1229 -574 1062 1140 -242 -830 364 1223 775 -453 -434 773 1284 463 -563 -90 1103
6718 1103 974 -226 -674 290 1211 142 -710 -358 355 415 -267 -893 -394 -81 -154 -683 -470 -365 -36 -109
6738 -109 -853 -696 -158 269 -410 -641 -219 351 308 -465 -4 642 154 27 234 414 426 60 503 314 223
6759 223 202 204 565 325 48 253 373 193 -30 -278 -247 261 87 -541 -514 -42 22 -262 -768 -778 -149 -113 -781
$$ packed form
6634A89J766r22k953K00K731P77k360k001J325K402m0k431j008K140K097j411
6650E01k631J60K872J042k454j838J747K863q76k909l00K683J247j898j646J050
6666c87K127p8j907p83J075J914q30k071n26K229J330j967k010J141K185l29k128
6683a015r41J794J537j385j831N72J677K59j716r10J164J768m62j964l5J800J014
6700A326j410j145O55J636P8j382n88J194Q59m48j228J9J207N11q21j026M73J193
6718A103j29j200m48R64R21j069q52L52P13O0o82o26M99L13p3n29K13J05L29p3
6738a09p44J57N38M27o79k31M22N70m3p73M61O46m88j27K07J80J2l66M43j89r1
6759B23k1KL61k40k77K05J20j80k23k48L1N08j74o28K7M72O4k84n06j0O29L6o68
$$ plain form
6782 -781 -680 -434 -113 -42 -82 -830 -319 567 123 -510 -464 312 824 75 -901 69 1532 992 -355 -429 1009
6803 1009 1275 283 -631 -377 1147 959 -250 -558 175 851 722 -568 -1238 202 1370 -59 -1515
6820 -1515 -929 1039 708 -838 -1716 -274 1200 225 -1526 -1552 264 1024 -254 -1794 -688 1327 936
6837 936 -880 -1628 496 1796 633 -1416 -996 1493 1738 -402 -1507 229 1931 1160 -1128 -1419
6853 -1419 994 2119 162 -1792 -843 1614 1560 -1365 -2113 248 1918 357 -2004 -1508 816 1707
6869 1707 -732 -2126 -765 1855 934 -1337 -1969 313 1767 312 -2231 -1412 1866 2032 -926 -2299
6885 -2299 126 2471 1205 -1888 -1371 1619 2366 -227 -1813 -342 2159 1384 -970 -1864 680 2162
6901 2162 449 -1933 -1288 1327 1867 -574 -2249 -512 1844 743 -1753 -1950 456 1990 -26 -2244
$$ packed form
6782g81J01K46L21P1m0p48N11Q86m44o33M6P76N12p49r76R70J463n40j347p4J438
6803A009K66r92r14K54J524j88j209l08P33O76j29j290o70J440J168j429j456
6820a515N86J968l31j546q78J442J474r75j751k6J816P60j278j540J106K015l91
6837I36j816p48K124J300j163k049M20K489K45k140j105J736J702p71k288k91
6853a419K413J125j957j954R49K457n4k925p48K361J670j561k361M96K324Q91
6869A707k439j394J361K620r21k271o32K282J454j455k543Q19L278J66k958j373
6885b299K425K345j266l093N17K990P47k593j586J471K501p75k354q94K544J482
6901B162j713k382O45K615N40k441j675J737K356j101k496j97K406J534k016k218
$$ plain form
6917 -2244 -1164 1672 1344 -993 -2035 -9 2065 802 -1958 -1723 1229 1722 -497 -1663 -364 1859
6933 1859 1474 -947 -1454 606 1803 808 -1262 -896 1241 1849 -331 -1762 -310 1629 945 -1450
6949 -1450 -1534 547 2076 238 -2053 -779 1395 987 -953 -1574 -1 1325 571 -1605 -1454 683
6965 683 1257 -148 -1580 -551 1416 1354 -1127 -1352 568 1491 222 -1627 -881 1229 1557 -272 -1439
6982 -1439 -33 1313 576 -870 -1203 349 1459 -108 -1192 -446 895 876 -429 -1153 38 1236
6998 1236 438 -1028 -670 397 934 -12 -1103 -632 940 777 -761 -875 342 973 190 -1073 -539
7015 -539 978 561 -688 -692 217 482 78 -174 -150 117 313 61 -451 -340 145 386 42 -595 -3 579
7035 579 204 -463 -252 152 640 107 -547 -266 488 154 -414 -43 206 257 228 -11 -32 -41 56 88 142 164 -190
$$ packed form
6917b244J080K836l28k337j042K026K074j263k760K35K952M93k219j166J299K223
6933A859l85k421n07K060J197r95k070L66K137O08k180j431J452J939o84k395
6949a450q4K081J529j838k291J274K174m08j940o21J573J326p54k176J51K137
6965F83N74j405j432J029J967o2k481k25J920R23j269j849P46K110L28j829j167
6982a439J406J346p37j446l33J552J110j567j084P46J341j9j305p24J191J198
6998A236p98j466L58J067N37r46j091M71J572j63j538j14J217O31p83j263N34
7015e39J517m17j249mR09K65m04k52K4K67J96k52n12J11M85K41l44o37N92N82
7035E79l75o67K11M04M88n33o54K81P54l34n68L71K49N1k9k39k1rR7L2N4K2l54
$$ plain form
7058 -190 139 373 341 85 -219 -59 334 97 -541 -374 206 484 -547 -112 113 -4 54 -655 -236 5
7078 5 153 65 -348 -379 162 822 -231 -832 87 682 459 -369 -559 646 989 55 -678 101 539 257 -348
7099 -348 -445 -86 692 344 -771 -675 669 936 10 -1098 -743 951 477 -1040 -1173 368 923 -209
7117 -209 -1186 -789 737 751 -735 -1683 -276 912 634 -767 -859 355 1468 -7 -1250 -496 1326
7134 1326 1003 -241 -855 117 1758 677 -841 -1063 707 1441 72 -1470 -610 1631 1465 -1096 -1598
7151 -1598 604 1794 364 -1739 -996 1174 1166 -874 -1782 -250 1213 502 -1204 -1478 506 1630 107
7168 107 -1673 -1011 1425 1722 -753 -1858 116 2277 733 -1638 -1227 1563 2066 76 -1749 -432
7184 -432 2154 1549 -1170 -1626 918 2103 170 -1994 -820 1521 1702 -889 -1982 -43 1768 575
$$ packed form
7058a90L29K34l2k56l04J60L93k37o38J67N80K78j031M35K25j17N8p09M19K41
7078EJ48q8m13l1N41O60j053o01R19N95k23q28j90J205L43r34p33P79M38k82o05
7099c48r7L59P78l48j115R6J344K67r26j108L55J694m74j517j33J541N55j132
7117b09r77L97J526J4j486r48J407J188k78j401r2J214J113j475j243P54J822
7134A326l23j244o14R72J641j081j518k22J770P34j369j542Q60K241j66k561n02
7151a598K202J190j430k103P43K170qk040r08J532J463p11j706k74J984J124j523
7168A07j780O62K436K97k475j105J974K161j544k371M11K790N03j990j825J317
7184d32K586o05k719m56K544J185j933k164J174K341J81k591j093J939J811j193
$$ plain form
7200 575 -1654 -1502 633 1319 -152 -1967 -955 1412 1068 -1381 -2182 76 1910 404 -1832 -996
7216 -996 1367 1729 -717 -1954 -169 1963 1035 -1234 -992 1001 1761 369 -1601 -452 1540 1547 -559
7233 -559 -1412 325 1874 975 -1342 -1523 938 1645 -284 -1569 -321 1110 640 -1076 -1660 179 1122
7250 1122 -78 -1584 -1047 766 1166 -460 -1624 -625 1144 650 -1009 -1364 544 1543 109 -1209
7266 -1209 -418 1134 1431 -220 -981 395 1729 791 -1042 -894 858 1453 -141 -1205 -236 1213 861
7283 861 -738 -828 374 729 -228 -1027 -514 304 696 -543 -1225 -569 451 209 -893 -1107 34 874
7301 874 -30 -960 -755 667 602 -467 -1179 195 858 252 -580 -27 583 587 147 -232 140 683 845 169
7321 169 -406 358 662 461 -265 60 313 405 -265 -333 -38 -67 28 -557 -346 -202 35 -92 -337 -544 -282
$$ packed form
7200E75k229J52K135O86j471j815J012K367l44k449q01K258J834j506k236Q36
7216i96K363L62k446j237J785K132r28k269K42J993P60j392j970J149J992Pk106
7233e59q53J737J549q99k317j81K461P07j929j285J248J431m70j716n84J839R43
7250A122j200j506N37J813M00j626j164R99J769m94j659l55J908R99j434j318
7266a209P91J552K97j651p61J376J334r38j833J48J752N95j594j064R69J449l52
7283H61j599r0J202L55r57p99N13Q18L92j239o82O56J020k42j102k14J141Q40
7301H74r04r30K05J422o5j069p12J374O63o06q32N53O10Mm40l79L72N43J62o76
7321A69n75P64L04k01p26L25K53R2o70o8K95k9R5n85K11J44K37j27k45k07K62
$$ plain form
7342 -282 17 -301 -548 -58 -190 -162 -347 35 -198 42 116 -23 189 -190 38 365 571 301 -12 411 755
7363 755 123 70 356 367 728 376 -19 -152 246 537 -210 -464 43 575 270 -888 -560 315 767 -373
7383 -373 -1067 -558 40 22 -809 -1041 -73 254 -108 -806 -384 261 365 -251 -943 -252 736 848 -458 -486
7403 -486 553 1134 510 -925 52 1010 1305 -102 -943 330 1174 1010 -857 -446 662 1299 -74 -1233
7421 -1233 -514 1073 600 -798 -1437 -93 558 -175 -1113 -993 567 762 -505 -1145 -499 735 786 -978
7439 -978 -1528 83 1504 508 -1472 -516 1186 1410 -497 -1303 279 1824 750 -795 -623 694 1637
7456 1637 80 -1199 -575 1366 1404 -604 -1637 312 1744 390 -1428 -1119 844 1223 -353 -1958
7472 -1958 -362 1359 785 -1357 -1819 154 1442 115 -1777 -1162 1108 1325 -686 -1829 23 1800
$$ packed form
7342b82K99l18k47M90j32K8j85L82k33K40P4j39K12l79K28L27K06k70l13M23L44
7363G55o32n3K86J1L61l52l95j33L98K91p47k54N07N32l05j158L28Q75M52j140
7383c73o94N09N98j8q31k32R68L27l62o98M22O45J04o16o92O91R88J12j306k8
7403d86J039N81o24j435R77R58K95j407q41J273Q44j64j867M11J108O37j373j159
7421a233P19J587m73j398o39J344O51p33r38J20J560J95j267o40O46J234N1j764
7439i78n50J611J421r96j980R56J702K24j907q06J582J545j074j545J72J317R43
7456A637j557j279O24J941L8k008j033J949J432j354j818L09J963L79j576j605
7472a958J596J721n74k142m62J973J288j327j892O15K270K17k011j143J852J777
$$ plain form
7488 1800 655 -1396 -1259 1374 1891 84 -1831 -387 1643 1358 -675 -1386 553 2080 718 -1463
7504 -1463 -1028 1151 1867 -738 -1696 97 1746 800 -1503 -1763 466 1416 -306 -1857 -912 1206 1053
7521 1053 -1004 -1802 -183 1376 703 -1487 -1599 691 1582 -241 -1974 -519 1537 1167 -932 -1223
7537 -1223 521 1840 456 -1284 -570 1253 1341 -365 -1351 -35 1683 964 -865 -1150 571 1501 -95
7554 -95 -1358 -547 1307 946 -768 -1256 -60 1345 323 -1116 -1147 510 1188 -149 -1559 -599 1076
7571 1076 433 -1021 -1135 421 1446 225 -1295 -445 950 916 -223 -1011 164 1045 746 -529 -637
7588 -637 425 883 204 -1003 -372 868 790 -422 -790 263 675 69 -986 -571 270 543 -313 -773
7606 -773 -281 611 201 -491 -723 -87 608 -139 -711 -356 541 534 -264 -582 -61 433 440 -261 -103 107 601
$$ packed form
7488A800j145k051J37K633N17j807j915J444K030k85k033p11J939J527j362k181
7504a463M35K179P16k605r58J793J649r46k303k60K229R50j722j551R45K118j53
7521A053k057p98J619J559o73k190j12K290Q91j823j733J455K056l70k099k91
7537a223J744J319j384j740P14J823Q8j706r86J316J718p19j829k85J721R30j596
7554i5j263Q11J854l61j714m88J196J405j022j439l1J657O78j337j410R60J675
7571A076o43j454j14J556J025j221j520Q50J395l4j139p88J175Q81k99j275j08
7588f37J062M58o79j207O31J240p8j212l68J053M12o06j055M15Q41K73q56m60
7606g73M92Q92m10o92k32O36O95p47n72L55Q97pp98l18N21M94Pp01J58K10M94
$$ plain form
7627 601 -83 -303 42 416 262 -30 -330 142 443 4 -320 -146 226 103 -187 52 190 193 -293 -155 7
7648 7 6 -165 183 75 81 -110 -105 95 -218 -204 -73 -201 -29 221 170 -322 -89 492 190 -171 -334 218 682
7671 682 -74 -467 -324 586 388 -632 -424 169 446 90 -706 -180 463 548 -28 -754 -219 711 269 -366
7691 -366 -509 403 735 -266 -565 -380 613 631 -390 -703 53 764 368 -460 -967 617 850 -320 -1236
7710 -1236 -426 1129 618 -834 -1048 190 1389 26 -961 -485 568 809 -436 -1212 -101 881 808
7727 808 -891 -1239 222 1229 15 -1324 -584 1271 1021 -521 -1190 273 1421 386 -962 -595
7743 -595 903 1176 -74 -1184 -306 1270 825 -701 -1323 97 1580 450 -1137 -746 756 1268 -654
7760 -654 -1461 -309 1265 778 -1246 -1414 475 1559 -13 -1541 -710 995 911 -660 -1616 -29 1312
$$ packed form
7627F01o84k20L45L74j54k92l00M72L01m39l24J74L72j23k90K39J38Lm86J38J62
7648Gjj71L48j08Oj91NK00l13J4J31j28J72K50n1m92K33N81l02l61j63N52M64
7671F82p56l93J43R10j98j020K08N93K77l56p96N26O43Q5n76p26N35R30m42o35
7691c66j43R12L32j001k99J85R93J8j021l13P56P11l96q28n07J584K33j170r16
7710a236Q10J555n11j452k14J238J199j363r87M76J053K41j245p76J111R82p3
7727H08j699l48J461J007j214j339P40J855k50j542o69J463J148j035j348L67
7743e95J498K73j250j110Q78J576m45j526o22J420J483j130j587L91J502N12j922
7760f54q07J152J574m87k024j68J889J084j572j528Q31J705q4j571r56J587J341
$$ plain form
7777 1312 683 -1559 -1196 1016 1440 -40 -1299 -391 1394 1090 -653 -1220 353 1614 582 -1072
7793 -1072 -935 1100 1670 -255 -1708 -173 1646 923 -1337 -1268 601 1667 -45 -1600 -558 1016
7809 1016 1036 -1003 -1399 -81 1337 260 -1466 -1543 802 1299 -207 -1666 -668 1460 861 -855 -1399
7826 -1399 469 1514 300 -1270 -903 1204 1437 -104 -1384 186 1812 1035 -925 -899 682 1546
7842 1546 -10 -1381 -250 1172 931 -650 -1261 111 1269 254 -1026 -1079 479 905 -489 -1851
7858 -1851 -749 820 330 -1052 -1247 261 1388 -33 -1304 -397 717 778 -712 -809 21 1181 682
7875 682 -625 -672 394 896 376 -976 -139 997 802 -326 -695 133 1143 177 -964 -633 718 463
7893 463 -627 -942 -431 406 314 -603 -915 27 186 -212 -908 -341 168 341 -272 -590 -336 345 127 -424
$$ packed form
7777A312o29k242L63K212M24j480j259R08J785l04j743n67J573J261j032j654
7793a072J37K035N70j925j453J535J819p23k260O9J869J066j712j555J042J574
7809A016K0k039l96J318J418j077j726p7K345M97j506j459R98K128n99j716n44
7826a399J868J045j214j570L67K107K33j541j280J570J626p77j960K6J581Q64
7842A546j556j371J131J422k41j581o11J372J158j015j280n3J558M26j394j362
7858a851J102J569m90j382j95J508J127j421j271R07J114O1j490r7Q30J160m99
7875F82j307m7J066N02n20j352Q37J136j95j128l69Q28J010r66j141L31J351k55
7893D63j090l15N11Q37r2r17l12R42J59l98o96N67N09J73o13l18K54O81k18n51
$$ plain form
7913 -424 -407 291 495 105 -238 -135 618 675 78 -385 158 772 395 -198 -40 673 423 3 -276 336 506
7934 506 -73 -23 102 151 -353 8 -29 -193 -339 -336 -31 -285 -489 -258 -331 -637 -182 -533 -211 -398 -192 -6
7956 -6 -555 -192 -124 361 312 -279 136 500 509 152 -33 387 534 272 -217 -102 528 747 225 -465 -294 864
7978 864 716 -232 -745 52 515 -249 -976 -634 175 425 -754 -1216 -260 538 -159 -790 -721 105 556 -57
7998 -57 -1342 -450 673 514 -720 -882 311 1077 130 -852 -169 914 992 25 -648 213 942 644 -312
8017 -312 -884 597 1231 380 -861 -478 888 1202 -359 -1245 95 1267 133 -1065 -868 520 662
8034 662 -455 -1545 -393 867 500 -989 -1262 81 922 1 -1345 -971 762 1012 -480 -1172 -125
8051 -125 1236 966 -749 -895 684 1541 315 -951 -396 987 1301 -195 -1405 255 1541 753 -908
$$ packed form
7913d24J7O98K04l90l43J03P53N7n97m63N43O14l77n93J58P13k50m20k79O12J70
7934E06n79N0J25M9n04L61l7j64j46LL05k54k04K31p3l06M55l51L22j87K06J86
7956fn49L63O8M85m9n91M15L64Rl57j85M20J47k62m89J15O30K19n22o90J71J158
7978H64j48r48n13P97M63p64p27L42Q09K50j179m62R56P98o97o31O9Q26M51o13
7998e7j285Q92J123j59j234j62J193P66r47r82O83J083P8r67o73Q61P29k98r56
8017c12n72J481O34q51j241L83J366L14j561q86J340J172j134j198J97J388J42
8034F62j117j090J152J260l67j489k73J343Q41r21j346L74J733K50j492o92J047
8051a25J361k70j715j46J579Q57j226j266N55J383L14j496j210J660J286p88j661
$$ plain form
8068 -908 -893 970 1299 -275 -1409 -255 1243 912 -1004 -1337 30 1086 370 -1281 -1060 464 1136
8085 1136 -707 -1711 -531 1140 710 -1169 -1442 664 1387 157 -1361 -422 1306 1474 -349 -1106
8101 -1106 83 1724 1016 -827 -884 833 1706 54 -1338 -363 1322 1213 -619 -1179 311 1446 389
8118 389 -1344 -826 653 1114 -563 -1713 -690 1155 571 -1342 -1347 381 1435 -61 -1398 -902 878
8135 878 886 -599 -1239 292 1155 446 -912 -925 766 1127 98 -1148 -366 1161 1167 -690 -1319 383 1557
8154 1557 416 -1189 -375 1064 1007 -333 -1112 -60 915 301 -779 -735 233 837 -189 -1282 -705 710
8172 710 685 -417 -1056 -295 866 350 -1091 -829 314 613 -240 -857 -211 672 204 -359 -700 21 1029
8191 1029
$$ packed form
8068i08J5J863L29j574j134J154J498l31j916l33J367J056p16j651K21J524O72
8085A136j843j004J180J671m30j879k73K106P23j230j518R39J728J68j823p57
8101a106J189J641p08j843n7J717Q73j652j392R75J685j09j832n60J490J135j057
8118C89j733N18J479M61j677j150J023J845n84j913nJ728J054j496j337M96J780
8135H78Qj485o40J531Q63p09j358j3J691L61j029j246P82J527Oj857o29J702J174
8154A557j141j605Q14J439n7j340p79J052R75o14j080M4R68O04j026j093N77J415
8172G10k5j102o39P61J161n16j441K62J143K99q53o17O46Q83m68n63l41P21J008
8191A029
$$ Imaginary data points
##PAGE= N=2
##DATA TABLE= (X++(I..I)), XYDATA
$$ plain form
0 0 0 0 0 0 0 0 0 7 -1 0 -8 8 -9 16 -17 24 -32 40 -46 56 -65 81 -94 111 -134 155 -178 207 -240 275 -314 358
32 358 -409 463 -522 590 -663 743 -832 928 -1032 1148 -1276 1412 -1561 1728 -1908 2102
48 2102 -2317 2554 -2813 3100 -3413 3767 -4160 4603 -5105 5678 -6343 7124 -8054 9185
62 9185 -10598 12420 -14862 18330 -23673 33020 -53991 204240 -329079 -599304 383587 485213
74 485213 -196854 -386011 123843 202725 -47548 -62960 -10786 -210444 -63052 305224 32337
85 32337 -556758 -176228 547950 152707 -635518 -259053 481165 203882 -441640 -250158
95 -250158 267662 173775 -144559 -44819 41942 -84301 80754 275028 -107598 -349973 210627
106 210627 526279 -122432 -485403 161784 555723 -25434 -432584 36765 401290 27697
$$ packed form
0@%%%%%%%PqJqJ6j7K5l3M1n6P2q6J02j21J46j75K05k45K89l33L85m47N15n89O72
32C58p67Q72r85J112j253J406j575J760j960K180k424K688k973L289l636M010
48B102m419M871n367N913o513P180p927Q763r708J0783j2021J3467j5178J7239
62I185j9783K3018k7282L3192m2003N6693q7011K58231n33319k70225R82891J01626
74D85213o82067j89157N09854P8882k50273j5412N2174j99658J47392L68276k72887
85C2337n89095L80530P24178l95243p88225L76465P40218k77283o45522J91482
95b50158N17820r3887l18334R9740Q6761j26243J65055J94274l82626k42375N60600
106B10627L15652o48711l62971O47187L93939n81157m07150M69349L64525l73593
$$ plain form
116 27697 -226322 49226 114165 -79561 41576 124400 -192735 -213064 249478 244912 -323033
127 -323033 -342052 258237 301806 -296006 -370698 181935 253988 -212576 -227836 120923 57193
138 57193 -127457 28608 60366 -170043 -75543 246465 101334 -282696 -99829 347666
148 347666 157081 -314014 -117919 339791 153538 -223717 -33476 221336 32322 -79939
158 -79939 92533 62520 -111429 19440 205553 -13648 -243325 40132 293449 -55750
168 -55750 -326288 34078 264797 -88566 -255701 61926 140550 -130567 -128366 82921 1116
179 1116 -163556 107 148560 -89091 -219874 102277 218394 -149135 -221271 160745
189 160745 192300 -154273 -131462 176395 122921 -122722 -31325 155564 22827 -109995 74772
$$ packed form
116B7697k54019K75548O4939j93726J21137Q2824l17135k0329M62542m566n67945
127c23033j9019O00289M3569n97812p4692N52633P2053m66564j5260L48759o3730
138E7193j84650J56065L1758k30409R4500L22008j45131l84030J82867M47495
148C47666j90585m71095J96095M57710j86253l77255J90241K54812j89014j12261
158g9939J72472l0013j73949J30869J86113k19201k29677K83457K53317l49199
168e5750k70538L60366K30719l53363j67135L17627P8624k71117K201K11287q1805
179A116j64672J63663J48453k37651j30783L22151J16117l67529p2136L82016
189A60745L1555l46573K2811L07857n3474k45643R1397J86889j32737j32822J84767
$$ plain form
200 74772 161454 -73663 -106132 162584 124236 -159890 -67302 189999 49163 -173531 -11585
211 -11585 161905 -27675 -162922 48232 132492 -113854 -156519 107956 96133 -173369 -98877
222 -98877 154946 21444 -195509 -25902 139542 -44493 -149318 57550 118487 -111918
232 -111918 -120771 144893 109300 -169720 -79308 202977 74693 -179918 -18045 199542 30615
243 30615 -129537 31025 124597 -27972 -53272 102434 56531 -115168 106 179068 -15296
254 -15296 -204262 40176 219190 -53174 -221409 38802 177064 -57098 -164173 26602
264 26602 84601 -66012 -62771 50060 -30557 -105446 67456 110955 -142230 -159054 151257
275 151257 162588 -162489 -167488 154366 166489 -124321 -134113 109978 110900 -61904 -28355 63317
$$ packed form
200G4772Q6682k35117l2469K68716l8348k84126R2588K57301j40836k22694J61946
211a1585J73490j89580j35247K11154Q4260k46346m2665K64475j1823k69502P4492
222i8877K53823j33502k16953J69607J65444j84035j04825K06868O0937k30405
232a11918q853K65664l5593k79020R0412K82285j28284k54611J61873K17587j68927
243C0615j60152J60562R3572j52569k5300J55706m5903j71699J15274J78962j94364
254a5296j88966K44438J79014k72364j68235K60211J38262k34162j07075J90775
264B6602N7999j50613L241J12831q0617p4889J72902M3499k53185j6824L10311
275A51257J1331l25077m999L21854J2123k90810r792K44091R22j72804L3549R1672
$$ plain form
287 63317 -23277 -27491 123761 48655 -165353 -35637 225718 68896 -228112 -75575 238055
298 238055 102768 -208893 -104720 163197 81544 -114707 -50365 46575 -13490 -5267 58457
309 58457 -54610 -138565 56599 173903 -72769 -229779 36967 230982 -27997 -235336
319 -235336 -5436 187877 9575 -134575 -15144 61743 9478 24071 23698 -87666 -58069
330 -58069 148459 122344 -158990 -153361 179424 204965 -149957 -205843 130897 206213 -76497
341 -76497 -158604 37535 102512 3929 -23717 -21077 -59368 9041 123184 3337 -190118
352 -190118 -44758 219646 74378 -235600 -116830 201478 123156 -163835 -129731 97073
362 97073 102424 -35979 -61435 -22285 973 64129 72022 -86236 -139353 91615 202346 -67532
$$ packed form
287F3317q6594m214J51252p5106k14008J29716K61355j56822k97008J52537L13630
298B38055j35287l11661J04173K67917q1653j96251O4342R6940o0065Q223O3724
309E8457j13067q3955J95164J17304k46672j57010K66746J94015k58979k07339
319b35336K29900J93313j78302j44150J19431P6887n2265J4593l73j11364K9597
330e8069K06528k6115k81334N629L32785K5541l54922n5886L36740P5316k82710
341g6497q2107J96139O4977r8583k7646K640l8291O8409J14143j19847j93455
352a90118J45360K64404j45268l09978J18770L18308p8322k86991L4104K26804
362I7073N351j38403k5456L9150K3258O3156P893j58258n3117K30968J10731k69878
$$ plain form
374 -67532 -228700 41289 235517 -4259 -214253 -28026 171953 56334 -102232 -57143
384 -57143 28405 38618 45775 308 -105880 -47633 148442 100402 -163467 -142090 158606
395 158606 173987 -130797 -184787 89644 171576 -42243 -129567 7860 72408 15941 -7129
406 -7129 -28444 -63692 21054 124424 -391 -166555 -29296 184994 58499 -183682 -85518
417 -85518 160350 97386 -123461 -93155 74688 69940 -26434 -36581 -22416 -15870 48333 64646
429 64646 -64883 -110287 62686 139855 -56266 -160835 34453 157197 -14763 -137720
439 -137720 2291 103425 7105 -51668 3206 8715 -12772 41490 44687 -64913 -59613 97148
451 97148 93273 -98295 -104910 100158 115816 -83206 -104143 67612 85351 -51020 -58783 28020
$$ packed form
374f7532j61168K69989J94228k39776k09994J86227J99979j15619j58566M5089
384e7143Q5548J0213P157m5467j06188N8247J96075m8040k63869K1377L00696
395A58606J5381l04784n3990K74431Q1932k13819q7324J37427O4548n6467k3070
406g129k1315l5248Q4746J03370j24815j66164J37259K14290j26495k42181R8164
417h5518K45868o2964k20847L0306J67843m748r6374j0147J4165O546O4203J6313
429F4646j29529m5404J72973P7169j96121j04569J95288J22744j71960j22957
439a37720J40011J01134r6320n8773N4874N509k1487N4262L197j09600N300J56761
451I7148l875j91568o615K05068J5658j99022k0937J71755J7739j36371p763Q6803
$$ plain form
463 28020 14075 -28647 13135 13444 -61122 -28358 77690 21181 -107484 -40418 100141 31283
475 31283 -104902 -34256 88181 23443 -70260 -7833 50326 -9328 -24967 41011 18998 -53475
487 -53475 6395 87287 -739 -83514 23363 102496 -13471 -85939 32232 88770 -25552
498 -25552 -61963 42131 47182 -48377 -27389 56408 7917 -67877 2938 66565 -27727 -79836
510 -79836 25131 59762 -50329 -66840 41784 36052 -66934 -36817 59286 6165 -78853
521 -78853 -3442 71967 -17859 -78179 25233 74266 -28697 -58901 39696 53401 -29930 -18594
533 -18594 51805 15854 -37128 27450 64416 -26262 -49414 61732 74105 -53832 -63245 68241
545 68241 69657 -56793 -56616 47887 36672 -42587 -24014 18714 -19053 -28363 30440 4579
$$ packed form
463B8020j3945m2722M1782L09p4566L2764J06048n6509j28665O7066J40559o8858
475C1283j36185P0646J22437o4738r3703O2427N8159n9654j5639O5978k2013p2473
487e3475N9870Q0892q8026q2775J06877P9133j15967p2468J18171N6538j14322
498b5552l6411J04094N051r5559K0988Q3797m8491p5794P0815O3627r4292n2109
510g9836J04967L4631j10091j6511J08624n732j02986L0117R6103n3121q5018
521g8853P5411P5409q9826o0320J03412M9033j02963l0204R8597J3705q3331J1336
533a8594P0399l5951n2982O4578L6966r0678k3152J11146J2373j27937r413J31486
545F8241J416j26450J77J04503j1215p9259J8573M2728l7767r310N8803k5861
$$ plain form
557 4579 -81948 -30735 81555 13915 -117723 -44977 102602 34989 -110383 -53500 80947
568 80947 43438 -60531 -33510 34827 18860 1987 21594 -9914 -35004 43066 88007 -23111
580 -23111 -89451 40538 128596 -3015 -106727 8618 113549 23901 -73009 -20345 47881
591 47881 26940 -3825 -16164 -38845 -9599 62735 23475 -98612 -69320 85497 73359 -103927
603 -103927 -115648 60800 94669 -59716 -108431 8539 62586 -3137 -42800 -26884 -10318
614 -10318 26193 50225 -19310 -83450 9308 120897 30182 -114046 -35144 129943 78982
625 78982 -81826 -60937 77547 84241 -13146 -41411 -233 34023 47791 17767 -52974 -50141
637 -50141 59043 85677 -54442 -121556 22600 116839 -15994 -132498 -34449 83398 27058
$$ packed form
557D579q6527N1213J12290o7640j31638P2746J47579o7613j45372N6883J34447
568H0947l7509j03969K7021O8337j5967j6873J9607l1508k5090P8070M4941j11118
580b3111o6340J29989Q8058j31611j03712J15345J04931q9648r6910N2664O8226
591D7881k0941l0765j2339k2681K9246P2334l9260j22087K9292J54817j2138j77286
603a03927j1721J76448L3869j54385m8715J16970N4047o5723l9663J5916J6566
614a0318L6511K4032o9535o4140R2758J11589r0715j44228P8902J65087n0961
625G8982j60808K0889J38484O694r7387k8265M1178L4256J3768l0024p0741K833
637e0141J09184K6634j40119o7114J44156R4239j32833j16504R8049J17847n6340
$$ plain form
648 27058 -76736 -64846 6205 33654 13005 -39399 -72426 -6925 84510 29317 -105067 -68000
660 -68000 100006 96877 -74948 -100708 58019 114242 -5650 -74919 -2174 66628 49267
671 49267 2335 -31633 -21920 52917 87269 -14527 -98896 5902 128330 33829 -119160
682 -119160 -55979 102895 71440 -79375 -88189 28994 63531 -9518 -62387 -48147 3658
693 3658 46242 8219 -83811 -72615 54242 78354 -60996 -116572 21038 108098 -4418
704 -4418 -103995 -22931 79306 43908 -33170 -34424 8902 45648 51604 -3304 -55885 5516
716 5516 102558 51019 -80056 -50652 97210 91972 -59056 -81805 48575 84995 -17034
727 -17034 -63640 -5897 32437 14858 -10802 -37186 -40874 12830 46355 -24601 -90821 -15964
$$ packed form
648B7058j03794J1890P1051K7449k0649n2404l3027O5501R1435n5193j34384L7067
660f8000J68006l129j71825k5760J58727N6223j19892o9269P2745O8802j7361
671D9267m6932l3968R713P4837L4352j01796q4369J04798J22428r4501j52989
682a19160O3181J58874l1455j50815q814J17183L4537p3049n2869J4240N1805
693C658M2584l8023r2030J1196J26857K4112j39350n5576J37610Q7060j12516
704d418r9577Q1064J02237l5398p7078j254M3326L6746N956n4908n2581O1401
716E516R7042n1539j31075K9404J47862n238j51028k2749J30380L6420j02029
727a7034m6606N7743L8334j7579k5660k6384l688N3704L3525p0956o6220P4857
$$ plain form
739 -15964 74584 6200 -98707 -42887 65448 31581 -61560 -45443 25711 28636 -5482 -12930
751 -12930 -11856 -3082 32404 36164 -24256 -38771 44200 75476 -16638 -60298 30346 80675 1624
764 1624 -46908 13649 51453 7854 -16531 6780 6982 -6533 14644 16201 -31812 -32315 32143
777 32143 29033 -50362 -50830 29584 27932 -50491 -48990 20828 18071 -37445 -28362 12339 -5820
790 -5820 -29243 4136 17895 -23722 -22641 30526 23075 -30183 -13037 42990 24036 -26396 -1509
803 -1509 43573 18060 -15673 15072 35327 -2240 -12169 27912 26430 -17095 -7353 31178 11770
816 11770 -25320 -4554 21376 -6984 -25995 6248 10903 -28581 -23568 22394 3864 -48612
828 -48612 -23364 32012 1773 -51279 -19325 33654 5516 -38181 -13717 19253 59 -14144
$$ packed form
739a5964R0548o8384j04907N5820J08335l3867r3141J6117P1154K925l4118p448
751a2930J074Q774L5486L760o0420j4515Q2971L1276r2114m3660R0644N0329p9051
764A624m8532O0557L7804m3599k4385K3311K02j3515K1177J557m8013n03O4458
777C2143l110p9395m68Q0414j652p8423J501O9818k757n5516R083M0701j8159
790e820k3423L3379J3759m1617J081N3167p451n3258J7146N6027j8954n0432K4887
803a509M5082k5513l3733L0745K0255l7567r929M0081j482m3525R742L8531j9408
816A1770l7090K0766K5930k8360j9011L2243M655l9484N013M5962j8530n2476
828d8612K5248N5376l0239n3052L1954N2979k8138m3697K4464L2970j9194j4203
$$ plain form
840 -14144 7758 6473 -14301 8731 35941 -1751 -33034 16982 56347 1616 -42448 9958
852 9958 58930 17062 -30024 -4756 31025 18016 -3823 -5651 -6403 5286 27908 6375 -42480
865 -42480 -24909 40581 28392 -51635 -53395 28680 42873 -32510 -57292 1034 30949 -4864
877 -4864 -33551 -23548 -2311 17838 17668 -22506 -42989 12474 57438 272 -63812 -10134 73461
890 73461 36988 -51555 -33674 48338 52239 -11265 -32402 2871 32688 29881 -159 -30393
902 -30393 -9851 46316 39290 -40836 -58775 28307 70399 -12520 -74814 -10776 58580 17301
914 17301 -52517 -41189 16051 32569 -1940 -40027 -35199 16749 45925 -7257 -67362 -24001
926 -24001 61082 38191 -56319 -53023 42210 62243 -16835 -54490 -2625 44683 28211 -12464
$$ packed form
840a4144K1902j285k0774K3032K7210l7692l1283N0016L9365n4731m4064N2406
852I958M8972m1868m7086K5268L5781j3009k1839j828p52J1689K2622k1533m8855
865d2480J7571O5490j2189q0027j760Q2075J4193p5383k4782N8326K9915l5813
877d864k8687J0003K1237K0149j70m0174k0483N5463M4964n7166o4084N3678Q3595
890G3461l6473q8543J7881Q2012L901o3504k1137L5273K9817k807l0040l0234
902c0393K0542N6167p026q0126j7939Q7082M2092q2919o2294O4038O9356m1279
914A7301o9818J1328N7240J6518l4509l8087M828N1948K9176n3182o0105M3361
926b4001Q5083k2891r4510L296R5233K0033p9078l7655N1865M7308j6472m0675
$$ plain form
938 -12464 -27864 -2411 42522 40029 -26306 -52621 21867 76883 5908 -74107 -19468 73967
950 73967 41905 -52785 -49721 27933 46447 -7649 -41930 -19528 20751 32845 -5369 -52704
962 -52704 -30158 42449 42866 -42963 -67586 19421 67212 -6088 -68015 -17952 49318 28871
974 28871 -30098 -37076 5238 39504 27457 -22307 -44404 10006 63649 16490 -62766 -30303
986 -30303 66715 56303 -44917 -59242 29362 61922 -4651 -49128 -12658 31272 27689 -6763
998 -6763 -33375 -19995 29242 39232 -25198 -62491 4699 68348 11793 -69392 -31683 53804
1010 53804 37556 -41663 -45879 17819 40515 2579 -30061 -22543 11843 35961 8659 -42194
1022 -42194 -30527 39341 49472 -27026 -56512 16625 61312 252 -54630 -12912 43086 25471
$$ packed form
938a2464j5400K5453M4933k493o6335k6315P4488N5016p0975q0015N4639R3435
950G3967l2062r4690L064P7654J8514n4096l4281K2402M0279J2094l8214m7335
962e2704K2546P2607M17q5829k4623Q7007M7791p3300o1927N0063O7270k0447
974B8871n8969o978M2314L4266j2047m9764k2097N4410N3643m7159p9256L2463
986c0303R7018j0412j01220j4325Q8604L2560o6573m4477L6470M3930l583l4452
998f763k6612J3380M9237R990o4430l7293O7190O3649n6555q1185L7709Q5487
1010E3804j6248p9219m216O3698K2696l7936l2640P518L4386K4118k7302n0853
1022d2194J1667O9868J0131p6498k9486P3137M4687o1060n4882M1718N5998j7615
$$ plain form
1034 25471 -20120 -24122 2855 22897 17605 -13300 -32064 1713 42836 13838 -45588 -27292
1046 -27292 42600 36434 -34256 -41596 19524 35860 -9932 -28703 577 17658 6440 -4403
1058 -4403 -12024 -12272 10288 26134 -3213 -34072 -3680 38175 10411 -36728 -15469 32034 18261
1071 18261 -24812 -18859 15416 15501 -6195 -10134 -3680 -1524 5607 7291 -9583 -14486 9874 17982
1085 17982 -10236 -21984 6727 20592 -4319 -15607 6024 13353 -5387 -5965 9670 4122 -8069
1098 -8069 3279 13005 -4055 -11157 9932 15612 -7760 -12794 8180 9530 -9654 -6521 12459
1111 12459 3039 -16564 -3309 13745 -3143 -17862 865 13858 -4452 -17289 -1256 10467
1123 10467 -1075 -9406 -2779 -798 -1551 5209 3211 -11597 -6515 16118 9915 -17815 -13199 18995
$$ packed form
1034B5471m5591m002K6977K0042n292l0905j8764L3777M1123k8998n9426J8296
1046b7292O9892o166p0690p340O1120J6336m5792j8771K9280J7081j1218j0843
1058d403p621k48K2560J5846k9347l0859L0392M1855k7764m7139K1259M7503j3773
1071A8261m3073N953L4275Q5k1696l939O454K156P131J684j6874m903K4360Q108
1085A7982k8218j1748K8711J3865k4911j1288K1631P329j8740n78J5635n548j2191
1098h069J1348R726j7060p102K1089N680k3372n034K0974J350j9184L133J8980
1111A2459r420j9603J3255J7054j6888j4719J8727J2993j8310j2837J6033J1723
1123A0467j1542q331O627J981p53O760j998j4808N082K2633o203k7730M616L2194
$$ plain form
1137 18995 20049 -9772 -15705 9320 18808 1073 -9205 -727 7603 11992 8368 -9230 -14118
1150 -14118 12819 26779 -5711 -30399 -1262 30672 7939 -29162 -15728 20944 15059 -18267
1162 -18267 -22851 -1520 11451 7636 -9791 -24791 -9014 22277 13503 -28464 -30196 18414 35514
1175 35514 -11821 -40834 2010 41289 11565 -29821 -16974 20569 28053 3321 -19676 -9423
1187 -9423 24897 31679 -7138 -33515 634 44534 21346 -34960 -27406 31165 36684 -16933 -37209
1200 -37209 -174 28352 12220 -22410 -30061 1071 29858 9754 -37182 -37996 17780 41561
1212 41561 -14898 -56894 -5228 50427 12118 -49238 -30117 29416 34270 -11747 -34296 -4895
1224 -4895 30306 24532 -10541 -29065 -583 41330 26425 -31190 -31369 34964 52243 -10018 -44438
$$ packed form
1137A8995J054k9821n933K5025R488j7735j0278Q478Q330M389l624j7598m888
1150a4118K6937J3960l2490k4688K9137L1934k2733l7101J3434L6672n885l3326
1162a8267m584K1331J2971l815j7427j5000J5777L1291q774m1967j732M8610J7100
1175C5514m7335k9013M2844L9279k9724m1386J2847L7543P484k4732k2997J0253
1187i423L4320O782l8817k6377L4149M3900k3188n6306P554N8571N519n3617k0276
1200c7209L7035K8526j6132l4630p651L1132K8787k0104m6936q14N5776K3781
1212D1561n6459m1996N1666N5655l8309o1356J9121N9533M854m6017k2549K9401
1224d895L5201n774l5073j8524K8482M1913j4905n7615j79O6333J7279o2261l4420
$$ plain form
1237 -44438 1089 46321 20904 -29347 -25690 19296 33749 1297 -31758 -24458 17605 34909
1249 34909 -11650 -52502 -12172 43771 16644 -46884 -39982 21947 34821 -19088 -46995 -6349
1261 -6349 31590 14710 -20514 -27971 -3018 29072 21059 -25016 -31103 22715 48546 -102 -41589
1274 -41589 -4908 50120 29589 -30925 -26309 28807 39849 896 -22911 -8289 20203 27089
1286 27089 -4117 -32752 -9725 32813 24286 -27770 -41171 10075 39908 -7528 -50435 -14641
1298 -14641 31782 13948 -28325 -32263 -480 23556 5985 -29868 -28476 11153 30940 -31
1310 -31 -35401 -14370 35402 27421 -27794 -29969 23069 39116 1957 -21993 -3765 25671 25878
1323 25878 -2137 -17431 648 26500 23854 -9818 -26345 9649 40328 3184 -40228 -13668
$$ packed form
1237d4438M5527M5232k5417n0251L657M4986J4453l2452l3055P300M2063J7304
1249C4909m6559m0852M0330N5943k7127o3528O902O1929J2874n3909k7907M0646
1261f349L7939j6880l5224p457K4953L2090q013m6075o087N3818K5831m8648m1487
1274d1589L6681N5028k0531o0514M616N5116J1042l8953k3807J4622K8492O886
1286B7089l1206k8635K3027M2538q527n2056j3401N1246K9833m7436m2907L5794
1298a4641M6423j7834m2273l938L1783K4036j7571l5853J392L9629J9787l0971
1310c1l5370K1031M9772p981n5215k175N3038J6047l7159k3950J8228K9436K07
1323B5878k8015j5294J8079K5852k646l3672j6527L5994L0679l7144m3412K6560
$$ plain form
1335 -13668 31071 18539 -24600 -29292 5696 21875 -6076 -31234 -16489 7905 9768 -8121
1347 -8121 -25922 -15105 15901 14085 -21833 -25941 8689 22195 -1718 -20508 -4796 21134
1359 21134 17002 -8014 -10375 7057 16639 13649 333 -8070 9641 26519 6727 -16044 -687
1372 -687 22409 14255 -10246 -12294 10567 16500 -5498 -14135 146 3848 -4064 -4775 -7525 -9235
1386 -9235 167 1667 -11624 -14731 -4294 1378 -5051 -13394 -6731 5492 -1300 -11942 -1809 5155
1400 5155 -3503 -3176 5513 2742 -435 4410 6991 5721 3990 3398 6846 7093 4749 8901 7692 -200
1416 -200 6030 13334 -617 -7828 6708 11848 -2074 -9073 -2321 5950 1411 -10343 -10236 -1064
1430 -1064 -2548 -5737 -5435 -12143 -9887 6570 829 -21641 -15481 9938 10406 -12960 -19545 3562
$$ packed form
1335a3668M4739j2532m3139m692L4988J6179k7951k5158J4745K4394J863j7889
1347h121j7801J0817L1006j816l5918m108L4630J3506k3913j8790J5712K5930
1359B1134m132k5016k361J7432R582k990j3316q403J7711J6878j9792k2771J5357
1372f87K3096q154k4501k048K2861N933k1998q637J4281L702p912p11k750j710
1386i235R402J500j3291l107J0437N672o429q343O663J2223o792j0642J0133O964
1400E155q658L27Q689k771l177M845K581j270j731n92L448K47k344M152j209p892
1416b00O230P304j3951p211J4536N140j3922o999O752Q271m539j1754J07R172
1430a064j484l189L02o708K256J6457n741k2470O160K5419M68k3366o585K3107
$$ plain form
1444 3562 19099 -126 -18542 -1743 17044 9673 -1993 -3808 1489 15488 17467 -3099 -11238
1457 -11238 9455 24127 8734 -14105 -7623 21741 21793 -11351 -18902 6868 17333 3196 -12332
1470 -12332 -14720 1857 16655 -420 -26498 -16876 13931 16410 -17489 -35424 -1795 29302
1482 29302 515 -36609 -16004 20357 13890 -14258 -21267 -1120 20107 13045 -13237 -18088 6793
1495 6793 27810 13306 -20886 -17330 27349 36152 -10812 -29697 10434 37487 12072 -22737
1507 -22737 -15866 20234 28935 -3726 -25949 -7821 20556 18891 -14981 -34419 -1226 34073
1519 34073 5611 -40279 -25460 22083 23819 -18732 -37683 -3944 28389 7915 -28335 -23518
1531 -23518 9458 25056 3553 -28838 -19741 25991 33081 -13875 -34343 6264 40141 13990
$$ packed form
1444C562J5537j9225j8416J6799J8787p371j1666j815N297J3999J979k0566q139
1457a1238K0693J4672j5393k2839O482K9364N2l3144p551K5770J0465j4137j5528
1470a2332k388J6577J4798j7075k6078R622L0807K479l3899j7935L3629L1097
1482B9302k8787l7124K0605L6361o467k8148p009K0147K1227p062k6282m851K4881
1495F793K1017j4504l4192L556M4679Q803m6964j8885M0131K7053k5415l4809
1507b2737O871L6100Q701l2661k2223J8128K8377j665l3872j9438L3193L5299
1519C4073k8462m5890J4819M7543J736m2551j8951L3739L2333k0474l6250M817
1531b3518L2976J5598k1503l2391R097M5732P090m6956k0468M0607L3877k6151
$$ plain form
1543 13990 -28917 -18728 28801 33692 -8404 -25733 1678 27061 18913 -11946 -24745 4768
1555 4768 33218 9757 -30010 -21861 21257 30006 -12777 -39711 -3724 34117 8937 -32961
1567 -32961 -24093 13717 22882 -5909 -31084 -14705 21077 19524 -17265 -29689 687 28756
1579 28756 10767 -26311 -21044 21184 29103 -7500 -24624 -407 25263 17932 -10998 -20234 7085
1592 7085 29195 10608 -20070 -15757 18386 29604 -5049 -30953 -2642 31761 12138 -25640
1604 -25640 -20298 13261 22094 -4687 -26690 -10439 17538 13241 -13669 -23368 -2592 19537 8834
1617 8834 -22249 -21242 12541 22346 -6347 -24052 -5265 19790 14587 -12557 -18853 5993 22386
1630 22386 6156 -16250 -12012 13937 23220 -2847 -22650 -875 24989 11020 -16582 -13641
$$ packed form
1543A3990m2907J0189M7529M891m2096j7329K7411K5383q148l0859j2799K9513
1555D768K8450k3461l9767Q149M3118Q749m2783k6934L5987L7841k5180m1898
1567c2961Q868L7810R165k8791k5175J6379L5782j553l6789j2424L0376K8069
1579B8756j7989l7078N267M2228P919l6603j7124K4217K5670p331k8930r236K7319
1592G085K2110j8587l0678M313L4143J1218l4653k5904K8311L4403j9623l7778
1604b5640N342L3559Q833k6781k2003J6251K7977m297k6910r699K0776K2129j0703
1617H834l1083J007L3783R805k8693j7705J8787K5055n203k7144o296K4846J6393
1630B2386j6230k2406M238K5949R283k6067j9803K1775K5864j3969k7602K941
$$ plain form
1642 -13641 11228 19010 -1703 -17748 -4866 13899 10461 -7561 -14943 -2165 14398 8256 -15833
1655 -15833 -15642 9845 16157 -6641 -19550 -3053 14978 5269 -14196 -11069 6974 9755 -2174
1668 -2174 -8787 -4418 5340 9301 -1456 -11029 -985 12432 6456 -7997 -7083 7145 10793 -2347
1682 -2347 -8444 2030 8683 2510 -2965 -2500 478 3718 2915 -4015 -4901 3040 5605 -2346 -6933
1697 -6933 516 6231 -1250 -7738 679 6488 -2941 -6454 3508 5358 -4421 -5308 3514 4933 -3134
1712 -3134 -4609 3040 4843 -1299 -2961 885 -117 -395 3212 314 -5944 -780 7742 1801 -9098
1727 -9098 -4754 8028 6768 -7375 -8699 4330 9202 -396 -7813 -3427 4586 7122 -583 -9633
1741 -9633 -3358 12040 9468 -9553 -12927 6572 16901 -1344 -16639 -2437 16111 7641 -10929
$$ packed form
1642a3641K4869P782k0713j6045J2882J8765l438j8022p382J2778J6563o142k4089
1655a5833J91K5487O312k2798j2909J6497J8031r709j9465L127J8043K781j1929
1668b174o613M369R758L961j0757r573J0044J3417n976j4453R14J4228L648j3140
1682b347o097J0474O653o173n475M65K978L240q03o930q86P941K565p951m587
1697f933P449N715p481o488Q417N809r429l513R962J850r779q87Q822J419q067
1712c134j475P649J803o142j662L846j002k78L607k898o258N164Q522n941j0899
1727i098M344J2782j260j4143j324J3029M872r598p417M386Q013K536p705r050
1741i633O275J5398k572j9021l374J9499J0329j8245j5295J4202J8548q470j8570
$$ plain form
1754 -10929 -9951 4719 10791 2118 -9308 -8523 5331 13584 758 -16458 -8561 14768 13546 -13529
1768 -13529 -20334 6589 21291 -781 -21062 -8606 13968 11720 -8840 -16542 -260 15432
1780 15432 8510 -12528 -16241 6609 21239 1928 -22060 -9461 21368 19034 -12264 -20163 6985
1793 6985 24077 5340 -18988 -10883 15734 20757 -3275 -20780 -5115 21108 15700 -15967 -23157
1806 -23157 7043 25874 1119 -26448 -13448 18453 17382 -13650 -25450 -1349 20416 7925
1818 7925 -18870 -20304 7461 22985 -84 -27287 -12991 22910 22381 -15035 -27833 6744 31386
1831 31386 6793 -25540 -13806 22059 24600 -7843 -23243 932 27477 14768 -17654 -20368
1843 -20368 11268 27567 2544 -25344 -11266 21461 19947 -13186 -26309 508 24123 7626
$$ packed form
1754a0929R78J4670O072q673j1426P85J3854Q253j2826j7216P897K3329j222k7075
1768a3529o805K6923J4702k2072k0281J2456K2574k248k0560p702J6282J5692
1780A5432o922k1038l713K2850J4630j9311k3988J2599L0829k334l1298p899K7148
1793F985J7092j8737k4328Q105K6617N023k4032j7505J5665K6223n408l1667p190
1806b3157L0200J8831k4755k7567J3000L1901j071l1032j1800K4101K1765j2491
1818G925k6795j434K7765J5524k3069k7203J4296L5901n29l7416j2798L4577K4642
1831C1386k4593l2333J1734L5865K541l2443j5400K4175K6545j2709l2422k714
1843b0368L1636J6299k5023k7888J4078L2727j514l3133j3123K6817K3615j6497
$$ plain form
1855 7626 -22948 -20528 10710 22564 -4543 -29754 -12434 21072 16459 -19210 -27573 6070 26776
1868 26776 1773 -27108 -13764 18943 19964 -9776 -21818 1324 23696 12346 -14502 -15411
1880 -15411 12012 25994 3571 -20165 -7146 22533 21252 -9287 -19739 4369 23119 7120
1892 7120 -18094 -13560 11880 18470 -4174 -22322 -9136 15792 12147 -15298 -23191 1203 18217
1905 18217 230 -22645 -13681 11673 12741 -9544 -19458 -2926 14715 8564 -10594 -14415 4443
1918 4443 18605 4449 -15504 -7884 17307 18743 -5603 -15392 5479 21338 7470 -10851 -5744
1931 -5744 11984 14099 -173 -9791 -2536 10541 10577 -4755 -14391 -1996 13411 5800 -14605 -14300
1945 -14300 5464 10408 -7636 -17729 -4680 9171 2194 -12443 -12977 367 8146 9 -11825
$$ packed form
1855G626l0574K420L1238J1854k7107k5211J7320L3506m613l5669q363L3643K0706
1868B6776k5003k8881J3344L2707J021k9740j2042K3142K2372j1350k6848r09
1880a5411K7423J3982k2423k3736J3019K9679j281l0539j0452K4108J8750j5999
1892G120k5214M534K5440O590k2644j8148J3186K4928l645k7445p893K4394J7014
1905A8217j7987k2875Q964K5354J068k2285r914J6532J7641o151j9158l821J8858
1918D443J4162j4156j9953P620K5191J436k4346r789K0871J5859j3868j8321N107
1931e744J7728K115j4272r618P255J3077L6j5332r636J2395J5407p611k0405L05
1945a4300J9764M944j8044j0093J3049J3851o977j4637n34J3344P779q137j1834
$$ plain form
1958 -11825 -8667 6727 10198 -3689 -11401 1349 13385 5208 -7385 -2687 10224 10240 710 -1605
1972 -1605 3629 7253 6498 2610 -1480 1023 8379 7398 -3195 -7012 3415 9069 -1715 -9964 -2560
1987 -2560 5476 -1446 -9368 -4778 1150 -2024 -7234 -5849 -2892 -2998 -3333 -2603 -3360 -4534 -2287 -458
2003 -458 -1723 -1614 1011 1047 -582 1577 4180 1901 -490 3971 7752 3484 -1064 3609 9001 5821
2019 5821 -367 472 5367 5559 1849 -700 -292 3871 5570 -621 -7818 -4065 5557 3960 -8708
2034 -8708 -10857 1514 6410 -5891 -14229 -5164 5108 548 -10765 -11150 -604 6432 730 -9348
2048 -9348 -8714 3427 9515 -814 -11241 -1739 14722 10826 -7541 -9122 9641 18219 3027
2061 3027 -10374 -1012 15945 14218 -3596 -9643 4429 16061 6328 -11338 -9989 8639 14841
$$ packed form
1958a1825L158J5394L471j3887p712J2750J2036q177j2593M698J2911J6r530k315
1972a605N234L624p55l888m090K503P356r81j0593l817J0427N654j0784q249P404
1987b560Q036o922p922M590N928l174n210J385K957j06l35P30p57j174K247J829
2003d58j265J09K625L6j629K159K603k279k391M461L781m268m548M673N392l180
2019E821o188Q39M895J92l710k549M08M163J699o191p197L753R622j597j2668
2034h708k149J2371M896j2301q338R065J0272m560j1313l85J0546P036n702j0078
2048i348O34J2141O088j0329j0427R502J6461l896j8367j581J8763Q578j5192
2061C027j3401R362J6957j727j7814o047J4072J1632r733j7666J349J8628O202
$$ plain form
2074 14841 -2749 -16775 -5826 11146 6610 -13161 -17514 242 12700 259 -18469 -14711
2086 -14711 6642 12647 -6844 -21843 -6603 16128 9663 -15160 -16257 8786 20347 -399
2098 -399 -19388 -5480 19558 17169 -6903 -14383 5533 21901 9130 -12832 -9845 14106 21613
2111 21613 -38 -16860 -2755 19573 14573 -11518 -18974 3980 20094 3939 -20226 -14655
2123 -14655 11919 16854 -9458 -27433 -7100 19242 8668 -21348 -22045 7582 19697 -4434
2135 -4434 -24979 -9508 17461 14242 -12405 -20018 3416 22804 9448 -16823 -14503 13893 23974
2148 23974 -538 -19378 -1343 25524 16753 -14106 -17481 11051 25533 3141 -19422 -8614
2160 -8614 17038 17983 -7859 -21360 -2060 18893 8340 -19287 -19704 8447 20469 -3965 -25905
$$ packed form
2074A4841j7590j4026J0949J6972m536j9771m353J7756J2458j2441j8728L758
2086a4711K1353O005j9491j4999J5240K2731o465k4823j097K5043J1561k0746
2098c99j8989J3908K5038k389k4072p480J9916J6368j2771k1962K987K3951P507
2111B1613k1651j6822J4105K2328n000k6091p456K2954J6114j6155k4165N571
2123a4655K6574M935k6312j7975K0333K6342j0574l0016o97K9627J2115k4131
2135d434k0545J5471K6969l219k6647p613K3434J9388j3356k6271K320K8396J0081
2148B3974k4512j8840J8035K6867q771l0859l375K8532J4482k2392k2563J0808
2160h614K5652R45k5842j3501J9300K0953j0553k7627m17K8151J2022k4434k1940
$$ plain form
2173 -25905 -10538 15849 11096 -16046 -21171 2685 18329 3293 -19591 -14520 11635 18100 -4401
2186 -4401 -20378 -3160 20918 13357 -13900 -15183 11840 22044 -340 -17404 -2755 18805
2198 18805 14725 -5929 -12373 2772 15421 6992 -10249 -11082 6996 16653 -6 -17512 -7796
2211 -7796 14425 11009 -12844 -18282 2236 14532 -119 -17023 -9696 7893 8590 -7658 -15447
2224 -15447 -3630 10617 6773 -9265 -11733 4342 12898 734 -11891 -4001 11474 10296 -3923
2237 -3923 -8065 3039 12023 5728 -4643 -5442 4561 11266 3660 -7324 -3979 9236 9376 -5329
2251 -5329 -11371 1472 11370 1887 -10418 -5774 5575 4962 -4848 -8241 -2067 3305 1270 -4852
2265 -4852 -6633 -772 4737 1188 -6959 -6449 3020 6090 -2011 -6699 535 6105 2327 -3969 -2428
$$ packed form
2173b5905J5367K6387m753k7142n125K3856J5644j5036k2884N071K6155O465k2501
2186d401j5977J7218K4078p561k7257j283K7023J0204k2384j7064J4649K1560
2198A8805m080k0654o444J5145J2649q429j7241q33J8078R657j6659j7506R716
2211g796K2221l416k3853n438K0518J2296j4651j6904P327J7589O97j6248p789
2224a5447J1817J4247l844j6038k468J6075Q556j2164j2625P890J5475j178j4219
2237c923m142J1104Q984o295j0371p99J0003O705p606j0984L345J3215J40j4705
2251e329o042J2843R898r483j2305M644J1349o13r810l393O174N372k035o122
2265d852j781N861N509l549q147N10R469L070q101m688P234N570l778o296J541
$$ plain form
2280 -2428 3167 4637 985 -1884 45 3406 3950 851 -1682 768 3759 2125 -1483 -1299 2749
2295 2749 2762 -581 -1785 -817 -112 -586 -312 -133 -1123 -1601 -1126 -967 -1452 -1722 -1399 -1402 -653 -532 -1868 -2025
2315 -2025 453 2245 -993 -4522 -981 4423 3223 -3309 -3400 4011 6023 -1105 -5594 301 7259
2330 7259 3795 -3650 -3787 3467 6325 456 -5566 -2330 4964 5099 -2673 -6643 -174 7075 4061
2345 4061 -6187 -7847 2462 8505 676 -9242 -4945 8219 7677 -6582 -11551 1761 12319 2760
2359 2760 -11827 -7587 8675 10436 -4660 -12054 -688 11193 5168 -8974 -9175 4968 12358
2372 12358 555 -12382 -6236 9870 10332 -5743 -12377 1134 13681 4775 -11861 -9851 7550
2385 7550 13263 -1652 -14002 -4371 12637 10230 -8790 -14273 3179 15996 3173 -15414 -9224
$$ packed form
2280b428N595J470l652k869J929L361N44l099k533K450K991j634l608J84M048
2295B749J3l343j204R68P05m74K74J79r90m78M75J59m85k70L23lP49J21j336j57
2315b025K478J792l238l529L541N404j200o532r1P411K012p128m489N895O958
2330G259l464p445j37P254K858n869o022L236P294J35p772l970O469P249l014
2345D061j0248j660J0309O043p829r918M297J3164n42j4259m969J3312J0558r559
2359B760j4587M240J6262J761j5096p394J1366J1881o025j4142k01J4143P390
2372A2358j1803j2937O146J6106M62j6075o634J3511J2547q906j6636K010J7401
2385G550N713j4915j2350R631J7008k407j9020n483J7452J2817j2823j8587O190
$$ plain form
2398 -9224 12405 14193 -6248 -16047 -664 14717 7159 -10901 -11317 6036 14786 958 -15266
2411 -15266 -8039 12137 13750 -7281 -17752 582 17724 5837 -15962 -12486 10077 14552 -4807
2424 -4807 -17097 -2923 14392 9308 -10333 -14461 2564 15741 4473 -14759 -10319 11484 17107
2437 17107 -4265 -18215 -1705 19104 10107 -13387 -13893 8843 18862 610 -16333 -6815 14265
2450 14265 13692 -7903 -17244 1474 18370 6453 -16582 -13706 9937 16078 -5223 -18812 -3548
2463 -3548 14847 7969 -12278 -14844 3443 14507 1943 -15057 -10723 9823 15083 -4158 -18063
2476 -18063 -2931 17695 9575 -14353 -14049 10172 18950 -1105 -16677 -3503 16052 11624 -8510
2489 -8510 -12502 4651 15849 4792 -11729 -8589 9797 14324 -3008 -14942 -2952 13455 8219
$$ packed form
2398i224K1629J788k0441r799J5383J5381p558j8060m16J7353Q750j3828j6224
2411a5266P227K0176J613k1031j0471J8334J7142j1887k1799L476K2563M475j9359
2424d807j2290J4174J7315n084j9641m128J7025J3177j1268j9232M440K1803N623
2437A7107k1372j3950J6510K0809q997k3494n06K2736J0019j8252j6943R518K1080
2450A4265n73k1595r341J8718J6896j1917k3035K876K3643O141k1301j3589J5264
2463c548J8395o878k0247k566J8287J1064j2564j7000M334K0546N260j9241j3905
2476a8063J5132K0626q120k3928L04K4221Q778k0055j5572J3174J9555m428k0134
2489h510l992J7153J1198j1057j6521L140J8386M527j7332j1934J1990J6407n236
$$ plain form
2502 8219 -10579 -12454 4160 12327 -1218 -14792 -7427 8312 8353 -6650 -14203 -1905 10664
2515 10664 4066 -11543 -10244 5663 11124 -1875 -12016 -2393 11676 7283 -6814 -7594 4187
2528 4187 11249 3783 -6099 -3509 7399 9526 -282 -7071 -450 9243 7012 -4657 -7018 3808
2542 3808 9357 34 -8293 -3614 5068 4074 -4519 -7500 -932 4143 240 -6258 -5724 -403 2793
2557 2793 -1010 -6098 -4034 2477 2562 -3001 -5277 -870 4125 2660 -3530 -2973 3607 5346 680 -2154
2573 -2154 622 4787 4487 294 -429 3346 4615 2111 439 677 1658 3027 1608 -441 -111 637
2589 637 480 142 -1574 -2830 -682 53 -2309 -3659 -2626 -1783 -1162 -2363 -4146 -2872 -961 -1336 -2363
2606 -2363 -1926 -1688 -492 533 -463 -1221 -357 1376 3102 1919 -1690 487 6269 5033 -1083 -1135 4928
$$ packed form
2502H219j8798j875J6614Q167j3545j3574P365J5739M1j5003p553J2298J2569
2515A0664o598j5609J299J5907N461j2999j0141R623J4069m393j4097p80J1781
2528D187P062p466r882K590J0908K127r808o789O621R693k231j1669k361J0826
2542C808N549r323q327M679Q682r94q593k981O568N075l903o498N34N321L196
2557B793l803n088K064O511Q5n563k276M407M995j465o190N57O580J739m666k834
2573b154K776M165l00m193p23L775J269k504j672K38R81J369j419k049L30P48
2589F37j57l38j716j256K148P35k362j350J033Q43O21j201j783J274J911l75j027
2606b363M37K38J196J025r96p58Q64J733J726j183l609K177N782j236o116n2O063
$$ plain form
2623 4928 7292 1948 -3115 535 7241 4415 -2973 -2867 2239 4502 1273 -3934 -4382 1774 4072
2638 4072 -2502 -7918 -4094 3005 2986 -6377 -9950 -779 6110 -1284 -10169 -5844 3707 4808 -3250
2653 -3250 -9224 -1502 8106 4021 -6191 -6455 4044 10735 2730 -8129 -2839 11553 10546 -3639
2667 -3639 -7171 4354 13096 5852 -6849 -5534 8218 11656 -1000 -9764 -2582 9950 8139 -7681
2681 -7681 -12970 2002 12036 -673 -14700 -8778 7216 8060 -8051 -15356 -1828 9678 1677
2694 1677 -11512 -10000 2805 10027 475 -12885 -6400 11014 11070 -5772 -12219 1890 16682 7667
2708 7667 -11223 -7723 12912 15678 -1806 -11449 398 14978 10491 -7428 -10765 6190 15230
2721 15230 1753 -12592 -8115 9022 11814 -6295 -16163 -1512 12625 3394 -12880 -12627 2785
$$ packed form
2623D928K364n344n063L650O706k826p388J06N106K263l229n207m48O156K298
2638D072o574n416L824P099j9r363l573R171O889p394q885M325R551J101q058
2653c250n974P722R608m085j0212k64J0499O691q005j0859N290J4392j007j4185
2667c639l532J1525Q742p244j2701J315J3752L438j2656q764P182J2532j811j5820
2681g681n289J4972J0034j2709j4027N922J5994Q44j6111p305J3528J1506q001
2694A677j3189J512J2805P222r552j3360O485J7414N6j6842o447J4109J4792r015
2708G667j8890L500K0635K766j7484r643J1847J4580m487j7919l337J6955R040
2721A5230j3477j4345M477J7137K792j8109r868J4651J4137r231j6274K53J5412
$$ plain form
2734 2785 11333 -1987 -16430 -8088 9364 8645 -8362 -15428 -1475 14092 5801 -14529 -11178
2747 -11178 10829 14861 -2983 -13519 -1125 15700 10494 -8426 -9822 8005 15794 3358 -9762
2760 -9762 -5419 10937 14392 -2644 -13585 -113 14662 7021 -10443 -12177 4904 14062 -1713
2773 -1713 -17110 -6478 10595 7279 -9487 -15449 -1137 11745 1827 -14971 -10753 6707 9915
2786 9915 -4137 -14127 -3978 12075 8421 -9823 -10922 6336 13476 1926 -9728 -4760 11735
2799 11735 12744 -3691 -10303 3151 13885 6323 -7653 -7283 7281 13007 -793 -11365 -1474
2812 -1474 10506 6043 -6827 -10094 1443 10114 140 -11557 -6425 4827 5332 -4270 -10369 -3836
2826 -3836 6531 3187 -8728 -8654 2615 7027 -554 -9005 -5013 7311 7197 -4965 -6889 3789
$$ packed form
2734B785Q548j3320j4443Q342J7452p19j7007p066J3953J5567q291k0330L351
2747a1178K2007M032j7844j0536J2394J6825n206j8920j396J7827P789j2436j3120
2760i762M343J6356L455j7036j0941J3472J4775p641j7464j734J7081R158j5775
2773a713j5397J0632J7073l316j6766n962J4312J2882r918j6798M218J7460L208
2786I915j4052r990J0149J6053l654j8244j099J7258P140j1550j1654M968J6495
2799A1735J009j6435o612J3454J0734p562j3976L70J4564N726j3800j0572R891
2812a474J1980m463j2870l267J1537Q671r974j1697N132J1252N05r602o099O533
2826c836J0367l344j1915P4J1269M412p581q451L992J2324j14j2162j924J0678
$$ plain form
2840 3789 8474 2418 -4586 -2114 6324 7474 -688 -3383 2509 6160 3856 -553 -2469 1500 5857
2855 5857 1810 -3886 -2123 2822 3291 -805 -5462 -2853 2979 471 -4740 -3723 -39 529 -1599
2870 -1599 -4340 -3316 872 818 -2991 -2772 -315 790 636 -940 -1245 987 1451 -581 804 2265
2886 2265 625 877 2603 1338 31 1032 2034 2779 1088 -740 1218 3213 520 -1012 542
2901 542 491 291 992 -802 -2206 -272 1183 -265 -2830 -3843 -387 2036 -2025 -5041 -454 2665
2917 2665 -658 -3960 -3257 207 2226 -399 -3753 -1725 2421 2949 -241 -3093 -1348 4901 4267 -3112
2933 -3112 -3264 4171 6451 779 -4426 -1610 5400 5592 -2382 -4860 1845 6210 2583 -4274 -5262 2631
2949 2631 6814 -1601 -8416 -2072 6196 3746 -5119 -7142 496 6205 26 -7799 -4322 4094 5620
$$ packed form
2840C789M685o056p004K472Q438J150q162k695N892L651k304m409j916L969M357
2855E857m047n696J763M945M69m096m657K609N832k508n211J017L684N68k128
2870a599k741J024M188n4l809K19K457J105j54j576l05K232M64k032J385J461
2886B265j640K52J726j265j307J001J002P45j691j828J958J995k693j532J554
2901E42n1k00P01j794j404J934J455j448k565j013L456K423m061l016M587L119
2917B665l323l302P03L464K019k625l354K028M146N28l190k852J745O249o34p379
2933c112j52P435K280n672n205K816P010J92p974k478O705M365l627o857r88P893
2949B631M183q415o815O344Q268k450q865k023P638N709o179p825L477Q416J526
$$ plain form
2964 5620 -1182 -7815 -3397 7023 6020 -5903 -8313 2959 10064 1852 -9281 -4817 8738 8581
2978 8581 -5643 -9821 2513 10768 3789 -7231 -6159 5309 9118 -1555 -9427 -2128 8446
2991 8446 7219 -5148 -9785 1208 11140 2361 -10286 -6913 6668 9631 -2947 -11502 -1971 10492
3005 10492 5470 -8945 -10037 4005 10806 876 -11159 -5776 9282 8878 -6598 -11324 1486
3018 1486 11596 4003 -9553 -7863 6725 10747 -2011 -10722 -2747 9173 7365 -5724 -9980
3031 -9980 2390 12446 2352 -11234 -7451 7639 10713 -2927 -12062 -1620 11770 5649 -9243
3044 -9243 -9270 4539 10817 326 -11079 -4933 9343 8791 -4611 -10577 26 10649 5063 -8618
3058 -8618 -8499 5998 11547 -1221 -12173 -4126 9686 7656 -6769 -10609 2705 11312 1144
$$ packed form
2964E620o802o633M418J0420j003j1923k410J1272P105q212j1133M464J3555j57
2978H581j4224m178J2334Q255o979j1020J072J1468L809j0673p872P299J0574
2991H446j227j2367m637J0993R932q779j2647L373J3581K963j2578q555R531J2463
3005A0492n022j4415j092J4042O801r930j2035N383J5058m04j5476m726J2810
3018A486J0110p593j3556J690J4588M022j2758q711P975J1920j808j3089m256
3031i980J2370J0056j0094j3586L783J5090L074j3640r135J0442J3390o121j4892
3044i243k7J3809O278j0491j1405O146J4276n52j3402n966J0603J0623n586j3681
3058h618J19J4497N549j2768j0952Q047J3812k030j4425l840J3314Q607j0168
$$ plain form
3071 1144 -10733 -6389 6960 9000 -3341 -11259 -1443 10345 6012 -7378 -9036 3144 10317
3084 10317 965 -9945 -4374 8936 8949 -4295 -10135 421 10352 4686 -8008 -7489 6046 10448
3098 10448 -561 -10034 -3052 9257 6523 -6894 -8959 3258 10185 726 -9042 -4268 6070
3111 6070 5833 -4304 -8166 -250 7258 2774 -6072 -6558 1590 6860 115 -8370 -4205 5933 6170
3126 6170 -4226 -8040 1491 8429 1846 -7333 -4095 6109 6959 -1535 -5504 416 6359 3791 -3674
3141 -3674 -3780 3144 6132 718 -4491 -1662 4393 4028 -2537 -4881 286 3931 499 -4107 -2817
3156 -2817 1290 1776 -1836 -4305 -2189 1742 1019 -2562 -3301 -533 2218 -452 -3272 -1135 1897 1545
3172 1545 -1144 -1334 1184 1817 554 346 810 1063 932 1420 1778 1021 879 1572 941 195 686 1622 951
$$ packed form
3071A144j1877M344J3349K040j2341p918R816J1788m333j3390j658J2180P173
3084A0317r352j0910N571J3310J3j3244n840J0556R931n666j2694N19J3535M402
3098A0448j1009r473O982J2309k734j3417k065J2217O927r459r768M774J0338
3111F070k37j0137l862P916P508m484q846m86Q148N270o745q485M165J0138K37
3126F170j0396l814R531O938o583r179L238J0204Q50q494l969N920N943k568p465
3141c674j06O924K988n414n209K829O055l65o565k344N167L645l432m606J290
3156b817M107M86l612k469K116L931p23l581p39K768K751k670k820K137L032l52
3172A545k689j90K518O33j263k08M64K53j31M88L58p57j42O93o31p46M91R36o71
$$ plain form
3191 951 394 445 336 -962 -856 1088 1160 -2076 -2625 326 1439 -1563 -3972 -1454 1587 -476 -4109
3208 -4109 -3232 709 1793 -1444 -3337 -1425 1307 1714 -1680 -2914 592 3842 2150 -1941 -1854 3130
3224 3130 4834 1301 -2290 175 4906 4190 -597 -2491 1734 5566 2638 -3760 -3213 3208 5846
3239 5846 -933 -6281 -1935 5027 1923 -5716 -5918 1762 4769 -1877 -7404 -3306 3094 2512 -3974
3254 -3974 -6742 -1087 4583 2092 -5065 -5742 2282 7101 277 -7063 -2721 7190 7151 -2787 -6503 2268
3270 2268 9680 3477 -5820 -3560 6914 8737 -748 -7041 -312 8564 5497 -5514 -7139 2597
3284 2597 8477 831 -8559 -4920 5932 5882 -5482 -10575 -1640 7426 2035 -8891 -8628 2801 7389
3299 7389 -2245 -10557 -4181 7320 5903 -5886 -9239 1898 10474 2812 -8584 -5240 7631 10059
$$ packed form
3191I51n57N1j09j298J06J944P2l236n49K951J113l002k409K518L041k063l633
3208d109Q77L941J084l237j893J912K732M07l394j234L506L250j692m091Q7M984
3224C130J704l533l591K465M731p16m787j894M225L832k928o398N47O421K638
3239E846o779n348M346O962l104p639k02P680L007o646n527M098O400n82o486
3254c974k768N655N670k491p157o77Q024M819o824p340M342R911l9r938l716Q771
3270B268P412o203r297K260J0474J823r485o293O729Q876l067j1011j625R736
3284B597N880p646r390L639J0852n0j1364n093Q935R066n391j0926K63J1429M588
3299G389r634q312O376J1501j417j1789l353J1137Q576p662j1396L344J2871K428
$$ plain form
3313 10059 -1231 -8106 753 11026 6847 -5364 -6691 4903 11461 2666 -7994 -4240 8267
3326 8267 8873 -4203 -10258 189 9737 2925 -10132 -8243 5252 8074 -3545 -11765 -3948 6730
3340 6730 3691 -7358 -9216 875 7766 697 -9363 -6774 5193 8469 -2217 -9701 -1562 10244
3354 10244 6836 -6084 -7288 4981 11336 1498 -8058 -2577 9792 9083 -3006 -7759 1584 10170
3368 10170 4458 -6646 -5754 5796 8910 -1728 -9113 -2735 7125 4507 -6075 -8608 429 6339
3382 6339 12 -8552 -6388 2939 5140 -3500 -9879 -3080 6854 4490 -6692 -8484 2307 8651
3396 8651 196 -8209 -2684 7969 7021 -3148 -6393 2503 8760 3861 -4599 -3432 5385 8468 1043
3411 1043 -5295 -1084 6944 5595 -3864 -6276 1596 7388 1024 -7105 -4283 3656 4079 -3859 -7391
$$ packed form
3313A0059j1290o875Q859J0273m179j2211j327J1594O558q795j0660L754J2507
3326H267O06j3076o055J0447R548o812j3057J889J3495K822j1619q220P817J0678
3340F730l039j1049j858J0091O891p069j0060K589J1967L276j0686p484Q139J1806
3354A0244l408j2920j204J2269O355r838r556N481J2369p09j2089m753R343Q586
3368A0170n712j1104Q92J1550L114j0638p385O378R860k618j0582k533R037N910
3382F339o327q564K164R327K201q640o379O799R934k364j1182j792J0791O344
3396H651q455q405N525J0653r48j0169l245Q896O257m899q460J167Q817L083p425
3411A043o338M211Q028j349r459k412P872N792o364q129K822P939M23p938l532
$$ plain form
3426 -7391 -1314 4051 920 -5980 -6108 847 3883 -1324 -6658 -3357 3567 3380 -3114 -4803 1357
3441 1357 4967 1158 -3831 -2021 4161 5005 447 -2666 872 5131 3780 -1219 -2099 2775 5258
3456 5258 1073 -2690 141 3988 2548 -2094 -2520 938 1967 -832 -2414 -777 251 -810 -1652
3471 -1652 -1920 -1862 -902 -759 -1576 -2422 -1610 -171 -717 -2092 -1452 209 -17 -1039 -425 1140 946 25
3489 25 406 1784 1550 164 614 2737 2987 658 -91 1675 3018 1278 -741 -102 2389 2348 -938
3506 -938 -2097 462 2481 335 -3312 -2604 1310 1667 -2031 -3743 -1055 1705 -170 -3594 -3698 77
3522 77 2038 -748 -3891 -2392 2001 2759 -1248 -4211 -250 4503 2508 -3587 -3172 3254 5683 -73
3538 -73 -4432 -303 5508 4032 -2111 -2687 2261 5602 1562 -3870 -2535 3539 4886 -921 -5241 -1118
$$ packed form
3426g391O077N365l131o900j28O955L036n207n334L301O924j87o494j689O160
3441A357L610l809m989J810O182Q44m558l113L538M259j351m999q80M874K483
3456E258m185l763K831L847j440m642m26L458J029k799j582J637J028j061q42
3471a652k68N8R60J43q17q46Q12J439n46j375O40J661k26j022O14J565j94r21
3489B5L81J378k34j386M50K123K50k329p49J766J343j740k019O39K491m1l286
3506i38j159K559K019k146l647P08L914L57l698j712K688K760j875l424j04L775
3522G7J961k786l143J499M393P58m007k963L961M753j995o095M15O426K429n756
3538g3m359M129N811j476o143n76M948L341m040n432J335O074J347n807m320M123
$$ plain form
3554 -1118 4896 2910 -4591 -5874 1179 5227 -836 -7042 -3386 3964 3564 -4055 -6938 -587 5174
3569 5174 1578 -5507 -4770 2961 5994 -462 -6693 -1903 6388 5235 -3419 -6089 1960 8052 2778
3584 2778 -5682 -3637 5594 7427 -1315 -6581 -501 7516 4888 -5035 -6698 2551 7991 366 -7977
3599 -7977 -3775 6009 5652 -4560 -8036 287 6941 1686 -6835 -5642 3250 6332 -1275 -7615 -3528
3614 -3528 5612 5283 -4123 -7966 1000 8834 2388 -7999 -5419 6415 8136 -2635 -8297 -220
3628 -220 8702 4435 -6019 -5859 4254 8221 152 -7285 -3024 6319 6571 -3380 -7594 692 7765
3643 7765 2786 -6987 -5601 4382 7050 -1564 -8105 -2505 6262 4459 -4932 -7298 1056 7234 1403
3658 1403 -7451 -5054 5038 6885 -2637 -7991 -838 7744 3851 -5724 -5462 3381 7218 -346 -6293
$$ packed form
3554a118O014j986p501j283P053M048o063o206L656P350m00p619k883O351N761
3569E174l596p085P37P731L033o456o231M790Q291j153q654k670Q049O092n274
3584B778q460K045R231J833q742n266O080Q017k628r923j663R249N440p625q343
3599g977M202R784l57j0212l476Q323O654n255q521J193Q892L082p607o340M087
3614c528R140l29r406l843Q966P834o446j0387K580J1834J721j0771n662Q077
3628b20Q922m267j0454J60J0113L967q069p437M261R343K52r951m214Q286P073
3643G765m979r773J386R983K668q614o541N600Q767j803r391k366Q354O178n831
3658A403q854K397J0092J847r522n354P153Q582l893r575K62Q843L837p564n947
$$ plain form
3673 -6293 -2528 5676 5632 -2723 -6709 219 6833 2976 -5525 -5461 3470 7109 -935 -7251 -1584 6311
3689 6311 3859 -4369 -5722 1553 6167 679 -5166 -3485 3423 5087 -1256 -5749 -1273 5305 3900
3704 3900 -3749 -5173 1747 6470 476 -5972 -3049 4742 4630 -2912 -5672 476 5469 1880 -4789
3719 -4789 -3775 2732 4567 -1094 -5363 -1339 4646 2891 -3076 -4277 1268 4561 580 -3725 -2002
3734 -2002 2858 3455 -821 -3477 -301 3606 2401 -2233 -3340 1314 4169 610 -3732 -1660 3384
3749 3384 3066 -2201 -3413 907 3794 365 -3067 -1356 2362 1929 -1467 -2215 -130 1700 440 -1679
3765 -1679 -1688 245 1127 -307 -1946 -1090 966 809 -921 -1585 311 1188 271 -953 -97 935 841 -170
3783 -170 96 1012 699 83 276 853 1056 194 -220 617 1032 206 -639 -294 1360 971 -1206 -1564 566
$$ packed form
3673f293L765Q204m4q355l986O928O614l857q501O4Q931L639q044o316N667P895
3689F311k452q228j353P275M614n488n845J681O908J664o343m493M476O578j405
3704C900p649j424O920M723n994o448K923P791j12p542k760O148M993l589o669
3719d789J014O507J835n661m269M024N985j755n967j201N545L293l981m305J723
3734b002M860N97m276k656L176L907j205m634j107M654K855l559m342K072N044
3749C384l18n267j212M320K887l429l432J711L718m33l396p48K085J830j260k119
3765a679rJ933Q82j434j639Q56K056j57j730o64J896Q77r17j224Q56J032r4j011
3783a70K66R16l13o16J93N77K03q62m14Q37M15q26q45L45J654l89k177l58K130
$$ plain form
3802 566 1661 -816 -2385 -616 1537 614 -2298 -2500 -52 1426 -615 -2874 -1693 1573 1912 -1345
3818 -1345 -2964 -524 3211 1650 -2482 -2582 2359 4095 -446 -3412 -7 4474 2674 -2241 -2333 2482
3834 2482 4221 754 -2912 -1408 3187 3349 -741 -3786 -416 4178 2467 -3725 -4326 1636 4522
3849 4522 -653 -5780 -2700 3742 2897 -4083 -6132 424 4536 246 -5642 -4090 2935 4405 -1837
3864 -1837 -5832 -622 5225 2922 -3783 -4209 2804 6481 900 -4674 -1312 5042 5268 -1177 -4352
3879 -4352 424 6041 3804 -4063 -4353 3085 6595 95 -6938 -2785 5692 4641 -4871 -7140 1101
3894 1101 5904 -127 -7331 -4828 3899 4898 -2823 -7237 -1615 5088 2712 -4967 -6251 1908 6588
3909 6588 618 -6806 -3157 5681 6062 -2693 -6698 676 8001 3633 -5102 -3548 4877 7188 257
$$ packed form
3802E66J095k477j569J769K153r23k912k02K448J478k041k259J181L266L39l257
3818a345j619K440L735j561m132j00M941J736m541k966L405M481j800m915r2M815
3834B482J739l467l666J504M595J62m090l045L370M594j711o192o01N962K886
3849D522n175n127L080O442q45o980k049O556M112m290n888J552P025J470o242
3864a837l995N210N847k303o705m26P013L677n581n574L362O354K26o445l175
3879d352M776N617k237p867k90P438L510o500p033M153Q477j051r512k269Q241
3894A101M803o031p204K503Q727R99p721m414N622O703k376p679j284Q159M680
3909F588n970p424L649Q838L81q755m005P374P325m368q735J554Q425K311o931
$$ plain form
3924 257 -5846 -1376 7034 5566 -3557 -5715 2064 7590 1567 -6669 -4753 4759 5644 -3304 -7706
3939 -7706 -1065 5820 2343 -6181 -6918 1568 5855 -1176 -7981 -3716 4782 4624 -4116 -7546 436
3954 436 7036 1912 -5978 -3556 4798 6461 -310 -5330 -476 6365 4539 -2694 -3684 2695 6957
3969 6957 2467 -4469 -3397 4654 6396 -1510 -6058 -241 6196 2830 -5287 -5132 2494 5174 -1823
3984 -1823 -6789 -2439 3587 2432 -3988 -6044 -321 4014 327 -5326 -3865 1980 3788 -861 -5370
$$ packed form
3924B57o103M470Q410j468r123k158P779N526o023q236J916R512Q85q948m402
3939g706O641O885l477q524p37Q486M287p031o805M265Q498j58q740l430P982
3954D36O600n124p890K422Q354J663o771n020M854O841j826p233r90O379M262
3969F957m490o936J072Q051J742p906m548N817O437l366q117J55P626K680o997
3984a823m966M350O026j155o420k056N723M335l687n653J461N845J808m649m509
$$ [...]
8191B1
##END NTUPLES=NMR FID
##END=
