##TITLE=1H_LY-8Dix.2B
 CD3CN, 8 sc, 
 29.04.2021
##JCAMPDX= 6.0         $$ Bruker NMR JCAMP-DX V2.0
##DATA TYPE= NMR FID
##DATA CLASS= NTUPLES
##ORIGIN= UXNMR, Bruker Analytische Messtechnik GmbH
##OWNER= root
$$ XWIN-NMR		Version 3.5
$$ Thu Apr 29 14:12:27 2021 Russian Standard Time (UT+4h)  she@DPX200
##.OBSERVE FREQUENCY= 200.131506
##.OBSERVE NUCLEUS= ^1H
##.DELAY= (6, 6)
##.ACQUISITION MODE= SIMULTANEOUS
##.ACQUISITION SCHEME= undefined
##.AVERAGES= 8
##.DIGITISER RES= 18
##SPECTROMETER/DATA SYSTEM= spect
##.PULSE SEQUENCE= zg30
##.SOLVENT NAME= CD3CN
##.SHIFT REFERENCE= (INTERNAL, CD3CN, 0, 15.7039)
##AUDIT TRAIL= $$ (NUMBER, WHEN, WHO, WHERE, WHAT)
$$ ##TITLE= Audit trail, XWIN-NMR		Version 3.5
$$ ##JCAMPDX= 5.01
$$ ##ORIGIN= Bruker BioSpin GmbH
$$ ##OWNER= she
$$ F:/spectra/data/she/nmr/H-F/1/audita.txt
$$ ##AUDIT TRAIL=  $$ (NUMBER, WHEN, WHO, WHERE, WHAT)
(   1,<2021-04-29 14:11:30.70 +0400>,<she>,<DPX200>,
      <created by zg, POWCHK disabled, PULCHK disabled
       configuration hash MD5:
       00 E9 B6 7A A2 85 ED C7 34 08 36 98 17 FE 4E 26
       data hash MD5: 16K
       1E 7D F5 CE C4 A7 B5 88 A0 41 50 95 3B E8 85 6F>)
$$ ##END=
$$ 
$$ hash MD5
$$ B9 E8 D7 F8 40 B9 D7 D2 0D 73 71 39 B6 46 43 3E
##$RELAX= 
##$RELAX= 
##$RELAX= 
##$RELAX= 
##$RELAX= 
##$RELAX= 
$$ Bruker specific parameters
$$ --------------------------
##$DU= <F:/spectra>
##$EXPNO= 1
##$NAME= <H-F>
##$PROCNO= 1
##$TYPE= <nmr>
##$USER= <she>
##$AMP= (0..31)
100 100 100 100 100 100 100 100 100 100 100 100 100 100 100 100 100 100 
100 100 100 100 100 100 100 100 100 100 100 100 100 100 
##$AQSEQ= 0
##$AQ_mod= 1
##$AUNM= <au_zg>
##$AUTOPOS= <>
##$BF1= 200.13
##$BF2= 200.13
##$BF3= 200.13
##$BF4= 200.13
##$BF5= 200.13
##$BF6= 200.13
##$BF7= 200.13
##$BF8= 200.13
##$BYTORDA= 1
##$CFDGTYP= 0
##$CFRGTYP= 5
##$CHEMSTR= <none>
##$CNST= (0..31)
1 1 145 1 1 1 1 1 1 1 1 1 1 1 1 1 1 1 1 1 1 1 1 1 1 1 1 1 1 1 1 1 
##$CPDPRG= <>
##$CPDPRG1= <>
##$CPDPRG2= <>
##$CPDPRG3= <>
##$CPDPRG4= <mlev>
##$CPDPRG5= <mlev>
##$CPDPRG6= <mlev>
##$CPDPRG7= <mlev>
##$CPDPRG8= <mlev>
##$CPDPRGB= <>
##$CPDPRGT= <>
##$D= (0..31)
0 1.2 0 0 0 0 0 0 0 0.06 0 0.03 0 0 0 0 0.0002 0 0 0 0 0 0 0 0 0 0 0 0 
0 0 0 
##$DATE= 1619691090
##$DBL= (0..7)
120 120 120 120 120 120 120 120 
##$DBP= (0..7)
150 150 150 150 150 150 150 150 
##$DBP07= 0
##$DBPNAM0= <>
##$DBPNAM1= <>
##$DBPNAM2= <>
##$DBPNAM3= <>
##$DBPNAM4= <>
##$DBPNAM5= <>
##$DBPNAM6= <>
##$DBPNAM7= <>
##$DBPOAL= (0..7)
0.5 0.5 0.5 0.5 0.5 0.5 0.5 0.5 
##$DBPOFFS= (0..7)
0 0 0 0 0 0 0 0 
##$DE= 6
##$DECBNUC= <off>
##$DECIM= 32
##$DECNUC= <off>
##$DECSTAT= 4
##$DIGMOD= 1
##$DIGTYP= 9
##$DL= (0..7)
0 120 120 120 120 120 120 120 
##$DP= (0..7)
150 150 150 150 150 150 150 150 
##$DP07= 0
##$DPNAME0= <>
##$DPNAME1= <>
##$DPNAME2= <>
##$DPNAME3= <>
##$DPNAME4= <>
##$DPNAME5= <>
##$DPNAME6= <>
##$DPNAME7= <>
##$DPOAL= (0..7)
0.5 0.5 0.5 0.5 0.5 0.5 0.5 0.5 
##$DPOFFS= (0..7)
0 0 0 0 0 0 0 0 
##$DQDMODE= 0
##$DR= 18
##$DS= 0
##$DSLIST= <SSSSSSSSSSSSSSS>
$$ [...]
##$SUBNAM2= <"">
##$SUBNAM3= <"">
##$SUBNAM4= <"">
##$SUBNAM5= <"">
##$SUBNAM6= <"">
##$SUBNAM7= <"">
##$SUBNAM8= <"">
##$SUBNAM9= <"">
##$SW= 16.9725357007746
##$SWIBOX= (0..15)
0 0 2 0 0 0 0 0 0 0 0 0 0 0 0 0 
##$SW_h= 3396.73913043478
##$TD= 16384
##$TD0= 1
##$TE= 0
##$TE2= 300
##$TE3= 300
##$TEG= 300
##$TL= (0..7)
0 120 120 120 120 120 120 120 
##$TP= (0..7)
150 150 150 150 150 150 150 150 
##$TP07= 0
##$TPNAME0= <>
##$TPNAME1= <>
##$TPNAME2= <>
##$TPNAME3= <>
##$TPNAME4= <>
##$TPNAME5= <>
##$TPNAME6= <>
##$TPNAME7= <>
##$TPOAL= (0..7)
0.5 0.5 0.5 0.5 0.5 0.5 0.5 0.5 
##$TPOFFS= (0..7)
0 0 0 0 0 0 0 0 
##$TUNHIN= 0
##$TUNHOUT= 0
##$TUNXOUT= 0
##$USERA1= <user>
##$USERA2= <user>
##$USERA3= <user>
##$USERA4= <user>
##$USERA5= <user>
##$V9= 5
##$VALIST= <valist>
##$VCLIST= <CCCCCCCCCCCCCCC>
##$VD= 0
##$VDLIST= <DDDDDDDDDDDDDDD>
##$VPLIST= <PPPPPPPPPPPPPPP>
##$VTLIST= <TTTTTTTTTTTTTTT>
##$WBST= 1024
##$WBSW= 4
##$XGAIN= (0..3)
0 0 0 0 
##$XL= 0
##$YL= 0
##$YMAX_a= 655957
##$YMIN_a= -652049
##$ZGOPTNS= <>
##$ZL1= 120
##$ZL2= 120
##$ZL3= 120
##$ZL4= 120
##$ABSF1= 10
##$ABSF2= 0
##$ABSG= 5
##$ABSL= 3
##$ALPHA= 0
##$AQORDER= 0
##$ASSFAC= 0
##$ASSFACI= 0
##$ASSFACX= 0
##$ASSWID= 0
##$AUNMP= <proc_1d>
##$AZFE= 0.1
##$AZFW= 0.1
##$BCFW= 1
##$BC_mod= 2
##$BYTORDP= 1
##$COROFFS= 0
##$CY= 11.3945322036743
##$DATMOD= 1
##$DC= 2
##$DFILT= <>
##$DTYPP= 0
##$F1P= 15.9154993809931
##$F2P= -4.1035820241983
##$FCOR= 0.5
##$FTSIZE= 0
##$FT_mod= 4
##$GAMMA= 1
##$GB= 0.15
##$INTBC= 1
##$INTSCL= 1
##$ISEN= 128
##$LB= 0.24
##$LEV0= 0
##$LPBIN= 0
##$MAXI= 10000
##$MC2= 0
##$MEAN= 0
##$ME_mod= 0
##$MI= 1.114404
##$NCOEF= 0
##$NC_proc= 0
##$NLEV= 6
##$NOISF1= 3.799351
##$NOISF2= 2.8
##$NSP= 1
##$NTH_PI= 0
##$NZP= 0
##$OFFSET= 15.70392
##$PC= 1
##$PHC0= -11120.47
##$PHC1= 9.20102
##$PH_mod= 1
##$PKNL= yes
##$PPARMOD= 0
##$PSCAL= 0
##$PSIGN= 0
##$REVERSE= no
##$SF= 200.130013532006
##$SI= 16384
##$SIGF1= 3
##$SIGF2= 2
##$SINO= 400
##$SIOLD= 16384
##$SREGLST= <1H.CDCl3>
##$SSB= 0
##$STSI= 0
##$STSR= 0
##$SW_p= 3612.71676300578
##$SYMM= 0
##$S_DEV= 0
##$TDeff= 0
##$TDoff= 0
##$TI= <>
##$TILT= no
##$TM1= 0
##$TM2= 0
##$TOPLEV= 0
##$USERP1= <user>
##$USERP2= <user>
##$USERP3= <user>
##$USERP4= <user>
##$USERP5= <user>
##$WDW= 1
##$XDIM= 8192
##$YMAX_p= 0
##$YMIN_p= 0
$$ End of Bruker specific parameters
$$ ---------------------------------
##NTUPLES= NMR FID
##VAR_NAME=  TIME,          FID/REAL,        FID/IMAG
##SYMBOL=    X,             R,               I
##VAR_TYPE=  INDEPENDENT,   DEPENDENT,       DEPENDENT
##VAR_FORM=  AFFN,          ASDF,            ASDF
##VAR_DIM=   8192,          8192,            8192
##UNITS=     SECONDS,       ARBITRARY UNITS, ARBITRARY UNITS
##FACTOR=    0.0002944,     1,               1
##FIRST=     0,             0,               0
##LAST=      2.4114304,     0,               0
##MIN=       0,             -652049,         0
##MAX=       2.4114304,     655957,          0
$$ Real data points
##PAGE= N=1
##DATA TABLE= (X++(R..R)), XYDATA
0@%%%%%%jJ%Qj6J6j6K4l3M1n6O9p8R7j21J39j62J93k30K70l11L59m15M76n44O20
32C30p05P99r04J017j138J276j428J591j768J966k185K418k672K953l261L595
48A884l960M363m805N295n839O440p114P877q746R741j0897J2265j3905J5912
62H511j8441K1740k6234L2747m3063O1877j06779M01120L24479j055787k2132
73d21962P61656O6586n47004J5205K18853o4128M0128K00399l35678l21553N12618
84A25120M45800o73051n23848P04303N18687o85705m15950N32636K49085l45138
94f8061p1552J13457j16649O0027L21606j81091n05522K58478O52664l06334p07417
105e50394L27483O84985l00979n38172K69117L31995j92228o1143J20335j74791
$$ y = [0, 0, 0, 0, 0, 0, 0, -1, 0, 0, 8, -8, 8, -8, 16, -17, 24, -32, 37, -41, 56, -65, 74, -88, 105, -125, 145, -166, 193, -222, 254, -290, 330, -375, 424, -480, 537, -601, 675, -753, 838, -930, 1036, -1149, 1269, -1403, 1550, -1711, 1884, -2076, 2287, -2518, 2777, -3062, 3378, -3736, 4141, -4605, 5136, -5761, 6504, -7401, 8511, -9930, 11810, -14424, 18323, -24740, 37137, -69642, 331478, 655957, -399830, -421962, 339694, 406280, -140724, -125519, 93334, 29206, 69334, 269733, -65945, -387498, 125120, 570920, -102131, -625979, 78324, 597011, -88694, -504644, 27992, 277077, -68061, -139613, -26156, -142805, -82778, 238828, 57737, -447785, -189307, 463357, 157023, -550394, -222911, 462074, 161095, -377077, -107960, 224035, 31807, -29336, 90999, -83792]
115h3792n3895L76264M8958n11474o0063O14379O7472o52873n5109N94001J1066
126B94934m59495M6146K59025j28564n1093J83988j68322k43218L13237K68754
136C15392m10861l06713M44115L12582m54572k79690M18467J77516l41949l0096
146a55809K36098j16662j01153K59228j7026l59259J20054M30144j66574m36597
156c07556J96919M23406j93919l58945K06484K58260k14019j04530K12658o3981
166E4777j82441K18235J38118l32789j01395L84197N5174l96128j8327L61224
176A80645k9954l13160P0175K28359j41801j33953K06642P701k61169J11363K72151
187A96999k07409k52459K59803K07411k79032j47893K78279Q8398k49191q621
$$ y = [-83792, -137687, 238577, 287535, -223939, -284002, 330377, 397849, -255024, -310133, 283868, 294934, -164561, -118415, 140610, 12046, -39047, 144941, -23381, -266599, 46638, 315392, -95469, -402182, 41933, 354515, -100057, -379747, 38720, 216236, -125713, -155809, 80289, -36373, -137526, 121702, 104676, -254583, -134529, 295615, 129041, -307556, -110637, 312769, 118850, -240095, -33611, 224649, 10630, -93900, 118758, 54777, -127664, 90571, 228689, -104100, -205495, 178702, 233876, -162252, -180579, 180645, 150691, -162469, -92294, 136065, -5736, -139689, 66953, 74654, -186515, -75152, 196999, -10410, -262869, -3066, 204345, -74687, -222580, 55699, 144097, -105094, -113715]
197a13715K19339p0162j72158J62227J23760k26862m0642K73737l8368k67476
207a50320J14886K31031j64059j70432J96614J03748k18942l6502K29996l6313
217I9707k35744R7032K08773j67065j67236K15906R1673k47330r606K32287q2671
228C5726k05040J49725J65954j99759j30596K31730R0153k46197l8119K40996
238I4573j8413k05637Q5486J51611j40368o4512J93578k2382k18795J02492K28664
249A86297j49721k14996J81409J97237j90278j59403J86154R7826j67925j3883
259d7283J33820q1840r2013J69098L9547k41601K547K76912m0115k87359N2428
270a15859K63861n9868k17936O0978J40956p4375n3757R0804m8860j01696J46067
$$ y = [-113715, 105624, 35462, -136696, 25531, 149291, -77571, -118213, 155524, 117156, -150320, -35434, 195597, 31538, -138894, 57720, 161468, -57474, -93976, 136020, 99707, -136037, -39005, 169768, 2703, -164533, 51373, 143046, -104284, -113890, 118397, 35726, -169314, -19589, 146365, -53394, -183990, 47740, 137893, -108304, -146423, 94573, 76160, -129477, -43991, 107620, -32748, -97260, 96318, 73936, -144859, -42367, 186297, 36576, -178420, 2989, 200226, 9948, -149455, 36699, 134525, -33400, -47283, 86537, 4697, -87316, 81782, 121329, -120272, -117725, 159187, 119072, -168287, -115859, 148002, 88134, -129802, -68824, 72132, -2243, -56000, 34804, -14056, -115752, 30315]
281C0315J08248k22380j05621K67048J01376k66546q5600K35076O8356j71290
291d1018l0926J01094j7565k0675Q4891n5488j48839J28588K03632j77064k33579
302b06949J94688K32575j85549k04856J50543J48597j05193p6544N3950j5748
312a4486j7047J08996j2263k00824K6752K66339l5861k96604L4761K81820k8754
323A12829k30483J8789J50482r514m9478J4711n4158l3175J50514O4971k24911
334h9423r5199K74062J20691k83506j27634K55800J17702j91538q7720J06872
344A07M0638j5522K2887o4131r3479J22546J59021j58708k13086J68040K41819
355B10132j53136k36574J15683J91529o7759j20303J4620K8873K9327O6502n8527
$$ y = [30315, 138563, -83817, -189438, 77610, 178986, -87560, -173160, 61916, 130272, -41018, -71944, 29150, 11585, -9090, 75801, 20313, -128526, 62, 203694, 26630, -206949, -12261, 220314, 34765, -170091, -19548, 129049, 23856, -52688, 1262, -14486, -31533, 77463, 65200, -135624, -108872, 157467, 121606, -174998, -140237, 141583, 112829, -117654, -98865, 51617, 42103, -7375, 7336, -46822, -79997, 70517, 135488, -89423, -184622, 89440, 210131, -73375, -201009, 54791, 172493, -19045, -106765, 107, 40745, 25223, 48110, -16021, -109500, 13046, 172067, 13359, -199727, -31687, 210132, 56996, -179578, -63895, 127634, 59875, -60428, -45808, -16935, 12392, 78894, 20367]
366B0367j56467O7629K27544n9294k71809L8590K80409j2705k47270o723J80997
377F1268J9528q9429k2778j2239J4289J11552J0452j89438m3284K38303P7084
388A75308k53371j03096K34388J12236j86796j00931J17519O7848l6680j9393
398G032m4779l9595J10695R9040j52199j47888J69149J79230j62266j87528J35244
409c3865J69030r4739j22113N1202N5254r587K3525k4526j00822M6088J65413
420A24860n4464k08973M9210K26111l6687k15618K0092J74340r266j12985M904
431c8476M0307r309L3176K0399j00830l6023J50246N0998j75154o0491J75372
442E0215O3385j51791n3514J13291L1353o3511K902J2707l9485L7005P6636p4352
$$ y = [20367, -136100, -68471, 159073, 99779, -172030, -133440, 146969, 134264, -113006, -119729, 61268, 80796, -8633, -31411, -43650, -29361, 82191, 92643, -96795, -140079, 98224, 175308, -78063, -181159, 53229, 165465, -21331, -122262, -4743, 63105, 26425, 7032, -37747, -77342, 33353, 132393, -19806, -167694, 1455, 180685, 18419, -169109, -33865, 135165, 40426, -81687, -30485, 24769, 15182, 38707, 14181, -86641, -40553, 124860, 70396, -138577, -89367, 136744, 100057, -115561, -95469, 78871, 69605, -43380, -38476, 1831, -7478, 25698, 46097, -54733, -90756, 59490, 110488, -64666, -125157, 50215, 113600, -38191, -91705, 21586, 52939, -10572, -7670, 5037, -34448, 2557, 79193, 4841]
454D841j06915R8760J25216j08076j25891J05240J10242r0720q0346O9517L7912
465C9780m7804Q430K5469n6529p745R5204q111j22715J6704J31305k6576j25423
477g8011L2934J02060l9805o7298M5108K4637n1637J8510N7652n6634n8974Q8999
489A7541N6452j06642m4171J15071K9450j08872o657R6900j6420p2635M2767M8163
501E0947o3381k2016Q0233k798q7845K5624Q6134m6941p6065O1257N3903p4289
513a5237l0410P8001J015q1233K2744P4635m6723o4569O0821M4444o9627k2079
525d8218O9244m473o2583L3542N2272o0312l7163Q3437K4612r4481r049R9753
537D6581j434q9438J5385P2615k3943m2328L4828J1024m2906K3811N2656n3438
$$ y = [4841, -102074, -3314, 121902, 13826, -112065, -6825, 103417, 12697, -67649, 1868, 39780, -8024, 406, 25875, -30654, -38399, 56805, 48694, -74021, -57317, 73988, 47412, -78011, -45077, 56983, 17178, -50120, -5012, 19625, -32012, -13502, 44150, -12484, -71458, 17541, 73993, -32649, -76820, 38251, 67701, -41171, -47828, 49072, 32652, -39983, 2784, 50947, -12434, -34450, 45783, 42985, -44860, -19236, 66898, 19957, -56108, 5149, 59052, -15237, -45647, 32354, 33369, -47864, -25120, 49515, 2792, -61777, -956, 43488, -26139, -48218, 21026, 16553, -46030, -12488, 39784, -20528, -57691, 25746, 50358, -44123, -53172, 46581, 45147, -44291, -28906, 43709, 19766, -22562, 12266, 23290, -19616, 4195, 56851, 3413]
549C413n9263P5805O1779q8830o0188Q6189N1136p5042l7905N0271J2591k4495
561d539J3380q224m6499L2850P2477n4205r7622O2956J09372o4279j09481N5993
573c7821R4402m0433o5028K5147K7980q191J9311J031o1749O136J02343p49j23900
586f1521l843J34448J4789j23217j9596R7737K2289n6521j8287Q173O574L8075
598C9100J0227q0682l4927J07381N4554j23756p3797J15784P8303r7225p6706
609h1744O1662N6954k5367k8503j4369r977M5296N0183o4995q6633P1599J15398
621H9504o2485j25660M6843J21486k0608r2906j667N6306K4860m622l4301m3788
633d7038L8242R0534k7768j21029J2423J35460P665j30343k5996J04673L6293
$$ y = [3413, -55850, 19955, 81734, -7096, -67284, 18905, 70041, -5001, -42906, 7365, 19956, -4539, 8841, 617, -45882, -13032, 59445, 5240, -92382, -29426, 79946, 15667, -93814, -37821, 56581, 16148, -48880, -23733, 4247, -3944, 15367, 16398, -45351, -39215, 63128, 62379, -61521, -65364, 69084, 83873, -39344, -58940, 38797, 61086, 4565, -13722, -5549, 1025, 39100, 49327, -31355, -66282, 41099, 95653, -28103, -101900, 13884, 92187, -5038, -81744, -20082, 36872, 11505, -16998, -31367, -41344, 3952, 54135, -10860, -97493, -25894, 89504, 27019, -98641, -51798, 69688, 49080, -43826, -45493, 10813, 35673, 31051, -3250, -47038, -8796, 81738, 53970, -67059, -54636, 80824, 88489, -41854, -67850, 36823, 73116]
644G3116o5964m0534J2812K9799L5399j4408q2947j4716J10946M0167j26930o7416
656a10676J19096Q2060r7856q7300O1968P5532k0414m8164j9989J1442N6757L3009
668E5465p6283p0680Q5552J05335p3198j19642N5936J22694k6177j01244L13O7491
680B5562K4799k0183l8533l0465M2696P7854l7487j16056K0716J34210k365j37556
692e6808k2095J16861L6425q6781m7256M0429M0362M762k8376n0837M702Q4422
704C5810K0220j05129m5425J07306O5397r1445p3168O5544P2332k8872n4223l558
716c5211L0243L7692O001n7792l8072P2463P0012p0568q6924O1169R3774m2542
728D0245q5262K1368O4629q62l5856j6818j399K3351L4300k6879o7187J9854Q3970
$$ y = [73116, 7152, -33382, -20570, 9229, 44628, 30220, -52727, -67443, 43503, 83670, -43260, -110676, 8420, 90480, -7376, -94676, -32708, 42824, 22410, -25754, -45743, -34301, 22456, 55465, -20818, -91498, -5946, 99389, 26191, -93451, -37515, 85179, 59002, -42242, -41929, 25562, 50361, 30178, -8355, -38820, 3876, 81730, 44243, -71813, -51097, 83113, 80748, -56808, -78903, 37958, 74383, -12398, -59654, -19225, 21137, 25899, -2477, -53314, -48612, 35810, 56030, -49099, -94524, 12782, 78179, -13266, -86434, -20890, 51442, 22570, -31653, -35211, -4968, 32724, 38725, -19067, -57139, 15324, 85336, 14768, -72156, -10987, 82787, 40245, -45017, -23649, 40980, 40118, 4262, -12556, -13955, 9396, 43696, 16817, -50370, -30516, 53454]
741E3454j4701r4243K277Q5343M656o8521j2954L9978J3182q767q560k0852p28
754c0436M7108J3398o3573k2140P5656L2295p2149l1474O4438K9178m4638j5940
766a8277K7269L647n814J4472r334k9993K1986M3814k9594n3223L1804N3494l2737
779A7514m8567K7945L3146k6230j9217J7838j291j3761J6318P375l2464o613L9644
792A1637K304m4366J441M2230p320l4746J4501K5328j9518j1398K5516L36k6491
805b0546J3510K9506j9025k3936K6086K0150k7993r898L1437J520l0164J0947
817A594K8745k1064k5133K7408J8536l0538j3224K6930M006k2523L150J2168j6140
830f085n514K3825o413l4778J2900M0780j9902m4805K0919M0654k0840l1569J8114
$$ y = [53454, 38753, -55490, -53213, 32130, 36786, -31735, -44689, -4711, 8471, -296, -8856, -29708, -30436, 16672, 30070, -33503, -55643, 20013, 52308, -19841, -51315, 13123, 42301, -2337, -18277, 8992, 12639, 6825, 21297, 11963, -18030, 3956, 47770, 18176, -35047, -3243, 50251, 17514, -31053, -3108, 30038, 3808, -15409, 2429, 1138, -12623, 3695, 11070, -21394, -28007, 11637, 13941, -30425, -28984, 13246, 5926, -28820, -14319, 11009, -8509, -19907, 5609, 5945, -20546, -7036, 22470, 3445, -20491, 5595, 25745, -2248, -12146, 19291, 20811, -9353, 1594, 30339, 9275, -15858, 11550, 30086, -452, -13676, 13254, 17260, -5263, -2113, 10055, -6085, -11599, 12226, 5813, -28965, -16065, 24715, 4813, -39992, -19073, 21581, 741, -30828, -12714]
843a2714J8841j2682j070J1033j5447p496L4533R356m6743r560N7594J5377n6136
856a5114j5874N0008J6723l5208j3971J7177R445M395r74k4692j1662L9039K3356
869D2648m9572l6691M9462M2527m4506m5549L0477L8491j6045k8383l831Q921
881a2051J9648J1950l0394l3525L3878N1403l1005o3985K3056O8860q752o0922
893c1839m446M5727J8464k0500k4638n354K6993L3454k0492n3412J2753O7986
905D4696R27p1628j5400O3875K7451m6070l2633K0699K9689N607k2846l3716P565
918b1784N2917R100o6669k8968O7676M3010o0344n3361M1940N2698k0040m4065
930b7890k526K7503K3880l098l9089k2805M5699M7759m0536o3298L1029P2505
$$ y = [-12714, 6127, -6555, -7625, 3408, -12039, -19535, 14998, 24354, -22389, -31949, 25645, 41022, -15114, -30988, 19020, 35743, 535, -13436, 3741, 13186, 17581, 16607, -8085, -19747, 19292, 42648, -6924, -43615, 5847, 48374, 3868, -41681, -11204, 27287, 11242, -17141, -20972, -12051, 7597, 19547, -10847, -44372, -10494, 40909, 9904, -54081, -31025, 37835, 29083, -31839, -36285, 9442, 27906, 7406, -17232, -22586, 4407, 37861, 17369, -36043, -23290, 44696, 45623, -26005, -41405, 22470, 49921, 3851, -28782, -8083, 21606, 27213, 4367, -29349, -21784, 31133, 40233, -26436, -55404, 12272, 55282, -5062, -58423, -16483, 36215, 16175, -27890, -30416, -2913, 20967, 17869, -21220, -44025, 1674, 49433, 8897, -54401, -23372, 49133]
942D9133j4525o8124k248N4707J8994l0587k9711K755L3830K7022k8710n3054
954d0518J6735O9477k940p5349j3459P0297K7535n6313l7437L1312L7523m782
966B2081l1066k2350J6447M3505K014n7317k3215O0238M0626n3649n3010L8506
978a7190N7221j5743n0921p197L5879K7831j3434m2407r979N0687L4904m7707
990A944n3274L7501O4266k1495o4013M017N3633J3209l3869k6056R547L1400J5811
1003C2621l1375m0768K2654N9395r959o8402n763O5276J8630n4701k8944L6282
1015e054L3194j3077l0257j2055K1772L3801q108m9061q208N6165K4469n3979
1027a0398l4967M5033M0417l0141l9007J2104L0521O379j5407k0314k724K9605
$$ y = [49133, 34608, -33516, -35764, 18943, 37937, 7350, -22361, -19606, 14224, 41246, 12536, -40518, -23783, 45694, 42754, -32595, -46054, 24243, 51778, -4535, -41972, -10660, 26863, 22081, -8985, -31335, -14888, 28617, 30631, -26686, -49901, 10337, 50963, -2686, -55696, -17190, 40031, 24288, -26633, -33830, 2049, 29880, 16446, -25961, -35940, 14747, 49651, 1944, -51330, -13829, 50437, 28942, -35071, -31054, 22579, 35788, 1919, -24137, -14590, 16810, 32621, 1246, -39522, -16868, 42527, 32568, -35834, -41597, 23679, 42309, -12392, -41336, -5054, 28140, 15063, -15194, -27249, -5477, 28324, 20216, -28845, -37053, 19112, 43581, -10398, -45365, -332, 40085, 9944, -29063, -16959, 13562, 19941, 4534, -15780, -18504, 11101]
1039A1101J9749l2710l5101L0305M5269k2836m9015J3031M5143k551l4624o899
1051a9138J9008J2556k137j4284j3082J3069K6538r744l6025L595L8901L155l4910
1064a2498q095K6772R649j5482q668K570N732R616j591j9380l722K6072R036k8754
1078h743j2945K6780J3509k2778j0784J7356O374j1150p23M029o438J928J2156
1091H571n346j5601Q393J5840r428j4785J0868J1673j1062o641J1440J449j1081
1104e710N297J0967j0764r603J3571P473j4088k322J3588k724j3322P290J1394
1117A1047j2386r904J6534Q389k0926p210K1262N551j9902m531J4011J752o954
1130c267J108r27m147P695Q008j3202j2775J6608J7788j5830j9401J4498J8459
$$ y = [11101, 30850, -1860, -36961, -6656, 38613, 15777, -33238, -20207, 24936, 22385, -12239, -19138, -130, 12426, 10289, -3995, -17077, -4008, 22530, 12786, -23239, -19644, 19257, 22412, -12498, -20593, 6179, 15828, 346, -8322, -5752, -20, 9596, 8005, -11375, -15097, 10975, 20011, -8743, -21688, 5092, 18601, -4177, -14961, 2395, 8769, -2381, -3104, 925, -5513, -3585, 8571, 3225, -12376, -3983, 11857, 2429, -12356, -1488, 10185, -877, -7518, 3922, 5371, -5710, -413, 10554, -210, -9813, 3758, 11231, -2857, -5179, 8409, 5685, -7637, -347, 11047, -1339, -11243, 5291, 13680, -7246, -14456, 6806, 12357, -7545, -12076, 1935, 3687, -3267, -2159, -3086, -7233, 462, 8470, -4732, -17507, -899, 16889, 1059, -18342, -3844, 14615]
1143A4615r268j3740L508P636M704J379j0582j0138J4462J9784j4380k7108J0219
1156h909L1250m713l1299j344K6205N867j7376j1216L238J3071J1002j2762k4360
1169b1346P811L2181j523l6033q063L4063J6049k7994k1412J7352K2583k670j8432
1182g434j3113J0533K7761O06l5961j0353M0029K1351l5837k9765K7506L6106
1194C1429j4232l4024J361K6474J1469j2640k1463m559K7640K1010k9369l5282
1206c2186K3613M3437j3322m7156k257M1394J4494l2260k4246J6647K7358J492
1218A7008k7265k1788K0611L8119j0818m6832q66M7610J3956l9124k4225K6902
1230f712L1271j0166l0646m965K5290K1994j1413l3530l929M0884J9285m0092
$$ y = [14615, 5347, -8393, -4885, 2751, 7455, 8834, -1748, -11886, 2576, 22360, 7980, -19128, -8909, 22341, 17628, -13671, -15015, 11190, 17057, -319, -11535, -8297, 4774, 15776, 3014, -21346, -13535, 18646, 17123, -18910, -26973, 7090, 23139, -4855, -26267, -8915, 13668, 10998, -7434, -20547, -10014, 17747, 18353, -17608, -27961, 12068, 33419, -2418, -32183, -4677, 31429, 17197, -16827, -15466, 11008, 22477, 9837, -11626, -16185, 11455, 32465, 3096, -32186, -8573, 34864, 21542, -25614, -27871, 13523, 28017, -4243, -28489, -11842, 15516, 17008, -10257, -32045, -11434, 26685, 15867, -30965, -31831, 15779, 29735, -9389, -33614, -6712, 24559, 14393, -16253, -21218, 4072, 26066, 14653, -18877, -22806, 18078, 37363, -2729]
1242b729k9821L2640L6812j8173l8828M2L4354J5547k5260k7900R426L2730P818
1255B6658l3755k6242K7979L7602k1189m3779Q608M0180N104k9790j8912J4814
1267a2722K6211J287k7354j6400K2518L1181j0904m0980m54M6430J2646m2114
1279a0655j9791L1782K6591j3506k6619l357K3918J8934j5906k8892L139L4735
1291B0373J2117l4917k6530K9286L3835k1799l5837Q026K9389N753k0472k0599
1303b1375P012K7762M705l0005j9444K4188L0468j4476l7791M213L9236M947l3614
1316a4174j1666K1979J8809m723k0726r743K1490K1876j4294k7459N153L1142
1328A7664P435k9129j6412K5479K2230j6624k2553L645J8274J0362j2544k2496
$$ y = [-2729, -32550, 90, 36902, 18729, -20099, -20057, 14297, 29844, 4584, -23316, -13890, 18840, 26658, -7097, -33339, -5360, 32242, 11053, -32726, -24118, 16062, 21166, -8624, -27536, -12722, 13489, 14776, -12578, -28978, -6460, 24721, 13817, -27163, -27617, 18813, 31459, -10655, -30446, 1336, 27927, 14421, -12198, -15555, 8363, 27297, 11391, -17501, -14362, 20373, 32490, -2427, -28957, 329, 34164, 12365, -23472, -15446, 13943, 19696, -776, -21375, -14363, 13399, 18104, -11901, -31345, -7157, 23311, 8835, -28956, -24743, 14493, 19440, -14174, -25840, -3861, 14948, 10225, -10501, -20244, 1246, 23122, 8828, -18631, -13478, 17664, 25099, -4030, -20442, 5037, 27267, 10643, -11910, -8265, 10009, 20371, 7827, -14669]
1340a4669N250K8200M09l0019r670K4144J6537j8351k2792J0103K1722m311j6790
1353a0237l352O626R442L339j4846j1179J7594J6899j4929j8749R256K0013r14
1366H963j7529k698J6224N693q839m536P48N254R399m135j5490M844J8245l820
1380A2323j6832R75J2901J598j1100m276Q060K744o864l07J833n915J608P250
1394C998o704p744Q264M544q073k977N448J525l245j389L382K009m198O00O773
1409B213k722m838N561K288l719L707J364n096L226O833m870o441M440P908j509
1424H345r312j057J0095J830r941j810M977l33J118o42r243P96J2975k160j5800
1439a0162j193J3215N164j1710j0057Q704J1918n587j0316M55N705O935R12j3298
$$ y = [-14669, -9419, 18781, 19190, -10829, -20499, 3645, 20182, 1831, -20961, -10858, 10864, 6553, -10237, -13589, -6963, 2479, 5818, -9028, -20207, -2613, 14286, -643, -19392, -10136, 9877, 8963, -8566, -11264, 4960, 10653, 1814, -2722, -1974, 3280, 12679, 8544, -6946, -2102, 16143, 12323, -4509, -3534, 9367, 10965, -135, -4411, 3649, 6393, -471, -778, 1055, -4860, -3252, 3998, -2706, -10450, -2186, 2358, -5715, -8692, -3244, -1719, -4964, -6353, -2971, -962, -5160, -4560, 2213, -509, -5347, 214, 2502, -1217, 2490, 3854, -1242, 1984, 8817, 3947, -2494, 1946, 9854, 8345, -967, -2024, 8071, 9901, -40, -1850, 3127, 2794, 3912, 3270, -5973, -5177, 7798, 5638, -10162, -11355, 1860, 7024, -4686, -14743, -6039, 5879, 292, -10024, -9569, -3864, 3071, 3983, -9315]
1453i315m839J8766R576j7680j1292J4187J4779o306j5880J114J6398M495j0806
1466C197p568J991J0029R067j1909j8231J1001K3326q839k4962O80K1901P196
1479A6879j8876j6006J2197J8606m843j8368o122J2683J6082o532k4532j22K7760
1492H806O668k4353j2756J6456J8899n276k1096m037K0714J3105j3182j8459K979
1505a1532K4144R636k5234j8880K3382K5024j5374k6002L893K3795Q445j9733
1517A564j8910J2307K3742k480k4981j0696K0543K1790j5415l0261P236L0649
1529A5088P82k6332j0766J6236J8902n150k3618o637K2941J7056j5977k4640N742
1542a6373L0981N420l1567j3464K8268K0037j7792k1659N338K1595Q659j7428
$$ y = [-9315, -14154, 4612, 14188, -3492, -14784, -597, 14182, 7876, -8004, -6890, 9508, 14003, 3197, -4371, -2380, 7649, 16716, 4807, -13424, -2423, 20903, 12064, -12898, -12218, 9683, 16879, -1997, -18003, -5806, 12800, 7957, -10411, -16533, -3850, 12232, 5700, -18832, -18954, 8806, 15474, -8879, -21635, -5179, 13720, 8444, -12652, -16689, 4025, 17130, 3948, -14511, -11532, 12612, 22248, -2986, -21866, 1516, 26540, 11166, -14836, -10943, 12852, 21297, 1564, -17346, -5039, 18703, 16223, -8758, -19454, 1089, 22879, 7464, -22797, -15561, 15088, 15870, -10462, -21228, -4992, 13910, 8760, -14858, -21495, 1446, 18502, 2525, -22115, -16373, 14608, 20028, -11539, -25003, 3265, 23302, 5510, -16149, -10811, 10784, 19443, 2015]
1554B015j8234J0633K4425p53k4998j1476K2504K1453j7728k7806R128K7600J18
1567A6881k3101j0990J3841J9240m848k4511n695K3098J4195j7143k2193Q137
1579a3089K6528J167k6558q661K1109J4773j1041j7416m94J8486J1944j5314j9496
1592a8062R847K3450k70k2904q880K0131J7056j4107k0810O420K0001L835j6230
1605e23j3443R713K0600k750k4368m662K2152J1190j7066j6880Q744J9177j618
1618A0266j8102n696J2065J1029l931j4618o048J6297J3855j4545j8421R575K0690
1631A2416k128j9785m879J7181J0867j1143j3410M378J3398M255j0574j1730P192
1644c962J7205l098j8684j626J6958O278j2933j0386P168J2043k159j0863l529
$$ y = [2015, -16219, -5586, 18839, 18086, -6912, -18388, 4116, 25569, 7841, -19965, -10837, 16763, 16881, -6220, -17210, -3369, 15871, 11023, -13488, -19183, 3915, 18110, 967, -21226, -13089, 13439, 14606, -11952, -20613, 496, 15269, 4228, -13188, -13682, 4804, 16748, 1434, -18062, -8215, 15235, 14965, -7939, -16819, 3312, 20368, 6261, -14549, -8129, 11872, 15707, -523, -13966, -4253, 16347, 13597, -10771, -15433, 6719, 17909, 843, -16037, -7293, 11884, 10266, -7836, -13532, -1467, 9562, 5631, -8987, -15035, 1262, 15117, 572, -17849, -8274, 12416, 10288, -9497, -14376, 2805, 13672, 2529, -10881, -6503, 6895, 11150, 576, -11154, -3962, 13243, 10145, -8539, -10165, 6793, 13071, 138, -10248, -3080, 8963, 6804, -4059, -7588]
1657g588P362P387k116j1197l401J2809O944j1992r267Q696J0200m222j0265j70
1671f820Q805L645o015n377K606O105J732n615n539N418P228m264p044K692N786
1686C343m08l574j359J619K326M14k528j890J761L454j215m669R19N331j647n067
1702c190K733L700l460k661L625J893l690j878L136K014k447j800J454J169j33
1717D65M05j923k098M051L551n216m378N227N316m277n737J862O108L51m873k364
1733c530K122L745J440m909n451M843Q368l847j0554J626J2341R77j1153m339
1747h321Q694P471n114q538P18Q353M399o468q610L196J1541P35j1921m864J0222
1762A493Q524o449j0610J034J0548M395r119r574N475J2879j68j4799o014J3894
$$ y = [-7588, -226, 7161, 5045, -6152, -9553, 3256, 10200, -1792, -11059, -2363, 7837, 3615, -6650, -6820, 1985, 5630, -385, -5762, -3156, 2949, 4681, -934, -6473, -1055, 6173, 1909, -5135, -2443, 3343, 2935, -639, -1998, -379, 1947, 2361, -167, -2057, -296, 3158, 1943, -2726, -1807, 3524, 1877, -3190, -457, 3243, -217, -2878, 747, 2640, -1050, -2928, 208, 2222, -225, -2025, -571, 598, 465, 870, -1053, -3151, 900, 4451, -765, -5143, 84, 5400, 1123, -4614, -2752, 3356, 3707, -1166, -3530, -1408, 2337, 3777, -1132, -6583, -1740, 6628, 2781, -7773, -6147, 6194, 7171, -3982, -8321, 373, 7844, 2730, -5808, -5090, 3263, 7662, 1194, -7416, -4220, 7321, 8056, -3865, -8729, 1493, 10017, 3568, -7042, -6008, 4540, 8935, -184, -9758, -4283, 8596, 8428, -6371, -12385, 1509]
1776A509J0749j0982j3981N990J4891J52j3161o633R762J1243l891j4206k713
1789a1271J4652R734j1941j4543P315J7764j273j7545m756J4398J0757q202j4457
1802i368J112J5175O810j3075j3996Q472J8787k119k0671n110J9011J0964j4620
1815A372j5856P661J6677M88j5254r005J0988J4613m730j8150l296J8417J1105
1828A5030j5675j6715R976K0100k397j9951n471J7193J2215j0316j6510K987J9031
1841I497N551j6940j2875J2572J8135n512j9648k160J8085R060j3404j4419N947
1854f111J6851J869j6264j0294J2397J6078o687k0017r13J9311P521j6451j3428
1867a6138J0328J6449k866j6760n355J4288J2077r083j6125K658J8047M280j6376
$$ y = [1509, 12258, 1276, -12705, -6715, 8176, 8328, -4833, -11466, -1704, 9539, 5648, -8558, -11271, 3381, 13115, 1174, -13369, -6054, 11710, 10437, -7108, -11864, 2534, 13291, 5089, -9368, -8256, 6919, 13729, 654, -13342, -4870, 13917, 11798, -8873, -13983, 5028, 15992, 1372, -14484, -6823, 9854, 10342, -4912, -13917, -2929, 11684, 6954, -11196, -14492, 3925, 15030, -645, -17360, -7384, 12716, 10319, -9632, -15103, 2090, 14305, 3989, -12521, -9534, 9497, 15048, -1892, -14767, -2195, 15940, 10428, -9220, -11380, 6705, 15765, 2361, -12058, -6111, 10740, 12609, -3655, -13949, -1552, 14526, 7839, -12178, -13091, 6220, 13741, -2710, -16138, -5810, 10639, 7773, -8987, -14342, -54, 12023, 2940, -13185, -10527, 7520, 11800, -4576]
1880d576r638J2657J4200o257j5076J8J3928O958r105j1539K836J4065M134j3924
1894a319r989J1128J4805o650j7247M34J6527M625j3193r708P367J1785j714j2262
1908e411n029R479R729o147j3057P88J3640M395j2081q815Q571J0973l312j1046
1922g323j786J0169P057o053j0335J909J2326L751j0950p257Q784J0337m623j1020
1936e014M12J0377M004p581p629L642R206Q48r422n700P135P816m749r698N43
1951e810R030K466p776n564M088O966p84p669l234O904O117m869p798K259R010
1966C336M82q187j835O472L991l377l522Q58L520J845j696l252N01M896J789n095
1982G26l127M387M431l495m697K111L717j001k952n54J211N55o48j647j001J319
$$ y = [-4576, -14214, -1557, 12643, 6386, -8690, -8672, 5256, 12214, 3109, -8430, -5594, 8471, 12605, -1319, -11308, -180, 14625, 7975, -9272, -8838, 7689, 12314, -879, -10587, -3220, 8565, 6851, -5411, -10440, -961, 8768, 2621, -10436, -9648, 3992, 8387, -3694, -12509, -3938, 7035, 3723, -7323, -9109, 1060, 8117, 2064, -8271, -6362, 5964, 9715, -1235, -8492, 292, 10629, 6006, -5014, -4602, 5775, 9779, 2198, -5431, -1789, 7417, 8265, -1157, -6857, 278, 8094, 3345, -6353, -5810, 3220, 5686, -2090, -7654, -3566, 3400, 2616, -5053, -8287, -1383, 4734, -135, -7933, -5674, 3336, 3818, -4369, -6204, 268, 4259, 882, -2640, -1782, 1738, 3583, 1887, -1365, -864, 4032, 5821, 726, -2401, 1986, 6417, 2922, -1775, 336, 4053, 3052, 100, -454, 757, 1312, 664, -983, -1984, -665]
1998f65J073j680k015J397J113j776j123K090N92k136n58K899O32k581l39K613
2014d64J656j781j136J234K161R21j309j781P36L355O19l397j731L852K881k783
2030C033m312O66M538J233m402m053K917N279j280p276j786P169L404o887o240
2045g997M509P118j663p372j593N375M634k979o447L07P503L863o737o973N344
2060c108R730j727j0218j063J0017N098o905p225L291Q897J504q526n764O923
2074I24R541l389j1670j290J1471M637j0108q854O606J0014j972j0918l740Q356
2088c92P671n209j1151k92J2083M992j0695r734P772J2972l263j4057j821J3466
2102B342P200r138j0754M718J3056J721j2581o521J0545J1276n470j3173J37J3432
$$ y = [-665, 408, -1272, -3287, -1890, -777, -2553, -3676, -1586, -994, -3130, -3688, -789, -157, -2738, -3077, -464, 1192, -589, -1725, -491, 1670, 2591, 1282, -499, 237, 3592, 4211, 814, -917, 2935, 5816, 3033, -1279, -613, 3925, 5158, 756, -3297, -380, 4899, 3619, -3657, -5443, 1726, 5130, -1757, -7997, -3488, 3630, 1967, -5405, -6998, -1623, 3011, 32, -6415, -6108, 1395, 5258, -1479, -8452, -3108, 6622, 4895, -5323, -6386, 3631, 8729, 1824, -5401, -2110, 6787, 8291, -235, -5999, 924, 10465, 7076, -4594, -5884, 5587, 10224, 116, -8738, -2132, 7882, 5910, -5008, -8748, -392, 7279, 2070, -9081, -9373, 2710, 7702, -2993, -12727, -4955, 8017, 4754, -9303, -11124, 2342, 9542, 404, -10350, -5632, 7424, 9145, -3436, -9957, 588, 11864, 6394, -6779, -6642, 6790]
2116F790N639j0785j0366N978J2874J43j3539o476J1221J1503p776j5722J626
2129h890J5936M168j4615r931J0064J3163m870j4788j916J3558P736r711j2470
2142a2566M397J5419J821j5130p528J2375J2427o953j4013J530J4391N090j1576
2155c16r853O989J3459j57j4358n745J2888J1491q880j5429L588J6065K110j4750
2169b898p773J0728J1336n372j3757j150J2072O274r295j1097M421J3636L62j3765
2183f278o222J1057J0431o595j2603J248J3108M242j0476q217O831J1483j727
2196F282j2009k944J1500P797q049j0122L640J0923J490r795n410P115Q598l043
2210E973j0496j645R663N777p910r093L947J0087Kr880m083P455O599m323q918
$$ y = [6790, 12429, 1644, -8722, -2744, 10130, 10273, -3266, -9742, 1479, 12982, 5206, -10516, -8890, 7046, 11214, -3401, -13332, -3268, 9895, 5025, -9763, -11679, 1879, 9615, -96, -12566, -8169, 7250, 9071, -6059, -13587, -1212, 11215, 4262, -9751, -8221, 6170, 11260, -316, -10169, -3180, 10279, 10122, -4236, -9981, 2907, 14398, 5518, -9911, -6323, 9742, 11852, -2898, -10671, 57, 11393, 6021, -7736, -8886, 3186, 9460, 165, -10932, -6511, 7125, 7487, -6278, -12500, -1443, 8988, 2393, -10210, -8962, 4146, 8388, -2088, -10305, -3474, 8009, 6282, -5727, -8671, 2829, 10626, 2577, -7545, -3905, 7018, 8508, -1287, -6697, 418, 9016, 5973, -4523, -6168, 3495, 9272, 1362, -7731, -3784, 6303, 6305, -3575, -7658, -203, 6396, 2073, -6845]
2225f845K60Q531M156p237p140M301Q849j397q853j777Q236M337n283n614K236
2240c240O302J270m792m241L033O578n6o792k322O394M973n238o679L030P320
2255E540k95o645k227M503L824k724m769j02M398J994l817l750J822M946j043
2270A655m639j287L772K572k202k788M56K947J130k428k271J503L319q5l147o23
2286b116L046J436j961j848J354K032m50j475l49J294O98o95j210K77R23k36p08
2303A2O57L59j016q14J081P70j382j244J228J287j027j401M59J097L34n43j360
2320a503l97J936J756j840l056J682M093r17m724N5M676J714l834k983K645L698
2336C001o12l907j467L493L578k348m968M03N848J746n542l964L912N813k100
$$ y = [-6845, -6585, 1946, 6102, -1135, -8275, -3974, 4875, 3478, -5375, -7152, 1084, 5421, 138, -5476, -3240, 3062, 4332, -460, -4701, -1668, 4910, 4854, -1938, -4260, 2134, 7107, 1869, -4810, -1780, 5540, 5245, -1400, -3627, 876, 4700, 1976, -2793, -2895, 1503, 3497, -320, -4070, -2248, 2698, 1655, -2984, -4271, -499, 2073, -129, -2917, -2461, 486, 1616, -812, -3083, -1580, 1739, 1654, -1493, -2116, 930, 2366, 405, -1443, -89, 1943, 1493, 18, -331, 963, 1661, 966, -244, 33, 956, 720, 12, 669, 1028, 12, -802, 279, 1049, -333, -1577, -349, 938, -89, -1490, -1031, 66, 400, -143, -1503, -1900, 36, 1792, -48, -3104, -1422, 2671, 1754, -2970, -2915, 1761, 3475, -359, -3342, -697, 3001, 2389, -1518, -2985, 508, 4086, 1738, -3230, -2827, 3021, 4767, -775, -4739, -827, 4986, 2886]
2351B886o171r01N874L270m565n614J975P279Q18p096m298O149O659l711q192
2366e638O13Q509K738p417n382N050P531j646q497j951P702N010n176p724K430
2381c848Q360J337p964n060O034P789k517r118j802R018N595p114q703L855J0843
2396F705j15j0916l894R427P500o171r394J598R733K906q181o708N130R745j345
2411F020j0724l105R667P245p226r967L138J0865J463j0180n624P148Q937l418
2425D239j0510j467J0415O121q334j0104M998J1870m67j2007l945J0070Q104o672
2439B311j0266J934J0953L217r365p320O090J0635j614j1768l091J0763P365p588
2453B256j0574L468J2042J320j1327o061Q664R488m934j1247n7J1045M419r249
$$ y = [2886, -3285, -4186, 1688, 4958, 393, -5221, -3246, 4033, 4851, -2245, -6543, -394, 6265, 2554, -5638, -5025, 3484, 6222, -1195, -6577, -1527, 6004, 4358, -4139, -6090, 1612, 6622, 1446, -6278, -3848, 4512, 5849, -2115, -7175, -1141, 6648, 4131, -4987, -6789, 2229, 7824, 710, -7993, -4138, 6705, 6590, -4326, -8220, 1207, 8707, 2536, -6858, -5260, 4473, 7379, -802, -7510, -2380, 7365, 6020, -4704, -7809, 1858, 9103, 1877, -8090, -4952, 5913, 7376, -2804, -8428, -1280, 7657, 4239, -6271, -7738, 2677, 8798, 464, -9640, -4642, 7228, 6761, -5246, -9191, 879, 8983, 2311, -7955, -6021, 4932, 8149, -1216, -8536, -2446, 8189, 6575, -5193, -8284, 2479, 9844, 2256, -8318, -4850, 7192, 8512, -2815, -8876, -212, 9276, 4342, -6905, -6962, 4083, 8502, -747]
2467g47q239N687J0191j629j0551l036Q569P374n434j0155J373J0834L099r777
2481b441o921P141J0311l307j0900r22J0250M959p431p746L771R508N57r202m434
2496f807P467P489m416r302O55R516K847p883n659M760P163j806p492k281O222
2511D73N264m189p503J023P851K293p416n133N224P313k775q155J85P467K546
2526D468n283m680K892N997K77n591k349M647M163k113n259k04N488K653m269
2541H37m070K591M687M5m800k220L760L851k763m631Q57M306P24l751k796K112
2557a261L442r73l601p79K804J740j675l016L07L570O08l112j193K015K181n44
2573E13k055n20K293J493j054j452L63J909R51j497j787J523K188j167j796P46
$$ y = [-747, -8986, -3299, 6892, 5263, -5288, -8324, 245, 7619, 2185, -7970, -6597, 4237, 7336, -2441, -9362, -2221, 8090, 4783, -6117, -7039, 3211, 8170, 739, -7007, -3236, 6272, 6829, -2373, -6807, 660, 8149, 3733, -5569, -4914, 4602, 7449, -434, -6093, -1333, 5830, 4024, -3468, -5749, 473, 5737, 1548, -5955, -4932, 2919, 5212, -2204, -7337, -2113, 5200, 2425, -5730, -5545, 1922, 4468, -815, -5495, -2603, 3394, 3671, -1920, -4269, 378, 4541, 2428, -2831, -3035, 2453, 5106, 837, -3233, -642, 4045, 4090, -710, -2930, 830, 4681, 1918, -2713, -1856, 2450, 3174, -577, -3373, -1261, 2181, 1208, -2393, -3172, -368, 1372, -303, -3319, -3012, 558, 1166, -1946, -3139, -1124, 1057, 513, -1542, -2062, 231, 1724, 670, -782, -419, 1490, 2441, 944, -843, 680, 2868, 1701, -95, 651]
2589F51R00M6m68p13K66O0l82K67k62j186M16J221j038j323L45Q24m92k45o3m25
2609a601M57K93O8n27q40Q15J799o20k062O12K266O03j242j580R87K903M2l082
2627g09n49L128J782k160k673Q31L639N88m180j508L115K261j599l629n81L641
2643A397K331l920l722K086L922k73m148k524L492M306k473n507N53N445K030
2658B995m514m394L297O960j529p273k27O853K973m703m906K498O527M68o184
2673a159k923N227M938j904o430j549P222M127o793o148M068P195j107p603l093
2688e932O940N330n392p078J847P166J513o511n459M695P897k336q904m82P878
2703A172L949n330o977K803R103K33q088l256O181O592k647q303m05R011M297
$$ y = [651, 1551, 1597, 1129, 416, 682, 742, 360, 627, 365, -821, -405, 816, -222, -1545, -1200, -376, -868, -1113, -1176, -1601, -1144, -851, -783, -1310, -2150, -1335, 464, -156, -2218, -1606, 660, 1263, 21, -1559, -572, 2331, 2373, -709, -1258, 1870, 3652, 1492, -1181, -350, 3289, 3877, -303, -1811, 1304, 3565, 1966, -1663, -2244, 1397, 3728, -192, -3914, -1828, 2094, 1821, -2327, -4851, -1359, 2947, 474, -5033, -4480, 965, 2995, -1519, -5913, -2616, 4344, 2815, -4458, -4685, 2168, 5141, 438, -4468, -1970, 4557, 5025, -1159, -4082, 1145, 6083, 4179, -2251, -3800, 3422, 7549, 756, -5392, -1324, 5871, 4764, -2839, -5932, 1008, 6338, 946, -6132, -4285, 2881, 4394, -2117, -7576, -2881, 5016, 2680, -6224, -6706, 1172, 5121, -209, -7186, -4383, 4720, 4953, -3135, -6391, -210, 6382, 3735, -4568, -4973, 4038, 8335]
2718H335p930o325M899Q168o41q972l367P914O795o351q189K206Q105J821p984
2733a516n724N518Q028l051q873r83P562M571n393p982K028R967R49r276m104
2748h279O804P692l430r538J69J0551K861q096n363N046P781o31q517l019Q103
2763B134O132n357p945J790Q422K603q190o000N987P979l307q333q59O997M741
2778F794n780p986K897R069k19q544l523O321O561l810q955J018R320J715p487
2793b609m264M835O477j178p487j598P302M129m851n276J749O878J804o470m547
2808e106N537N972k753o602k76O281L322n292n981L711O613k046n827j259M123
2823D17L837l189n476J212N268O50m268k936K346M498n29n321j084N107K290l636
$$ y = [8335, 405, -5920, -1021, 7147, 6506, -2466, -5833, 2081, 8876, 2525, -5664, -3458, 4647, 6468, -1516, -7240, -1722, 6306, 3255, -5618, -6601, 961, 5532, 139, -7843, -5815, 4152, 5101, -4175, -8279, -1475, 6217, 2787, -6751, -6582, 3969, 6830, -1266, -6629, -1583, 6198, 5567, -2950, -5969, 2134, 8266, 2909, -5036, -3246, 5176, 7779, -411, -6411, -424, 7555, 4248, -4085, -4944, 2053, 6794, 1014, -6972, -4075, 4994, 4775, -3769, -7292, -971, 5590, 1780, -7175, -6157, 3163, 4878, -2609, -6873, -2038, 4439, 3261, -4226, -5824, 1478, 5607, 756, -4520, -2771, 4107, 5911, -559, -5106, 431, 6403, 3650, -2952, -3228, 3053, 6375, 1083, -4898, -1187, 5426, 3380, -2447, -3706, 417, 4254, 1065, -4411, -3199, 2069, 2719, -1549, -4485, -2139, 2359, 1830, -3491, -4575, 532, 2822, -814]
2839h14k790J450L854Q12l924j662L152K789j527k718l32L043K346k804l087K328
2855A16K813r97k583k14J874J769j507k447O85J861j64q22j558j34K100O37k849
2872a420r12K233Q86j329j104K26J450J86j555K39R27O8k65Ql24L77N03j41p9
2891b6K25l62M98R66p51q70R51P03m82j81k30k24J001r1r07n9L57P8M64j052j259
2912a251J128J159r19j268J3R42R74j188j825P93K481m42k026p79J600K184q47
2929G29l177L03L632K02k647j206K098K327o43k900n80K677J777j803k206k15
2945a632L318J930l542l391L154L690j383m220o08M009K414l360m096K192M276
2960B751m03m062j836L050M150j901n375p4N397J799m228l657K357N623n40o147
$$ y = [-814, -3604, -2154, 1700, 2512, -1412, -3074, 78, 2867, 1340, -1378, -1710, 1333, 3679, 875, -2212, 116, 2929, 1932, -651, -865, 1009, 2778, 1271, -1176, -491, 1370, 1206, 384, -1174, -1308, 792, 1429, -1420, -2332, -99, 787, -542, -1646, -1420, 30, 216, -1339, -1100, -173, -105, -370, -362, -686, -309, 194, 53, -26, 199, -163, 335, 1301, 550, -320, 631, 1334, 852, 671, 441, 217, 1218, 1127, 220, 161, 518, 596, 1060, 8, -1251, -123, 1036, 117, -1151, -1138, -196, 778, -410, -2235, -1442, 1039, 597, -1429, -2208, -608, 1576, 729, -2448, -2145, 1487, 1689, -958, -2164, -66, 2261, 1618, -1282, -1862, 815, 2592, 789, -1417, -1632, 1686, 3616, 74, -3317, -163, 3527, 2144, -2076, -2684, 1325, 3739, 379, -3717, -1525, 2751, 2348, -1714, -3550, -500, 3650, 1749, -3626, -3700, 1697, 3496, -732, -4389, -2032, 3591, 3051, -3096]
2976c096j302N299L541l691m768J146N929J706n715l979M591N382k331n967o60
2991c915N926L406m793n563L040O096m72n934k566M900M974l027o471P77O103
3006B481J869m752m676K834O529k44p289k186O395M232m283o095J929P049J127
3021D920o999l355N176N208k662n903o28N868L453m398n643K682O170j08n537
3036a756l900N840N784l130p199M72O845J879n149m764L171O607j214o574j964
3051e052N995M227l606o330J478O702J338o404l586M579N445k207o106p62N910
3066A621L619m780n428K618O304J64o127l406N130N334k915o820M25O781K400
3081D920n547n004L696O537j571o282j280N937L376m018n230J639O335M89n074
$$ y = [-3096, -4398, 901, 4442, 751, -4017, -2871, 3058, 4764, -951, -4930, -339, 5043, 2712, -3255, -3915, 2011, 5417, 624, -4939, -1899, 4197, 3725, -2209, -4775, 125, 5099, 2072, -4399, -3622, 2481, 4350, -402, -5078, -2244, 4285, 4041, -3248, -5434, 961, 5193, 910, -5185, -3256, 3793, 4920, -2079, -5434, -258, 4950, 2288, -3615, -4243, 1625, 5078, 680, -4963, -2281, 3889, 3781, -1756, -5656, 184, 5968, 2838, -4361, -3889, 2956, 4835, -314, -5078, -1907, 4700, 3486, -3088, -5052, 943, 5170, 1564, -4766, -3288, 3414, 4752, -1652, -5238, -659, 4786, 2579, -3527, -4289, 1621, 5240, 460, -4968, -2350, 3954, 4118, -2009, -5415, -285, 5049, 2134, -4686, -4261, 2520, 4920, -627, -5631, -1935, 4602, 3031, -3251, -4531, 1406, 4782, 764, -4466, -2827, 3508, 3997, -1077]
3096a077l377M041M844j397n936o58N709K599m683m275K805N218l46n412j702
3111c647M567L362l084m850J056M639J410m274l203K669M469j100m632p51M029
3126F60K526l086l468J444M136K63l807j683K691L131j170l793l38L863J732l131
3142c0k336K118K742n82k966n03K693J374k049j844P28K142j0j547j143J017J280
3159A084j64j709n74J309J082o50j882J49J700K14j373p23J005J069p86j025N96
3176f78Q58N5n95k03K70J77K90J78p9j20K86q0Q1lk20M82L08K1o32l90L69P05
3198A080k70r63k23J195J91j003p77L98Q87l90n24j158R94O65J30q44j386J378
3216f20J421r12j775K51K224L04k181n85J721J700o19k074l5K080J183j271j744
$$ y = [-1077, -4454, -413, 4431, 3034, -2902, -3560, 2149, 4748, 65, -4210, -1405, 3813, 3467, -1945, -3647, 920, 4282, 1198, -3652, -2596, 2043, 3453, -821, -4024, -1355, 3114, 2014, -2618, -3369, 660, 3186, 100, -3368, -1924, 2212, 2475, -1332, -3015, -324, 2807, 1637, -2156, -2494, 1369, 3101, -30, -2366, -248, 2494, 1912, -1054, -1557, 1136, 2510, 461, -1383, -655, 1487, 1477, -70, -1213, -196, 1084, 920, -789, -1363, -54, 1028, 378, -1504, -1355, 345, 559, -814, -1537, -532, 537, -249, -1274, -678, 180, 235, -360, -563, -293, -116, 174, 352, 273, 153, 439, 359, 440, 437, 217, 699, 1007, 1028, 396, 6, 375, 1080, 810, -153, -376, 819, 1010, 7, -770, -372, 515, 125, -399, -1557, -563, 102, 232, -612, -1998, -620, 801, -111, -1886, -1635, 589, 893, -1288, -1873, -152, 1548, 929, -1145, -1180, 900, 2083, 812, -932]
3233i32N80K301J47k172j387J963K297q45l081m04L083J460k575k638J415L137
3249B349m89l461j119K727K345k035l277M70L383J258l122k671K095L498m59m079
3265b587j101L865K854k475l927J223M261J065l704k655L107L895j031m665q28
3280b703M867K580l813m168K119N150m16n021j833M308L091k905m430M89M804
3295B119J487m281l505K248M772p33n107j739M761L701l447n241J592O112P02
3310C441n535l158M480M895k040n337k39N563K535m362m072K398N605j40n417
3325a383k016M581M044l021n243P91N188J656m746l721K996N021j089n783j541
3340d266M927L280l261n007J069N613P45n251l219L945M902j906n660k57N484
$$ y = [-932, -352, 1949, 2096, -76, -1463, 500, 2797, 1952, -1129, -1533, 1550, 3010, 435, -2203, -788, 2349, 1860, -1601, -2720, 7, 2352, 317, -2960, -2490, 893, 2151, -971, -3642, -1547, 1951, 1492, -2587, -3688, 177, 3031, 556, -3371, -2148, 2113, 3178, -526, -3181, -74, 3821, 2790, -1875, -2703, 2164, 4744, 931, -3237, -1118, 4032, 3616, -1405, -3238, 1070, 4161, 1256, -3174, -2685, 2119, 3606, -675, -4180, -1932, 2840, 2107, -3000, -4739, 22, 3723, 276, -4965, -3373, 2739, 3441, -2094, -5252, -772, 4123, 2083, -3254, -3493, 2070, 4605, 243, -3829, -1431, 4174, 4034, -1383, -3399, 1182, 5226, 2205, -3038, -2247, 2941, 4597, -149, -3870, -874, 4147, 3058, -2725, -4266, 661, 3941, 680, -4327, -3258, 2355, 3100, -2151, -5370, -1425, 3477, 1571, -4089, -4346, 1138]
3355A138K553m082m000K283N308j04m713k190M145M195k194n074K3N398K078m287
3371D77l938L084M790q62n708p75M462K841l260m288J091M587P63m114l064K791
3387a123L917j258m915o04M638K529l521m109J753M881J44m509k020L817L674
3402C294k342m185N26M442J708l703l114K663M169o88m171r10L803K298k591l323
3418b124J348L508K62l174j974K254K686r78l459n17L080J681k469k989J310L267
3434A712j92l425j181K779K125j965k691R74K628J17k269r61J751J794n45j866
3450a215k54J912J197q58j787N92J695M12j508o88J243J063q84j328L05J262J34
3467A293p67q86N71O19l60p86j62M57K71n79m53L11L04k35k07N3K31l73j40M21
$$ y = [1138, 3691, -391, -4391, -2108, 3200, 3096, -1617, -3807, 338, 4533, 2339, -2735, -2712, 2686, 4764, 477, -3461, -377, 4413, 3551, -2157, -2932, 1530, 4371, 1111, -3177, -2086, 2501, 3264, -850, -3914, -1123, 2794, 1536, -3379, -3983, 655, 3184, -337, -4446, -2693, 2188, 2332, -2177, -4197, -380, 3294, 952, -3233, -2707, 1735, 3443, -260, -3374, -711, 3458, 2770, -1401, -2311, 1492, 3790, 1199, -2124, -776, 2732, 2994, -180, -2154, 100, 2786, 1808, -1651, -2168, 912, 2593, 124, -2865, -1555, 1712, 1520, -1905, -3086, -307, 1818, -147, -2838, -1864, 764, 881, -1388, -2349, -598, 1196, 651, -1215, -1469, 443, 1640, 782, -1005, -413, 1282, 1694, 186, -502, 741, 1804, 920, -408, -103, 1159, 1293, 526, -360, 211, 830, 470, -316, -478, -21, 250, -329, -782, -471, -167, -402, -609, -556, -325, -698, -838, -417]
3487d17J64k71m16N58L08k26m04K60N73K64m42j79K61O88L8n44n62Q28R86m71
3507I96j315R4J419M88j478j094J096J469p12j942K46J357M98j358j242P57J245
3524E24K10j693q61J098J560l44j972n41K192J099j571j857R98K608j71k166r89
3541a876K024J808j078k215J38K636J009k407j964J706K609l90k967o84K551J752
3557B652j967k564P78K663N10k362k026J758K524o01l190j029L314J978k187l361
3573c110J290L757Q4l507j720K972K885j666l740L57L973J089l002k574J885L578
3589B551k79l425j536L415K831k167l842N30M171J105l750k698K840L568j189
3604B125m188n96L754K389l202l625J413M250K51m029k070L043L555j747m433
$$ y = [-417, -253, -524, -940, -382, -74, -300, -704, -444, 129, 393, -49, -228, 33, 721, 759, 215, -347, 481, 1467, 996, -319, -225, 1194, 1682, 204, -890, 206, 1675, 963, -979, -733, 624, 1122, -236, -1478, -721, 524, 734, -959, -1820, -722, 838, 494, -1478, -2019, 173, 1272, -299, -2156, -1158, 1450, 1279, -887, -1876, 148, 1956, 878, -1337, -1199, 1437, 2446, 39, -1925, -219, 2390, 2000, -967, -1651, 900, 2652, 685, -1879, -1101, 1562, 2072, -290, -2316, -558, 1966, 1365, -1825, -2854, 460, 2438, 251, -3110, -1820, 1937, 2021, -1486, -3206, -234, 2651, 985, -2755, -2398, 1575, 2664, -338, -2912, -1027, 2551, 2272, -1153, -2689, 726, 3557, 1390, -2452, -1922, 2249, 3354, -396, -3094, -254, 3314, 2125, -2063, -2659, 1095, 3484, 282, -3343, -1930, 2320, 2571, -1458, -3528, -485, 3070, 1323, -3110]
3619c110L42M273J585l753k940K486L669r5m367j186L612L294k838l933Q24M355
3635B218J070m030k973L171M065j415m448m01M003K366l428l229J728L690J78
3650B565l681k131K940L481j571m245l7M110J718k951l541K146L653j88m211j325
3666c268L873K499k526l585J283L752O53l836k094K874L153j109l697o02L742
3681A112J952k452l296J147L637M72l727j597K595K798j005l806j32L201J827
3696B726k521l052J682L514j13l230j834L465K378k472k898N36L430O83k872j657
3712b235J846K604p76k758n61K508J600j803k443P84K861M40l023j250K085K324
3728B203j318k613L53K448N29j926j553J279K040k14k026o57J708J520j305k057
$$ y = [-3110, -2768, 1505, 3090, -663, -3603, -1117, 2552, 2457, -1910, -3096, 516, 3810, 972, -2961, -2137, 2218, 3288, -742, -3715, -544, 3521, 2106, -2342, -2743, 1260, 3626, 198, -3031, -1303, 2387, 2565, -1116, -3247, -307, 3174, 1603, -2642, -2679, 1431, 3149, 198, -3343, -1197, 2456, 2268, -1943, -3268, 605, 3104, 578, -3007, -1724, 2028, 2681, -1155, -3249, -375, 2778, 1669, -2028, -2630, 1112, 3064, 612, -2684, -1537, 2100, 2572, -1155, -2752, -157, 2641, 1636, -2170, -2302, 899, 2726, 205, -2847, -1165, 2349, 2236, -994, -2828, 637, 3015, 543, -2355, -1819, 1611, 2294, -578, -2235, -389, 2215, 1439, -1319, -1880, 628, 2228, 425, -2018, -1234, 1627, 2067, -956, -2206, -121, 2203, 885, -1728, -1375, 1073, 1602, -324, -1877, -598, 1442, 1228, -798, -1455, 253, 1773, 468, -1589]
3744a589P33J485Q10j980o39Q75J549k49j867J01J337J165j312j035P79N75l05
3761D33j115n19J163R92n36j204M76Q39J17j104j93N86K70j28m87J86r2O6OK07
3781c7j76J4l4J55J26j24L5J49N9j3j16K42j25L4N78n80l96N12P92p25p80J59
3803b51J193p9j161m77J262P28j061r52K29J177Q5j052p58O52J110l18j452j51
3821a276J274J021j303j312P05J582L5j416q89J505J455q71j628N4J840Q87j624
3838C9j634J230K174l77k121o50K190J512j753k124P47K392K20k278j257J664
3854b6J903r99k287l22K227J332j836k332Q96K865K04k995j304K457K086j313
3870E56k817K61L008R37k460j804J565K556j98k732p97K275K311j764k719N00
$$ y = [-1589, -856, 629, 1439, -541, -1180, -305, 1244, 995, -872, -771, 566, 1731, 419, -616, 163, 738, 433, -682, -1201, -38, 954, 418, -786, -310, 529, 646, -458, -651, -65, 205, 77, -410, -224, -316, -250, -244, -37, -213, -199, -233, -78, 48, -76, -41, 108, 167, 154, 38, 280, 155, 189, 767, 187, -209, 303, 1095, 370, -410, -251, 942, 863, -298, -775, 487, 1215, 154, -798, -569, 608, 693, -359, -1117, -465, 645, 327, -1125, -1276, -2, 1019, -284, -1596, -891, 691, 726, -690, -1579, -74, 1381, 510, -1118, -1064, 776, 1663, 39, -1595, -365, 1809, 1432, -689, -1339, 851, 2363, 610, -1514, -767, 1625, 1845, -433, -1690, -26, 1877, 878, -1409, -1731, 496, 1828, -8, -2340, -1444, 1421, 1625, -1370, -2674, -217, 1869, 556, -2261, -2000, 1008, 1945, -515, -2319, -754, 1802, 1604, -1128, -1925, 350, 2661, 897, -1822, -1322]
3886a322L138R65k841k147K077K818p36l403m15K929J736k397k908J253L106K66
3902B119l270j694K431K956j719l390J67L120J403k750k415J696L266m49l217
3917a746q89K639K263j360l134L14L399J268l012k416K278L475j054l600n22L523
3933A426J970k891k820J361L463o6l279j465K629K350j684l123J07L267R85k408
3949a78k741J483L193k81l371j041L130J814j812k785M05L457O61k842j678J827
3965g59K894o37l066m91K846J924k429k463J407K868J72k689j274K123K337j425
3981A338k607oK374J196j887k096R53K660j76l068q79K204J927j447k693K69K825
3998H87M01k202j486J697J670m25k153l40J706J772j299j504q8K349N42j934j371
$$ y = [-1322, 1816, 2781, -60, -2207, -130, 2688, 1952, -1451, -1866, 1063, 2799, 402, -2506, -1253, 1853, 2119, -1151, -2845, -414, 2542, 823, -2567, -2400, 720, 2123, -627, -3042, -1346, 1920, 1471, -1746, -2635, 4, 2267, 907, -2227, -1913, 1486, 2754, -258, -2674, -396, 3079, 2025, -1575, -2097, 1426, 3396, 505, -2315, -954, 2509, 2443, -836, -2301, 328, 2678, 994, -2129, -2022, 1245, 2230, -178, -2919, -1436, 1757, 1476, -1895, -2936, 194, 2008, 196, -2589, -2184, 1273, 1934, -908, -2586, -759, 2135, 1498, -1568, -2059, 787, 2711, 282, -2181, -774, 2094, 2266, -423, -1697, 426, 2763, 1338, -1269, -1275, 1099, 2295, 408, -1688, -735, 1925, 1749, -1319, -2198, 6, 1933, 486, -2207, -1938, 887, 1288, -914, -2400, -703, 967, 542, -1611, -1951, -245, 1527, 228, -1276, -1364, 985, 1527, -407, -1778]
4015a778J880K214j235k193O37J698N43j305j689J115K047n84j494p60J380J208
4031A684j054j389k92J756J20j091r31O83J380l16j748l10J437P55p84j237L04
4048a033J142M84j144j011J209J054p16q25j30J375P14j037r66J048Q64m08p49
4065a29L56K95J67o4o27J33N95k29j51j80j45L35Kk98m31M13R5l79j87J22O7l1
4087b71j75J68J61n78j36O35Q4m48j16M27J57K54o43m5Q25J47o02k73L57Q65J60
4108I53j040m33R27N90n68r27N44R19J89j073p47P70J239r09j045m1P94R17j013
4127D6j385P04J604j33j934m61J483J030q71j687J66K130K46j858o50J217J206
4144H53k07j698m06J954J033j146j450M09J818N58j840j379J837J808j131j995
$$ y = [-1778, 102, 2316, 1081, -1112, -475, 1223, 1766, 461, -1228, -113, 1934, 1350, -144, -904, 476, 1684, 630, -759, -1051, 705, 825, -266, -1197, -514, 866, 550, -1198, -1508, -71, 684, -100, -1337, -1033, 109, 593, -551, -1562, -353, 701, -15, -840, -970, 405, 1119, 82, -884, 164, 1028, 620, -129, 227, 522, 689, 625, -2, 131, 726, 497, 346, 166, 21, 356, 358, 60, -371, 42, 137, -242, -429, -307, -240, -271, -446, -278, -117, -695, -831, -196, -112, -560, -676, -249, -92, 162, -481, -526, 299, 446, -156, -429, -72, 793, 953, -87, -520, 407, 997, 429, -498, 46, 965, 1154, 81, -666, 104, 1343, 434, -611, -652, 142, 1059, 46, -1339, -635, 969, 836, -1098, -1559, -76, 954, 83, -1604, -1438, 692, 938, -920, -1570, -353, 853, 646, -1052, -1458, 496, 1529, 383, -1067, -658, 1160, 1718, -122, -1501, 336, 2144, 1013, -982]
4160i82J15K040Q81j813j902J310J940l73k019p46J582J651j429k050L38K383
4176I26M39k187j223J370K032m51k497l17K271J244j652j726M31K784L89k567
4192g34j526K293K062j140k696L95K390J274k045k120J482K316jk584q47J885
4208D04J615j213k587P00K770M63k019k509J338L012o82k816o96K504J647j785
4224A46k798J118K440P26l065j673L247J654q03k649k82K521J471j913k253J331
4240g82K506j05k435j176K084K247j310k730M47K740N45k121j700J210K484l56
4256A548k974m78K585J509j640k512O40K630M10k646j390K386J482r16k120l41
4272a827K217J307j852j753J011K058N8k009j193J974J980j191k435M29K399L81
$$ y = [-982, -867, 1173, 2054, 241, -1661, -351, 1589, 1216, -803, -1549, 33, 1684, 255, -1795, -1457, 926, 1365, -822, -2045, -675, 1357, 906, -1591, -1908, 363, 1607, -45, -1771, -1340, 1444, 1833, -734, -2260, 33, 2095, 955, -1741, -1346, 1044, 2318, 273, -1847, -365, 1951, 1950, -634, -1481, 404, 2019, 806, -1781, -1081, 1689, 2152, 133, -2376, -1038, 1974, 1292, -1524, -2220, 284, 1931, 146, -2652, -1534, 906, 1632, -1433, -3106, 141, 1795, 992, -1657, -1939, 582, 2053, 140, -2113, -782, 1724, 1619, -816, -1992, 92, 2339, 1029, -1701, -1254, 1486, 2031, -90, -1790, -580, 1904, 1548, -1426, -1904, 681, 2190, 550, -1962, -1322, 1308, 1718, -928, -2318, 68, 1550, 634, -1486, -1827, 390, 1697, -155, -1908, -897, 1161, 1219, -790, -1983, -9, 1971, 780, -1655, -1226, 1173, 1554]
4288A554j596j293R14K041n16k092j78J700R54j039j575L53J769K61j579r75J115
4305a82J292k42j660o11J741J073j437j420P37J420J41j428q75J189J437p43j542
4322a110J81J240O91j004j203R58J271j93j446l04J079Q12q01q35K98J026J55
4339H15q88m94N23O34K35j217o01J088R61q49q68L50R05l9j017k58Q01P77n66
4358B92o83kM77K07k49m13J77O24k41l57j13K10L16m3m63o1N14O2n35Q2K07J85
4380A93q0k73j53L74q0l3J74j58Q7j69J56O3p0j77j05M88Q1l82j02J67L53k2o64
4403c32m3O54L15n56o07M52N25j30m60k77O71L53k16j001K87Q53K27r41o39N01
4423c64J244m85j289j8J471K91j275q08P24J342k26j336k04J168P16o04j294J55
$$ y = [1554, -42, -1335, -421, 1620, 1104, -988, -1166, 534, 1488, 449, -1126, -773, 996, 1257, -322, -1297, -182, 1110, 868, -792, -1403, 338, 1411, -26, -1446, -709, 711, 852, -576, -1451, -262, 1175, 432, -1110, -929, 311, 1002, -2, -1205, -247, 1024, 831, -615, -919, 160, 972, 171, -664, -366, 660, 815, -73, -567, -44, 590, 825, -392, -993, 95, 1056, 207, -661, -311, 594, 555, -462, -720, 81, 858, 292, -391, -393, 84, 291, 42, -371, -194, 430, 189, -168, -281, -71, 245, 202, -261, -322, 192, 254, -281, -199, 8, 193, 113, -160, -313, 61, -19, -52, 122, -36, 51, -118, 38, 101, 31, -146, -251, 237, 318, -64, -166, 1, 354, 332, -332, -375, 279, 594, 38, -569, -117, 408, 278, -182, -459, 212, 565, 349, -652, -365, 488, 715, -226, -865, -364, 880, 395, -894, -912, 559, 850, -425, -1233, -509, 833, 607, -729, -933, 235, 951, 347, -947, -792]
4441g92J440N21j458q24J028J319m16j512k76J688Q17j321j278O35J599J57j782
4458d55r14J280J634p38k002m8J841Q57j859j343J277J821o35j767n17J686J305
4475A423j139j789O63J584M72j522j217J146J719l42k132k33J907J316j577j880
4491a601R95K013J4j958q96J744J421r15k003L14J802Q98j825j562J029J785O7
4508A322k192p43J840J284j171j993J93K532J29j948j297J567J629n11j822l09
4524a490J877J208j366j811Q07K054K07k059j067J716J675q67j920KK043Q23j623
4541B09j591J018K001l47j873r96J855J352j104j969L13K123M44j943j288J563
4557b33J757q02k131q2J850O49j253j403Q07J564K10j628r02J327J652p54j848
$$ y = [-792, 648, 1169, -289, -1113, -85, 1234, 818, -694, -970, 718, 1535, 214, -1064, -429, 1170, 1327, -455, -1369, -89, 1545, 807, -1195, -1243, 598, 1455, -404, -1747, -470, 1351, 716, -1051, -1568, 118, 1423, 284, -1505, -842, 742, 1214, -308, -1525, -379, 1340, 998, -1134, -1367, 540, 1856, 279, -1601, -606, 1407, 1421, -537, -1433, 311, 1732, 817, -1186, -872, 930, 1828, 3, -1559, -530, 1255, 1322, -870, -1613, 227, 1511, 340, -1653, -1460, 1072, 1201, -747, -2044, -477, 1152, 641, -1181, -1490, 387, 1595, 229, -1582, -775, 1279, 1486, -573, -1640, 76, 1751, 884, -1036, -1034, 1009, 1832, 209, -1382, -364, 1637, 1290, -583, -1579, 276, 1628, 524, -1445, -1132, 991, 1435, -508, -1796, -233, 1524, 722, -1409, -1491, 359, 1008, -245, -1648, -841, 723, 933, -695, -1597, -270, 1382, 628, -1220]
4574a220o2J897J114j735j384J023J751j91j932j39J384J170j142j487L61J696
4590A104K86j546r22J000J273m81j510j52J389N62j143j067L06J388J34j293o66
4607a338J082R26l00j349q4J302M55p51j238O30J370l5j196k51J123O36o78o92
4625c88J48J003J26p36m79M89O29r7p10m06P31N17n21p38r6J000J31p85n63O29
4645a16M03l16n87r9N57K02k39l89J29M34J16m91l42K69O73j73k68m0J90N49m29
4666C3j58J63K84P0m07J71K3J90k2k79p0L10M3n7j48M0m7O0k30J21k62m4Q9J55
4690B8m9k62n9L27o0l38P4J3K87q6l94O0K64K05k34j51L6L38L31k67m85L65O90
4713F33k05o47k50J102L08o25p50L91P49J83q97n01P23O48n27j045L78Q64L50
$$ y = [-1220, -1282, 615, 1729, -6, -1390, -367, 1384, 1193, -739, -878, 506, 1676, 534, -953, -592, 1104, 1390, -156, -1078, -78, 1195, 714, -796, -948, 441, 1003, -140, -1207, -901, 487, 621, -672, -1338, -256, 670, 370, -979, -1063, 239, 694, -57, -1295, -665, 705, 670, -526, -777, 346, 982, 304, -388, -240, 763, 889, 153, -326, 163, 792, 695, -15, -421, 310, 827, 306, -432, -528, 472, 603, -182, -745, -116, 287, -29, -616, -715, -158, 44, -195, -584, -455, -21, 95, -396, -738, -469, 204, 31, -237, -277, -87, 462, 33, -125, 38, 322, 392, -15, 156, 179, 369, 347, 68, -2, 308, 351, 294, 146, 186, 139, 199, -31, 90, -172, -216, -127, 28, -21, -283, -342, -15, -75, -413, -339, -326, -39, -125, -519, -459, -195, 10, -224, -375, -339, -1, 330, 63, -422, -57, 633, 428, -219, -469, 633, 941, 316, -434, -43, 706, 889, -8, -509, 214, 862, 335, -710, -332, 532, 882]
4732H82j080p35O31J017m50q84m78J111P95q54j012K05J130L96j135r12R31J295
4750H53l08j512j27J643N91j254j013O11J734o1j766k57J370J001r44j170L8J391
4768H20N51j373j153J055J459m04j685m91J514J273j356j672N42J849J51j722
4784f42j205J534J432p11j644q7J885M94j288j278O70J884j25j523p47J493J363
4801A505r37j790L29J974M81j674j208J061J823m95j842l67J707J099j254j587
4817a175L75K037J83j876r83J290J537q14j855J7J661O65j392j076M02J904J00
4834A000j840o77J205J626q39j790O0J882P10j587j369J198J977n18j947j95J852
4851G48Q56j222j535O66J543K02j380r24R52J532n77j693k03J663P93j325j429
$$ y = [882, -198, -933, -302, 715, 265, -619, -1097, 14, 809, -45, -1057, -852, 278, 674, -461, -1373, -442, 853, 545, -967, -1094, 549, 1140, -114, -1127, -516, 1218, 1157, -609, -866, 504, 1505, 561, -609, -571, 820, 1371, -2, -1155, -100, 1359, 955, -730, -1221, 293, 1566, 210, -1462, -920, 929, 1080, -642, -1847, -313, 1119, 408, -1236, -1323, 562, 1056, -232, -1510, -840, 1044, 919, -604, -1351, 142, 1505, 568, -1222, -893, 1081, 1562, -112, -1320, -259, 1564, 1069, -773, -1140, 567, 1666, 412, -1175, -800, 1237, 1420, -456, -1439, -149, 1388, 574, -1281, -1264, 397, 1062, -330, -1406, -1004, 900, 1000, -840, -1517, -312, 1314, 475, -1315, -1255, 627, 1337, -250, -1619, -421, 1556, 1038, -909, -1104, 748, 1604, 382, -1153, -487, 1056, 1258, -122, -1046, -94, 1438, 861, -832, -1035, 628, 1421, 96, -1333]
4868a333Q40J518o0j563r40J524J149p73j504m5J540O83j272j162Q20J647l34
4885G35j470l04J451O26q10j305O20J223K58j309o65R04J257n26j506K13J015
4902D07P66r59j171O98J133L9j131o27R72P86o75r84K04Q54L05j136k09N59O96
4921E27j03q07l20M73Q35m59r06K53R39K05q32m02M83P14k51o83r2M94N26m92
4941A02l68Q2N70J12n39j54J91N29l88l12p4M06K86l27k22lL11Jj99k36N8K66
4963I2j2j95l50K52L82m2m17J07K80p8j34q3K43Kn6P2j27j05J09K99%j87j69M39
4987C22O2j81l38M4K13lj6j69J11J76ll08j41R7L42o6k67m12M36L92l52k74R4
5010b41N92J07n70k90M58M35k68o70K7N23L56l85p09L55P14l3o99l04P43N20m91
$$ y = [-1333, -493, 1025, 965, -598, -1538, -14, 1135, 362, -1142, -1187, 353, 1036, -236, -1398, -578, 1069, 735, -735, -1039, 412, 1038, 228, -1077, -457, 766, 1024, -285, -950, -46, 1211, 685, -821, -608, 407, 1173, 214, -957, -259, 874, 913, -218, -845, 127, 913, 238, -746, -542, 312, 617, -519, -728, -169, 527, 424, -383, -703, -230, 605, 146, -760, -507, 432, 637, -195, -597, -114, 600, 349, -334, -426, 68, 594, 102, -266, -184, 386, 498, -41, -195, -4, 525, 137, -175, -249, 157, 443, 116, -106, -109, 202, 203, 4, -232, -174, 92, 80, -115, -465, -213, 169, 127, -290, -183, 97, 19, -115, -198, 45, 47, -9, 63, -64, -169, -60, 239, 239, 52, -117, 322, 384, 203, -135, -91, 122, 119, 103, -66, 45, 221, 218, -90, -231, -134, 208, 142, -125, -537, -101, 291, -61, -335, -241, 351, 458, -112, -402, 56, 491, 223, -447, -420, 103, 459, 74, -635, -280, 434, 401, -298, -602, 141, 661, 170]
5031A70p32j7R63K05o16o41M77Q87k77j037k36J067N69o68j069K97J398J59j220
5050c21p81R79J150o14j168J4J339M73j018j109O76J122K97j422o64R80J266p91
5068D08j546J97J674L31j325q76Q47J343m32j579j99J554P35j086j295N86J592
5085I29J49j499q54J074J523o21j570j46J673O87j299j189Q17J392k12j495l82
5102a023J265J130q79j532O8J696O09j460j272J181J457l45j913k58J708R81j320
5119I3j352O45J392J20j449p78J062J305n46j571j49J699P09r68j470O31J579
5136I52R4j915m57J570J144o75j628J64J690L64j276j341J224J341j61j643n18
5153a071J402J191j068j455J77J563L19j449r10J152J182n02j434k28J280R24
$$ y = [170, -562, -579, 384, 589, -27, -668, -191, 696, 419, -618, -854, 213, 782, 114, -955, -658, 740, 899, -321, -1102, -123, 1027, 413, -755, -741, 598, 1071, 53, -1056, -380, 742, 1039, -383, -1047, -67, 1199, 408, -1138, -941, 733, 1064, -261, -1137, -290, 1053, 621, -958, -1157, 397, 1132, 46, -1249, -663, 929, 1078, -421, -1275, -201, 1322, 701, -869, -1015, 658, 1345, 46, -1143, -326, 1066, 854, -641, -1023, 242, 1372, 493, -1039, -971, 725, 1334, -126, -1398, -217, 1240, 895, -1018, -1276, 432, 1413, 93, -1259, -614, 778, 898, -551, -1329, -267, 1038, 492, -1079, -1228, 471, 1180, 212, -1258, -627, 952, 1046, -869, -1326, 244, 1388, 713, -915, -751, 939, 1303, 27, -1314, -90, 1251, 1090, -553, -1071, 331, 1522, 454, -1001, -824, 739, 1058, -391, -1301, -149, 1033, 531, -903, -1131, 149, 1073]
5169A073j158j100M96J387N0j467n11J200J102p31j340K60J357M04j030j110Q17
5186c01J168j10j161m84J074J064p44j225J39J253N53j259r01Q62J111o22j133
5203g16j01J253K79q69p57M14J064k30q40m52Q18N11m05o49J23P81K02o08p51
5222i33N37P91k4o75k86O95L89k59o24J50O13K25n19l57M19N19k74m14k22O77
5242D28L1k73l91K90K18j32k38k61K49N4K34l04j08J19O6K2j99k17L81P0l30j58
5264d49J55L49J7l14K0j9J76R0l4Q6j16K79N8k76j16J03K49ok9l08M50R1k77k0
5288A59k65J81L78l12k10k39L65K40l06k58R2M09l16l59k21M94M06l01n40J33
5308d70L37L40k96n74L43O62Ro01l31O70M95j19p22K03O19K07o91l63J24Q54R7
$$ y = [1073, -85, -1185, -689, 698, 748, -719, -1230, -30, 1072, 341, -999, -739, 618, 1022, -8, -1118, -301, 867, 757, -404, -888, 186, 1250, 506, -719, -580, 673, 1226, -33, -934, -72, 1039, 417, -716, -817, 436, 715, -154, -911, -497, 567, 337, -503, -955, -137, 374, -31, -680, -557, 224, 426, -182, -933, -396, 395, 371, -304, -590, 105, 494, 235, -389, -239, 374, 599, 80, -277, 142, 661, 387, -27, -249, 428, 459, 186, -205, 85, 303, 171, -67, -328, -79, -25, 209, -95, -203, -84, -18, 4, -195, -412, -31, 39, -291, -449, -294, 55, 72, -242, -222, -241, -65, 25, -9, 77, -39, 240, 298, 22, -94, 9, 258, 252, 223, -85, 365, 456, 179, 159, -106, 75, 453, 141, -69, -308, 57, 297, -9, -267, -175, 234, -82, -441, -662, -168, 238, -63, -603, -470, -133, 207, -89, -663, -320, 342, 351, -250, -581, 89, 584, 465, -257, -54, 565, 772, 81, -282, -158, 696, 793]
5329G93q25k48L49P18k65r28J3Q68L08r00o36L95J124k93j187k74J149O21p77
5348Er30K44R68K73j037p42Q09J203m02j173r9J017Q34p75j228M55J427N3j376
5367d74m60J150J076m77j701J03J513O31j222j165R47J315k64j463n89J457J056
5384A433j325j144L45J457J91j459r13R84J565o14j535k30J564P05r32j643N97
5401i54J846J4j699p63J501J403r25j628L45J478O90j438r84Q68J440N7j651n11
5419i11J461J035j102j630M96J751K39j658j026J189J685q26j652l46J627R01
5435A233j312j520Q62J707k40j649n23J228J177o82j592K40J684M71j574p46P43
5452d93J599j42j467o09J306J261q38j402J53J418N99j521r31J118J422o65j697
$$ y = [793, -32, -280, 69, 787, 522, -406, -393, 475, 783, -117, -753, -358, 766, 473, -714, -988, 161, 782, 5, -925, -681, 287, 560, -477, -1219, -410, 793, 391, -782, -881, 136, 970, 195, -1033, -578, 849, 902, -474, -934, 216, 1292, 815, -886, -783, 730, 1361, 139, -1026, -79, 1236, 972, -491, -1080, 377, 1433, 108, -1036, -691, 766, 957, -502, -1415, -431, 1134, 520, -1015, -1245, 319, 1024, 92, -1551, -954, 892, 906, -793, -1556, -55, 1348, 423, -1205, -860, 618, 1308, -130, -1114, -246, 1194, 1251, -400, -911, 550, 1585, 483, -1147, -651, 1100, 1339, -319, -1345, -156, 1529, 703, -949, -1295, 332, 1233, -79, -1599, -737, 970, 730, -919, -1442, -214, 963, 281, -1311, -1071, 613, 1084, -490, -1236, -493, 1106, 964, -503, -1112, 194, 1455, 617, -785, -632, 786, 1385, -136, -1067, 51, 1473, 808, -889]
5469h89n4J291R09j115j052N42J263j88j278m97J103P42l66j390o0J312N51j050
5487b26j000N37J330M2j456k66J024Q87o48j109K79J308K68j240n23P89R34l68
5505E62q44l14R29N86o81r29N27Q34P6q94m70P28P33m06r42N5P61K93o88o23L42
5526c65Q52q2r05k50Q84K59l00q48J66P06K63p36k14M27N40l33k72j16L84L02
5546C62k86k99J40K83J77p3n27K08N20k56l51J33J04J00j18J4j74J18j17l5J90
5567A13j82NK1J11l25o0J05K25l4j35k58K70L51l24l2M1m1L03j53l24K75J81q8
5590D5m9j62J58L45rl23l26L86K39k17j93j29O28P5n71l66L33P24m28m27k69P27
5612A91M14p26n61N44N71j89k32o44N64N54k99o36L3P36M05p14q18L88J052j38
$$ y = [-889, -943, 348, 1257, 142, -910, -368, 895, 707, -571, -1068, 35, 777, 411, -979, -1039, 273, 824, -226, -1226, -689, 641, 683, -773, -1039, -15, 872, 224, -885, -606, 702, 970, -270, -793, -4, 930, 562, -282, -596, 333, 919, 238, -691, -164, 670, 746, -148, -618, 110, 843, 437, -505, -450, 311, 604, -84, -707, -365, 487, 405, -500, -750, 134, 393, 93, -755, -589, 117, 380, -356, -570, -143, 397, 64, -208, -324, 60, 362, 76, -223, -83, 200, 377, 304, -223, -15, 505, 249, -102, 31, 135, 235, 117, 131, -43, 75, -42, -77, 113, -69, -64, -43, 68, -257, -317, -212, 13, -21, -156, -414, -144, 207, -117, -149, -108, -149, 154, 1, -323, -48, 133, 45, -4, -166, -8, 337, 328, 5, -321, 65, 304, 87, -106, -235, 393, 468, -103, -469, -136, 588, 160, -267, -536, 191, 605, -121, -682, -138, 433, 244, 12, -632, -68, 486, 187, -449, -416, 320, 725, 11, -807, -419, 633, 495]
5632D95r37m19J011O07o33o68L2R80K75p05q60O07J054k58j041l51R60Q52r05
5651I6j000L46J147P8r12o61O17J266l74j349J11R86M89p40j052K75J507O7j320
5670d23p06J295P20m82j238j26J429P25j454r00R64J154j71j319n88J208J259
5687A347j008j478K65J459O06j431j005J113J495n30j967j64J760P86j083j397
5703a232P09J481M5j581n68J200J284n52j685k54J698O51j431j042P04J570o3
5720I34j615p08J460J316j079j637M31J754L20j526j060J069J690o32j784P4J499
5737E06P74j353j262P08J615q0j572n12J209J072l94j612j08J604P91j443j068
5754a125P01J600j39j507p43J473J150j093j325L18J481L58j510p49R47J149n01
$$ y = [495, -442, -861, 150, 757, 124, -544, -512, 468, 743, 38, -822, -215, 839, 581, -460, -811, 149, 1001, 96, -904, -558, 589, 667, -245, -906, -289, 977, 603, -746, -635, 351, 840, 100, -952, -677, 830, 897, -423, -1129, 166, 886, 404, -834, -960, 469, 1194, -260, -1160, -196, 958, 787, -532, -1120, 88, 1347, 339, -1139, -874, 585, 1191, -240, -1245, -132, 1363, 833, -1134, -1298, 462, 1248, 165, -1232, -523, 958, 1003, -578, -1146, 54, 1338, 786, -899, -1153, 545, 1196, -235, -1277, -573, 997, 934, -681, -1389, 71, 1387, 308, -1329, -898, 856, 1176, -350, -1410, -341, 1349, 717, -1067, -993, 506, 1280, -73, -1335, -627, 988, 908, -664, -1176, 33, 1105, 711, -901, -1009, 595, 1386, -57, -1125, -424, 1176, 1037, -470, -1213, 260, 1410, 317, -1008, -690, 791, 1149, -361, -1110, -163, 986, 485]
5771D85j281j15J171O61p69j387M84J487P9j403n49Q53J310n38j452R6J419M32
5789I83j082p40M16J284q5j351m63J277P13o24j061L08J079K14j068o38P88Q30
5807G80k51r33k85J047M41o63q28J76Q96K57q49n65O41Q23m35r49L5Q55K83p25
5827b49m42L39Q55k26o59j19O07J39p2n07J98K99K81n02l91K96N76j01m07l7L28
5848B06L60m02l59J79M28j25k48j47pK97j36k24o7K15k1k5k9j30J22q2l2R4j28
5871b61N6j4K80k44o4J5M27n0k92j94M29J82Kl16P9j13N50k69l90J03M53K05m12
5894A62m58K60O07L2o83l45O48M84n32q45L46P48j15n64m25N05N31k60p19k84
5914i07Q60N07n45p91N21O12K81j036j58O67P33m38j037J98J009M19r07o11O06
$$ y = [485, -796, -911, 260, 921, 152, -1235, -751, 736, 815, -588, -1137, -284, 1026, 488, -964, -868, 551, 983, -99, -839, -423, 861, 776, -575, -1038, 239, 952, 328, -733, -425, 654, 868, -200, -838, -50, 780, 529, -404, -689, 358, 799, 136, -692, -516, 380, 637, -212, -777, -136, 687, 252, -697, -662, 193, 476, -249, -691, -352, 503, 277, -382, -501, 106, 245, 173, -334, -136, 163, 444, -58, -449, -153, 423, 322, -85, -122, 206, 566, 164, -195, -16, 412, 287, 39, -108, -115, 182, 46, -178, -245, -30, -51, -76, -105, -235, -113, -195, -227, -133, -261, -205, -219, 61, -183, -247, -232, 195, 145, -147, -341, 88, 270, 272, -44, 35, -78, 472, 203, -187, -84, 369, 574, 162, -296, -36, 571, 603, -80, -425, 223, 707, 175, -670, -324, 424, 309, -255, -680, -175, 356, 96, -623, -907, -47, 460, -85, -876, -355, 257, 538, -498, -656, 11, 744, 306, -731, -533, 476, 895, -12, -623, -17]
5933a7R30j58j028m22J074O82m97j109J70J062J95r98p85Q21Q16j42j280l95J129
5952D8P99p54j162K94J336L07j590o53R33J471o48j611J44J520O16j157j020N92
5970e35J322K4j339n78J340Q54m52j291j03J467P33j304j083Q80J201n0j601l62
5988h77J244J130j133j447K36J672K98j627r63J169J410n03j891j14J631R79j533
6005c19j308O66J765j50j622n03J401J327q51j655K02J714O80j229j366Q52J703
6022A307j50j844l52J511J422j288j755M39J935J83j685j125J374J439p03j570
6038h62j92J487R05j333j341N59J629K10j847q45J394J534q67j842J27J797O65
6055A178j376j127Q65J516k60j546m19J369J054q81j338M09J452L45j373q60J017
$$ y = [-17, 913, 755, -273, -695, 379, 1061, 564, -545, -375, 687, 882, -116, -901, -80, 736, 594, -686, -1081, 48, 847, 93, -1069, -775, 561, 868, -722, -1375, -442, 1029, 381, -1230, -1086, 434, 1050, -107, -1127, -535, 787, 811, -528, -1106, 234, 1088, 636, -655, -758, 709, 1442, 138, -945, -65, 1136, 1086, -515, -877, 367, 1497, 364, -1083, -847, 825, 1123, -504, -1467, -298, 1112, 609, -1282, -1396, 235, 1214, -319, -1627, -961, 804, 654, -968, -1471, -70, 1257, 406, -1249, -1047, 667, 1347, 118, -1248, -396, 1307, 1157, -687, -1039, 472, 1894, 606, -1149, -710, 1225, 1408, -277, -1402, -28, 1411, 708, -862, -1054, 433, 1338, 5, -1336, -777, 852, 1062, -785, -1630, -236, 1298, 431, -1411, -1284, 513, 1178, -198, -1325, -460, 1056, 796, -750, -1169, 200, 1254, 373, -965, -556, 896, 1241, -132, -992, 25]
6072B5J385n72j465p1J355O55j123j173N37J301P7j392q47J208J150o34j672K52
6090a004J395L71j257p45P66R02Q6j505N3R13P76n91j013K40R97L04p77p36N27
6109b98J059j84j062lQ86N73p97p82O32P52P0r69k61N88O32n98o84J00O11K59
6129E24o71m64K55O19l2n76m68N98O05l62n06%M12L0k05k47K82M03k02l59J5L89
6151D0K67k77p9J05M03k55k33QL45Nk35Q4j5qj49J36J91k60q7J36r7n9p6j4J7
6176a07L43l73j11K4j09M54j87k99m4L03L85n90k97O12L39k45l84k01P64R0l77
6197a0l98M05L48J94q44j10P00N03m43p21J97O35K83o97n37L59Q44k84r68j7P77
6218B16N75o24j020N25Q80J03j117l65N62R93o11r87J21J241L17j124p02P01J073
$$ y = [25, 1410, 838, -627, -698, 657, 1312, 189, -984, -447, 854, 931, -461, -1308, -100, 1050, 416, -1256, -1004, 391, 762, -495, -1240, -474, 428, 514, -991, -938, -25, 751, 160, -853, -613, 384, 688, -89, -825, -298, 761, 577, -485, -488, 398, 971, 174, -608, 24, 776, 846, -123, -384, 204, 836, 238, -446, -346, 265, 524, -147, -611, -356, 263, 231, -345, -813, -215, 390, 28, -478, -478, -66, -36, -241, -488, -206, 197, -5, -364, -349, 40, 307, 30, -49, 56, 459, 204, -29, -21, 324, 329, 94, 178, 163, 155, 6, 142, 333, 73, -14, 122, 25, -34, -110, -124, -107, 236, -137, -248, -224, -333, 121, -66, -365, -409, -106, 279, -311, -608, 4, 343, 98, -286, -487, 277, 367, -10, -408, -3, 345, 539, -305, -415, 285, 788, 345, -376, -179, 456, 739, 42, -495, -136, 708, 424, -544, -561, 216, 791, 167, -853, -328, 552, 655, -462, -827, -265, 728, 117, -870, -749, 492, 809, -315, -1017, -316, 757]
6237G57k64j019k77R64P93n41j152K49J148M40j142r41Q35J258l23j444k74J457
6255E24O50q71j266O26J167J52j397n39J136Q80p55j145j6J236N76r73j014O54
6273c75J208R5j553p09J388J065q44j250N9J406O32j263j261J121J747n27j651
6290g12n32J564J055j105j574O25J624L39j623q12J119J420p55j724Q9J496P51
6307A245j187j449Q11J501M10j926q15J372J490j005j759K69J666P28j637j248
6323a534J155J715n28j594n51J629J014r79j567K84J887K99j553r56J015J665
6339A401o29j784n4J701Q38j366j309O15J728P7j776q61J489J295r88j437o2J893
6357G71N93j699j139J086J641n43j505m37J517Q94r66j326M54J384L19j314q49
$$ y = [757, 493, -526, -803, 161, 954, 413, -739, -490, 658, 1098, -44, -985, -150, 1108, 785, -659, -933, 524, 1174, 303, -963, -337, 830, 982, -415, -954, 182, 1062, 307, -838, -854, 382, 958, -15, -1029, -375, 833, 928, -625, -1334, 54, 1119, 275, -975, -916, 490, 1122, -141, -1402, -281, 1466, 939, -712, -1244, 320, 1375, 270, -1304, -679, 945, 1284, -339, -1151, -32, 1388, 633, -1091, -1002, 494, 1245, 58, -1391, -580, 921, 1331, -595, -1410, -38, 1452, 447, -1312, -1043, 623, 1351, -286, -1534, -379, 1336, 808, -786, -1337, 292, 1306, 327, -1240, -956, 931, 1230, -323, -1279, -264, 1401, 772, -1012, -1066, 635, 1473, 107, -1202, -587, 1141, 1218, -558, -1419, 70, 1365, 377, -1060, -1122, 771, 1364, -335, -1474, -388, 1253, 710, -795, -1232, 285, 1179, 213, -1113, -659, 725, 1044, -270, -1119]
6374a119R64J323m69j463k40J389Q68j201j250Q27J308k16j292k81J116O50o64
6391B50j092K67J025L72p93r56P06R80r2j171k89R38Q06o73r72J63J092K67r05
6410g7n97N74R50k79j161O9P43N12p17p03L13Q16l3q45k71O88N54l04p80N7P16
6431B25J63l04m37l2Q18j94n23k11M47L37k94l95KO70K32o63j61L34K95n5k10
6452D4r0K37l8j35k2J02Q4o9M2j78L6J65j20j22j67J22J05p0r4J68p5j14q7L34
6476E8k01k74J0M31j09m08J93L40J73j47m26L13J31J04l71k25L03N71m9p23J07
6497a99N39M93n37o25L12P97k09p50k35M42O53k74q33m4Q45K26n17q07K81J038
6517E96j97j087l25J142P96j026j104O94J114j8j344l51J025Q50m21j133R7J184
$$ y = [-1119, -155, 1168, 699, -764, -1004, 385, 1253, 52, -1198, -371, 937, 721, -571, -852, 264, 914, 250, -842, -575, 450, 822, 29, -927, -221, 759, 667, -504, -793, 145, 951, 278, -694, -531, 561, 828, -77, -674, -100, 850, 571, -590, -521, 222, 734, 17, -686, -373, 443, 410, -435, -706, -18, 536, 232, -548, -491, 225, 388, 84, -353, -385, 433, 239, -284, -495, -48, 289, -5, -400, -398, 272, 504, -159, -320, 14, 309, 254, 44, -46, 191, 153, 18, -4, 98, 182, 113, 155, -23, 13, 178, 58, -64, -231, -109, -4, -74, -168, 0, -75, -189, -276, 58, -143, -417, -407, 24, -85, -493, -300, 40, 213, 66, -360, -47, 84, 188, -183, -408, -105, 466, 417, -306, -199, 340, 833, 296, -329, -17, 780, 571, -179, -414, 28, 681, 407, -426, -470, 375, 601, 84, -723, -442, 596, 399, -688, -1013, 129, 925, -101, -1205, -511, 603, 585, -759, -1110, -85, 765, 344, -789, -692, 492]
6535D92L66p63r18N46J331j15j208o25J301J032j024j147L24J437J87j415q11
6552a010J026J140l56j647k14J333P74j222j110O40J301K13j654o12J149J144
6568H95p05j364N2J513O69j348j154R47J395j58j445m22J399J073j039j482L96
6585g78J793K68j338j112J306J237k63j717k61J550Q02j233j402N91J499K27j530
6602c61q07R10J551o91j853j57J769Q28j495j240N52J934k27j750m89J514J172
6619A160r41j510M87J564M39j371j043Q74J715m84j497l44J595R34j188j318L52
6636e76J701K72j541q63J109J252n40j758K8J523P50j383j340P01J737m58j387
6653g73o89J308J091q12j377L09J286M77j057j288R52J426p3j477n03J453R82
$$ y = [492, 858, 95, -823, -277, 1054, 939, -269, -894, 407, 1439, 415, -732, -408, 1029, 1216, -199, -1010, 16, 1156, 800, -847, -1061, 272, 1046, -176, -1286, -646, 655, 868, -786, -1398, -249, 895, 190, -1174, -1122, 391, 1060, -288, -1442, -495, 900, 742, -703, -1125, 274, 1347, 308, -1174, -778, 1015, 1283, -55, -1167, 139, 1376, 1113, -604, -865, 685, 1487, 254, -1148, -557, 942, 1169, -361, -1168, -258, 1293, 602, -1251, -1408, 361, 1189, -306, -1546, -994, 940, 713, -1037, -1526, -12, 1160, 219, -1291, -804, 760, 1199, -172, -1215, -341, 1374, 890, -607, -951, 644, 1578, 390, -928, -576, 1125, 1397, -144, -1007, 102, 1354, 814, -944, -916, 607, 1357, -26, -1366, -665, 1072, 614, -773, -1462, -154, 937, 125, -1252, -943, 343, 820, -237, -1525, -573, 853, 780, -697, -1200, 253, 1235]
6670A235r52j328N00J342K04j160q09J207J158p67j163o9J244N65j117q98N39
6687b69J125P1j363m72R94O70o71r35P2J095K71r46q20P50J018m09q28j97O88
6706a56P32o53q32L71R67M7o81m70O03Q11l11p43l1O46K52k15p01K87O71M0m74
6727A60m33K87N93j68o60P0M86K02n46o11N28L03j24o15J32K99L15m65m19L14
6747c52L82k58p4K2k5L22K2k71m2J28K51l6j66Q8L26j2l39J45m2J54m0P0j77M8
6771A24J35o4J35J00m70l3J18J52l05j3o3J31L54n31k79M62K07l18l29K5M52J17
6793A07p37k5O35L17k60m39r3O11M02m49p85N44P58j88o79k09O51Q88p04q26K87
6814a94Q26K28r06p47P31J118m97j167n4J056L96o63q59L51Q28K93j172p94J047
$$ y = [1235, 283, -1045, -545, 797, 1001, -159, -968, 239, 1397, 630, -533, -602, 642, 1207, 90, -808, -269, 856, 927, -436, -908, 86, 756, 85, -850, -778, 317, 588, -358, -1178, -428, 590, 181, -647, -844, -156, 576, -77, -909, -538, 429, 476, -205, -675, -72, 739, 428, -315, -346, 300, 552, 337, -364, -77, 594, 634, 160, -273, 14, 607, 439, -221, -151, 335, 537, -9, -620, -92, 211, 87, -528, -396, -97, 218, -247, -666, -352, 30, -228, -302, -280, -305, 17, 39, -232, -274, -146, 105, 69, -97, -9, 317, 305, -34, 111, 69, 223, 183, 253, 76, 124, 259, 195, 330, 430, -40, -73, 45, 197, -108, -121, -184, -53, 301, -230, -509, -47, 160, -158, -487, -462, -10, 107, -630, -655, -20, 297, 37, -402, -495, 116, 518, 69, -716, -172, 586, 398, -281, -490, 161, 1049, 345, -481, -194, 632, 860, -46, -793, -62, 1056, 559, -608, -662, 394, 790, 127, -732, -381, 447, 740, -432, -1226, -179]
6833a79R56n92j315J25J409N43j181j028P78J433l20j407l38J386Q99q62j446
6850a139M16J525Q3j058q62J008J238l72j543j00J396P32j203j134O07J413J87
6867A194j681p17J143J133m41j705J40J626P17j737j215J010J670m46j507m24
6883a240J350R89j049j453P11J437J82j185j125J202J353k86j784j91J588J001
6899A500j239j319L39J922O2j807n17J173J347q27j643K10J565O87j503j170P65
6916d55J601m16j556n18J391J219j094j613N02J538M15j419j059R81J729m40j759
6933i53j67J363J119j149j546N45J813M8j697n45J274J169n64j488j61J602O48
6950A311j221j140O62J326lj510m95J174J052p81j588L50J480M85j396j020J038
$$ y = [-179, 777, 185, -1130, -1005, 404, 947, -234, -1262, -484, 949, 629, -778, -1116, 270, 1169, 307, -1139, -723, 802, 885, -173, -1035, -27, 1211, 839, -704, -804, 592, 1324, 121, -1013, -406, 1007, 1194, -487, -1204, -61, 1072, 631, -1074, -934, 692, 1409, -328, -1543, -533, 1137, 691, -816, -1240, 110, 1099, 50, -1403, -692, 745, 927, -258, -1383, -181, 1172, 886, -898, -1089, 499, 1500, 261, -1058, -719, 1203, 1265, -542, -1059, 114, 1461, 634, -1009, -799, 766, 1453, -50, -1220, -455, 1146, 730, -826, -1344, 47, 1266, 172, -1441, -939, 599, 1014, -405, -1464, -483, 1246, 806, -953, -1120, 243, 1362, 213, -1333, -788, 1025, 1073, -624, -1169, 105, 1274, 710, -778, -939, 663, 1311, 90, -1050, -388, 938, 935, -575, -1070, 104, 1156, 375, -1213, -863, 617, 1102, -294, -1314, -276]
6967b76J363l20j620j16J359N65q11j245M79J385J88j376m74P83J092m39j379
6984h42J43J279N25j326o25N54J151k80r12n13R59Q54p63j097L71J045K66j005
7002b16p44O65J023j97j001j65Q41L71m74p81N54O54k17m61k98L61M61m2o82q1
7022d29O22M07m70n47J70N40J6o56j21N70L50l75m61J93M06Q3l55l51L02K53j79
7043c2k2q2J13J98q7l98J71K47J59l25P4j45L33r4j15l9J82j87J76q5j03K24j9
7066A44K13l01J26j75p4L26j34j58j06J33J87j05k74o0L62K3l70n9R9L36J6o75
7088e26R2M11J89k59j08q3N83j17k76m50N05O59l90n94oO70L74o74o04P77N50
7109G23l04q39JN31N92n20q20K02R47Qp67o18N57R38j85j287j7J239M53r49r19
$$ y = [-276, 1087, 767, -853, -969, 390, 955, 144, -1101, -622, 763, 951, -425, -899, -116, 976, 537, -842, -699, 580, 1105, -221, -846, -292, 859, 579, -333, -846, 113, 967, 204, -893, -522, 523, 789, -216, -960, -295, 728, 531, -470, -635, 206, 577, 103, -678, -124, 530, 313, -148, -446, -85, 376, 334, -348, -429, 193, 600, 130, -417, -247, 293, 309, -347, -468, 102, 452, 77, -384, -191, 215, 298, -57, -408, -106, 147, -32, -54, -136, -23, 175, 88, -310, -139, 108, 267, -58, 16, -129, 204, 110, -5, -44, 138, -49, 127, 42, -61, 163, 144, 357, 56, 182, 7, -67, 259, 125, -33, -139, -6, 181, 76, -198, -258, 104, 127, -243, -302, -203, 133, 149, -526, -434, -23, 166, -93, -201, -284, 299, 182, -94, -544, -39, 620, 230, -364, -370, 300, 674, 0, -604, 173, 723, 419, -420, -419, 112, 704, 184, -636, -434, 513, 521, -246, -864, -307, 631, 446, -841, -858, 381, 834, -115, -1034]
7130a034M41J007K07j090o83R95J227q68j125K95J155N19j368q12R83J306n60
7147E95j139l04J301P14j008j111N23J396O2j225p29J038J097p09j421q5J732
7164G27L79j247j171Q06J486j23j780n65J557J090j120j384M85J537K44j391r20
7181a390J086J416m51j448j76J463P25r91j486Q17J691j87j480n18J202J141q85
7198E29j345j01J845L70j252j259Q27J627k50j753m00J389J034j174j531O66J463
7215F85J07j411o14R81J116m15j457n5J261Q96j077j259N12J704k5j484p93J310
7233a8J216o91j381R2J521M27j183p78O61J150R3j366m11R51Q83o14j396J07J338
7252F01N06j370r52R16J113l39j359k78J350P34j104r38L66J358o1j173o24J011
$$ y = [-1034, -593, 414, 621, -469, -1152, -157, 1070, 202, -923, -628, 527, 1046, -322, -1134, -151, 1155, 595, -544, -848, 453, 1167, 159, -952, -429, 967, 1029, -196, -925, 113, 1210, 501, -920, -1005, 727, 1106, -141, -1312, -506, 980, 857, -923, -1488, 69, 1159, 39, -1345, -860, 677, 921, -470, -1390, -304, 1112, 661, -787, -963, 500, 1225, 234, -1252, -435, 1256, 1069, -411, -929, 273, 1414, 529, -816, -917, 928, 1298, 46, -1213, -386, 1241, 991, -762, -1162, 227, 1261, 87, -1444, -778, 685, 792, -619, -1233, -252, 864, 449, -1008, -1063, 198, 1094, 17, -1242, -730, 974, 949, -535, -1328, -18, 1198, 507, -874, -782, 739, 1166, -17, -795, -134, 1016, 1109, -257, -668, 283, 1166, 552, -844, -737, 601, 1107, -263, -1215, -299, 814, 475, -884, -1162, 188, 922, -182, -1120, -754, 604, 543, -630, -1254, -243]
7270b43J303p74j027q8J346L56r72p64Q48Q96j49j053l95Q74P42l65j042M8R81
7289E22L86r62p11P49R00k11j309n4J137L32r26q10N05R87j94q18j76N30O56m81
7309E2o81j6O41L27m64m52K98O74j12o11j45N19N03k54n35J90N05J5m49k16M37
7330B26L19n5n10nK64K82l17l52K01K97j74k85l1R0J23k51r5O8q8K72k36q8l9
7353c84J77O1j04j54J07K74j1M1r1R2j33J75J21j63j05K36M0N5k66k3L09K16m14
7376E6j39J40L11J17k96l54L25P4n7l17j85L81J94k00m02j85N66J14k64n39M34
7397b26N97l38p83K53N01L51m16o05K71O60M4o31k46M87P15l11q04J25Q54K18
7417G16n16o62L89Q21q1q87l06Q18N56k56j000L8Q71L09q97q76O60J305m83j236
$$ y = [-243, 1060, 286, -741, -829, 517, 873, -99, -863, -15, 881, 732, -321, -716, 158, 900, 535, -507, -459, 522, 908, -54, -765, -16, 884, 673, -636, -690, 447, 779, -147, -957, -452, 535, 341, -477, -653, -123, 533, 52, -629, -645, -4, 323, -141, -593, -295, 379, 267, -344, -489, 30, 533, 279, -256, -66, 439, 454, 5, -211, 226, 545, 490, -20, -25, 239, 521, 204, -148, 53, 350, 176, -109, -140, -50, 73, -178, -273, -205, -293, -21, -257, -345, -384, -207, -146, -250, -404, -297, -23, -34, 7, -84, 8, -125, 50, 171, 8, -97, 139, 179, 234, -32, -55, 254, 470, 56, -83, 57, 368, 485, 189, -165, 160, 234, 177, -140, -325, 56, 250, 50, -352, -537, 29, 143, -121, -660, -226, 371, 33, -750, -497, 4, 355, -61, -666, -395, 265, 309, -322, -568, -81, 634, 323, -481, -356, 498, 716, 200, -462, -73, 748, 667, -220, -526, 292, 848, 592, -408, -370, 501, 810, -87, -963, -303, 1002, 519, -717]
7437g17k61J297N85j198p55L90J364j72j181l31Q25R27l87j373J22J354N37j121
7455i5r86P85J336r8j329p06J485R58q33j427L02J621J49j397q62J146J245o30
7473F64j531j92J561O35j069j199N74J496L3j799o50J320J158p80j651L77J652
7490E99N21j626r45R31J589l15j598m38J700J145j228j601M83J947j01j522o08
7507a067J186J229p60j259J03J224O42j118j318P80J300k8j400p60J192J230q43
7524C33j598M12J543J42j237r41J157J329p13j373j70J419P19j016j354Q03J304
7541G59q8r20p64J025J141n56j219p0J288N06r50j001M45J226J32j433n59J253
7559B15R70o59j249J79J158M73j332p34P65J069l83j088k91J178N58p81r47K12
$$ y = [-717, -978, 319, 904, -294, -1049, -659, 705, 533, -648, -979, -154, 773, 386, -987, -865, 489, 1026, -95, -1081, -296, 1040, 942, -387, -1093, 392, 1350, 517, -910, -608, 1013, 1162, -235, -1097, 49, 1294, 664, -867, -1059, 502, 1137, 68, -1131, -557, 939, 972, -827, -1477, -157, 1001, 221, -1430, -1053, 599, 1120, -506, -1451, -520, 1069, 754, -844, -1282, 418, 1563, 335, -1266, -783, 1164, 1063, -459, -1067, 119, 1348, 588, -671, -568, 656, 1298, 180, -1138, -358, 942, 914, -486, -1246, -54, 1176, 333, -1265, -853, 690, 832, -405, -1346, -189, 1140, 427, -946, -1116, 303, 1022, 6, -1348, -545, 759, 671, -249, -1013, 12, 1153, 597, -622, -692, 596, 1102, 152, -849, -404, 822, 954, -479, -1038, 215, 1185, 526, -723, -544, 614, 1087, -245, -979, -214, 855, 472, -616, -907, 271, 829, 48, -899, -687]
7577f87J092J18q61o32P09P85j48j018M8R81M73r09p07O80O15j92p42r8P44M29
7597F80l53p08Q2O04K64n39o58M76P04j07q44k76J091Q4n60n12K48O34j4n27l30
7618e61N24L21r5o37N7N92Q8l24m69M85L73j47m26j8L23J43k97j09k1L49K83n54
7640a20P8j4Q5O2p7k41K69J9L7k64J96N1N6k07J4j20J27j99J85O1J24k26K53O2
7664B11j57k38K08L59m35q7j43L49k1R1l17p5L47K05l22l55J89K06J12l77K7K92
7686F9L78k92m44PM77K17l81n34K86N29qo47lM22L81l52o22J03P74J26p29j67
7708d10M83O03l00q33j30Q50L03m71n56K07P81N9p13n58O05Q10l40j059J16Q19
7728B66M98r34p42O48R37k21r31k97R31N82m55j069k8J191N87j114q14P34J062
$$ y = [-687, 405, 523, -338, -970, -261, 524, 376, -642, -594, 387, 860, -49, -756, -76, 539, 347, -395, -493, 251, 680, 327, -381, -299, 305, 569, 30, -628, -152, 552, 445, -399, -675, 416, 500, -60, -572, -324, 310, 296, -231, -561, -37, 284, 189, -448, -391, 201, 289, -35, -504, -19, 354, 207, -219, -237, 86, 229, -68, -177, -198, 151, 434, -120, -42, -56, 29, 91, 14, -227, 42, 61, 98, -166, 30, 81, 137, -70, -56, -176, -49, -248, -63, -2, 122, -104, 149, 211, 54, -184, 24, 383, -52, -139, -282, 67, 46, 137, -180, -255, 92, 297, -25, -380, -191, 15, 127, -250, -223, 69, 447, 155, -289, -282, 195, 412, 31, -503, -217, 312, 304, -343, -346, 76, 457, 105, -517, -414, 360, 486, -243, -410, 73, 676, 376, -457, -587, 263, 566, 95, -461, -254, 527, 586, -127, -685, -80, 730, 390, -669, -553, 266, 764, -170, -912, -264, 673, 452, -479, -776, 155, 737, 282, -787, -815, 376, 963, -151, -965, -231, 831]
7747H31j43j443j42J189P69q37j114L82J481r4j224p01J162R74o16j357J23J262
7765E02P12j414r97R45J175k39j437l79J205Q92q60j172J53J588K68j309q38Q30
7783c75J528n48j475m74J630J120j285j266M01J976k17j568n30J366J033p28j642
7800a054K11J504N88j204j277J093J280l09j479k84J193J032j110j167J53J397
7816E67L85j506p79J121J301p69j298JJ354P23j253j268P34J559o8j515m36J334
7834A87Q87n95j379K35J303M31j114q66O44J423k95j297m24J081Q99q36j144K92
7852e68J273L13j309r64J155J178p01j289J22J126N12j035p64L29R41K37r46o12
7870a002Q61Q54m05j104q5J143N62j071n73N35J075k23j042k46J094P41q69p39
$$ y = [831, 688, -755, -897, 292, 1061, 224, -890, -508, 973, 879, -345, -1046, 116, 1090, 474, -883, -760, 502, 1214, -200, -1197, -252, 923, 684, -753, -1132, 73, 965, 105, -1067, -914, 674, 942, -367, -1205, -375, 1153, 605, -870, -1344, 286, 1406, 121, -1145, -744, 1232, 1015, -553, -1083, 283, 1316, 588, -1054, -843, 661, 1249, 45, -1232, -139, 1141, 832, -647, -931, 262, 1294, 184, -983, -830, 567, 952, -554, -1333, -212, 1089, 320, -978, -977, 377, 1100, -153, -1421, -687, 872, 804, -711, -1147, 187, 1074, 479, -900, -665, 638, 1069, -45, -911, -267, 1156, 861, -436, -860, 221, 1120, 284, -860, -568, 705, 1018, -291, -1255, -100, 1078, 377, -912, -790, 336, 848, -187, -951, -622, 319, 556, -390, -1002, -141, 713, 308, -796, -881, 262, 824, -247, -820, -285, 790, 567, -475, -721, 373, 1114, 245, -494]
7888d94R6J085J55q91m80O42O60k48q93j28P26K91l27p74J76O83R9q18q5K45N46
7909B66k63n82O4N76L17o11m60L21P48p9o48j11N36L30m14m09L26M31j68j54J1
7930B7K25O8K03m77k27M52J94j45m92K53O2J4m9k87J80K11j42j81O6j07J75j58
7952a35N7j4j91Q6J15o5k38J39J23L9kk1j67L39K5j08k17K00L51j21l45O8L65
7975B83K89n44p2J91M61l3n27j99K84L36k30l74l21N63M52m37o38J62O64J6p23
7996c97k35M73N41m39o13J24N41J70n41l55L47O14N1o09l75P87M72l27o75n8R51
8017D47L06p49n59N93Q17l37q59r6P87O04n43r76M83P18L45j117n94P12Q84k42
8037F24j271k39J265M65r08r42M59J052K4j087o53P71J192o06j269M5J349O51
$$ y = [-494, -398, 687, 842, -49, -529, 113, 773, 525, -368, -496, 230, 521, 194, -580, -404, 279, 378, -440, -525, -280, 266, 3, -579, -515, 61, 378, -233, -693, -372, 376, 297, -351, -462, 74, 404, -10, -419, -93, 338, 170, 16, 27, 252, 320, 523, 46, -181, 271, 465, 320, -172, 81, 143, 157, 108, -179, 1, 212, 70, -111, -45, -152, 23, -135, -78, -92, -283, -197, -82, -147, -385, -246, -123, -84, -86, -107, -274, 65, 90, -18, -235, -35, 316, 195, -150, -82, 283, 572, 28, -44, 147, 608, 575, 48, -151, 133, 469, 239, -135, -456, 107, 559, 122, -516, -354, 310, 326, -397, -632, -159, 382, -57, -670, -546, -5, 165, -376, -731, -384, 230, 281, -328, -703, 84, 556, 229, -446, -504, 447, 753, 4, -555, 38, 855, 518, -341, -437, 350, 954, 411, -565, -82, 636, 981, -136, -730, -18, 866, 624, -647, -886, 379, 844, -64, -1006, -547, 505, 529, -558, -1211, -440, 752, 146, -1123, -1078, 271, 922]
8055I22j004r95P05J222k53j150m54J440P47q51r68K09J299J81j141q36O86J436
8073A195m41j376j32J264P31q56j462M66J495J09j605q17J377J174q65j543J91
8090a095J431O06j418r05Q42J520l37j464n83J442J189j197j261M39J769J68j492
8107c46q63J149J232m30j565j49J594Q69j385j159O49J621k4j726p23J591J041
8124A376r91j335O3J474P22j728q74R72J294n42j411j98J312Q23r39j484O83J409
8142F26K61j518n41J010J255n71j479K46J363M65j049q92O88J331m26j196k89
8159g16J122O43n03j200L1J347M12j371o83Q91Q98l08j276l50J415L60p13r28
8177i29L80R73L9r28n53Q35Q96o42r12O5J033M66q73n91
$$ y = [922, -82, -1077, -372, 850, 597, -553, -1007, 433, 1180, 329, -639, -430, 869, 1050, -91, -927, -241, 1195, 754, -622, -754, 510, 1241, 385, -1077, -611, 884, 993, -612, -1429, -52, 1122, 257, -1286, -1095, 336, 942, -476, -1381, -539, 981, 644, -820, -1403, 39, 1228, 31, -1230, -791, 978, 1146, -346, -1209, -60, 1172, 742, -823, -972, 622, 1491, 106, -1053, -404, 1217, 1193, -533, -1256, 335, 1376, 385, -950, -887, 587, 1309, -419, -1293, -321, 973, 431, -980, -1178, 134, 957, 18, -1466, -783, 626, 887, -631, -1172, -162, 1093, 522, -957, -711, 652, 1117, 68, -824, -136, 1195, 769, -427, -716, 406, 1049, 546, -654, -623, 724, 1136, -235, -918, -27, 871, 563, -713, -1063, 352, 712, -1, -929, -549, 424, 463, -465, -1018, -183, 713, 71, -841, -776, 257, 723, -150, -741]
8191g41
$$ Imaginary data points
##PAGE= N=2
##DATA TABLE= (X++(I..I)), XYDATA
0@%%%%%%%JkJqJ6j7K5l2M0n6P2q6J00j19J45j72K00k37K81l27L77m36N05n79O60
32C52p52Q52r67J095j231J379j546J730j925K141k383K644k923L228l568L940
48B066m343M784n269N806o398P052p783Q603r530J0587j1800J3215j4890J6907
62I007j9393K2547k6701L2450m0988N5138q4056K43404n39872k07403R71336k384
74D13085o32020o1529M01284n8387p7278J08618j85498k77054M39520L74045n95504
85a50718n01331P06200N28036p00277m81851O27239L35387m37037j60060K35845
95A433j8063j1051K21537j20071m14734K29663N89868k80810o88579L25793P10801
106E45787l15033o23126K88837M42446k34406k00324J54266o4851q4142K79182
$$ y = [0, 0, 0, 0, 0, 0, 0, 0, 1, -1, 0, -8, 8, -9, 16, -16, 24, -32, 40, -46, 54, -65, 80, -92, 108, -129, 152, -175, 202, -234, 271, -308, 352, -400, 452, -515, 580, -651, 728, -818, 912, -1013, 1128, -1255, 1389, -1534, 1694, -1874, 2066, -2277, 2507, -2762, 3044, -3354, 3698, -4085, 4518, -5012, 5575, -6225, 6990, -7900, 9007, -10386, 12161, -14540, 17910, -23078, 32060, -51996, 191408, -348464, -555867, 415469, 413085, -218935, -280464, 120820, 62433, -14845, 93773, -91725, -368779, 70741, 444786, -150718, -652049, 54151, 582187, -118090, -599941, 27298, 362685, -74352, -234412, 1433, -16630, -27681, 193856, 73785, -340949, -111286, 478582, 197772, -490807, -165014, 545787, 230754, -392372, -103535, 338911, 104505, -95819, 58447, -6404, -90546, 188636]
116A88636M2412m53379n8021N64254O1683o48173o8121O31950L3003n38643J2525
127b31874L61335q9853j58110J57349o3412k15727K50081K58469l67988k86496
137c86226M34752L16662m50620l00774M46080K40206l81062j02690K96104m1088
147G1344j66333J93265M2458l11568P5321M02375j47274m38217J84902M33276
157C39549j97623l98203J96861L12420k13662j88995K13241J6940k04129J41209
167A7608J56828k85502j22498L62353P6254l97286l8620L81039o703l40542M8440
178a48629K74351j02539j82542J77353P5183k35510N6299K74567j61442k63120
188b36029K41388K35366k69963j75774K84028J20997k64067m8659K35792k9112
$$ y = [188636, 231048, -222331, -280352, 283902, 345585, -302588, -370709, 261241, 294244, -244399, -231874, 129461, 39608, -118502, 38847, -24565, -240292, 9789, 268258, -99730, -386226, 48526, 365188, -85432, -386206, 59874, 300080, -80982, -183672, 112432, 71344, -94989, 98276, 140734, -170834, -95513, 306862, 159588, -278629, -93727, 339549, 141926, -256277, -59416, 253004, 39342, -149653, 63588, 80528, -123601, 17608, 174436, -111066, -233564, 128789, 205043, -192243, -230863, 150176, 143473, -197069, -148629, 125722, 23183, -159359, 17994, 93177, -142333, -86034, 188533, 27091, -236029, 5359, 240725, -29238, -205012, 79016, 200013, -64054, -112713, 123079, 93967]
198I3967j96285J17156J50249j98265q5628K53572j047k78020P6943K50554j44277
209C8919k04454J79437J35661k11307p2425K23448k300k36789O5955K24140j33437
220F848j91577J93440J31919k35941n1558K44567l6457k18909J20596J87380j75134
231b4826j46499K19446J13847k39225o3139K48630J2718k24713N3424J83591j12749
242B0505j09393J69014K0844k08897O4750K25597j30165k24362J66435K05803
252B00131j89848j83024J87929J29831j80740o0111J50755l5387j15593J25768
262B9711O4794k09482j8211K63106k3423k85522M8923K79216n5668k43306N9465
273i0397J84172o3762r8404Q4781M270r5703J00410J07141j86680j06498K50351
$$ y = [93967, -102318, 14838, 165087, -33178, -118806, 134766, 133719, -144301, -67358, 183196, 38919, -165535, 13902, 149563, -61744, -134169, 89279, 86979, -149810, -83855, 140285, 6848, -184729, 8711, 140630, -95311, -146869, 97698, 61241, -157668, -37072, 150308, -24826, -171325, 48121, 161968, -77257, -140396, 108234, 120952, -103761, -50337, 133254, 20505, -88888, 80126, 100970, -107927, -43177, 182420, 52255, -172107, -5672, 200131, 10283, -172741, 15188, 145019, -35721, -95832, 54923, 19536, -96057, 29711, 94505, -114977, -133188, 129918, 106495, -179027, -130104, 149112, 93444, -149862, -90397, 93775, 30013, -68391, 16390, 20660, -75043, 25367, 132508, -54172, -160670, 89681]
284H9681J05313k71589r3862K55296P8230k05699n1802J36790Q448o1964M9908
295C8750j8401j18505R2852J77508j57589k23286J88726K36163j94554k22968
305b01304J69396J79111j29557j15507P8380L1334l4200O2255Q91j56561K1049
316i4713K37802l1848k86241L7008K95361l1620k59079K4977J94320j2039j00804
327b6876J0904k023k1326J05111M8711j90625q0239K53841J09483k84085j26791
338b03915K74282J24551k28290j05751J50301O5490o1401j1285k7386n8645R5408
349A3359J27090j44103j88752J66666K31263j63858k43900J36383K18787r2455
359F0480j58783M1423P6489R346J9427m5975j12799O5948J95053o5125k53535
$$ y = [89681, 194994, -76595, -170457, 84839, 163069, -42630, -94432, 42358, 50806, -11158, 38750, 20349, -98156, -5304, 172204, 14615, -208671, -19945, 216218, 21664, -201304, -31908, 147203, 17646, -97861, -19481, 11853, -22347, 39908, 40799, -115762, -94713, 143089, 111241, -175000, -137992, 157369, 125749, -133330, -108353, 85967, 73928, -26876, -15972, -17995, -39321, 65790, 114501, -76124, -156363, 97478, 206961, -77124, -203915, 70367, 194918, -33372, -139123, 11178, 76668, 15267, 3982, -23404, -82049, 13359, 140449, -3654, -192406, -25740, 205523, 41665, -202235, -65852, 152935, 60480, -98303, -56880, 19609, 28955, 48382, 2407, -110392, -44444, 150609, 85484, -168051]
370a68051N0310K81229k5383k68547J785K17662J4302j37749k2583L9208K0510
381B693O3224l325j53931k6124K17762O0791k50240r1827K48113J10222k14067
392c6709j09141J54513Q6383p8015m5264n204r276Q0299O9845j34720j25514J63789
404A0986J65992j68791j86959J51032J82120j15940j48693P3168R0402k9634j6634
415G049q831o3202L7255J35236n2204j90041N3151K20861m3890k24763K8277J98226
427I7124j3908j45698O090P7283o287l121J4255o8441k7711J28659M4185j65470
439f3040n6051J78804O3630j65672n9873J34475M4414q8940j4927L8081k0802
450i901J2939N8263n7699r3476Q8024J17632j05849j28160J07700J19297r9830
$$ y = [-168051, -117741, 163488, 138105, -130442, -128657, 89005, 103307, -34442, -57025, -17817, 2693, 65917, 62592, -91339, -117463, 100299, 161090, -89150, -180977, 67136, 177358, -36709, -145850, 8663, 95046, 17031, -28233, -33437, -42713, 37586, 107431, -27289, -152803, 10986, 176978, 8187, -178772, -27740, 154380, 38440, -110253, -37085, 53317, 23683, 7049, -1782, -64984, -27729, 107507, 55303, -134738, -81587, 139274, 95384, -129379, -101102, 97124, 83216, -62482, -56392, 20891, 14604, 11483, 25738, -42703, -70414, 58245, 102430, -63040, -119091, 59713, 123343, -42329, -102202, 32273, 76687, -12253, -27180, 10901, -9901, 3038, 61301, 3602, -89874, -1850, 115782, 9933, -118227, -10527, 108770, 8940]
461H940r7808P9949N9599n9010j5654L6269l3178j6302P7110p36j10812J3216
473e8417J29427k1166j29753L0551J16258l5941q5305M3177M6851m7582k168N5570
485D1502l7615n8250P4422N8606r9120n1089J12518L7037j12901j8504J02827
496D9433m351q6168K8937O0578n5333l5390P2504Q938q5619J3549Q7161l7346
508A6893q3048N4016O5473o8891m2976P6444J5475q0246J1164P9054l5136p0226
520f2004N5387N5639o5453l2661P1139J0084o5597K0024N8589m6284m3880P3811
532B8794L1660q9568j5980R8720L830r5838Q368Q2345k0411n8926K8937K6153
544B8084l9783N473M6713m0382n7630O4719N9977q4924o2809Q8219N5668q2679
$$ y = [8940, -88868, -8919, 50680, -8330, -23984, 12285, -20893, -37195, 39915, 39179, -71633, -58417, 71010, 49844, -79909, -49358, 66900, 30959, -54346, -11169, 35682, -11900, -14068, 41502, 3887, -54363, 20059, 78665, -20455, -71544, 40974, 78011, -34890, -53394, 49433, 45082, -41086, -12149, 48429, -6904, -42294, 30210, 39148, -46471, -32922, 54239, 16893, -66155, -12139, 53334, -15557, -58533, 17911, 33386, -46860, -35696, 43358, 8222, -62004, -6617, 49022, -16431, -49092, 22047, 32131, -33466, -13442, 45147, -1137, -45017, 28794, 60454, -29114, -45094, 53626, 57456, -38382, -30014, 52331, 31920, -27006, 1931, 28084, -11699, -6226, 40487, 105, -57525, 7194, 67171, -17753, -80562, 7657, 63325, -19354]
556a9354m5966O3257K5750l7709J32Q566k9681K1805O0772m3860q5042O0844J06065
569H5579o3638j10306O2514J04871m7796q0310L3842M8199j5380m178M273m0598
581b2928L466Q3287m415j15414j518J30804Q488j31685j8497J11519K0194p9536
593a6235k2273L1771J2456J4059R2o1693k3234R5198M4370j18446o5465J22002
605A2602P7364j08211p9064Q1420O9115m3122m2956O119J1078L2349L1432n5620
617g494o7786P1534J03476o7237j21836N6837J26632l3358j09210R728P6031J3972
629E1289l1423l1629k0515L6606O7433l5355j09326J9552J29402m011j36930j8659
641h3566J18778L0952q8125m0498L9557L5727J1240k3331o0427P36R9334K8325
$$ y = [-19354, -65320, -2063, 23687, -14022, -13890, -5324, -35005, -13200, 47572, 3712, -81330, -20486, 85579, 21941, -88365, -25851, 79020, 31224, -49086, -15244, 32955, 17575, 13397, 17670, -22928, -19462, 63825, 59410, -56004, -57522, 73282, 81770, -49915, -68412, 43107, 63301, -16235, -38508, -6737, 5719, 19778, 19870, -41823, -65057, 30141, 74511, -43935, -109400, 12602, 89966, -18245, -97309, -15889, 53226, 10104, -32852, -26733, -15655, 16694, 48126, -7494, -75280, -3746, 99730, 32493, -89343, -32506, 94126, 60768, -48442, -38714, 37317, 51289, 19866, -11763, -32278, 4328, 71761, 36406, -72920, -53368, 76034, 72023, -64907, -83566, 35212, 66164, -21961, -62459, -22902, 12825, 24065, 734, -59693, -58957, 40377, 68702]
653F8702j20704n3682J26393P7185j09253q5441Q2354Q4667l9934o2524P91L1970
665E24M0451J1375o7383n1945Q3610Q9639q0799j14757O5475J23371m2195j15026
677e7660J2302Q5167J2116m5774l4128o419M0865N3683m2458j00107K8913J26574
689G3074j3021j38899j1038J29048K9946j03795m3220O4735M5748j7214l4629
700a9265k7793J8397P0352Q545r5387l1790J09684N7986r9947o9543Q1009P5563
712G7811m7161o4261J2945M3667K1414j2526m9079k3109O6078N4220p3966q1297
724g5264O6070R0881n4044r2365L1019P5224j2018n2382j0001J6618K0523J7520
736B1781k6191n2358K3909P7253j7623r0561R261R2315K082p7532q234N6250J4867
$$ y = [68702, -52002, -105684, 20709, 97894, -11359, -96800, -14446, 70221, 30287, -32237, -31446, 524, 40975, 52350, -15033, -66978, 16632, 106271, 25472, -89285, -23810, 99561, 57366, -57660, -45358, 39809, 51925, 6151, -27977, -34396, 6469, 60152, 17694, -82413, -53500, 73074, 60053, -78846, -89884, 39164, 69110, -34685, -77905, -13170, 32578, 15364, -19265, -47058, -28661, 41691, 50236, -45151, -76941, 32743, 90729, -9218, -78761, 2248, 77811, 30650, -33611, -20666, 23001, 44415, 31889, -17190, -40299, 25779, 79999, 6033, -75264, -9194, 81687, 27643, -64722, -33703, 41521, 29503, -22879, -32880, -16262, 4261, 21781, -4410, -56768, -32859, 44394, 26771, -63790, -54529, 37786, 39868, -37664, -45898, 10352, 25219]
749B5219k3340j0645n295N138L5985Q105n5438j7464P1582K8494p4945l2509O9742
762B4629L0960n5354k3409L5723R558j7138M222k865k3438J5108L6309k7508n0627
775d3830L0114N3419l3898n2776K9695M0887k7557k6892K1901R001j5605R407
787f134J0712k4358o205L7506N521m1608P14M5001l011l7931J1826L1589j6076
800G546j7617K3403O319k5705P338K8615j6705k7597K2586K2050k7992j5830K9018
813A5429N333l2231L965K8594j7566k8121K3870K0825l0051j6681K8583Q291k5654
826a5414m87J7161r986q722K0503m47k8981J0495L8643j6262m2748K1707M4257
839B9719k0623l5495K0652K6435j4702r258J2051o625q338K5568Q371m0818q967
$$ y = [25219, 1879, -8766, -14061, -8923, 27062, 35167, -20271, -37735, 33847, 62341, -12604, -45113, 24629, 55589, 235, -23174, 12549, 22107, 4969, 9191, 6326, -17112, -2004, 34305, 6797, -43830, -13716, 39703, 5805, -46971, -17276, 23611, -3946, -30838, -8937, 64, -15541, -6134, 4578, -19780, -25985, 11521, 17042, -24566, -23852, 21149, 18138, -19793, -7967, 23622, 7546, -10071, 13332, 19651, -6054, 1284, 29899, 13194, -14403, 8183, 30233, 2241, -13589, 15429, 20762, -11469, -7504, 21090, 3524, -24597, -727, 20098, -9953, -26634, 1949, 10240, -15414, -15901, 1260, -8726, -17448, 3055, 2608, -26373, -15878, 22765, 6503, -36245, -14538, 29719, 9096, -26399, -5747, 20688, 5986, -3272, 8779, 2154, -6184, 19384, 27755, -13063, -22030]
852b2030N3135J2274n8273j6378N3284J6215m3901j6404K5893J1021p015o571
864A250j5755n928L1404J6969m5811l0845N0034L9991m8062m4988L8061M2966
876B9286k3505l3876O629K0047J2974K095k5091k2462L3823M3820l2434n7707
888d6401K8247O8439j5646o5883K495N4615J1788l3678k2382P669K6544J9572
900C5379k4779m4716J6551O1278p140p1874q767O8641K1555n6847l1304L3535
$$ y = [-22030, 31105, 43379, -14894, -31272, 22012, 38227, -5674, -22078, 3815, 14836, 7821, 1250, -14505, -20433, 10971, 27940, -17871, -48716, 1318, 41309, -6753, -51741, -13680, 29286, 5781, -28095, -21466, -1419, 11555, 13650, -11441, -33903, -80, 43740, 11306, -46401, -18154, 50285, 34639, -31244, -28749, 25866, 37654, 3976, -18406, -10737, 15807, 35379, 10600, -34116, -17565, 43713, 36573, -35301, -44068, 24573, 46128, -10719, -42023, -8488]
$$ [...]
8191B8
##END NTUPLES=NMR FID
##END=
