##TITLE=1H_LY-877.60
 CCl4, 8 sc, 
 12.11.2019
##JCAMPDX= 6.0         $$ Bruker NMR JCAMP-DX V2.0
##DATA TYPE= NMR FID
##DATA CLASS= NTUPLES
##ORIGIN= UXNMR, Bruker Analytische Messtechnik GmbH
##OWNER= root
$$ XWIN-NMR		Version 3.5
$$ Tue Nov 12 14:41:36 2019 Russian Standard Time (UT+4h)  she@DPX200
##.OBSERVE FREQUENCY= 200.131
##.OBSERVE NUCLEUS= ^1H
##.DELAY= (6, 6)
##.ACQUISITION MODE= SIMULTANEOUS
##.ACQUISITION SCHEME= undefined
##.AVERAGES= 8
##.DIGITISER RES= 18
##SPECTROMETER/DATA SYSTEM= spect
##.PULSE SEQUENCE= zg30
##.SOLVENT NAME= DMSO
##.SHIFT REFERENCE= (INTERNAL, DMSO, 0, 15.7039)
##AUDIT TRAIL= $$ (NUMBER, WHEN, WHO, WHERE, WHAT)
$$ ##TITLE= Audit trail, XWIN-NMR		Version 3.5
$$ ##JCAMPDX= 5.01
$$ ##ORIGIN= Bruker BioSpin GmbH
$$ ##OWNER= she
$$ F:/spectra/data/she/nmr/H-F/1/audita.txt
$$ ##AUDIT TRAIL=  $$ (NUMBER, WHEN, WHO, WHERE, WHAT)
(   1,<2019-11-12 14:40:35.31 +0400>,<she>,<DPX200>,
      <created by zg, POWCHK disabled, PULCHK disabled
       configuration hash MD5:
       00 E9 B6 7A A2 85 ED C7 34 08 36 98 17 FE 4E 26
       data hash MD5: 16K
       74 EE E7 BC F8 75 F1 E3 8C 2C A4 8C 93 0F 08 E9>)
$$ ##END=
$$ 
$$ hash MD5
$$ 1E F7 F7 C3 95 30 1B ED DB 28 29 1C CB C6 30 14
##$RELAX= 
##$RELAX= 
##$RELAX= 
##$RELAX= 
##$RELAX= 
##$RELAX= 
$$ Bruker specific parameters
$$ --------------------------
##$DU= <F:/spectra>
##$EXPNO= 1
##$NAME= <H-F>
##$PROCNO= 1
##$TYPE= <nmr>
##$USER= <she>
##$AMP= (0..31)
100 100 100 100 100 100 100 100 100 100 100 100 100 100 100 100 100 100 
100 100 100 100 100 100 100 100 100 100 100 100 100 100 
##$AQSEQ= 0
##$AQ_mod= 1
##$AUNM= <au_zg>
##$AUTOPOS= <>
##$BF1= 200.13
##$BF2= 200.13
##$BF3= 200.13
##$BF4= 200.13
##$BF5= 200.13
##$BF6= 200.13
##$BF7= 200.13
##$BF8= 200.13
##$BYTORDA= 1
##$CFDGTYP= 0
##$CFRGTYP= 5
##$CHEMSTR= <none>
##$CNST= (0..31)
1 1 145 1 1 1 1 1 1 1 1 1 1 1 1 1 1 1 1 1 1 1 1 1 1 1 1 1 1 1 1 1 
##$CPDPRG= <>
##$CPDPRG1= <>
##$CPDPRG2= <>
##$CPDPRG3= <>
##$CPDPRG4= <mlev>
##$CPDPRG5= <mlev>
##$CPDPRG6= <mlev>
##$CPDPRG7= <mlev>
##$CPDPRG8= <mlev>
##$CPDPRGB= <>
##$CPDPRGT= <>
##$D= (0..31)
0 1.2 0 0 0 0 0 0 0 0.06 0 0.03 0 0 0 0 0.0002 0 0 0 0 0 0 0 0 0 0 0 0 
0 0 0 
##$DATE= 1573555234
##$DBL= (0..7)
120 120 120 120 120 120 120 120 
##$DBP= (0..7)
150 150 150 150 150 150 150 150 
##$DBP07= 0
##$DBPNAM0= <>
##$DBPNAM1= <>
##$DBPNAM2= <>
##$DBPNAM3= <>
##$DBPNAM4= <>
##$DBPNAM5= <>
##$DBPNAM6= <>
##$DBPNAM7= <>
##$DBPOAL= (0..7)
0.5 0.5 0.5 0.5 0.5 0.5 0.5 0.5 
##$DBPOFFS= (0..7)
0 0 0 0 0 0 0 0 
##$DE= 6
##$DECBNUC= <off>
##$DECIM= 24
##$DECNUC= <off>
##$DECSTAT= 4
##$DIGMOD= 1
##$DIGTYP= 9
##$DL= (0..7)
0 120 120 120 120 120 120 120 
##$DP= (0..7)
150 150 150 150 150 150 150 150 
##$DP07= 0
##$DPNAME0= <>
##$DPNAME1= <>
##$DPNAME2= <>
##$DPNAME3= <>
##$DPNAME4= <>
##$DPNAME5= <>
##$DPNAME6= <>
##$DPNAME7= <>
##$DPOAL= (0..7)
0.5 0.5 0.5 0.5 0.5 0.5 0.5 0.5 
##$DPOFFS= (0..7)
0 0 0 0 0 0 0 0 
##$DQDMODE= 0
##$DR= 18
##$DS= 0
##$DSLIST= <SSSSSSSSSSSSSSS>
$$ [...]
##$SUBNAM2= <"">
##$SUBNAM3= <"">
##$SUBNAM4= <"">
##$SUBNAM5= <"">
##$SUBNAM6= <"">
##$SUBNAM7= <"">
##$SUBNAM8= <"">
##$SUBNAM9= <"">
##$SW= 24.0690132163818
##$SWIBOX= (0..15)
0 0 2 0 0 0 0 0 0 0 0 0 0 0 0 0 
##$SW_h= 4816.95568400771
##$TD= 16384
##$TD0= 1
##$TE= 0
##$TE2= 300
##$TE3= 300
##$TEG= 300
##$TL= (0..7)
0 120 120 120 120 120 120 120 
##$TP= (0..7)
150 150 150 150 150 150 150 150 
##$TP07= 0
##$TPNAME0= <>
##$TPNAME1= <>
##$TPNAME2= <>
##$TPNAME3= <>
##$TPNAME4= <>
##$TPNAME5= <>
##$TPNAME6= <>
##$TPNAME7= <>
##$TPOAL= (0..7)
0.5 0.5 0.5 0.5 0.5 0.5 0.5 0.5 
##$TPOFFS= (0..7)
0 0 0 0 0 0 0 0 
##$TUNHIN= 0
##$TUNHOUT= 0
##$TUNXOUT= 0
##$USERA1= <user>
##$USERA2= <user>
##$USERA3= <user>
##$USERA4= <user>
##$USERA5= <user>
##$V9= 5
##$VALIST= <valist>
##$VCLIST= <CCCCCCCCCCCCCCC>
##$VD= 0
##$VDLIST= <DDDDDDDDDDDDDDD>
##$VPLIST= <PPPPPPPPPPPPPPP>
##$VTLIST= <TTTTTTTTTTTTTTT>
##$WBST= 1024
##$WBSW= 4
##$XGAIN= (0..3)
0 0 0 0 
##$XL= 0
##$YL= 0
##$YMAX_a= 506980
##$YMIN_a= -541489
##$ZGOPTNS= <>
##$ZL1= 120
##$ZL2= 120
##$ZL3= 120
##$ZL4= 120
##$ABSF1= 10
##$ABSF2= 0
##$ABSG= 5
##$ABSL= 3
##$ALPHA= 0
##$AQORDER= 0
##$ASSFAC= 0
##$ASSFACI= 0
##$ASSFACX= 0
##$ASSWID= 0
##$AUNMP= <proc_1d>
##$AZFE= 0.1
##$AZFW= 0.1
##$BCFW= 1
##$BC_mod= 2
##$BYTORDP= 1
##$COROFFS= 0
##$CY= 11.3945322036743
##$DATMOD= 1
##$DC= 2
##$DFILT= <>
##$DTYPP= 0
##$F1P= 16.9975609425685
##$F2P= -3.02152046262296
##$FCOR= 0.5
##$FTSIZE= 0
##$FT_mod= 4
##$GAMMA= 1
##$GB= 0.15
##$INTBC= 1
##$INTSCL= 1
##$ISEN= 128
##$LB= 0.24
##$LEV0= 0
##$LPBIN= 0
##$MAXI= 10000
##$MC2= 0
##$MEAN= 0
##$ME_mod= 0
##$MI= 1.114404
##$NCOEF= 0
##$NC_proc= 0
##$NLEV= 6
##$NOISF1= 3.799351
##$NOISF2= 2.8
##$NSP= 1
##$NTH_PI= 0
##$NZP= 0
##$OFFSET= 15.70392
##$PC= 1
##$PHC0= -9611.074
##$PHC1= 14.40088
##$PH_mod= 1
##$PKNL= yes
##$PPARMOD= 0
##$PSCAL= 0
##$PSIGN= 0
##$REVERSE= no
##$SF= 200.130013532006
##$SI= 16384
##$SIGF1= 3
##$SIGF2= 2
##$SINO= 400
##$SIOLD= 16384
##$SREGLST= <1H.CDCl3>
##$SSB= 0
##$STSI= 0
##$STSR= 0
##$SW_p= 3612.71676300578
##$SYMM= 0
##$S_DEV= 0
##$TDeff= 0
##$TDoff= 0
##$TI= <>
##$TILT= no
##$TM1= 0
##$TM2= 0
##$TOPLEV= 0
##$USERP1= <user>
##$USERP2= <user>
##$USERP3= <user>
##$USERP4= <user>
##$USERP5= <user>
##$WDW= 1
##$XDIM= 8192
##$YMAX_p= 0
##$YMIN_p= 0
$$ End of Bruker specific parameters
$$ ---------------------------------
##NTUPLES= NMR FID
##VAR_NAME=  TIME,          FID/REAL,        FID/IMAG
##SYMBOL=    X,             R,               I
##VAR_TYPE=  INDEPENDENT,   DEPENDENT,       DEPENDENT
##VAR_FORM=  AFFN,          ASDF,            ASDF
##VAR_DIM=   8192,          8192,            8192
##UNITS=     SECONDS,       ARBITRARY UNITS, ARBITRARY UNITS
##FACTOR=    0.0002076,     1,               1
##FIRST=     0,             0,               0
##LAST=      1.7004516,     0,               0
##MIN=       0,             -541489,         0
##MAX=       1.7004516,     506980,          0
$$ Real data points
##PAGE= N=1
##DATA TABLE= (X++(R..R)), XYDATA
0@%%%%%qJ6j7K5l2L3m2N8p7J00j21J46j77K13k52K95l51M15m84N60o42P37q45
28d50R64j097J242j401J576j771J986k225K483k761L070l411L783m191M643n136
44b696N679o286O962p719Q573r540J0646j1927J3431j5225J7404k0104K3543k8057
58a5316L4125m2073N7419n75644O66424O45m12769P94169p21205r9568O49910
69C36117m58211J60528Q1315l86328M25730j25390j30115J75458j92970K33209
79A19343l9920l13776L12987l7366m2491J38555l15277M0560L37204j22435j53328
90g5944N3018n7110L7229K94400k64276k53551M23895j68591o9360L42151n02966
101b41105J55535M01041n56980K68404J24717l93862M57762k18155k37882M55367
$$ plain form
0 0 0 0 0 0 0 -8 8 -9 16 -16 17 -25 33 -44 56 -65 81 -96 117 -135 160 -191 224 -260 300 -342 395 -450
28 -450 514 -583 659 -742 834 -937 1049 -1176 1307 -1454 1616 -1795 1988 -2203 2440 -2696
44 -2696 2983 -3303 3659 -4060 4513 -5027 5619 -6308 7123 -8102 9302 -10802 12741 -15316
58 -15316 18809 -23264 34155 -541489 124935 125580 -287189 506980 -214225 -313793 336117
69 336117 -122094 38434 119749 -266579 159151 33761 -96354 79104 -113866 119343
79 119343 79423 -234353 78634 41268 -1223 137332 -177945 -137385 199819 77384 -75944
90 -75944 -22926 -80036 -42807 251593 -12683 -266234 157661 -10930 -80290 261861 -241105
101 -241105 -85570 315471 -241509 26895 151612 -242250 215512 -2643 -240525 214842
111B14842k71026P5477P5948l67877M17776n5244j96355K71183m07069K24022
121a8323L19510n19928K76008k961l05412N19750k47733k49031M13490k57013
131g1643J5435K23251l01606J10306J46787j81852K6523N2728j6732J1389J5091
142B9677p5403k2399J61769o4564q4744P2412p6123R2591M3887j39860O3724l6066
154c5099N3610O8796j92141J37608n493j22933K42177k17504k8446K93448l21675
165a27652J08345J61578l31322K90189q960k89050L18531j22012q6206K31739
175A45180k44679O0638J41144j69609J09726n3279m8508J42276j21308L8331L0716
186C0628j03658J40885o1158p4496J29892q6530Q152P0233j02631L7766N6705
$$ plain form
111 214842 -56184 19293 95241 -272636 145140 89896 -106459 164724 -242345 -18323
121 -18323 301187 -218741 57267 54306 -251106 268644 20911 -228120 185370 -71643
131 -71643 -56208 167043 -134563 -24257 122530 -59322 -32799 19929 3197 14586 29677
142 29677 -45726 -68125 93644 29080 -55664 16748 -59375 33216 77103 -62757 967 -35099
154 -35099 18511 87307 -104834 32774 27281 -95652 146525 -70979 -99425 194023 -127652
165 -127652 -19307 142271 -189051 101138 92178 -196872 121659 -353 -86559 145180
175 145180 -99499 -38861 102283 -67326 42400 -10879 -59387 82889 -38419 -88 30628
186 30628 -73030 67855 6697 -67799 62093 -24437 -16285 53948 -48683 -10917 45788
197D5788n6505j3724L7073m728l0424O1019m9975m8514J38335q9593m2947J26645
209G2450j32360N8658Q7350j78344J08371K3938r8428J26862r9402j5593J18555
220G2057j13909O0902o574q1329J47374r5269k7400J12384j37593R3252M0400
231F4295j64594J42196j4649q4356J26762j06574j0106J23202r6767N463K8905
242A3777m5703N9080p302m2305J0017J2253K3978k4852r519N114n582M2667l0407
255A216l0894L7790p761J7980j8467l2663N0393j5078O464R62o0498P8187k162
268B5469n8238O4736o7260J7438R2329j16706K6410M4855p2133R2056l8409p5296
280f4749J02840l7880o672L6959p8800N4800K6114n2432L4540l8016J2333N5295
$$ plain form
197 45788 -10717 -24441 12632 7904 -22520 38499 -11476 -59990 78345 -11248 -54195 72450
209 72450 -59910 -1252 86098 -92246 16125 40063 -58365 68497 -30905 -46498 72057
220 72057 -41852 19050 12476 -68853 78521 -16748 -44148 68236 -69357 23895 64295
231 64295 -100299 41897 27248 -57108 69654 -36920 -47026 76176 -20591 -15128 13777
242 13777 -31926 27154 19852 -22453 -12436 -183 23795 -1057 -10576 -5462 -11044 31623 1216
255 1216 -29678 8112 351 18331 -136 -32799 17594 2516 8980 9942 -50556 27631 25469
268 25469 -32769 31967 -35293 -17855 74474 -42232 -15822 29033 -43100 48956 10547 -64749
280 -64749 38091 211 -6461 30498 -48302 6498 32612 -19820 14720 -23296 -10963 44332
292D4332o1732P888J1277j8396N2761l5932l4825M6295p077L048M18l2383J8455
305e871K5930r419k3093l68J5238M204J2792l0981j8785N2357j0526j6299R270
318D449l4154M0502K0360n2005K0065p644K172M3322n2479m331L1157k0350L5109
331B6173k7289l7027N9904j4880q838J4118m6465M1251K4234m8480J7933j0149
343i515j53M3684l8228j8275K4058j175J9105j6177k9923K5002J5677l111j3866
356b897j6674J7543J8199o310j8864p499J8758J2874o105k1733o135L0488M816
369A6461j7254j0167o680L1926Q146l6026K468N433J2321J8846l8737q692K9323
382G368R8Q490k2773k2160M0627O885j7852p649j4751L0802J6178l3108n027M213
$$ plain form
292 44332 -17400 -9512 1765 -16631 36130 198 -34627 11668 4591 7639 8057 -24326 -5871
305 -5871 20059 10640 -12453 -12821 2417 6621 19413 -11568 -30353 22004 11478 -4821 4449
318 4449 -29705 10797 31157 -20848 -783 -8427 -6255 37067 -15412 -19743 11414 -8936 26173
331 26173 -1116 -38143 21761 6881 -1957 12161 -34304 6947 31181 -17299 634 -9515
343 -9515 -9668 34016 -4212 -22487 1571 396 19501 3324 -26599 -1597 14080 10969 -2897
356 -2897 -19571 -2028 16171 9861 -9003 -16502 2256 15130 9025 -12708 -18843 11645 16461
369 16461 -793 -10960 -17640 14286 22432 -13594 -11126 -5693 6628 25474 -13263 -21955 7368
382 7368 7466 15956 -6817 -28977 11650 18535 683 -6966 -21717 9085 25263 -7845 -12872 -8659
396h659J4645J7444k9924j4680K0342J2256M377k2384j6664K5248J7734j1638
408H097k1335l835K3090J3319j5289k1692N101K4585L439j5676j6775N241K9214
421A7484j875k5158n995R846K4226l557l3068M095J9423Q719l828k8490L402K8633
435A3857j657j0159j6650K93L1358k211k2450o409O704K4812l804k8563K065J4989
449B175J2579o000k5008N402J9130L860q341j9367O214K1985j485j3369j3371
462a5596J0515K1815r494j5723l506J1376J8316j5012j6122Q360O983J1711j0481
475C142k0262J4678J0625k88o476j8352J5455J6452j2702o556p090J1666J6408
488A6700j9080o437N732L279J3350j5184j1679J5635J315L389p413j4102J7920
$$ plain form
396 -8659 5986 23430 -6494 -21174 -832 11424 15801 -6583 -23247 2001 19735 8097
408 8097 -13238 -17073 6017 19336 4047 -17645 -12544 12041 15480 -196 -16971 -11730 17484
421 17484 15609 -9549 -15544 -5698 18528 14971 -18097 -14002 5421 14140 10312 -18178 -14776 13857
435 13857 12200 2041 -14609 -14316 17042 14831 -7619 -14028 -7324 17488 13684 -14879 -12814 2175
449 2175 14754 8754 -16254 -10852 8278 12138 3797 -15570 -9356 12629 11144 -2225 -15596
462 -15596 -5081 16734 7240 -8483 -11989 -613 17703 2691 -13431 -5071 1912 13623 3142
475 3142 -17120 -2442 8183 7895 1419 -16933 -1478 14974 2272 -4284 -11374 292 16700
488 16700 -2380 -8817 -3085 194 13544 -1640 -13319 2316 3631 7020 -393 -14495 3425
501C425O765r597n204m880J5499M063j4139r97q38J2808L109j9105N716K687K323
516A635J0377k1280J031J6642q698N211r571n293K3069j2067p080O206n947J8111
530A2346r778j7228J8992n240P061L032k9270J9888J1662j3349R787k0550L046
543i601K8458j9397m392L173m211J7605j1046r581J1154j678O798j0700q090J9006
557G498l077l69p429j4678K7695N409j8069k972q719K1355J1874k3000l030k902
571a0414J5300J2083k5759N955M34k374K3880k9318j776L0114k5332R426j493
584G26k0892M3129j2808l0333K0508r064K1950P634m2579J2291Q583R082J5424
597B3651m2099L237K2642p122J9466k7903j4512M0061j6684l515Q540j9396K3465
$$ plain form
501 3425 10190 593 -4611 -9491 6008 10071 -4068 -5065 -5903 6905 10014 -9091 -3375 -688 1635
516 1635 12012 -9268 -8237 8405 -293 4918 -4653 -9946 13123 1056 -6024 182 -5765 12346
530 12346 2568 -14660 4332 -908 6153 9185 -20085 -197 11465 -1884 7903 -12647 -9601
543 -9601 18857 -540 -4932 -1759 -5970 11635 589 -8992 2162 484 7282 -3418 -11508 7498
557 7498 4421 4052 -3377 -18055 9640 15049 -3020 -5992 -14711 6644 18518 -4482 -7512 -10414
571 -10414 4886 16969 -8790 -2835 -2401 -4775 19105 -10213 -11989 18125 -7207 2219 726
584 726 -20166 22963 10155 -20178 330 -8734 13216 20850 -21729 -9438 -855 8227 23651
597 23651 -18448 -15211 7431 309 19775 -8128 -22640 17421 737 -2778 5762 -13634 9831
610I831j675k3305J4303M559P141q650j9076J2389Q139J6120j3702l7033K9096
623a863J3896m372P639m1708J1690L8021k2371M797j2399j1797L5528j4340o057
636c336N496j4260K7836j7142j6398L3757k0208J0298K523m3362M7875R478l5512
649a2955K2122k9907Q995M7424l8136o985L347p681L6607j4713j9722P144m799
662i259K6051j3001j8099K4418j7856R559R106l1064L0144J791k5317J7813j3566
675i280J0297J8747k6977j469k77J5193J4306l2100O919l88k021L6180l7731r190
689a7791L3326l0173K4894N008m2678L8105m460j8137K5300k4467J2093J1798
701A2818k6866J8380p952M790J5795l6925K0733P137k0414L5275l0872j2936M1974
$$ plain form
610 9831 8156 -15149 -846 3713 10854 2204 -16872 -4483 3656 19776 6074 -30959 -1863
623 -1863 12033 7661 15300 -26408 -14718 23303 932 5729 -6670 -18467 17061 2721 -3336
636 -3336 2160 -12100 15736 -1406 -17804 15953 -4255 6043 8566 -34796 13079 22557 -12955
649 -12955 9167 -20740 -11745 35679 -2457 -9442 -6095 -13776 22831 8118 -11604 -4460 -9259
662 -9259 16792 3791 -14308 10110 -7746 1813 10919 -20145 9999 11790 -13527 4286 -9280
675 -9280 1017 19764 -7213 -8682 -8959 6234 20540 -11560 -4641 -5029 -7050 29130 -8601 -17791
689 -17791 15535 -14638 10256 15264 -27414 10691 6231 -11906 13394 -11073 1020 12818
701 12818 -14048 4332 -3620 1170 16965 -19960 773 7910 -12504 22771 -8101 -21037 20937
714B0937k8062R419R135l4423L0473K185j7442J3718j4054J0385K552j1208J5015
727H630j8324J0964J1414l0539K6796m712j9010L4364k8853k397L0997k9886J2514
740A958L531j9130K4948j2848j266Q931j8464K3149j1164r263K6080l2177J6374
753F59J7727m0906L2749l389k6049L8489k4837n243K7864k9040J3626N583j7213
766i980J7781j2798N710O229j9621K3087j2255p378K6020k9804J1991J5234l1520
779a7304K6683m336k0266K7897j5517r53J1028j6167J5064o465l382J1493j8939
792a1164J8498l014j8849L0197k1773k858K8216l4890J5482J3879k9333K5696
804A0087j0095j2592K7434j9528L067N266j4076K1922j3400k721J4117k4782K2516
$$ plain form
714 20937 -7125 2294 11429 -22994 7479 9664 -7778 5940 -8114 2271 4823 -6385 8630
727 8630 -9694 1270 12684 -17855 8941 4229 -14781 19583 -9270 -11667 19330 -10556 1958
740 1958 5489 -13641 11307 -1541 -2807 6124 -12340 10809 -355 -9618 16462 -15715 659
753 659 18386 -22520 10229 6840 -19209 19280 -5557 -10800 17064 -11976 1650 7233 -9980
766 -9980 7801 -4997 713 6942 -12679 10408 -1847 -9225 16795 -13009 -1018 14216 -17304
779 -17304 9379 5043 -15223 12674 -2843 -3796 7232 -8935 6129 -336 -3718 7775 -11164
792 -11164 7334 4320 -14529 15668 -6105 -8963 19253 -15637 -155 13724 -15609 10087
804 10087 -8 -12600 14834 -4694 -1627 3639 -10437 11485 -1915 -4636 9481 -15301 7215
817G215K726k5522K7503j6622n226K8697k9208P700J3659k3243J7472l020p185
830e054J3336j4700O221J176m928J5695j8270K386R981j6879K3486o917k1636
843a6103K3598j1432L141J4775k5201R930L735q320J6739j3790K11N230j2503
856i990K0351q995q427J8447k4078J0176J6319k3586J8304q688j7177L0426j1358
869A724l955J0266k1996J3947P194q831J0226j7236K256J3132r923J2576j0250
882h70j0935J8640j1451O852R653k2731R038K497m677J5728j2451n271N225m501
896e254J2868l278o657J540r651J5558L385j2900R092j2633J568J7905j3751N528
910C320j699j5542J9033n57m417O201j6883P556P903n984J0838j4351n073J4717
$$ plain form
817 7215 9941 -15581 11922 -4700 -9926 18771 -10437 -2737 10922 -12321 5151 2131 -5054
830 -5054 8282 -6418 -197 979 -3949 11746 -6524 -4138 5843 -11036 12450 5533 -16103
843 -16103 7495 -3937 -796 13979 -11222 -1292 2443 -5877 10862 -2928 -2717 2513 -9990
856 -9990 10361 1366 -7061 11386 -12692 -2516 13803 -9783 8521 -167 -17344 13082 1724
869 1724 -2231 8035 -13961 -14 7180 -1651 8575 -8661 -6405 6727 -3196 9380 -870
882 -870 -11805 6835 -4616 2236 11889 -10842 -1804 693 -3984 11744 -707 -5978 -753 -5254
896 -5254 7614 4336 -2321 -781 -10432 5126 8511 -4389 4703 -7930 -6362 11543 -2208 3320
910 3320 1621 -13921 5112 4555 138 6339 -10544 -2988 4915 -1069 9769 -4582 -9655 5062
924E062p759J0009k346j7589J5199k639k040J3229j5943p1O664o886J2563l554
938C899r356N451n176P025N191q081J191o934L879J1798q021n37l752l578J3139
953F138l167l015J350q634P778L832m369L380p762K162N375n846P718l501o966
968e527P193n382O055N528j4046M765J119k740J1677q843n009O101m777Q756l0
983D840j0910O051q81J068M628q113L190J279m494O228k864j004L472n686K940
998b56J529j995M161n159j651M375j16K595m873k858N928j225J697j447n120N982
1014A567j210o07L341p207L795L829o254M396k389j215O602p456Q77N308n342
1029a965L892j927l777P266l694m57K710o091N169K004n184K623k331J471M301
$$ plain form
924 5062 -2697 7312 4966 -12623 2576 -63 -2103 11126 -4817 -4888 1776 -5110 7453 3899
938 3899 -5457 -6 -5182 1843 7034 -1047 144 -6790 -2911 8887 866 329 -3423 -7001 6138
953 6138 2971 -44 1306 -7328 450 4282 -87 3293 -4469 -2307 3068 -2778 4940 1439 -5527
968 -5527 1666 -3716 2339 7867 -6179 -1414 -295 -3035 8642 -201 -5210 891 -3886 4870 4840
983 4840 -6070 -19 -900 168 4796 -3317 -127 1152 -3342 2886 22 -982 2490 -3196 -256
998 -256 1273 -722 3439 -1720 -3371 1004 888 3483 -1390 -4248 1680 455 2152 705 -4415 1567
1014 1567 357 -250 3091 -4116 -321 3508 -2746 1650 -739 -1954 4648 -2808 -1931 3377 -1965
1029 -1965 1927 0 -3777 3489 -205 -662 2048 -4043 1126 3130 -2054 569 -1762 -291 4010
1044D010o105N66K514j309K135k431j018K495p61R90j358j184J662R9J384k759
1060a070r71M313k500O2O11k791M932k161l133M951l703J408L103o553M072N58
1076A128l140N908o087p80P184n754K007O40n170P324k419l882N936m773R41M298
1092C361n838K612R28k872M107k855j631M300j788j055O26n26J346J22j489k35
1108h87J561o46l41J773l029N71L489l771J560K31l166N993l466l092O700n185
1124a705J171L947p559N821J45n864Q139n305k153Q354p551J962L256o885P380
1139C153j973n647P967m260j065N185o163K755K311m813M075q62l293M361q89
1154H42k382K034m12o76J953j818j301M106k645j745N027m944R80M700p205M633
$$ plain form
1044 4010 -2095 -1529 985 -324 1811 -620 -1638 857 96 1086 -272 -1456 206 305 1689 -1070
1060 -1070 -2041 2272 -228 -166 445 -2346 2586 425 -2708 2243 -1460 -52 3051 -3502 570 1128
1076 1128 -2012 3896 -2191 -2971 4213 -1541 466 1106 -4064 3260 841 -3041 2895 -1878 -937 3361
1092 3361 -2477 135 1063 -1809 2298 -557 -2188 2112 324 -731 -105 -631 715 837 -652 -887
1108 -887 674 28 -313 1460 -1569 -998 2491 -1280 280 511 -2655 3338 -128 -3220 3480 -1705
1124 -1705 -534 3413 -4146 1675 1820 -4044 4095 -1210 -3363 4991 -2560 -598 2658 -4227 3153
1139 3153 1180 -4467 3500 -760 -1825 3360 -2803 -48 2263 -2550 1525 663 -2630 1731 842
1154 842 -1540 494 82 -594 1359 -459 -1760 2346 -299 -2044 2983 -1961 -981 3719 -3486 1147
1170A147Q02o758R543m837m835J0707q732J681O525j1568Q987M93r954J2447o318
1185f70m193J1566j0768L143N866j1049R467j168q341J0979n176k632P228p519
1199c267L039L746o881M397M93m312M065J43l234J965P25k486K960m34m365O346
1215B900k320m717Q817o384j019Q437j0933O005M044j2492J3001m046q917J6013
1229H389j1782J9J1694j7011J1237L556j6280J7241o625q052J7215j4625K529
1242b495J0509j6567J1738J339j2927J4154n680m689J0622r701K708N507q720
1255d202N192J120n017M052j57k395J731O52k581K279J034n526O286n74p459J0394
1271D829n540l594J1879j3465M797R006j7424J4376n78j5426K0757j1322m920
$$ plain form
1170 1147 1949 -4809 4734 -103 -4938 5769 -2963 -1282 5243 -6325 2662 3155 -6799 5648 -670
1185 -670 -4863 6703 -4065 -922 4944 -6105 3362 2194 -6147 4832 -344 -2976 4252 -3267
1199 -3267 -228 3518 -3363 1034 1527 -2785 1280 1423 -1811 154 879 -1607 1353 919 -3446 2900
1215 2900 580 -4137 4680 -1704 -2723 5714 -5219 786 4830 -7662 5339 1293 -7624 8389
1229 8389 -3393 -3374 8320 -8691 2546 6102 -10178 7063 438 -7614 9601 -5024 -2495
1242 -2495 8014 -8553 3185 4524 -8403 5751 71 -4618 6004 -3697 -989 4518 -4202
1255 -4202 990 2110 -2907 1145 988 -1407 324 976 -1605 674 1708 -3818 2468 1894 -5565 4829
1271 4829 -711 -4305 7574 -5891 -1094 7912 -9512 4864 4286 -11140 9617 -1705 -6625
1284f625J8241k0991R013J0263k2030J8633l407j3756K1505j5127l75J5412k0509
1297i753J1639M637j6665J6995o150p452J4531j2230K818Q398j2536O319K477
1310C028o652N769j295l032K697O21k155J024K297n969M497L258r943Q977j576
1325A546p734J3629j0799n57J3112j7747J0318N095j8051J9282p777r269K1429
1338A2477k0187N056J4446k4999J8224J396j8919K3453j4063n042K1905k2208
1350h461P419R689k0178J7597k309j1934J5556j1483R87J1084j2895N354J722
1363B148o609P624k843j306K413l506J596J052J715l040r87L586n951O925J330
1378D147j0115R876o776j610J6143j7549L379R103j7869J8820j980j6629K0529
$$ plain form
1284 -6625 11616 -9375 -362 9901 -12129 6504 3097 -10659 10846 -4281 -4656 10756 -9753
1297 -9753 1886 6523 -10142 6853 703 -6749 7782 -4448 -1630 6768 -5768 551 3028
1310 3028 -3624 2145 850 -2182 515 1136 -1019 5 2302 -3667 830 4088 -5855 3122 1546
1325 1546 -6188 7441 -3358 -3915 9197 -8550 1768 6863 -11188 8094 317 -8952 12477
1338 12477 -7710 -2654 11792 -13207 5017 6413 -12506 10947 -3116 -8158 13747 -8461
1350 -8461 -1042 8647 -11531 6066 3757 -8177 7379 -4104 -3117 7967 -4928 426 2148
1363 2148 -4461 3163 320 -986 1427 -2079 -483 569 2284 -756 -1743 1843 -4108 2817 4147
1378 4147 -5968 3908 -2868 -4478 11665 -5884 -2505 6598 -11271 7549 5569 -11060 9469
1391I469j5440n9K0972k3862R484N482j9896K3626o938j0768J8829k0868O165
1404c804J6036j9584J2477m226j3371K1681q352l081R596j7266P985Q518q273
1417a664O103o784l977Q685p58J379k451l491o3J471P990n167l196J697p366J2032
1433D440J771j0051Q192j2001K408J7142j4740N266j798j4551K3348n790p912
1446d276J4074k2371Q885J5489j8724J5307q413j5291K5372j0770j48J2311k4547
1459a3102J0445Q588j0599J6168j3232r920J6135o580P145K104j6487P109J497
1472g29J712Q162j1346l146K897J735P081m076l529k927n43R362j862K36l446
1487d19r639J2621R69l044P034j6544L573J1834r332J1983q499j4258J9387o367
$$ plain form
1391 9469 -5971 -6030 14942 -8920 564 6046 -13850 9776 2838 -7930 10899 -9969 -3804
1404 -3804 12232 -7352 5125 899 -12472 9209 857 -2224 7372 -9894 -1909 6609 -1664
1417 -1664 4439 -2345 -6322 2363 1605 2984 533 -2958 -3021 -1550 6440 1273 -1923 -226 -7592 4440
1433 4440 6211 -3840 4352 -7649 -5241 11901 -2839 2427 629 -13922 9426 3636 -4276
1446 -4276 9798 -12573 -3688 11801 -6923 8384 -29 -15320 10052 -718 -866 11445 -13102
1459 -13102 -2657 5931 -4668 11500 -1732 -11652 4483 -2097 5048 7152 -9335 -2226 -729
1472 -729 983 9145 -2201 -5347 -2450 -715 6366 2290 -1239 -4166 -4709 4653 2791 3027 -419
1487 -419 -10058 2563 3532 488 7522 -9022 -5449 6385 -2947 9036 537 -13721 5666 -701
1501g01K035R197k2191R641O087r852J7726j2748r143J5366j1286R729N553j8876
1515i463J0690k866l453J6829j2631l610N271p692J2840O7j0140M386n355M613
1529e14P190o411j60m474J439P243l036J174m778k194O930l267M615j027r492
1544f762P782j875R85P312j2804L538L535o867J3097o766p638J0106q856P308
1558B095N576j5121R373j907n284J3767j0552o49O762j0867J0263N49r244R452
1572D213p054m4Q441q469M740r22o641R545l368j111L135o841N376O35l136M538
1588C037n655J508L220l765M379m101o99N359n884L789L31m962O732n039L91N702
1604D343q369N220O82n973Q283n526q29O470q677N866J488p918Q171m175r32O743
$$ plain form
1501 -701 1334 10531 -11660 -2019 4068 -5784 11942 -806 -9949 5417 -5869 3860 9413 -9463
1515 -9463 1227 -1639 -5092 11737 -894 -4504 767 -6925 5915 5982 -4158 228 -5127 -514
1529 -514 6676 265 105 -4369 -2930 4313 1277 2451 -2327 -4521 2409 -858 3757 2730 -6762
1544 -6762 1020 -855 130 7442 -5362 -1824 1711 -5156 7941 1175 -6463 3643 -5213 2095
1558 2095 7671 -7450 1923 16 -5268 8499 -2053 -2702 4060 -6807 3456 4005 -5239 4213
1572 4213 -2841 -2885 5556 -2913 1827 905 -5736 3809 441 -670 2465 -4376 1000 1635 -1501 3037
1588 3037 -2618 -1110 2110 -1655 2724 -1377 -2076 3283 -2601 1188 1519 -3443 3289 -1750 -1359 4343
1604 4343 -4026 1194 1876 -4097 4186 -1340 -2169 4301 -4376 1490 2978 -4940 3231 -944 -1876 4867
1620D867r147M408K707o832P628m095k715O705o271L901J469o984O612k355j513
1635a615N067o103K963J011m489O195l128j537L586m796M306R0l925M778m384
1650a981Q32M133m747L358k096k444O489m652Q13K385n658N428j268k448N486
1665C630o468J907L715n549N314k444l138O194n610K675L194p289N258j234k349
1680b194O254o276J296L509o076N692j008l922N124m531K006L157o014M138p59
1695C96k658M774l616J060J493m199M363j111j860L139l512K144O11k884L941
1710B081k909k81L011l634L013r97k541N016m146O46L223n142M129r97k928N846
1726C390n305Q39M193o073M345m24l896O062m659L59M439o388L869P43m013N118
$$ plain form
1620 4867 -4280 128 2835 -3997 3631 -464 -3179 3526 -2745 1156 2625 -4359 2253 -102 -1615
1635 -1615 3452 -2651 312 1323 -3166 3029 -99 -1636 1950 -2846 1460 1550 -2375 2403 -1981
1650 -1981 -1149 2984 -1763 1595 -501 -2945 3544 -1108 -295 2090 -3568 1860 592 -1856 3630
1665 3630 -2838 -931 2784 -2765 2549 105 -3033 3161 -2449 226 3420 -3869 1389 155 -2194
1680 -2194 4060 -2216 -920 2589 -3487 2205 1197 -2725 2399 -2132 -126 3031 -2983 1155 396
1695 396 -2262 2512 -1104 -44 1449 -2750 1613 502 -1358 1781 -1731 413 1024 -1860 2081
1710 2081 -828 -1109 1902 -1732 1281 284 -2257 2759 -1387 -741 2482 -2660 1469 472 -2456 3390
1726 3390 -1915 -1076 3117 -2956 1389 965 -2931 3131 -1528 -1169 3270 -3118 751 1494 -2519 2599
1742B599l832j71M347n263K981N68l439L852k367K17K438l993K668l3j827K769
1758A514k523J240M71k647L724j883q33K421l461L083k26l039M606l655jL858
1774B649m780L236m63l512N897l867o21M317n519L304Q43m037N266l646q83M743
1790B927m867K373Q89l693M223k578k38L344m311K167M77k073L135k933Q26J869
1806A537l520L292j159j399L028l719K551R00m070M600k461j005L993m856L077
1821G89Q09m814N834k800j905N059n275K542J597m972N620k334k509N163m488
1836a684J650J753m284M391j882j669L932l527J388P37k350L303k621J70K328
1851A635l215K630j114j074L232m077K483J088m351M955k666j023M562o108L746
$$ plain form
1742 2599 -1233 -1404 2943 -2320 661 1229 -2210 1642 -725 -508 1930 -2063 605 572 -1255 1514
1758 1514 -1009 231 702 -1945 1779 -104 -937 1484 -1977 1106 880 -2159 2447 -1208 -1209 2649
1774 2649 -2131 1105 642 -2870 3027 -840 -1461 2856 -2663 641 1484 -2553 2713 -933 -1816 2927
1790 2927 -1940 433 1322 -2371 1852 -726 -964 2380 -1931 236 713 -1360 1775 -1158 -332 1537
1806 1537 -1983 1309 150 -1249 1779 -1940 611 1511 -2559 2041 -420 -1425 2568 -2288 789
1821 789 1598 -3216 2618 -182 -2087 2972 -2303 239 1836 -3136 2484 150 -2359 2804 -1684
1836 -1684 -34 1719 -2565 1826 -56 -1725 2207 -1320 68 805 -1545 1758 -863 -693 1635
1851 1635 -1580 1050 -64 -1138 2094 -1983 500 1588 -2763 2192 -474 -1497 3065 -3043 703
1866G03J702o264O692k991k322O363o921L088L086p492P018j870m231P245n901
1881b095J413L897p114N728m54m533N961m025L11L343m985L656l60k753L968k845
1897h87O75J004k178K997k372L0K201l096L128j943r88M169n106K814J600n569
1913c521O257l055j982O509p910L883L508q477P736k724l824Q795q352K196N403
1928D442r644P885q47o492Q997o338L58O252r047N791J027o564P407l992r52N146
1944C429o529L625J209m152M662k980l69K467k840L300k020j505L092k777L037
1959A649j270k880N090m552K001K944o787N949k018l294Q074p799K019N126r577
1974e325P811p17o007R789q874O55Q577j0487O792Jq805J1369n189j785P652j1166
$$ plain form
1866 703 2405 -3859 2833 -158 -2480 3883 -3038 50 3136 -4356 2662 792 -3439 3806 -2095
1881 -2095 -682 3215 -3899 1829 1375 -3158 2803 -1222 -911 2432 -2553 1103 743 -2010 1958 -887
1897 -887 -212 792 -1386 1611 -761 -731 1470 -1626 1502 -441 -1429 2740 -2366 448 2048 -3521
1913 -3521 2736 -319 -2301 4208 -3702 181 3689 -4788 2948 224 -3600 5195 -3157 -961 4442
1928 4442 -5202 2683 1836 -4656 4341 -1997 -1639 4613 -4434 1357 2384 -4180 3227 -765 -1717 3429
1944 3429 -3100 525 1734 -2418 2244 -736 -1105 1362 -1478 1822 -198 -1703 1389 -1388 1649
1959 1649 379 -2501 2589 -1963 38 2982 -3805 2144 126 -3168 4906 -2893 -874 4252 -5325
1974 -5325 2486 1769 -4238 5551 -3323 -2668 5909 -4578 2214 2215 -6590 4779 -410 -2195 5457 -5709
1990e709N629M277q219P616m515k856Q243o929K855K379o737N608j665j123M211
2005C065n062K150k5k155M955l126J22j79l025O627k749j527K597o259O512P22
2021B643n489O617p217R56Q325r416N442k39p872J1503o199j912R428j2111N234
2036c07M086r314J1347n632n928J0787q909M490N584j2444P294p22l398R932r125
2051b259j005N969o119O615j176n658N312l684K287K932n313K931j827j45L269
2066B129l299L222k448k676N222l417L455j53p292P396k530o35O767j0587L647
2081a199M114p106R987o214n539J1435q838L692N099j2187R641j759o399J2103
2095F830r282q1P615j1046Q074J304q225R327p037j006R483q442K959Q49o130
$$ plain form
1990 -5709 -80 4197 -4022 3594 -921 -3777 4466 -2463 392 2771 -3966 1642 -23 -1146 3065
2005 3065 -1997 153 128 -2027 2928 -198 -76 -255 -3280 3347 598 -929 1668 -4591 1921 2643
2021 2643 -2846 3771 -3446 -2490 5835 -3581 1861 1622 -6250 5253 -946 -2858 6570 -5541 -307
2036 -307 3779 -5535 5812 180 -5748 5039 -3870 620 6204 -6240 1054 332 -3066 6866 -2259
2051 -2259 -3264 2705 -3414 3201 2025 -3633 1679 -2005 282 3214 -2099 832 -995 -1140 2129
2066 2129 -1170 2052 -396 -3072 2150 -1267 2188 2035 -5257 2139 -391 -1026 5741 -4846 -1199
2081 -1199 2915 -4191 5796 -418 -5957 5478 -3360 332 5431 -6756 2885 1126 -5273 6830
2095 6830 -2452 -2533 5082 -5964 2110 3414 -4811 4516 -2521 -3527 5956 -2486 473 1322 -4808
2110d808Q320k599k582L934n492L529J855l246K504l407J760J892l093L277k950
2125a106L41K744m948N213j330l967O314n869K078M559q244O600j865n234J0449
2140E735p490l64O506r862Q119N14r048J0623o140j879R321j0461M705L176q904
2155e449R609l946m300Q944p591K195L771p352O607j895l683O480n137J211K718
2170B182m664M112j818j257L678l704J797J66j802L236l400J547J384l931M738
2185B264k808j062M471n868M144J148o539P270l363k028O728p983L720L239p805
2200d472P755l184l981Q583p152J884L970q309P784j253n838P905n653R69N057
2215D065q004N043M63m709O578m496q33M490m551L169n95l066M815k953q7J673
$$ plain form
2110 -4808 3512 913 -1669 2265 -3227 302 2157 -1089 1415 -1992 -232 1660 -1433 1844 -1106
2125 -1106 -765 1979 -2969 2244 914 -3053 3261 -2608 -530 4029 -4215 2385 520 -4714 5735
2140 5735 -1755 -2119 4387 -5475 2644 3158 -5890 4733 -1407 -3286 6035 -4426 279 3455 -5449
2155 -5449 4160 214 -4086 4858 -2733 -538 3233 -4119 2488 593 -3090 3390 -1747 -536 2182
2170 2182 -2482 1630 -188 -1445 2233 -1471 326 492 -1310 1926 -1474 73 1457 -2474 2264
2185 2264 -544 -1606 2865 -3003 1141 2289 -4250 3020 -343 -2371 4357 -3626 94 3333 -4472
2200 -4472 3283 99 -3882 4701 -2451 -567 3403 -4906 2878 1625 -4213 3692 -1961 -992 4065
2215 4065 -3939 1104 1567 -3142 3436 -1060 -1893 2597 -1954 1215 620 -2446 2369 -584 -671 1002
2231A002k724L744k114j616L140l040L153k18m104L942k175J621K434o665L623
2246CR51k147M894o197N67M989n650M649r82n007P183m263m92M999o718M522N25
2263A826o267P080k134j355L661p190M256L677n027L447m073q20O886l972O10
2278F05p97l876O579q04k505J639l568L438Q92l016K986k308J8J632k827L671
2294A759o90k195J922l849L626L153m798J160k951J247O924n498j159N34k477
2309c292P219j967m271L032l811L966K800o252L467j235j706M759m331J944K486
2324B808o033L063K79n04M440n793j073L319j041M324k927m862L477M35K910o65
2340B157n779K762J011O30J791m602J245J238j717L354k298o32K351l623K168
$$ plain form
2231 1002 -1722 2022 -92 -1708 1432 -1608 1545 1327 -2777 1165 -1010 611 3045 -3620 3
2246 3 954 -1193 3701 -2496 -1929 3060 -2590 2059 1077 -3930 3253 -1010 -1502 3497 -3221 1301 1826
2263 1826 -4441 2639 505 -850 2811 -4379 -123 3554 -1473 1974 -2099 -2919 3967 -5 605
2278 605 -192 -4068 2511 1707 -798 841 -2727 711 1603 -1413 1573 -735 -717 915 -1912 1759
2294 1759 1069 -1126 796 -3053 573 3726 -1072 88 -2863 -1616 5308 -190 -1349 -815 -3292
2309 -3292 3927 1960 -2311 721 -3090 876 3676 -2576 891 -344 -2050 2709 -1622 322 2808
2324 2808 -3225 -162 117 -387 4053 -1740 -2813 506 -535 3789 862 -4000 -523 -88 2822 2157
2340 2157 -3622 -860 151 781 2572 -2030 -785 453 -1264 2090 -208 -840 1511 -2112 56
2355E6R27j376K975m592p16M576j419J890k886l622N584k51n6M31n545L579K528
2372B083k056J883m073L41M147l013J329k65k121L112k305M17K438k773J219r72
2388f09j120L747j575l81j67k690M271M27k389P11k654K732K104l379J564j664
2404a072k37L611k928O57N70k789L870j511j578L308k969Q09J213k779L529j177
2420E27k280K862k038J115J321l031J837m92n77K525k324j4Q66j044J878j226
2436i5o31J437j485J079K48j075J138j540J123R29k227J622p36l72K143k668J116
2453FP94k431L175j536j518L029k525J406Q75l753L671m11k132K869k760R45K337
2470B041l790K251j36j751L442k557r11K481j650J627o68k605L016L3p39J50j792
$$ plain form
2355 56 983 -393 2582 -2010 -2726 1850 431 2321 -565 -4187 1397 1146 1090 1521 -4024 -445 2083
2372 2083 27 1910 -2163 -1822 2325 -688 641 376 -1745 1367 -938 -521 1917 -856 363 -609
2388 -609 -1729 2018 443 62 -105 -2795 1476 1903 -486 225 -2429 303 2407 -972 592 -1072
2404 -1072 -1309 2302 -626 31 601 -2188 1682 171 -1407 1901 -1068 -259 954 -1825 1704 527
2420 527 -1753 1109 -929 186 1507 -1524 313 -179 -756 1769 -555 -569 297 -747 1131 -95
2436 -95 -726 711 -774 305 553 -522 616 -924 199 1128 -1099 523 -213 -585 1558 -1110 6
2453 6 800 -1631 1544 8 -1510 1519 -1006 400 1275 -2478 1193 782 -1350 1519 -1241 -296 2041
2470 2041 -1749 502 366 -1385 2057 -500 -1411 1070 -580 1047 379 -2226 790 823 84 234 -1558
2487a558J752R88j221k5j079J228Q80q11l31j215J917R33k273O66m59Q81J681
2504A954l651J131J579j610K354k649j275M140k020N00J1l657M888K70l568K117
2520E14k337K095K789n111J461J059j310L288l173j423L534j498J045q39k644
2535b550L701L96k013j0j076K437R44k506m70M17J808J63j806m47L0K437J33l218
2553a630R61L29J262J177m538J312K777j855J646k750r30N050k826l18P23l216
2569b826M998k41m497L026j550J638K585o103J872K706k058K384l214j187M935
2584B468k160k25j23k326L903K87k936L27k05K214M76l013O2J188J505n22k255
2601a335O04N61J658l84l263J832P77K12J019m288J615L471k997J372k041r46
$$ plain form
2487 -1558 194 1182 -39 -64 -1143 85 965 154 -177 -1392 525 1458 -815 -149 -608 273 1954
2504 1954 -1697 -566 1013 -597 1757 -892 -2167 1973 -47 453 464 -3193 1695 1965 -1603 514
2520 514 -1823 272 3061 -2050 -589 470 -840 2448 -725 -2148 1386 -112 933 94 -2550
2535 -2550 1151 1547 -466 -476 -1552 885 1829 -677 -1147 -730 1078 1241 -565 -1012 -982 1455 1588 -1630
2553 -1630 -669 -340 922 2099 -2439 -1127 1650 -205 1441 -1309 -2239 2811 -15 -333 390 -2826
2569 -2826 2172 1931 -2566 460 -1090 548 3133 -2970 -1098 1608 -450 1934 -1280 -2467 2468
2584 2468 308 83 -40 -2366 1537 1824 -1112 -785 -990 1224 1700 -1313 -1251 -63 1442 920 -1335
2601 -1335 -731 -170 1488 1104 -2159 -327 450 662 1681 -2607 -992 2479 -518 854 -1187 -2133
2617b133N540l582j287K434l331M413m7n411M267r58j08L230o076J833L988l658
2633h86K061k055j525N381k785j290J543k209L216J59l299J352m6J260N65l044
2649a602O26J509M66n60j856J037Q78M10m19k327K069N24q47J376l426J482L464
2666B804m010J476n06j908N519l633k165M362l559K597J101n635M710l50k086
2681a283L923m987J230M104m531K247q25k084N217l373j307L205l110K501N91
2696A518l754K862l33p11J772k504M49J620o42k79q54J111J98m81N36j882J777
2713D03O48k285K280j542o33L298l245P32J306k669L609j938j936M109l493J280
2729g6K050m777M422r09l324N544m132k75M408n343K820J379m572M656j720k063
$$ plain form
2617 -2133 3407 -175 -1462 972 -2359 2054 2007 -3404 863 -95 -203 3027 -3049 -1216 2772 -886
2633 -886 1175 -880 -2405 2976 191 -1099 444 -1765 1451 1610 -1689 -337 -383 877 1442 -1602
2649 -1602 -976 533 999 439 -1417 -380 498 908 489 -1838 231 755 -92 1284 -2142 -660 2804
2666 2804 -1206 270 -236 -2144 3375 -258 -2423 1939 -1620 977 2078 -3557 1153 803 -1283
2681 -1283 2640 -2347 -1117 2987 -1544 703 -122 -2206 3011 -362 -1669 1536 -1574 927 1518
2696 1518 -2236 626 293 -418 1354 -1150 -701 919 277 -2 -856 255 453 -28 508 -1374 403
2713 403 1051 -1234 1046 -496 -1129 2169 -1076 -344 962 -1707 1902 -36 -1972 2137 -1356 -76
2729 -76 1974 -2803 1619 710 -2614 2930 -1202 -1477 2931 -2412 408 1787 -2785 1871 151 -1912
2745a912M176l298M76J713k374K345j311r27K459k052R43J63j570K316j326l36
2761e15J262j640J459j98r60P35r05K033r88j894K534j741J573J037m901L856
2777G47L60k823M377m105p30N321m477J644P15l990N221j610k582L541k976K170
2793H03N79m420M500p97j551K995n007K228L774m169J857j888j353N715k228k416
2809a378P03o16L085m37k256J26k55K675j130j766K125j910J642N58l994M057
2825A229L46k665J525k957K995L083m738K85j049J576M780n176r65J046j407O397
2841D305l093n013M751k193K202K169o799L876J567l626L290k224M82K774m268
2856a800P31J012O12K682m984j050K914O04L198m552m011N081R15R36j413m838
$$ plain form
2745 -1912 2264 -1034 -558 1155 -1219 1126 -185 -1112 1347 -705 238 401 -1169 1147 -179 -515
2761 -515 747 -893 566 368 -592 143 -762 1271 283 -1611 923 -818 755 1792 -3109 747
2777 747 1107 -1716 2661 -1444 -2174 3147 -1330 314 1029 -2961 2260 650 -1932 1609 -1367 803
2793 803 1382 -3038 1462 665 -886 2109 -2898 -670 3104 -1065 792 -1096 -2449 3266 1038 -1378
2809 -1378 -675 -1291 1794 1357 -899 -773 -1028 1647 517 -1249 876 -1034 608 1166 -2828 1229
2825 1229 1575 -1090 435 -2522 473 3556 -1182 -897 -1946 -370 4410 -766 -1731 -685 -2092 4305
2841 4305 1212 -3801 950 -1243 959 3128 -3671 205 1772 -1854 1436 -788 -306 2468 -1800
2856 -1800 -1069 -57 555 3237 -1747 -2797 117 721 3919 -633 -4644 437 1352 2288 875 -3963
2872c963L366K150l21k31l345J942J332j235J522k704J870J634n171L158J526
2887A530j682K852n577l97O661k351K46k379l589O675Q89k146j095l983N022K566
2903C242l556R51l194J628M110m690J766P31l038L508k179o54M150k796o36n84
2919a241m68M636j133k719j244j14N465r48l607N18j851M135K068n121J107n65
2935a082K58L803l730k10J747k051K276j465j54L130l940O48R74j438M576l259
2951H3l044L700j830K922Q43o135K766J324l96K348m337N4K832j447J660j682
2967c39r30K433k177J437M68k209K792j992j053K959j871J324n00k763L200l4
2983G45n17K79k586K492M81j186J587l010J319K111k998K442j319j600M014l107
$$ plain form
2872 -3963 -597 1553 1232 1001 -2344 -402 930 -305 1217 -1487 383 2017 -3154 4 1530
2887 1530 -152 2700 -2877 -3274 3387 1036 1282 -1097 -4686 1989 2878 732 -363 -4346 676 3242
2903 3242 -314 637 -2557 -929 3181 -1509 257 988 -2050 1458 -721 -1375 2775 -21 -657 -1241
2919 -1241 -1709 2927 1794 -925 -2169 -2283 3182 2234 -1373 -855 -2706 1429 3497 -1624 -517 -1082
2935 -1082 -824 2979 -751 -961 786 -1265 1011 -454 -608 2522 -1418 -770 204 -1234 3342 83
2951 83 -2961 739 -1091 1831 2674 -3461 -695 629 233 2581 -1756 -1702 1130 -317 1343 -339
2967 -339 -1269 1164 -1013 424 892 -1317 1475 -517 -1570 1389 -482 842 342 -2421 779 745
2983 745 228 507 -2079 413 894 -292 1295 -1715 -396 1715 -1283 1159 -160 -1760 2254 -853
2999h53L1K636l359K149j28k116L566k335m60J971k505K438l51k210K721j981
3015g86O78J830l544K081N93j807K310k264O8K439k362Q54J20r32J720j480L43
3032a39N49j237J790j444k87J930j857J339n21j951L374j111j217J410k233K470
3048H65N96k798J853j486P45K283l305J204K12j440L403k766p71L247k936J379
3064B85L28k553L696j352k012K519j747J458Q43l151J598J7L60J370l096N57J410
3081E30l63J206k384j85K297j255O42o17j048K237r58l26L96j071K118r76j299
3098a056J418j061J894l70l090K825q1n38J591l489J368K242k259J579j606j038
3114a671L597j917l48M65j629L048r40k109K285j330J046O80l078K241L36j153
$$ plain form
2999 -853 -822 1814 -1545 604 476 -1640 1926 -409 -869 1102 -1403 1035 684 -1526 1195 -786
3015 -786 -108 1722 -1822 259 852 -955 1355 -909 -841 1598 -764 90 210 -722 998 -482 -139
3032 -139 410 -827 963 -481 -768 1162 -695 644 123 -1828 1546 435 -782 628 -1605 865
3048 865 1461 -1337 516 -970 -225 2058 -1247 -43 169 -1271 2132 -634 -1405 1842 -1094 285
3064 285 613 -1940 1756 404 -1608 911 -836 622 1465 -1686 -88 -71 289 1659 -1437 -880 530
3081 530 167 1373 -1011 -1196 1101 -154 488 -129 -1177 1060 102 -224 172 -899 1219 243 -1056
3098 -1056 362 -699 1195 825 -2265 560 479 -59 1532 -1957 -589 1653 -606 973 -633 -1671
3114 -1671 1926 9 -339 126 -1503 1545 605 -1504 781 -549 497 1177 -1901 340 676 -477
3130d77J581k323N94K189j671J89q63N4K281j505m56l2j93K186j651p61J200j060
3148g18J770m68k120J927m65M00O13k624J797P81j309J158j908R30J728k337J157
3165C12n13q66K793k042o48J668j644J987l69k448K358k98k70O17k066J591O44
3182H06j169R34j531N48J671j684O46o76l11K230j675m15Q76q10J545r40j048
3199a003J754j076P64p2j572J914n60m01J160k381J605J134k153J339r60p2K315
3216A735k414K10R01j312J890r12j097J614j197J057K54k090J834k05n62J042
3232G48j823J151Q95j742J030m82j73J379j405K79J35l82J385j247k56P92p55
3249d71J458j009j093K049j163K71O17j923J829j47j083J580j785P00J364k086
$$ plain form
3130 -477 1104 -1219 -625 1564 -107 82 -781 -727 1554 49 -407 -439 -632 1554 -97 -858 342 -718
3148 -718 1052 584 -1536 391 -74 326 939 -1685 112 893 -416 742 -1166 -236 1492 -845 312
3165 312 -201 -1067 1726 -316 -964 704 -940 1047 678 -1770 588 290 20 637 -1429 162 806
3182 806 -363 571 -960 -412 1259 -425 221 -455 -766 1464 -211 -626 250 -560 985 45 -1003
3199 -1003 751 -325 439 367 -1205 709 149 -252 908 -1473 132 1266 -887 452 -508 -580 1735
3216 1735 -679 -469 432 -880 1010 98 -999 615 -582 475 729 -1361 473 268 -294 748
3232 748 -1075 76 971 -771 259 -223 -396 983 -422 -143 -8 -390 995 -252 -508 284 -471
3249 -471 987 -22 -1115 934 -229 42 659 -1264 565 418 -665 915 -870 -170 1194 -892
3265h92J259m46o41K257k205K6J614j840J575m15j624K351j211j26J296k131J267
3282A14O01j337J099j038L48J146j548N91K0l11J118j282L73N13r08J135o88n12
3300e66R82p90Q35l17j079J749r48%O55j573J683k55j352J930j568L34J522k323
3318a081J442jj399K434j842m01K038k043J193K22j909K352j042o98J883k071
3334i23R12Q97j770J380o62m08J610j621L96O58j004J114q29j33J005j024O61
3351B59j50o79J071p49M44J38j136J337n80j63Q03j500J410j01j468K013j332
3368c83k08J842k317J319N16k068K391j185r51K388j971N75O86j898K193o47j167
3385h85J891j857P43J056j872J493n92r00K137j586j21J162j336R87j23o49J027
$$ plain form
3265 -892 367 -79 -720 1537 -668 -642 972 -868 707 292 -1332 1019 -192 -318 978 -1153 114
3282 114 715 -622 477 -561 -213 933 -615 -24 -4 -315 803 -479 -106 407 -501 634 -54 -566
3300 -566 416 -374 461 144 -935 814 -134 -134 521 -1052 631 376 -976 954 -614 -280 1242 -1081
3318 -1081 361 360 -1039 1395 -447 -848 1190 -853 340 562 -1347 1005 -37 -735 1148 -923
3334 -923 -11 886 -884 496 -166 -574 1036 -585 -189 469 -535 579 -250 -383 622 -402 259
3351 259 109 -570 501 -248 196 334 -802 535 -45 -208 595 -905 505 404 -1064 949 -383
3368 -383 -591 1251 -1066 253 769 -1299 1092 -93 -1044 1344 -627 -52 634 -1264 929 282 -885
3385 -885 1006 -851 -108 948 -924 569 -23 -923 1214 -372 -493 669 -667 320 197 -452 575
3402E75q13N4K06j71O88r54M07L23j097J626o62q71J239j254R33P38j992J418
3420C93m71m98J750j779N55N86j795K274q79r79K051k243Q59J381k533K230m59
3437D43k133K884j203l47J495k383J117Q34j165J221j114k88J110p35R91p78q67
3454i18J588j027M57O05j416Q92k49l29J120r60J79j52k15J063q98N87j14j598
3472a385K157l57r74J716k375P88J980k607J613r9j994K492r21l75J319k182J367
3489A63M18j363J969j585k09J334j837J867J0k199K084q47l19J891j984K15P18
3506C26r83J306l07p87L00j71Q34m91j54O12j310J029K98j136J548j394k85J775
3524A010j563P51L50j506J442o24J02R25k006J306J50j060J930j820l3J870k464
$$ plain form
3402 575 -238 -184 22 -149 539 -415 -8 315 -782 844 182 -689 550 -704 229 967 -1025 393
3420 393 -78 -576 1174 -605 -50 536 -1259 1015 136 -843 1208 -1035 -176 1205 -1328 902 443
3437 443 -1690 1194 -9 -356 1139 -1244 -127 707 -458 763 -351 -639 471 -264 727 -51 -918
3454 -918 670 -357 100 705 -711 181 -68 -397 723 -237 -58 -210 -425 638 -260 327 213 -1385
3472 -1385 772 415 -559 1157 -1218 -430 1550 -1057 556 457 -1537 955 34 -341 978 -1204 163
3489 163 581 -782 1187 -398 -607 727 -1110 757 767 -1432 652 -195 -514 1377 -607 -392 326
3506 326 -657 649 342 -445 -145 -316 518 27 -127 485 -825 204 502 -634 914 -480 -765 1010
3524 1010 -553 198 548 -958 484 -140 -38 887 -1119 187 337 -723 1207 -613 -646 1224 -1240
3541a240J631O26k534K284o60r67K036j738K35R49j412J174j23o23P26r55J003
3558D12j9j133J396r65P5J031j576J038J02j202J533q15k33Q82r29P41n15j76
3576c53J112j418P60L08j323J921j218o78K134k050O96J218k280J623j12j102
3592g62J705j602K59J297j460R53n59l70J562j640O49N10j577J794o55q49J590
3609H45j432N31Q21j605J049J6m71N82r40Q71k0o38R32j164N03R50j701J384m06
3628A07j095K217j488m08J508j476J038l4j371J592o86p0P70j441J103%q04J492
3646I54j671L22J533j922J012q0j060J875j136l51J194j202P19j5o48R53p48M78
3664B07K5j185J564m03l59O99j723J321Q85j756J085p49j95J716j318J12J32r67
$$ plain form
3541 -1240 391 1017 -1517 767 107 -860 1176 -562 -327 622 -790 384 261 -362 364 -591 412
3558 412 393 -740 656 -309 -234 797 -779 259 361 -841 692 -123 -356 526 -403 338 -177 -353
3576 -353 759 -659 101 409 -914 1007 -211 -889 1245 -805 -109 1109 -1171 452 340 -762
3592 -762 943 -659 -400 897 -563 390 -169 -539 1023 -617 32 542 -1035 759 104 -745 845
3609 845 -587 -56 765 -840 209 225 -246 336 -604 267 247 -391 541 -623 -120 830 -871 513 107
3628 107 -988 1229 -259 -667 841 -635 403 369 -1002 590 -96 -166 604 -837 266 266 -538 954
3646 954 -717 -395 1138 -784 228 148 -912 963 -173 -524 670 -532 187 172 -476 477 -271 207
3664 207 232 -953 611 208 -151 548 -1175 146 1031 -725 360 -389 -584 1132 -186 -74 58 -909
3682i09J800p06o48R50j317J289J1j574J962q67p33J438j579J197P64k062J076
3699I2l44p5J660j625m44M37L6J569j272r42Q92m78J337l32j378J139o16L75Q93
3718I24j651P75K61q29R18o75N54N23j708O50K13M21R81k353Q3J294n12J465j482
3737a48j624K244k79N39m3k358J650P18p50P02j409O56Q00j498J249l25l88J183
3755I19j906M85J461r06O55j299q94K425j12n93p33r90K107M40q64l77j023J430
3773B25P24j098K83r36O95J207j761M88M79n02P67j309K79J552r59j46o73q0K136
3792A371j019o10j49q05K472j32k094Q09o12J174J037k555P04O82m58J023j416
3809e78MJ446j216N17l89m90J956j193p63O37l74J614n77j946J178L77M04kj677
$$ plain form
3682 -909 891 185 -463 487 -830 459 470 -1104 858 -9 -742 696 -883 314 1078 -984 92
3699 92 -252 -327 1333 -292 -736 -299 -263 1306 34 -908 -16 -494 843 511 -867 272 -344 31 924
3718 924 -727 48 309 -520 398 -277 277 800 -908 -258 -45 376 1357 -996 -913 381 -131 1334 -148
3737 -148 -1772 472 193 732 689 -1669 -19 699 -51 651 -758 -102 698 -800 449 124 -264 919
3755 919 -987 -502 959 53 708 -591 -1485 940 828 235 -498 -1488 619 1059 195 -182 -1205 225
3773 225 949 -149 134 -802 -107 1100 -661 -173 306 -196 571 -738 -459 1093 134 -12 -685 -765 1371
3792 1371 352 -258 -407 -1212 1260 1128 -966 -157 -769 405 1442 -1113 -409 273 -185 838 -578
3809 -578 -574 872 -344 173 -216 -706 1250 57 -706 -69 -443 1171 594 -1352 -174 203 607 605 -1072
3828a072O26Q41L7N0j418O37R33m93K02j148N47J387j392OR0j01J371j293o19
3847h09J182n00P82n68j274J688k25p5J22j796J826O84j625Q24q63M87J525k079
3865f94J94Q38p04J232j027q06J494m96K72k59j007J445l2o34J85o04J184M2j401
3884g78P34j0L09L24j276M67M69P0K09j275L84Q17k89L40j286K35J695j338J97
3903bj7p07J734r24r51J381q52O36K43j734J463K08n43M88j518J074J289j728
3921d60K97l14J68J642j569m72R61n83J047m51j199J130J03j5l27p31J055L25
3939F07n87l33l50J252J01j159K62j83Q50M88j656L65L61K46P51j789K8J272l56
3958A70M96j223m04K066r72m22K63r77J884j84j766J206m16N38Q23k190O38J082
$$ plain form
3828 -1072 -446 395 432 482 -936 -299 634 141 343 -805 -258 1129 -263 -257 -167 -268 1103 -190 -809
3847 -809 373 -127 655 87 -1187 501 276 201 323 -1473 353 1037 -588 236 -627 -140 1385 -694
3865 -694 -500 338 -366 866 -161 -967 527 31 303 44 -963 482 450 -184 1 -603 581 623 -778
3884 -778 -44 -54 255 579 -697 -230 239 309 518 -757 -373 444 155 495 -791 -556 1139 -199 -2
3903 -2 -19 -726 1008 84 -867 514 -338 298 541 -1193 270 478 -65 423 -1095 -21 1268 -460
3921 -460 -163 -477 -309 1333 -236 -708 253 -330 717 266 -933 197 300 285 -42 -773 282 607
3939 607 20 -313 -663 589 690 -469 -207 -390 460 948 -708 -343 18 264 1015 -774 -746 526 170
3958 170 666 -557 -961 1105 133 -289 -26 -1003 881 697 -1069 137 -279 259 1082 -1108 -470 612
3976F12m67M88j531Q2J883p78m00l62j54J530n51r29L07j1J017k08j268L97L75
3995C2P16m87j300Q23N76K45n56j191J247N69o54J03j097Q83J225j405R9k04p0
4014d46J805j491r28J327l92R25o36j555J838k8m35M19j436J047J042j457M03
4031Bm49J62J531j509m46P65q3Q64r61q03J167M3R3m19o83R42J75k13k65o17J058
4052C54J50o09o4m28J019K12j173N53k79L98O70j468M35N56n78J034j036n50J555
4071G51q70K44J8j139J682l22r09Q75p99N70O47j494Q77m2m83J216j230LQ95o84
4091a94N14l26o03J066l80j40J03l38N90j43k61K29n08O06L9n02M78n56L71M60
4111E05j036O41q8k33P39q97K53N71r73R28k53p45J160q00K32N05j390J218O9
$$ plain form
3976 612 145 633 -898 -816 1067 289 -111 -473 -627 903 352 -577 -270 -281 736 528 -740 -343 32
3995 32 748 261 -1039 -216 360 605 49 -1142 105 674 20 123 -974 -91 1134 -271 -172 -376 -446
4014 -446 1359 -132 -1060 267 -125 800 164 -1391 447 419 -16 403 -1033 14 1056 -401 2
4031 2 -447 -285 1246 -263 -709 56 -27 837 -124 -927 240 283 376 -43 -726 216 391 178 -87 -704 354
4052 354 504 -105 -169 -597 422 634 -539 14 -265 133 803 -665 -230 326 -252 782 -254 -804 751
4071 751 -119 125 143 -996 686 364 -545 330 -469 101 748 -746 131 89 -394 822 -408 -405 490 -194
4091 -194 320 -6 -609 457 77 -63 40 -298 292 149 -112 117 -391 215 254 -248 230 -326 45 505
4111 505 -531 110 22 -211 528 -369 -116 455 -518 410 157 -588 572 -228 4 509 -881 337 406
4130D06r38J060q06KJ007j181M43J54n90J020o41l26N41m05O55k47p41Q51k63
4149AN8J16p20P44Jm11M63o45M03M05n43K13m88M09O48r93K43Q3k07R41j007j06
4171c92Q38p56O38p5j057J217j94m53N58j031Q60N62j205N19k40J91Q22j328K56
4190b70N44n01P81p18n00J043l31J54j19q24J068J7m68J07k77O51j08p01M42o3
4210g3M25j86q55P83L5m0M22j202M33Q70n23J76q13j1J345p81o7M4n21J138n03
4231I6n52Q66p42M80K17j132J064J73p24L99q66P28J019j282j34K8K78J079j055
4250f0m90L73KQ63m61p92M64M1M31k02o80P66j44l67J04j05Q39k23r39K95K16
4271f9P49m9j470M56L38M96N47j760j8J156k28N05q37p33J465m60k20M82q17Q88
$$ plain form
4130 406 -532 528 -278 -276 731 -450 -7 147 -443 577 -64 -390 151 -254 401 154 -587 264 1
4149 1 59 175 -545 199 200 -211 252 -393 10 415 -128 85 -403 6 654 -339 -96 -13 -220 721 -286 -392
4171 -392 446 -310 328 253 -804 413 219 -234 324 -707 153 715 -490 29 -211 -20 802 -526 -270
4190 -270 274 -227 554 -164 -664 379 48 202 83 -741 327 344 -124 -17 -294 357 249 -452 -10 -73
4210 -73 352 166 -689 94 129 89 511 -691 -258 612 89 265 -548 -559 786 5 -62 -18 -539 599 96
4231 96 -456 410 -332 148 365 -767 297 470 -254 145 -721 7 1026 -256 -390 -362 -84 995 -60
4250 -60 -550 -177 -175 688 227 -565 -101 -60 371 169 -511 255 111 -256 -152 -257 582 359 -580 -285 -69
4271 -69 680 631 -839 -383 -45 451 998 -762 -780 376 148 653 -184 -917 548 88 -132 350 -467 421
4291D21k20r47J090j02N6j6j370R37J059n03l02j214N21J733o64o90m73J03J302
4310G21j69p03j89l8P99j99m69K25O0K17m71l60J085M4n19n27l98J501M59j240
4330a71l73m11J202J097j491l97p0M68J466j280q57R15k31P00m58q78J349l47
4348B33o13M29m50Q96K81j572L37M42N61M02j697k71J173N04R9j274m74J225L54
4367E85j79p02l81R23J56l41k67k51R81k26o54J39J82P45m86j181Q71M55J79k96
4387B52j357Q83R30m07n8j043J96J524n93n55j80j96J464n05j115P72l9L97j37
4406B33j025Q31L75l75R4p97N10R89p74k71k82M20R28q31o41L65L92M78p00n18
4426e99N79K69K11n41o47P71K88l2m63n92R54K79n14j14l55P63L13j034L28J28
$$ plain form
4291 421 201 -746 344 242 298 282 -1088 -151 908 405 103 -1111 -590 1143 479 -211 -684 -581 721
4310 721 552 -151 -340 -378 421 222 -247 -22 38 255 -216 -576 509 553 34 -493 -891 610 1069 -171
4330 -171 -544 -955 247 1344 -147 -544 -614 -146 1320 40 -817 98 -133 567 109 -769 580 233
4348 233 -380 49 -401 495 776 -796 -459 -17 544 946 -751 -1022 151 655 754 -520 -994 231 585
4367 585 406 -296 -677 246 402 61 -206 -457 524 298 -356 -217 -35 710 224 -957 -86 369 548 252
4387 252 -1105 -222 708 301 243 -800 -604 920 327 -228 -408 -604 860 355 -760 12 -27 370 233
4406 233 -792 39 414 39 133 -664 -154 835 61 -210 -492 -72 856 25 -616 -251 141 619 -81 -599
4426 -599 -20 249 460 -81 -728 43 331 299 -164 -756 198 477 -37 -151 -506 257 570 -464 -136 -8
4446hJ7N55r85l1Q31l55L06n89m44J311j83n34o2m34J097O9r29J63K2K89M99r69
4468c64J71K40j02M23o28p0N92k10L6l50R6P40n98k81O6J77O50n22n19L96k3N58
4490D78k13p87M38LK68K11r56M82L74m39L28m08J12M66p73L55K99m23O32o55k61
4511d69Q23l30K72j91p84R01J37k93N2o26N58L55o05L20k47l6M20l81J68J1k46
4532a91M63m88J28K84j61M6k46r5O62m48o1J06k46N38k68j82L46m96M19K24o47
4553c13M60k25m3N25o76K08L62o36N00j67j95N77n87J55L58n81M89j38l14M76
4573B35m59K25K73o61N72j03k33L60m18K28J66m14M34j46k04K81k75K91r0l35
4593b73M96l26O8K24m20L91j12k21M79m88L5M49m49L31k81j57O62n76Q3L49n42
$$ plain form
4446 -8 9 564 -421 -452 379 24 330 -259 -703 608 425 -109 -171 -605 492 561 -368 -205 -183 106 605 -364
4468 -364 -193 47 -55 368 -260 -330 262 52 88 -262 -166 574 -24 -305 -239 -62 588 66 -453 -57 -80 478
4490 478 265 -522 -84 -81 187 398 -558 -76 298 -141 187 -221 -109 357 -416 -61 238 -185 447 -208 -469
4511 -469 354 24 296 105 -679 222 359 66 118 -508 50 405 -200 120 -127 -163 257 -124 44 55 -191
4532 -191 272 -216 -88 196 35 81 -165 -260 402 -46 -107 -1 -247 291 23 -159 187 -309 110 334 -313
4553 -313 147 -78 -121 404 -272 -64 298 -338 162 -5 -200 377 -210 -55 303 -278 211 73 -241 235
4573 235 -224 1 274 -387 185 82 -151 209 -209 19 185 -229 205 59 -145 136 -139 152 62 -273
4593 -273 223 -103 -35 189 -231 160 48 -173 306 -182 -147 302 -147 184 -97 -254 408 -168 -85 264 -278
4614b78M94k06l21O08m23O6L67o89M87J28l78M00n62J79O27p43K64o7j55O34m31
4635Aj13K33l21M28j55l95M58k11J81l0m61O31p9l51K71l80N10P8o26L82k15K46
4657H2L64p71K30J74j18M43o24j56P35l77K20k43m20Q86l41k97L70n00N85P0o83
4678c71M19k19L17K58q37K49M34j34J78p17K31O33n39J46k07j40P32l70k31J10
4698e8l16Q09k41n96M28p2L94j32p59N83J88j23L6n64M33M62o76K16k58NQ64p11
4720h8j06J88j48P09o77m17O92r6K36k67o12Q33l9l03J83n67N42L93o52J20k34
4741c10L38N16q16j8L42L5K79o22j78P44j52L5k78l94P98j54j97k2l76P74l8n70
4763b64J70j53N86J20r28L51K46lK31p89K39N62m07K46n16l8R04n22k21J1j27
$$ plain form
4614 -278 216 10 -311 297 -126 -60 307 -382 105 233 -145 255 -307 -128 499 -244 20 -47 -202 432 1
4635 1 -112 121 -200 228 73 -322 136 -75 106 76 -385 246 167 -184 87 -293 217 295 -331 51 -164 82
4657 82 446 -325 -95 79 -39 404 -220 -376 359 -18 202 -41 -461 425 84 -213 157 -343 242 312 -371
4678 -371 48 -171 146 404 -433 -184 250 116 294 -423 -192 441 -98 48 -159 -299 433 63 -168 -58
4698 -58 -374 435 194 -402 26 -46 348 216 -543 40 228 105 141 -423 10 472 -204 12 -246 -241 623 -88
4720 -88 -194 -6 -154 555 -122 -539 153 57 293 26 -586 247 208 -95 88 -479 63 456 -196 -76 -310
4741 -310 28 544 -272 -290 52 87 366 -256 -434 310 158 193 -85 -479 319 165 -32 -54 -430 344 306 -264
4763 -264 -94 -247 339 459 -469 -118 128 125 356 -433 -194 368 -39 207 -309 -347 557 35 -186 -175 -302
4784c02Q23l60o51N13p0K43P7p82N20Q6o4K14p21L29O09n25N9l18K08O86o81j60
4806b67J86L3N61n93l23N18j53L14k40n19N61O9no3n69O53K18n00P5k87M70K81
4828D20o89K03M9l2M59p17j3M88k10M03n44l17Q33j17j25j27m38Q16l7n80K94
4849A9j88J87L39o60K59O2kL57p00J15N74l00J07m16k2Q07m78k26O5j27O58k83
4871A47m15K37k02M79Oo24L58N2P3J01n57L47K19l37J95k48J69L87n72P5Q8q7
4893a09N79n80k20L65j17M10k63n29O00m0NO0o24N51J02m06L81k83P9K99n16K81
4915B5M7j92M51n12j78N78j49J02k96k69O97k23j00j6k98N05Nk98J16k65L56J80
4937B66n31K78J6j6K10n20J97L81l80J44k41N1M35l07o0O1k64N61j36l96K61j45
$$ plain form
4784 -302 521 161 -490 23 -47 196 273 -509 11 97 33 247 -474 -145 464 -61 -2 -320 -112 574 -107 -267
4806 -267 -81 -48 513 -80 -403 115 -38 276 36 -483 78 147 142 79 -490 163 381 -119 -44 -331 139 420
4828 420 -269 -66 -17 -49 410 -307 -320 168 -42 361 -183 -500 333 216 91 -36 -474 342 305 -275 19
4849 19 -169 18 357 -303 -44 18 16 373 -327 -212 362 62 169 -247 -269 538 60 -166 -101 -228 430 147
4871 147 -268 -31 -233 246 252 -372 -14 38 111 212 -345 2 221 -116 79 -169 0 387 -185 -110 -22 -109
4893 -109 470 -110 -330 35 -82 328 65 -464 136 96 101 161 -463 88 190 -216 165 -118 -39 260 -256 25
4915 25 72 -120 331 -181 -359 219 70 172 -124 -393 304 81 -19 -35 -333 172 177 -121 -5 -270 86 266
4937 266 -265 13 29 13 223 -297 -100 281 -99 45 -196 -145 290 -17 -77 -16 -280 281 145 -251 10 -135
4959a35L55l0n53M04k3k6K60m99K50J50k41K27k10j32N36m04j4J03k03M96l19
4980hk17L35j56J64j6l51L83m5j40K10m25K87R8k34K18l12J89L16l83R4Jn5K28
5003A81l10j3K66k26K28p4j63K50k43J26Q6l74L60N4k89J95j69J52J55m55L24
5024F1n2j26L94l67P2J00l14L87j06k63L22j45PJ16k73K58p2j35K96k90P7J64
5046A11k74K52j69q5L83k86L1R5j82K87k47j7K40k55J40R3k77K52r2m3K69m14
5068a88J60J45j69K17l41P2L62l25K2J16k92L93j30j59K22l40L14J18l53K71j54
5089c9O6J79n11L77L8l42L47j79q3L66m51K31N7k22M41k21l41L14q3L04p4n16
5111c42L65K1k2J76l69P7R7j0J96k76jK12j94J77j19J4J22l46J34K88k47K06k81
$$ plain form
4959 -135 220 190 -363 41 18 -8 252 -247 3 153 -88 139 -71 -203 333 -71 -85 18 -185 311 -8
4980 -8 -225 110 -46 118 102 -249 134 89 -51 159 -266 21 119 -115 103 -209 -20 296 -87 7 8 -47 181
5003 181 -129 -142 124 -102 126 52 -111 139 -104 22 108 -266 94 148 -141 54 -115 37 192 -263 61
5024 61 9 -117 277 -90 -18 82 -232 155 49 -214 108 -37 -30 86 -187 71 -1 -136 160 -130 -53 111
5046 111 -163 89 -80 -165 218 -68 -37 58 -124 163 -84 -101 139 -116 24 117 -160 92 0 -43 226 -188
5068 -188 -28 117 -52 165 -176 -104 258 -67 -45 71 -221 172 42 -117 105 -235 79 197 -156 115 -39
5089 -39 27 206 -305 72 110 -232 115 -64 -147 219 -232 -1 56 -166 275 54 -287 27 -56 248 174 -342
5111 -342 23 44 22 198 -171 -94 3 -7 189 -87 -88 124 -70 107 -12 2 124 -222 -88 200 -47 159 -122
5134a22j25M20j65Q1J2n34N09J11j42K04o57L03L90l53J86j91j67M58m10K56K17
5155B81o02L50p0j98N27l06j00J39l46M99J74n27Q2r5K57K43l87m0m8R5L31k34
5177B5Nj12j15L12j21RJ35l32K18m6PL24m51l2K55k78N30k45l97M49l47K85L82
5200D60p69K85Q3k45N24m52j48M68n07L67J34m90M54k61j43O00m64N8J84m03L67
5221A02K7r4M0k93K45J35p7j35n1J17p5K1J75k73P6J39j96K96k09p1L74m94J66
5244e5L29m94L64j56k94P53n25l5L49n06M06J03o26O88l81j59O44o78J69L53m67
5265b18L88j76k93O06l94q6L75l21J29O7k17K00r8L5J18k49N1J19P6j03k21L80
5287A68j10J0k1l19L87%k28L24m91K65K79n51L83q0l84P90m50k27N99n62K40K01
$$ plain form
5134 -122 -247 173 8 89 101 -433 76 187 45 249 -408 -105 285 -68 118 -73 -240 218 -192 64 281
5155 281 -321 29 -41 -239 288 -18 -118 21 -325 174 348 -179 -97 -192 65 308 -79 -119 -167 -72 259 25
5177 25 30 -82 -197 115 -6 3 138 -194 24 -22 -15 309 -142 -174 81 -197 333 88 -309 140 -207 78 460
5200 460 -309 -24 59 -186 338 -114 -262 206 -301 66 200 -290 164 -97 -240 360 -104 -46 138 -265 102
5221 102 129 35 75 -218 27 162 85 -50 -101 16 -59 -38 137 -136 -60 79 -117 179 -30 -101 273 -221 -55
5244 -55 274 -220 144 -12 -306 447 -78 -113 236 -270 136 239 -387 301 -80 -239 405 -273 -104 249 -218
5265 -218 170 -6 -299 307 -87 -173 202 -119 10 77 -140 60 -38 -3 115 -134 -83 36 112 9 -212 168
5287 168 58 68 47 -272 115 115 -113 211 -280 -15 264 -287 96 16 -368 422 -28 -255 344 -218 22 223
5309B23o20O70j57n25O87n10K12L87o46K88Q5k62M79l80k77N10k08J68o2k80L03
5330H5oq2O8j19K9j3P7r1J3J85j75o6J05j69L88j09m39M92k33R9L36p81L52K64
5354B10m58O05m58k58P78n81J58K24o36O17n8n18O78m41M1M28o40L78J25m58M69
5375B05k96j26M62k05n7L4k21L82jj99n8O6P9l3Po5j15K43j05j3J26k31K52m5
5399H6l62M47r0j48L30o27M18J43m89N16k41l09P60n15J0K98o00O23m7n03M86
5420A86k40q9M15n59K83J77l85L85j49k41M53k85K8N9k03K95k2k76K25K7p7Lr7
5443h7J6KJ20j04j8J96k98K72P5m11M15j07j96L13m01K32J51m79M86k10k69O38
5465C36m73O0L04n43M42J11n87N79k26j79M14n41K85K34m41L74r1k52M53l10J2
$$ plain form
5309 223 -397 273 116 -409 278 -232 -20 367 -279 9 94 -168 311 -69 -346 164 -44 124 62 -218 85
5330 85 79 -3 65 -54 -25 -38 39 -52 -39 146 -29 -95 10 -159 229 120 -319 173 -60 39 375 -406 -54 210
5354 210 -248 357 -101 -359 419 -162 -4 220 -416 201 143 -375 303 -138 -97 331 -309 69 194 -264 205
5375 205 -91 -217 245 40 -17 17 -204 178 177 -22 -80 -14 65 32 39 -26 -141 102 -3 -16 110 -121 131 86
5399 86 -276 171 81 -67 263 -364 54 197 -292 224 -17 -326 434 -81 -71 227 -373 250 203 -300 186
5420 186 -54 -143 272 -287 -4 173 -212 173 24 -217 236 -49 -21 38 -165 130 108 -168 57 84 7 10 -87
5443 -87 -71 -69 51 -53 -71 125 -173 99 174 -237 178 71 -125 188 -213 19 170 -309 177 -33 -302 336
5465 336 -137 -77 227 -316 126 237 -350 229 3 -176 238 -303 -18 216 -225 149 58 -194 259 -51 -39
5486c9J42l15K73L0k39J84ML1r5l5J14m9J4r0O1Q7j91J10N2k41L06l1j56K18l07
5511a62Q9K70m24L23n8k07M13l75J07K49m71L46N1l84M47k11j61L88m19K13K34
5532B58n20L40j4k21L33k86MK77l20K14Ok19K57j57L2Q8j75J69k4l5N8q6O6l6
5556In7J63j64Q7l4m7J33k04J93N7l06K06L6k32K90k64O5K77m42K93J04l82L32
5579A13r0j02L20m08J48K59m45K90l5j89K90l05J2K98l42K93K1k09J99j89K2K04
5601A55k30L7P9j14R1L0k5j4n2J24r0o4O9K7M7j25o2J95j34N5N7j60K24j58o2
5626a00K13j58O5J37k93K00kj43K55l79J04K71l08J97n6j88L34j72o7L32m15J64
5648iJ22j92K15j62j02L02l09J49J72l11K09k07P1J83k09L2Q1j91K58K8j52Nj46
$$ plain form
5486 -39 103 -212 61 91 -148 36 40 71 -24 -59 55 6 20 -70 -9 78 -113 -3 49 -192 114 83 -73 145 -162
5511 -162 -73 197 -227 96 38 -169 244 -131 -24 225 -246 100 151 -233 214 3 -158 230 -189 24 258
5532 258 -262 78 64 -157 176 -110 -106 171 -149 65 71 -148 109 -48 -16 72 -103 66 42 7 65 -21 45 9
5556 9 -48 115 -49 38 4 -43 90 -114 79 136 -170 36 72 -160 130 -134 -69 208 -234 59 163 -219 113
5579 113 23 -79 241 -167 -19 240 -205 85 50 -139 151 -154 -142 156 -186 107 128 -81 118 -71 -49 155
5601 155 -75 -38 41 -73 18 48 23 9 -43 81 -9 -73 -4 23 70 -55 -117 78 -56 -1 56 -104 120 -38 -100
5626 -100 113 -45 20 157 -136 64 62 -81 174 -205 -101 170 -138 59 3 -185 149 -23 -90 242 -173 -9
5648 -9 113 -79 136 -26 -128 174 -135 14 186 -125 84 -123 -52 131 -78 -46 35 -156 102 130 -22 -17 -163
5671a63J94P0j60L0j5L2K3l8J11j27LQ5q2J17m5j22J35j30N4K50l46RO4p0L74
5696B53k82j83L18k76K28J52l46J27j40N9L50l78J1K43l55K89Jj47K46l41l8L73
5718A64j74J4j9j28K66p9L2L1l77K46J25j9K7k46J20Q8o3J03j58o6J59j91L01
5741A56m9k14J17j53Q5K64k43J15k07j49N27k08o5J8k37K84R8k29K30k49m9L53
5763A95k08J34r9j95K75q7l9K36l82O8J68j04K50k11j57K32k04J48J00k09N7p2
5785a04J55J93l64J47j22P7J31k09P2J43k83L25r4j49J82j89J52N0j98J93j09
5806aj58K80j97J17K4k69K72l1j02J76k29R9J25j93K66j80q6J97j78O6O8j62J59
5829F3M4j32J26k53J36L2j25K31j33j22K89k39M9J8j43K65j16k6J47k48J67P0
$$ plain form
5671 -163 31 101 -59 -29 -44 -12 11 -27 84 -43 -40 45 -37 80 35 -87 48 -82 -28 222 -124 -115 -51 -121 253
5696 253 -29 -212 106 -170 58 210 -136 -9 -149 -90 260 -118 -107 136 -219 70 71 -76 170 -171 -209 164
5718 164 -10 4 -15 -143 123 44 76 107 -270 -24 101 82 109 -137 -17 71 8 111 -47 -113 46 -145 156
5741 156 107 -107 10 -143 -58 206 -37 78 -129 -278 249 41 -24 -6 -243 41 139 -90 140 -109 -158 195
5763 195 -13 121 22 -173 102 15 -24 212 -170 -102 66 -38 212 1 -156 76 -128 20 120 -89 -32 -104
5785 -104 51 244 -120 27 -95 -18 113 -96 -24 119 -164 161 67 -82 100 -89 63 113 -85 108 -1
5806 -1 -159 121 -76 41 65 -204 68 37 -65 111 -118 -19 106 -87 179 -1 -87 110 -68 -2 66 -96 63
5829 63 107 -25 101 -152 -16 16 -109 122 -11 -133 156 -83 -34 -16 -159 106 -10 -36 111 -137 30 100
5851A00j66J97k44J43Q3l12K44J02l29K83j56L7J93k92J37n3n2K50j23r2J13k81
5873b18L03Q6l40K05j12N5J69k64Q4M4j23K61j48k9O3r8J04j05rL01l16K1P3n
5897BK30j96k14K37k34L01L0l62K28r5J37J55m07R7J75j05J37j48p5L18l63J67
5919A5N4j49K58j93l4J01j77K47l6k76J72O1M3k4l14K56J39j27R0k66J80R3j00
5942A3O6j68l1K98k05l6L8o1K70k53j29L01j74J58m2k38K97L1j23R2m16K87K93
5965B68l03K3j68J09L38k80p1N5m1K12j42q9J37j11J63l3k60K73m6Km4k41K81
5988C2Q9r7p7o7J98Q7k57Q3j31J07K82l44j1J33k0K36l00k29L58%L3j42k26L85
6012A22r0r5J40k43J48K18l52J36o1P2K17l65rK09j0J07k29m7K82n0Kj39j88K82
$$ plain form
5851 100 -66 131 -113 30 113 -199 45 147 -182 101 -55 -18 175 -117 20 -33 -85 165 42 -50 63 -218
5873 -218 85 171 -169 36 -76 -21 148 -116 -32 12 -111 150 2 -27 36 -62 42 -63 -72 229 -87 -66 7 2
5897 2 232 36 -178 59 -175 126 156 -206 22 -73 64 219 -188 -91 84 -21 116 -32 -107 211 -152 15
5919 15 69 -80 178 -15 -49 52 -125 122 86 -190 -18 43 86 62 -252 4 143 16 106 -160 20 113 13
5942 13 79 -89 -120 178 -27 -63 -25 -86 184 -69 -198 103 -71 87 45 -193 104 135 12 104 -312 -25 268
5965 268 -35 -12 -180 -71 267 -13 -84 -29 -70 142 0 -89 48 -63 100 67 -193 80 34 36 -8 -249 32
5988 32 121 24 -53 -120 78 165 -92 -9 -140 -33 249 -95 -106 27 7 243 -57 -286 72 72 105 -37 -263 122
6012 122 32 -63 77 -166 -18 200 -152 -16 -77 -5 212 -153 -162 47 37 144 -85 -132 150 100 102 -37 -225 57
6036E7poq8j85L66r7j51O6q5K12N6l08J77JJ6J58l43J02J97k70K97k15j87L68
6060A31j15j2Qk34L89n8k42J68o6L2J27k52O0Q5j05L11l31qK01j11N2j12J3J41
6084G2j12M6L2r9P9l6j6O7j69K13Nj31O1j27K24Lk50J22K2q6J62j66Q2J04j93
6109i1J73r0j11K50j89J2J67k34J84Rl06L92k08J4J45k13J40n6j29K50j48r2J40
6132Ij02Q7K8p5L5r3O7J35j35j4J1O0P3j25P2K5k4%j21J9J82j91J22n7j16K83
6158A55j56J4j6k00L05j0j39p0M5J11R7k83J73P1q7J18k08m1K06j15N4p1j48K76
6182H1k3j59O1o1K20l5k34Q8O6P8j5j87k8K08J7M6k40k4K07Jqk24M5L16j05j05
6208a4j46R9K18n4j77M1m7K83l1m34J74K02M6Lm27J41L33j67l6k10Q3L19j59j46
$$ plain form
6036 57 50 44 -44 -229 137 40 -111 -45 -130 82 138 -170 7 8 24 182 -161 -59 138 -132 165 -50 -237 131
6060 131 16 4 12 -222 167 109 -133 35 -31 1 128 -124 -64 21 -84 227 -104 -112 89 -22 30 -82 -69 72
6084 72 -40 6 38 -61 18 -18 -34 33 -136 77 82 -49 12 -115 109 112 -138 -16 6 -80 82 -84 -2 102 -91
6109 -91 82 -8 -119 131 -58 -46 121 -113 71 80 -226 166 -42 -28 117 -96 44 -12 -141 109 -39 -131 9
6132 9 -93 -6 22 -53 -18 -111 -44 91 -44 -58 -47 13 86 -39 33 58 34 34 -87 -68 114 -77 45 -12 -128 155
6158 155 -1 13 -3 -203 102 92 -47 -117 -72 39 136 -147 26 97 10 128 -80 -121 85 -30 24 -47 -195 81
6182 81 58 -101 -40 -101 119 84 -150 -62 4 82 67 -120 -148 60 77 123 -117 -141 66 67 59 -165 -120 196 91 -14
6208 -14 -160 -61 157 103 -74 -33 -80 203 172 -262 -88 114 160 163 -264 -123 210 43 7 -203 -120 199 40 -106
6232a06n1M9L25r5l32J56j7K53l1l90J27L11n1o9k84J35K00k8r6k27J31K64k1
6255A53k86m3O7L23j38k95J31J32J22j13k40J60J35M4j23k36J97J35p1r2j82J82
6277c8L44j94k81m0J91K60k05j91K7J51J80j41k78J25J72N1j06k94K43K63j43
6298I6j49j71K80J71k06p3r4J69K20k39j30Q1Q4J54j43l41K65J61j0j69j99K40
6320cJ91j61o0j48J72K03k17j9l6O8K85k53j76J86J4J88k59j55K30J15q8j06q0
6343a09J13J19j35Rj21J04J28p2o3n4Q0J30j38j32J33kQ8j17p4J05J1P6l4j78
6367a33J67K9l8Kj34J40L6j49L2j8N1J51k32R0K0j41J46N6j70J67j07L3L7j19
6391h4J48M7j51J24j54L6L5n7J28m5j12J01qNk2q6J44p3M1N1j69R5K7pL1j70Q8
$$ plain form
6232 -106 -157 -108 217 122 -210 -54 -71 182 151 -239 -112 199 148 79 -205 -70 130 102 6 -221 -90 174 153
6255 153 -133 -176 -109 214 76 -219 -88 44 166 53 -187 -27 108 152 29 -207 -10 125 54 -38 -220 -38
6277 -38 306 112 -169 -209 -18 242 37 -154 -127 24 204 63 -215 -90 82 133 27 -267 -24 239 96
6298 96 -53 -224 56 227 21 -52 -146 23 243 4 -126 -45 39 193 50 -291 -26 135 125 -44 -243 -3
6320 -3 188 27 -33 -181 -9 194 -23 -42 -78 -10 275 22 -154 32 46 234 -25 -180 50 165 77 -29 -109
6343 -109 4 123 -12 -3 -124 -20 108 36 -27 -81 -1 129 -9 -141 -8 -10 78 -39 -113 -8 3 79 45 -133
6367 -133 34 63 25 27 -107 33 69 -80 -48 -66 -15 136 -96 -6 14 -127 19 75 -95 72 -35 -2 35 -84
6391 -84 64 111 -40 84 -70 -34 1 -56 72 27 -85 16 8 13 -9 -95 49 -24 17 68 -101 -6 21 14 45 -125 -37
6418c7J79j89j8Q5n7K29k53J6J34j73K65j75j82K24r5J12M8l51K17J49j99M0p0
6441a01L3K38k26K5k3j3J72j51j14J03R6J13j61j84K07K6j7k0j53K09J55k06q3
6464g5m0J45J34j74j03j6J58J56k23o8K4J36K12m05p8L05M4Q9k37k01K82K6p3
6487A8lk50L54J34k87j9j55K36L02n23Q2J51jP2k13j20L10J5j1j34k28K84K21
6510B35j53j68j69L60J61l33q2L6J73J03k52l6L1J09R7k65k9J27J74M3m11M9L23
6533A23j8k8k64l5M55j20j14m3k88M82Q5l08j2q1K86J84m47k4K06O9M9k40j16
6556a99L70j31j8r2j21L46oj83j30j4M48m9l88q7K27K87j02l57PJ31K57M7m59
6579b16Q5J59R7Jl05N0L11j43n3j50pM69k08k34J02l1L05n9m25J63J33O5J62m94
$$ plain form
6418 -37 142 -47 -65 20 -37 192 -61 -45 89 -84 181 6 -176 48 -47 65 113 -238 -21 128 -71 -31 -101
6441 -101 -68 170 -56 -31 -54 -67 105 -46 -160 -57 39 152 -9 -193 14 40 23 3 -150 59 214 8 -75
6464 -75 -115 30 164 -10 -113 -129 29 185 -38 -106 -82 54 266 -139 -217 88 132 221 -16 -217 65 91 18
6487 18 15 -235 119 253 -34 -53 -208 28 330 -193 -111 40 39 111 -102 -222 88 103 92 -42 -270 14 235
6510 235 82 -86 -255 105 266 -67 -149 -113 60 163 -89 -125 -94 15 112 -153 -182 -55 119 162 -249 -200 123
6533 123 105 77 -187 -222 233 113 -1 -44 -332 150 235 -73 -85 -166 120 304 -143 -167 39 108 157 -83 -199
6556 -199 171 40 22 -70 -191 155 149 -34 -164 -178 270 221 -167 -254 -27 260 158 -199 -192 -61 196 243 -216
6579 -216 -131 28 125 126 -179 -129 182 39 -14 -164 -171 298 90 -144 -42 -73 232 173 -252 -89 44 109 271 -223
6603b23K6L57r4N1k97M2K96m4j35Oo9K03rj76j2R1J24n2k80J03J27R7j05k46J20
6628i9K21j2r1k82K44J49j00L6k23Q4K58j68j8o9j02M27k48j70J72k6J53q8k77
6651b29K86o8RN8j20QK04j65k3p5J9K96k23l6J02j2J45k07p6J87q3Jk9o1Q7oQ1
6678G0p6j30K28o8l4O0j79J25N7j92J25j4oJ51k41R5J24j61J82j74k3K46k17P0
6702A8P2k35K64r8j81K71j02n2R5j19J54o8j11J03l1N2Q7j90k6L7R2J72l17l4
6726a47J72L7j9j30J0J58n1J0j07j8J55r1M0p2o9K18q1j36N3J7K09j81k25K34
6750a4N1K8M9l18J38K32j24J4j38j45M91k57q5J6m8K70j02k94K37jJ08m6k60J18
6774h0K14n1r9j88J22K58l6k36j63K76J93l4l21o8K46K20k66j89J85N1J83k23
$$ plain form
6603 -223 -197 160 66 117 -180 -138 158 114 -21 -15 -84 119 110 -66 -78 13 137 85 -195 -92 35 132 27 -219 -99
6628 -99 122 110 19 -263 -19 130 30 66 -157 -73 185 17 -1 -70 -172 255 7 -163 9 -17 136 48 -229
6651 -229 57 -11 -2 56 -64 -56 148 -17 -40 -115 -96 200 -23 -59 43 31 176 -31 -107 80 -3 -2 -31 -92 -5 -11 70
6678 70 -6 -136 92 24 -10 50 -129 -4 53 -139 -14 -28 -34 117 -124 -29 95 -66 116 -58 -81 165 -52 18
6702 18 90 -145 119 21 -160 111 9 -43 52 -67 87 19 -92 11 -20 32 119 -71 -97 -60 32 204 -113 -147
6726 -147 25 62 43 -87 -77 81 30 40 -67 -85 70 -21 19 -53 -122 96 15 -121 -68 -51 158 -23 -248 -14
6750 -14 37 65 114 -204 -66 166 42 56 -82 -227 264 7 -78 -62 -110 160 58 -236 1 0 108 62 -198 -80
6774 -80 134 83 -16 -204 -82 176 140 -96 -259 17 210 176 -145 -213 33 253 -13 -202 -17 34 217 -6
6796fj83J58J14J00k36k53M13Q0j61j04j35K22K79l84n8P7J23K37l75j48J96Q8
6818D4J48k12k84L12K13j38j26j98L04J81k76q7k1J67J75k32j89J51J95R8l46
6839a21j18K62J72n0k78m7K09J52j28j64j1K11O1j61q4j44L19J05k97k5L7K00
6861A00Q7l91N9K40o8P8l01N9K25k0m1j21p3L23Qk65%jK53J0l01M0Q7J03l5k16
6887a61k2K73rj3j22j32K90K7j59j44R8Q4O1j18k1J08P2p5j20L1QR0lj13M2M6
6913A8R2k1k28O9K33r6k8j21l5K03j8r8J01j37J61n1j73J85n6pJ30k52R9J46j64
6938d8M6l8l3J80j69M0N2j50J69mq9K5m1J04qo8J5K3No3K8ROj0OK3Pk5qQ3q4k7
6970d4P1n7K2l7l7O2j5m8K10k31Q2Q7j30J29j35J2J89j64n5J66j19J25m0j52J72
$$ plain form
6796 -6 -189 -31 83 183 -53 -306 107 187 26 -78 -213 9 288 -96 -154 -77 46 283 -92 -240 -44 44
6818 44 192 -20 -304 8 221 83 -43 -241 63 244 -32 -119 -140 27 202 -30 -219 -68 127 225 -121
6839 -121 -239 23 195 145 -133 -180 29 181 53 -111 -122 89 150 -11 -95 -239 80 185 -112 -137 -100 100
6861 100 187 -204 -145 95 27 105 -196 -137 88 68 27 -94 -167 156 164 -101 -101 -102 151 161 -140 -100 -13 90 55 -161
6887 -161 -183 90 81 68 -54 -186 104 131 -28 -172 -74 10 71 -47 -68 40 112 37 -83 -52 -44 46 43 -70 -28 18
6913 18 110 89 -139 -70 163 67 39 -82 -117 86 68 -30 71 -66 95 44 -129 56 0 -7 123 -129 -30 116 -48
6938 -48 -2 -40 -73 107 -62 -22 30 -120 49 45 -44 -19 -60 44 36 -32 -17 6 11 -52 -24 -15 -9 -19 -13 10 17 -8 -16 67 -17 -44
6970 -44 27 -30 -8 -45 -82 -20 -35 -83 127 -104 -22 65 -65 64 -71 -59 130 -34 -89 77 -42 83 43 -109 63
6995F3j17pJ87j41n9J68j08N6j35L2K32j47m6m6k5J50k3p2L4o9J04Kp1L4k7P9
7021D8j0j40J17l9LQ2j79J21M5n8J28j92N9J35j32jj1q1K45j87o6J57p3O7kj03
7047f7J38j04j10K24j84N3J37j59J26r4k1J22o5o3O0l4Q3L2k02J39n7O0J00j58
7071d4Oq2J20L9j04N2M1KL9j67J03L3j26J82q3n3P8p6R2q9rJ70j00j41J91j05
7097c1N7M8j83Q6N4pR3j66o7J74q5J34j14j19J17R0Mp6n7J15m9n2M3o8M9L0p4
7124e4Q5p8J02O6k12P2O6M3j3k11K9J62k6L1j30q2J86K0k0n7j40K30M6k18J52
7149D9j03J03L3k43J85rL8J7j52jJ61l1k1j26MJ85Pq2p2r3K44J6j40jJ1J12N3
7176A44j48j09J04K8L4j76Q4J48l7r4j47J33J46j01J1j29K7K15j14j68Q6K2J54
$$ plain form
6995 63 -54 -61 126 -15 -74 94 -14 42 -93 -61 171 24 -22 -68 -93 57 34 -38 -4 -73 31 33 -38 -4 -31 48
7021 48 38 -102 15 -24 -21 61 -118 3 48 -10 118 -74 -15 120 -12 -13 -24 -105 140 -47 -113 44 -29 38 36 -67
7047 -67 71 -33 -143 81 -103 -50 87 -72 54 -40 -61 61 -4 -67 -7 -41 42 74 -128 11 -46 14 114 -44
7071 -44 -38 -120 0 39 -65 -13 28 30 69 -98 5 38 -88 94 11 -42 36 -40 52 -37 -46 124 24 -117 74 -31
7097 -31 26 74 -109 -23 31 24 117 -49 -116 58 -27 107 -7 -126 -9 81 85 9 -48 67 18 -34 9 -59 -10 20 -54
7124 -54 31 -47 55 121 -91 -19 47 90 77 -134 -105 57 31 62 -68 -150 36 56 36 -21 -161 69 115 -103 49
7149 49 -54 49 82 -161 24 15 53 70 -82 -83 78 47 26 -100 -96 89 96 14 -58 -151 93 109 -31 -32 -21 91 144
7176 144 -4 -113 -9 19 53 -123 -39 109 72 -22 -169 -36 110 9 20 -109 -82 133 19 -149 -63 -41 113
7199A13J4k62Q1P3O1k1k08J78Q4j18J1j05J35O8j03o0j2J15O8r9j70M9J41P7j25
7224a5j14J09J1Q2q4j11J55L9o2K5j37J52Q0j88M9r3Q5J43k37J9R1K9J02k17k
7249h9K04o1j6o6o1J68K3j35m0m3J14O9j53k3J19M6M5j69J2J14nn4m0K2LN6L5
7276G5j12oJ25l0p8k5OK14j97l0O3n0R8l6j27J41m5L7L5j91Q1J11l4M3j55O0J46
7303A19j33m8R6l4Q5j08k8J11m7o1RJ9k1O3L2j8j52J57oj8p4k0J20j5j30J46n0
7330fN0M0j29Q3n2j00J50r2J6Q7j64J27j09J3K49j65j24J68p5Q0L3j68J00l2L3
7355A3R2k09L9J10l8M3o4m7K16j09j06R6K4k9k1LJ4j0K4j18Q9k1J9Q5j21p5Q5
7382a6P5k4j5n6J45j19q3J14o3oQ9j75R6P5j13J03j02k4K24q6q9Q2j36J80l4q6
$$ plain form
7199 113 127 -135 -54 19 80 59 -149 29 113 -5 6 -99 36 104 1 -59 -71 44 112 13 -157 -108 33 110 -15
7224 -15 -129 -20 -9 73 -11 -122 33 72 10 35 -102 50 130 -58 -9 -102 -17 126 -111 -92 -1 28 130 -87 -89
7249 -89 115 54 38 -28 -89 79 102 -33 -73 -116 -2 67 -86 -109 10 56 101 -68 -56 58 53 -1 -41 -19 -16 40 75
7276 75 -37 -43 82 52 -26 -51 -45 169 -28 -58 5 -45 53 17 -110 31 -14 23 58 -133 -52 59 25 68 -87 -27 119
7303 119 -14 -62 34 0 85 -23 -51 60 13 -48 -39 -20 -41 22 54 36 -116 41 35 17 -57 -77 43 28 -102 44 -6
7330 -6 44 84 -45 38 -14 -114 36 -56 -40 47 -117 10 -99 -86 163 -2 -126 42 -33 47 80 -88 12 -20 13
7355 13 105 -104 -65 45 7 50 -14 -61 155 46 -60 36 60 31 10 13 27 17 41 -77 12 -9 10 95 -26 -101 -16
7382 -16 59 35 20 -36 109 -10 -93 21 -42 -48 41 -134 -38 37 -76 27 -75 -99 125 39 -50 32 -104 76 42 -44
7408d4Q6l6O8r4p2R8Q3j62Q4kj11J35l6L2k7l2L3QL3j24L6Q9p8J26r2o5J67r0
7436A3P0kj47K4N7m7P1K4q4P9j10J18Mj40J33o3n9J22j06J5L7r7M8R3q2L1N6j17
7464e9Q4n6J0P2r9P6L5o5J4k7L6jKj6j8Rj0P6n7k0L0k9n0L4K2M9k0q9N3P4j17
7495e7Q1p7L2M8k2jK7j37J70J8j47R7k2J1N9k44J60P3j26Q0Po0J02j07KJ01q9
7522b1J8M8j60O0O3Ol7o1Q4N6Ml6kM7k4n1j3m5P2K7r5M0k6M6K1n1m9J09n6M4j08
7553i0J7J13m6j3P4j22J00k4q1J02j38K17J0k49J26K8K1N4j72j0J72j32J24l5
7577D6j50J93r9pM0p1M7N4j51L1O5L0kj31M9R8n7j%J0O0n7M5n8o9O6P4q2l9J7
7607d9J22o3k0jkQ1r6j12J20K4l6Q7j42J00J21j95Q7j22R4O2j12rL5l7J42K3j45
$$ plain form
7408 -44 42 6 74 -20 -92 6 89 -73 11 9 -102 33 -3 29 2 -30 3 11 44 -80 -44 45 -33 93 1 -64 103 13
7436 13 83 81 -66 -42 15 -32 39 63 -21 58 -52 66 70 -70 63 0 -59 63 -43 -28 9 -88 -40 53 -29 2 58 -59
7464 -59 25 -31 -21 51 -48 28 63 -2 12 -15 21 20 22 6 -12 -3 -13 63 6 -14 16 -13 -63 -29 -7 42 22 -67 -14 60 -57
7495 -57 24 -53 -21 27 5 4 31 -106 64 82 -65 32 10 21 80 -164 -4 69 -57 23 30 -30 72 -35 -33 68 -21
7522 -21 -3 45 -115 -55 8 14 -23 -84 0 56 60 24 22 69 45 -6 -19 -64 8 35 -60 -20 -46 0 21 -30 -79 30 -26 18 -90
7553 -90 -73 40 -6 -19 55 -67 33 9 -72 30 -108 109 119 -130 -4 24 45 99 -73 -83 89 -43 81 46
7577 46 -104 89 -10 -17 23 -48 -1 53 -98 -67 -2 28 26 -105 -56 42 -15 -16 -16 -6 54 -3 42 -16 -85 -19 55 -27 -66 -49
7607 -49 73 10 -10 -11 -13 68 -28 -140 -20 4 -32 55 -87 13 134 -61 26 -96 -2 60 -52 -61 -26 -63 79 102 -43
7634d3M5N0r1N3j11J51N6j24O5j08QJ22j47J4M3j4Q5r0K3jk2J02p5o5Q8k7l1J1
7662c3p5J59rj06K2n9J43o9q3J32m7J9M5n0j7J1K2Q6j39M2P8p8M3n0q5J53l0j06
7690h1J22n5P6K5j41N9j3mK8r3O9P0q0J08j51N9J15j30M0o6N5M2p4PK9o4N1Nj22
7719a14J45m7L3l1r7J81jo1%l5jJ50j90J21j28qJ74j01J2M8j07J46j1j22N0l2
7745b6P1K0j02R1p3m6J49j10N0J1p7M0op3J59j78R7J4m9O8o5jJ20j72J09m6p1
7772i6J50j15L7lp0P5N4p7L3KJ7J2m8M4K3o1J03j39K3J35q9K4k0r7J62n7l2Rj5
7801a6N7o9J7N2k9n0L7m8R7l9n2K9lM3j6j6M5l4m1J14q4m1Q5r8J00o6l1O6p8R5
7831B6Nq7j2N0K0J1m1M5M0p7l5P8ON2j10L9P6j47J21l4m5N6m8J6J4j0nQl5Q5l5
$$ plain form
7634 -43 2 52 -39 14 -97 54 110 -14 51 -57 -49 73 -74 -60 -17 -31 54 -36 -13 -14 -36 66 -9 -74 14 -13 -44 -33
7662 -33 -108 51 42 -64 -42 -101 42 -27 -110 22 -25 -6 39 -11 -28 -17 5 91 -48 -6 72 -6 37 -13 -98 55 25 -81
7690 -81 41 -14 62 87 -54 5 -8 -12 16 -77 -8 62 -18 90 -61 -2 113 -17 23 -43 12 54 -20 -13 16 -48 3 8 -114
7719 -114 31 -16 17 -14 -111 70 69 8 8 -27 -28 122 -68 53 -75 -83 91 -10 2 50 -57 89 78 -44 6 -26
7745 -26 45 65 -37 54 -19 -65 84 -26 24 35 -42 -2 -8 -81 78 -100 -3 11 -38 30 -35 -36 84 -88 21 -25 -96
7772 -96 54 -61 -24 -27 -97 -22 32 -45 -12 -10 7 19 -29 15 38 -23 80 -59 -36 99 10 34 14 -83 79 22 -10 -1 -16
7801 -16 41 -28 -11 41 12 -38 -1 -49 48 9 -43 -14 -17 26 10 -6 39 5 -36 78 -6 -47 38 -60 40 -26 -57 9 -69 26
7831 26 31 -56 -68 -18 2 13 -28 17 57 -20 -55 23 29 81 -29 10 86 -61 60 26 -19 37 -11 5 19 9 4 12 -23 62 27
7862B7L9m0nM5q4L7K7j9Nl4j2L8l6L3K6j12J96j55k4J48j21k7J03j43O9K4J7O6
7890H8j23L9N4j23K1rO5J4o6L1n0M2K2O2j36O9m9N8Ll7j2O0n4m3M8M1k6q9J18
7919A8k8Jj7L2K5k6o0R9l5M1p7l3J36q5n4O8l8l1O7n3N9M5j46J25p0OM7k7pP1
7949E3l6m3K6o2P0O9p7M7L2o0rn2N1m9l9M5R9j32J7N7l6npn3J35m8j1J7mNP9q3
7981doMOlPo6J16r4N2K5r6P4m8j9J3O7nJ8n4O5n0l9J00m7r6J10l2l8N2rK6j0j8
8014ApJ8q8L0J83r6r7N1nL7l3j8N3j11N8Q6r1NQ1j29J03m1j2J41j28n6J03O8j67
8043f1O0o7Q7N9p5j0l8J4L4j0n6J26q3j5O3m2K3O9n9qm9NP0p7J3J1O2o3M6q8j
8074f0P0n4N2J1p7J36k9j40J02l2j1P3r3R8J4o2LLr2J27p7o9R6n6J48n9j14J42
$$ plain form
7862 27 66 26 21 66 -18 19 46 27 32 -2 -14 24 -12 21 47 -65 131 -24 -48 100 -21 -48 55 -88 -19 5 22 88
7890 88 -35 4 58 -65 -44 -53 12 26 -40 -9 -59 -17 5 67 -69 0 -49 9 12 -25 -37 23 -31 -74 -26 15 -11 -100 18
7919 18 -10 -9 -26 6 31 5 -55 44 9 50 -27 -60 76 -9 -63 5 -33 -64 3 -50 9 54 -92 33 -37 -31 16 -11 -18 53
7949 53 17 -26 0 -62 8 77 0 47 79 19 10 -42 9 -40 -79 -34 65 -67 -50 7 -29 -34 -41 -94 41 -7 -18 -1 -5 0 79 -4
7981 -4 -10 -6 0 -3 4 -62 54 -40 12 37 -59 15 -33 -52 -39 28 23 41 -13 52 2 -37 63 16 -80 30 -2 -40 12 3 29 19 1
8014 1 -6 12 -76 -46 137 41 -56 -5 -10 27 -6 -24 29 -82 -24 62 -29 -24 57 -72 31 -10 -22 119 -9 -65 38 106 -61
8043 -61 -1 -68 19 78 3 -7 -45 -31 3 -7 -63 63 -20 -35 28 -14 9 78 19 11 -38 -33 37 -40 -27 -16 46 -17 29 -59 -60
8074 -60 10 -44 8 19 -58 78 49 -91 11 -21 -32 41 -52 46 60 -2 1 4 -88 39 -38 -107 -11 -67 81 22 -92 50
8102E0j7r5R8r9O5P9j09M1o7O3J2M6q1KJP0m8q7J17mK0l3n0J4M6l5r3J50j0n1
8132elk6j1Q6l2l2k0rJ00M8j88mJ05o5P1k3jJ20j13P4m7o5M4L8m5K2l8R8q7j08
8162a16J09rkP7j31L2Q9n3J4qm5Q5k8l5k2K9O1m8l2M5L4K9j06j4N0j2j3j2q1
$$ plain form
8102 50 33 -62 36 -63 2 81 -28 13 -54 9 21 67 -14 -12 -11 59 11 -76 41 37 57 24 -26 -12 34 -1 -94 56 46 -5
8132 -5 -8 -34 -45 41 9 -23 -43 -52 48 96 -92 -96 9 -56 15 -8 -9 111 -2 72 25 -40 4 42 -3 19 -19 79 -8 -116
8162 -116 -7 -16 -18 59 -72 -40 49 -4 10 2 -43 42 14 -21 -43 -14 47 -1 -33 12 46 75 -31 -45 5 -7 -20 -32 -113
8191a13
$$ Imaginary data points
##PAGE= N=2
##DATA TABLE= (X++(I..I)), XYDATA
0@%%%Qj6K4l2M0m8N6q0J05j29J61j94K34k82L33l92M63n44O35p36Q49r75J116
26E96j274J449j644J856k088K348k634K946l289L662m071M523n018N561o159O817
42C581p543Q346r245J0255j1390J2677j4150J5858j7871K0275k3203K6866l1590
55a7134L7936m6944O0767q4740J37174m19621J62280O43235q15864O26543k47651
66C5981n24227Q34920k65988k69809L89497m24829K65729J31435l44614K36234
76F4329q2227J2526J44138l59083K36872J42454k29138J37861j62159o2679L73766
87B16660j12373k48932R0400N6706j8034J86031j34029l30142L84477O5902l20516
98a63850L38452k50086j52990N67304m40309p1637M36043m53994K30224J21984
$$ plain form
0 0 0 0 0 8 -8 16 -16 24 -24 32 -48 57 -72 89 -105 129 -153 180 -212 251 -293 342 -394 455 -520 596
26 596 -678 771 -873 983 -1105 1243 -1391 1555 -1734 1928 -2143 2380 -2638 2923 -3236 3581
42 3581 -3962 4384 -4861 5394 -5996 6681 -7469 8389 -9482 10793 -12410 14456 -17134
55 -17134 20802 -26142 34625 -50115 87059 -332562 -170282 472953 -342911 283632 35981
66 35981 -488246 346674 80686 -189123 200374 -224455 41274 172709 -171905 64329
76 64329 -17898 -5372 138766 -220317 16555 159009 -70129 67732 -94427 -157106 216660
87 216660 104287 -144645 -54245 2461 -15573 170458 36429 -293713 90764 156666 -163850
98 -163850 174602 -75484 -228474 338830 -101479 -173116 262927 -191067 39157 161141
108A61141m54075M49539o0533k40007K76053l20003K11672K07391m16745K57135
118G1568j35064p7659M79995m69593j3895L35582m01951L38507M3174m76491M25312
129A19485m0781k33978L16874k18950m9273K59506j90727l5372J19537l4308j0256
140A757O530l4438k8590J27446j4048j49533R3978n709J027Q9599j50937K5141
152c7777O2312l5145R3298j51611K7633J34834j85161J60199l5717j94736L25650
163A63779j79372j23455L18669k90074P9380K11470l71444K19924R0525k61878
173a42476K46179j15507j02750K47985j68560N731P4979j21631J40628n4672o5737
184e5831J10919j07248P2280L3125j39907J26545j7050p4007J04001p5709j2080
$$ plain form
108 161141 -292934 156605 96072 -143935 132118 -187885 23787 231178 -185567 71568
118 71568 -63496 -141155 338840 -130753 -144648 190934 -211017 127490 170664 -305827 119485
129 119485 78704 -155274 161600 -57350 -106623 152883 -37844 -73216 46321 12013 1757
140 1757 8287 -26151 -54741 72705 58657 -90876 3102 -2607 -1580 88019 -62918 -37777
152 -37777 24535 -10610 82688 -68923 -41290 93544 -91617 68582 32865 -161871 163779
163 163779 -15593 -139048 179621 -110453 -31073 180397 -191047 28877 119402 -142476
173 -142476 103703 -11804 -114554 133431 -35129 -29398 45581 -76050 64578 9906 -55831
184 -55831 55088 -52160 20120 53245 -86662 39883 22833 -51174 52827 -22882 -34962
195c4962Q9436n9926k7898M3986P665l6951L0674K096p3392J07234j4141j17286
207h3465J37927n5928n0905J45971j50510J5301J27492j42364P8280L22r9271
218g7150J47007p3151l2497Q1548j07600J00822k594j18113J41835p6484j8465
229c4842J22943j66189O6521R1272j48666J00433j7200q7820J45327o3152o0931
240e2304Q0044m4588K6145K0740o1198J9084K1154R718j6977k3031K2612m134
252b735K1455q883m6287M3848P398j2813L384l6858M2666R736l1942K1917m4898
265c4012M0029M1969q8316M6992k863m0445J03273q1091m0041J03518p1749L2477
277I741K7384j07572R0922J5717o8539N7933n1531J0081O6143p2059J5572P858
$$ plain form
195 -34962 54474 -5452 -33350 10636 18301 -18650 12024 14120 -59272 47962 33821 -83465
207 -83465 54462 -1466 -52371 93600 -56910 -41609 85883 -56481 21799 22121 -77150
218 -77150 69857 -3294 -35791 45757 -61843 38979 36385 -81728 60107 -16377 -34842
229 -34842 88101 -78088 -11567 79705 -68961 31472 14272 -73548 71779 8627 -52304
240 -52304 27740 -16848 9297 30037 -31161 -12077 9077 18795 1818 -21213 1399 -2735
252 -2735 18720 9837 -36450 7398 14796 1983 5367 -31491 11175 20911 -11031 10886 -34012
265 -34012 6017 47986 -40330 6662 3799 -36646 66627 -14464 -54505 49013 -22736 9741
277 9741 37125 -70447 20475 36192 -32347 25586 -25945 -15864 50279 -21780 -6208 1650
289A650k2229O2184m7245k5432M7376k5427K8242p387n3462N1447J0050k4351
301d584R634k3748J1767L0892j6724k3003K560K1971R28k095j4456k1626M6742
314A8258N398m1552J7835j3458J3703L6412n6690L509K6857j8487L5265l1147
326d097k9834N3259j6898L901K704m7710N2935J0942m2692K5320k6168J2909M4535
339C9106n5858J463K2430j6955L5362k2501l5249L8650L556j389m838k9997K4775
352a445K2951j6377j2520r165J6996J8707j3791j7708j610J9949J0589j3854j6177
365a3455j658K7776O403k7074m894M219K0383J1035l8699j604K3438R51J0758
378A7579k7384j6992M0009Q65j0590q461k0607L5894J5471l3795l185q00J8849
$$ plain form
289 1650 -20579 41605 -5640 -31072 16304 -9123 19119 11732 -41730 9717 19767 -4584
301 -4584 5050 -18698 -6931 23961 7237 -15766 -13206 8765 9693 7598 -6858 -28484 18258
314 18258 23656 -17896 -61 -13519 184 36596 -20094 -16585 10272 -8215 27050 -4097
326 -4097 -33931 19328 2430 6331 9035 -38675 14260 25202 -17490 7830 -18338 -5429 39106
339 39106 -16752 -15289 7141 -9814 25548 3047 -32202 6448 10004 8615 3777 -26220 -1445
352 -1445 21506 5129 -7391 -16556 440 19147 5356 -12352 -13962 5987 16576 2722 -13455
365 -13455 -15113 12663 19066 -8008 -12902 -8683 11700 22735 -15964 -17568 5870 6821 17579
378 17579 -9805 -26797 13212 14077 3487 -4974 -25581 10313 25784 -8011 -11196 -11996 6853
391F853J9650l6817r386K0713O820R901k4010j8052K8762J1638p796j6613j2879
404b1216K6098J7522j9879j9017L230K3172R021k0132j7590R886K4461r71k1318
417f733r378R647K4197k963k9640n10J7478J4662m946l1406M299K8423J09j0031
431C208j9526K094L2103m520j9913o140L101K6340j093k9624K06J3611J5797l631
445A2013k9670M277K2599M079q873k0785N777K4116k532j2855j2127O418K2955
458A5392n297j7900n305J0757J9544j0850j9943M673J2184J2196j3093j9446J3949
471c139J0828J301p024j8832J4187J6488r735o451j0626J0656K0123j6867j0631
484i722L562P084J4679j7111j2473J5045K375N325q701j5469J8550N451p124k106
$$ plain form
391 6853 26503 -10314 -19700 1013 7833 17734 -6276 -24328 4434 16072 8276 -8337 -21216
404 -21216 4882 22404 2525 -16492 -13262 9910 18931 -1201 -18791 -8905 15556 14585 -6733
417 -6733 -16111 -6464 17733 14770 -14870 -15380 2098 16760 11814 -19592 -15293 13130 13239 3208
431 3208 -16318 -14224 17879 13359 -6554 -12694 -9593 16747 15654 -13970 -13764 -153 15644 12013
445 12013 -17657 -13380 9219 13298 4425 -16360 -10583 13533 11001 -1854 -13981 -7563 15392
458 15392 10095 -7805 -13110 -2353 17191 6341 -13602 -8929 3255 15451 2358 -17088 -3139
471 -3139 7689 8990 1966 -16866 -2679 13809 4074 -2377 -13003 -2347 17776 909 -9722
484 -9722 -6160 924 15603 -1508 -13981 1064 3439 8764 63 -15406 3144 8595 1471 -635
498f35j1423J4093J1537j6383l739J169J0116O494j7441j123O743N626M548j8577
512h995J677J2989m767O606j2651o994K3094p848n392J944r349J9798l962j7888
526a1738J3569k866O629N99k2488J8608N593r212Q833k2237Q953K4687k2170K239
540a001l321p317L0110j4268j7705J5172m298R827k630j6735J4604J572k054k434
554d78j0710J8062J570j2011J313j0227J9259J2014k7609r41L787J1245J4130
567A9404k6677o106J1260O336J2239k4047l883J7093r577J6241j3244j8220L6771
580A7590j6399j1701J8782k2439K6029O090m4541K4296Q614k142J4697l9795M881
593a6038K9558p422R190k9338q929L9781j1060J004q339k4257M1022k844k5076
$$ plain form
498 -635 -12058 2035 13572 -2811 -6550 -5381 4735 11229 -6212 -7335 -592 5034 9582 -8995
512 -8995 -7318 5671 904 7510 -5141 -12135 10959 3111 -2281 -337 -9686 10112 6150 -11738
526 -11738 1831 -1035 5594 6193 -16295 2313 7906 -1306 7527 -14710 -5757 18930 -3240 -1001
540 -1001 -4322 -11639 18471 4203 -13502 1670 -2628 7199 4569 -12166 2438 4010 1956 -478
554 -478 -11188 6874 8444 -3567 -2254 -12481 6778 18792 -8817 -9758 -5971 5274 19404
567 19404 -7273 -13379 -2119 4217 16456 -7591 -11474 5619 -3958 12283 -961 -19181 17590
580 17590 1191 -10510 8272 -14167 11862 17952 -26589 -2293 6321 4179 18876 -20919 -16038
593 -16038 13520 6098 15288 -14050 -22979 16802 5742 6746 -1593 -25850 15172 12328 -12748
606a2748J9012j3822Q640J2088k8493J2656J2686n678l597j7023J3966J4136j271
619A0552p260l1525K3641K9775k3139J489k0902j571M8413k2690j6558Q732j5446
632a6489L0326j654k5268J6547j0456J2954K683k9606L2958m391j6982K0351l4505
645b3532K5083L2849n2781J3023L040j2862M9003l0103k9515K7550p501K2132
657A6386l068l4420J7310L193J0772j4k9387K4253j420j1235K1361k6776J1874
670a171K0509l5440J4078N269p420K2346k4559q759J6334L870J2920k8058m912
683a4993K1639j1274K3876j7795l0382M5090j5592n832K5919m4103K1214K2641
695B0408l6819K3758o795j0063K5678k7172P336J1711j3631J9661k6099J185K9893
$$ plain form
606 -12748 6264 -7558 1082 13170 -15323 -2667 10019 4341 744 -16279 -2313 11823 10552
619 10552 3292 -28233 -4592 25183 2044 3533 -17369 -18940 29473 6783 -9775 -1043 -16489
632 -16489 13837 12183 -13085 3462 -6994 5960 8643 -20963 11995 7604 -9378 10973 -23532
645 -23532 1551 34400 -18381 -5358 -2318 -15180 33823 3720 -25795 1755 -5746 16386
657 16386 13318 -21102 -3792 -599 10173 10159 -19228 5025 3605 -7630 13731 -13045 -1171
670 -1171 19338 -16102 -2024 3245 -4175 18171 -6388 -15147 1187 5057 17977 -10081 -14993
683 -14993 6646 -4628 19248 1453 -28929 16161 569 -5263 20656 -23447 -2233 20408
695 20408 -16411 7347 552 -9511 16167 -11005 -3669 8042 -5589 14072 -12027 -10842 19051
708A9051k9616J9197l766l2479M6393j1872j9477K6619l0439J4272K1863l1134
720a1388J2164j473l195J3689j6988J0437l802o544K2140k6750Q704J8194l1631
733a6443K6202n388k4603L9138j9922r729K2820k3828J6248L130j8221J8074j4419
746f941Q666P684k4059K5985j3933r290L4226l7058R474K4617l9364K8670J0k8528
760a9841L5748j8205p164K3002k3108J1507J573j0122J6199j8667J0621O830k2355
773a3982K6303j4095j0531L0542k9217P970J7758l1362K2782Q30j8296J9735j3095
786d658L996P209j4704J4843j1189K436J3555k6049K1418l74k3277L3413k0792
799d173q396L2074l0844R621J2579k6421K6068o665j4755J8626j4957J1890J754
$$ plain form
708 19051 -10565 8632 4866 -27613 18780 6908 -12569 14050 -16389 -2117 19746 -11388
720 -11388 776 -697 -3892 9797 -7191 3246 -556 -7100 15040 -11710 -3006 15188 -16443
733 -16443 9759 4371 -20232 18906 -1016 -10745 12075 -11753 4495 7625 -10596 7478 -6941
746 -6941 1725 9409 -14650 11335 -2598 -11888 22338 -14720 -5246 19371 -19993 8677 8687 -19841
760 -19841 15907 -2298 -9462 13540 -9568 1939 3512 -6610 9589 -9078 1543 8373 -13982
773 -13982 12321 -1774 -12305 18237 -10980 -3010 14748 -16614 6168 6998 -11298 8437 -4658
786 -4658 -662 6547 -8157 6686 -4503 -2067 11488 -14561 6857 6483 -16794 16619 -4173
799 -4173 -12569 19505 -11339 -1718 10861 -15560 10508 3843 -10912 7714 -7243 4647 6401
812F401j8147K0598j5251L409J9829l1905J6858N925k2908L0560j5925j2928K7959
825A4475k2151N050J2235j7702J3393o671m420J2250j0539J0686p210j0224J9993
838I165j3981P562Q525k9218K0235N067j4102J9012j9070k439J8861j4393J0705
851E929l733j1720J4832j0792R472M375k0429J8917r679o720K6863k2882J993
864c574J1024k4152K5384K387k1705J6435j3453K609J8707j6649M814n179o643
877i995K0492r768M60J729j6659J9020q59q420J4898j9306M71J5816j0662R898
891G115n109j3121J2572j951N164J638j3309N317k996P086R599j8526M754N83
905a184o521J9929j0220p512R184j4641J3285Q848j5575O824q703J27J6386j0410
$$ plain form
812 6401 -11746 8852 -6399 -2990 16839 -15066 1792 7717 -15191 15369 -556 -13484 14475
825 14475 -7676 -2626 9609 -8093 5300 -1371 -5791 6459 -4080 6606 -604 -10828 9165
838 9165 -4816 2746 11271 -17947 2288 7355 -6747 12265 -6805 -9244 9617 -4776 5929
851 5929 2196 -9524 5308 -5484 3988 8363 -12066 6851 -2828 -9548 17315 -5567 -3574
864 -3574 7450 -16702 8682 11069 -10636 5799 -7654 -5045 13662 -2987 1827 -3352 -9995
877 -9995 10497 729 1189 2918 -13741 5279 4420 -4000 10898 -8408 -7937 7879 -2783 7115
891 7115 2006 -11115 1457 -494 4670 6308 -7001 -1684 -4680 2406 12005 -6521 -1767 -1184
905 -1184 -7705 12224 2004 -5508 3676 -10965 2320 11168 -4407 2417 -6286 -6159 10227 -183
919a83L109l969j1235J8821l050l127N538j8251J1104R071j1785J1411r219q138
933i903J4904o107M418K502j4186P025J366M29P344j0292j163J022J29J1958p576
948A870o896L565l479J0536L39j0223M226m439L613Q164q415J188k208j906R099
963E034n590J414K251r926P498O18j834P861j2550k16R623o042P275l563j0445
978h592J0157j197J326M024j2515M444N403l861M818o056j037O177n482L681R01
993B191m937M683l506j75M852l858K140j782l778O223q3o75k031l973O694N06
1009B491k599R63m909M507K529m605L677m173j87P073o677R82K542m388O093l681
1025c62l715Q167m619l75K607n471O059j52n033M739l863J230N146o674J239J484
$$ plain form
919 -183 2926 -1043 -12278 6543 3493 366 5904 -12347 -1243 7828 -3957 7454 -1765 -9903
933 -9903 5001 -1106 3312 5814 -8372 -1347 19 448 7792 -2500 -3663 -2641 -2512 9446 1870
948 1870 -5026 -1461 -4940 5596 5935 -4288 -62 -4501 -888 7276 -1139 49 -2159 -4065 5034
963 5034 -556 858 3109 -6817 681 1299 -535 7326 -5224 -5440 4183 -1859 5416 1853 -8592
978 -8592 1565 368 1694 5718 -6797 -2353 3050 -811 4007 -2049 -3086 3091 -2391 1290 2191
993 2191 -2746 1937 -1569 -1744 3108 -750 1390 -392 -4170 2053 1970 1295 -736 -4709 1985 2491
1009 2491 -108 855 -4054 453 2982 -1623 2054 -2119 -2306 4767 -1910 -928 1614 -2774 3319 -362
1025 -362 -4077 4090 -529 -904 1703 -3768 2291 2139 -2894 1845 -2018 -788 4358 -2316 -1077 407
1041D07j445M544m586k039N226j941M85n79k253L207j69p11j49j586K055L30j25
1058F71j098j896M226q44k644K439k256K425Q68n246M718n36k623M773n144O51
1074a516M656n188L761j482m505Q383l513l091M691n172M134J993p247N682r81
1089F05l140O026m670o72M242l861K305O1l632M415m63k848J708k28O57K90j540
1106g45n7J403k3j235J459j310j002L969k705j202K990l566L474M51n988O430
1122B343j375l839O395n815J002N396p952N242O51o901Q873l759l807P313o358
1137b591K678L594q561O533N70n720O336l583j329N386n076J432K306m540L405
1152H40R77l716J834R09j519J302l79k051L324m71l847M720j604l053O356n085
$$ plain form
1041 407 -1038 3506 -1080 -3119 2107 166 651 72 -2181 1026 857 146 -3 -1589 466 796 671
1058 671 -427 -2323 1903 1059 -1585 854 -1402 1023 1891 -3355 1363 827 -1796 2977 -2167 -1516
1074 -1516 3140 -2048 1713 231 -4274 4109 596 -2495 2196 -2976 1158 3151 -4096 1586 605
1089 605 -2535 3491 -1179 -1851 2391 -1470 835 896 -2736 1679 1216 -1632 76 -152 505 795 -745
1106 -745 -802 601 578 -657 802 -508 -1510 2459 -246 -1448 1542 -2024 1450 1901 -4087 2343
1122 2343 968 -2871 3524 -2291 -1289 4107 -3845 1397 2048 -4853 4020 261 -3546 3767 -2591
1137 -2591 87 3681 -4880 1653 2223 -3497 2839 -744 -2073 3313 -1763 -331 1975 -2565 840
1152 840 1817 -1899 -65 844 -675 627 248 -1803 1521 1050 -2797 1923 319 -2734 3622 -1463
1168a463m10N681p610N257J827r451J0008k592o096J0457q843J248Q323j2528
1182f192P850K322j0958J1937m582n404J1200r767K456O641j1645Q093J553q728
1196e224Q574l821k389P284o648R29M278n437K598K144m116J260K091k544J042
1211B1J740m488L505K045p207O695n14o784R820o189k193J0368j2228N309O211
1226F111j4632J3143j749j0859J5904j1240p69J3899j8141R051O270j6791J6081
1239F278m675r603J6829j3001J047J1664j6263Q974L919j2168J1316m058m710
1252d451R967p945N05N858o626K571K149l608J437J350k106L73K701m538K228
1267a35L940q704O302K090r758J1520n673n741J5228j4277K706J1848j9778J3730
$$ plain form
1168 -1463 -1873 3808 -3802 1455 3282 -6169 3839 1247 -4849 5608 -3235 -1987 6336 -6192
1182 -6192 1658 3980 -6978 4959 377 -5027 6173 -3594 -1138 5503 -6142 1951 3504 -5224
1196 -5224 3350 -471 -2860 4424 -2224 -1295 2983 -2454 144 2288 -1828 -568 1523 -1021 21
1211 21 1761 -2727 778 2823 -4384 2311 1797 -4987 4833 -1356 -3549 6819 -5409 -100 6111
1226 6111 -8521 4622 2873 -7986 7918 -3322 -4091 9808 -8333 718 6988 -9803 6278
1239 6278 1603 -8000 8829 -4172 -3125 8539 -7724 1250 5169 -6999 4317 259 -4451
1252 -4451 5516 -2429 -1924 3934 -2692 -121 2028 -1580 -143 1207 -899 -526 2175 -2363 -135
1267 -135 3805 -4899 1403 3493 -6265 5255 -418 -6159 9069 -5208 -2502 9346 -10432 3298
1281C298K997j7263J9978j0544o591K0988k0742N671J2385k1897J7179j286j4647
1294a0474K0685j3757k183J6584j9150Q888O323j6162J4407l999p294J3579j0527
1307c080l21Q966q770L242K411n149K876J204j955l33K857l655L04O388q876K868
1323a023O149j1331R697j082j0235J6056j0789k813J5758j8922Q994P468j9538
1336a1611J9682o926j1580K3374j9805K284J7661k4945J5091L201j9261K4036
1348A1201j1749r039K1235j8964N916J1207j9546J2973q13r481J5179r942k599
1361d422R241q648N020J565n625M116k330K43K491m64j280k724M479k685P99N765
1377E541j1177N301L284q993J4911r304q935J8081j4429N554J1369k3469J5154
$$ plain form
1281 3298 6295 -10968 9010 -1534 -8125 12863 -7879 -2208 10177 -11720 5459 4173 -10474
1294 -10474 10211 -3546 -5729 10855 -8295 593 6916 -9246 5161 1162 -6132 7447 -3080
1307 -3080 -3401 5565 -3205 37 2448 -2701 175 1379 -576 -909 1948 -1707 -1403 4985 -3891 -1023
1323 -1023 5126 -6205 3492 2410 -7825 8231 -2558 -5371 10387 -8535 459 7927 -11611
1336 -11611 8071 1145 -10435 12939 -6866 -4582 13079 -11866 3225 6426 -12835 11201
1348 11201 -548 -9587 11648 -7316 -1400 9807 -9739 3234 2421 -7060 8119 -1823 -4422
1361 -4422 4819 -3829 1191 2756 -2869 1247 -1083 -840 1651 1187 -93 -2817 1662 -1023 -224 5541
1377 5541 -5636 -335 2949 -6044 8867 -437 -9372 8709 -5720 -166 11203 -12266 2888
1390B888R73j4610K4313j5658p295J9973k0340J1934Q782k3172J8205o978q827
1403i812K4323j7768j110J0714j7959J7196K367j5828J3026j0065p21J6006j1396
1416a027L49O66o903J0383M96l619n76l786K642J916M546l012p556N285l069N262
1432A997O861j4502M784l65n531J8896j1006p424R990j4152J5451O181k0778J4408
1446D810r335m626K4857j8711O79P934k0838K1871K154j6713J6617j6324j027
1459h652K1137j5273O307j011j6996J9304J56n445P038j5672M093J0389m641N663
1473F397q426o478R118J239L452l434o580J712M63P651o63o133P28o788R053P187
1489H498j0734N141p943l380J8429r269J84K453j7463J7541M344j1798J1906j5639
$$ plain form
1390 2888 3861 -10749 13564 -2094 -9389 10584 -9756 2178 10960 -12212 5993 -985 -9812
1403 -9812 14511 -3257 -4367 6347 -11612 5584 7951 -7877 5149 -4916 -5637 10369 -1027
1416 -1027 -678 -12 -6915 3468 3964 345 -231 -4017 -1375 541 5087 2075 -5481 -196 -3265 1997
1432 1997 8858 -5644 -860 -1225 -6756 12140 1134 -6290 3700 -10452 4999 11180 -9598 4810
1446 4810 -4525 -9151 15706 -3005 -2326 5608 -15230 6641 8795 -7918 8699 -7625 -8652
1459 -8652 12485 -2788 3519 2508 -14488 4816 4972 -473 6565 -9107 -5014 5375 734 6397
1473 6397 -2029 -8507 611 1850 5302 1868 -4712 -3000 -2537 5114 4451 -1682 -954 -7742 1311 8498
1489 8498 -2236 2905 -5038 -8418 10011 742 926 3379 -14084 3457 7801 -3997 7909 -7730
1503g730j48J8309j3954Q315j060j7652J8801k768m069J2199j8856M025J0044
1516E456j0391J3478o149j2513J2409m469M863N481j4845M125J989n96Q599p554
1530a17l446J397k47P799l260l281k25l309P726q79k047K732r321N574M827n377
1546a454O928q599k778J1011p775O157R47j3677J1546j586k618J0410j4546K668
1560c366Q524j0521J0853l385r385J1897p631K287P892j3065O600R17o536J0686
1574E767o246j985N458q083P124J628o863N163m472J444N037o031L255j774k205
1589b783O074m121J226L19m175O586l589j079M608o409M565J43m793P576n839
1604a691m60O293p908N381L56o461Q475n452n36P009r374M766K284o519P893n539
$$ plain form
1503 -7730 -7878 10431 -3523 4792 3732 -13920 4881 2113 -1956 10243 -8613 -4588 5456
1516 5456 -4935 8543 2394 -10119 2290 -2179 2684 8165 -6680 -2555 -566 -1162 7437 -117
1530 -117 -3563 -2166 -2413 5386 2126 -1155 -1380 -4689 3037 2158 111 2843 -6478 -904 3923 -1454
1546 -1454 5474 -3125 -5903 5108 -2667 3490 4437 -9240 2306 720 -1898 8512 -6034 -3366
1560 -3366 5158 -5363 5490 2105 -7280 4617 -3014 -727 7165 -5900 700 1617 -4919 5767
1574 5767 -479 -2464 2994 -5089 2035 3663 -3200 1963 -2509 -1065 3972 -2059 1196 -578 -2783
1589 -2783 3291 -830 396 715 -3460 3126 -463 -1542 3066 -3343 1222 1365 -3428 4148 -1691
1604 -1691 -2151 4142 -3766 1615 1971 -4490 3985 -1467 -2003 5006 -4368 398 2682 -3837 4056 -1483
1620a483j634P971p815L575J835p097P583k912j844N616p496L659K902n812N615
1635B663l363j449N105n504L731Q66n323M990k606L43L652n832L449l13k962N900
1651C347m081j78K212m484N738j385l843N098m781K123L138n620M870k621k692
1666c159P033n398J360K390o081O080j779k649O211o717J515M035n564N374k489
1681A62l516O704n186J663L271o575M614p15k417N495n438Q14L501m870M153j033
1697F27k509L887l905J986K047m338L331j465p76L121l664K379N4l009M202k547
1713e79M4K243m174M070r74l034N142m192P31L117n207M719j388l574O456m819
1729a419K82M023o016M704m85m130O254m516k68M707n593L299J70l788N643l601
$$ plain form
1620 -1483 -3117 4854 -2961 614 2449 -4648 2935 23 -1821 3795 -3701 -42 2860 -2952 2663
1635 2663 -700 -2149 2956 -2548 1183 2049 -3274 1716 -890 -547 3105 -2727 722 409 -2553 3347
1651 3347 -734 -912 1300 -3184 2554 1169 -2674 2424 -2357 -234 2904 -2716 2154 -467 -3159
1666 -3159 3874 -1524 -164 2226 -3855 2225 446 -2203 4008 -2709 -1194 2841 -2723 2651 162
1681 162 -3354 3350 -1836 -173 3098 -3477 1137 422 -1995 3500 -1938 -1124 2377 -2493 1660 627
1697 627 -1882 2005 -1900 86 2133 -2205 1126 -339 -1115 2006 -1658 721 775 -2234 1968 -579
1713 -579 -535 1708 -2466 1604 630 -2404 2738 -1454 -723 2394 -2813 1906 518 -3056 3400 -1419
1729 -1419 -1137 2886 -3130 1574 1089 -3041 3213 -1303 -1571 3136 -2457 842 1012 -2776 2867 -734
1745g34p21L960m640K605N19k664L641l121K86K670l303K340o58j300K611l024
1761a533K123O60l244L318k084K84K608m404L188j90l232N234l434l89L198m883
1777b780M277j25m464N665l431o39M436n261L227L59m355N725k885j366M027m436
1793b026K497O97l277M286k859o38L201l247K202n66j900L485l042J060J706l495
1809a916L154j588o27L364m544K545J184m112M577k583p81M131n544L347J467
1824B074n206N409k466j721M900n406K801J786n431N209j607k234M403m397J901
1839A5J767m221M145j592j591L210l007J931n6k379L505k440K97J688l040L313
1855A545j969q37L836m792K599J306m424N286l387r62N567o828L267K323o345
$$ plain form
1745 -734 -1455 2505 -2135 470 989 -1675 1966 -1155 -869 1801 -1502 838 180 -1120 1491 -1533
1761 -1533 590 1250 -1994 1324 -760 -476 2132 -2272 916 726 -2506 2728 -706 -1095 2103 -2780
1777 -2780 1497 1372 -3092 2573 -858 -1497 2939 -2322 905 1264 -3091 2634 -251 -1617 2410 -2026
1793 -2026 471 1168 -2109 2177 -682 -1320 1881 -1366 836 270 -1630 1855 -1187 -127 1579 -1916
1809 -1916 1238 -350 -977 2387 -2157 388 1572 -2540 2037 -546 -1327 2804 -2740 607 2074
1824 2074 -3132 2277 -189 -1910 2990 -2416 385 2171 -3260 1949 342 -1892 2511 -1886 15
1839 15 1782 -2439 1706 114 -1477 1733 -1274 657 601 -1778 1727 -713 -416 1272 -1768 1545
1855 1545 -424 -1261 2575 -2217 382 1688 -2736 2550 -837 -1799 3768 -3060 207 2530 -3815
1870c815O661l060k524O994p213K622L786p599O316j260m051O868n915J242M463
1885C515p042M753k0l841N293l911N07L027m524L291m49k112L001k531J611M2
1901F10k388L516k513P27J216l397M328k528j393M933n732L010J947n942O673
1916C067l745k045P639q304K911L960q155Q055k932m761R454q056J705O008r849
1931e048O897q3o032Q868o562k00O778q470M706J325n682O633m204q41N251n615
1947b279K867N63l599M223k350O99J057l727L920j332k47J760m382M332r98k550
$$ plain form
1870 -3815 2846 -214 -2738 4256 -2957 -335 3451 -4148 2168 908 -3143 3725 -2190 -948 3515
1885 3515 -3527 1226 1206 -2635 2658 -1253 -746 2281 -2243 1048 599 -1513 1488 -1043 568 610
1901 610 -1778 1738 -775 -48 1168 -2229 2099 -429 -1822 3111 -2621 389 2336 -3606 3067
1916 3067 -678 -2723 4916 -3388 -477 3483 -4672 3383 451 -4310 5144 -2912 -1207 4801 -5048
1931 -5048 1849 1766 -4266 4602 -1960 -2160 4618 -3852 854 2179 -3503 3130 -1074 -1915 3336 -2279
1947 -2279 588 1151 -2448 1775 -575 124 1181 -2546 1374 42 -205 1555 -2827 1505 507 -2043
$$ [...]
8191i
##END NTUPLES=NMR FID
##END=
