##TITLE=1H_LY-877.40
 CCl4, 8 sc, 
 12.11.2019
##JCAMPDX= 6.0         $$ Bruker NMR JCAMP-DX V2.0
##DATA TYPE= NMR FID
##DATA CLASS= NTUPLES
##ORIGIN= UXNMR, Bruker Analytische Messtechnik GmbH
##OWNER= root
$$ XWIN-NMR		Version 3.5
$$ Tue Nov 12 14:30:19 2019 Russian Standard Time (UT+4h)  she@DPX200
##.OBSERVE FREQUENCY= 200.131
##.OBSERVE NUCLEUS= ^1H
##.DELAY= (6, 6)
##.ACQUISITION MODE= SIMULTANEOUS
##.ACQUISITION SCHEME= undefined
##.AVERAGES= 8
##.DIGITISER RES= 18
##SPECTROMETER/DATA SYSTEM= spect
##.PULSE SEQUENCE= zg30
##.SOLVENT NAME= DMSO
##.SHIFT REFERENCE= (INTERNAL, DMSO, 0, 15.7039)
##AUDIT TRAIL= $$ (NUMBER, WHEN, WHO, WHERE, WHAT)
$$ ##TITLE= Audit trail, XWIN-NMR		Version 3.5
$$ ##JCAMPDX= 5.01
$$ ##ORIGIN= Bruker BioSpin GmbH
$$ ##OWNER= she
$$ F:/spectra/data/she/nmr/H-F/1/audita.txt
$$ ##AUDIT TRAIL=  $$ (NUMBER, WHEN, WHO, WHERE, WHAT)
(   1,<2019-11-12 14:29:15.03 +0400>,<she>,<DPX200>,
      <created by zg, POWCHK disabled, PULCHK disabled
       configuration hash MD5:
       00 E9 B6 7A A2 85 ED C7 34 08 36 98 17 FE 4E 26
       data hash MD5: 16K
       87 DD 8F 47 D0 0A DA 78 F2 70 31 97 A9 A9 4F 25>)
$$ ##END=
$$ 
$$ hash MD5
$$ 20 6E 7B D7 7D 64 6A 42 41 B0 F6 19 72 D0 C9 39
##$RELAX= 
##$RELAX= 
##$RELAX= 
##$RELAX= 
##$RELAX= 
##$RELAX= 
$$ Bruker specific parameters
$$ --------------------------
##$DU= <F:/spectra>
##$EXPNO= 1
##$NAME= <H-F>
##$PROCNO= 1
##$TYPE= <nmr>
##$USER= <she>
##$AMP= (0..31)
100 100 100 100 100 100 100 100 100 100 100 100 100 100 100 100 100 100 
100 100 100 100 100 100 100 100 100 100 100 100 100 100 
##$AQSEQ= 0
##$AQ_mod= 1
##$AUNM= <au_zg>
##$AUTOPOS= <>
##$BF1= 200.13
##$BF2= 200.13
##$BF3= 200.13
##$BF4= 200.13
##$BF5= 200.13
##$BF6= 200.13
##$BF7= 200.13
##$BF8= 200.13
##$BYTORDA= 1
##$CFDGTYP= 0
##$CFRGTYP= 5
##$CHEMSTR= <none>
##$CNST= (0..31)
1 1 145 1 1 1 1 1 1 1 1 1 1 1 1 1 1 1 1 1 1 1 1 1 1 1 1 1 1 1 1 1 
##$CPDPRG= <>
##$CPDPRG1= <>
##$CPDPRG2= <>
##$CPDPRG3= <>
##$CPDPRG4= <mlev>
##$CPDPRG5= <mlev>
##$CPDPRG6= <mlev>
##$CPDPRG7= <mlev>
##$CPDPRG8= <mlev>
##$CPDPRGB= <>
##$CPDPRGT= <>
##$D= (0..31)
0 1.2 0 0 0 0 0 0 0 0.06 0 0.03 0 0 0 0 0.0002 0 0 0 0 0 0 0 0 0 0 0 0 
0 0 0 
##$DATE= 1573554554
##$DBL= (0..7)
120 120 120 120 120 120 120 120 
##$DBP= (0..7)
150 150 150 150 150 150 150 150 
##$DBP07= 0
##$DBPNAM0= <>
##$DBPNAM1= <>
##$DBPNAM2= <>
##$DBPNAM3= <>
##$DBPNAM4= <>
##$DBPNAM5= <>
##$DBPNAM6= <>
##$DBPNAM7= <>
##$DBPOAL= (0..7)
0.5 0.5 0.5 0.5 0.5 0.5 0.5 0.5 
##$DBPOFFS= (0..7)
0 0 0 0 0 0 0 0 
##$DE= 6
##$DECBNUC= <off>
##$DECIM= 24
##$DECNUC= <off>
##$DECSTAT= 4
##$DIGMOD= 1
##$DIGTYP= 9
##$DL= (0..7)
0 120 120 120 120 120 120 120 
##$DP= (0..7)
150 150 150 150 150 150 150 150 
##$DP07= 0
##$DPNAME0= <>
##$DPNAME1= <>
##$DPNAME2= <>
##$DPNAME3= <>
##$DPNAME4= <>
##$DPNAME5= <>
##$DPNAME6= <>
##$DPNAME7= <>
##$DPOAL= (0..7)
0.5 0.5 0.5 0.5 0.5 0.5 0.5 0.5 
##$DPOFFS= (0..7)
0 0 0 0 0 0 0 0 
##$DQDMODE= 0
##$DR= 18
##$DS= 0
##$DSLIST= <SSSSSSSSSSSSSSS>
$$ [...]
##$SUBNAM2= <"">
##$SUBNAM3= <"">
##$SUBNAM4= <"">
##$SUBNAM5= <"">
##$SUBNAM6= <"">
##$SUBNAM7= <"">
##$SUBNAM8= <"">
##$SUBNAM9= <"">
##$SW= 24.0690132163818
##$SWIBOX= (0..15)
0 0 2 0 0 0 0 0 0 0 0 0 0 0 0 0 
##$SW_h= 4816.95568400771
##$TD= 16384
##$TD0= 1
##$TE= 0
##$TE2= 300
##$TE3= 300
##$TEG= 300
##$TL= (0..7)
0 120 120 120 120 120 120 120 
##$TP= (0..7)
150 150 150 150 150 150 150 150 
##$TP07= 0
##$TPNAME0= <>
##$TPNAME1= <>
##$TPNAME2= <>
##$TPNAME3= <>
##$TPNAME4= <>
##$TPNAME5= <>
##$TPNAME6= <>
##$TPNAME7= <>
##$TPOAL= (0..7)
0.5 0.5 0.5 0.5 0.5 0.5 0.5 0.5 
##$TPOFFS= (0..7)
0 0 0 0 0 0 0 0 
##$TUNHIN= 0
##$TUNHOUT= 0
##$TUNXOUT= 0
##$USERA1= <user>
##$USERA2= <user>
##$USERA3= <user>
##$USERA4= <user>
##$USERA5= <user>
##$V9= 5
##$VALIST= <valist>
##$VCLIST= <CCCCCCCCCCCCCCC>
##$VD= 0
##$VDLIST= <DDDDDDDDDDDDDDD>
##$VPLIST= <PPPPPPPPPPPPPPP>
##$VTLIST= <TTTTTTTTTTTTTTT>
##$WBST= 1024
##$WBSW= 4
##$XGAIN= (0..3)
0 0 0 0 
##$XL= 0
##$YL= 0
##$YMAX_a= 518163
##$YMIN_a= -553148
##$ZGOPTNS= <>
##$ZL1= 120
##$ZL2= 120
##$ZL3= 120
##$ZL4= 120
##$ABSF1= 10
##$ABSF2= 0
##$ABSG= 5
##$ABSL= 3
##$ALPHA= 0
##$AQORDER= 0
##$ASSFAC= 0
##$ASSFACI= 0
##$ASSFACX= 0
##$ASSWID= 0
##$AUNMP= <proc_1d>
##$AZFE= 0.1
##$AZFW= 0.1
##$BCFW= 1
##$BC_mod= 2
##$BYTORDP= 1
##$COROFFS= 0
##$CY= 11.3945322036743
##$DATMOD= 1
##$DC= 2
##$DFILT= <>
##$DTYPP= 0
##$F1P= 19.5091578491511
##$F2P= -0.509923556040331
##$FCOR= 0.5
##$FTSIZE= 0
##$FT_mod= 4
##$GAMMA= 1
##$GB= 0.15
##$INTBC= 1
##$INTSCL= 1
##$ISEN= 128
##$LB= 0.24
##$LEV0= 0
##$LPBIN= 0
##$MAXI= 10000
##$MC2= 0
##$MEAN= 0
##$ME_mod= 0
##$MI= 1.114404
##$NCOEF= 0
##$NC_proc= 0
##$NLEV= 6
##$NOISF1= 3.799351
##$NOISF2= 2.8
##$NSP= 1
##$NTH_PI= 0
##$NZP= 0
##$OFFSET= 15.70392
##$PC= 1
##$PHC0= -9610.065
##$PHC1= 13.00088
##$PH_mod= 1
##$PKNL= yes
##$PPARMOD= 0
##$PSCAL= 0
##$PSIGN= 0
##$REVERSE= no
##$SF= 200.130013532006
##$SI= 16384
##$SIGF1= 3
##$SIGF2= 2
##$SINO= 400
##$SIOLD= 16384
##$SREGLST= <1H.CDCl3>
##$SSB= 0
##$STSI= 0
##$STSR= 0
##$SW_p= 3612.71676300578
##$SYMM= 0
##$S_DEV= 0
##$TDeff= 0
##$TDoff= 0
##$TI= <>
##$TILT= no
##$TM1= 0
##$TM2= 0
##$TOPLEV= 0
##$USERP1= <user>
##$USERP2= <user>
##$USERP3= <user>
##$USERP4= <user>
##$USERP5= <user>
##$WDW= 1
##$XDIM= 8192
##$YMAX_p= 0
##$YMIN_p= 0
$$ End of Bruker specific parameters
$$ ---------------------------------
##NTUPLES= NMR FID
##VAR_NAME=  TIME,          FID/REAL,        FID/IMAG
##SYMBOL=    X,             R,               I
##VAR_TYPE=  INDEPENDENT,   DEPENDENT,       DEPENDENT
##VAR_FORM=  AFFN,          ASDF,            ASDF
##VAR_DIM=   8192,          8192,            8192
##UNITS=     SECONDS,       ARBITRARY UNITS, ARBITRARY UNITS
##FACTOR=    0.0002076,     1,               1
##FIRST=     0,             0,               0
##LAST=      1.7004516,     0,               0
##MIN=       0,             -553148,         0
##MAX=       1.7004516,     518163,          0
$$ Real data points
##PAGE= N=1
##DATA TABLE= (X++(R..R)), XYDATA
$$ plain form
0 0 0 0 0 0 0 -8 8 -9 16 -16 17 -25 33 -45 57 -65 81 -97 118 -138 162 -192 225 -262 302 -348 399 -455
28 -455 520 -591 665 -751 846 -948 1062 -1185 1321 -1470 1633 -1815 2010 -2227 2464 -2725
44 -2725 3015 -3338 3698 -4104 4561 -5082 5680 -6379 7205 -8199 9414 -10942 12916 -15539
58 -15539 19118 -23724 34959 -553148 120089 137580 -305031 518163 -189230 -350023 341667
69 341667 -109627 19703 149712 -281902 140678 62479 -112506 87142 -119197 97997
79 97997 129937 -249540 43892 61991 -20104 171887 -142250 -210928 177018 130370 -61761
90 -61761 -24681 -78834 -110918 249760 109130 -318755 95848 63609 -166344 309601 -135752
101 -135752 -263930 380134 -154847 -119494 265175 -270603 121805 178852 -342093 153504
$$ packed form
0@%%%%%qJ6j7K5l2L3m2N8p8J02j22J46j78K15k56L00l54M17m87N64o50P47q54
28d55R75j111J256j416J597j794K010k247K506k791L103l448L825m237M691n189
44b725N740o353P036p802Q665r643J0762j2059J3584j5404J7613k0356K3858k8455
58a5539L4657m2842N8683n88107O73237J7491m42611Q23194p07393j60793O91690
69C41667m51294J29330J30009m31614M22580p8199j74985J99648k06339K17194
79I7997L1940l79477K93432J8099q2095J91991l14137o8678L87946m6648j92131
90f1761L7080n4153l2084L60678j40630m27885M14603l2239k29953M75945m45353
101a35752j28178O44064n34981L5353L84669n35778L92408N7047n20945M95597
$$ plain form
111 153504 39315 -70428 224622 -285330 -25307 224649 -156940 207007 -120351 -288157
121 -288157 389257 -84042 -107992 230832 -339395 90226 294612 -310810 88612 84859
131 84859 -203028 196837 -7078 -173048 138020 27788 -74461 2741 676 2120 50725
142 50725 27342 -130957 -360 124835 -41669 14447 -37076 -84373 124847 7736 -29713
153 -29713 -7374 -93351 135891 -3895 -103313 133110 -137308 26684 182476 -263671 104298
164 104298 135850 -253130 205878 -25625 -216172 297677 -101757 -133357 202406 -170415
174 -170415 51709 143170 -201102 69956 31746 -60537 110377 -101631 -7087 79991 -81939
185 -81939 79037 -31111 -80263 130086 -57001 -38429 79268 -78035 28102 59703 -80826
$$ packed form
111A53504j14189j09743K95050n09952K60023K49956l81589L63947l27358j67806
121b88157O77414m73299k3950L38824n70227M29621K04386o05422L99422l753
131H4859k87887L99865k03915j65970L11068j10232j02249P7202k065J444M8605
142E0725k3383j58299J30597J25195j66504N6116n1523m7297K09220j17111l7449
153b9713K2339q5977K29242j39786r9418K36423k70418J63992J55792m46147L67969
164A04298L1552l88980M59008k31503j90547N13849l99434l1600L35763l72821
174a70415K22124R1461l44272K71058l8210r2283J70914k12008R4544Q7078j61930
185h1939J60976j10148m9152K10349j87087J8572J17697j57303J06137L1601j40529
$$ plain form
196 -80826 -91 52745 -10625 -30976 26197 -11797 -33138 93502 -52042 -79475 130344
207 130344 -60411 -28244 105139 -139751 43784 108185 -136063 62087 399 -71979 131661
218 131661 -73699 -40882 79197 -78879 80274 -7180 -108855 128258 -51040 -30216
228 -30216 104015 -141785 53926 101433 -144890 68762 9435 -83135 131879 -49314 -85432
239 -85432 87724 -20072 7298 21281 -66110 17295 39333 3024 -22509 -29168 26270 10672
251 10672 9781 -8257 -49378 39276 28411 -26180 -2527 -29083 33066 31356 -44283 7764 -22918
264 -22918 19611 63321 -83013 1832 39588 -48142 82298 -31924 -95142 106334 -16380
275 -16380 -24441 56075 -101215 36650 82636 -83212 21855 -7524 -29761 85051 -41315
$$ packed form
196h0826Q0735N2836o3370k0351N7173l7994k1341J26640j45544k7433K09819
207A30344j90755L2167J33383k44890J83535O4401k44248J98150o1688p2378K03640
218A31661k05360L2817J20079j58076J59153q7454j01675K37113j79298K0824
228c0216J34231k45800J95711M7507k46323K13652n9327r2570K15014j81193l6118
239h5432J73156j07796K7370J3983q7391Q3405K2038l6309k5533o659N5438j5598
251A0672q91j8038m1121Q8654j0865n4591K3653k6556O2149j710p5639N2047l0682
264b2918M2529M3710j46334Q4845L7756q7730J30440j14222o3218K01476j22714
275a6380q061Q0516j57290J37865M5986j65848J05067k9379k2237J14812j26366
$$ plain form
286 -41315 -38026 34662 -23948 48360 -4862 -67999 43279 7658 1648 18231 -63711 16518
298 16518 52877 -25967 -6090 -14531 -7347 42365 3374 -35147 -14413 23671 20015 -5748 -12336
311 -12336 -31726 22807 49336 -38809 -18366 7828 -6967 50193 -17542 -53151 33828 2234
323 2234 13850 13333 -62741 20749 36362 -18053 15879 -41695 -7541 66839 -28542 -16644 5298
336 5298 -25833 54399 3449 -57197 21159 2132 11672 27246 -53020 -9756 38998 3549
348 3549 4081 -28858 -20658 40467 16354 -18229 -22093 -6942 30061 17017 -20246 -24400 2459
361 2459 29266 10124 -19816 -24716 5438 38069 451 -30429 -10906 7171 35451 2359
373 2359 -45762 335 20827 15023 9343 -43281 -11705 41792 6909 -5419 -25878 -20493 46582
$$ packed form
286d1315L289P2688n8610P2308n3222o3137J11278l5621o010J6583q1942Q0229
298A6518L6359p8844J9877q441P184M9712l8991l8521K0734L8084l656k5763o588
311a2336j9390N4533K6529q8145K0443K6194j4795N7160o7735l5609Q6979l1594
323B234J1616n17p6074Q3490J5613n4415L3932n7574L4154P4380r5381J1898K1942
336E298l1131Q0232n0950o0646P8356j9027R540J5574q0266M3264M8754l5449
348C549N32l2939Q200O1125k4113l4583l864J5151L7003j3044l7263m154K6859
361B459K6807j9142k9940m900L0154L2631l7618l0880J9523J8077K8280l3092
373B359m8121M6097K0492n804n680n2624L1576N3497l4883j2328k0459N385O7075
$$ plain form
386 46582 16387 -30859 -14762 -6204 33235 22208 -40441 -16453 14754 19707 16554 -32408 -25381
399 -25381 26640 22843 220 -26851 -22624 28207 29524 -13712 -30678 -7513 28697 22356 -17197
412 -17197 -30828 406 32629 12955 -21309 -24390 1951 35070 11172 -32660 -18148 12565
424 12565 29580 7806 -38733 -14471 27581 18849 -1511 -30817 -14624 34465 16348 -14966
436 -14966 -21724 -10535 31956 20204 -26563 -20884 3036 27776 15737 -31384 -19449 16614
448 16614 21966 5660 -27941 -16126 22570 18115 -2959 -23628 -12918 25218 17543 -11777 -22098
461 -22098 -5901 27926 12951 -20969 -16399 2492 25329 8504 -27209 -9107 10714 15380
473 15380 7955 -26312 -11168 21186 10152 -307 -20170 -11940 27283 9371 -13958 -12240 -5080
$$ packed form
386D6582l0195m7246J6097Q558L9439j1027o2649K3988L1207M953l153m8962P027
399b5381N2021l797k2623k7071M227N0831J317m3236j6966K3165L6210o341l9553
412a7197j3631L1234L2223j9674l4264l081K6341L3119k3898m3832J4512L0713
424A2565J7015k1774m6539K4262M2052q732k0360k9306J6193M9089j8117l1314
436a4966o758J1189M2491j1752m6767N679K3920K4740j2039m7121J1935L6063
448A6614N352j6306l3601J1815L8696m455k1074k0669J0710L8136p675k9320j0321
461b2098J6197L3827j4975l3920M570J8891K2837j6825l5713J8102J9821M666
473A5380p425l4267J5144L2354j1034j0459j9863Q230L9223j7912k3329J718P160
$$ plain form
486 -5080 24200 7912 -22724 -4264 3115 13620 9510 -24017 -5167 14208 5248 4536 -18110
499 -18110 -8720 22236 4775 -8655 -11876 -1861 21085 647 -13642 -5859 804 19935 -1747
512 -1747 -18856 3848 174 11566 6663 -25611 4351 13385 -3175 5422 -16997 -45 23043
525 23043 -12259 -5307 -802 -1213 22623 -14166 -16720 13810 -2624 16031 -2329 -33057 17866
538 17866 12893 -3477 7002 -28390 2691 30834 -12209 -5821 -4566 -3013 20600 -8409 -11569
551 -11569 5920 2173 10996 -13096 -13308 17183 4747 5284 -13021 -24952 25930 19307 -9757
564 -9757 -12694 -21455 19837 26955 -12851 -13026 -15834 14001 25453 -18386 -2813 -5264 -4725 31941
578 31941 -21894 -16302 30941 -14111 4984 -778 -32671 40895 15019 -34353 784 -15071
$$ packed form
486e080K9280j6288l0636J8460P379J0505m110l3527J8850J9375q960p12k2646
499a8110R390L0956j7461j3430l221J0015K2946k0438j4289P783O663J9131k1682
512a747j7109K2704l674J1392m903l2274K9962R034j6560Q597k2419J6952K3088
525B3043l5302O952M505m11K3836l6789k554L0530j6434J8655j8360l0728N0923
538A7866m973j6370J0479l5392L1081K8143m3043O388J255J553K3613k9009l160
551a1569J7489l747Q823k4092k12L0491j2436N37j8305j1931N0882o623k9064
564i757k937q761M1292P118l9806j75k808K9835J1452m3839J5573k451N39L6666
578C1941n3835N592M7243m5052J9095n762l1893P3566k5876m9372L5137j5855
$$ plain form
590 -15071 22551 35931 -36064 -16829 -2264 12686 41982 -28225 -28340 11291 -953 33843
602 33843 -7764 -41617 25871 4567 -6513 12213 -22995 11450 19284 -23795 -5867 3925
614 3925 17748 11446 -26290 -13455 85 30416 26111 -46949 -18110 17451 9699 35926 -28225
627 -28225 -43553 30904 8488 9968 2645 -38945 15765 14669 -7809 9306 -22949 15379 16653
640 16653 -36876 15886 2851 -1972 35261 -49874 -17027 49600 -11722 15151 -11196 -52746
652 -52746 42005 25918 -13454 -1117 -36556 12325 34911 -9191 -4325 -23731 6923 28339
664 28339 -22704 7253 1033 -16172 29231 -20063 -15556 34185 -10881 -102 -3524 -24713 28149
677 28149 15039 -9491 -15602 -20883 32669 12227 -13478 2887 -35083 20650 37560 -38030
$$ packed form
590a5071L7622J3380p1995J9235J4565J4950K9296p0207j15L9631j2244L4796
602C3843m1607l3853O7488k1304j1080J8726l5208L4445P834m3079J7928R792
614C925J3823o302l7736J2835J3540L0331m305p3060K8839L5561p752K6227o4151
627b8225j5328P4457k2416J480p323m1590N4710j096k2478J7115l2255L8328J274
640A6653n3529N2762j3035m823L7233q5135L2847O6627o1322K6873k6347m1550
652e2746R4751j6087l9372J2337l5439M8881K2586m4102M866j9406L0654K1416
664B8339n1043K9957o220j7205M5403m9294M507M9741m5066J0779l422k1189N2862
677B8149j3110k4530o111n281N3552k0442k5705J6365l7970N5733J6910p5590
$$ plain form
689 -38030 10791 -2737 -25168 47242 -14734 -25177 29958 -19097 7190 8879 -25428 24775
701 24775 -1403 -10675 7405 -22688 27582 9198 -31058 20741 -19421 -42 43788 -38162
713 -38162 -5388 19051 -23297 30554 -1344 -31827 21037 -2755 2075 5839 -16431 12638
725 12638 -6309 1494 12078 -26065 19881 5774 -26602 27830 -15378 -9750 35733 -30470
737 -30470 -1563 20300 -21083 18655 -4146 -15816 18160 -11876 9847 1415 -19708 24475
749 24475 -15005 -2541 26536 -37147 15566 19590 -37029 28988 -3397 -25000 34999 -18777
761 -18777 -6820 22624 -22556 10129 3989 -10902 13752 -15287 8798 7467 -21111 22711
773 22711 -10826 -11740 29599 -25696 3120 20188 -29945 19024 6129 -22427 18528 -7706
$$ packed form
689c8030M8821j3528k2431P2410o1976j0443N5135m9055K6287J689l4307N0203
701B4775k6178r272J8080l0093N0270j8384m0256N1799m0162J9379M3830q1950
713c8162L2774K4439m2348N3851l1898l0483N2864k3792M830L764k2270K9069
725A2638j8947P803J0584l8143M5946j4107l2376N4432m3208N628M5483o6203
737c0470K8907K1863m1383L9738k2801j1670L3976l0036K1723q432k1123M4183
749B4475l9480J2464K9077o3683N2713M024n6619O6017l2385k1603N9999n3776
761a8777J1957K9444m5180L2685o140j4891K4654k9039K4085j331k8578M3822
773B2711l3537r14M1339n5295K8816J7068n0133M8969j2895k8556M0955k6234
$$ plain form
785 -7706 -898 10211 -15238 11333 -4899 -2715 15332 -23062 13398 8537 -26573 27938 -9397
798 -9397 -18689 34393 -22539 -4599 21928 -24986 17270 4972 -23940 17882 -5912 2584 9774
811 9774 -22266 14174 -2062 -7136 24950 -26116 -939 21314 -24385 19964 2080 -27796
823 -27796 26659 -7301 -10952 21113 -14930 2398 4110 -12068 13992 -3775 1203 2351 -18777
836 -18777 16635 1817 -6747 16753 -26213 -701 25619 -15531 9593 -3546 -21000 21949
848 21949 -953 -2337 8061 -19193 7358 3275 -3002 16382 -19137 -280 10818 -19244 23067
861 23067 3036 -23362 16629 -14922 407 30265 -21932 -3467 4060 -14688 23524 2262
873 2262 -12566 2799 -15457 12762 13480 -11150 5726 -15325 -2987 21493 -9754 6491 296
$$ packed form
785g706O808J1109k5449K6571j6232K184J8047l8394L6460m861l5110N4511l7335
798i397r292N3082n6932J7940K6527m6914M2256j2298k8912M1822k3794Q496P190
811I774l2040L6440j6236n074L2086n1066K5177K2253m5699M4349j7884k9876
823b7796N4455l3960l651L2065l6043J7328J712j6178K6060j7767M978J148k1128
836a8777L5412j4818q564K3500m2966K5512K6320m1150K5124j3139j7454M2949
848B1949k2902j384J0398k7254K6551m083o277J9384l5519J8857J1098l0062M2311
861B3067k0031k6398L9991l1551J5329K9858n2197J8465P527j8748L8212k1262
873B262j4828J5365j8256K8219P18k4630J6876k1051J2338K4480l1247J6245o195
$$ plain form
886 296 -23535 14540 6743 -2177 10147 -18345 -5044 10375 1096 11618 -8524 -11670 2310
899 2310 -1707 18458 311 -17982 5388 -8363 6305 19625 -15800 -1229 -2282 -11849 22844
912 22844 2559 -10563 1843 -15322 8992 14424 -6761 4620 -15009 -6822 20120 -2670
924 -2670 4183 -3367 -20432 14858 5702 -4063 11602 -16176 -6217 12002 -3224 10288 -1420
937 -1420 -15381 4318 -42 6557 8713 -10986 -4204 -3966 3662 16257 -6261 -8141 -2641 -4064
951 -4064 14655 3275 -8646 -232 -8164 5122 10781 -5042 68 -6022 -3029 9590 -3017
964 -3017 3502 1403 -12026 4533 1231 1602 10413 -13055 -5364 7397 -2850 10673 -860 -14318
978 -14318 4611 265 4746 7793 -13250 -1963 5176 -1066 6811 -4585 -4518 4977 -4407 3016
$$ packed form
886B96k3831L8075p797q920J2324k8492J3301J5419r279J0522k0142l146J3980
899B310m017K0165j8147j8293K3370j3751J4668J3320l5425J4571j053r567L4693
912B2844k0285j3122J2406j7165K4314N432k1185J1381j9629Q187K6942k2790
924b670O853p550j7065L5290r156r765J5665k7778R959J8219j5226J3512j1708
937a420j3961J9699m360O599K156j9699O782K38P628J2595k2518j880N500j423
951d064J8719j1380j1921Q414p932J3286N659j5823N110o090K993J2619j2607
964c017O519k099j3429J6559l302L71Q811k3468P691J2761j0247J3523j1533j3458
978a4318J8929m346M481L047k1043J1287P139o242P877j1396O7R495r384P423
$$ plain form
992 3016 3367 -4820 3209 -2855 -2656 5270 -1322 2477 -874 -7261 3386 3548 2210 -1016 -8184 2731
1008 2731 4366 -23 1888 -6790 -333 5467 -2438 3397 -2754 -5320 7990 -1874 -2625 3463 -4865
1023 -4865 4606 1469 -8081 5817 808 -2752 3981 -6144 1237 5521 -4557 2472 -1975 -4005
1037 -4005 7687 -1239 -3296 1075 -2990 5089 1569 -6372 1789 1084 421 1793 -3717 -215 1848
1052 1848 458 1117 -2519 -888 1368 1307 1089 -4302 475 3737 -2448 958 -1386 -1386 5392 -3640 -1533
1069 -1533 3688 -4086 3761 1334 -6334 4267 -829 -545 5302 -7789 338 6413 -4759 2833
1083 2833 -1410 -4620 7767 -2606 -2881 4803 -5304 1813 4182 -5440 2083 378 -2059 4252
1097 4252 -3019 -2230 4276 -767 -1201 -4 -814 1585 1076 -1573 -1083 1487 -403 158 2214 -3722
$$ packed form
992C016L51q187Q029o064J99P926o592L799l351o387J0647J62j338l226p168J0915
1008B731J635m389J911q678O457N800p905N835o151k566J3310r864p51O088q328
1023d865R471l137r550J3898n009l560O733j0125P381M284j0078P029m447k030
1037d005J1692q926k057M371m065Q079l520p941Q161p05o63J372n510L502K063
1052A848j390O59l636J631K256o1k18n391M777L262o185L406k344%O778r032K107
1069a533N221p774P847k427p668J0601n096K84N847j3091Q127O075j1172P592
1083B833m243l210J2387j0373k75P684j0107P117K369r622P523j705k437O311
1097D252p271P89O506n043m34J197q10K399n09k649M90K570j890N61K056n936
$$ plain form
1113 -3722 -257 4135 -2893 1219 -172 -3918 6461 -1733 -4775 6377 -4084 36 5297 -7603
1127 -7603 3760 2485 -6734 7487 -2794 -5377 8918 -4651 -935 4587 -7426 5471 2339
1140 2339 -7928 6045 -920 -3458 6077 -4322 -797 4300 -4192 2189 1703 -4802 2553 2192 -2740
1155 -2740 453 500 -1373 2268 81 -3781 3645 651 -4357 5055 -2011 -3711 7173 -4738 -569
1170 -569 5620 -8824 5597 4050 -10815 8475 -1012 -6423 10960 -8345 -1192 10155 -11863
1183 -11863 5378 5205 -12017 9879 -1106 -7488 10806 -7697 -819 9646 -10832 3106 5292
1196 5292 -7921 6255 -1056 -5463 7129 -2774 -2179 4958 -3767 -1260 4257 -1430 -1843 2489 -1919
1211 -1919 -729 4791 -5041 -480 6766 -7988 2631 5400 -9960 7969 12 -9180 12789 -7410
$$ packed form
1113c722L465M392p028M112j391l746J0379q194l042J1152j0461M120N261j2900
1127g603J1363j275r219J4221j0281k583J4295j3569L716N522j2013J2897l132
1140B339j0267J3973o965k538R535j0399L525N097q492O381m86o505P355l61m932
1155b740L193M7j873L641k187l862P426k994n008R412p066j700J0884j1911M169
1170e69O189j4444J4421j547j4865J9290r487n411J7383j9305P153J1347k2018
1183a1863J7241j73j7222K1896j0985o382J8294j8503O878J0465k0478J3938K186
1196E292j3213J4176p311m407J2592r903N95P137q725K507N517n687m13M332m408
1211a919J190N520r832M561P246j4754J0619K769j5360J7929p957r192K1969k0199
$$ plain form
1225 -7410 -4114 14138 -14151 3056 9592 -15286 12268 -598 -13594 18156 -9034 -5957 16392
1238 16392 -15707 3991 10028 -16285 11888 156 -12411 15634 -6728 -5937 12001 -9662
1250 -9662 2221 6054 -9788 5948 1633 -6376 5428 -658 -3327 3009 119 -2266 1734 678
1264 678 -3677 4481 -393 -6602 9186 -3179 -6117 11376 -9646 699 11273 -16221 8913
1277 8913 5227 -17254 18174 -4403 -13022 20046 -14530 41 16874 -22598 11101 7574 -20170
1290 -20170 19516 -5392 -11735 20036 -15672 1126 14537 -19538 10822 4442 -15762 15167
1302 15167 -4521 -6843 13050 -11202 492 9578 -9376 2861 2749 -5518 3409 1656 -2782
1315 -2782 -229 2290 -2871 543 5757 -8521 2047 7236 -11122 7803 1158 -11476 14960
$$ packed form
1225g410L296J8252k8289J7207O536k4878K7554j2866j2996L1750k7190L077K2349
1238A6392l2099J9698O037k6313K8173j1732j2567K8045k2362P91J7938k1663
1250i662J1883L833j5842J5736m315q009J1804o086k669O336k890k385M000j056
1264F78m355Q158m874o209J5788j2365k938J7493k1022J0345J0574k7494K5134
1277H913l686k2481L5428k2577q619L3068l4576J4571J6833l9472L3699l527k7744
1290b0170L9686k4908o343L1771l5708J6798J3411l4075L0360o380k0204L0929
1302A5167j9688k322J9893k4252J1694R086j8954J2237j12q267Q927j753m438
1315b782K553K519n161L414N214j4278J0568N189j8358J8925o645j2634K6436
$$ plain form
1328 14960 -7546 -6355 17122 -16648 3984 12320 -20549 15328 221 -16799 22932 -13376
1340 -13376 -6204 22865 -22840 6020 12778 -22503 19396 -1789 -18315 22583 -11490 -4217
1352 -4217 18184 -19214 4592 8655 -13289 13161 -3339 -10335 11573 -5127 168 5975 -7208
1365 -7208 1665 477 -1212 3855 -300 -1774 -3842 3236 1532 -2301 7229 -8517 -3777 10540
1379 10540 -8520 8498 2973 -20085 14850 167 -8890 20195 -17918 -5087 18260 -18075
1391 -18075 14407 6449 -26180 18470 -3771 -8681 24610 -19346 -3230 13215 -19569 19104
1403 19104 5930 -21830 13425 -9472 -1805 22912 -15833 -2022 4088 -13915 16994 5462
1415 5462 -11833 2662 -8136 2442 12163 -2660 -2628 -5661 -2503 4423 5682 5229 -10520 -4801
$$ packed form
1328A4960k2506J191K3477l3770K0632Q336l2869L5877j5107j7020L9731l6308
1340a3376P172K9069m5705K8860O758l5281M1899k1185j6526M0898l4073P273
1352d217K2401l7398K3806M063k1944K6450j6500o996K1908j6700N295N807j3183
1365g208Q873j188j689N067m155j474k068P078j704l833R530j5746M740J4317
1379A0540j9060J7018n525k3058L4935j4683r057K9085l8113J2831K3347l6335
1391a8075L2482p958l2629M4650k2241m910L3291m3956J6116J6445l2784L8673
1403A9104j3174k7760L5255k2897P667K4717l8745J3811O110j8003L0909j1532
1415E462j7295J4495j0798J0578R721j4823L2l033L158O926J259m53j5749N719
$$ plain form
1429 -4801 3031 -1404 14455 -2746 -13871 5764 -8494 8999 17077 -19389 343 -1798 -8711
1442 -8711 26912 -6791 -13143 10589 -19996 12696 19520 -20982 8800 -8339 -14296 29884 -6715
1455 -6715 -6181 9904 -25382 10244 17127 -11115 10768 -14017 -14013 21733 -363 2786 928 -20943
1469 -20943 5848 9633 2387 6986 -14368 -8426 7157 5501 8332 -4922 -9163 -3230 1002 12966
1483 12966 1484 -5256 -4820 -11291 12572 10128 -6521 4099 -15518 -4589 20689 -4464 4576
1496 4576 -2897 -23169 17209 7827 -5490 12134 -21110 -4468 18560 -8581 12514 -1890
1508 -1890 -23201 14508 11 476 15672 -20104 -3042 8400 -7745 17718 -1183 -17381
1520 -17381 5637 -4378 7590 12485 -13606 -3276 -1532 -680 13718 -1553 -6325 -4190 -3836
$$ packed form
1429d801P832m435J5859j7201j1125J9635j4258J7493Q078l6466J9732k141o913
1442h711L5623l3703o352K3732l0585L2692O824m0502K9782j7139n957M4180l6599
1455f715N34J6085l5286L5626O883k8242K1883k4785ML5746k2096L149j858k1871
1469b0943K6791L785p246M599k1354N942J5583j656K831j3254m241N933M232J1964
1483A2966j1482o740M36o471K3863k444j6649J0620j9617J0929K5278k5153R040
1496D576p473k0272M0378r382j3317J7624l3244J6642K3028k7141K1095j4404
1508a890k1311L7709j4497M65J5196l5776J7062J1442j6145K5463j8901j6198
1520a7381K3018j0015J1968M895k6091J0330J744Q52J4398j5271m772K135L54
$$ plain form
1533 -3836 10327 3297 -2086 -2626 -8670 5514 3981 615 5391 -11930 -2238 7160 -2852 10160
1547 10160 -4368 -11855 8529 -4681 5389 10162 -16459 1953 2405 -5141 16077 -7804 -8924
1560 -8924 9716 -9607 7317 8040 -13728 6483 -3091 -5016 14334 -7665 -2030 5407 -10345
1573 -10345 7622 3286 -5932 6251 -7810 -1132 8942 -4797 2765 -1907 -5558 7045 -1783
1586 -1783 827 1980 -7040 3984 779 -1020 3913 -6542 2400 2829 -5215 5835 -2890 -2429 5739
1601 5739 -6700 3955 2838 -7922 6966 -2530 -3326 8022 -7255 1923 3934 -8279 8132
1614 8132 -965 -6475 7629 -5448 1677 5348 -9512 5294 977 -5177 8144 -5224 -2070
1627 -2070 5367 -5927 5376 723 -6920 5997 -2696 -426 5061 -6001 2756 218 -4466 6675
$$ packed form
1533c836J4163p030n383n40o044J4184j533l366M776j7321R692R398j0012J3012
1547A0160j4528p487K0384j3210J0070M773k6621J8412M52p546K1218k3881j120
1560h924J8640j9323J6924P23k1768K0211r574j925J9350k1999N635P437j5752
1573a0345J7967m336r218J2183j4061O678J0074j3739P562m672l651J2603q828
1586a783K610J153r020J1024l205j799M933j0455Q942M29q044J1050q725M61Q168
1601E739j2439J0655j117j0760J4888r496p96J1348j5277R178K011j2213J6411
1614H132r097n510J4104j3077P125L671j4860J4806m317o154J3321j3368L154
1627b070P437j1294J1303m653p643J2917q693K270N487j1062Q757k538m684J1141
$$ plain form
1641 6675 -2374 -1571 2780 -5193 4263 1101 -3513 4459 -4845 -432 5007 -3579 3304 -2247 -4143
1656 -4143 6631 -2933 421 3010 -6627 3847 330 -2590 6436 -5811 -1026 4844 -5154 4817
1670 4817 17 -5236 5570 -4521 517 6430 -6917 2285 664 -4293 7272 -3404 -2153 4836
1684 4836 -6348 3383 3111 -5217 4175 -3070 -1467 6024 -4748 1345 1838 -4735 4183 -938 -1079
1699 -1079 3467 -4855 1703 2182 -3098 3255 -2181 -779 2793 -3538 2900 263 -3473 3629 -2370
1714 -2370 704 2517 -4880 3827 -237 -3584 5224 -3520 -79 3473 -5594 4560 248 -5221 6143
1729 6143 -3254 -1240 4940 -5861 3162 1462 -5421 6167 -2293 -2964 5109 -4388 2072 2132 -5440
1744 -5440 4554 -986 -2633 4634 -3327 486 1609 -3235 3703 -1165 -1897 2958 -2593 1211 718
$$ packed form
1641F675r049Q03M351p973R456l162m614P972r304M413N439q586O883n551j896
1656d143J0774r564L354K589r637J0474l517k920R026j2247M785N870r998R971
1670D817m800n253J0806j0091N038N913j3347R202j621m957J1565j0676J251O989
1684D836j1184R731k72q328R392p245J603P491j0772O093M93o573Q918n121j41
1699a079M546q322O558M79n280O353n436J402L572o331O438k637l736P102n999
1714b370L074J813p397Q707m064l347Q808q744L441L552r067J0154m312n469J1364
1729F143r397K014O180j0801R023j700o883J1588q460o71Q073r497O460O0p572
1744e440R994n540j647P267p961L813J123m844O938m868p32M855n551L804m93
$$ plain form
1759 718 -1961 3017 -2879 -197 3052 -3049 2438 -1053 -2478 4346 -3386 717 3219 -5543 3216
1774 3216 453 -2866 5039 -4534 -414 4772 -5490 3251 1216 -4789 4815 -2701 -907 5030 -5432
1789 -5432 1733 2124 -4269 4188 -1514 -1535 3517 -4164 1931 2130 -3514 2707 -1703 -311 2718 -3476
1805 -3476 2409 96 -2934 3635 -2258 530 1930 -4413 3914 -436 -3184 4888 -3605 274 3083
1820 3083 -5276 4610 -151 -4676 5958 -3461 -847 4540 -5427 3352 741 -5051 5885 -2329
1834 -2329 -2083 4483 -4344 2043 1495 -4105 4210 -1815 -1705 3567 -2884 1482 31 -2207 3602 -2434
1850 -2434 -50 1989 -3028 2947 -1392 -1293 4012 -4639 1953 2306 -4992 4739 -2068 -2206 6090 -6425
1866 -6425 1792 4223 -7240 5620 -704 -4734 7621 -5832 -49 6208 -8178 4518 1974
$$ packed form
1759G18k679M978n896K682L249o101N487l491j425O824p732M103K502q762Q759
1774C216k763l319P905r573M120N186j0262Q741k035o005R604p516J794N937j0462
1789e432P165L91o393Q457n702k1N052p681O095J99n644O221m410J392L029o194
1805c476N885k313l030O569n893K788J400o343Q327m350k748Q072q493L879K809
1820C083q359R886m761m525J0634r419K614N387r967Q779k611n792J0936q214
1834b329K46O566q827O387n48n600Q315o025J10N272o451M366j451k238N809o036
1850b434K384K039n017N975m339R9N305q651O592L53p298R731o807j38Q296j2515
1866f425Q217K431j1463J2860o324m030J2355j3453N783O257j4386J2696k544
$$ plain form
1879 1974 -6459 6780 -3527 -1863 6609 -6813 2115 3327 -5746 4679 -1473 -2416 4677 -4061
1893 -4061 1234 2087 -3724 2865 -923 -225 1595 -3214 2956 -461 -1738 2906 -3561 2534 922
1908 922 -4461 5557 -3177 -1736 6164 -6567 2801 2333 -7039 8317 -3145 -5074 9125 -7217
1922 -7217 1699 5544 -9949 7468 9 -7143 10284 -6428 -2209 8458 -8676 4480 2357
1935 2357 -8469 8726 -2964 -4160 7869 -6216 1467 3262 -6445 5596 -731 -3256 4653
1948 4653 -4204 908 2391 -2495 2828 -3336 -271 3505 -2696 2637 -2525 -1635 5073 -4617 2954
1963 2954 1541 -6850 6780 -2339 -2466 7658 -8639 2848 4768 -9886 8867 -867 -6673 9432
1977 9432 -8986 1328 9747 -11406 5787 514 -9305 12800 -4202 -4067 7559 -11110 5657
$$ packed form
1879A974q433J3239j0307J664Q472j3422Q928J212r073J0425o152r43P093q738
1893d061N295Q53n811O589l788O98J820m809O170l417j277M644o467O095j612
1908I22n383J0018q734J441P900j2731R368m68r372J5356j1462j929J4199j6342
1922g217Q916L845j5493J7417p459p152J7427j6712M219J0667j7134J3156k123
1935B357j0826J7195j1690j196J2029j4085P683J795r707J2041o327k525P909
1948D653q857N112J483m886N323o164L065L776o201N333n162Q90O708r690P571
1963B954j413q391J3630r119j27J0124j6297J1487J920j4654J8753r734n806J6105
1977I432j8418J0314Q419k1153J7193n273r819K2105j7002J35J1626j8669J6767
$$ plain form
1990 5657 6825 -10067 6277 -3263 -4298 9915 -5982 573 3547 -7867 5343 775 -2677
2003 -2677 4583 -5095 366 1777 -2380 5422 -2397 -2622 687 -2846 7273 -683 -4952 3045 -5720
2018 -5720 5089 5320 -8174 4547 -4346 -3039 12408 -7715 -465 4648 -10842 9817 842
2031 842 -8241 11454 -9168 -2923 11414 -9900 6800 2479 -13629 10537 -2050 -2778 11945
2044 11945 -12698 -1302 7413 -6316 9871 -2910 -10424 8390 -2864 2209 5555 -9552 1911
2057 1911 927 -1478 6753 -4420 -1640 1353 -3053 4782 -839 57 1289 -6897 4126 1691 -828
2072 -828 5123 -9302 209 6205 -5117 8400 -3818 -9614 10275 -4373 2661 6882 -15020
2085 -15020 6411 4096 -8260 12209 -7211 -5557 11271 -10633 5390 6600 -13054 8995
$$ packed form
1990E657J168j6892J6344r540j035J4213j5897O555K974j1414J3210m568l452
2003b677P260r678N461J411m157P802p819k25L309l533J0119p956m269P997q765
2018e720J0809K31j3494J2721q893J307J5447k0123P250N113j5490K0659q975
2031H42r083J9695k0622O245J4337k1314J6700m321j6108K4166j2587p28J4723
2044A1945k4643J1396Q715j3729J6187j2781p514J8814j1254N073L346j5107J1463
2057A911r84k405Q231j1173K780K993m406P835n621Q96J232q186J1023k435k519
2072h28N951j4425R511N996j1322J3517j2218n796J9889j4648P034M221k1902
2085a5020K1431k315j2356K0469j9420J654J6828k1904J6023J210j9654K2049
$$ plain form
2097 8995 -2216 -6973 13042 -7241 -873 5761 -11570 8176 4497 -7966 5809 -5876 -1072
2110 -1072 9048 -5426 1252 -377 -5148 6415 -310 -937 447 -4276 3972 -256 -857 2710 -4682
2125 -4682 2994 -379 -3352 7086 -4813 -794 4607 -7772 6457 1360 -7152 8314 -6790
2138 -6790 -1313 10669 -10084 3428 2879 -9916 11794 -3238 -6709 10982 -9568 1771 8261
2151 8261 -11499 7074 338 -7890 11079 -6208 -2715 8632 -8454 3718 2564 -7179 7388
2164 7388 -2902 -3060 6376 -5520 1756 2491 -4502 4163 -2198 -1017 3752 -3707 1822 -130 -1555
2179 -1555 3413 -3813 1793 1376 -4349 5182 -2521 -1663 5070 -6386 3998 2629 -7965 7097
2193 7097 -2206 -3522 8217 -8053 1556 5624 -8811 7285 -727 -7205 9545 -5182 -671
$$ packed form
2097H995j1211m757K0015k0283O368O634j7331J9746l679j2463J3775j1685M804
2110a072J0120j4474O678j629m771J1563o725o27J384m723Q248m228o01L567p392
2125d682P676l373k973J0438j1899M019N401j2379J4229n097q512J5466j5104
2138f790N477J1982k0753J3512n49j2795K1710j5032l471J7691k0550J1339O490
2151H261j9760J8573o736q228J8969j7287L493J1347j7086J2172j154r743J4567
2164G388j0290j58R436j1896P276P35o993Q665o361J181M769p459N529j952j425
2179a555M968p226N606m17n725R531p703Q58O733j1456J0384j369j0594J5062
2193G097r303j316J1739j6270R609M068j4435J6096q012o478J6750j4727M511
$$ plain form
2206 -671 6258 -9800 5958 3151 -8297 7375 -3662 -2377 8275 -7416 1556 3299 -6380
2219 -6380 6495 -1202 -4491 5110 -3495 1690 1888 -5129 4220 -381 -1881 2223 -3589 3317 1218
2234 1218 -3782 2609 -3032 1543 4385 -5165 1131 -1422 -878 7610 -5180 -2439 2728 -3739 6843
2249 6843 -955 -6639 5846 -3905 1089 5864 -8259 3495 1748 -5877 6926 -3670 -1595 7438
2263 7438 -8166 384 4129 -3541 6849 -4210 -6722 6751 -1257 3151 1440 -9653 3173
2276 3173 2981 434 4096 -7921 -1638 5532 -1087 3038 -2743 -3470 4211 -2088 1284 1894 -3013
2291 -3013 2541 -2907 -1561 4568 -1125 2682 -2521 -6865 5749 2647 1190 -139 -10108 3163
2305 3163 6928 -1285 2303 -7448 -3291 8622 -922 1636 -1405 -7569 6457 1212 -2368 4244
$$ packed form
2206f71O929j6058J5758k807j1448J5672j1037J285J0652j5691Q972J743r679
2219f380J2875p697l289R601q605N185J98p017R349m601j500M104n812O906k099
2234A218n000O391n641M575K842r550O296k553N44Q488j2790K741N167o467J0582
2249F843p798n684J2485r751M994M775j4123J1754j747p625J2803j0596K075R033
2263G438j5604Q550L745p670J0390j1059k512J3473q008M408j711j1093J2826
2276C173j92k547L662j2017O283P170o619M125n781p27P681o299L372O10m907
2291c013N554n448J346O129n693L807n203m344J2614l102j457j329r969J3271
2305C163L765q213L588r751M157J1913r544K558l041o164J4026n245l580O612
$$ plain form
2319 4244 -5111 681 2371 -5382 6003 1734 -4550 1267 -5074 2771 7654 -3926 -1582 -3942
2333 -3942 -1566 9618 422 -4143 -3199 -3387 7638 3228 -4312 -1015 -3792 2841 4455 -3097 1122
2348 1122 -2116 -1909 4056 -2423 1466 2557 -4304 776 -1855 612 7232 -3855 -3657 -469 -1030
2363 -1030 8033 -21 -6487 250 -2212 4831 5191 -6586 -1293 -516 602 6229 -3700 -2612 2171
2378 2171 -2495 2832 489 -2132 3092 -3007 -1060 2454 -1261 3293 -948 -4273 1627 -242 3321
2393 3321 1768 -6294 169 1439 1513 3477 -4975 -1554 2405 -1124 3811 -1355 -3770 2949 -1663
2408 -1663 1394 2126 -4516 2581 282 -3012 3646 -1537 -5 2146 -4493 2000 2056 -2352 2516 -2238
2424 -2238 -1462 3198 -1394 1253 -105 -3122 2510 330 -345 910 -2327 1234 605 -969 1858 -1465
$$ packed form
2319D244r355N792J690p753J1385m269o284N817o341P845M883j1580K344k360
2333c942K376J1184r196m565R44j88J1025m410p540L297k777O633J614p552M219
2348A122l238K07N965o479L889J091o861N080k631K467O620j1087J98L188n61
2363a030R063q054o466O737k462P043L60j1777N293P77J118N627r929J088M783
2378B171m666N327k343k621N224o099J947L514l715M554m241l325N900j869L563
2393C321j553q062O463J270P4J964q452L421L959l529M935n166k415O719m612
2408a663L057P32o642P097k299l294O658n183J532K151o639O493N6m408M868m754
2424b238P76M660m592K647j358l017N632k180o75J255l237L561o29j574K827l323
$$ plain form
2440 -1465 -495 843 -963 2040 -1241 -1319 2271 -1596 1175 543 -2717 2712 -926 -884 2847 -3705
2456 -3705 879 2672 -3040 2277 -1444 -1909 4869 -2986 -996 2629 -3073 2880 215 -3798 3513
2471 3513 -1049 -589 2767 -4199 1006 2949 -2026 1046 -2097 -933 4480 -1166 -1783 -273 -614 3044
2487 3044 191 -2213 -499 -112 2387 407 -2002 -716 67 2889 -276 -3232 1262 436 1198 394
2503 394 -4357 2227 2295 -1890 1536 -3426 -375 5644 -2724 -905 -369 -2739 6474 -205 -5618 2193
2519 2193 -934 2547 2697 -6750 1154 2813 -1249 2933 -3857 -2210 5202 -830 -391 -1067 -2791 4923
2535 4923 1236 -3834 -612 -99 3071 1408 -3948 -1270 1512 2707 484 -3255 -1189 995 3360
2550 3360 674 -4904 -18 2235 1450 1356 -5502 -488 5356 -1346 228 -2076 -2939 6506 -345 -3481
$$ packed form
2440a465R70J338j806L003l281p8L590l867K771o32l260N429l638M2L731o552
2456c705M584J793n712N317l721m65O778p855J990L625n702N953k665m013P311
2471C513m562M60L356o966N205J943m975L072l143J164N413n646o17J510l41L658
2487C044k853k404J714L87K499j980k409J286P83K822l165k956M494q26P62q04
2503C94m751O584O8m185L426m962L051O019q368J819N36k370R213o679n413P811
2519B193l127L481J50r447P904J659m062M182o790J647P412o032M39o76j724P714
2535D923l687n070L222N13L170j663n356K678K782J195k223l739K066K184K365
2550C360k686n578M886K253p85r4o858N014N844o702J574k304q63R445o851l136
$$ plain form
2566 -3481 1261 -3194 4287 3566 -7312 902 1430 231 4540 -6160 -2454 6154 -1349 1079 -1569
2581 -1569 -4701 5770 1541 -2905 176 -3140 2921 4242 -4088 -1889 266 2162 2864 -3421 -2671
2596 -2671 1517 2634 1187 -3278 -1474 1197 2130 1949 -4276 -1671 3356 517 1791 -3427 -3739 6175
2612 6175 337 -1892 295 -4382 4817 3328 -5872 1699 -1378 -157 6668 -5887 -2447 4301 -2148
2627 -2148 4291 -1686 -6720 6434 965 -2111 1632 -5265 2740 4869 -4362 202 -1123 -528 5239
2642 5239 -2312 -3085 948 508 3140 -1202 -3763 1275 2035 1321 -1859 -2323 1364 1314 1542 -2051 -2792
2659 -2792 2984 268 834 -104 -5159 4075 2933 -3901 1983 -3072 59 6704 -5652 -875 3070
2674 3070 -3950 5409 -607 -6218 5301 -1311 -18 3522 -7076 2528 4155 -4195 2743 -2739
$$ packed form
2566c481M742m455P481p21j0878Q214N28j199M309j0700L706Q608p503K428k648
2581a569l132J0471m229m446L081l316O061J321q330K199K155J896P02o285P50
2596b671M188J117j447m465J804K671R33j81o225K605N027k839J274n218l12R914
2612F175n838k229K187m677R199j489r200P571l077J221O825j2555L440O748o449
2627b148O439n977n034J3154n469l076L743o897Q005K129r231M564j325N95N767
2642E239p551p73M033m40K632m342k561N038P60p14l180m64L687n0K28l593p41
2659b792N776k716N66r38n055R234j142o834N884n055L131O645j2356M777L945
2674C070p020R359o016n611J1519o612J293L540j0598R604J627q350O938n482
$$ plain form
2688 -2739 -1577 6528 -3887 -1101 2358 -3490 3922 618 -4410 2478 -322 184 1926 -3207 -83
2703 -83 2103 335 -647 -1593 1242 369 252 605 -2921 1864 1462 -2426 2500 -2100 -1391 4527 -2997
2720 -2997 -41 1476 -3402 4358 -1132 -3413 4723 -3382 568 3534 -5840 3896 787 -5093 6216
2735 6216 -2991 -2746 6287 -5157 864 3666 -5544 3743 312 -3917 4770 -1949 -1474 2592 -2458
2750 -2458 2041 -110 -2453 2609 -1351 265 1163 -2548 2128 29 -1338 1632 -1852 821 1412
2765 1412 -1323 226 -1777 2188 1849 -3580 1340 -1366 60 5377 -5229 -974 3537 -4164 4913
2780 4913 342 -6984 5199 -490 -1218 4177 -6034 1478 4184 -4634 2426 -1312 -883 5258 -5246
2795 -5246 -527 3168 -2706 5066 -2338 -6245 5485 332 939 1322 -7747 2035 5739 -992 -538
$$ packed form
2688b739J162Q105j0415K786L459n848P412l304n028O888k800N06J742n133L124
2703h3K186j768r82r46K835q73j17L53l526M785m02l888M926m600P09N918p524
2720b997K956J517m878P760n490k281Q136q105L950K966r374R736l109n880J1309
2735F216r207K45R033j1444O021K802r210R287l431m229Q687o719M75M066n050
2750b458M499k151k343N062l960J616Q98l711M676k099j367K970l484K673N91
2765A412k735J549k003L965l39n429M920k706J426N317j0606M255M511p701R077
2780D913m571p326J2183n689p28N395j0211P512K706q818P060l738M29O141j0504
2795e246M719L695n874P772p404l907J1730n153O07L83r069R782L704o731M54
$$ plain form
2810 -538 -3922 -216 4312 391 -407 -3444 288 3600 -2208 981 -607 -1831 5029 -3437 -3324 4914
2826 4914 -378 1791 -2152 -6320 5710 3427 -499 -1475 -7617 4119 6454 -2081 558 -7271 -952
2841 -952 10667 -3128 -1883 -28 -5410 7404 1282 -6227 4342 -1498 -953 2471 -4505 3192
2855 3192 3381 -3007 -1290 -4132 3728 6972 -3705 -3511 -4315 1759 10564 -2339 -6523 -1695 -493
2870 -493 7785 1981 -6424 -1804 -516 4367 2378 -4172 510 -1052 662 2250 -4758 4057 3362
2885 3362 -6358 741 -1613 1584 9000 -6464 -6095 2016 593 8514 -634 -10091 88 1991 6414
2900 6414 2675 -9507 -617 2116 1531 5090 -5833 -2045 4204 -3690 2668 1180 -3161 4353 -2844
2915 -2844 -3899 3619 1357 3211 -2552 -6885 2117 3993 4425 -1864 -8874 1734 3973 2611 2482
$$ packed form
2810e38l384L706M528l921p98l037L732L312n808L189j588j224O860q466J13Q238
2826D914n292K169l943m168J2030k283l926r76o142J1736K335q535K639p829O319
2841i52J1619j3795J245J855n382J2814o122p509J0569n840N45L424o976P697
2855C192J89o388J717k842P860L244j0677J94q04O074Q805j2903m184M828J202
2870d93Q278n804q405M620J288M883j989o550M682j562J714J588p008Q815o95
2885C362r720P099k354L197P416j5464L69Q111j423P921r148r457J0179J903M423
2900F414l739j2182Q890K733n85L559j0923L788O249p894O358j488m341P514p197
2915b844j055P518k262J854n763m333R002J876M32o289p010J0608K239j362j29
$$ plain form
2930 2482 -8256 -2086 5674 13 2760 -2810 -4613 4730 -555 -347 1795 -2686 2604 -1819 -3162
2945 -3162 5159 -514 683 -225 -7074 4673 4171 -2247 1712 -6449 -1087 8498 -1363 -1094 -1985 -3732
2961 -3732 5901 1243 -2239 376 -3168 2263 1515 -2102 2472 -2179 -452 2153 -3487 2538 2015
2976 2015 -3140 1115 -2405 668 4705 -2799 -1167 -737 -422 4376 -1649 -1301 307 -2543 4267 166
2992 166 -3308 2869 -2775 763 3443 -4737 2465 1328 -3915 3447 -1331 -767 3421 -4022 894
3007 894 1801 -2336 3077 -2022 -1611 3273 -2446 1668 452 -3967 3858 -119 -2046 2276 -2790 1290
3023 1290 2327 -3319 1346 113 -893 1885 -1785 487 617 -1152 1801 -1950 48 2395 -2279
3038 -2279 1040 -734 -1553 4523 -1891 -2287 1711 -1696 3140 548 -4103 1972 -667 962 2797
$$ packed form
2930B482j0738O170P760n661K747n570j803R343n285K08K142m481N290m423j343
2945c162Q321n673J197r08o849J1747n02o418L959q161N362R585r861K69q91j747
2961c732R633m658l482K615l544N431p48l617M574m651J727K605n640O025n23
2976B015n155M255l520L073M037p504J632M30L15M798o025L48J608k850O810m101
2992A66l474O177n644L538K680q180P202j137n243P362m778N64M188p443M916
3007H94R07m137N413n099M11M884n719M114j216m419P825l977j927M322n066M080
3023A290J037n646M665j233j006K778l670K272J30j769K953l751J998K347m674
3038b279L319j774q19O076o414l96L998l407M836k592m651O075k639J629J835
$$ plain form
3053 2797 -4517 796 1337 -1506 3678 -3144 -1674 4635 -3105 404 1481 -3183 3906 -846 -3730
3068 -3730 3273 -915 859 1552 -4497 1051 1875 338 1357 -4217 -511 3386 -132 826 -2716 -1557
3084 -1557 3806 -620 -302 -225 -2111 2634 204 -1431 642 -1191 2168 248 -2989 1563 -14 1220
3100 1220 957 -4817 1809 2670 -1640 1824 -3283 -1354 5109 -1530 -313 -395 -3262 4478 899 -3015
3116 -3015 961 -1808 2268 2074 -4198 1322 622 -663 2551 -3361 -446 3211 -1675 1133 -1105
3131 -1105 -2355 3810 168 -1622 -382 -1507 2950 838 -2473 -25 -733 2209 1087 -3046 623
3146 623 -206 531 2459 -3268 -573 1936 -469 1854 -2195 -1814 3501 -667 -82 -292 -2307 3336
3162 3336 129 -1916 1415 -2297 1544 2455 -3626 818 314 -620 3024 -2856 -1442 2957 -771 829
$$ packed form
3053B797p314N313N41k843N184o822J470O309p740L509J077m664P089m752k884
3068c730P003m188J774O93o049N548Q24j537J019n574L706L897l518R58l542J159
3084a557N363m426L18P7j886M745k430j635K073j833L359j920l237M552j577J234
3100A220k63n774O626Q61m310L464n107J929O463o639J217q2k867P740l579l914
3116c015L976k769M076j94o272N520p00j285L214n912K915L657m886K808k238
3131a105j250O165l642j790J240j125M457k112l311K448p08K942j122m133L669
3146F23q29P37J928n727K695K509k405K323m049L81N315m168N85k10k015N643
3162C336l207k045L331l712L841R11o081M444n04r34L644n880J414M399l728J600
$$ plain form
3178 829 -933 -2148 2808 -26 -348 117 -2471 2102 1327 -1477 587 -1990 1113 2557 -2513 -8
3194 -8 82 -218 2211 -1948 -652 1429 -956 1650 -1057 -1727 2369 -862 591 263 -3168 2808 1153
3211 1153 -2072 1252 -2050 766 2897 -2794 331 241 -1191 2816 -1269 -1350 1272 -1281 1979 29
3227 29 -2727 2071 -138 -165 1024 -2497 1354 1400 -1751 900 -883 -78 1901 -1193 -14 -412 -336
3244 -336 2259 -1205 -764 475 -772 2300 -821 -2079 2113 -971 482 1172 -2842 1445 637 -1230
3260 -1230 1940 -2238 -161 2596 -2096 806 -302 -1513 3305 -1601 -1370 2200 -2074 1586 861
3275 861 -2970 2024 -300 -782 2287 -2443 -26 1837 -1258 996 -971 -760 2185 -1079 -146 281
3291 281 -1059 1605 -514 -585 858 -1303 1235 469 -1496 800 -697 693 867 -2192 1238 301
$$ packed form
3178H29j762j215M956k834l22M65k588M573p75k804K064k577L103J444n070K505
3194hR0l00K429m159J296K081k385K606k707o70M096l231J453l28l431N976j655
3211A153l225L324l302K816K131n691L125r0j432M007m085q1K622k553L260j950
3227B9k756M798k209k7J189l521L851M6l151K651j783Q05J979l094J179l98P6
3244c36K595l464M41J239j247L072l121j258M192l084J453O90m014M287q08j867
3260a230L170m178K077K757m692K902j108j211M818m906K31L570m274L660p25
3275H61l831M994k324m82L069m730K417J863l095K254j967K11K945l264R33M27
3291B81j340K664k119p1J443k161K538p66j965K296j497J390J74l059L430r37
$$ plain form
3307 301 -745 1697 -2005 368 1666 -2194 1813 -277 -2079 2989 -1255 -695 1746 -2654 1929
3322 1929 956 -2997 2290 -749 -853 2505 -2606 525 1623 -2430 2061 -418 -1882 2450 -1098
3337 -1098 -63 961 -1955 1655 426 -1516 1167 -763 400 718 -1382 925 -306 -313 1251 -1149
3353 -1149 298 101 -580 1509 -1438 -280 1226 -1295 1339 -566 -1287 2397 -1805 16 1902 -2793
3369 -2793 1653 576 -2419 2670 -1431 -810 2984 -3002 348 1719 -2142 2198 -1002 -1599 2758
3384 2758 -1794 392 1411 -2795 1770 229 -1326 2219 -1983 -393 2217 -1829 702 566 -1357
3399 -1357 1113 -592 -176 932 -621 305 -694 133 948 -1005 1228 -592 -1677 2263 -498 -141
3415 -141 844 -2568 1533 1098 -1718 1696 -1520 -619 2016 -1740 1601 24 -2657 2823 -1186 -830
$$ packed form
3307C01j046K442l702K373J298l860M007k090j802N068m244N60K441m400M583
3322A929r73l953N287l039j04L358n111L131J098m053M491k479j464M332l548
3337a098J035J024k916L610j229j942K683j930J163L18k100K307j231pJ564k400
3353a149J447j97o81K089k947J158J506k521K634j905p21L684m202J821J886m695
3369b793M446j077k995N089m101O21L794n986L350J371l861M340l200n97M357
3384B758m552K186J019m206M565j541j555L545m202J590K610m046K531j36j923
3399a357K470j705M16J108j553R26r99Q27Q15j953K233j820j085L940k761L57
3415a41R85l412M101m35k816L414l216R01K635l756L341j577k681N480m009L56
$$ plain form
3431 -830 2979 -3077 688 1431 -3198 3310 319 -3148 2335 -1386 -40 2671 -2196 157 81 -1035
3447 -1035 2384 -533 -796 52 -1249 2020 111 -1214 1237 -1527 -38 1415 -849 915 -539
3462 -539 -1103 1000 -157 956 -180 -1172 730 -1351 1558 1818 -3133 905 37 -1423 3722 -1693
3478 -1693 -1872 2550 -2557 1254 2296 -3136 1156 -450 -1108 2879 -1703 -27 911 -2536 2095 275
3494 275 -1020 2075 -2921 -110 2846 -2093 1333 196 -2823 2041 271 -368 1245 -1950 -142
3509 -142 1017 152 455 -1231 448 -104 -792 2266 -1064 -816 1237 -2000 1495 1320 -2154 1459 -791
3526 -791 -1031 2258 -1040 431 -163 -1914 2454 -603 -635 1718 -2822 1324 1373 -2633 2814 -873 -2498
3543 -2498 3288 -1507 -468 2228 -2607 829 882 -1596 1813 -720 -963 864 -789 1294 -577 -1075
$$ packed form
3431h30L809o056L765P43m629O508k991l467N483l721J346K711m867K353p6j116
3447a035L419k917k63Q48j301L269j909j325K451k764J489J453k264J764j454
3462e39n64K103j157J113j136r92J902k081K909K60m951M038q68j460N145n415
3478a693j79M422n107L811J042n432M292j606o58L987m582J676R38l447M631j820
3494B75j295L095m996K811K956m939L426j137l019M864j770o39J613l195J808
3509a42J159q65L03j686J679n52o88L058l330K48K053l237L495j75l474L613k250
3526g91k40L289l298J471n94j751M368l057l2K353m540M146M9m006N447l687j625
3543b498N786m795J039K696m835L436N3k478L409k533k43J827j653K083j871m98
$$ plain form
3559 -1075 1616 -1366 473 1187 -1998 1238 -53 -1099 1841 -1124 -314 1223 -985 709 -424
3574 -424 -39 1309 -1859 899 456 -1571 2287 -1420 -987 2758 -2330 559 1723 -3059 1830 630
3590 630 -1816 1878 -1451 -99 1894 -1853 591 -31 -757 1782 -1598 171 1095 -2023 1881 -11
3606 -11 -1853 1987 -1036 -93 1506 -2051 939 884 -1202 714 -840 608 666 -1237 1185 -909 -271
3623 -271 2068 -1946 468 765 -2047 2484 -471 -2226 2330 -907 -24 1224 -2344 1312 568 -1158
3639 -1158 1422 -1567 39 1525 -1424 1327 -832 -1422 2943 -1324 -668 1285 -1895 1362 523 -1962
3655 -1962 1547 -434 -417 1155 -1244 602 209 -345 840 -1826 691 1602 -1354 823 -1403 -683
3671 -683 3213 -1311 -748 627 -1955 2171 852 -1779 706 -1467 855 1922 -1987 597 -363 -644
$$ packed form
3559a075K691k982J839P14l185L236j291j046K940k965Q10J537k208J694j133
3574d24L85J348l168K758m43k027L858l707M33L745n088K889J164m782M889j200
3590F30k446L694l329J352J993l747K444o22p26K539l380J769R24l118L904j892
3606a1j842L840l023R43J599l557K990n5k086J916j554J448N8j903K422k094O38
3623b71K339m014K414K97k812M531k955j755M556l237Q83J248l568L656p44j726
3639a158K580k989J606J486k949K751k159n90M365m267O56J953l180L257q39k485
3655a962L509j981J7J572k399J846l93n54J185k666K517R11k956K177k226P20
3671f83L896m524N63J375k582M126j319k631K485k173K322J067l909K584r60k81
$$ plain form
3687 -644 2113 -1881 225 1870 -2460 927 124 -1338 2931 -972 -1738 925 -1136 2048 1228 -2738
3703 -2738 -422 -55 1717 1707 -2555 -690 25 426 2426 -1669 -1258 808 -926 1772 167 -1881
3719 -1881 1451 -547 -446 680 -705 1851 -401 -2234 698 35 2074 812 -3753 181 829 883
3735 883 2799 -3298 -2315 2238 417 2047 -998 -3420 1967 677 108 727 -2194 972 535 -1450
3751 -1450 1537 -637 254 1318 -2948 223 1863 32 1278 -2900 -2032 3269 1290 75 -2035
3766 -2035 -2521 2430 1819 118 -1031 -2729 1481 1864 -497 59 -1895 577 2056 -1761 133 680
3782 680 -265 1015 -2069 -432 2455 7 80 -1986 -1461 3285 696 -577 -1377 -2733 3264 2405 -2227
3799 -2227 -465 -1755 1153 3272 -2292 -797 543 -565 2067 -1025 -1379 1841 -481 415 -658
$$ packed form
3687f44K757l994K106J645m330L387q03j462M269l903p66K663k061L184q20l966
3703b738K316L67J772j0m262J865P15M01K000m095M11K066j734K698j605k048
3719a881L332j998J01J126j385K556k252j833K932o63K039j262m565L934O48N4
3735H83J916o097R83M553j821J630l045k422N387j290n69O19k921L166m37j985
3751a450K987k174Q91J064m266L171J640j831J246m178Q68N301j979j215k110
3766b035m86M951o11j701j149j698M210L83k361N56j954K472J479l817J894N47
3782F80r45J280l084J637K887k448P3k066N25M746k589j273q00j356N997q59m632
3799b227J762j290K908K119n564J495J340j108K632l092l54L220k322Q96j073
$$ plain form
3814 -658 -1822 2695 651 -1597 -431 -1355 2330 2021 -2754 -869 126 1134 2011 -1892 -1491 567
3830 567 990 1644 -1650 -1406 1127 501 983 -1387 -1550 2462 78 -787 -89 -1353 2129 709 -2130
3847 -2130 310 -451 1070 1611 -2654 -220 876 266 1816 -2473 -1267 2761 -490 288 -579 -2013
3863 -2013 2841 487 -1786 641 -1196 1088 1683 -2182 -216 381 420 1331 -1921 -612 1549 -12
3879 -12 381 -1396 -577 2147 -404 -756 -309 -502 1876 110 -1390 -341 -126 1819 192 -2053 198
3896 198 167 1448 633 -2800 791 1218 -588 1030 -1720 -402 2431 -1375 -170 140 -1078 2384
3912 2384 -410 -2187 1066 -44 1469 75 -3095 1318 1447 -238 464 -2368 164 2575 -979
3927 -979 -216 -657 -754 2300 -141 -1517 -39 178 1486 -420 -1726 479 894 939 -1081 -1887 1468
$$ packed form
3814f58j164M517k044k248J166r24L685l09m775J885R95J008Q77l903M01K058
3830E67M23O54l294K44K533o26M82k370j63M012k384q65O98j264L482j420k839
3847b130K440p61J521N41m265K434J096o10J550m289J206M028l251P78q67j434
3863b013M854k354k273K427j837K284N95l865J966N97L9R11l252J309K161j561
3879a2L93j777Q19K724k551l52M47j93K378j766j500J049K15J945j627k245K251
3896A98l1J281q15l433L591M27j806J618k750J318K833l806J205L10j218L462
3912B384k794j777L253j110J513j394l170M413J29j685P02k832K532K411l554
3927i79P63m41r7L054k441j376J478K17J308j906j306K205M15M5k020q06L355
$$ plain form
3944 1468 1079 71 -488 -2177 1225 1930 -771 -536 -1701 655 2789 -1424 -1189 -224 201 2589 -1436
3961 -1436 -1985 1610 -89 1108 -77 -2945 1938 1317 -937 360 -2177 717 3062 -1698 -1124 -349
3977 -349 315 2688 -1326 -2170 891 578 1477 -633 -2354 1026 1127 414 -520 -2069 870 1879 -238
3994 -238 -1093 -1418 1299 1794 -950 -1085 -807 1409 1829 -1772 -851 93 520 2166 -1715 -2027 1495 339
4012 339 1197 -725 -2865 2153 1419 -854 38 -1992 1224 2474 -2003 -267 -240 -179 2645 -1353 -1840
4029 -1840 1196 -9 1475 -440 -2604 1480 1235 -230 -269 -1754 936 1648 -801 -493 -841 482
4045 482 1571 -792 -837 -505 609 1582 -1001 -1130 276 568 1290 -1280 -1245 1272 51 639 -356 -1817
4063 -1817 1612 405 -595 555 -1871 730 1905 -1589 119 -323 -332 2213 -1411 -935 1238 -806
$$ packed form
3944A468l89j008n59j689L402P05k701K35j165K356K134m213K35R65M25K388m025
3961a436n49L595j699J197j185k868M883o21k254J297k537K894K345m760N74P75
3977c49O64K373m014q44L061l13Q99k110j721L380J01p13r34j549K939J009k117
3994b38q55l25K717M95k744j35K78K216M20l601R21R44M27J646l881l12L522j156
4012C39Q58j922k140N018p34k273Q92k030L216J250m477J736K7O1K824l998m87
4029a840L036j205J484j915k164M084k45j465l9j485K690P12k449L08l48J323
4045D82J089k363m5L32J114R73k583j29J406K92P22k570L5K517j221N88r95j461
4063a817L429j207j000J150k426K601J175l494J708m42rK545l624M76K173k044
$$ plain form
4079 -806 1093 -4 -1729 1343 -100 -125 972 -1778 392 1346 -905 354 -599 -312 1445 -670
4095 -670 -437 252 -267 737 -300 -347 112 -477 973 -76 -831 528 -417 604 466 -1406 769 170
4113 170 -518 890 -1025 52 875 -981 1005 -346 -1060 1558 -582 -124 707 -1568 1240 591 -1567
4130 -1567 1173 -510 -409 1491 -1216 -43 588 -855 1245 -356 -1051 853 -148 422 -150 -1258
4146 -1258 1040 193 -323 226 -1030 638 646 -659 253 -713 233 1152 -657 -236 -254 293 1258 -1068 -532
4165 -532 658 -329 1115 -626 -1309 1385 -367 79 762 -1773 865 1004 -1111 491 -855 122 1792
4182 1792 -1438 -472 557 -235 1321 -918 -1155 1205 -182 575 77 -1762 966 810 -314 180 -1302
4199 -1302 352 1303 -727 -358 -227 357 710 -931 -131 263 181 794 -1203 -485 1133 11 692 -977
$$ packed form
4079h06J899j097j725L072j443k5J097k750K170R54k251J259r53K87J757k115
4095f70K33O89n19J004j037m7M59n89J450j049p55J359r45J021j38j872K175n99
4113A70o88J408j915J077Q23j856J986j351p14K618k140M58Q31k275K808o49k158
4130a567K740j683J01J900k707J173O31j443K100j601o95J904j001N70n72j108
4146a258K298q47n16N49j256J668Qj305R12r66R46R19j809M21j8N47R65k326N36
4165e32J190r87J444j741o83K694j752M46O83k535K638J39k115J602j346R77J670
4182A792l230R66J029p92J556k239k37K360j387P57m98j839K728j56j124M94j482
4199a302J654R51k030L69J31N84L53j641Q00L94q2O13j997P18J618j122O81j669
$$ plain form
4217 -977 -1511 1733 525 -328 -409 -1475 1375 1043 -1148 232 -788 204 1328 -1338 244 402 -819
4234 -819 1178 -938 -743 1949 -486 -517 -331 -963 2184 675 -1818 -364 -346 1360 1271 -1539 -687 -82
4252 -82 688 1403 -1033 -936 345 170 773 -658 -411 1078 -339 -546 -187 396 1533 -682 -1372 -156
4270 -156 419 2044 -174 -2333 -239 355 1892 1058 -2995 -583 1149 436 1173 -1571 -1023 1619 -536
4287 -536 132 452 -902 1215 -561 -1405 1145 360 868 -247 -2807 648 2172 627 -425 -2809
4303 -2809 -305 2895 745 -702 -1719 -933 1957 1029 -486 -1007 -641 1112 363 -601 42 151 691
4320 691 -871 -1329 1326 1258 79 -1337 -2148 1539 2250 -186 -1151 -2380 509 3167 -2 -1289 -1651
4337 -1651 -393 3004 168 -1809 98 -428 1044 524 -1794 1040 728 -902 93 -1115 766 2129
$$ packed form
4217i77n34L244j208q53q1j066K850l32k191J380j020R92J124k666J582J58j221
4234h19J997k116J95K692k435l1J86o32L147j509k493J454J8J706q9k810Q52O05
4252h2P70P15k436R7J281j75O03j431K47J489j417k07L59N83J137k215o90J216
4270a56N75J625k218k159K094N94J537q34m053K412J732p13P37k744N48K642k155
4287e36O68L20j354K117j776q44K550p85N08j115k560L455J524j545j052k384
4303b809K504L200k150j447j017P86K890r28j515n21L66J753p49r64O43J09N40
4320F91j562m58K655o8j179j416q11L687P11k436r65j229K889K658l169j287l62
4337a651J258L397k836j977J907n26J472n20k318K834l12j630R95j208J881J363
$$ plain form
4353 2129 -1253 -1492 -610 906 2782 -815 -2726 -290 1216 2215 -299 -2531 -324 1099 1296 40
4369 40 -1809 -243 939 574 -252 -1215 625 1177 -562 -815 -723 1302 1668 -1704 -1258 236 1084 1788
4387 1788 -1535 -2109 797 920 1394 -591 -2676 863 1497 145 -280 -2026 637 2008 -1017 -491
4403 -491 -351 129 1667 -1010 -1234 758 273 991 -553 -1903 940 1231 123 -723 -1533 1016 1605
4420 1605 -523 -1005 -810 888 1473 -771 -971 -279 710 1394 -767 -1158 145 680 1170 -1008 -1389 885
4438 885 649 382 -700 -1228 1283 516 -676 -8 -881 889 1130 -1350 -331 74 445 1399 -1523 -1297
4456 -1297 1156 549 690 -1000 -1513 1350 782 -215 -188 -1280 651 1017 -464 -53 -528 161 1011 -776
4474 -776 -405 484 250 314 -1005 -367 1061 416 -73 -920 -494 1263 381 -149 -665 -1012 1177 849 -541
$$ packed form
4353B129l382k39Q82J516J876l597j911K436J506R99k514k232K207J423J97j256
4369D0j849J566J182l65q26r63J840N52j739k53R2K025L66l372M46J494Q48P04
4387A788l323n74K906J23M74j985k085L539O34j352m25j746K663J371l025N26
4403d91J40M80J538k677k24J992m85P18j544j350K843K91j108q46q10K549N89
4420A605k128m82J95J698N85k244k00O92R89O84k161l91J303N35M90k178l81K274
4438H85k36k67j082n28K511p67j192O68q73J770K41k480J019M05L71R54k922K26
4456a297K453o07J41j690n13K863n68r97K7j092J931L66j481M11m75O89Q50j787
4474g76L71Q89k34O4j319O38J428o45m89q47M26J757q82n30n16l47K189l28j390
$$ plain form
4493 -541 -222 -814 689 979 -1013 22 125 -187 729 -822 -43 962 -673 125 -256 -716 1434 2
4511 2 -775 55 -708 1153 769 -1459 -119 95 326 919 -942 -368 390 -228 608 -252 -464 451 -179
4530 -179 210 9 -406 753 -117 -509 188 -45 711 -168 -921 366 9 347 405 -916 202 107 -21
4549 -21 816 -861 -275 773 -472 470 -141 -715 988 -470 -455 755 -644 233 256 -779 714 -287
4567 -287 -294 767 -728 64 559 -547 437 -369 -355 906 -527 -59 442 -528 485 -107 -293 550 -519
4586 -519 126 393 -400 285 -269 -75 563 -517 226 117 -503 559 -166 -126 322 -766 537 370 -710
4605 -710 445 -275 99 561 -887 336 328 -589 716 -443 -303 851 -584 250 54 -866 967 10
4623 10 -718 301 -454 603 440 -1099 266 81 -100 689 -812 -101 460 -313 563 -393 -626 889
$$ packed form
4493e41L19n92J503K90j992J035J03l12R16j551P79J005j635P98l81m60K150j432
4511Bp77Q30p63J861l84k228J340K14K31N93j861N74P58o18Q36q60k12R15o30
4530a79L89k01m15J159q70l92O97k33P56q79p53J287l57L38N8j321J118r5j28
4549b1Q37j677N86J048j245R42o11n74J703j458J5J210j399Q77K3j035J493j001
4567b87pJ061j495P92M95j106R84q06J4J261j433M68N01r70J013n92j86Q43j069
4586e19O45K67p93O85n54J94O38j080P43j09o20J062p25M0M48j088J303j67j080
4605g10J155p20L74M62j448J223qr17J305j159J40J154j435Q34j96r20J833r57
4623A0p28J019p55J057j63j539J365j85j81P89j501P11N61p73Q76r56k33J515
$$ plain form
4641 889 -122 -21 -178 -480 1001 -60 -703 243 -276 622 166 -932 353 -38 178 676 -1112 -118
4659 -118 693 -103 478 -870 -448 1320 -311 -196 -192 -530 1126 -151 -776 427 -392 604 490 -1247
4677 -1247 252 241 186 498 -1301 -73 1030 -167 52 -770 -194 1388 -307 -415 -96 -424 1053 16
4695 16 -850 141 -112 832 213 -1369 253 492 263 150 -1268 230 984 -341 -18 -753 -128 1245
4713 1245 -422 -347 -206 -329 1385 -90 -1175 216 68 847 47 -1517 558 621 3 143 -1248 245
4731 245 1109 -435 13 -654 -263 1488 -344 -749 -135 -69 1301 -255 -1281 485 352 514 -128 -1347
4749 -1347 517 668 -36 -12 -1089 278 1145 -326 -248 -817 279 1380 -617 -746 -1 259 1167 -624
4767 -624 -1037 625 144 565 -197 -1269 700 605 -101 -8 -1282 606 1265 -724 -282 -511 298 1425
$$ packed form
4641H89j011J01j57l02J481j061o43R46n19Q98m56j098J285l91K16M98j788R94
4659a18Q11p96N81j348M22J768j631J15Ml38J656j277o25J203q19R96j14j737
4677a247J499j1n5L12j799J228J103j197K19q22N76J582j695j08L19l28J477j037
4695A6q66R91k53R44o19j582J622K39k29j13j418J498P54j325L23p35O25J373
4713A245j667P5J41j23J714j475j085J391j48P79q00j564K075O3o18J40j391J493
4731B45Q64j544M48o67L91J751j832m05O14O6J370j556j026J766j33J62o42j219
4749a347J864J51p04K4j077J367Q67j471P8n69J096J101j997j29P45K60R08j791
4767f24m13J662m81M21p62j072J969r5p06R3j274J888O59j989M42k29Q09J127
$$ plain form
4785 1425 -982 -672 406 23 956 -476 -1094 723 181 368 -41 -1361 745 842 -411 -224 -782 669
4803 669 1121 -873 -443 -121 323 996 -821 -637 337 181 879 -576 -999 692 417 351 -452 -1114 960
4822 960 598 -474 -159 -661 724 715 -951 -32 -123 324 993 -1068 -528 482 214 851 -913 -981 1067
4841 1067 323 55 -398 -1085 1041 443 -633 147 -637 463 779 -806 -21 -5 67 786 -1041 -442 908
4860 908 20 270 -742 -667 1261 202 -367 -253 -615 908 516 -609 -133 -514 603 886 -795 -190
4878 -190 54 168 655 -863 -166 729 -193 81 -464 -286 1000 -168 -297 -155 -575 1091 297 -920
4896 -920 -139 -356 898 670 -1331 -22 304 77 669 -790 -297 589 -401 408 -142 -566 874 -246
4914 -246 -394 110 -395 868 132 -1119 205 234 415 315 -1073 26 578 13 352 -660 -290 635
$$ packed form
4785A425k407L10J078l83R33j432o18J817n42J87m09j320K106R7j253J87n58J451
4803F69M52j994M30L22M44O73j817J84R74j56O98j455m23J691k75o6q03o62K074
4822I60l62j072L15n02J385rj666R19r1M47O69k061N40J010k68O37j764o8K048
4841A067p44k68m53o87K126n98j076P80p84J100L16j585P85J6P2P19j827N99J350
4860I08q88K50j012P5J928j059n69J14l62J523l92j125M76l81J117K83j681O05
4878a90K44J14M87j518O97Q95r22K74n45J78J286j168j29J42m20J666p94j217
4896i20P81k17J254k28k001J309L26k27N92j459M93Q86r90Q09n50m24J440j120
4914b46j48N04n05J263p36j251J324K9J81j00j388J099N52n65L39j012L70R25
$$ plain form
4932 635 11 297 -384 -511 807 -60 -261 51 -158 584 -164 -730 520 27 76 148 -795 244 403 -71
4952 -71 347 -802 -118 948 -181 18 -443 -373 1000 -243 -497 307 -325 379 158 -686 369 -169 -74
4971 -74 509 -673 76 503 -246 198 -441 -71 770 -370 -117 -7 -246 646 -158 -375 355 -274 338 214
4991 214 -604 216 -7 132 296 -737 170 415 -218 225 -321 -30 504 -473 186 113 -488 439 -124 -258
5011 -258 270 -367 301 179 -637 361 39 -160 196 -531 172 307 -495 406 -206 -383 569 -271 119 159
5031 159 -566 577 172 -371 329 -315 109 295 -449 419 -38 -325 516 -269 1 146 -364 462 -79 -418
5051 -418 552 -102 -12 233 -389 302 -34 -208 401 -342 -29 383 -301 204 -237 -208 630 -343 -186 167 -235
5072 -235 431 -118 -468 414 -245 115 391 -565 131 90 19 485 -607 -125 555 -248 220 -208 -353 634
$$ packed form
4932F35o24K86o81j27J318q67k01L12k09P42p48n66J250m93M9P2r43J039J59m74
4952g1M18j149O84J066j129J99m61P0J373j243k54Q04o32P04k21q44J055n38R5
4971g4N83j182P49M27p49M44o39L70Q41j140K53J10k39Q92q04k17P30o29O12j24
4991B14q18Q20k23J39J64j033R07K45o33M43n46K91N34r77O59p3o01R27n63j34
5011b58N28o37O68j22q16R98l22j99L56p27P03J35q02R01o12j77R52q40L90M0
5031A59p25J143m05n43P00o44M24J86p44Q68m57k87Q41p85K70J45n10Q26n41l39
5051d18R70o54R0K45o22O91l36j74O09p43L13M12o84N05m41K9Q38r73J57L53m02
5072b35O66n49l50Q82o59L60K76r56O96m1p1M66j092M82O80q03M68m28j45R87
$$ plain form
5092 634 -355 -131 488 -474 285 124 -525 468 -110 95 329 -859 146 662 -88 173 -665 -230 834
5111 834 -86 12 -105 -564 510 227 -128 67 -566 245 393 -313 202 -110 0 84 -515 554 320 -373
5131 -373 85 -584 214 697 -383 33 -465 -518 1177 41 -417 -139 -700 830 515 -710 288 -432 -114
5150 -114 766 -481 252 203 -835 520 20 -281 826 -546 -487 197 -183 912 -26 -992 73 150 549
5169 549 403 -734 -211 8 245 672 -395 -412 -102 31 509 -149 -137 202 -511 216 119 33 521 -796
5189 -796 -221 546 -280 609 -170 -1026 553 -42 290 687 -1372 -30 663 -421 764 -370 -707 752
5207 752 -500 129 743 -882 266 69 -473 825 -183 -252 384 -669 346 619 -366 -44 -372 -19
5225 -19 646 -122 -246 -134 -23 231 -8 258 -312 -247 419 -317 226 183 -516 519 -209 -412 979 -461
$$ packed form
5092F34r89K24O19r62P59j61o49R93n78K05K34j188J005N16p50K61q38M35J064
5111H34r20R8j17m59J074k83l55J95o33Q11J48p06N15l12J10Q4n99J069k34o93
5131c73M58o69P98M83j080M16m98n3J695j136m58K78n61J530l15j225R98p20L18
5150a14Q80j247P33m9j038J355n00l01J107j372N9O84l80J095r38r66J065P7L99
5169E49j46j137N23K19K37M27j067j7L10J33M78o58J2L39p13P27r7q6M88j317
5189g96N75P67q26Q89p79q56J579n95L32L97k059J342O93j084J185j134l37J459
5207G52j252O29O14j625J148j97n42J298j008o9O36j053J015K73r85L22l28L53
5225a9O65p68j24J12J11K54k39K66n70O5O66p36N43m3o99J035p28k03J391j440
$$ plain form
5245 -461 -266 409 -731 692 243 -896 719 -332 -257 1016 -853 10 492 -841 911 -109 -963
5262 -963 1029 -323 -312 698 -728 399 430 -752 421 31 -306 474 -306 -72 258 -104 211 -194
5280 -194 -154 251 148 -56 -426 80 305 -123 189 -350 -165 651 -389 207 167 -867 852 197 -682 607
5300 607 -645 93 956 -1169 346 518 -976 796 -244 -544 1171 -692 -204 590 -873 734 417
5317 417 -1064 404 -258 58 916 -916 -260 521 -225 482 -168 -452 306 54 99 109 -250 -108 165 191
5337 191 -243 -27 431 -314 -11 -68 -251 800 -218 -609 649 -407 270 661 -1083 284 221 -391 1149
5356 1149 -678 -698 1069 -597 260 390 -1121 893 71 -736 957 -594 -213 835 -770 245 433
5373 433 -495 656 -336 -633 776 -34 -77 -46 -419 366 314 -153 -109 -210 139 136 167 -93 -488 390 89 -44
$$ packed form
5245d61J95O75j140J423m49j139J615j051P5J273j869Q63M82j333J752j020q54
5262i63J992j352J1J010j426J127L1j182J173l90l37P80p80K34L30l62L15m05
5280a94M0M05j03k04l70N06K25m28L12n39J85Q16j040N96m0j034J719o55q79J289
5300F07j252P38Q63k125J515J72j494J772j040l00J715j863M88P94j463J607l17
5317D17j481J468o62L16Q58j832O56P81p46P07o50k84P58k52M5J0l59J42K73K6
5337A91m34K16M58p45L03n7j83J051j018l91J258j056O77L91j744J367o3o12J540
5356A149j827k0J767j666Q57J30j511K014q22q07J693j551L81J048j605J015J88
5373D33r28J151r92k97J409q10m3L1l73P85n2m67M4j01L49lL1k60l95Q78l01j33
$$ plain form
5395 -44 202 -440 445 330 -755 464 -9 -370 803 -704 -94 763 -752 513 83 -978 978 21
5413 21 -423 644 -890 280 858 -1043 413 162 -590 831 -358 -372 607 -531 290 335 -800 355
5431 355 208 -193 228 -397 107 346 -239 -94 -12 46 64 2 14 -301 196 223 -196 172 -343 -21 729 -595
5453 -595 -88 379 -480 541 -100 -562 829 -442 -162 647 -896 331 448 -740 658 -308 -319 1069
5471 1069 -689 -219 629 -627 457 109 -652 654 -270 -247 617 -560 -10 405 -337 219 -131 -233
5489 -233 503 -92 -176 155 -50 110 -63 1 2 -30 180 -123 85 40 -215 487 -140 -357 405 -251 140 278
5511 278 -691 511 155 -548 638 -306 -202 647 -602 307 292 -711 752 0 -581 630 -393 18
5529 18 491 -759 433 217 -603 566 -165 -285 492 -406 145 225 -518 267 82 -289 206 -78 14 64
$$ packed form
5395d4K46o42Q85j15j085J219m73l61J173j507O10Q57j515J265m30j061J956r57
5413B1m44J067j534J170N78j901J456k51p52J421j189j4R79j138Q21M5j135J155
5431C55j47m01M21o25N04K39n85J45Q2N8J8o2J2l15M97K7m19L68n15L22P50j324
5453e95N07M67q59J021o41m62J391j271K80Q09j543J227J17j188J398r66j1J388
5471A069j758M70Q48j256J084l48p61J306r24K3Q64j177N50M15p42N56l50j02
5489b33P36n95q4L31k05J60j73O4Jl2K10l03K08m5k55P02o27k17P62o56L91J38
5511B78r69J202l56p03J186r44J04Q49j249R09j5j003J463p52n81J211j023M11
5529A8M73j250J192k16q20J169p31j20P77q98N51Q0p43P85j85l71M95k84R2N0
$$ plain form
5549 64 -204 133 15 -69 13 25 107 -160 -6 197 -174 131 -21 -53 296 -307 66 291 -497 282 142 -372
5571 -372 471 -288 -103 582 -577 81 356 -482 402 -127 -402 558 -401 -85 532 -553 197 283 -450 430
5591 430 -294 -160 519 -505 -16 424 -382 191 -60 -279 476 -195 -123 291 -294 68 120 -48 105 -247
5611 -247 44 208 -112 12 -38 163 45 -218 249 -60 -97 161 -294 202 113 -300 291 -248 -196 463 -163
5632 -163 86 -20 -453 614 40 -439 371 -391 -62 540 -406 136 0 -540 581 -16 -410 513 -380
5651 -380 20 294 -482 439 19 -577 352 -77 70 340 -466 41 121 -132 483 -68 -495 71 50 324 73
5672 73 -285 -59 -34 72 118 -3 67 -272 -4 296 -88 144 -139 -363 180 -25 328 303 -720 -30 245
5693 245 -2 505 -505 -395 404 -191 327 228 -731 221 100 -64 541 -486 -157 378 -470 287 351 -366
$$ packed form
5549F4k68L37j18q4Q2J2Q2k67J54K03l71L05j52l2L49o03L73K25p88P79j40n14
5571c72Q43p59J85O85j159O58K75q38Q84n29k75R60r59L16O17j085P50Q6p33Q80
5591D30p24J34O79j024M89M40q06N73k51k19P55o71P2M14n85L62N2j68J53l52
5611b47K91J64l20J24n0K01j18k63M67l09l7K58m55M96q9m13N91n39N2O59o26
5632a63K49j06m33J067n74m79Q10p62L29O02r46N42j36n40J121n97l94R23q93
5651c80M00K74p76R21m20n96R29m29J47K70q06N07Q0k53O15n51m27N66k1K74k51
5672G3l58K26K5J06M6j21P0l39K68L00l84K32k83k24N43k05L53k5j023O90K75
5693B45k47N07j010J10P99n95N18r9r59R52j21j64O05j027L29N35q48P57O4p17
$$ plain form
5713 -366 179 -389 -80 709 -224 -127 -73 -437 466 289 -82 -154 -595 172 504 -52 -74 -366 -107 313 -71
5734 -71 158 -103 -350 93 2 306 134 -344 86 -123 -67 639 -113 -217 -251 -426 731 271 -475 81 -349
5755 -349 122 695 -357 18 -237 -410 717 4 -257 153 -498 308 241 -324 493 -212 -367 393 -102 276
5775 276 134 -582 139 49 -24 501 -386 -241 35 78 549 -188 -388 178 -111 214 161 -324 166 -279 72
5796 72 559 -319 21 65 -272 403 -182 6 379 -561 47 278 -209 342 -318 -220 435 -307 186 132 -522
5817 -522 250 -52 -35 344 -564 48 266 -309 267 -115 -154 316 -322 167 188 -419 236 51 -96 291 -373
5838 -373 181 198 -394 342 -92 -159 259 -212 234 87 -492 440 -55 -123 321 -310 160 80 -433 449 -15
5859 -15 -277 275 -443 187 254 -358 240 -213 -294 575 -190 -118 -129 -396 544 50 -301 176 -331 128 291 -270
$$ packed form
5713c66N45n68L09P89r33R7N4l64R03j77l71p2m41P67L32n56k2k92K59M20l84
5734g1K29k61k47M43r1L04j72m78M30k09N6P06p52j04l4j75J157m60p46N56m30
5755c49M71N73j052L75k55j73J127p13k61M10o51Q06o7n65Q17p05j55P60m95L78
5775B76j42p16P21r0p3N25q87J45K76M3M71p37k00N66k89L25n3m85M90m45L51
5796G2M87q78L40M4l37O75n85J88L73r40O08K31m87N51o60R8O55p42M93n4o54
5817e22P72l02J7L79r08O12K18n75N76l82l9M70o38M89K1o07O55j85j47L87o64
5838c73N54J7n92P36m34o7M18m71M46j47n79R32m95o8M44o31M70q0n13Q82m64
5859a5k62N52p18O30O7o12N98m53q1Q69p65P2j1k67R40m94l51M77n07M59J63n61
$$ plain form
5881 -270 175 -183 -250 436 -239 45 131 -280 239 -280 -27 591 -364 -132 -2 -168 684 -104 -347 142 -338
5902 -338 459 466 -558 45 -206 190 636 -487 -190 209 -266 413 -138 -206 448 -293 105 144 -282 426 42
5923 42 -383 74 -231 478 349 -643 -99 96 281 356 -604 -248 188 71 401 -272 -434 273 42 348 -183
5944 -183 -597 512 49 -168 109 -364 430 253 -571 226 -13 96 429 -671 -199 288 -4 511 -458
5963 -458 -668 620 143 102 -203 -617 499 283 -213 67 -393 133 477 -264 -109 -227 104 512 -418 -343
5983 -343 94 206 376 -449 -309 384 134 166 -312 -460 450 145 39 -72 -676 438 447 -387 -59 -453 358
6004 358 703 -560 -229 156 -46 581 -343 -439 446 -93 259 22 -739 380 358 -64 -57 -568 218 619 -350
6025 -350 -101 -159 166 493 -254 -231 20 30 452 -185 -390 75 207 398 -221 -538 272 165 113 -24 -475
$$ packed form
5881b70M45l58o7O86o75K84Q6m11N19n19K53O18r55K32J30j66Q52p88k43M89m80
5902c38P97Pj024O03k51L96M46j123K97L99m75O79n51o8O54p41L98L9m26P08l84
5923D2m25M57l05P09j29r92N44J95J85P5r60L56M36j17L30o73j62P07k31L06n31
5944a83m14J109m63k17K77m73P94j77q24P97k39J09L33j100M72M87k92N15r69
5963d58k10J288m77m1l05m14J116k16m96K80m60N26L44p41J55j18L31M08r30P5
5983c43M37J12J70q25J40O93k50L2m78j48R10l05j06j11o04J114Rq34L28l94Q11
6004C58L45j263L31L85k02O27r24r6Q85n39L52k37p61J119k2m22Pn11P86M01r69
6025c50K49n8L25L27p47K3K51J0M22o37k05M65J32J91o19l17Q10j07n2j37m51
$$ plain form
6046 -475 290 255 -145 138 -425 65 519 -322 -1 -149 -114 665 -352 -406 315 -154 304 -97 -560 474
6066 474 67 -82 222 -562 59 398 -153 58 -354 -127 585 -129 -171 45 -29 376 -64 -262 141 -61 106
6087 106 81 -173 51 -97 161 143 -384 110 137 -34 154 -341 165 279 -338 137 -64 -241 366 -206 -35
6108 -35 180 -410 325 138 -415 272 -198 -68 336 -428 115 165 -382 334 12 -251 140 -229 122 249 -448
6129 -448 166 118 -135 126 -202 -4 139 -90 219 -116 -215 202 55 76 -142 -157 360 57 -83 -68 -259 302
6151 302 27 -254 66 -226 178 323 -338 -45 47 128 491 -456 -326 355 1 151 -197 -392 465 167 -171
6172 -171 87 -496 228 474 -321 -166 -164 162 568 -391 -436 118 249 337 -355 -452 249 245 188 -142 -504 196 450
6195 450 30 -268 -466 287 591 -144 -401 -280 381 469 -349 -384 24 190 592 -330 -526 169 224 476 -316
$$ packed form
6046d75P65l5m00K83n63M90M54q41L21j48L5P79j017n4P21m69M58m01m63J034
6066D74m07j49L04p84O21L39n51K11m12K27P12p14m2K16p4M05m40j98M03k02J67
6087A06k5k54K24j48K58j8n27M94K7j71J88m95N06J14o17M75k01j77O07n72J71
6108c5K15n90P35j87n53O87m70J30M04p64N43N0n47P16l22k63L91l69L51J27o97
6129d48O14m8k53K61l28J98J43k29L09l35r9M17j47K1k18j5N17l03j40J5j91N61
6151C02k75k81L20k92M04J45o61K93R2Q1L63r47J30O81l54J50l48j95Q57k98l38
6172a71K58n83P24K46p95J55KL26M06r59m5N54J31Q8o92r7P01mn7l30l62P00K54
6195D50m20k98j98P53L04p35k57J21O61Q8q18l5M08J66M02r22j96O95N5K52p92
$$ plain form
6216 -316 -786 335 499 46 -306 -656 347 663 -241 -350 -347 176 653 -201 -471 -149 177 688 -151 -795
6236 -795 46 504 366 -243 -761 259 594 123 -315 -547 126 689 93 -399 -516 179 789 -59 -629 -292
6256 -292 298 704 -165 -645 1 454 431 -136 -653 42 530 146 -187 -630 43 728 121 -417 -509 129 899
6277 899 -74 -649 -155 185 656 -6 -718 -100 320 408 154 -707 -142 548 340 -143 -660 22 671 184
6297 184 -360 -436 74 648 -37 -486 -246 26 609 96 -663 -252 294 537 152 -729 -211 518 298 -72
6317 -72 -550 -156 548 142 -154 -259 -211 516 217 -372 -166 -67 410 168 -595 -178 313 329 39 -543 -194
6338 -194 378 179 -27 -387 -319 374 260 -82 -292 -238 396 336 -290 -211 -80 307 145 -301 -29 55 123 123 -240
6361 -240 -65 84 18 205 -277 -286 417 62 19 -78 -300 357 152 -287 106 -92 -54 280 -190 -7 -26 -124 339
$$ packed form
6216c16m70J121J64m53l52l50J003L16r04j09LN23M77q54k70L22L26N11q39o44
6236g95Q41M58j38o09n18J020L35m71m38k32O73N63n96m92j17O95O10q48n70L37
6256b92N90M06q69m80O46M53k3n67n17O95M88l84l33m43O73O85o07n38r2O38P70
6277H99r73n75M94L40M71o62p12O18M20Q8k54q61N65O90k08m83n17O82O49m87
6297A84n44p6N10N74o85m49K40K72N83n13p59M11N46K43l85q81N18P29k20l70
6317g2m78L94P04m06k96j05M8P27k99n89K06R9M77k42p63M17M91J6k90n82L49
6338a94N72j99k06l60O8O93j14l42k10N4O34o0o26P9J31L87j62m46K72Q4O8%l63
6361b40J75J49o6J87m82rP03l55m3r7k22O57k05m39L93j98L8L34m70J83j9r8M63
$$ plain form
6384 339 -114 -178 198 -211 122 22 -193 232 -80 -171 276 -115 -46 113 -69 225 -70 -135 148 -6 48 -54
6406 -54 -147 118 -98 107 161 -223 54 158 62 57 -244 31 336 -126 -78 -170 38 389 -164 -164 -21 -163 398
6429 398 66 -446 146 -4 277 223 -620 38 399 -162 114 -304 -168 525 -156 -120 -97 -241 507 98 -354
6450 -354 -46 -54 481 159 -583 -59 306 247 85 -479 -96 387 241 -116 -425 -152 374 236 -42 -543 -145
6471 -145 636 100 -325 -319 -126 710 104 -602 -34 12 428 279 -610 -169 311 329 309 -692 -334 733 149
6492 149 15 -444 -350 849 232 -497 -121 -230 511 512 -583 -311 58 409 468 -619 -559 347 531 176 -619
6513 -619 -400 451 420 -28 -528 -349 479 412 -78 -381 -350 628 406 -408 -408 -104 699 354 -791 -329 196
6534 196 457 535 -728 -436 454 306 368 -532 -804 687 455 -57 -285 -583 557 681 -404 -258 -177 292
$$ packed form
6384C39m53o4L76m09L33j00k15M25l12r1M47l91O9J59j82K94k95o5K83j54N4j02
6406e4r3K65k16K05N4l84K77J04r6nl01K75L05m62M8r2K08L51n53%J43j42N61
6429C98l32n12N92j50K81n4q43O58L61n61K76m18J36O93o81L6K3j44P48m09m52
6450c54L08qN35l22p42N24L65n9j62n64L83M83j46l57l09K73N26j38k78n01L98
6471a45P81n36m25OJ93Q36o06p06N68M6M16j49q89M41M80J8k0j001L58J067n84
6492A49j34m59R4J199o17p29L76j09P41Jj095K72L69L51N9j087O0R06J84l55p95
6513f19K19Q51l1m48n00J79Q28o7m90l03L1R78k22q14%L04Q03l45j145M62N25
6534A96K61P8j263K92Q90j48O2r00k72J491k32n12k28k98J140J24j085J46Q1M69
$$ plain form
6554 292 552 -471 -438 185 265 447 -398 -680 368 549 166 -529 -596 414 695 23 -560 -493 428 570
6574 570 -16 -391 -539 386 660 -248 -329 -245 301 637 -474 -416 263 228 348 -448 -561 550 275 36 -220
6595 -220 -708 506 691 -143 -314 -624 323 1036 -317 -552 -107 118 722 -112 -608 131 140 255 -42 -492
6615 -492 55 329 164 -206 -473 246 457 -58 -424 -337 383 451 -280 -358 -315 270 531 -258 -360 -132 92
6636 92 700 -246 -554 216 86 372 -2 -661 416 243 -180 191 -382 128 550 -361 -73 -79 -126 528 -134
6657 -134 -405 159 55 274 -67 -548 234 220 33 102 -322 21 277 -85 20 -196 -45 206 22 -60 -144
6678 -144 125 226 -208 -50 72 0 204 -267 -72 242 -296 101 15 -303 346 16 -136 154 -259 107 264
6699 264 -420 194 64 -88 299 -281 12 417 -293 51 132 -241 326 -179 -239 216 -150 181 56 -399 120
$$ packed form
6554B92K60j023L3O23Q0J82q45k82J048J81l83o95o7J010K81o72n83O7R21J42
6574E70n86l75j48R25K74r08q1Q4N46L36j111N8O79l5J20p96j13J111k75k39k56
6595b20m88J214J85q34j71l10R47P13j353k35M45K25O04q34m96P39RJ15k97m50
6615d92N47K74j65l70k67P19K11n15l66Q7P20O8p31p8M3N85K61p89j02K28K24
6636I2O08r46l08P70j30K86l74o59J077j73m23L71n73N10M22r11K88om7O54o62
6657a34k71N64j04K19l41m81P82j4j87O9m24L43K56l62J05k16J51K51j84q2q4
6678a44K69J01m34J58J22p2K04m71J95L14n38L97q6l18O49l30j52K90m13L66J57
6699B64o84O14j30j52L87n80K93M05p10L44Q1l73N67n05o0M55l66L31j25m55N19
$$ plain form
6720 120 210 81 -84 -372 138 330 41 -119 -282 174 354 -115 -72 -176 -5 363 -135 -157 -41 118 388
6741 388 -275 -385 209 100 252 -254 -522 461 351 -116 -22 -532 247 663 -308 -164 -335 -14 794 -196
6761 -196 -448 124 145 429 -98 -614 248 297 -58 -63 -535 153 651 -28 -294 -395 220 707 -64 -636 -229
6782 -229 433 555 -267 -596 -106 370 498 -210 -556 1 351 431 -216 -649 192 491 139 -325 -636 336
6802 336 668 -291 -381 -303 275 841 -343 -524 46 194 679 -78 -865 155 490 383 -70 -895 102 770
6822 770 -60 -203 -442 84 698 -65 -476 -192 175 561 -67 -644 -118 424 480 -126 -730 -17 548 288
6842 288 -301 -564 129 530 253 -183 -493 156 565 35 -348 -439 138 714 -137 -506 -153 174 607 -212
6862 -212 -612 112 308 246 -18 -661 70 533 23 -71 -495 2 729 -27 -375 -155 11 591 54 -553 -16
$$ packed form
6720A20R0j29j65k88N10J92k89j60j63M56J80m69M3j04J71L68m98k2J16J59K70
6741C88o63j10N94j09J52n06k68R83j10m67R4n10P79M16r71J44j71L21Q08r90
6761a96k52N72K1K84n27n16Q62M9l55nm72O88M98o79k66j01O15M87p71n72M07
6782b29O62J22q22l29M90M76J28p08l46N57L50Q0o47m33Q41K99l52m64l11R72
6802C36L32r59r0P8N78N66j184j81N70J48M85p57p87J020L35j07m53q25R97O68
6822G70q30j43k39N26O14p63m11K84L67L86o28n77N26N42N6o06o04P13N65k60
6842B88n89k63O93M01k77m36l10O49M09n30l83r1N77N76q51l69L53L27M33q19
6862b12m00P24J96o2k64o43P31M63n10r4m24M97P27p56l48K20J66N80n37o07N37
$$ plain form
6883 -16 178 276 119 -490 -189 316 189 38 -427 -180 507 184 -242 -319 29 381 74 -298 -213 82 232
6904 232 100 -224 -146 3 349 -48 -395 -39 125 167 54 -403 58 311 -101 57 -254 -57 373 -82 2
6925 2 -42 -221 337 90 -253 26 -69 141 169 -378 14 189 -122 172 -43 -105 215 -21 50 58 -310 70 103
6948 103 -96 47 -62 36 125 -114 -19 59 -98 13 -16 -1 -22 -82 142 18 -84 -77 -46 94 10 -133 48 -99
6972 -99 -30 148 -129 90 3 -29 285 -123 -179 175 -97 63 33 -199 261 -4 -112 143 -266 38 288 -205
6994 -205 35 -56 -70 368 -103 -227 187 -62 103 40 -326 84 70 7 47 -103 -111 74 60 -58 -115 64 218
7017 218 17 -60 -107 3 201 -192 -68 -30 -50 149 -82 -99 17 3 234 26 -319 136 122 -77 115 -348
7039 -348 -26 228 -239 178 -58 -203 290 -123 -127 148 -231 136 239 -340 85 33 -13 202 -273 0 205
$$ packed form
6883a6J94R8j57o09L01N05j27j51m65K47O87l23m26p7L48L52l07l72Q5K95J50
6904B32j32l24P8J49L46l97l47L56J64M2j13m57M61K53m12J58l11J97M30m55Q4
6925Bm4j79N58k47l43K79r5K10K8n47L92J75l11K94k15o2L20k36P1Ql68L80L3
6948A03j99J43j09R8Q9k39R5P8j57J11k9J5k1o0K24j24j02PL1J40q4j43J81j47
6972i9O9J78k77K19q7l2L14m08n6L54k72J60l0k32M60k65j08K55m09L04K50m93
6994b05K40r1j4M38m71j24M14k49J65o3l66M10j4o3M0j50qJ85j4j18n7J79J54
7017B18k01p7m7J10J98l93J24L8k0J99k31j7J16j4K31k08l45M55j4j99J92m63
7039c48L22K54m67M17k36j45M93m13mK75l79L67J03n79M25n2m6K15m75K73K05
$$ plain form
7060 205 -90 66 -100 -149 164 99 -20 -29 -230 111 109 -54 -81 -111 121 99 -37 -31 -73 127 23 -56 170 -170
7084 -170 -46 214 -181 -79 145 -41 150 -106 -212 286 19 -152 124 -339 85 188 -102 61 -227 -49
7104 -49 459 -99 -123 -74 -134 365 67 -280 48 1 93 156 -177 19 76 46 68 -166 50 194 45 -106 -302
7127 -302 136 292 -102 -127 -250 37 352 -59 -186 -101 0 355 28 -230 -30 -19 335 134 -388 90 147
7148 147 -49 112 -212 -30 308 -110 -77 -90 -77 425 109 -383 -101 74 378 108 -433 -134 220 278 60
7169 60 -271 -50 202 145 77 -356 -126 238 89 -52 -247 -56 364 28 -262 -127 40 369 -63 -349 62
7190 62 103 291 104 -469 -32 275 152 68 -347 -204 424 75 -119 -188 -115 360 12 -207 -41 69 203 86
7212 86 -234 -97 124 179 50 -330 -87 283 194 -160 -347 60 306 53 -51 -236 4 346 -73 -93 -142 -102
$$ packed form
7060B05k95J56j66m9L13o5j19rk01L41kj63k7l0K32k2j36Om2K00j04p9K26l40
7084a70J24K60l95J02K24j86J91k56j06M98k67j71K76m63M24J03k90J63k88J78
7104d9N08n58k4M9o0M99k98l47L28m7R2O3l33J96N7l0K2k34K16J44j49j51j96
7127c02M38J56l94k5j23K87L15m11j27Q5J01L55l27k58K00J1L54k01n22M78N7
7148A47j96J61l24J82L38m18L3j3J3N02l16m92K82J75L04k70n41K99L54N8k18
7169F0l31K21K52n7o8m33K30L64j49j41j95J91M20l36k90J35J67L29m32k86M11
7190F2M1J88j87n73M37L07j23q4m15J43O28l49j94o9P3M75l48k19J66J10J34j17
7212H6l20J37K21N5j29l80K43L70q9l54j87M07K46k53j04j85K40L42m19k0m9M0
$$ plain form
7234 -102 369 57 -296 -22 2 277 -4 -384 -24 188 0 61 -282 27 303 -85 -42 -87 -85 293 44 -213
7256 -213 -21 122 236 15 -373 -27 230 92 -94 -201 -4 103 130 -95 -204 22 82 78 -10 -261 74 241
7278 241 -103 -19 -22 35 238 -194 -103 212 -19 109 -8 -249 193 72 -43 18 -281 97 303 -174 -71 -33
7300 -33 -53 240 -139 -150 123 -61 -42 16 -66 111 45 -86 -89 -19 62 100 -69 -191 -35 174 117 -151 -78 -75 170
7325 170 12 -73 20 -75 32 196 -188 -57 24 -131 130 -52 -117 313 -48 -168 79 -73 281 95 -355 27
7347 27 76 -17 246 -221 -103 102 -34 123 -128 -200 202 84 -101 -31 -12 84 11 -114 1 52 68 -41 -46 -58
7371 -58 21 58 -75 -252 51 72 102 20 -278 95 199 -73 29 -122 -17 252 -160 -15 102 -147 217 56
7393 56 -251 103 -37 56 129 -238 78 211 -139 69 -40 -96 217 -92 -19 69 -126 73 120 -129 -67 69 -16
$$ packed form
7234a02M71l12l53K74K4K75k81l80L60K12j88O1l43L09K76l88M3m5KL78k49k57
7256b13J92J43J14k21l88L46K57j38j86j07J97J07K7k25j09K26O0mq8k51L35J67
7278B41l44Q4lN7K03m32R1L15k31J28j17k41M42j21j15O1k99L78K06m77J03L8
7300c3k0K93l79j1K73j84J9N8q2J77o6j31lP0Q1L8j69j22J56K09n7k68P3LK45
7325A70j58q5R3r5J07J64l84J31Q1j55K61j82o5M30l61j20K47j52L54j86m50L82
7347B7M9r3K63m67J18K05j36J57k51p2M02j18j85P0J9R6p3j25J15N1J6j09nj2
7371e8P9L7j33j77L03K1L0q2k98L73J04k72J02j51J05K69m12J45J17k49L64j61
7393E6l07L54j40R3P3l67L16J33l50K08j09n6L13l09P3Q8j95J99M7k49O2J36q5
$$ plain form
7416 -16 76 -152 -65 108 11 -12 -65 18 17 -20 -37 -65 40 23 -25 21 -110 -16 173 -45 -20 34 -44 140 -101 -148 236
7443 236 -133 14 182 -170 108 46 -138 202 -78 -150 296 -146 -31 88 -135 162 -9 -171 278 -12 -82
7464 -82 120 -49 -1 9 -89 97 71 -92 0 31 -19 73 34 25 -11 19 -13 -21 -8 19 166 48 -129 78 -15 26 160
7491 160 -155 3 113 -186 79 -27 -136 161 -54 -31 41 -210 146 212 -257 68 35 -74 149 -173 -30
7512 -30 202 -119 78 100 -216 214 112 -94 85 -188 53 98 -222 -91 62 65 54 -118 -97 187 -41 -21 -52
7535 -52 -90 19 76 47 -86 -59 39 65 -33 -139 -31 208 -26 -84 50 -39 127 60 -199 105 -9 22 172 -222
7559 -222 -64 216 -9 102 -120 -143 318 3 -197 89 -62 74 89 -243 90 24 -41 167 -166 -3 184
7580 184 -13 51 -68 -157 263 52 -86 12 -35 59 26 -166 -13 -12 11 122 -155 -63 62 151 130 -229 -55 93
$$ packed form
7416a6R2k28Q7J73r7k3n3Q3jl7j7k8J05j7m8M6j31R4J89k18K5N4p8J84k41m7L84
7443B36l69J47J68l52K78o2j84L40k80p2M46m42J15J19k23K97j71j62M49k90p0
7464h2K02j69M8J0r8J86k6j63R2L1n0R2l9rl6L0l2qJ3K7J47j18j77K07r3M1J34
7491A60l15J58J10k99K65j06j09K97k15K3P2k51L56O6m69L25l3j09K23l22J43
7512c0K32l21J97K2l16M30j02k06J79k73K41M5l20J31J53Lj1j72K1K84k28K0l1
7535e2l8J09N7k9j33K7R8K6r8j06J08K39k34n8J34q9J66o7k59L04j14L1J50l94
7559b22J58K80k25J11k22k3M61l15k00K86j51J36J5l32L33o6o5K08l33J63J87
7580A84j97O4j19q9M20k11j38R8m7R4l3j92J53JK3J11k77R2J25Q9k1l59J74J48
$$ plain form
7604 93 41 -12 -203 38 155 -109 23 -24 -86 171 41 -155 69 -76 136 156 -305 3 85 48 44 -244 -83
7627 -83 259 -130 28 7 -167 199 -58 -155 90 -168 97 57 -277 11 109 48 54 -251 7 198 25 -17 -89
7650 -89 -36 118 21 -29 -56 -72 180 -16 -52 -100 38 147 -20 -153 77 77 2 51 -144 147 74 -8 105 -241 -28
7675 -28 219 -50 -17 -76 -95 224 -41 -236 114 -32 57 -39 -239 138 57 -95 135 -213 -18 168 -55 44 -144
7698 -144 -3 239 -50 -161 2 58 173 -17 -177 110 6 33 0 -188 4 -29 2 47 -156 -15 168 -36
7720 -36 -62 -136 14 189 -210 -68 111 -36 142 -90 -91 102 -135 125 90 -319 42 58 27 28 -175 71 226
7743 226 -134 52 -7 -47 154 -62 -67 101 -105 101 37 -163 57 13 114 -2 -195 112 128 -97 -36 -85 58
7766 58 62 -95 77 -52 -13 163 -80 -79 11 -47 179 -52 -125 127 -29 44 -53 -160 145 44 -86 78 -72 34
$$ packed form
7604I3n2n3j91K41J17k64J32m7o2K57j30j96K24j45K12K0m61L08Q2l7mk88J61
7627h3L42l89J58k1j74L66k57r7K45k58K65m0l34K88R8o1Ol05K58J91j73m2p2
7650h9N3J54r7n0k7j6K52j96l6m8J38J09j67j33K30%p5M9j95K91p3q2J13l46K13
7675b8K47k69L3n9j9L19k65j95L50j46Q9r6k00L77q1j52K30l48J95J86k23R9j88
7698a44J41K42k89j11J63N6J15j90j60K87j04K7l3j88J92l3L1M5k03J41J83k04
7720c6k6p4J50J75l99J42J79j47J78k32jJ93k37K60l5m09L61J6l1Jk03K46J55
7743B26l60J86n9m0K01k16nJ68k06K06o4k00K20m4J01j16j93L07J6k25O1m9J43
7766E8Mj57J72j29L9J76k43JR0n8K26k31p3K52j56P3r7j07L05j01j30J64j50J06
$$ plain form
7790 34 115 -93 82 -35 15 161 -57 -49 64 6 91 -55 -110 93 -46 -68 93 -98 9 -51 -96 63 -148 22
7814 22 75 -84 -2 -33 -31 179 -131 -51 158 -90 74 -25 -49 145 -25 -12 95 -120 34 29 -72 95 -69 -1
7838 -1 123 -115 37 54 -59 26 -30 -28 49 -65 11 4 -82 33 21 13 -8 -68 104 141 -56 -51 -12 76 -13 -58 60 -18
7866 -18 -5 40 -40 -20 -11 -50 103 -79 -163 86 -36 -25 48 -129 98 10 -154 129 -2 -77 113 -30 34 15 -90
7891 -90 163 8 -57 69 62 60 48 -55 110 -25 -51 40 102 55 26 -52 17 50 6 -32 33 -9 -3 37 44 -52 100 31 -27
7920 -27 80 -64 -7 49 -43 79 113 -66 74 -12 -35 66 -64 113 79 -125 44 80 -40 64 -74 -33 70
7943 70 -91 -1 99 -115 32 57 -63 26 39 -20 7 -45 -30 62 9 -25 -5 19 34 -24 -37 50 3 -52 25 51 -61
7970 -61 15 -18 -59 75 -2 -55 46 -125 -12 192 -38 -19 13 -40 102 -48 -79 134 -85 -66 97 -73 27 -53
$$ packed form
7790C4Q1k08J75j17N0J46k18QJ13n8Q5j46n5K03j39k2J61j91J07o0m5J59k11J70
7814B2N3j59Q2l1KK10l10Q0K09k48J64r9k4J94j70J3J07k15J54nj01J67j64O8
7838aJ24k38J52J7j13Q5n6KP7j14P6pq6J15j2qk1o0J72L7j97NL9Q8q9m5J18p8
7866a8J3M5q0K0Rl9J53j82q4K49j22J1P3j77K27q8j64K83j31p5J90j43O4j9j05
7891i0K53j55o5J26pkj2j03J65j35k6R1O2m7k9p8O9L3m4l8O5m2OM0Pr6J52o9n8
7920b7J07j44N7N6r2J22L4j79J40q6k3J01j30J77l4k04J69L6j20J04j38M1J03
7943G0j61R0J00k14J47K5j20Q9J3n9K7n2J5R2n3l4K0K4J5n8j3Q7m7n5P7K6j12
7970f1P6l3m1J34p7n3J01j71J13K04k30J9L2n3J42j50l1K13k19J9J63j70J00q0
$$ plain form
7994 -53 -48 54 -53 -104 147 -75 -125 40 17 27 30 -77 59 84 -17 -51 -12 -63 29 93 -39 48 -46 8 138 -78
8020 -78 -102 110 47 27 13 -66 65 85 -161 133 3 -12 87 -74 -13 79 20 94 18 -122 19 59 -54 58 -104
8045 -104 12 113 -18 19 0 -68 96 81 -116 65 -17 -4 21 -38 15 148 21 -101 -1 30 88 29 -82 -16
8069 -16 65 -24 26 -28 -71 143 88 -76 6 -86 59 114 -99 -32 92 -18 65 64 -141 94 -78 52 36 -181 90
8094 90 108 -62 41 -37 16 158 -153 -75 41 -52 80 -13 -108 72 0 39 67 -182 -2 179 32 -77 -100 111
8118 111 117 -31 -40 12 50 -19 -62 -7 -43 92 166 -101 14 59 77 120 -145 -89 176 64 -3 -77 -118 168 97 -67
8144 -67 89 -68 -6 130 -69 -59 11 -3 210 -56 -182 120 9 -13 -57 -51 74 76 -137 16 18 56 72 -76 -110
8169 -110 -17 73 71 -11 -123 18 104 58 -52 -89 68 46 28 -9 -34 125 -17 11 -38 -44 156 68
$$ packed form
7994e3NJ02j07n1K51k22n0J65k3J0Lj07J36K5j01l4L9n1R2O4j32Q7r4N4J30k16
8020g8k4K12o3k0j4p9J31K0k46K94j30j5R9j61O1R2n9P4p6j40J41M0j13J12j62
8045a04J16J01j31L7j9o8J64j5j97J81q2J3K5n9N3J33j27j22J00L1N8n9j11O6
8069a6Q1q9N0n4m3K14n5j64Q2r2J45N5k13O7J24j10Q3jk05K35j72J30j6k17K71
8094I0J8j70J03p8N3J42l11P8J16r3J32r3r5J80p2L9K8k49J80J81j47j09k3K11
8118A11Oj48rN2L8o9m3N5l6J35P4k67J15M5J8M3k65N6K65j12o7p4m1K86p1j64
8144f7J56j57O2J36j99J0P0j4K13k66j26L02j11k2m4OJ25Kk13J53KL8J6j48l4
8169a10R3R0kq2j12J41Q6m6j10l7J57k2j8l7k5J59j42K8m9oK00q8
8191F8
$$ Imaginary data points
##PAGE= N=2
##DATA TABLE= (X++(I..I)), XYDATA
$$ plain form
0 0 0 0 0 8 -9 16 -16 24 -24 33 -48 58 -73 89 -106 129 -154 181 -217 254 -298 346 -399 457 -526 601
26 601 -685 780 -885 992 -1118 1258 -1406 1571 -1754 1950 -2166 2405 -2669 2956 -3273 3621
42 3621 -4006 4433 -4917 5455 -6063 6757 -7556 8487 -9588 10918 -12557 14625 -17335
55 -17335 21051 -26459 35060 -50785 88340 -338680 -179134 486820 -348416 280132 62247
66 62247 -515271 334108 112149 -207919 212499 -219720 9111 201898 -173956 50892
76 50892 -4079 -28037 170343 -214805 -35433 185964 -63095 70699 -60668 -218228 186846
87 186846 173676 -126592 -83905 -5354 -46661 163188 139388 -313788 -19566 234413 -176656
98 -176656 144552 48986 -358483 307010 62716 -310268 285582 -108929 -102776 294128 -298553
$$ packed form
0@%%%Qj7K5l2M0m8N7q1J06j31J62j95K35k83L35l98M71n52O44p45Q56r83J127
26F01j286J465j665J877k110K376k664K977l325L704m116M571n074N625o229O894
42C621p627Q439r350J0372j1518J2820j4313J6043j8075K0506k3475K7182l1960
55a7335L8386m7510O1519q5845J39125m27020J59546O65954q35236O28548k17885
66F2247n77518Q49379k21959l20068M20418m32219K28831J92787l75854K24848
76E0892n4971k3958J98380l85148J79372K21397k49059J33794j31367j57560M05074
87A86846j3170l00268M2687P8551m1307K09849k3800m53176K94222K53979m11069
98a76656L21208r5566m07469O65493k44294l72984N95850l94511O153L96904n92681
$$ plain form
109 -298553 5396 235981 -181128 144588 -119941 -169854 331361 -114211 -11082 65797
119 65797 -324557 305963 122279 -315929 224871 -146842 -103286 392079 -253781 -103645
129 -103645 241192 -201828 84167 114213 -221894 101743 93578 -119806 2367 30617 4897
140 4897 21916 13243 -90895 -24297 148191 -29827 -62588 17938 -71614 96552 53826 -100005
152 -100005 15877 -49911 70459 72440 -156254 91498 -11370 -91397 209177 -169203 -60040
163 -60040 254818 -230761 44903 153704 -272820 203155 66314 -268072 207065 -39634
173 -39634 -96936 205603 -168736 -29146 142134 -103160 68819 -25660 -80588 123421 -61012
184 -61012 2715 43922 -108935 101514 12167 -103819 92107 -32605 -29986 84319 -68775
$$ packed form
109b98553L03949K30585m17109L25716k64529m9913N01215m45572J03129P6879
119F5797l90354O30520j83684m38208N40800l71713M3556M95365o45860J50136
129a03645L44837m43020K85995L0046l36107L23637q165k13384J22173K8250k5720
140D897J7019q673j04138O6598J72488j78018l2761Q0526q9552J68166m2726j53831
152a00005J15882o5788J20370J981k28694K47752j02868q0027L00574l78380J09163
163f0040L14858m85579K75664J08801m26524M75975j36841l34386M75137k46699
173c9634n7302L02539l74339J39590J71280k45294J71979r4479n4928K04009j84433
184f1012O3727M1207j52857K10449q9347j15986J95926j24712K619J14305j53094
$$ plain form
195 -68775 -25264 70306 -9597 -39577 14725 16986 -37579 54065 1949 -107190 106118 14859
207 14859 -103543 109667 -66846 -44836 156022 -116860 -20604 89938 -98384 88063
217 88063 599 -110867 107145 -37221 -3242 60531 -126130 85395 37137 -108087 108435
228 108435 -68981 -38803 153874 -127430 -12465 97952 -104882 79710 20071 -130403
238 -130403 90821 25294 -47185 34484 -49889 2371 57974 -14087 -25264 -21495 26390 23227
250 23227 -13939 -3194 -35081 23835 45871 -41875 -9579 -2121 12687 40484 -48351 -9653
262 -9653 17093 -5623 55686 -56492 -40130 79391 -38773 23193 20868 -110575 83802
273 83802 44171 -84402 56270 -48012 -17922 113361 -77786 -27928 49270 -43361 60115
$$ packed form
195f8775M3511R5570p9903k9980N4302K261n4565R1644n2116j09139K13308r1259
207A4859j18402K13210j76513K2010K00858k72882R6256J10542j88322J86447
217H8063q7464j11466K18012j44366L3979O3773j86661K11525m8258j45224K16522
228A08435j77416L0178J92677k81304J14965J10417k02834J84592n9639j50474
238a30403K21224o5527p2479Q1669q4373N2260N5603p2061j1177L769M7885l163
250B3227l7166J0745l1887N8916K2036q7746L2296P458J4808K7797q8835L8698
262i653K6746k2716O1309j12178J6362J19521j18164O1966k325j31443J94377
273H3802l9631j28573J40672j04282L0090J31283j91147M9858P7198r2631J03476
$$ plain form
284 60115 -6373 -74235 53425 -1670 6098 19501 -72271 31834 41270 -30516 15268 -38500
296 -38500 -3770 68102 -29050 -28256 8613 -5779 33503 4408 -41369 -7478 28797 19760 -17267
309 -17267 -16049 -11763 14247 46490 -33726 -38250 30722 133 23139 -555 -61752 32454 29174
322 29174 -16752 14265 -44997 2113 59019 -28651 -6380 -9159 -20560 64496 -13642 -47751
334 -47751 26336 -12035 26330 20910 -66388 14559 31961 -11125 19865 -36797 -21323 53521
346 53521 1954 -16793 -14478 -16949 39198 18754 -32217 -17430 3840 27575 13273 -27439
358 -27439 -20355 11020 28097 4270 -26348 -16624 11987 32839 -1710 -37571 -3801 18898
370 18898 22570 501 -44778 -593 36947 3947 -3288 -30128 -13946 48218 7439 -25602
$$ packed form
284F0115o6488o7862J27660n5095P768J3403r1772J04105R436p1786M5784n3768
296c8500L4730P1872r7152P94L6869j4392L9282k9095m5777L3891L6275r037l7027
309a7267J218M286K6010L2243q0216m524O8972l0589K3006k3694o1197R4206l280
322B9174m5926L1017n9262M7110N6906q7670K2271k779j1401Q5056p8138l4109
334d7751P4087l8371L8365n420q7298Q0947J7402m3086L0990n6662J5474P4844
346E3521n1567j8747K315k471N6147k0444n0971J4787K1270K3735j4302m0712
358b7439P084L1375J7077k3827l0618R724K8611K0852l4549l5861L3770K2699
370A8898L672k2069m5279M4185L7540l3000p235k6840J6182O2164m0779l3041
$$ plain form
382 -25602 -13384 -11514 39107 20776 -43912 -12849 12004 22702 18351 -40741 -20004 30918
394 30918 15801 2759 -26697 -23872 33031 23925 -14452 -24005 -13335 29129 27543 -22853 -30169
407 -30169 2848 30513 15967 -24289 -27183 8748 32987 6891 -28748 -18523 11690 30280
419 30280 5930 -36319 -14701 24069 23094 -897 -35720 -12653 36252 15712 -14862 -24352 -8920
432 -8920 35210 16266 -27199 -17739 1155 27416 17659 -32214 -20346 15910 23542 8352 -31300
445 -31300 -18881 26362 19905 -4908 -25267 -12767 27547 17156 -13620 -20325 -6547 25990
457 25990 16073 -20272 -19177 2256 25656 10799 -26685 -14175 12076 20458 4808 -28362 -9110
470 -9110 20795 10818 34 -21493 -11457 26594 9717 -11342 -13943 -8100 25694 11459 -23063
$$ packed form
382b5602J2218J870N0621j8331o4688L1063K4853J0698m351n9092K0737N0922
394C0918j5117j3042k9456K825N6903r106l8377r553J0670M2464j586n0396p316
407c0169L3017K7665j4546m0256k894L5931K4239k6096l5639J0225L0213J8590
419C0280k4350m2249K1618L8770r75k3991l4823K3067M8905k0540l0574r490J5432
432h920M4130j8944m3465R460J8894K6261r757m9873J1868L6256P632j5190l9652
445c1300J2419M5243o457k4813k0359J2500M0314j0391l0776o705J3778L2537
457B5990r917l6345J095K1433K3400j4857l7484J2510K6251Q382j5650l3170J9252
470i110K9905r977j0784k1527J0036L8051j6877k1059k601N843L3794j4235l4522
$$ plain form
483 -23063 -8963 3284 18294 8660 -26382 -5175 13872 7225 5633 -20426 -8436 21881 3255
496 3255 -4088 -11078 -8900 22672 6188 -16673 -6672 1700 17842 1805 -19563 -1405 6138
509 6138 13129 476 -22514 4423 10146 1946 6237 -21051 -1822 22726 -6988 -2185 -6260
522 -6260 -5874 23723 -7894 -15442 9187 -1434 13551 -5614 -23676 18435 5831 -687 3868
535 3868 -29255 11768 26247 -15307 285 -13535 -4990 34963 -10238 -18996 6399 -2401 15415
548 15415 -2239 -18539 10321 4491 2638 -5926 -14951 18404 8293 -8248 -6191 -17883 21443
561 21443 24521 -22078 -14127 -6891 15730 28601 -20011 -19909 -803 10984 25581 -18439 -16076
574 -16076 10069 -5958 21961 -6519 -29834 32359 -1626 -16609 13579 -24191 22627 27995
$$ packed form
483b3063J4100J2247J5010r634l5042K1207J9047o647j592k6059J1990L0317j8626
496C255p343o990K178L1572j6484k2861J0001Q372J6142j6037k1368J8158P543
509F138O991j2653k2990K6937N723q200M291k7288J9229K4548k9714M803m075
522f260L86K9597l1617p548K4629j0621J4985j9165j8062M2111j2604o518M555
535C868l3123M1023J4479m1554J5592j3820Q545L9953m5201q758K5395q800J7816
548A5415j7654j6300K8860n830j853q564r025L3355j0111j6541K057j1692L9326
561B1443L078m6599P951P236K2621J2871m8612J02J9106J1787J4597m4020K363
574a6076K6145j6027K7919k8480k3315O2193l3985j4983L0188l7770M6818N368
$$ plain form
586 27995 -45964 -2592 10579 7316 32241 -35042 -28145 22117 10277 27023 -21236 -41480
598 -41480 25982 10876 11667 1531 -45504 19795 25210 -20995 9916 -10819 -2895 25417 -22231
611 -22231 -10405 16131 8966 6376 -25692 -12303 16800 19391 16593 -42174 -25682 38916 10659
624 10659 10955 -17067 -47900 35211 27205 -13999 2907 -30702 6330 31953 -17209 2444 -8653
637 -8653 -1886 26443 -31827 1007 25850 -17406 21390 -24727 -32705 60490 -1682 -20333 6569
650 6569 -42792 31453 44457 -35536 -8599 -14724 4453 43463 -15948 -18387 -6466 428 32846
663 32846 -17359 -12024 16889 -18819 17528 407 -28100 34016 -738 -20472 9059 -17208
675 -17208 19201 21983 -24440 -11460 -8758 25266 21516 -29826 -1073 -11729 4707 45543 -35256
$$ packed form
586B7995p3959M3372J3171l263K4925o7283O897N0262j1840J6746m8259k0244
598d1480O7462j5106P91j0136m7035O5299N415m6205L0911k0735P924K8312m7648
611b2231J1826K6536p165k590l2068J3389K9103K591k798n8767J6492O4598k8257
624A0659K96k8022l0833Q3111q006m1204J6906l3609L7032K5623m9162J9653j1097
637h653O767K8329n8270L2834K4843m3256L8796m6117p978R3195o2172j8651K6902
650F569m9361P4245J3004p9993K6937o125J9177L9010n9411k439J1921O894L2418
663C2846n0205N335K8913l5708L6347j7121k8507O2116l4754j9734K9531k6267
675a7208L6409K782m6423J2980K702L4024l750n1342K8753j0656J6436M0836q0799
$$ plain form
688 -35256 -14931 24011 -26733 30736 7922 -44626 30164 -594 -14503 21839 -23132 10750
700 10750 14499 -24737 11190 -8919 8531 22690 -37710 9130 8782 -17506 40175 -22675 -29470
713 -29470 37128 -15582 7657 15609 -39302 16569 14184 -12880 10163 -14331 4791 7374 -10570
726 -10570 15070 -16909 2146 22107 -30588 14624 8516 -26159 33027 -13177 -22672 33267
738 33267 -16008 801 12170 -24102 16937 292 -6863 12621 -21353 14609 4883 -20398
750 -20398 28396 -20878 -9057 36999 -34286 6731 21879 -35989 26146 2718 -26635 28429
762 28429 -13020 -6182 17895 -16918 9565 -3059 -5859 17501 -20521 9389 8619 -24157 26586
775 26586 -8512 -17758 30509 -22270 -131 22992 -27655 10763 7507 -13885 14589 -11416
$$ packed form
688c5256K0325L8942n0744N7469k2814n2548P4790l0758j3909L6342m4971L3882
700A0750L749l9236L5927k0109J7450J4159o0400M6840l48k6288N7681o2850o795
713b9470O6598n2710K3239P952n4911N5871k385k7064K3043k4494J9122K583j7944
726a0570K5640l1979J9055J9961n2695M5212o108l4675N9186m6204r495N5939
738C3267m9275J6809J1369l6272M1039j6645p155J9484l3974L5962r726k5281
750b0398M8794m9274J1821M6056p1285M1017J5148n7868O2135k3428k9353N5064
762B8429m1449O838K4077l4813K6483j2624k800K3360l8022K9910p70l2776N0743
775B6586l5098r246M8267n2779K2139K3123n0647L8418l256k1392K8474k6005
$$ plain form
787 -11416 1308 8273 -12299 15205 -12136 -3857 22290 -26278 11732 12635 -30990 28204 -2914
800 -2914 -24711 30210 -15361 -2660 20130 -27623 10865 9653 -12133 13646 -17112 2463
812 2463 14577 -16797 18379 -10263 -17811 31042 -16288 -923 18548 -31292 16248 12061 -24133
825 -24133 20247 -5051 -11306 14095 -11678 7929 4872 -10301 7199 -13301 8006 14113 -17025
838 -17025 10943 -10406 -12419 32485 -11014 -8930 9709 -21055 16676 11483 -16253 8800 -12063
851 -12063 -663 15457 -9420 9888 -8852 -12410 20586 -12794 6547 15200 -30090 10176
863 10176 5619 -12334 28826 -14694 -19647 17934 -9778 12526 10561 -23462 3581 -2955 4444
876 4444 19149 -16313 -3050 -1269 -7728 23530 -4745 -9616 8137 -19466 9194 18107 -11877
$$ packed form
787a1416J2724O965k0572K7504k7341Q279K6147m8568L8010R03m3625N9194l1118
800b914k1797N4921m5571J2701K2790m7753L8488j212k1786K5779l0758J9575
812B463J2114l1374L5176k8642p548M8853m7330J5365J9471m9840M7540m187l6194
825b4133M4380k5298o255K5401k5773J9607l057j5173J7500k0500K1307O107l1138
838a7025K7968k1349k013M4904m3499K084J8639l0764L7731n193k7736K5053k0863
851a2063J1400J6120k4877J9308j8740l558L2996l3380J9341Q653m5290M0266
863A0176m557j7953M1160m3520m953L7581k7712K2304j965l4023K7043o536P399
876D444J4705l5462J3263J781o459L1258k8275m871J7753k7603K8660Q913k9984
$$ plain form
889 -11877 4306 -10127 -9464 18534 1211 1675 -4649 -15161 8434 4391 8265 3221 -22667 3951
903 3951 5942 -1510 18293 -13788 -12495 9830 -8310 15356 8851 -21085 2153 -3801 3012
916 3012 19190 -11196 -4628 -3462 -8705 21928 1425 -9984 2203 -16079 10583 16047 -12807
929 -12807 5190 -7315 -11423 18098 103 -807 2242 -16401 4609 8561 178 6566 -11198
942 -11198 -7044 5197 2771 12274 -5660 -14413 3490 922 9846 5166 -14351 -830 -34 2129
956 2129 12120 -6712 -5694 97 -3356 10120 31 -4301 3688 -9996 2198 8536 -3362 6197
970 6197 -8276 -9794 13027 163 1836 2305 -15430 4146 8204 -1390 5764 -10641 -5767 11116
984 11116 -945 1933 -1379 -7664 6257 -409 -1330 5380 -5408 266 1356 -4111 5609 268
$$ packed form
889a1877J6183j4433O63K7998j7323M64o324j0512K3595m043L874n044k5888K6618
903C951J991p452J9803l2081J293K2325j8140K3666o505k9936K3238n954O813
916C012J6178l0386O568J166n243L0633k0503j1409J2187j8282K6662N464k8854
929a2807J7997j2505m108K9521j7995r10L049j8643K1010L952q383O388j7764
942a1198M154J2241k426R503j7934q753J7903k568Q924m680j9517J3521P96K163
956B129R991j8832J018N791l453J3476j0089m332P989j3684J2194O338j1898R559
970F197j4473j518K2821j2864J673M69j7735J9576M058r594P154j6405M874J6883
984A1116j2061K878l312o285J3921o666r21O710j0788N674J090n467R720n341
$$ plain form
998 268 -2015 1038 -6011 2883 6025 -1578 -1607 -6122 1876 7497 -2326 -661 -3574 -2066 7552 -1708
1014 -1708 -1125 762 -5927 6403 2167 -6622 4192 -1965 68 4583 -7863 2816 5201 -5763
1028 -5763 2872 -2129 -2156 7433 -4024 -1517 2187 -4550 5925 1472 -6648 2356 -461 1893 3214
1043 3214 -6839 624 4067 -1394 1195 -2490 -1212 3373 -170 -60 -1577 -1220 2485 731 111
1058 111 -2791 -878 4826 -1941 -1502 1196 -2126 4080 -964 -4378 4930 -1909 -306 3891 -6367
1073 -6367 2049 3452 -3786 4381 -4012 -3397 8846 -3641 -1842 2716 -5296 5608 1342 -6596
1087 -6596 5066 -1897 -2014 6045 -4779 -880 3618 -3196 2649 -483 -3871 4434 360 -2984 741
1102 741 -129 981 953 -1670 -1107 1543 610 -1022 1514 -1821 -1840 4698 -1606 -1881 2413 -3558 3555
$$ packed form
998B68k283L053p049Q894L142p603k9m515P998N621r823J665k913J508R618r260
1014a708N83J887o689J2330m236q789J0814o157K033M515j2446J0679K385j0964
1028e763Q635n001k7R589j1457K507L704o737J0475m453q120R004k817K354J321
1043C214j0053P463L443n461K589l685J278M585l543J10j517L57L705j754o20
1058A11k902J913N704o767M39K698l322O206n044l414R308o839J603M197j0258
1073f367Q416J403p238Q167q393O15J2243j2487J799M558q012J0904m266p938
1087f596J1662o963j17Q059j0824L899M498o814N845l132l388Q305m074l344L725
1102G41q70J110k8k623N63K650r33j632K536l335j9O538o304k75M294n971P113
$$ plain form
1119 3555 1871 -7058 5178 334 -4377 6449 -4837 -1209 6658 -7043 3209 2894 -8319 7513
1133 7513 93 -6267 6628 -4491 246 6434 -8530 2636 4160 -6329 4947 -761 -4292
1146 -4292 5693 -2541 -1147 3808 -4397 734 3826 -3167 -655 1801 -1069 839 1078 -3338 1665
1161 1665 2897 -4773 2425 1855 -5704 5651 -397 -5293 7017 -5095 -800 8633 -10380 2756
1175 2756 6404 -10070 7986 -917 -8249 12199 -6945 -3249 11283 -11473 3285 6962 -11576
1188 -11576 8179 -271 -7731 11289 -6647 -3788 10185 -7614 1262 4311 -7607 5497 1223
1201 1223 -5627 4989 -1347 -3316 4604 -392 -3195 2221 146 -2222 3898 -1917 -3784 7237
1215 7237 -4234 -3095 8763 -7996 1197 7020 -11426 7956 1905 -11554 13972 -6087 -7548
$$ packed form
1119C555j684q929J2236m844m711J0826j1286L628P867j3701J0252l15j1213J5832
1133G513p420o360J2895j1119M737O188j4964J1166J524j0489J1276n708l531
1146d292R985q234J394M955q205N131L092o993K512K456k870J908K39m416N003
1161A665J232p670P198n70p559J1355o048m896J2310j2112M295R433j9013J3136
1175B756L648j6474J8056q903p332K0448j9144L696J4532k2756J4758L677j8538
1188a1576J9755q450p460J9020j7936K859J3973j7799Q876L049j1918J3104m274
1201A223o850J0616o336j969P920m996k803N416k075k368O120n815j867J1021
1215G237j1471J139J1858j6759R193N823j8446J9382o051j3459K5526k0059j461
$$ plain form
1228 -7548 15739 -12253 1530 10296 -17188 11995 3228 -15795 16758 -6586 -8094 17055 -13644
1241 -13644 1548 10781 -16085 10397 3205 -13672 12677 -3329 -5841 10411 -8251 512 6860
1254 6860 -7902 3061 2843 -5148 2635 1499 -2654 751 1790 -2963 1477 2823 -6740 5106
1268 5106 2932 -10009 9167 -1551 -7805 13816 -10398 -2440 14580 -17031 7816 8923 -20537
1281 -20537 16158 -942 -13772 21052 -14622 -4005 19905 -20826 8160 9620 -20771 17316
1293 17316 -2944 -12492 20152 -13918 -2031 15547 -17747 7828 6666 -14468 12222 -3396
$$ packed form
1228g548K3287k7992J3783Q766k7484K9183q767j9023L2553k3344j508K5149l0699
1241a3644J5192R233k6866K6482p192j6877K6349j6006k512J6252j8662Q763O348
1254F860j4762J0963k18p991P783j136m153L405J039m753M440J346r563J1846
1268E106k174j2941J9176j0718o254K1621k4214P958J7020l1611K4847J107k9460
1281b0537L6695j7100j2830L4824l5674J0617K3910m0731K8986J460l0391L8087
1293A7316k0260r548L2644l4070J1887J7578l3294K5575j162k1134K6690j5618
$$ [...]
8191a30
##END NTUPLES=NMR FID
##END=
