##TITLE=1H_LY-877.24
 CCl4, 8 sc, 
 12.11.2019
##JCAMPDX= 6.0         $$ Bruker NMR JCAMP-DX V2.0
##DATA TYPE= NMR FID
##DATA CLASS= NTUPLES
##ORIGIN= UXNMR, Bruker Analytische Messtechnik GmbH
##OWNER= root
$$ XWIN-NMR		Version 3.5
$$ Tue Nov 12 14:33:57 2019 Russian Standard Time (UT+4h)  she@DPX200
##.OBSERVE FREQUENCY= 200.131
##.OBSERVE NUCLEUS= ^1H
##.DELAY= (6, 6)
##.ACQUISITION MODE= SIMULTANEOUS
##.ACQUISITION SCHEME= undefined
##.AVERAGES= 8
##.DIGITISER RES= 18
##SPECTROMETER/DATA SYSTEM= spect
##.PULSE SEQUENCE= zg30
##.SOLVENT NAME= DMSO
##.SHIFT REFERENCE= (INTERNAL, DMSO, 0, 15.7039)
##AUDIT TRAIL= $$ (NUMBER, WHEN, WHO, WHERE, WHAT)
$$ ##TITLE= Audit trail, XWIN-NMR		Version 3.5
$$ ##JCAMPDX= 5.01
$$ ##ORIGIN= Bruker BioSpin GmbH
$$ ##OWNER= she
$$ F:/spectra/data/she/nmr/H-F/1/audita.txt
$$ ##AUDIT TRAIL=  $$ (NUMBER, WHEN, WHO, WHERE, WHAT)
(   1,<2019-11-12 14:32:55.42 +0400>,<she>,<DPX200>,
      <created by zg, POWCHK disabled, PULCHK disabled
       configuration hash MD5:
       00 E9 B6 7A A2 85 ED C7 34 08 36 98 17 FE 4E 26
       data hash MD5: 16K
       8E D7 9E 78 5E F2 50 80 61 62 83 85 C6 78 CE F4>)
$$ ##END=
$$ 
$$ hash MD5
$$ 57 59 7D 32 CD 10 74 05 D8 62 22 95 68 42 BA 0C
##$RELAX= 
##$RELAX= 
##$RELAX= 
##$RELAX= 
##$RELAX= 
##$RELAX= 
$$ Bruker specific parameters
$$ --------------------------
##$DU= <F:/spectra>
##$EXPNO= 1
##$NAME= <H-F>
##$PROCNO= 1
##$TYPE= <nmr>
##$USER= <she>
##$AMP= (0..31)
100 100 100 100 100 100 100 100 100 100 100 100 100 100 100 100 100 100 
100 100 100 100 100 100 100 100 100 100 100 100 100 100 
##$AQSEQ= 0
##$AQ_mod= 1
##$AUNM= <au_zg>
##$AUTOPOS= <>
##$BF1= 200.13
##$BF2= 200.13
##$BF3= 200.13
##$BF4= 200.13
##$BF5= 200.13
##$BF6= 200.13
##$BF7= 200.13
##$BF8= 200.13
##$BYTORDA= 1
##$CFDGTYP= 0
##$CFRGTYP= 5
##$CHEMSTR= <none>
##$CNST= (0..31)
1 1 145 1 1 1 1 1 1 1 1 1 1 1 1 1 1 1 1 1 1 1 1 1 1 1 1 1 1 1 1 1 
##$CPDPRG= <>
##$CPDPRG1= <>
##$CPDPRG2= <>
##$CPDPRG3= <>
##$CPDPRG4= <mlev>
##$CPDPRG5= <mlev>
##$CPDPRG6= <mlev>
##$CPDPRG7= <mlev>
##$CPDPRG8= <mlev>
##$CPDPRGB= <>
##$CPDPRGT= <>
##$D= (0..31)
0 1.2 0 0 0 0 0 0 0 0.06 0 0.03 0 0 0 0 0.0002 0 0 0 0 0 0 0 0 0 0 0 0 
0 0 0 
##$DATE= 1573554774
##$DBL= (0..7)
120 120 120 120 120 120 120 120 
##$DBP= (0..7)
150 150 150 150 150 150 150 150 
##$DBP07= 0
##$DBPNAM0= <>
##$DBPNAM1= <>
##$DBPNAM2= <>
##$DBPNAM3= <>
##$DBPNAM4= <>
##$DBPNAM5= <>
##$DBPNAM6= <>
##$DBPNAM7= <>
##$DBPOAL= (0..7)
0.5 0.5 0.5 0.5 0.5 0.5 0.5 0.5 
##$DBPOFFS= (0..7)
0 0 0 0 0 0 0 0 
##$DE= 6
##$DECBNUC= <off>
##$DECIM= 24
##$DECNUC= <off>
##$DECSTAT= 4
##$DIGMOD= 1
##$DIGTYP= 9
##$DL= (0..7)
0 120 120 120 120 120 120 120 
##$DP= (0..7)
150 150 150 150 150 150 150 150 
##$DP07= 0
##$DPNAME0= <>
##$DPNAME1= <>
##$DPNAME2= <>
##$DPNAME3= <>
##$DPNAME4= <>
##$DPNAME5= <>
##$DPNAME6= <>
##$DPNAME7= <>
##$DPOAL= (0..7)
0.5 0.5 0.5 0.5 0.5 0.5 0.5 0.5 
##$DPOFFS= (0..7)
0 0 0 0 0 0 0 0 
##$DQDMODE= 0
##$DR= 18
##$DS= 0
##$DSLIST= <SSSSSSSSSSSSSSS>
$$ [...]
##$SUBNAM2= <"">
##$SUBNAM3= <"">
##$SUBNAM4= <"">
##$SUBNAM5= <"">
##$SUBNAM6= <"">
##$SUBNAM7= <"">
##$SUBNAM8= <"">
##$SUBNAM9= <"">
##$SW= 24.0690132163818
##$SWIBOX= (0..15)
0 0 2 0 0 0 0 0 0 0 0 0 0 0 0 0 
##$SW_h= 4816.95568400771
##$TD= 16384
##$TD0= 1
##$TE= 0
##$TE2= 300
##$TE3= 300
##$TEG= 300
##$TL= (0..7)
0 120 120 120 120 120 120 120 
##$TP= (0..7)
150 150 150 150 150 150 150 150 
##$TP07= 0
##$TPNAME0= <>
##$TPNAME1= <>
##$TPNAME2= <>
##$TPNAME3= <>
##$TPNAME4= <>
##$TPNAME5= <>
##$TPNAME6= <>
##$TPNAME7= <>
##$TPOAL= (0..7)
0.5 0.5 0.5 0.5 0.5 0.5 0.5 0.5 
##$TPOFFS= (0..7)
0 0 0 0 0 0 0 0 
##$TUNHIN= 0
##$TUNHOUT= 0
##$TUNXOUT= 0
##$USERA1= <user>
##$USERA2= <user>
##$USERA3= <user>
##$USERA4= <user>
##$USERA5= <user>
##$V9= 5
##$VALIST= <valist>
##$VCLIST= <CCCCCCCCCCCCCCC>
##$VD= 0
##$VDLIST= <DDDDDDDDDDDDDDD>
##$VPLIST= <PPPPPPPPPPPPPPP>
##$VTLIST= <TTTTTTTTTTTTTTT>
##$WBST= 1024
##$WBSW= 4
##$XGAIN= (0..3)
0 0 0 0 
##$XL= 0
##$YL= 0
##$YMAX_a= 476979
##$YMIN_a= -508891
##$ZGOPTNS= <>
##$ZL1= 120
##$ZL2= 120
##$ZL3= 120
##$ZL4= 120
##$ABSF1= 10
##$ABSF2= 0
##$ABSG= 5
##$ABSL= 3
##$ALPHA= 0
##$AQORDER= 0
##$ASSFAC= 0
##$ASSFACI= 0
##$ASSFACX= 0
##$ASSWID= 0
##$AUNMP= <proc_1d>
##$AZFE= 0.1
##$AZFW= 0.1
##$BCFW= 1
##$BC_mod= 2
##$BYTORDP= 1
##$COROFFS= 0
##$CY= 11.3945322036743
##$DATMOD= 1
##$DC= 2
##$DFILT= <>
##$DTYPP= 0
##$F1P= 19.5091578491511
##$F2P= -0.509923556040331
##$FCOR= 0.5
##$FTSIZE= 0
##$FT_mod= 4
##$GAMMA= 1
##$GB= 0.15
##$INTBC= 1
##$INTSCL= 1
##$ISEN= 128
##$LB= 0.24
##$LEV0= 0
##$LPBIN= 0
##$MAXI= 10000
##$MC2= 0
##$MEAN= 0
##$ME_mod= 0
##$MI= 1.114404
##$NCOEF= 0
##$NC_proc= 0
##$NLEV= 6
##$NOISF1= 3.799351
##$NOISF2= 2.8
##$NSP= 1
##$NTH_PI= 0
##$NZP= 0
##$OFFSET= 15.70392
##$PC= 1
##$PHC0= -9609.373
##$PHC1= 12.20088
##$PH_mod= 1
##$PKNL= yes
##$PPARMOD= 0
##$PSCAL= 0
##$PSIGN= 0
##$REVERSE= no
##$SF= 200.130013532006
##$SI= 16384
##$SIGF1= 3
##$SIGF2= 2
##$SINO= 400
##$SIOLD= 16384
##$SREGLST= <1H.CDCl3>
##$SSB= 0
##$STSI= 0
##$STSR= 0
##$SW_p= 3612.71676300578
##$SYMM= 0
##$S_DEV= 0
##$TDeff= 0
##$TDoff= 0
##$TI= <>
##$TILT= no
##$TM1= 0
##$TM2= 0
##$TOPLEV= 0
##$USERP1= <user>
##$USERP2= <user>
##$USERP3= <user>
##$USERP4= <user>
##$USERP5= <user>
##$WDW= 1
##$XDIM= 8192
##$YMAX_p= 0
##$YMIN_p= 0
$$ End of Bruker specific parameters
$$ ---------------------------------
##NTUPLES= NMR FID
##VAR_NAME=  TIME,          FID/REAL,        FID/IMAG
##SYMBOL=    X,             R,               I
##VAR_TYPE=  INDEPENDENT,   DEPENDENT,       DEPENDENT
##VAR_FORM=  AFFN,          ASDF,            ASDF
##VAR_DIM=   8192,          8192,            8192
##UNITS=     SECONDS,       ARBITRARY UNITS, ARBITRARY UNITS
##FACTOR=    0.0002076,     1,               1
##FIRST=     0,             0,               0
##LAST=      1.7004516,     0,               0
##MIN=       0,             -508891,         0
##MAX=       1.7004516,     476979,          0
$$ Real data points
##PAGE= N=1
##DATA TABLE= (X++(R..R)), XYDATA
$$ [...]
2624H75N035j0007M930j703k326J0091q377k711O751m772N686j378q820Q529M91
$$ 875 5910 -4097 833 -870 -3196 6895 -1482 -4193 2558 -2214 3472 2094 -6726 1803 2294
2639B294k819K497o173L654M681n035Q49j551J41M947k917k242J06J451L173k912
$$ 2294 -525 1972 -4201 -547 4134 -901 -52 -1603 -1462 3485 568 -1674 -1568 -117 3056 144
2655A44j970K99K217K751n020k44K342j585M705m011l969P203l691J476K571r644
$$ 144 -1826 -1527 690 3441 -1579 -1823 519 -1066 3639 -372 -4341 2862 -829 647 3218 -6426
2671f426P668L117p813O145n066m23R724r850J013M739o962Q220k564o854Q683
$$ -6426 1242 4359 -3454 2691 -2375 -2798 6926 -2924 -1911 2828 -4134 4086 1522 -5332 3351
2686C351m697J249M460j0075N997L268o270N336m472q87P688o286o8K850l604
$$ 3351 -1346 -97 4363 -5712 285 3553 -2717 2619 -1853 -2740 4948 -1338 -1406 1444 -2160
2701b160L869m43l192J804m7J347r35j202O04m48L310k628k747N007k877P50K202
$$ -2160 1709 1266 -1926 -122 -169 1178 243 -959 -355 -803 2507 -121 -2868 2139 -738 12 2214
2718B214n831M991P8m117N914n306L88N752p267M476m4n706R327n791k717Q983
$$ 2214 -3617 1374 1452 -2665 3249 -2057 -1669 4083 -3184 1292 1248 -4458 4869 -922 -3639 5344
2734E344r052L509M546j0043Q737j406o876J0202o021j744P105p529L614J947
$$ 5344 -3708 -199 4347 -5696 3041 1635 -5241 4961 -1060 -2804 4301 -3228 386 2333
2748B333n414N487k953j190M551m519K025J52k341M593l748m65L547l221J902
$$ 2333 -3081 2406 -547 -1737 2814 -1705 320 472 -1869 2724 -1024 -1489 2058 -1163 739
2763G39p86j509L192j983R02j003j586M550l117J053O88o243Q330k97o966O762
$$ 739 -47 -1556 1636 -347 555 -448 -2034 2516 -601 452 1140 -5103 3227 2930 -4036 2726
2779B726n437J020Q302j0647L123L763p176Q364l386n075Q152n360J836K229p561
$$ 2726 -2711 -1691 6611 -4036 -913 2850 -4326 4038 652 -4423 3729 -1631 205 2434 -5127
2794e127Q485j230n807N934n625M238N373j1509M115K239l145Q030o680m835O894
$$ -5127 3358 2128 -3679 2255 -3370 868 6241 -5268 -1153 1086 -2059 5971 -709 -5544 1350
2809A350r87K722j953n737M024J829J390k599l728N604j836o64K662n604N437
$$ 1350 363 3085 1132 -4605 -581 1248 2638 39 -3689 1915 79 -585 2077 -3527 1910
2824A910J102p406N054j157J091M779r887Q48N066O8M620r834k769R734k710M241
$$ 1910 3012 -4394 660 -497 594 5373 -4514 -3666 1400 1468 6088 -3746 -6515 3219 509 4750
2840D750m047r992J2195l28l358N600j1074M057Q540r581L971K76l705O733o539
$$ 4750 703 -9289 2906 2578 -780 4820 -6254 -2197 6343 -3238 733 1009 -2696 4037 -2502
2855b502q49P187k827J006n327k081R915j511j192l529o625J1156L726o089j254
$$ -2502 -3351 3836 1009 2015 -3312 -5393 4522 3011 1819 -1710 -8335 2821 6547 458 -796
2870g96o127O143Q012o424k195k099K065N575m584Q61p44j976N817o169M36P730
$$ -796 -6923 -780 7232 808 -1387 -3486 -1421 4154 -430 431 -313 -2289 3528 -2641 -2205 5525
2886E525o930J963j863n626J3715j593q917K068m302Q852N891j1462l77j168L719
$$ 5525 -1405 558 -1305 -6931 6784 5191 -3726 -1658 -5960 2892 8783 -2679 -3056 -4224 -505
2901e05R126r166k632J633j834R773m955o308P647m730J425L334o469O755m82
$$ -505 8621 -545 -3177 -1544 -3378 6395 1440 -4868 2779 -1951 -526 2808 -3661 3094 2612
2916B612p231M122m37L680J892q295J98J492N084L856j0413j168L497J570O997
$$ 2612 -4619 -497 -934 2746 4638 -3657 -3459 -1967 3117 6973 -3440 -4608 -1111 459 7456
2931G456q408n203P321k006L678K8p701N538m37j209L734n235L660O94o217N447
$$ 7456 -952 -6155 1166 -840 2838 2866 -4835 703 266 -943 2791 -2444 1216 1910 -4307 1140
2947A140j416J432L766j1114L591O237m135N209o669m851J0462k393K71K14p948
$$ 1140 -276 1156 4922 -6192 -2601 3636 -499 4710 -1959 -6810 3652 1259 1530 1744 -6204
2962f204O478K816l190J839n052K799L189m800L804j742j370M043n626K725L493
$$ -6204 274 3090 -100 1739 -3313 -514 2675 -2125 1679 -63 -1433 2610 -3016 -291 3202
2977C202m969L274k766j821O456k797l71q64k915O430j385k167J362m304N464
$$ 3202 -1767 1507 -1259 -3080 3376 579 208 -656 -3571 2859 1474 -693 669 -3635 1829
2992A829M58n192N432m154k62O103o996K906K215n791O011k802k414O494n494
$$ 1829 2287 -2905 2527 -1627 -1889 4214 -2782 124 2339 -3452 2559 -243 -2657 3837 -1657
3007a657P63K324m013N510k928k915N586m284K117J691n947N452q81k838M901
$$ -1657 -894 1430 -2583 2927 -1 -2916 2670 -1614 503 2194 -3753 1699 818 -2020 2881
3022B881n043R51M226m620K050n05j399L826l289L74J407j864K604k808K49L374
$$ 2881 -2162 -1211 3015 -1605 445 -60 -1459 2367 -922 -548 859 -1005 1599 -1209 -960 2414
3038B414m073K424m48l142N771k602j776K657m253M691J301n749L235j698J303
$$ 2414 -1659 765 317 -2825 2946 344 -1432 1225 -3028 1663 2964 -2785 450 -1248 55
3053E5L757o739K699J252l413N928m291j958O026n435K469J649n904O713j342
$$ 55 3812 -2927 -228 1024 -2389 3539 -752 -2710 3316 -2119 350 1999 -3905 2808 1466
3068A466m791M849k711K081K192o681K961J562q03K680n123L54L324j478K746
$$ 1466 -3325 1524 -1187 894 3086 -3595 -634 928 125 2805 -2318 -1964 1360 -118 2628
3083B628l622k397N337j493K16n11k944M554q10k136J657j809K777m48l198L002
$$ 2628 -994 -3391 1946 453 669 158 -2786 1768 958 -1178 479 -1330 1447 999 -2199 803
3099H03j652J715J800o384L325J812j870L538n830l83O924m115Q20m03l933O676
$$ 803 -849 866 2666 -3718 -393 1419 -451 3087 -2743 -3126 3798 -317 503 100 -3833 2843
3115B843j508k903K806m056L727K100n660L116r29n8L971o240J218M109l387K285
$$ 2843 1335 -1568 1238 -2818 909 3009 -2651 465 -464 -522 3449 -2791 -1573 2536 -851 1434
3131A434k220j897N402k355q03N16k406L986k6k471N19j765L830M16m331K145
$$ 1434 -786 -2683 2719 364 -439 77 -2329 1657 1631 -840 -321 -2086 1744 2160 -2171 -26
3147b6q21J447K062n243J912J800j863L008l444q98M007k306J500j307k949N691
$$ -26 -847 600 2662 -2581 -669 1131 -732 2276 -1168 -2066 1941 -365 1135 -172 -3121 2570
3163B570j937j775K105l553M152P13n251L853j099o49L888m911P60K585k335K866
$$ 2570 633 -1142 963 -2590 1562 2275 -2976 877 -222 -871 3017 -1894 -1134 1451 -884 1982
3179A982k599k059M567j606K58o24k465M371r43j860J814k855K521J489l515K105
$$ 1982 -617 -2676 1891 285 543 -81 -2546 1825 882 -978 836 -2019 502 1991 -1524 581
3195E81j411K18L057l772O95J083j077K650l351j14L444k926J878p05k864M810
$$ 581 -830 -612 2445 -1327 -632 451 -626 2024 -1327 -1441 2003 -923 955 250 -2614 2196
3211B196k037j048K515m365L173K125m379K353j402P7L642m363Q29J644k371L263
$$ 2196 159 -889 1626 -2739 434 2559 -1820 533 -869 -792 2850 -1513 -684 960 -1411 1852
3227A852k042j487L323k701J571P06l760L467Nj695J701k571J811J621k958J300
$$ 1852 -190 -1677 1646 -1055 516 1222 -2538 929 934 -761 940 -1631 180 1801 -1157 143
3243A43p80M83J760k699J252k52j049L410k898n81K259k333K828r66l206M248
$$ 143 -637 -154 1606 -1093 159 -93 -1142 2268 -630 -1211 1048 -1285 1543 577 -2629 1619
3259A619j634n29K049l652K823N53l035L536k843r5L924m332J658P50k942M786
$$ 1619 -15 -544 1505 -2147 676 1229 -1806 1730 -1113 -1208 2716 -1616 42 792 -2150 2636
3275B636k675k311M310k900J078J345l790L219l44j668K770k973P72J858k036
$$ 2636 -39 -2350 1960 -940 138 1483 -2307 912 568 -1100 1670 -1303 -531 1327 -709
3290g09J488j435l34K895k563L73N24j190K389j755m50J656k019K022m28j774
$$ -709 779 -656 -990 1905 -658 -285 239 -951 1438 -317 -767 889 -1130 892 464 -1310
3306a310K323j941J378R86l837L253k3k158L102l372J077K939m559K946l8l110
$$ -1310 1013 -928 450 1436 -2401 852 829 -1329 1773 -1599 -522 2417 -2142 804 766 -2344
3322b344M681k718r53L383m230L054R13m663M257j103j468L355m023J615K171
$$ -2344 2337 -381 -1334 2049 -2181 873 1786 -2877 1380 277 -1191 2164 -1859 -244 1927
3337A927l766K814p46j830L222k122K96R12k255K708p46j533J697j309J559l14
$$ 1927 -1839 975 229 -1601 1621 -501 -205 707 -1548 1160 414 -1119 578 -731 828 514
3353E14j912K137j098L11R77k166J861p53n75K560l350J182J838l181L171j758
$$ 514 -1398 739 -359 -48 929 -1237 624 -129 -704 1856 -1494 -312 1526 -1655 1516 -242
3369b42j666M701m162L98L203m478L318n7l535M561k682l30L498m805K215J473
$$ -242 -1908 2793 -1369 -971 2232 -2246 1072 1015 -2520 2041 -641 -971 2527 -2278 -63 1410
3385A410k999L578k940q23M382l959J365J290l687L581o77j853L047k699M12J918
$$ 1410 -1589 1989 -951 -1774 2608 -1351 14 1304 -2383 1198 521 -1332 1715 -984 -572 1346
3401A346k315J269j63j78M84j643J754n3q04J252k646J787J445k851K588j660
$$ 1346 -969 300 137 -41 443 -1200 554 501 -303 949 -1697 90 1535 -1316 1272 -388
3417c88j555L915k202L40O81l155L832q98j920L285l598J548J939m332M463j218
$$ -388 -1943 1972 -230 110 791 -2364 1468 570 -1350 1935 -1663 -115 1824 -2508 1955 737
3433G37l663N454l659m5M455n428J978J317l686M928j512l026K934j832J732Q57
$$ 737 -2926 2528 -1131 -1176 3279 -2149 -171 1146 -2540 2388 876 -2150 784 -1048 684 1541
3449A541l038J931j224L11K501k939J061n0j706L258j617p06J838k199P20N97
$$ 1541 -1497 434 -790 -479 2022 -917 144 94 -1612 1646 29 -677 1161 -1038 -318 279
3465B79j12J076k490Q37N29p83L101l282o40K975l569L420J117n774M070n11j715
$$ 279 167 1243 -1247 -410 119 -664 2437 -845 -1485 1490 -2079 1341 2458 -3316 754 243 -1472
3482a472M602m430n0L176l940L142J84k793L044k935J108K649m139L113q57l233
$$ -1472 3130 -1300 -1350 1826 -2114 1028 1212 -1581 1463 -1472 -364 2285 -1854 1259 402 -2831
3498b831N009k246n11K704m921K480K661l471J943j102j114K331q45O05q43q76
$$ -2831 2178 -68 -579 2125 -2796 -316 2345 -1126 817 -285 -1399 932 87 692 -151 -1027
3514a027J573j233J690l52k511L281j975p70L700l325O61J046k734L447r47j663
$$ -1027 546 -687 1003 651 -1860 1421 -554 -1324 2376 -949 -288 758 -1976 1471 524 -1139
3530a139K287k756J926R25k628L091k888l24M543m705J564J902m720M567q23l128
$$ -1139 1148 -1608 318 1243 -1385 1706 -1182 -1506 3037 -1668 -104 1798 -2922 1645 822 -2306
3546b306M877l401p19L659l323J631K79k170K499j594N24J274k607K047q25o11
$$ -2306 2571 -830 -1549 2110 -1213 418 697 -1473 1026 -568 -44 1230 -1377 670 -155 -766
3562g66K800l461R19K149l162K141k49j535K351j851N21R19j757J915j373J00
$$ -766 2034 -1427 -508 1641 -1521 620 371 -1164 1187 -664 -143 776 -981 934 -439 -339
3578c39J576l006K869k43l331M443k099j275L682m311J935K297m485L255m84k180
$$ -339 1237 -1769 1100 857 -2474 1969 -130 -1405 2277 -2034 -99 2198 -2287 968 484 -1696
3594a696L546k481L02J112k299L022j315j640K886k564J595Q41l646L601q07k060
$$ -1696 1850 -631 -329 783 -1516 1506 191 -1449 1437 -1127 468 1309 -2337 1264 457 -1603
3610a603L315k479J93J888k421J648o39o61K031j965Q33j80r94L061k920k12K892
$$ -1603 1712 -767 -574 1314 -1107 541 -98 -759 1272 -693 140 -40 -1034 2027 -893 -1105 1787
3627A787l353K301M60l569L934j482j304L255l542J080K022k648J895j538j72
$$ 1787 -1566 735 1195 -2374 1560 78 -1226 2029 -1513 -433 1589 -1059 836 -702 -874
3642h74K940l163J116O65k471L633j816j493L196l235J502J944l796K231J18j422
$$ -874 2066 -1097 19 684 -1787 1846 30 -1463 1733 -1502 0 1944 -1852 379 497 -925
3658i25K145k179Q64J282k017J218j126P32J668l015J607j59j685M016k323j616
$$ -925 1220 -959 -95 1187 -830 388 -738 -6 1662 -1353 254 95 -1590 2426 103 -1513
3674a513K275k307K760M55l899K533n27O9K006l256J455K78j760L354k418n56
$$ -1513 762 -1545 1215 1670 -2229 304 -223 -154 1852 -1404 51 329 -1431 1923 -495 -1051
3690a051K843l467J888Q22k898M058k062k694L725j370J125M21l797K190P12J25
$$ -1051 1792 -1675 213 1035 -1863 2195 133 -2561 1164 -206 919 1340 -2457 -267 445 570
3706E70J288l576M56J675j74J960l211j037L270j595J253j72k452K662j086o28
$$ 570 1858 -1718 -1262 413 239 2199 -1012 -2049 1221 -374 879 707 -1745 917 -169 -797
3722g97K074j790J104m61j897K449n32Q56K29m443K863J910j185J536m448K19
$$ -797 1277 -513 591 130 -1767 682 150 1006 1235 -3208 -345 1565 380 1916 -2532 -2313
3738b313M918k334P45j167l139M615j15j234P96l079K625J133k764K271j194j3
$$ -2313 2605 271 1016 -151 -3290 1325 1210 -24 772 -2307 318 1451 -1313 958 -236 -249
3754b49J605l804K571K121k876J116k137J9M532k035j229q90j124M508R1k797
$$ -249 1356 -2448 123 2244 -632 484 -1653 -1634 2898 863 -366 -1256 -2380 2128 2219 -578
3770e78p02q13L584O21l120P54r51J346J741l056J127N60j244J843k136L22K705
$$ -578 -1280 -2093 1491 2112 -1008 -254 -1205 141 1882 -1174 -47 513 -731 1112 -1024 -702 2003
3787B003k094o2j260L02M263k635j937M95o17M355j067m171K116p81J802K348
$$ 2003 -91 -153 -1413 -1111 3152 517 -1420 -925 -1542 2813 1746 -2425 -309 -1090 712 3060
3803C060n117Q44J858q46K095l044n46L565k076J64k40j021L595k131j907K035
$$ 3060 -2057 -1213 645 -201 1894 -1150 -1696 1869 -207 -43 -283 -1304 2291 160 -1747 288
3819B88j154K483jm233K047R54O04P66l936O61K805k54k31k516O94K486j198K23
$$ 288 -866 1617 1616 -2617 -570 384 988 1754 -2182 -1521 1284 1030 799 -1717 -1023 1463 265 488
3837D88j486k00L056j819o42N41j251L240j115k982K340j02J027j51l514K737
$$ 488 -998 -1198 1858 39 -603 -62 -1313 1927 812 -2170 170 68 1095 944 -2570 167
3853A67R91j230J177l161J436K936l070J043q37j249M533k387k197K264j123K088
$$ 167 1158 -72 1105 -2056 -620 2316 -754 289 -548 -1797 2736 349 -1848 416 -707 1381
3869A381k46l627K727N19o32O55k470J556J339j521P82j535N05K428k240k92L90
$$ 1381 1135 -2492 235 754 122 777 -1693 -137 1202 -319 463 -1072 -567 1861 -379 -671 -281
3886b81p8K142k022j378J826K32P41j683j066K198m09O76p90k301L101j06j114
$$ -281 -359 1783 -239 -1617 209 441 1182 -501 -1567 631 222 898 108 -2193 908 802 -312
3903c12J150k761K027K134l715J392K44p17K533l190p1K864j959J087r85j726
$$ -312 838 -1923 104 2238 -1477 -85 159 -558 1975 -1215 -1286 1578 -381 706 -279 -2005
3919b005L693j079j009O88k472L204J122l558J097k55O26K024l286O3J982p38
$$ -2005 1688 609 -400 288 -2184 1020 2142 -1416 -319 -574 52 2076 -1210 -1147 835 97
3935I7P25j446l27J806m95j8j224j52K568r95q69m95l29L177j148k494J192j00
$$ 97 822 -624 -951 855 360 342 -882 -1034 1534 539 -330 -825 -1154 2023 875 -1619 -427 -527
3953e27J838j02l212J779M74J73J153l522J079K488j925J242k041o89M570k659
$$ -527 1311 1209 -2003 -224 250 423 1576 -1946 -867 1621 -304 938 -1103 -1792 2778 119
3969A19j440J527j464L060n85l729K661J61J51J066l655J253K271r71M17k412
$$ 119 -1321 206 -1258 1802 1217 -2512 149 310 461 1527 -2128 -875 1396 425 842 -1570
3985a570K04L453j526j092m14J29K714j288j928Q07L28J575r25j870R27N46J494
$$ -1570 -1366 2087 561 -531 -945 -816 1898 610 -1318 -511 -183 1392 467 -1403 -476 70 1564
4002A564j110k601K180P32J54l86l101K672J966k477N92j581N94L433l064m92
$$ 1564 454 -2147 33 765 919 533 -2568 104 2070 -407 185 -1396 -802 2631 -433 -925
4018i25R39j225L375j495l115K908l56Q06K53l878K743J749k173R72k036O32L107
$$ -925 14 -1211 2164 669 -2446 462 106 912 1165 -2713 30 1779 -394 578 -1458 -826 2281
4035B281k510k84J98n91K751j348j894J142J74J431q54k255J671O78R2n83j590
$$ 2281 -229 -513 -315 -906 1845 497 -1397 -255 -81 1350 496 -1759 -88 590 682 99 -1491
4052a491J612O31m94L3j711J554J071j391M36j465R77K314k811J01P25q39K570
$$ -1491 121 752 258 291 -1420 134 1205 -186 250 -1215 -238 2076 -735 -634 91 -748 1822
4069A822k006j387K612j498R03M92k887K424K39j209J572k532J009K317k709Q45
$$ 1822 -184 -1571 1041 -457 446 938 -1949 475 714 -495 1077 -1455 -446 1871 -838 7
4085GL9j054K678j950p63J878j494J085K49j777J374k22M0N24j519Q41M74l33
$$ 7 46 -1008 1670 -280 -1043 835 -659 426 675 -1102 272 50 90 614 -905 -64 410 77
4103G7K70j236J043M76j249J227r19k49J516j452P12Q7j467K140q51q26J327j474
$$ 77 347 -889 154 630 -619 608 -311 -560 956 -496 216 303 -1164 976 125 -701 626 -848
4121h48J342K81k104K176r42o75K267k340M39J270j939K107p55j873K713j107
$$ -848 494 775 -1329 847 -95 -770 1497 -843 -404 866 -1073 1034 279 -1594 1119 12
4137A2k90R63j887J694J93j395J266j149M09J128j472O72m30j94J786j626m36
$$ 12 -278 685 -1202 492 685 -710 556 -593 -184 944 -528 144 -286 -480 1306 -320 -756
4154g56J007l68R61r71q64J517n11M58m39j118J756n08m3M17k087J954Q67k139
$$ -756 251 -117 844 -127 -991 526 15 473 34 -1084 672 164 121 538 -1549 405 1272 -867
4172h67J209j056M07K146k909M35J413j452J718j136j249K319j060L10J97k167
$$ -867 342 -714 -307 1839 -1070 -635 778 -674 1044 -92 -1341 978 -82 228 425 -1742
4188a742K389M33j556O94j506J392J749k745M00M36k79J661j597o47J185l86Q50
$$ -1742 647 1080 -476 218 -1288 104 1853 -892 -492 -56 -335 1326 -271 -918 267 -119 731
4205G31p92q42J323k11J86p73o91K328o30j200L91p83K093L7k475J076j99P46
$$ 731 -61 -903 420 209 395 -378 -1069 1259 629 -571 -180 -963 1130 1167 -1308 -232 -431 315
4223C15J370k715J81R19j00J533k217o09K356j301O10k40j366K631j227j549K187
$$ 315 1685 -1030 -849 70 -30 1503 -714 -1323 1033 -268 342 102 -1264 1367 140 -1409 778
4240G78j136Q90M93k852J563R80k92O83k596J03K602m33j91j620l42K475m71n55
$$ 778 -358 532 1025 -1827 -264 716 424 1107 -1489 -1386 1216 783 592 -1028 -1370 1105 634 79
4258G9j90q96J487j73p36P85n77O43m26j198J504M64l7j019j913K601J308j319
$$ 79 -111 -1007 480 307 -429 356 -221 422 -4 -1202 302 766 729 -290 -2203 398 1706 387
4276C87m42k083J661K742k126j84q25o37L335j048j643J021j114J554J50k155
$$ 387 -55 -2138 -477 2265 139 -45 -870 -1507 1828 780 -863 158 -956 598 748 -1407
4292a407K322l17j276O22j189K084J138l110J57J89J020K319k641j914J191Q67
$$ -1407 915 598 -678 -56 -1245 839 1977 -1133 -976 -787 233 2552 -89 -2003 -812 55
4308E5K098j422k786J185J235Q36p33j582R80M11j74J6p45J335k21j392M25qJ689
$$ 55 2153 731 -2055 -870 365 1201 468 -1114 -134 277 103 119 -626 709 488 -904 -479 -487 1202
4327A202M45l147m7J351J648Q15l747q26K690N34R69k310k111L071J89o7Pk546
$$ 1202 1647 -1500 -1547 -196 1452 2267 -1480 -2306 384 918 1887 -423 -2534 537 726 659 666 -1880
4345a880K038J233k218R60m11M49J300l043L93K541o09q1k022n77L390Kj144j340
$$ -1880 158 1391 -827 133 -278 171 1471 -1572 -1179 1362 753 672 -1350 -1927 1463 1465 321 -1019
4363a019j121L017J192j895j240n52K191J240k088o25L75J108L50j729L26P38
$$ -1019 -2140 877 2069 174 -1066 -1618 573 1813 -275 -900 -525 583 933 -796 -470 268
4379B68J71J18j904P02J898o17l86j766K37L401r86j862l21k10L101l93k869P90
$$ 268 439 557 -1347 -645 1253 636 250 -1516 -1279 2122 1136 -726 -1047 -1257 1844 1451 -1418 -628
4397f28J13J303Q20k914M71J317l36J027k162k64K739j066o72l65l77K624q28
$$ -628 -515 788 1608 -1306 -835 482 146 1173 -989 -1253 1486 420 -252 -617 -994 1630 802
4414H02k115R17K54J180j40k259P42R68N16q3k098L78J784M3o31j617O98J971
$$ 802 -1313 -396 -142 1038 898 -1361 -619 349 865 782 -1316 -938 846 889 258 -1359 -661 1310
4432A310q14p51p25N12J781r82q81J18j68J841p32j636J098k8Q16j06k307J790
$$ 1310 496 -255 -980 -468 1313 331 -550 -432 -600 1241 509 -1127 -29 -57 759 653 -1654 136
4450A36R78j267K63j334J060J931k075k06J12j34K105j269j523J006r1J436l59
$$ 136 1114 -153 110 -1224 -164 1767 -308 -514 -402 -536 1569 300 -1223 -217 -308 1128 769
4467G69k276J296O46j67K60j434Q01Q40j039L22k72J44R16j151j26K70L08R94
$$ 769 -1507 -211 435 268 528 -906 -105 735 -304 18 -254 -110 806 -345 -471 -201 107 1101
4485A101j441p77J067M28Q01j377j184J667N5J12j46j511J301L22n07O67j292
$$ 1101 -340 -1117 -50 378 1179 -198 -1382 285 340 452 306 -1205 96 418 -89 578 -714
4502g14M86J082j443O27K8l83J303j750LJ801j020K39m23j064K018k94o62M57
$$ -714 -228 854 -589 38 66 -317 986 -764 -761 1040 20 259 -164 -1228 790 496 -166 291
4520B91j315J017J003j225K40n62L49J060j240K12L99n46P38p24R6P92r05L48
$$ 291 -1024 -7 996 -229 11 -551 -202 858 -382 -170 229 -317 421 -303 -207 585 -320 28
4538B8n4l62R54m68k46P4o37J367k06r66O54o72Q89K87j424J099k75n51J282j160
$$ 28 -26 -388 566 98 -148 -74 -711 656 450 -516 138 -534 355 642 -782 317 42 -509 773 -387
4558c87J55P29j183J160k65r75J479q07k51Q50j121J073j44j182J417n88k60Q77
$$ -387 -232 497 -686 474 209 -766 713 -94 -345 505 -616 457 313 -869 548 -40 -300 577
4576E77j062O77J02r22J167n58m48R72p62L75j0o18J010o59m9O68q31M77o0k68
$$ 577 -485 192 294 -628 539 -19 -467 505 -257 118 108 -510 500 -159 -208 460 -371 106 46 -222
4596b22Q36j078J63Q11q03O51m76l60J167r40K01M58j136J093j76n50R57j218
$$ -222 614 -464 -301 510 -293 358 -118 -478 689 -251 -50 408 -728 365 189 -361 596 -622
4614f22O48P46j644J065K9n26R75j293L42J160j338P11k76p40J531p63j43L78
$$ -622 26 772 -872 193 222 -304 671 -622 -280 880 -458 253 -23 -763 768 5 -138 240
4632B40j121J368J61j247O67m14N28N07j553Q15L33n01P18r97K23Q57p65M65n09
$$ 240 -881 487 648 -599 68 -346 182 689 -864 -49 284 -217 501 -496 -273 584 -181 284 -225
4651b25m58J501p12l65J41m73J529o51j204J136l88N94J90j600J142N2l01Q46
$$ -225 -683 818 106 -259 -118 -591 938 287 -917 219 -169 425 615 -985 157 209 -92 754
4669G54j594M11J251q92L25p77j07J908j349n05N94m41J295o80j224J286l11L48
$$ 754 -840 -429 822 -70 255 -522 -629 1279 -70 -575 19 -422 873 193 -1031 255 -56 292
4687B92L57j721R94O05m15L77j511P21J373j170n4m10K97J513j510k96N94l55
$$ 292 649 -1072 -78 527 112 489 -1022 -301 1072 -98 -152 -562 -265 1248 -262 -558 36 -319
4705c19J212p78r98J110l14P56k91j704J516M67n58L2j300J425Q54j592M25l69
$$ -319 893 115 -883 227 -87 669 378 -1326 190 657 99 131 -1169 256 1110 -482 -57 -426
4723d26K41J421j637j69O47l94J416j127j207J637j93L84n39j418J834L43j078
$$ -426 -185 1236 -401 -570 77 -317 1099 -28 -1235 402 209 593 54 -1364 470 813 -265
4740b65L25r38J055R14j563K65j53K68J309j584m48Q98O2Q44j340q17J856k63
$$ -265 60 -878 177 1091 -472 -207 -360 -92 1217 -367 -815 83 145 989 -351 -1168 688 425
4758D25r7o62p54J792p6q17J56q68J305N97j601L50l02Q49R38k066J76J028k44
$$ 425 328 -334 -1088 704 628 -189 -33 -901 404 1001 -600 -250 -552 297 1235 -831 -655 373 129
4777A29P83j636j71J782o98j4l32r38J889k10r18L01q74J528N06j971N44K11M03
$$ 129 912 -724 -895 887 189 175 -157 -1095 794 584 -334 -33 -907 621 1127 -844 -300 -89 314
4796C14P31j955L54J200n80M62j076j97J626o82j88k99n71J825l55j114J44j39
$$ 314 1045 -910 -556 644 64 526 -550 -747 879 197 9 -290 -861 964 609 -505 -361 -500
4814e00J380j25j789P28L90K91K88j517N54P78m55N33j186N8J431p68n7m52k39
$$ -500 880 755 -1034 -306 84 375 663 -854 -300 478 23 556 -630 -572 859 91 34 -418 -657
4833f57J882j053r92Q15l07J194m80j557J226L8K27L86j699O57R29n72N04j265
$$ -657 1225 172 -820 -5 -312 882 402 -1155 71 109 336 722 -977 -320 609 37 541 -724
4851g24J65J638j169j35P3k58J388j068p00J153m31O07l64j257J227K16j06R3
$$ -724 -559 1079 -90 -225 -152 -410 978 -90 -790 363 -68 539 175 -1082 145 361 255 348
4869C48j508R80J103q34j04p82N12J322j171p4N7k48J074p33m29P24n00P11l69
$$ 348 -1160 -180 923 89 -15 -797 -285 1037 -134 -208 -151 -399 675 -58 -487 237 -263 448 79
4888G9q86J194p2k07j81r52J493L78j222L25n50O78R71j451K61J1l18J381r44
$$ 79 -807 387 315 108 -73 -1025 468 846 -376 -51 -601 77 1048 -403 -142 -131 -449 932 -12
4907a2o65R20m71O96l66r83J442l39n09M17o57J001O3j214P82k68K45P75j282
$$ -12 -677 243 -228 468 102 -881 561 222 -287 130 -527 474 537 -677 105 -163 82 857 -425
4926d25j4M69kQ35j132n16J102k34K24l38o16J083l31k40L68o94O63J20p23N45
$$ -425 -439 30 28 863 -269 -785 317 83 307 -31 -647 436 105 -135 233 -461 202 322 -401 144
4946A44m61M76M41j288M29N38j77M32j129K06J009p83L87m22l96J142n74j43N15
$$ 144 -317 159 600 -688 -259 279 102 534 -595 -389 620 -163 224 -198 -594 548 -26 -169 346
4965C46j027R64K95j079N64k19J84N84j235N43N28o68N20n85N0P48p55L00k0n85
$$ 346 -681 283 578 -501 63 -156 28 612 -623 -80 448 -220 300 -285 -235 513 -242 58 38 -547
4985e47J048k89m96L27m78Q25K6j018O98p1k9K91p55M80J62m54P18o77j13O70
$$ -547 501 212 -284 43 -435 390 416 -602 96 25 -4 287 -468 12 174 -280 438 -239 -352 318
5005C18n17M21k42m93J012m72l11N49n24M61n8o42Q62l96j17O17r07M28J74l95
$$ 318 -199 222 -20 -513 499 27 -284 265 -259 202 144 -498 364 -32 -149 468 -439 -11 163 -232
5025b32P29p83r2R35p40K37N7n46Q14l64k70O53p27K94L61n62N15m95m8P62q32
$$ -232 497 -286 -378 557 -183 54 111 -435 379 15 -255 398 -329 -35 326 -236 279 -216 -264 498 -334
5046c34K78K96n25N74m47j15O46p28M30J98o57N35j46n0M15r01N38L88o37M28
$$ -334 -56 240 -285 289 -158 -273 373 -355 75 273 -384 151 5 -45 370 -531 7 395 -242 186
5066A86l13M8N39p93L58P5m89P90l96l36M45l98O74j05r52Q30j22l2L39r02N90
$$ 186 -127 -79 460 -333 25 100 -389 401 5 -331 114 -284 390 285 -667 163 41 9 348 -554 36
5087C6K89o08O88n50k82Q60o11K91J19p70R92m42n14Q17l44K54m0q95J033L2m90
$$ 36 325 -283 405 -145 -427 433 -178 113 232 -538 454 12 -502 315 -29 225 185 -710 323 355 -135
5108a35M53r23M11P03n13K83o14l44J253l33k83L7m75Q47k32l65N17m74K10Kk97
$$ -135 318 -605 -194 509 -4 279 -335 -679 574 241 -42 -5 -480 367 135 -230 287 -187 23 25 -272
5129b72O73l63j48L30r01Q68M26p64K31p92M99J268j163m7j9l41J200m79m66N30
$$ -272 401 38 -110 220 -681 187 613 -151 80 -712 -213 1055 -108 -155 -174 -515 685 206 -260 270
5149B70j016R60M91j286Q27l17m04R20q72N31O26j368M38L23j59Q43j077k69O44
$$ 270 -746 214 705 -581 246 -71 -475 445 -427 104 730 -638 -200 123 -36 807 -270 -539 105
5168A05k83P73k09j030M36J55N61p0r76L29J93J22K75o17K42m7l18P29l37N5J84
$$ 105 -178 595 386 -644 -208 -53 508 438 -538 -209 -16 106 381 -236 6 -41 -359 370 33 88 272
5189B72q70P45m7k01R57j340j84J200p25P69n17j198J713m86k62J014j554M98
$$ 272 -598 147 100 -101 856 -484 -668 532 -193 576 59 -1139 574 88 -174 840 -714 -216
5207b16P50r68J033o62o80J366r04P4Q49j083O70k63n81J337n64n13M69n31M88
$$ -216 534 -434 599 -63 -743 623 -281 -207 642 -441 229 -34 -615 722 158 -355 114 -417 71
5226G1L30n06P2l03K86M10k13k41l14N56J78o27O09l82k07O32q13O42K77j105
$$ 71 401 -105 -33 -336 -50 360 147 -94 -408 148 326 -301 308 -74 -281 351 -462 180 457 -648
5246f48J031l40n45J309j103P0P41j284J333k5j460J493o73j47J106j611O99P43
$$ -648 383 43 -502 807 -296 -226 515 -769 564 539 -921 572 -101 -248 858 -753 -54 689
5264F89j429J196k88r10J430q63o9P37j017O85K58r47O33n7j10K15n05M69J17
$$ 689 -740 456 168 -742 688 -175 -244 493 -524 161 419 -528 105 48 -62 153 -352 117 234
5283B34k57j6j60L44r2J2J24o85O36J60m70M49q02L50J075j435M57L97r65J373
$$ 234 -23 -39 -199 145 53 65 189 -496 140 300 -170 279 -523 -173 902 -533 -76 321 -644 729
5303G29p18p28J560j304L23R29j645J167J89j277J362q95o0J430j620J84Q25q63
$$ 729 11 -717 843 -461 -138 791 -854 313 502 -775 587 -308 -368 1062 -558 -374 451 -412
5321d12J035n69q69J232n32J45M68j107M17N05l50J92l48j7M71j80k72Q2L85k94
$$ -412 623 54 -815 417 -115 30 498 -609 -192 313 -37 155 -193 -210 261 81 -191 -109 276 -18
5341a8k18L66l52L71K70r85P50j24l40J169j187l75J263q51O07l0j377J704m29
$$ -18 -236 130 -222 149 419 -566 184 60 -280 889 -298 -673 590 -261 346 316 -1061 643 214
5360B14p24J254j361L47J069j522J048j20j072J730r85m94J328r71K99L02j130
$$ 214 -510 744 -617 -270 799 -723 325 205 -867 863 -122 -616 712 -259 40 342 -788
5377g88J245nq44N58m23J44N50m59o0j30P5M69k31k66j89M10K83n66L26k16K9
$$ -788 457 452 -392 166 -257 -113 437 -22 -82 -212 -137 332 101 -165 -354 56 339 -227 99 -117 -88
5398h8N18p99L33L80q65R33l34q20J361p46N5N85j371J115M82j507J147m57l91
$$ -88 430 -369 -36 344 -521 412 78 -742 619 -127 -72 513 -858 257 739 -768 379 -78 -469
5417d69J440j417K45P59j300J203j45j147J262m88j11P64j228O58N21r63N47j29
$$ -469 971 -446 -201 558 -742 461 316 -831 431 -57 -168 596 -632 26 547 -416 131 2
5435Bk38O88o76Q3K83k71L11j04j61r7K29K73n10J17P4j30O04o70r3Q02q40L75
$$ 2 -236 452 -224 -141 142 -129 182 78 -83 -180 49 322 -188 -71 3 -127 477 -193 -286 516 -324 51
5457E1L56j031R61k52m61R94j092K71R62j388O99K00r03J361r00m27J320j167
$$ 51 407 -624 337 85 -376 618 -474 -203 759 -629 70 270 -633 728 -172 -599 721 -446
5475d46L68O94j305J018j50n76J065j012j7J030j045L67J46m85O92l63k68N83
$$ -446 -78 616 -689 329 179 -397 668 -344 -361 669 -376 -9 137 -348 344 -19 -287 296
5493B96l59Q0J29k87J38n6J69l2k46J48q0L31k54m02P56l62j41M70o26M08J97
$$ 296 -63 17 146 -141 -3 -59 110 78 -168 -20 -100 231 -23 -425 331 -31 -172 298 -328 80 277
5514B77p89R06m10m84J090q30J07N18r81R14j64q37J235o47k38R36j048N07K26
$$ 277 -512 394 -16 -500 590 -240 -133 385 -596 318 154 -683 552 -95 -333 603 -445 62 288
5533B88q73R99k95o75J003o56M0M55o41N46k0o00P00k42k08L23k72J99m4k32M03
$$ 288 -585 414 119 -556 447 -209 -169 286 -355 191 171 -429 271 29 -179 144 -128 71 27 -205 198
5554A98j63j38K4J12O2k51J92P8k84K79k00K1K95n43M78P9o45O89k38k61O08p21
$$ 198 35 -103 -79 33 95 -156 36 114 -170 109 -91 -70 225 -318 160 239 -406 283 45 -216 392 -329
5576c29L13M13r24P94o4o27P92n36l5O53r21O03K42q53P25k76k14O86q21L39M59
$$ -329 -16 397 -527 267 203 -424 368 -168 -203 450 -471 132 374 -479 246 -30 -244 442 -379 -40 419
5597D19q68O53o0n08O68m43P5L07n70M02J90m67J60MJ36K4k93J81rl8O2p0J13
$$ 419 -449 204 144 -364 304 -139 -64 243 -327 75 265 -202 -42 -38 98 122 -171 10 1 -37 25 -45 68
5620F8j45n7K86k95J05J78k62K59k43n6O00o63J06K79m04N97l07m11O92o42K78
$$ 68 -77 -134 152 -143 -38 140 -122 137 -106 -162 438 -225 -119 160 -244 353 46 -365 327 -315 -37
5641c7O06r61M08J15m31P41m99k33P80p74J28N48p30N81k68m07P90m36m1M52p34
$$ -37 569 -392 16 131 -300 441 -58 -291 489 -285 -157 391 -339 242 -26 -433 357 -79 -120 332 -402
5662d02L33L16l50L53n43p7P25k80Op1k53L39o1J9J10l22K8L2J43J00k36K06j77
$$ -402 -69 247 -103 250 -293 -370 355 75 81 10 -243 96 35 54 164 -158 -130 -98 45 145 -91 115 -62
5685f2k02M73q6q2n1m53O79J23m82L02n16K15N83n11K81k71n54J038k16l22L49
$$ -62 -264 209 123 41 -10 -463 216 339 -143 159 -357 -142 441 -70 211 -60 -614 424 208 -114 235
5706B35o82L49M11o49P56l54o01P34l32K07L40p88K24J09j92P95n22m05L25j90
$$ 235 -447 -98 313 -336 420 66 -535 199 -133 74 414 -374 -150 -41 -233 562 40 -365 -40 -230
5726b30O40p5p17L31k8J24L28m69K1p7l2M72k63q0Q2k92L59j36J38K52p65J98
$$ -230 410 335 -382 -51 -79 45 373 -96 -75 -152 -184 288 25 -55 27 -265 94 -42 96 348 -417 -219
5748b19L53r1M37p27j85O19l12M44op99M74k0R0N03r51J94M14n19O24j92m85N68
$$ -219 134 43 480 -247 -432 187 -125 319 313 -486 -12 -32 58 561 -390 -196 218 -301 323 131 -354 214
5770B14n42L39M90o43K02j09l29O79k15l3Q1o30N30K55k85J21m42K70L50l93L07
$$ 214 -328 11 501 -142 60 -49 -378 301 86 53 134 -496 34 289 4 125 -317 -47 303 -90 217
5791B17k60l45N38j43J46l6n53O08j30k49M88m46J95O7m66P44k44m15N01m02J91
$$ 217 -43 -388 150 7 153 117 -436 172 42 -207 281 -165 30 97 -369 375 131 -284 217 -185 6
5812FK78n69M78k93k62Q07n66l1K54m73O34k15l63O35n71J47L89n06M34k82j94
$$ 6 284 -285 193 -100 -362 445 -121 -152 102 -371 263 48 -315 320 -251 -104 285 -221 213 -69 -263
5833b63O72n29K6K62l92M58k70j23M44n45K78K89n76L58k48O4N18p12K57K25m75
$$ -263 409 -120 -94 168 -224 234 -36 -159 285 -260 18 307 -269 89 -159 -95 423 -289 -32 193 -282
5854b82M48j91j44N30o69K90L13n91N80k73l06M33m35M97J32q56N49M7j31M49
$$ -282 166 -25 -169 361 -308 -18 295 -296 284 11 -295 138 -297 200 332 -524 25 72 -59 390
5874C90p24K59K61l78N15k34m17M93k77L49q5n48O72k53k39L90k95K93j50m71
$$ 390 -334 -75 186 -192 323 89 -328 165 -112 237 152 -396 276 23 -216 174 -121 172 22 -449
5894d49P38k45m8L66q42L94L32l97N86p50j17Q30k69J32l00n37R21k55k52M49
$$ -449 289 44 -4 362 -480 -86 246 -151 435 -315 -432 398 129 261 -39 -576 345 90 -162 287
5914B87o14K95K89n56N42l25k3M72p58K74M20l23K27n79R6P47m26Lk04j54O86
$$ 287 -327 -32 257 -299 243 -82 -105 367 -391 -117 303 -20 207 -372 -276 471 45 48 -156 -310 376
5935C76j39k75K2m38O71J99o17J85k43L54L05p62K95J80k65M62n36J0O40n72K28
$$ 376 237 -38 -16 -454 217 416 -201 -16 -259 95 400 -362 -67 113 -152 310 -226 -216 424 -148 80
5956H0j38m44J010l47k68N7m33Q84J72r89L31p5L12L95r09K28J18j06N64n96j97
$$ 80 -58 -502 508 161 -107 -50 -483 401 573 -416 -85 -160 152 547 -362 -134 -16 -122 442 -154 -351
5977c51N05n8J08l60k91P96j45l40oj92O77j47m80K40k00N07J64p73K44p6L05
$$ -351 154 96 204 -156 -447 349 204 -136 -142 -334 343 196 -284 -44 -244 263 427 -346 -102 -178 127
5998A27M19r36J17N54k43L21o64j27Q87m62j7Km82Q14k4n37L20m65N36M72j063
$$ 127 546 -390 -273 281 38 359 -305 -432 455 -7 -24 -22 -504 310 286 -251 69 -396 140 612 -451
6019d51K35L23j67N25p77q5P43k90Q9k18l84O79m6j71q8k99O53L3m24mj52N57
$$ -451 -216 107 -60 465 -312 -397 346 56 145 -73 -457 222 176 5 -83 -382 271 304 -120 -124 -276 281
6041B81Q5o57K08m0K57K18o38K07N0m2N05o70p2N87k81K53l58m21R77l50l00L75
$$ 281 366 -291 -83 -123 134 352 -286 -79 -29 -71 434 -236 -308 279 -2 251 -107 -528 449 99 -201 174
6063A74m90N19J40p26N06k59m4P29p88l7L86j54L61m08l04O77k70K3O5l96M32
$$ 174 -316 203 343 -383 123 -136 -180 549 -239 -276 110 -44 317 -91 -395 282 12 35 100 -296 136
6084A36m9k35K26k92J98J95k67Q4j45K14J80m36J66M8r0L13m26J25K01m03M48
$$ 136 87 -148 78 -214 -16 179 -88 -4 -149 65 245 -191 -25 23 -67 246 -180 -55 146 -257 191
6105A91j08l53M41k22Q5J74n71N14k5m03M90k88m2L64n00L01J40n65O02j56j81
$$ 191 83 -270 171 -51 34 208 -363 151 126 -277 213 -75 -117 247 -253 48 188 -377 225 69 -112
6126a12L14m68L06J91m67L54j43j36L81k21p4N5j40M19j63l02K29n3J96j57k75
$$ -112 202 -266 40 231 -236 118 -25 -161 220 -1 -75 -20 -160 259 96 -206 23 -30 166 9 -266
6147b66M02j02N6l8l18L24M0q0J36n39L24M00l30J4k74J33N97n11k23L23k03M00
$$ -266 136 34 90 52 -266 58 98 18 154 -385 -61 339 9 23 -251 -118 479 -32 -255 68 -135 265
6169B65j77m67M59n4J10J50p52L90L93k55L3m45J60O59m60j76j6N5N08k57m06
$$ 265 88 -379 80 26 136 286 -466 -76 317 62 95 -350 -190 469 9 -167 -183 -128 380 123 -283
6190b83K04l3M29m8p00K38L58K41k36o27L20M61r4k30m42M13M25k64k05l23K21
$$ -283 -79 -112 317 269 -431 -193 165 406 170 -457 -137 324 230 0 -442 -29 396 132 -73 -396 -175
6211a75O39l62l49J7M3P86l74p72M48K53K33j48p52L85M12p2j4o32J13Q09k62
$$ -175 464 102 -247 -230 -187 599 225 -547 -99 154 387 239 -513 -128 284 212 198 -434 -321 488 226
6232B26k91l15M5R28l34o64Q7K36N78k57p27J86M95J23p0p23J01O29J37k41o93
$$ 226 -65 -380 -335 593 259 -405 -318 -82 496 239 -488 -302 193 316 246 -477 -376 253 390 149 -544
6253e44K15Q29j40m69l55K93P79l63n15mJ50O17j74o66J4M04L59j14q93K05P11
$$ -544 -329 500 360 -109 -464 -171 608 245 -270 -274 -124 493 319 -347 -333 71 430 316 -577 -372 339
6274C39N2k89p19L25Q31k59l70l21Q7Q41j27o04j64J65O76nq03j17M82L80j33
$$ 339 391 102 -617 -292 539 280 -90 -411 -324 517 390 -214 -378 -213 463 458 -345 -462 20 400 267
6295B67p35K13N47J6k34n14J86O46r3l23l01KP84j07n81r6J32P13r9q21J13L41
$$ 267 -468 -255 292 308 74 -440 -254 392 299 -24 -325 -323 461 354 -227 -323 -191 522 423 -398 -285 56
6317E6K40L2p04P6M78J5R7n62j40P72j28l10j39o9O97r4o88J79J94K33N8o36R1
$$ 56 296 328 -376 -300 178 193 290 -272 -412 360 232 -78 -217 -286 411 317 -371 -192 2 235 293 -343 -252
6340b52K67J51J72n58j12N20Jn9l62r9N85p0k29k5q7L42n6k11j8r0L34O8m12J63
$$ -252 15 166 338 -220 -332 188 189 130 -232 -331 254 184 -45 -70 -157 185 129 -82 -100 -190 144 212 -200 -37
6364c7rK02J23o46K09L08j33J21l13o7N97l71JQ2k84L34Kj80J40l01K72J93n12
$$ -37 -46 156 279 -367 -158 150 17 138 -175 -242 355 -16 -15 67 -217 117 119 -61 79 -222 50 243 -269
6387b69L19k2j99L34k63O2K96m48J66J84l32K28q3K7Q8j75N3J01j73J83j53J00
$$ -269 50 28 -171 163 -100 -38 258 -190 -24 160 -172 56 -27 0 88 -87 -34 67 -106 77 -76 24
6409B4%j28L41k48j79K36m6J02j23k46M31n7j02N4k77J95K48l23J78l32J26O17
$$ 24 24 -104 237 -11 -190 46 0 102 -21 -267 164 107 5 59 -218 -23 225 -98 80 -252 -126 491
6431D91n97m8J41r5N39m20m33N88j60J10L7o63N47K15l42K30m87J51O37l98j42
$$ 491 -106 -154 -13 -108 431 11 -422 166 6 116 153 -510 37 252 -90 140 -347 -196 441 43 -99
6452i9j09J60N43n45l54L12J26L10k63m54K62K37J92k31n42K84L86R7k65n75N73
$$ -99 -208 -48 495 -50 -404 -92 34 344 81 -373 -111 126 318 87 -455 -171 215 312 47 -528 45
6473D5M15m00j27l40M48M57n17j63M3MO63m95m97K81J22N82l87p98O23L22q8o3
$$ 45 460 60 -67 -407 41 498 -19 -182 -139 -135 528 33 -464 -183 -61 521 134 -664 -41 281 193 130
6495A30p65N08O66n85K0l16KR62m16n86J28R6P07k29r20L65L93K92l01o92K86
$$ 130 -635 -127 539 -46 -26 -342 -340 622 206 -380 -252 -156 551 322 -598 -233 160 452 151 -541 -255
6516b55M53Q6j62n78K26N49o8k13n86L76O49k66m40k46M77N75o01l72J96J03O55
$$ -255 198 284 122 -456 -230 319 251 38 -548 -172 477 211 -229 -475 2 577 -24 -396 -200 -97 558
6537E58l41q70N72J20K64J00j107M60O35j00j09o72J76Q19l38l11o5p7P41k53
$$ 558 217 -653 -81 39 303 403 -704 -244 391 291 182 -490 -314 505 167 -144 -209 -286 455 202
6557B02n09J77J8N28j10r18L68N08J72k60p19J95P04N2m20l90J49O67j42j97n42
$$ 202 -307 -130 -112 416 306 -612 -244 264 436 176 -543 -348 356 408 -12 -402 -253 414 272 75 -467
6578d67J79P53k40l20k29O4P57l42n96L48N9L73j41p41N27J91N1N6r01K79R24
$$ -467 -288 465 225 -95 -324 -260 497 155 -441 -93 -34 339 198 -543 -16 175 226 282 -619 -340 584
6599E84m03r3n46m3J118k80o10J20j47O84M5p42J21J38J82K68o44l2M24Q9l4n50
$$ 584 181 88 -458 -501 617 337 -273 -153 -300 384 429 -313 -192 -54 128 396 -248 -280 144 233 199 -351
6621c51J84N09j20k77l24K10N97k60k27j92K0O17j10l97j40%O99j16p16L45K4
$$ -351 -167 342 222 -55 -379 -169 428 168 -59 -251 -231 386 276 -121 -261 -261 438 322 -394 -49 -25
6642b5J95J66p35K78L84l76L41m01k18Q03l98m9Jl27O67o8o32L84o7L39K5o59
$$ -25 170 336 -399 -121 263 -113 228 -173 -391 412 14 -35 -34 -361 306 238 -394 -10 -77 262 287 -372
6664c72L31J90j74K68l79l6K96m1N1k10j55L56J9j42j33K0L85k79n0M1j34L13
$$ -372 -41 149 -25 243 -136 -172 124 83 134 -76 -231 125 144 2 -131 -111 274 -5 -55 -14 -148 165
6686A65j62j57L10k78J89J85n18L25M3j82K90m57K14L85n31K21j0k80N46m27j5
$$ 165 3 -154 156 -122 67 252 -266 59 102 -80 210 -247 -33 352 -179 42 32 -248 298 -129 -144
6707a44L96n19K89K27n16L85j25k18N09m07J61J35m83K68K16j20K1l26K09K41
$$ -144 252 -267 22 249 -267 118 -7 -225 284 -123 38 173 -310 -42 174 54 75 -251 -42 199
6727A99k30oq2NL30k02L1j12o5L56k11j38K4P0L58l72k36L93m9J09k02l34M98
$$ 199 -31 -37 -119 -114 216 14 45 -67 -132 224 13 -125 -101 -31 327 -45 -281 112 63 172 -30 -364 134
6750A34J07k71J87o08L71N37m93j0j65p2Q03m84m22L87JK87j14o94N93P3j36J01
$$ 134 241 -30 157 -451 -80 457 -36 -46 -211 -283 520 36 -386 1 2 289 175 -519 74 147 11 112
6772A12m88L41M31l19j23k69J94O38l64n15J04L28M31m33n07J44M21K72l54m59
$$ 112 -376 -35 396 77 -46 -315 -121 517 153 -362 -258 70 501 68 -439 -295 126 398 44 -415
6792d15J91L55K84l97n58N69L01n1l79l66N58M11n49j78m4L45N01n46l71K02J15
$$ -415 -224 131 415 18 -540 29 330 279 -100 -466 92 503 -46 -224 -268 77 578 32 -339 -137 -22
6813b2N74m71p65N99L64N7k93p32O36N45m61o9l53K55O06m51k97L1J00O05l02
$$ -22 552 81 -684 -85 279 336 43 -689 -53 492 31 -38 -391 -136 470 19 -278 -247 -147 458 156
6834A56o46L52L56K67m47n79M15N41r5l73m09L86M66j78l68l37N09L82j90m19
$$ 156 -490 -138 218 485 38 -541 -126 415 320 -53 -462 -76 390 212 -156 -493 16 398 208 -211
6854b11j86M94M76n81l21J95K65K60m90l46M24J85J23k31n39M23N01l14j26m77
$$ -211 -397 97 573 -8 -329 -134 131 391 -99 -445 -21 164 287 56 -483 -60 441 127 1 -476
6874d76L88O69o07k22mJ64O00n40l54L61J5K77j33n64L69L25j20m6m90K25N40
$$ -476 -88 581 -26 -248 -252 -88 512 -28 -382 -21 -6 271 138 -426 -57 268 148 102 -388 -163 377
6895C77l41k00n6K25L27k82k15N3J02K36j86j90n6J81L20l33k31K06J80Q7j99
$$ 377 36 -164 -220 5 332 50 -165 -112 -10 226 40 -150 -206 -25 295 -38 -269 -63 117 204 5
6916Ek80M54k2k06O7k36J92K36k50L0r5m5M58k89k38K65p9K50j54l60M11n9j76
$$ 5 -275 179 157 -49 18 -218 -26 210 -40 -10 -105 -150 308 19 -219 46 -33 217 63 -297 114 55 -121
6939a21K77k80M5K94l13J65j43j47L99j55j23J67j06P2N4k60K75j02o2J12n4K3
$$ -121 156 -124 -79 215 -98 67 -76 -223 176 21 -102 65 -41 31 85 -175 100 -2 -64 48 -6 17
6961A7p5J1J28p6m2O3K7k7q8K1J34j71J82J1k48K12j79J14J56l79J83K26k78J96
$$ 17 -58 -47 81 5 -37 26 53 26 -62 -41 93 -78 104 115 -133 79 -100 14 170 -209 -26 200 -78 118
6985A18j87m8K74j90j5J03k63L15Q5l16J33j30J86J91m62R7K19j59J78k53m1L37
$$ 118 -69 -117 157 -33 -48 55 -208 107 192 -124 9 -121 65 256 -206 -109 110 -49 129 -124 -165 172
7007A72j33Qk0j98K48J18j97n7j03K94j4k56J0J15J56j17j95J43K7Q8N9k56N3
$$ 172 39 47 27 -171 77 195 -2 -59 -162 132 118 -138 -128 -13 143 26 -169 -26 1 89 148 -108 -55
7030e5Q9m9K06k95q3M00j90k6q4j31M53k40j32J94j61J88J63m45J42R9j68M16
$$ -55 34 -15 191 -104 -187 213 23 -3 -87 -218 235 -5 -137 57 -104 84 247 -198 -56 43 -125 291
7052B91l83j43L86j51J7k2k02M43j37k18J23q9N7K05l77K03j13R0K44k40m0N6
$$ 291 -92 -235 151 0 17 -5 -207 236 99 -119 4 -85 -28 177 -200 3 -110 -20 224 -16 -56 0
7074@M4O2j75PM4K0l0r0P8J85k12J35p9j65L00j18m2M6j73K78Q4l41J83k2r2K30
$$ 0 44 106 -69 -62 -18 2 -28 -118 -40 145 -67 68 -11 -176 124 6 -36 10 -163 115 199 -142 41 19 -73 157
7100A57k49rJ93k79L06N1m07K64p2P3J59m14K01J17k52K70o2j66J57q8J14m2j43
$$ 157 -92 -101 92 -187 119 170 -237 27 -45 28 187 -227 -26 91 -161 109 47 -119 38 -50 64 22 -121
7123a21J98n2m7k3L4K06j07k25P9J0K10p5k55J53j04K15J29l24k7N9J25J10l21
$$ -121 77 25 -22 -45 -11 195 88 -137 -58 -48 162 87 -168 -15 -119 96 225 -99 -126 -67 58 168 -153
7146a53m6L99l06J08m0j19K76r6j50K25k69K18J90m68J16J41R4J10m41l3L19N8
$$ -153 -199 200 -106 2 -38 -157 119 23 -127 98 -171 47 237 -231 -115 26 120 230 -211 -244 75 133
7168A33j6k52o7K78J5L6j53k50L43R7j82n1l9K39N4l54K7J05J49O3l81J21J76
$$ 133 117 -135 -202 76 91 127 -26 -276 67 164 -18 -69 -108 131 185 -169 -142 -37 112 175 -206 -85 91
7191I1p6K21m68J9M22j29M2k25k36N91nl06n0p8L60Q9m04N6K7P4K23l18n0J29
$$ 91 15 236 -232 -213 209 80 122 -103 -339 252 247 -59 -109 -187 173 262 -142 -86 -59 15 238 -80 -130 -1
7215aJ03N7l28p1L82R7k29k53J50K61n4k27p5R3L01j23j56M3q5K85K4m00J14J03
$$ -1 102 159 -169 -240 142 239 10 -243 -93 168 114 -113 -188 -95 206 83 -73 -30 -115 170 194 -206 -92 11
7239A1J47N5n58K36K81j29K6j62j09M00j43j17Q0k12L26k8l01J49P6J09L4m06
$$ 11 158 213 -345 -109 172 43 69 -93 -202 198 55 -62 18 -194 132 104 -197 -48 28 137 171 -235
7261b35J68K31m4p2j63L0J78J2j14j25K1J95l9j3j88J28K76k75k9N4rJ99k36m1
$$ -235 -67 164 120 48 -115 -85 93 105 -9 -134 -113 82 43 30 -158 -30 246 -29 -58 -4 -13 186 -50 -91
7285i1K17j48L6N1j86K04L3j39J14l21K63K60l76o4R8qL26k93j50K67j25M5J11
$$ -91 126 -22 14 65 -121 83 116 -23 91 -230 33 293 -83 -147 -49 -57 269 -24 -174 93 -32 13 124
7308A24k05Q4L3j16J77j48K5Q2j02j14J36Q7K7j26JL8O6Rj38j3R2m5J51k47k6
$$ 124 -81 3 36 -80 97 -51 -26 56 -46 -160 -24 63 90 -36 -35 3 69 78 -60 -73 19 -26 125 -122 -148
7333a48J55r4K20j46k36L56j49r4K64j94J21O7l06K71M6k18J92k33L6J77j09O1
$$ -148 7 -87 133 -13 -249 107 -42 -136 128 -66 55 122 -184 87 133 -85 107 -126 -90 87 -22 39
7355C9m2j50K91k0k61J39l2N0N0j86J34K5r0O7k4O9m5J4l4q3O7J09o4m6k02K67
$$ 39 -3 -153 138 118 -143 -4 -36 14 64 -122 12 37 -53 14 -10 59 14 28 -6 -89 -22 87 23 -23 -225 42
7381D2J21k92J27k9J4J51k36P4J50k38K23k2k63K82r8m5J75l26K81O2l73K83m7
$$ 42 163 -129 -2 -31 -17 134 -102 -28 122 -116 107 85 -178 104 6 -39 136 -190 91 153 -220 63 16
7404A6p9K31k28n0J93j71J71K6k48K03m3o0J10j99P9K12k60J35m4J0L0n0Ql6N2
$$ 16 -63 168 -60 -110 83 -88 83 109 -139 64 21 -39 71 -128 -49 163 -97 38 -6 4 34 -16 -8 -44 8
7429HJ8j5M3l8o5J65j68m9J56j02J34j22j01L63k86K7J44k31K11q3j83L26j91
$$ 8 26 11 54 16 -49 116 -52 -101 55 -47 87 -35 -136 227 -59 -32 112 -119 92 9 -174 152 -39
7452c9l1K17k60J45O3j68J99j69n9K13k15K7J55j90J81l4j39J80p9j39K87j41
$$ -39 -70 147 -113 32 95 -73 126 -43 -102 111 -104 -77 78 -112 69 35 -104 76 -3 -142 145 4
7474Dn7J52r5M2r6N5P2m8m5L0N5o7k3K0P1p1oq1J51L8k24K61k02l0K45j86M4J4
$$ 4 -53 99 4 46 -50 5 77 29 -16 14 69 2 -21 -1 70 -1 -7 -88 63 101 -123 138 -64 -94 151 -35 9 23
7502B3j30L18j27l06L01L2k19K07k09J70J26l25J87j8j69L16j44j45J58j93K24
$$ 23 -107 211 84 -222 79 111 -108 99 -110 60 186 -139 48 30 -139 177 33 -112 46 -147 77
7523G7M9l20K14N3q8M7j20J21J20k14NN8q2K07l0r7m7M2J34j54n5oJ65P3k18L2
$$ 77 126 -194 20 73 -15 32 -88 33 153 -61 -56 2 -80 127 97 0 -47 -5 129 -25 -80 -86 79 152 -66 -34
7549c4J19o5M4j15m2J15L4p6M5k84K51J51k74J24j01N1L07l73k8K22q6R6p2k25
$$ -34 85 20 64 -51 -93 22 56 -20 25 -259 -8 143 -131 -7 -108 -57 250 -123 -151 71 -15 81 9 -216
7573b16L29j00k8J01k44J30K24k75Q0q1L2K06j86r9J50o1J42j45j00K89j69L5
$$ -216 113 13 -15 86 -158 -28 196 -79 1 -80 -48 158 -28 -127 23 -38 104 -41 -141 148 -21 14
7595A4j8j43J51L3%q6p4J96N6j71j1M1J00%k09R4j4j2J59j50l5J38q0J21j03j94
$$ 14 -4 -147 4 37 37 -49 -123 73 129 -42 -53 -12 88 88 -121 -27 -41 -53 106 -44 -79 59 -21 100 -3 -197
7621a97M01j02j26J6j41L20o8k86J98p9QK06k58rK23j56K47k46j73K91J9m3p1
$$ -197 204 102 -24 -8 -149 171 103 -183 15 -64 -56 150 -108 -117 106 -50 197 -49 -222 69 88 45 -26
7644b6p5K64o8k25J98j01J27k1k13J54l1nJ30k11j9J78%K3j93j6K65j32ol6QJ66
$$ -26 -101 163 95 -130 68 -33 94 73 -140 14 -17 -22 108 -103 -122 56 56 79 -114 -130 135 3 -3 -39 -31 135
7670A35j12l3N5j48K08Jk34J45l2J8J41l72K60J07j51J06k11O1J56j20K4Rk04
$$ 135 23 -10 45 -103 105 106 -128 17 -15 3 144 -228 32 139 -12 94 -117 -56 100 -20 4 13 -191
7693a91L23j08j51J66j11J53J1l12K63O3l5k5j66J26Q3p8J6j05K5J81j74L1po8
$$ -191 132 24 -127 39 -72 81 92 -220 43 106 71 46 -120 6 89 11 27 -78 -53 128 -46 -15 -22 -90
7717i0J76m6j18N7j1J39q7j40J03N9k6M9k06K14Nj44J65k09N4K26k13k2Q1j34
$$ -90 86 40 -78 -21 -32 107 20 -120 -17 42 16 65 -141 73 78 -66 99 -110 -56 170 -43 -65 16 -118
7741a18K77j26j40J78r9L7N8j76J57p7%Q8j41M4J43j67P8j30R0K43k68k0J25o9
$$ -118 159 33 -107 71 -28 9 67 -109 48 -29 -29 59 -82 -38 105 -62 16 -114 -24 219 -49 -69 56 -13
7765a3R3o2j35J99j57J15k0j46J81k3J5N5l28J96K17k75R2j7lR0j29K7P8j21J66
$$ -13 80 18 -117 82 -75 40 20 -126 55 32 47 102 -226 -30 187 -88 4 -13 -16 74 -55 -28 50 -71 95
7790I5j28j4Q9q5J32m0j75J59Np7j8p0J82K1j44J18o1n0J30j75J68q4lJ39j15
$$ 95 -33 -47 42 -43 89 49 -126 33 38 -39 -57 -127 55 76 -68 50 -11 -61 69 -106 62 -22 -25 114 -1
7815ao2J37k8N4j18k7J43r1nj0m2J47r1l5Q5r8J7J40j60K2L6rJ99k02r9K04j13
$$ -1 -63 74 46 100 -18 -45 98 7 2 -8 -50 97 6 -29 56 -42 -25 115 -45 -23 13 4 203 1 -98 106 -7
7842gn5J06r9J24n1o6Q2j17J2J46j20K6J4M0L7j17jO6rj4l6N1Q4m5r7O3l6N2o7
$$ -7 -62 44 -55 69 18 -48 34 -83 -71 75 -45 -19 -5 35 72 -45 -46 20 11 -3 -39 12 96 51 -46 17 -19 33 -34
7871c4R5j8j48K27p5j20J11p1L6M2j60J89K2j65J12l2o4J39j65J34k6n9R0J5p2
$$ -34 61 43 -105 122 47 -73 38 -33 3 45 -115 74 96 -69 43 11 -53 86 -79 55 29 -30 60 75 3
7896CPl6L1jj00J15L7p8j2J25j31L4j4R9n4j6nL1j9l2M7ln8l3O2L1j7r6M5R6j26
$$ 3 10 -26 5 4 -96 19 56 -22 -34 91 -40 -6 -20 79 25 9 4 35 16 -16 31 28 -30 -63 -1 30 13 -83 -38 58 -68
7927f8J01j5p8R1o0nJ21k06J19J11j69P1m6k2R0l4lJ12k22J01N5q0k2M8k6O6j4
$$ -68 33 18 -60 31 -29 -34 87 -119 0 111 -58 13 -33 -55 35 1 -2 110 -112 -11 44 -36 -58 -10 -36 30 16
7954A6n1O3p8QM8K9l7j20M9Q2o5M1N1l7k5j6K8m0Q2m4q1J96j51M0J39k10J12N4
$$ 16 -35 28 -50 -42 6 35 -2 -122 -73 9 -56 -15 36 -1 -26 -42 -14 -54 28 -16 -97 99 -52 -12 127 -83 29 83
7982H3p8J2r7J3J43n6j6O0j44K5J16j23J71j59k1J51j03J7Q4j31l7K8K0J41j30
$$ 83 5 17 -80 -67 76 20 4 64 -80 -55 61 -62 109 -50 -71 80 -23 -6 78 -53 -90 -62 -42 99 -31
8007c1r3Q4J2J3j5k7k9R8j4P5j3j32k3J10k7m3M4k1Q1L9k11K46j16o4J13j41M8
$$ -31 -124 -40 -28 -15 -30 -57 -86 12 -2 73 60 -72 -95 15 -12 -55 -11 -32 49 88 -123 123 7 -57 56 -85 -37
8034c7O4j56J67pj67K72p7k21J76j21M3J72k20J05J8k0J12j10n7J12Pn9Kn0O4
$$ -37 27 -129 38 31 -136 136 59 -162 14 -107 -64 108 -112 -7 11 -9 103 -7 -64 48 55 -4 -2 -52 12
8059A2O5j68M8R7l8M2m0p2J15m3m6K7J3p3J44p6j48J06O0L2m8j94J67J12j30J7
$$ 12 77 -91 -43 54 16 58 18 -54 61 18 -28 -1 12 -61 83 7 -141 -35 25 57 9 -185 -18 94 -36 -19
8085a9Mk3J19j21j1O6j23K08nj34j5J07jM7k01J78Qj32P1j0n0K03j87o2O2k7O3
$$ -19 -15 -38 81 -40 -51 15 -108 100 95 -39 -54 53 52 99 -102 76 84 -48 23 13 -37 166 -21 -83 -21 -48 15
8112A5K6j15K3R7K9j02j4K5J36j01l7j6Q3kl3Jq7J43q1Nk5n8M3K19k60k2J04O6
$$ 15 41 -74 -51 46 75 -27 -41 -16 120 19 -18 -34 49 47 14 15 -72 71 -10 -5 -30 -88 -45 174 -86 -108 -4 62
8140F2J2j43l6J83j07L0J20k17J08M3j42J86j86K3K22k02l0N0l8J94j60j28K51
$$ 62 74 -69 -105 78 -29 1 121 -96 12 55 -87 99 -87 -64 158 -44 -74 -24 -62 132 -28 -156 95
8163I5p6j8k5m4M4M7op0j6J3J91j42q0NJ27J02j59l3N9jj2Nl7R3r4M2p1Q
$$ 95 19 1 -24 -68 -24 23 17 -53 -69 -56 135 -7 -87 -82 45 147 -12 -45 14 13 1 6 -31 62 -32 10 -61 -53
8191e3
$$ Imaginary data points
##PAGE= N=2
##DATA TABLE= (X++(I..I)), XYDATA
0@%%%Qj6K4l2L4m2N6p3R7j22J47j79K17k59L09l68M34n10N93o86P91r10J045j192
$$ 0 0 0 0 8 -8 16 -16 18 -24 32 -41 56 -66 81 -98 119 -140 169 -199 235 -275 318 -368 423 -487 558 -634
27f34J354j536J733j950K192k458K751l071L421l802M222m687N195n751O365p041
$$ -634 720 -816 917 -1033 1159 -1299 1452 -1619 1802 -2000 2222 -2465 2730 -3021 3344 -3697
43c697P792q634R576j0636J1837j3214J4811j6689J8933k1670K5093k9505L5433
$$ -3697 4095 -4539 5037 -5599 6238 -6976 7835 -8854 10079 -11591 13502 -16003 19430
56A9430m3852N6773p9189J28260l92997J50042O07798p67604N82902k14556n15508
$$ 19430 -24422 32351 -46838 81422 -311575 -161533 446265 -321339 261563 47007 -468501
67d68501P85099k24694k78874L81136m01741K28213J58039l41398K15726o2283
$$ -468501 316598 91904 -186970 194166 -207575 20638 178677 -162721 53005 -9278
77i278q507J67134l55188J91616J81274k29824J28948j36973j14870L76559n0546
$$ -9278 -17785 149349 -205839 -14223 167051 -62773 66175 -70798 -185668 190891 140345
88A40345k69604O0002O7107l1241J94482o4729l94383L20498J77515l67727L20595
$$ 140345 -129259 -69257 -2150 -33391 161091 96362 -298021 22477 199992 -167735 152860
99A52860j52234l04612O19793l16021k55990N31762m15164R0712K92660n41173
$$ 152860 626 -303986 315807 -214 -256204 275558 -139606 -48894 243766 -297407
109b97407L61168J20548l53847L11381k89605M9801L97809m44876J65379l455
$$ -297407 63761 184309 -169538 141843 -147762 -97961 299848 -145028 20351 16896
119A6896k79509N93451l04731k88275M84077m01250J63882L39813o15141K71888
$$ 16896 -262613 330838 26107 -262168 221909 -179341 -15459 324354 -290787 -18899
129a8899K10036l88499L20244p1013k44627L25207q5636j58337J33257L618k1104
$$ -18899 191137 -197362 122882 51869 -192758 132449 46813 -111524 21733 25351 4247
140D247J4462k1955q2276J01486J11285j88352J8895N3975o1814J56914r7906
$$ 4247 18709 -3246 -85522 15964 127249 -61103 -42208 11767 -50047 106867 8961
151H961r6710J10038o1877J28136o9393j50488K40875j60877J8865J99265l69042
$$ 8961 -87749 22289 -39588 88548 19155 -131333 109542 -51335 -32470 166795 -202247
162b02247K39300J42024m18170L62355o5050k76911M62842k93395j37353M06110
$$ -202247 37053 179077 -239093 123262 58212 -218699 244143 -49252 -186605 219505
172B19505l25308Q7115J70160l43694K42644M1067j88483J76137j42279L6336
$$ 219505 -105803 -18688 151472 -192222 50422 91489 -96994 79143 -63136 -26800
182b6800J30825j85289J15180k8849q1009J89943j56546j7902J50534j49398O7569
$$ -26800 104025 -81264 33916 5067 -75942 114001 -42545 -60447 90087 -59311 8258
193H258M8194j37004R4548M2239q6757M390N0880k3239k4948P9919r6815j9299
$$ 8258 56452 -80552 13996 56235 -30522 -26132 24748 1509 -23439 56480 -40335 -59634
205e9634J77633j65571n181J50592j97368J29088O9779k39220J88146q852j14868
$$ -59634 117999 -47572 -52753 97839 -99529 29559 99338 -139882 48264 39412 -75456
216g5456J76923j64105J3705J50110j67619J02078k9532r6809K08809j54638j8775
$$ -75456 101467 -62638 -48933 101177 -66442 35636 6104 -90705 118104 -36534 -55309
227e5309J51537j99649J46537M2557k31609K12188l0338j18247J84438j56876
$$ -55309 96228 -103421 43116 85673 -145936 66252 35914 -82333 102105 -54771
237e4771j3938J80459j40755N491M4804o8718Q5573o481o4411J4080J6550L6365
$$ -54771 -68709 111750 -29005 -23514 21290 -47428 38145 31664 -32747 -18667 -2117 34248
249C4248l2575j7762Q966j2328O3285l4088n4927N3391p699K4689j6857n9519
$$ 34248 1673 -16089 -7123 -19451 43834 9746 -45181 8210 511 25200 8343 -51176
261e1176P0412j1354J382J5698r9810R8060K8598j01980R4240p9369j8003J66020
$$ -51176 19236 7882 9264 24962 -74848 23212 51810 -50170 44070 -35299 -53302 112718
273A12718j48951r076R7304j17566J16900j171j52581J37098j6101m2015P9848
$$ 112718 -36233 -45309 51995 -65571 51329 50158 -102423 34675 18574 -23441 56407
284E6407j14694L8375P8544q2977M3113l7123k3144J05547o7168k1023L2852m4133
$$ 56407 -58287 -19912 58632 -24345 18768 -18355 -41499 64048 -3120 -24143 8709 -35424
296c5424P5563r995q3842N4558R352m198J8326n0869N00M6626N101l1011j7873
$$ -35424 40139 30144 -53698 860 10212 6014 24340 -26529 -26029 20597 25698 -5313 -23186
309b3186J8296P005K7568j9500o3432N8953K4849l6101K2329n2389J4749P6784
$$ -23186 -4890 2115 29683 10183 -53249 5704 30553 -5548 16781 -35608 -20859 55925
321E5925o4755k859J0362l1615P8627k9562n7837N1927k6180L5076J9810r5052
$$ 55925 -8830 -11689 -1327 -32942 45685 16123 -41714 10213 -15967 19109 38919 -56133
333e6133N2420L0298l6727M1830o1591n577Q6261n1367p649J0006l9600O7231
$$ -56133 -3713 26585 -10142 31688 -29903 -35480 50781 -586 -8235 1771 -37829 29402
345B9402L408o1986J9053N60K3131K0634n6821m917L4204J2185j368l5204p498
$$ 29402 32810 -29176 -10123 -9563 13568 34202 -22619 -27536 6668 18853 17485 -17719 -25217
358b5217L2823J5792j3856l0176J825K7339J5328j4382l9505J3880L8553n862
$$ -25217 7606 23398 9542 -20634 -18809 8530 23858 9476 -30029 -16149 22404 16542
370A6542j3203l1342Q040N6558k2156l0346K988n651M7555j306n8792J6326J4673
$$ 16542 3339 -28003 -19963 36595 14439 -15907 -12919 -18570 28985 27679 -31113 -14787 -114
383a14J5848J5388o0769l6N0331m266l345l3617j2297N9381j989l2130p513o911
$$ -114 15734 31122 -29647 -29683 20648 16382 13037 -20580 -32877 26504 24515 -7615 -15128 -22039
397b2039M0604J3163m6255q626J5598K4864J0856m2608j7514L3958K4527j0765
$$ -22039 18565 31728 -14527 -23153 -7555 17309 28165 -14443 -31957 2001 26528 15763
409A5763l5096p032L3211K1866j9915l4473O992L1822J0253j7038l3782Q212M2679
$$ 15763 -19333 -26365 6846 28712 8797 -25676 -18684 13138 23391 6353 -27429 -19217 23462
422B3462j681k6178k0806Q952M6010p793m2003j7J5899K8574l643m6871N822K9756
$$ 23462 21781 -4397 -25203 -16251 29759 21966 -20037 -20054 -4155 24419 20776 -26095 -20273 9483
436I483Q994l634l8036j245M2884K875j8859k4494J448M4041p40l3657r509J0978
$$ 9483 18477 14843 -23193 -24438 18446 21321 2462 -22032 -20584 23457 22717 -10940 -20449 -9471
450i471L1786l139l6343j009J7823J9466l656l4536M88K5743J2314j0120l1918
$$ -9471 22315 19176 -17167 -18176 -353 19113 15457 -19079 -18591 7152 19466 9346 -22572
463b2572O579L2280M24j6040k2640J0484L4697j2306j9605m777M257L0837q838
$$ -22572 -15993 16287 16711 671 -21969 -11485 23212 10906 -8699 -13476 -9219 21618 12780
476A2780l0363P606Q639J7899k875l6462J1757K2453j0m952k7553J1402L0082
$$ 12780 -17583 -9977 -1338 16561 13686 -22776 -11019 11434 11424 6472 -21081 -9679 20403
489B0403j5273p953q695J805L0521j4939j8469Q241n29J9912n502k8658J3724
$$ 20403 5130 -2823 -11518 -9713 20808 5869 -12600 -4359 -4888 15024 9522 -19136 -5412
502e412J2629L493p889k1710J7144J4389p169o209j6948J8897J5846k0650L189
$$ -5412 7217 10710 2821 -18889 -1745 12644 5475 -734 -17682 1215 17061 -3589 -400
515d00r249L375K8550k5763q010J4156p961K0543j4616k1157L1164n906l873j8
$$ -400 -9649 -6274 22276 -3487 -11497 2659 -5302 15241 625 -20532 10632 4726 853 835
529H35k0799L3389Q23k7415J5653j6066J6779K4906m5592P400J3606r572L1537
$$ 835 -19964 13425 14248 -13167 2486 -13580 3199 28105 -17487 -10087 3519 -6053 25484
542B5484k9649k2802L9018p248m24k784k0270K7793N80j6043M510o666K1146l401
$$ 25484 -4165 -26967 12051 4803 4379 1595 -18675 9118 9698 -6345 -1835 -8501 12645 9244
556I244k5607J4052q89J5557O468m4209J1552K4667P95M785l7795K16L6220l050
$$ 9244 -16363 -2311 -3200 12357 18825 -25384 -13832 10835 11630 16415 -21380 -21164 15056 12006
570A2006q87k7568k624L8231j8298M025l867k7563M9955j4842l4748M2033k2942
$$ 12006 11119 -16449 -19073 19158 860 4885 1018 -26545 23410 8568 -26180 15853 -7089
583g089J1350K0146o4963L6604L4998l4637J4105l6466L000O1322k9480j1028
$$ -7089 4261 24407 -40556 -3952 31046 -3591 10514 -25952 -22952 38370 8890 -2138
595b138j3987j4280O4332j5735l1319J1450k7584M6783J4349o0757K9465K941
$$ -2138 -16125 -30405 33927 18192 -13127 -1677 -29261 17522 31871 -28886 579 3520
607C520j1204K8417l7171N688L4481k4140o164q776J3467K7354k0066j1726k2673
$$ 3520 -7684 20733 -16438 -10750 23731 -409 -6573 -15349 -1882 25472 5406 -6320 -28993
620b8993J9849N5938m3227k2645P766j2417O2736j3647o1571L3413m711J5080
$$ -28993 -9144 46794 3567 -19078 -11312 -23729 39007 25360 -36211 -2798 -7509 7571
632G571K2495n3936J7021J3085j1511K5120m0486J6793L3323n1350K5688q837
$$ 7571 30066 -23870 -6849 6236 -5275 19845 -20641 -3848 29475 -21875 3813 -5024
644e024j5235P2594o0467l2992N9271l1374L7469N878q1996M5434K2398j0494
$$ -5024 -20259 52335 -8132 -41124 18147 -13227 24242 30120 -51876 -6442 15956 5462
656E462K1759n4179M456L8336r418J2020l7406K303M0593l5691J7768k77k9100
$$ 5462 27221 -26958 -22502 15834 6416 18436 -18970 -16667 23926 -11765 6003 5726 -23374
669b3374N0946k9630k5214M5940k2106J2011K562m2453L0803J3717J816j0228
$$ -23374 27572 -2058 -27272 18668 -3438 8573 11135 -31318 -515 13202 15018 4790
681D790l9939L8821Q917r556K0358o0641K5109M9631n7113L2920q094m4931P2223
$$ 4790 -35149 3672 12589 3033 23391 -37250 -12141 37490 -19623 13297 5203 -39728 32495
694C2495k7334k7967M4618l8321K0539J1142m1243L8876r457m962J3984m4230
$$ 32495 5161 -22806 21812 -16509 4030 15172 -26071 12805 3348 -1614 12370 -31860
706c1860M4376O896m0191M3059m2117o6O3525n9781R807K0088m4593N3066p199
$$ -31860 12516 19412 -20779 22280 -19837 -19903 43622 -16159 -6352 13736 -30857 22209 15010
719A5010l8954L2628j5252J0368N861k3696K3974j8079Q461J6434m2720L9152
$$ 15010 -23944 8684 -6568 3800 9661 -14035 9939 -8140 321 16755 -25965 13187
731A3187k714l5390N0757l7334o524N2436n2323J2888J9353l4580L7607j6110
$$ 13187 10473 -24917 25840 -11494 -18018 34418 -17905 -5017 14336 -20244 17363 1253
743A253j5149K6300k5568K4403o863k3894M2190l7931R653L6119o3171M0229J2703
$$ 1253 -13896 12404 -13164 11239 4376 -19518 22672 -15259 -5606 30513 -32658 7571 20274
756B0274n2755N7371k5106k5074N5250m3313N915K6399l6756K6018p194q427K1564
$$ 20274 -32481 24890 -216 -25290 29960 -13353 -7438 18961 -17795 8223 1029 -7398 14166
769A4166l0768K4240P1k7207M1572l2321k484M1074n0912K4267J7548m6239M1517
$$ 14166 -16602 7638 7709 -19498 22074 -10247 -12731 28343 -22569 1698 19246 -26993 14524
782A4524q069k2937L1012k4062J0575Q255k1930K3064j8571P741J6436l9571L6635
$$ 14524 6455 -16482 14530 -9532 1043 9298 -12632 10432 -8139 -398 16038 -23533 13102
795A3102n144l3100N1613l5204q636M7609m9611J8066J8023m1407M1495j0587
$$ 13102 7958 -25142 26471 -8733 -17369 30240 -19371 -1305 16718 -24689 16806 6219
807F219k3749K9351k2674J8137L282k9882L2435k1394K494L2163m9025K3612J2795
$$ 6219 -17530 11821 -10853 7284 10566 -19316 13119 -8275 -5781 26382 -22643 969 13764
820A3764l8226M7131k0129k6286M5672l0893K184K3003k8871J9691o330j2334
$$ 13764 -24462 22669 2540 -23746 21926 -8967 -6783 16220 -12651 7040 710 -11624
832a1624K1684j5135J3382n872k1402L2006j7558L874K2275m6593K1477J8399
$$ -11624 10060 -5075 8307 2435 -18967 13039 -4519 -645 21630 -24963 -3486 14913
844A4913k6540K9576k2255j5639L4692j9508R606L604k4039K1927j2338N936J8428
$$ 14913 -11627 17949 -4306 -19945 14747 -4761 4845 8449 -15590 6337 -6001 -65 18363
857A8363l5204K1521j214k4467M4153k2369j2912K8630m0192K3631K5973l9647
$$ 18363 -16841 4680 3466 -21001 23152 783 -12129 16501 -23691 -60 25913 -13734
869a3734J9024j0034j2370L7103j8557j708K658k2753K9378j594q791J2528l0564
$$ -13734 5290 -4744 -17114 19989 1432 -276 2382 -20371 9007 7413 -1378 11150 -19414
882a9414J6315J6467k2760K4238j4718k0259K8755j1212P644R164k9640J0666
$$ -19414 -3099 13368 -9392 14846 128 -20131 8624 -2588 5056 14220 -15420 -4754
894d754M684Q93J4279j9608n00q00k174K7745j7527j0296J0896j9553K4428P894
$$ -4754 -70 823 15102 -4506 -5006 -5806 -7980 19765 2238 -8058 2838 -16715 7713 15607
908A5607k5531J7009j6297m320L1784j7239Q42j181j9861K6649o83o153R720k7663
$$ 15607 -9924 7085 -9212 -13532 18252 1013 1855 674 -19187 7462 6779 626 10346 -17317
922a7317J1598J5775j2909J7777k0170j3365K9592j3228N896Q944k8226J3461
$$ -17317 -5719 10056 -2853 14924 -5246 -18611 10981 -2247 3649 12593 -15633 -2172
934b172M484o491J9345j6794q184J0208o147J4655j459j2681L907r355J2967J1876
$$ -2172 2312 -4179 15166 -1628 -9812 396 -5751 8904 7445 -5236 -1329 -10684 2283 14159
948A4159j6194Q71p183J990K0047j1900l157O83j0333J5842J190o254L792j3055
$$ 14159 -2035 -1164 -8347 -6357 13690 1790 -1367 -684 -11017 4825 6015 -239 3553 -9502
962i502Q214O872q936J1273r317o597J1644r378J2115L865k2305J0818P11j742
$$ -9502 -1288 5584 -3352 7921 -1396 -7993 3651 -5727 6388 10253 -12052 -1234 -523 -2265
976b265J6159j7751m177J0301p848J4460k543j6786J0563j658L149O013j4164
$$ -2265 13894 -3857 -8034 2267 -5581 8879 6336 -10450 113 -1545 1604 7617 -6547
989f547O188K507o977R540m790j234N051r336N586K855m259O190p204k633O626
$$ -6547 -359 2148 -4829 4711 -79 -1313 3738 -5598 -12 2843 -1416 4774 -2430 -5063 1563
1004A563m41M512p119n887R571q14K003k386q251R765j201k470O346j0936M097
$$ 1563 1122 5634 -1485 -7372 2199 1385 3388 1002 -7249 2516 1315 -1155 5191 -5745 -1648
1019a648P271r490O291k981m042J2285j0317k067R826p669N065j496q119J2102
$$ -1648 5623 -3867 2424 -557 -4599 7686 -2631 -4698 5128 -2541 2524 1028 -7091 5011
1033E011l831l765O457r168M930N931q349L925l240p61R695p903k795M943j730
$$ 5011 1180 -2585 3872 -5296 -366 5565 -2784 1141 -2099 -2860 6835 -1068 -3863 1080 -650
1048f50L704k820m011M827m46M06n26k501J939j49K730j979m765O107p72j457
$$ -650 3054 234 -3777 1050 604 1010 484 -2017 -78 -227 2503 524 -4241 1866 1094 -363
1064c63J807n889O558J687q791O903k104k107P940r324J915N484q136Q920k912
$$ -363 1444 -4445 2113 3800 -4991 1912 -192 -2299 5641 -3683 -1768 3716 -4420 4500 1588
1079A588r293J2111m001j698N635j1258P792N128j1525P912j824n001R733o614
$$ 1588 -7705 4406 405 -1293 4342 -6916 876 6004 -5521 2391 567 -4434 5299 -1315
1093a315j128N878o852M688J688p363N022J471k677J068k275J347L030k271k565
$$ -1315 -2443 3435 -3417 1271 2959 -4404 618 2089 -588 480 -1795 -448 2582 311 -2254
1108b254K264J308k614K905j158l982O014k187j576M647q183N227N428j1630P282
$$ -2254 10 1318 -1296 1609 451 -3531 2483 296 -1280 3367 -4816 411 5839 -5791 1491
1123A491M50o759J1072q676j892J1845j2786N228N930j3831J1331n67q622J2029
$$ 1491 1941 -4818 6254 -2422 -4314 7531 -5255 -27 5903 -7928 3403 2836 -5786 6243
1137F243r870P8J2142j3906L967N916r749Q903k644o465J0138n572j847P066o879
$$ 6243 -3627 -3549 8593 -5313 -1346 4570 -5179 3724 1080 -5385 4753 -819 -2666 4400 -2479
1152b479O81M883m003M87J360k917K731K316o479K413N381p797M004K457q660
$$ -2479 -1798 3085 -918 -431 929 -1988 743 3059 -3420 -1007 4374 -3423 581 3038 -5622
1167e622R692k759p158J3045j0897o29J4268j7034O439P378j6039J6308n206j2279
$$ -5622 4070 1311 -5847 7198 -3699 -4328 9940 -7094 -655 6723 -9316 6992 1786 -10493
1181a0493K1555j4349k803J7094j9682R271P154j8531J7578m952j1412J9914j3302
$$ -10493 11062 -3287 -6090 11004 -8678 593 7747 -10784 6794 1842 -9570 10344 -2958
1194b958k785J4122j4178O878L946j3135J1795o30q375Q979l516l678O398k360
$$ -2958 -5743 8379 -5799 1079 5025 -8110 3685 3055 -5320 3659 143 -3535 2863 503
1208E03k583M015k316k747P847n103n197J2235q738k153J2261j4864P580O804
$$ 503 -2080 1935 -381 -3128 4719 -384 -5581 6654 -2084 -4237 8024 -6840 740 7544
1222G544j9213J8490l148j5747K4615j6295m326K2131k5381J2848R824k8744K7022
$$ 7544 -11669 6821 3673 -12074 12541 -3754 -8080 14051 -11330 1518 11342 -17402 9620
1235I620m456j9965K9572k0290k332K3800k8833J4021J0002k6652K3934m244j6060
$$ 9620 5164 -14801 14771 -5519 -7851 15949 -12884 1137 11139 -15513 8421 4177 -11883
1248a1883K2536j4330j124J5061j8339P758P048j3253Q616J51o100O005j424l066
$$ -11883 10653 -3677 -4801 10260 -8079 -321 6727 -6526 2090 2241 -3859 2146 722 -2344
1262b344L657M54n594N626J948j1050J1595j014j2045J7400j1704l535K0889k5228
$$ -2344 1313 1767 -3827 1799 3747 -7303 4292 3278 -8767 8633 -3071 -6606 14283 -10945
1276a0945R117J5342l0083K4820q51k5377L3905k0038p249L2547l6395J2689J9387
$$ -10945 -1828 13514 -16569 8251 7400 -17977 15928 -4110 -11359 21188 -15207 -2518 16869
1289A6869l6214K9374m004k4060L5940k4034l779K8984l3315J4564J1923k8491
$$ 16869 -19345 10029 6025 -18035 17905 -6129 -9908 19076 -14239 325 12248 -16243
1301a6243K5765o533j5137K5226j8414j155J8080j7847N365N548j0391Q142L90
$$ -16243 9522 2989 -12148 13078 -5336 -6491 11589 -6258 -893 4655 -5736 2406 2796
1314B796n882K801K734m406J86Q152j1293K040J1435j6602J0829K852j8474K3999
$$ 2796 -3086 -285 2449 -1957 -1771 6381 -4912 -2872 8563 -8039 2790 5642 -12832 11167
1328A1167j1017j2440K8500k5559M783K0661l3644K5088J107k9151L8918k1480
$$ 11167 150 -12290 16210 -9349 -4566 16095 -17549 7539 8646 -20505 18413 -3067
1340c067j1730L7735l7903J1619K1360l9398L3310m092l0322M0780k1283p846
$$ -3067 -14797 22938 -14965 -3346 18014 -21384 11926 7834 -22488 18292 -2991 -10837
1352a0837K9928l3454J2680J4298k6514K3292o634j5911K2885j1697j82R251j4316
$$ -10837 19091 -14363 -1683 12615 -13899 9393 2759 -13152 9733 -1964 -2146 7105 -7211
1365g211P740J760n146O510k972k238k024M966J825n688P878j0686l51J5706j6785
$$ -7211 529 2289 -2857 3653 681 -1557 -3581 1385 3210 -2478 5400 -5286 -5637 10069 -6716
1380f716J1353K498k6345K8708m451j5827K8682l0474K795K9410l4975K3315L690
$$ -6716 4637 7135 -19210 9498 5047 -10780 17902 -12572 -9777 19633 -15342 7973 11663
1393A1663l7102L8746j1808j3053L4913l8362P070K3894l3860L1269l273l1746
$$ 11663 -25439 13307 1499 -11554 23359 -15003 -7933 15961 -17899 13370 10097 -21649
1405b1649L2735j7124Q74K8315l6638Q162J2133k0026K7121o898j9225J5202j0209
$$ -21649 11086 -6038 -5164 23151 -13487 -5325 6808 -13218 13903 7005 -12220 2982 -7227
1418g227P968J2287j5966p02p88K201P227p65j84j2394K868Q803l839J2913j4454
$$ -7227 741 13028 -2938 -3640 -4428 -2227 5000 4235 4051 -8343 -5475 3328 -511 12402 -2052
1433b052j2124J9988j1287J1805R270l2975J6546Q24q181L2888l0110r454K5348
$$ -2052 -14176 5812 -5475 6330 15600 -17375 -829 -5 -8186 24702 -5408 -14862 10486
1446A0486k6566K6840P422l8885K8137j3459p438M1839l4368k297J7503l1245
$$ 10486 -16080 10760 18182 -20703 7434 -6025 -13463 28376 -5992 -8289 9214 -22031
1458b2031L2657N569k8829K2015k1529l81L4270k2240J253r72j8924K7418J617
$$ -22031 10626 16195 -12634 9381 -12148 -12529 21741 -499 754 -218 -19142 8276 9893
1471I893r983N367j8940O851J5460l568J510j3035l076R207L526P521j1285n446
$$ 9893 -90 5277 -13663 -6812 8648 5080 6590 -6445 -9521 -314 3212 10733 -552 -5998
1485e998K062m187K0888m308j6185R301j4902J3111J9477k5734R151o622j4941
$$ -5998 -3936 -8123 12765 8457 -7728 1573 -13329 -218 19259 -6475 2676 -3946 -18887
1498a8887L7373j2348j1977J4150k8980K1222J7562k7554J9655j5028j4301L5363
$$ -18887 18486 6138 -5839 8311 -20669 553 18115 -9439 10216 -4812 -19113 16250
1510A6250j7099K185J0085l2738K2312Q272j5709K1757k0921r025K2550j1493
$$ 16250 -849 1336 11421 -21317 995 9267 -6442 15315 -5606 -14631 7919 -3574
1522c574J2291k57k4203J4453K081J033R749j7055o94M021P37J1772q978n237
$$ -3574 8717 8460 -15743 -1290 791 1824 11573 -5482 -6176 -2155 -1418 10354 1376 -3861
1536c861K16k112J3736n093l951L560j3214J1979N203q573J0268j6176l69J8454
$$ -3861 -3645 -5757 7979 2886 -1065 2495 -10719 1260 6463 -2110 8158 -8018 -8387 10067
1550A0067j4094R990j559j9860K1211m859l295J6081k5447O599J4295j7124J7449
$$ 10067 -4027 5963 4404 -15456 5755 896 -2399 13682 -11765 -5166 9129 -7995 9454
1563I454p556j4396K1235j3473L412J3505k2314J0530K643j0883J7847j1010m184
$$ 9454 1898 -12498 8737 -4736 -1324 12181 -10133 397 3040 -7843 10004 -1006 -5190
1576e190J1103j3889J0278M532j2329Q495o873J312J0322j1157M098m80n192J0256
$$ -5190 5913 -7976 2302 6834 -5495 3000 -3873 -2561 7761 -3396 702 222 -4970 5286
1590E286o285Q86K503q842J0452k701m702Q247r703N614L330j0758J2285n693
$$ 5286 -999 -113 2390 -6452 4000 1299 -3403 4844 -4859 755 4085 -6673 5612 -81
1604h1n501J2358j1572N365M846j3703J3368m117p036J4277j2772K341Q449j2970
$$ -81 -5582 6776 -4796 569 5415 -8288 5080 963 -6073 8204 -4568 -2227 6222 -6748
1618f748J1700l506r763J5643r108j92P927j3400R872Q08q716J1986r336j268
$$ -6748 4952 1446 -8317 7326 -1782 -1974 5953 -7447 2425 3233 -5483 6503 -2833 -4101
1632d101R953r843O583p56p906J0941o483l14P360r766N174k29m348R807p904
$$ -4101 5852 -3991 2592 1836 -6070 4871 -1612 -1926 5434 -4332 842 613 -3735 6072 -1832
1647a832n92N595p741P717j076n591P244q094L871O285r908O173k698l526J0232
$$ -1832 -2424 3171 -4570 3147 2071 -3520 3724 -4370 -499 5786 -4122 2051 -647 -4173 6059
1662F059q718K282M487j0732R392r15n215Q884j0141L030O832j0643R190k123
$$ 6059 -2659 -377 4110 -6622 2770 1855 -3360 5524 -4617 -1587 5245 -5398 3792 1669
1676A669p644J0670p396K516O186j2715Q184Q50o942J0357p601q05O962r419P688
$$ 1669 -5975 4695 -2701 -185 6001 -6714 1470 2320 -4622 5735 -1866 -2671 4291 -5128 2560
1691B560P56q644Q560m544k42O044q309N144J94n851P979m076q18L523o009N949
$$ 2560 3316 -5328 3232 -1312 -1554 4490 -3819 1325 1519 -4332 3647 -429 -1247 2276 -3733 2216
1707B216j140m053O360n469J613K849n543O425l954k545P814p472L007K644p239
$$ 2216 1076 -2977 3383 -2086 -473 2376 -3167 3258 -696 -3241 4573 -2899 108 2752 -4487
1722d487Q410m552k905R389r762L091N029r181Q510l305m888J0611r053J582O492
$$ -4487 3923 -629 -3534 5855 -3907 -816 4213 -4968 3542 237 -4651 5960 -3093 -1511 4981
1737D981j0055P233m94n858R332p786J89P492q687M741N24n282P126m960K44M917
$$ 4981 -5074 2159 1665 -4193 5139 -2647 -2458 5034 -3653 1088 1612 -3670 3456 -1504 -1260 3657
1753C657o921L835L70k763M644m857J894K149n194N482k167j596L951o018N132
$$ 3657 -3264 571 941 -1822 2822 -2035 -141 2008 -3186 2296 129 -1467 2484 -3534 1598
1768A598R12o611P274m388r88O596p961M976O80p710J0042m307l410P821q443
$$ 1598 2510 -4101 3173 -1215 -2203 4393 -3568 1408 2088 -5622 4420 113 -3297 4524 -3919
1783c919M279L116q591Q945l440m717Q774o773K207L299p768P259k012l942P245
$$ -3919 360 3476 -5115 3830 390 -4327 4447 -2326 -119 3180 -4588 2671 659 -3283 3962
1798C962n761J080K598m784N927l476k106N638n544L290N13m244O296n375N48
$$ 3962 -1799 -719 1879 -2905 3022 -454 -2560 3078 -2466 824 1337 -2907 3389 -1986 -1438
1813a438N560p789N090k02n017Q311o836N74O913j0074O138J340p229R239o368
$$ -1438 4122 -3667 1423 1221 -3796 4515 -2321 -1747 5166 -4908 1230 2570 -4659 4580 -1788
1828a788r41Q278j0180N278L001q560Q281l801k265P562q553L504L354o957O285
$$ -1788 -2729 5549 -4631 647 3648 -4912 3369 -432 -2697 4865 -3688 -184 3170 -3787 2498
1843B498k632j678M818n990M003P62m733N264l619J292K160n880O587k817k973
$$ 2498 -134 -1812 3006 -2984 1019 1781 -2952 2312 -1307 -15 2145 -3735 2852 35 -2938
1858b938P014p177L579K457q179R896m874m496J1025j0081L193N423j1601J1269
$$ -2938 4076 -3101 478 2935 -5244 4652 -222 -4718 6307 -3774 -581 4842 -6759 4510
1872D510l212p922J3828j0224K26R291j2806Q735N12r749J3021p471l042J0567
$$ 4510 1298 -6624 7204 -3020 -2794 6497 -6309 2426 2938 -6811 6210 -1261 -4303 6264
1886F264j0461M684K690q474R463m274l351P589o700K817J461m432N367m129P61
$$ 6264 -4197 487 3177 -5297 4166 -108 -3459 4130 -2570 247 1708 -2724 2643 -1486 -725
1901g25L256n173M341k547j70M773q060N689Q49o784R388p187j12Q617j2387Q613
$$ -725 2531 -2642 1699 -848 -1018 3755 -4305 1384 2233 -4551 4837 -2350 -2462 6155 -6232 2381
1917B381J526j2009J4569p134m131J2802j5268P849O667j6617J4751m112q787
$$ 2381 3907 -8102 6467 -667 -4798 8004 -7264 585 7252 -9365 5386 1274 -7513
1930g513J6456j3356J997J0068j6337J2226N27j2027J4505q290j740J0038j2455
$$ -7513 8943 -4413 -2416 7652 -8685 3541 4068 -7959 6546 -1744 -3484 6554 -5901
1943e901P463K591j0234R588m086j375O312p967M310K07l605O619n485J020J093
$$ -5901 1562 4153 -6081 3507 -579 -1954 4358 -3609 701 908 -2697 3922 -1563 -543 550
1958E50l650Q070o401r71O309q998Q348j124q009J2456j0364O16J1377j5533J0009
$$ 550 -3100 4970 -1431 -2402 3907 -5091 3257 2133 -5876 6580 -3784 -3168 8209 -7324 2685
1973B685J508j3503J6978r729k834J6199j9979P275Q465j5852J7184p987j0480
$$ 2685 4193 -9310 7668 -2061 -4895 11304 -8675 -1400 7065 -8787 8397 410 -10070
1986a0070J9402j4249M187J0348k0189J2508J381r737J5722j2831j879J2324j2512
$$ -10070 9332 -4917 -730 9618 -10571 1937 3318 -6419 9303 -3528 -5407 6917 -5595
1999e595P915J496r498R549o343M18P638q420M340k214l160P780m916L711k133
$$ -5595 2320 3816 -5682 3867 -2476 -2058 5580 -2840 1500 -714 -3874 3906 -1010 2701 568
2014E68p543J0598l593J285L208j3708J1165J119p572J3294j3932p5J2972j4946
$$ 568 -6975 3623 30 1315 4523 -9185 1980 3099 -4473 8821 -5111 -5186 7786 -7160
2028g160J2507q34j6264J9921j0348l579J8006k0011P647N882j8239K1806n519
$$ -7160 5347 4513 -11751 8170 -2178 -5757 12249 -7762 -115 5767 -12472 9334 3815
2041C815j2716J7297j6616N897J4469j9681J0535k841j0535K1059r668m974Q168
$$ 3815 -8901 8396 -8220 -2323 12146 -7535 3000 159 -10376 10683 1015 -3959 4209
2054D209j2719J1280L021j0445Q565p163%P996o579M744l394l469O633n454N760
$$ 4209 -8510 2770 5791 -4654 3911 -3252 -3252 4744 -1835 2909 -485 -3954 2679 -2775 2985
2069B985q3p219O632p355N576Q189j4790P416k455n473J7876j3675j486R902j6994
$$ 2985 2902 -4317 2315 -5040 536 8725 -6065 1351 -1104 -6577 11299 -2376 -3862 6040 -10954
2084a0954J6427K229j7819J7296j1351j731J8913k1243Q639P025j9923J9548n022
$$ -10954 5473 7702 -10117 7179 -4172 -5903 13010 -8233 406 7431 -12492 7056 2034
2097B034r557J8789j8397K966J3325j7544J4029j617j4740J6583p467L28R892
$$ 2034 -7523 11266 -7131 -4165 9160 -8384 5645 4028 -10712 5871 -1596 -1268 8624
2110H624j6727O906N021p284R063p294k111O709n509N817k322m143N261m855N184
$$ 8624 -8103 -1197 3824 -3460 5603 -1691 -3802 2907 -2602 3215 893 -3250 2011 -2844 2340
2125B340r19n380Q830p856R77P085j0278R511l303q797J5462j0629P91J0484j7689
$$ 2340 1421 -3959 4871 -2985 -2008 5077 -5201 4310 1007 -7790 7672 -2957 -2166 8318 -9371
2140i371J1649K356j3063J7974j2614m410J8439j7986P580O413j8107J8100n343
$$ -9371 2278 4634 -8429 9545 -3069 -7479 10960 -7026 554 6967 -11140 6960 1617
2153A617r923J8383j5242J906J1813j6509J1154k16j0543J4953r730j553J0524
$$ 1617 -8306 10077 -5165 -3259 8554 -7955 3199 2983 -7560 7393 -2337 -3890 6634
2166F634j1724O523J147p694R720n960q58O246p440M617m86k796N359o340L566
$$ 6634 -5090 1433 2580 -5114 4606 -1354 -2212 4034 -3406 1211 725 -2071 3288 -3052 514
2181E14J659n440O743n671R63N964j0103Q162q11q427J2773q320r10R464j3958
$$ 514 2173 -3267 3476 -2195 -1232 4732 -5371 2791 1980 -6447 6326 -1994 -2904 6560 -7398
2196g398R934K683j3590J4289o946l838J3616j5139O039O358j4308J4341m746
$$ -7398 2536 5219 -8371 5918 -1028 -4866 8750 -6389 -350 6008 -8300 6041 1295
2209A295r103J5373j0918K228P548j5005J1661Q24j0090J1552p964k67Q983j0614
$$ 1295 -7808 7565 -3353 -1125 6423 -8582 3079 3903 -6187 5365 -2599 -2866 6117 -4497
2223d497N677P24o532Q973n356j110M928n491N516l043l887P970m721J617Qo068
$$ -4497 1180 1904 -4628 4345 -1011 -2121 2807 -2684 2832 -211 -4098 3872 -849 768 776 -5292
2239e292R081k682k459M376r104P016L707p581O401p579P74J1229j1348L607J920
$$ -5292 3789 1107 -1352 3024 -6080 936 4643 -2938 3463 -4116 -3342 7887 -3461 146 2066
2254B066q674J2600n960m774J1522j1364L844N583j1815J1538j850q115R452q936
$$ 2066 -6608 5992 32 -4742 6780 -4584 -740 4843 -6972 4566 2716 -5399 4053 -4883
2268d883M622R172j3926L870K80k506J2261r566m269O253n448Q886m68r617N780
$$ -4883 -261 8911 -5015 -1145 -865 -3371 8890 -676 -4945 1308 -4140 4746 4278 -5339 441
2283D41k791L144M490r043L837O06l122N139m538L104J893p884M800o98J231N770
$$ 441 -2350 794 5284 -3759 78 684 -2438 2701 -1837 1267 3160 -4724 76 -622 609 6379
2299F379j0571P93L593j640R828q404p883Q581j908O744p37j3412Q439P99j017
$$ 6379 -4192 -3399 194 -1446 8382 -22 -7905 676 -1232 5512 4775 -8637 -198 601 -416
2314d16P459j1323J401N838o938Q109k880n313Q863q340O05P473n761N200m981
$$ -416 7043 -4280 -2879 2959 -3979 4130 1250 -4063 4800 -3540 -2935 4538 -1223 3977 -1004
2329a004p241J1814o54q61m51r905P613N217k649J389r279J632Q918k924J147
$$ -1004 -8245 3569 2915 2054 1603 -8302 -689 4528 1879 3268 -6011 -4379 4539 1615 2762
2344B762n212k527Q535l716O70J678n597M910k334j816P145n076P75Q3o181Q849
$$ 2762 -2450 -4977 3558 -158 512 2190 -3407 1503 -831 -2647 4498 -578 197 280 -5901 2948
2360B948Q06l983J177p997O485P793p666Q21m291k30J0769n598j852R77n657Q331
$$ 2948 3754 -229 948 -7049 -564 7229 -437 384 -3907 -4137 6632 1034 -818 159 -5498 2833
2376B833M85n518L905m357K094L500n922M966l30m076L103l341L875L030o803
$$ 2833 3318 -2200 1705 -2652 -558 2942 -2980 1986 1656 -2420 683 -2658 1217 4247 -2556
2391b556K100j409O30O527n700j280N95j886P851l153n045L866l092M394J256
$$ -2556 -456 -1865 -1235 5292 -408 -1688 -1093 -2979 4872 1719 -3326 540 -2552 1842 3098
2406C098o605N109k137j713O112n737J616K611n852N393j544k824O575n733n03
$$ 3098 -3507 1602 -535 -2248 3864 -1873 -257 2354 -3498 1895 351 -2473 4102 -1631 -2134
2421b134M113l844M303j686m420N464k144J72K535m753K509K45j360L519l715
$$ -2134 1979 -1865 2438 752 -3668 1796 -348 -176 2359 -2394 115 360 -1000 2519 -1196
2436a196J46K180k151K340j513p59K326l154K459N93k883K831k576J373K509n399
$$ -1196 -1050 1130 -1021 1319 -194 -953 1373 -1781 678 1271 -1612 1219 -1357 16 2525 -2874
2452b874L602J62k890M928m423n1M529n628M148P5n778O982k371k155M392o004
$$ -2874 728 890 -2000 2928 -1495 -1546 2983 -2645 1503 1578 -4200 2782 411 -1744 2648 -3356
2468c356M027K817p261M840n64k258N358n811M24M427m122L181j383m032N565
$$ -3356 671 3488 -3773 1067 503 -1755 3603 -2208 -1784 2643 -1479 1702 319 -3713 1852
2483A852n35j208l1l283M170J777l290l98q04K670R51k222j82j240K693J280l543
$$ 1852 1317 109 78 -3205 965 2742 -548 -946 -1750 920 1871 -351 -533 -1773 920 2200 -1343
2500a343J041r52J709L191o685J349L646k469L392m970k003Q501m336l01J197
$$ -1343 -302 -1254 455 3646 -3039 -1690 1956 -513 2879 -2091 -4094 4407 71 -230 967
2515I67o160P846J051o640L888l964K681O683r579Q30L651k557N696n406l778
$$ 967 -5193 2653 3704 -2936 952 -3012 -331 6352 -3227 -2397 1254 -1303 4393 -1013 -4791
2530d791P747k573L20K84n518N862J804l866L78k600L360L864m809k148J060L304
$$ -4791 2956 383 703 987 -4531 1331 3135 -731 -353 -2953 407 4271 -538 -2686 -1626 1678
2546A678J472m268j236Q26L482J407n551M33J260J035L877o757j644O450k047
$$ 1678 3150 -1118 -2354 -1528 1954 3361 -2190 -1757 -497 538 4415 -2342 -3986 2464 417
2561D17K105l178n319R894j355m565L256n713N657M423r556L524j62j313Q565
$$ 417 2522 -656 -5975 3919 2564 -2001 1255 -4458 1199 5622 -3934 -410 -572 -1885 6680
2576F680q604l070P717l330L718k294p545R246N68m052J872m981M135M677n804
$$ 6680 -1924 -4994 2723 -607 3111 817 -6728 2518 3086 -966 906 -4075 60 4737 -1067
2591a067n6p00J274M793m086l091J347K834K319m494j759J718K446K140n800o83
$$ -1067 -1123 -1823 -549 4244 158 -2933 -1586 1248 3567 -927 -2686 -968 1478 3618 -2182 -2865
2607b865L924j061L414m126m431P906j616n69Q73p749Q252L100q566M618l579
$$ -2865 1059 -2 3412 -714 -5145 2761 1145 576 1449 -6300 1952 5052 -3514 1104 -2475
2622b475R33Q630j0369N83N282n797P833l445p907R806k467n55L120r254O111
$$ -2475 -1542 7088 -3281 -2698 2584 -3213 4620 1175 -6732 3074 607 52 3172 -6082 29
2637B9N125p252K536k439K02O838n702j507K146j186M235k020l906K159J239K034
$$ 29 5154 -2098 438 -2001 -1799 5039 -663 -2170 -24 -1210 3025 1005 -2901 -742 497 2531
2653B531k286l013K198J639J721l819k131M769j554J450n53n849O981O9m103M874
$$ 2531 245 -2768 -570 1069 2790 -1029 -3160 1609 55 1505 952 -4897 2084 2153 -1950 2924
2669B924o919K470Q175j0040K716J961n399R855n760n397R536o057K475L352r923
$$ 2924 -3995 -1525 6650 -3390 -674 1287 -4112 5743 -17 -5414 4122 -1935 540 3892 -6031
2684f031P568R10n245O793p364P72Q422q238K172J171m678P953l541m411N996
$$ -6031 1537 2447 -2798 3995 -3369 -2597 5825 -2413 -241 930 -3748 4205 664 -3747 2249
2699B249l196J131K022m581K064J174l10j5j981J436M0J199m64l967M569K6l099
$$ 2249 -947 184 2206 -2375 -311 863 553 538 -1443 -7 33 1232 768 -3199 1370 1396 -1703
2716a703L838m280J400M071o090L968n21m187P524n047r62N276p178N975M24q134
$$ -1703 2135 -2145 -745 3326 -2764 1204 683 -3504 4020 -1027 -1989 3287 -3891 2084 2508 -5626
2732e626R811m293l633R191r074K776N613j0295P815K10p551Q825m351j933O300
$$ -5626 4185 -108 -3741 5450 -3624 -848 4765 -5530 2285 2495 -5056 3769 -582 -2515 3785
2747C785o385K932J450m674N310k601j341L382l657L210p82l274M806k339o02
$$ 3785 -2600 332 1782 -2892 2418 -183 -1524 1858 -1799 1411 629 -2645 2161 -178 -780
2762g80J817k721K944o84j424J263k225L608q20k735L371m822L989M240r677M910
$$ -780 1037 -1684 1260 576 -848 415 -1810 1798 978 -1757 1614 -3208 781 5021 -4656 254
2778B54R30m611R205p195l233R302p236L246K796r024P896q27m251N998o641L740
$$ 254 1184 -3427 5778 -1417 -4650 4652 -2584 662 3458 -5566 2330 1503 -2748 3250 -3391 349
2794C49M197r403N535k32j975P477r805l05Q420n586M274j973p831Q669J111k269
$$ 349 4546 -4857 678 446 -1529 5948 -3857 -4162 4258 -1328 2946 973 -6858 1811 2922 653
2810F53L67n658L975L885j969j191l805M757J219m169L726l344R83M576q049L042
$$ 653 1020 -4638 -663 3222 1253 62 -3743 1014 2233 -1936 1790 -1554 -571 4005 -4044 -1002
2826a002L722l580M562o620k314R328k062N11m865n242J2033r55l191Q12r483
$$ -1002 2720 -860 3702 -2918 -5232 4096 2034 2545 -2320 -7562 4471 3516 325 1137 -8346
2841h346R519N823r973N038m873j853J2294q725j905O146o110M996j663m879Q771
$$ -8346 1173 6996 -2977 2061 -2812 -4665 7629 -1096 -3001 3145 -2965 2031 368 -4511 4260
2856D260k530l103k68k952R343j99o693L09m082Q279O282j0613j567l47L310Q762
$$ 4260 1730 -1373 -1641 -4593 4750 4551 -2142 -1833 -5915 2364 8646 -1967 -3534 -3881 -571 8191
2872H191p691n018K558J170N325l994k777K876k945M445j745m105Q810n068l296
$$ 8191 500 -4518 -1960 -790 4535 541 -2236 640 -2305 2140 395 -3710 5100 32 -3264
2887c264M313n666R088K450j3557L613J830K950P075j2382k866O181P19P017p340
$$ -3264 1049 -4617 4471 6921 -6636 -3023 -1193 1757 8832 -3550 -6416 -235 484 7501 161
2902A61p088P119j061N113q10j0180P919J68l827O075n645J988L902q821L823
$$ 161 -6927 192 -869 4244 3434 -6746 1173 1341 -2486 3589 -2056 -68 3834 -4987 -1164
2917a164L424j039K278p344n03N810J486K281q852l048Q605K12K606m951p822
$$ -1164 2260 1221 3499 -3845 -4348 1462 2948 5229 -3623 -6671 1934 2146 4752 -199 -8021
2932h021R608J192k149K288p588L451M283m695L762k893o40M295o530L484K964
$$ -8021 1587 2779 630 2918 -4670 -1219 3064 -1631 2131 -762 -1402 2893 -3637 -153 2811
2947B811l684M257p417n29J0657n593M5o86o915J0587R55o177K747n665L659O512
$$ 2811 -873 3384 -4033 -4562 6095 502 547 -139 -7054 3533 4488 -1689 1058 -4607 -948 5564
2963E564o427O78j483k29N721n066Q07K018m070M308k604j176N949n313M15J637
$$ 5564 -863 -185 -1668 -1897 3824 -1242 -435 1583 -2487 1821 -783 -1959 3990 -1323 -908 729
2979G29l822O077j062m054J942k398M584J019n489K660j922J995L535o947L503
$$ 729 -3093 2984 1922 -2132 -190 -2588 1996 3015 -2474 186 -1736 259 3794 -3153 350
2994C50P20m259O882m233k063O173o159K716K170n875O330k162l630N469l831
$$ 350 1070 -3189 3693 -540 -2603 3570 -2589 127 2297 -3578 2752 590 -3040 2429 -1402
3009a402K147J130n717N800j277k417M490n457K438L197n635M198j444k810O122
$$ -1402 745 1875 -3842 1958 681 -1736 2754 -2703 -265 2932 -2703 1495 51 -2759 3363
3024C363l937q31K716k963L303j315k226L344k130J083q7k189M255k903o96K892
$$ 3363 -574 -1405 1311 -1652 1651 336 -1890 1454 -676 407 320 -1869 2386 -517 -1213 1679
3040A679m055L951M07m897L906j919Q56L906o809J720K402k124M286m950r21N386
$$ 1679 -2376 1575 1982 -2915 991 -928 -72 3834 -2975 -1255 1147 -977 3309 -1641 -2562 2824
3056B824m546L177j62n375O781k536k274N160n844L125L009p322M568O66k189
$$ 2824 -1722 1455 1293 -4082 2699 163 -2111 3049 -2795 330 3339 -3983 585 1251 -938
3071i38L816n559O15M944l062J542k572j643N291j754J2p76l506N437J87l033
$$ -938 2878 -2681 -2066 2878 -184 1358 -1214 -2857 2434 680 692 -84 -3590 1847 2034 -999
3087i99J269k457L013J390m154K053l53M97J384l963K460Q10j407K782m876P36
$$ -999 270 -2187 826 2216 -1938 115 -238 259 1643 -2320 140 950 -457 2325 -2551 -1815
3103a815N147l935J645j877l106P932k690l413K962l706M320J673o073L442j194
$$ -1815 3332 -603 1042 -835 -3941 3991 1301 -2112 850 -2856 1464 3137 -2936 506 -688
3118f88L5M336o011J019K827k726L720l658j905O446l619l73J082l162M859n13
$$ -688 -653 3683 -2328 -1309 1518 -1208 2512 -1146 -3051 3395 -224 -597 485 -2677 2182 1669
3134A669l711K340j639K227J507m168J100pJ461J884n006J312J952j071K418m059
$$ 1669 -2042 298 -1341 886 2393 -1775 -675 -682 779 2663 -2343 -1031 921 -150 2268 -1791
3150a791k27M444k965J315p66k761M803j356j328J281l296M177O84m590L028j576
$$ -1791 -2018 2426 -539 776 10 -2751 2052 696 -632 649 -2647 1530 2214 -2376 652 -924
3166i24R02L131n883K119K466l311L618k691k045M942k516M90J85l387M529j04
$$ -924 -22 3109 -2774 -655 1811 -1500 2118 -573 -2618 2324 -192 298 483 -2904 1625 1521
3182A521k592J310k254L006J155l977K178j001J44L041l866O58J330j636L048
$$ 1521 -1071 239 -2015 991 2146 -1831 347 -654 -510 2531 -1335 -677 653 -983 2065
3197B065k495j392L259j808J209j044k032M429k142q36J912l453L463O33l979
$$ 2065 -430 -1822 1437 -371 838 -206 -2238 2191 49 -787 1125 -2328 1135 1768 -2211
3212b211L379k221J68M174m924P07J785k070L533k782j713L949k487J226M79l389
$$ -2211 1168 -1053 -885 3289 -1635 -928 857 -1213 2320 -462 -2175 1774 -713 513 992 -2397
3228b397L688r82j224K616l643J810K212l445J654p27j40K647l041J67J216r31
$$ -2397 1291 309 -915 1701 -1942 -132 2080 -1365 289 -438 -578 2069 -972 -805 411 -520
3244e20K047k160l47J922k012K458r72k694L627j565K54J438m109L299Q99l235
$$ -520 1527 -633 -980 942 -1070 1388 416 -2278 1349 -216 38 1476 -2633 666 1565 -1670
3260a670L023k345K86L001m062K230K19k772M570k781j340L420l397K605N42m675
$$ -1670 1353 -992 -706 2295 -1767 463 682 -2090 2480 -301 -1641 1779 -1618 987 1529 -3146
3276c146M577p01k037L082l440J327K204l382K403r01j504L361k248J13O01j587
$$ -3146 1431 730 -1307 1775 -1665 -338 1866 -1516 887 -14 -1518 1843 -405 -292 309 -1278
3292a278K876j521j382K144j384J221k35j889K438j324J74J262k628K003j41r70
$$ -1278 1598 77 -1305 839 -545 676 441 -1448 990 -334 -160 1102 -1526 477 336 -634
3308f34K299l393J304K517l735K429p30j799M408l736N1L100m255L239K56l856
$$ -634 1665 -1728 -424 2093 -1642 787 57 -1742 2666 -1070 -1019 2081 -2174 1065 1321 -2535
3324b535M312k365l51L659n191K305K165l878L333j782j365M149l643P17J922
$$ -2535 1777 -588 -939 2720 -2471 -166 1999 -1879 1454 -328 -1693 2456 -1187 -470 1452
3339A452l248K827m82j845K369j932J086J056k776J844k11l30J205k402J633M09
$$ 1452 -1796 1031 549 -1296 1073 -859 227 1283 -1493 351 140 -190 1015 -1387 246 655
3355F55j437J874j939O47J097j950K311j658j165L665l154R66J294l509M160j394
$$ 655 -782 1092 -847 -200 897 -1053 1258 -400 -1565 2100 -1054 -88 1206 -2303 1857 463
3371D63k961M961l487K12L074m780L230N14l359M335l023q42M202l795J655L12
$$ 463 -2498 2463 -1024 -812 2262 -2518 712 1226 -2133 2202 -821 -1663 2539 -1256 399 711
3387G11l231M796k124j815L652l623J575J887l636K787q02j699K976j882m8J246
$$ 711 -2520 2276 152 -1663 1989 -1634 -59 1828 -1808 979 177 -1522 1454 -428 -476 770
3403G70j215Q18j066P24J127j986J213j119J02K758l118P44J110k933L622o15
$$ 770 -445 373 -693 31 1158 -828 385 -734 -632 2126 -992 -248 862 -2071 1551 936
3419I36k359K466k619J851J725m029L016j132j442L932l887J564K194n462M432
$$ 936 -1423 1043 -1576 275 2000 -2029 987 -145 -1587 2345 -1542 22 2216 -3246 1186
3434A186J9l768N485l636j396M437m028K479J381n137L304K06q43K170l341J011
$$ 1186 1205 -2563 2922 -714 -2110 2327 -1701 778 2159 -2978 326 532 -311 1859 -1482 -471
3450d71J012j401K709k116q63J989k133K248N1k618K469j184n45J795r89P34j397
$$ -471 541 -860 1849 -267 -1130 859 -1274 974 1025 -1593 876 -308 -853 942 -47 687 -710
3467g10l79K212j540J737j183k656M097j979K5L339n827J949L251m096L650j646
$$ -710 -1089 1123 -417 1320 137 -2519 1578 -401 -376 2963 -2864 -915 2336 -1760 1890 244
3483B44l108N045k811J35K708m108K280j55j620M051l637K76K290m220L861N37
$$ 244 -2864 2181 -630 -495 2213 -1895 385 230 -1390 2661 -976 -700 1590 -2630 1231 1768
3499A768l691L432k833k04M703l969J08J350k160K433k02r43L29j357J768l22
$$ 1768 -1923 1509 -1324 -1528 3175 -794 -686 664 -1496 937 735 -208 121 -1236 532 210
3515B10j39J031k876K165N65k804L686j684j885L139k573J563J216l554K533q25
$$ 210 71 1102 -1774 391 956 -1848 1838 154 -1731 1408 -1165 398 1614 -1940 593 -232
3531b32m76K694l302J588J47k704M913k653k037M521m334J652K706n067L795l36
$$ -232 -708 1986 -1316 272 419 -2285 2628 -25 -2062 2459 -1875 -223 2483 -2584 1211 875
3547H75l602M819k063j153K559k829J718K40j429K102k209O45J390k113K427j660
$$ 875 -2727 2092 29 -1124 1435 -1394 324 564 -865 1237 -972 -327 1063 -1050 1377 -283
3563b83j328L602k783K54J894k685J993l89j199K037j828Q58L39j543K248j971
$$ -283 -1611 1991 -792 -538 1356 -1329 664 275 -924 1113 -715 143 482 -1061 1187 -784
3579g84M13K241m167L038Q69l894L942j980j291M301m247Q28K587l727K844l24
$$ -784 -371 1870 -2297 741 1610 -2284 1658 -322 -1613 2688 -1559 -731 1856 -1871 973 649
3595F49k167K724k133J217Q62l162L019q20j043K679l572J656J888l760K884m30
$$ 649 -1518 1206 -927 290 1152 -2010 1009 189 -854 1825 -1747 -91 1797 -1963 921 491
3611D91j995L118k138P7J296j908J999r84p68J606j691K058q63k330L836k173
$$ 491 -1504 1614 -524 -447 849 -1059 940 -44 -812 794 -897 1161 298 -2032 1804 -369
3627c69m74K697l831K282J349l637L266j496j396L739k842L22Q93j857L167j985
$$ -369 -843 1854 -1977 305 1654 -1983 1283 -213 -1609 2130 -712 -390 503 -1354 1813 -172
3643a72j221K825k677J889O03l420L441j240j279L498l494M25K425k759J829o55
$$ -172 -1393 1432 -1245 644 1247 -2173 1268 28 -1251 2247 -1247 -822 1603 -1156 673 18
3659A8r41K377k083K39P00q53K155k350k84K108k356K649l16l594L296q30J07
$$ 18 -923 1454 -629 -390 310 -543 1612 -738 -1022 1086 -1270 1379 1063 -2531 765 -65 42
3676D2K114m315J419J970j857K115k133n56K524k492K149j73k873L642k069o90
$$ 42 2156 -2159 -740 1230 -627 1488 -645 -1201 1323 -1169 980 807 -2066 1576 -493 -1183
3692a183L121l332J996O61m217L843L24j586J637l326J252K696j771Q27k136o81
$$ -1183 1938 -1394 602 1263 -2954 889 1213 -373 1264 -2062 -810 1886 115 942 -1194 -1875
3708a875L299q79N18j497k275M135o13j152J225k573J767Q78k093K275j091o82
$$ -1875 1424 545 1063 -434 -2709 1426 813 -339 886 -1687 80 958 -1135 1140 49 -633
3724f33J296k190K033P03j387J050l254J451L831k836K39j737j217N753j734k411
$$ -633 663 -1527 506 1209 -178 872 -2382 -931 2900 64 303 -1434 -2651 3102 1368 -1043
3740a043J208k731L393J697l552J148j428P72K920l513R94R25j859K200k276M17
$$ -1043 165 -2566 827 2524 -1028 120 -1308 -536 2384 -1129 -135 790 -1069 1131 -1145 -728
3756g28L564l644r5O02j142M182j470l269J167m42L113P73m343J21O71K254J254
$$ -728 2836 -808 -903 -301 -1443 2739 1269 -2000 -833 -1275 1838 2611 -1732 -1611 -940 1314 2568
3773B568m098M31J033j21K187k807l72K327j908J177m08j235L121j698j470R29
$$ 2568 -1530 -1099 -66 -187 2000 -807 -1179 1148 -760 417 9 -1226 1895 197 -1273 -344
3789c44l53L329j730l645K326J91K061K98n182K043J948p27K339m204p86M205
$$ -344 -697 2632 902 -2743 -417 -226 1835 2133 -3049 -1006 942 215 2554 -1650 -2436 1769
3805A769j605O31j031j978M096j259j866J633j285K267m02l395K875r0J21J133
$$ 1769 164 795 -236 -2214 1882 623 -1243 390 -895 1372 970 -2425 450 360 481 1614
3821A614m100J376K872j252M29k678j94L973r62j237j158N4K993j082j266K29
$$ 1614 -2486 -1110 1762 510 939 -1739 -1933 2040 1078 -159 -1317 -1263 1730 648 -618 -389
3837c89p62K754r30k212J745p15J438L66l636K156J380j002N40k830J644K703
$$ -389 -1151 1603 673 -1539 206 -509 929 1295 -2341 -185 1195 193 733 -2097 -453 2250
3853B250k747O86j106k18L783k943r23J705j879L226n60m034L181J5j34J006l612
$$ 2250 -497 189 -917 -1135 2648 -295 -1218 487 -1392 1834 1274 -2760 421 436 302 1308 -2304
3870b304J873K243k205P11j283L33K423k124K5R4o05K483j590j531J716k83J154
$$ -2304 -431 1812 -393 318 -965 -632 1791 -333 -308 -214 -819 1664 74 -1457 259 -24 1130
3887A130j005k049K374N48o03p06j413K408K83j017K12j899K113J362k657J224
$$ 1130 125 -1924 450 998 395 -311 -1724 684 967 -50 162 -1737 376 1738 -919 305
3903C05j155K00L205l583k51K485j782J669j316j751L833j574q89R35k111K920
$$ 305 -850 -650 2555 -1028 -1279 1206 -576 1093 -223 -1974 1859 285 -604 331 -1780 1140
3919A140L96k981J593j148J177K410m116L35J883q19J726k264j138L119q60m64
$$ 1140 1536 -1445 148 -1000 177 2587 -1529 -1194 689 -130 1596 -668 -1806 1313 453 -11
3935a1k71p76K022l66r28j55m00K211n18j995O83n6K076l00l399J643J088J87
$$ -11 -282 -1058 964 598 -330 -485 -885 1326 808 -1187 -504 -560 1516 1216 -2183 -540 548 735
3953G35M24l126J178K086j227Q42k088l72L710k074m51L07j714M003j120l585
$$ 735 1159 -1967 -789 1297 70 912 -1176 -1548 2162 88 -363 -56 -1770 2233 1113 -2472
3969b472K901n50Q11R86m259K153K069j814J127k393OL567j683o94n79m85L358
$$ -2472 429 -121 690 1676 -2583 -430 1639 -175 952 -1441 -1435 2132 449 -245 -824 -1309 2049
3986B049j150k287Q61K17J834p39k676J486R42L37l98k022J117J192J62n46k547
$$ 2049 899 -1388 -527 -310 1524 785 -1891 -405 537 874 476 -1546 -429 763 925 379 -2168
4003b168J958J797j320j72j931J411L038l048m49N98n84L131k043k327K703r78
$$ -2168 -210 1587 267 95 -1836 -425 2613 -435 -884 -286 -870 2261 218 -2109 594 -384
4019c84J430K40m020K812J284j344Q85k935J344L318l217J34J01p04L231j929
$$ -384 1046 1286 -2734 78 1362 18 903 -2032 -688 2630 -587 -453 -352 -1056 2175 246
4035B46j833J827o56J558l17k740J710Q80P6k67k187J546J454j026l29j111J179
$$ 246 -1587 240 -416 1142 825 -1915 -205 675 751 484 -1703 -157 1297 271 -58 -1169 10
4052A0J228j299l5q04P14J777j868j49K4j78K482k186j246K241j014J228m09k579
$$ 10 1238 -61 -96 -900 -186 1591 -277 -426 -402 -580 1902 -284 -1530 711 -303 925 516 -2063
4070b063K966k83j162J680k621J170J927k439J214p41p72L162k360p16J787j516
$$ -2063 903 620 -542 1138 -1483 -313 1614 -825 389 -352 -1124 2038 -322 -1038 749 -767
4086g67J798n62k163K482o44l89J182j979R50P94r48P23j046J66J206q89J51m93
$$ -767 1031 469 -1694 788 144 -245 937 -1042 -92 702 -246 477 -569 -403 803 -86 65 -428
4104d28J67J169j414M97K33j033J637q48n04J135j469J226M29j927J567n96j50
$$ -428 -261 908 -506 -9 224 -809 828 -20 -524 611 -858 368 797 -1130 437 -159 -309
4121c09J542k443J181Q46j986K215j050j181K392j783O20R40k627K206L65j869
$$ -309 1233 -1210 -29 817 -1169 1046 -4 -1185 1207 -576 44 984 -1643 563 928 -941
4137i41J602j236L16J495k104R32M0o99J664j320k85Q60q21J394p24j438J803
$$ -941 661 -575 -259 1236 -868 64 104 -595 1069 -251 -536 324 -497 897 173 -1265 538
4154E38k66o7p2j269J610No23L23j096J267M33j288R07j322P55J801k493M08O41
$$ 538 272 205 133 -1136 474 479 -144 179 -917 350 783 -505 402 -920 -165 1636 -857 -449 192
4173A92q70K266j974j049K620j466M20M42k111K250n4j270J155j765J297J585
$$ 192 -678 1588 -386 -1435 1185 -281 139 581 -1530 720 666 -604 551 -1214 83 1668
4189A668k539N60l6P9K180k599o03J932p16Q98o88j471J818j06j82j0j191J310
$$ 1668 -871 -311 -347 -268 1912 -687 -1290 642 -74 824 136 -1335 483 377 195 185 -1006 304
4207C04K36o57l3p46J803M4k064Q45JQ95P07k824Q70J168m49J207k155n79K223
$$ 304 540 -117 -150 -896 907 951 -1113 -268 -267 628 1335 -1489 -619 549 100 1307 -848 -1427 796
4226G96o70O98r55j655K878o39j090J191j607J656L29k594K176M5q06J205k371
$$ 796 126 824 -131 -1786 1092 453 -637 554 -1053 603 932 -1662 514 559 -247 958 -1413
4243a413P48K293j489J94j351m79L097n26j400m71m49K434k9j724L29m34R79N22
$$ -1413 -665 1628 139 333 -1018 -1497 1600 1074 -326 -797 -1246 1188 1159 -565 -236 -670 309 831
4261H31j448P19n8k19M43j178J119Q79j089m35j176K003J792k336o98m06Q15K998
$$ 831 -617 102 44 -175 268 -910 209 1088 -1 -436 -1612 391 2183 -153 -851 -1257 -442 2556
4279B556k333j566R80o60K559j88k951J516j14K37J196k424J226J109k275R99
$$ 2556 223 -1343 -363 -1023 1536 1348 -1603 -87 -201 36 1232 -1192 34 1143 -1132 -133
4295a33n9M91J607l124l86J987J45J458k101k494K373J206O58j157k893J635K042
$$ -133 -192 299 1906 -1218 -1604 383 528 1986 -115 -2609 -236 970 1628 471 -2422 -787 1255
4312A255k94p88j454R63J076p05M7m54N90L93j577N85O73N06M32k833j41K556
$$ 1255 961 173 -1281 -318 758 53 100 -354 236 629 -948 -363 310 816 1248 -1585 -1726 830
4330H30N71kk892j116L781M68q51j259k076L034J294j893L44j632R44K409k641
$$ 830 1401 1399 -1493 -2609 1172 1640 789 -470 -2546 488 1782 -111 233 -1399 -455 1954 -687
4347f87J34J055p58J187j760o18L236j009j239m48o60L219J57k545m27k58K405
$$ -687 -553 502 -256 931 -829 -1447 1789 780 -459 -907 -1567 1652 1809 -736 -1163 -1421 984
$$ [...]
8191E6
##END NTUPLES=NMR FID
##END=
