##TITLE=1H_LY-877.1
 , 8 sc, 
 11.11.2019
##JCAMPDX= 6.0         $$ Bruker NMR JCAMP-DX V2.0
##DATA TYPE= NMR FID
##DATA CLASS= NTUPLES
##ORIGIN= UXNMR, Bruker Analytische Messtechnik GmbH
##OWNER= root
$$ XWIN-NMR		Version 3.5
$$ Mon Nov 11 14:51:31 2019 Russian Standard Time (UT+4h)  she@DPX200
##.OBSERVE FREQUENCY= 200.1315
##.OBSERVE NUCLEUS= ^1H
##.DELAY= (6, 6)
##.ACQUISITION MODE= SIMULTANEOUS
##.ACQUISITION SCHEME= undefined
##.AVERAGES= 8
##.DIGITISER RES= 18
##SPECTROMETER/DATA SYSTEM= spect
##.PULSE SEQUENCE= zg30
##.SOLVENT NAME= D2O
##.SHIFT REFERENCE= (INTERNAL, D2O, 0, 15.7039)
##AUDIT TRAIL= $$ (NUMBER, WHEN, WHO, WHERE, WHAT)
$$ ##TITLE= Audit trail, XWIN-NMR		Version 3.5
$$ ##JCAMPDX= 5.01
$$ ##ORIGIN= Bruker BioSpin GmbH
$$ ##OWNER= she
$$ F:/spectra/data/she/nmr/H-F/1/audita.txt
$$ ##AUDIT TRAIL=  $$ (NUMBER, WHEN, WHO, WHERE, WHAT)
(   1,<2019-11-11 14:50:17.21 +0400>,<she>,<DPX200>,
      <created by zg, POWCHK disabled, PULCHK disabled
       configuration hash MD5:
       00 E9 B6 7A A2 85 ED C7 34 08 36 98 17 FE 4E 26
       data hash MD5: 16K
       40 2F C9 6C 4B 88 15 14 C1 66 1B 3A EB 74 CA DD>)
$$ ##END=
$$ 
$$ hash MD5
$$ AF 4C 44 49 47 A2 2D 07 3D 2D 00 4F 61 33 22 11
##$RELAX= 
##$RELAX= 
##$RELAX= 
##$RELAX= 
##$RELAX= 
##$RELAX= 
$$ Bruker specific parameters
$$ --------------------------
##$DU= <F:/spectra>
##$EXPNO= 1
##$NAME= <H-F>
##$PROCNO= 1
##$TYPE= <nmr>
##$USER= <she>
##$AMP= (0..31)
100 100 100 100 100 100 100 100 100 100 100 100 100 100 100 100 100 100 
100 100 100 100 100 100 100 100 100 100 100 100 100 100 
##$AQSEQ= 0
##$AQ_mod= 1
##$AUNM= <au_zg>
##$AUTOPOS= <>
##$BF1= 200.13
##$BF2= 200.13
##$BF3= 200.13
##$BF4= 200.13
##$BF5= 200.13
##$BF6= 200.13
##$BF7= 200.13
##$BF8= 200.13
##$BYTORDA= 1
##$CFDGTYP= 0
##$CFRGTYP= 5
##$CHEMSTR= <none>
##$CNST= (0..31)
1 1 145 1 1 1 1 1 1 1 1 1 1 1 1 1 1 1 1 1 1 1 1 1 1 1 1 1 1 1 1 1 
##$CPDPRG= <>
##$CPDPRG1= <>
##$CPDPRG2= <>
##$CPDPRG3= <>
##$CPDPRG4= <mlev>
##$CPDPRG5= <mlev>
##$CPDPRG6= <mlev>
##$CPDPRG7= <mlev>
##$CPDPRG8= <mlev>
##$CPDPRGB= <>
##$CPDPRGT= <>
##$D= (0..31)
0 1.2 0 0 0 0 0 0 0 0.06 0 0.03 0 0 0 0 0.0002 0 0 0 0 0 0 0 0 0 0 0 0 
0 0 0 
##$DATE= 1573469416
##$DBL= (0..7)
120 120 120 120 120 120 120 120 
##$DBP= (0..7)
150 150 150 150 150 150 150 150 
##$DBP07= 0
##$DBPNAM0= <>
##$DBPNAM1= <>
##$DBPNAM2= <>
##$DBPNAM3= <>
##$DBPNAM4= <>
##$DBPNAM5= <>
##$DBPNAM6= <>
##$DBPNAM7= <>
##$DBPOAL= (0..7)
0.5 0.5 0.5 0.5 0.5 0.5 0.5 0.5 
##$DBPOFFS= (0..7)
0 0 0 0 0 0 0 0 
##$DE= 6
##$DECBNUC= <off>
##$DECIM= 24
##$DECNUC= <off>
##$DECSTAT= 4
##$DIGMOD= 1
##$DIGTYP= 9
##$DL= (0..7)
0 120 120 120 120 120 120 120 
##$DP= (0..7)
150 150 150 150 150 150 150 150 
##$DP07= 0
##$DPNAME0= <>
##$DPNAME1= <>
##$DPNAME2= <>
##$DPNAME3= <>
##$DPNAME4= <>
##$DPNAME5= <>
##$DPNAME6= <>
##$DPNAME7= <>
##$DPOAL= (0..7)
0.5 0.5 0.5 0.5 0.5 0.5 0.5 0.5 
##$DPOFFS= (0..7)
0 0 0 0 0 0 0 0 
##$DQDMODE= 0
##$DR= 18
##$DS= 0
##$DSLIST= <SSSSSSSSSSSSSSS>
##$DSPFIRM= 0
$$ [...]
##$SUBNAM2= <"">
##$SUBNAM3= <"">
##$SUBNAM4= <"">
##$SUBNAM5= <"">
##$SUBNAM6= <"">
##$SUBNAM7= <"">
##$SUBNAM8= <"">
##$SUBNAM9= <"">
##$SW= 24.0689530833862
##$SWIBOX= (0..15)
0 0 2 0 0 0 0 0 0 0 0 0 0 0 0 0 
##$SW_h= 4816.95568400771
##$TD= 16384
##$TD0= 1
##$TE= 0
##$TE2= 300
##$TE3= 300
##$TEG= 300
##$TL= (0..7)
0 120 120 120 120 120 120 120 
##$TP= (0..7)
150 150 150 150 150 150 150 150 
##$TP07= 0
##$TPNAME0= <>
##$TPNAME1= <>
##$TPNAME2= <>
##$TPNAME3= <>
##$TPNAME4= <>
##$TPNAME5= <>
##$TPNAME6= <>
##$TPNAME7= <>
##$TPOAL= (0..7)
0.5 0.5 0.5 0.5 0.5 0.5 0.5 0.5 
##$TPOFFS= (0..7)
0 0 0 0 0 0 0 0 
##$TUNHIN= 0
##$TUNHOUT= 0
##$TUNXOUT= 0
##$USERA1= <user>
##$USERA2= <user>
##$USERA3= <user>
##$USERA4= <user>
##$USERA5= <user>
##$V9= 5
##$VALIST= <valist>
##$VCLIST= <CCCCCCCCCCCCCCC>
##$VD= 0
##$VDLIST= <DDDDDDDDDDDDDDD>
##$VPLIST= <PPPPPPPPPPPPPPP>
##$VTLIST= <TTTTTTTTTTTTTTT>
##$WBST= 1024
##$WBSW= 4
##$XGAIN= (0..3)
0 0 0 0 
##$XL= 0
##$YL= 0
##$YMAX_a= 543095
##$YMIN_a= -533270
##$ZGOPTNS= <>
##$ZL1= 120
##$ZL2= 120
##$ZL3= 120
##$ZL4= 120
##$ABSF1= 10
##$ABSF2= 0
##$ABSG= 5
##$ABSL= 3
##$ALPHA= 0
##$AQORDER= 0
##$ASSFAC= 0
##$ASSFACI= 0
##$ASSFACX= 0
##$ASSWID= 0
##$AUNMP= <proc_1d>
##$AZFE= 0.1
##$AZFW= 0.1
##$BCFW= 1
##$BC_mod= 2
##$BYTORDP= 1
##$COROFFS= 0
##$CY= 11.3945322036743
##$DATMOD= 1
##$DC= 2
##$DFILT= <>
##$DTYPP= 0
##$F1P= 19.5091578491511
##$F2P= -0.509923556040331
##$FCOR= 0.5
##$FTSIZE= 0
##$FT_mod= 4
##$GAMMA= 1
##$GB= 0.15
##$INTBC= 1
##$INTSCL= 1
##$ISEN= 128
##$LB= 0.24
##$LEV0= 0
##$LPBIN= 0
##$MAXI= 10000
##$MC2= 0
##$MEAN= 0
##$ME_mod= 0
##$MI= 1.114404
##$NCOEF= 0
##$NC_proc= 0
##$NLEV= 6
##$NOISF1= 3.799351
##$NOISF2= 2.8
##$NSP= 1
##$NTH_PI= 0
##$NZP= 0
##$OFFSET= 15.70392
##$PC= 1
##$PHC0= -9609.411
##$PHC1= 11.60088
##$PH_mod= 1
##$PKNL= yes
##$PPARMOD= 0
##$PSCAL= 0
##$PSIGN= 0
##$REVERSE= no
##$SF= 200.130013532006
##$SI= 16384
##$SIGF1= 3
##$SIGF2= 2
##$SINO= 400
##$SIOLD= 16384
##$SREGLST= <1H.CDCl3>
##$SSB= 0
##$STSI= 0
##$STSR= 0
##$SW_p= 3612.71676300578
##$SYMM= 0
##$S_DEV= 0
##$TDeff= 0
##$TDoff= 0
##$TI= <>
##$TILT= no
##$TM1= 0
##$TM2= 0
##$TOPLEV= 0
##$USERP1= <user>
##$USERP2= <user>
##$USERP3= <user>
##$USERP4= <user>
##$USERP5= <user>
##$WDW= 1
##$XDIM= 8192
##$YMAX_p= 0
##$YMIN_p= 0
$$ End of Bruker specific parameters
$$ ---------------------------------
##NTUPLES= NMR FID
##VAR_NAME=  TIME,          FID/REAL,        FID/IMAG
##SYMBOL=    X,             R,               I
##VAR_TYPE=  INDEPENDENT,   DEPENDENT,       DEPENDENT
##VAR_FORM=  AFFN,          ASDF,            ASDF
##VAR_DIM=   8192,          8192,            8192
##UNITS=     SECONDS,       ARBITRARY UNITS, ARBITRARY UNITS
##FACTOR=    0.0002076,     1,               1
##FIRST=     0,             0,               0
##LAST=      1.7004516,     0,               0
##MIN=       0,             -533270,         0
##MAX=       1.7004516,     543095,          0
$$ Real data points
##PAGE= N=1
##DATA TABLE= (X++(R..R)), XYDATA
$$ plain form
0 0 0 0 0 0 0 -8 8 -8 8 -16 24 -25 32 -40 48 -57 73 -88 103 -121 143 -167 197 -227 262 -301 342 -390 447
29 447 -504 569 -643 723 -810 905 -1011 1125 -1254 1392 -1542 1710 -1894 2097 -2321 2566
45 2566 -2842 3152 -3505 3902 -4355 4880 -5501 6247 -7154 8285 -9748 11708 -14483 18682
59 18682 -25662 53926 -533270 -122257 340746 -395143 54742 543095 -217855 -295772 234169
70 234169 -122296 -102821 279771 -48351 -170862 122682 -46252 -7820 184892 -141593
80 -141593 -198260 146540 39844 -17386 188456 -23117 -290359 -63329 161772 87592 12603
91 12603 84557 -29661 -295292 -48136 328627 -11916 -159096 224117 -79987 -348979
101 -348979 278419 215035 -350434 71218 219401 -287159 64651 304141 -265235 -122198
$$ packed form
0@%%%%%qJ6j6J6k4M0m9N7p2Q8j05J30j61J91k24K64l10L64m24M89n63O43p32Q37
29D47r51J073j212J366j533J715j916K136k379K646k934L252l604L991m418M887
45B566n408N994o657P407q257R235j0381J1748j3401J5439j8033K1456k6191L3165
59A8682m4344P9588n87196M11013M63003p35889M49885M88353p60950p7917N29941
70B34169l56465J9475L82592l28122j22511K93544j68934L8432J92712l26485
80a41593n6667L44800j06696n7230K05842k11573k67242K27030K25101p4180p4989
91A2603P1954j14218k65631K47156L76763l40543j47180L83213l04104k68992
101c48979O27398o3384n65469M21652J48183n06560L51810K39490n69376J43037
$$ plain form
111 -122198 190843 -150759 61601 299702 -220201 -146561 160299 -210626 14833 421868
121 421868 -167744 -256874 247475 -126939 -226552 378968 81307 -336775 118382 119315 -225959
132 -225959 78759 184737 -156161 -88843 114296 34412 -25031 -3641 -7549 -52298 -53128 102506
144 102506 111704 -86897 -53628 19310 -82889 32621 134479 -35316 -27477 -1219 -116840
155 -116840 64618 126977 -126569 24721 118134 -206339 6831 261316 -182037 -131185
165 -131185 264397 -108857 -178464 292529 -9523 -278449 164339 77067 -197015 142301
175 142301 111199 -203883 17557 88375 -94234 69047 67930 -124486 25175 50383 -92326
186 -92326 68685 73983 -128863 4597 92742 -71601 -6322 85555 -53266 -63711 50474
$$ packed form
111a22198L13041l41602K12360K38101n19903P3640L06860l70925K25459M07035
121D21868n89612q9130N04349l74414r9613O05520k97661m18082M55157R33l45274
132b25959L04718J05978l40898O7318K03139p9884n9443K1390l908m4749q30J55634
144A02506R198j98601L3269P2938j02199J15510J01858j69795P839K6258j15621
155a16840J81458O2359k53546J51290R3413l24473K13170K54485m43353N0852
165a31185L95582l73254o9607M70993l02052k68926M42788q7272k74082L39316
175A42301l1102l15082K21440P0818j82609J63281j117j92416J49661K5208j42709
186i2326J61011N298k02846J33460Q8145j64343O5279R1877j38821j0445J14185
$$ plain form
197 50474 42972 -20058 -32983 20742 11284 -64949 40124 99543 -101589 -62099 122899 -47167
209 -47167 -73479 149035 -21141 -150969 94735 39198 -95722 95524 27832 -136105 52626
220 52626 48951 -79208 83579 26444 -141304 64303 72583 -115767 66364 83495 -162857
231 -162857 6490 140527 -86566 -20602 109432 -96078 -75417 119309 15715 -50826
241 -50826 35450 -25093 -54884 35444 39497 9269 -10010 -40875 -6573 16625 3117 37331
253 37331 5173 -62052 -5694 28330 2301 32759 -4358 -58970 9861 15795 -8724 61364
265 61364 -5890 -93587 31172 36495 -53063 67697 50165 -126322 -9542 86114 -50886
276 -50886 15744 86303 -91298 -62029 84968 -7652 -16748 66820 -45626 -66733 51854
$$ packed form
197E0474p502o3030j2925N3725r458p6233J05073N9419k01132L9490J84998j70066
209d7167k6312K22514j70176j29828K45704n5537j34920J91246o7692j63937J88731
220E2626l675j28159J62787n7135j67748K05607Q280j88350J82131J7131k46352
231a62857J69347J34037k27093O5964J30034k05510K0661J94726j03594o6541
241e0826Q6276o0543k9791R0328M053l0228j9279l0865L4302K3198j3508L4214
253C7331l2158o7225N6358L4024k6029L0458l7117n4612O8831N934k4519P0088
265F1364o7254q7697J24759N323q9558J20760j7532j76487J16780R5656j37000
276e0886O6630P0559j77601K9269J46997r2620r096Q3568j12446k1107J18587
$$ plain form
287 51854 10283 -8737 51640 -34753 -64840 38693 19356 -8318 43376 -19258 -68568 19154
299 19154 37655 -2218 16218 -2798 -43996 -14050 27606 31939 6116 -22390 -16832 -15558 -5577
312 -5577 49775 30547 -46771 -21559 7338 -20416 32802 52172 -40122 -34799 14576 -20891
324 -20891 15832 60838 -25794 -42744 13528 -18842 4862 66520 -15063 -55170 14858 -5215
336 -5215 -10415 60183 6520 -60935 -180 9668 -13252 42926 27552 -48039 -26004 7364 1872
349 1872 32083 27592 -30052 -34501 -4596 11171 29213 20320 -16721 -29932 -16308 10293 30885
362 30885 17589 -8612 -26889 -27993 10217 39371 13841 -9598 -20830 -34235 4764 47465
374 47465 14249 -14314 -12154 -33377 -10257 47755 25922 -15307 -12514 -29875 -19712 42737
$$ packed form
287E1854m1571j9020O0377q6393l0087J03533j9337k7674N1694o2634m9310Q7722
299A9154J8501l9873J8436j9016m1198K9946M1656M333k5823k8506N558J274R981
312e577N5352j9228p7318K5212K8897k7754N3218J9370r2294N323M9375l5467
324b0891L6723M5006q6632j6950N6272l2370K3704O1658q1583m0107P0028k0073
336e215n200P0598n3663o7455O0755R848k2920N6178j5374p5591K2035L3368n492
349A872L0211m491n7644m449K9905J5767J8042q893l7041j3211J3624K6601K0592
362C0885j3296k6201j8277j104L8210K9154k5530k3439j1232j3405L8999M2701
374D7465l3216k8563K160k1223K3120N8012k1833m1229K793j7361J0163O2449
$$ plain form
386 42737 36996 -13662 -18488 -24923 -19759 34399 40134 -8847 -21068 -21208 -19596 23652 41801 1985
400 1985 -23438 -25295 -17611 19058 41043 10918 -24430 -31912 -13682 19649 34329 14326 -18048
413 -18048 -34765 -15479 19560 29707 16542 -9511 -36919 -22729 20735 31671 15956 -6651
425 -6651 -36848 -26685 21896 32892 12070 -4663 -30836 -29249 17119 33355 12425 -2616
437 -2616 -26294 -32057 10789 35276 16339 -3629 -26159 -30919 8935 34061 16311 -4047 -23404
450 -23404 -27549 6143 29140 16430 -825 -20751 -27548 2855 26885 18755 1255 -22285 -27656
463 -27656 4790 25781 16366 1960 -21186 -26863 6607 23573 11533 4478 -15164 -28587 2729
476 2729 24121 11555 4379 -12945 -28817 1320 25617 10927 1508 -12203 -25766 2652 24334
$$ packed form
386D2737n741n0658m826o435N164N4158N735m8981j2221j40J612M3248J8149l9816
400A985k5423j857P684L6669K1985l0125l5348p482J8230L3331J4680k0003l2374
413a8048j6717J9286L5039J0147j3165k6053k7408J4190M3464J0936j5715k2607
425f651l0197J0163M8581J0996k0822j6733k6173J587M6368J6236k0930j5041
437b616k3678n763M2846K4487j8937j9968k2530m760L9854K5126j7750k0358j9357
450b3404m145L3692K2997j2710j7255j9926o797L0403K4030q130j7500k3540n371
463b7656L2446K0991r415j4406k3146n677L3470J6966j2040p055j9642j3423L1316
476B729K1392j2566p176j7324j5872L0137K4297j4690r419j3711j3563K8418K1682
$$ plain form
489 24334 6815 539 -7034 -23652 -572 23274 6782 -1098 -5338 -21414 -2471 23533 9565
502 9565 -4205 -9923 -17570 2901 20504 5997 -1611 -9410 -19581 5269 20350 465 1192
515 1192 -2131 -23587 710 24623 -474 -4121 968 -18942 1211 25739 -3618 -10930 800
528 800 -14322 5454 28488 -6881 -14749 2475 -18046 26 37503 1094 -21184 1337 -15449
541 -15449 -9179 35199 11897 -22262 -3473 -5084 -6094 20594 6550 -15624 -2884 -3174 3486
554 3486 21261 -3542 -20334 -3396 -6332 7734 35299 1565 -30243 -13096 -8976 7460 37174
567 37174 9530 -20310 -13585 -18931 2140 33590 2914 -11038 5973 -22135 -9273 39642
579 39642 -3341 -31757 14951 -1359 -12055 42051 5833 -51444 -4954 10308 -2648 41101
$$ packed form
489B4334j7519o276p573j6618K3080K3846j6492p880m240j6076J8943K6004j3968
502I565j3770n718p647K0471J7603j4507p608p799j0171K4850J5081j9885P27
515A192l323k1456K4297K3913k5097l647N089j9910K0153K4528k9357p312J1730
528H00j5122J9776K3034l5369p868J7224k0521J8072L7477l6409k2278K2521j6786
541a5449O270M4378k3302l4159J8789j611j010K6688j4044k2174J2740k90O660
554C486J7775k4803j6792J6938k936J4066K7565l3734l1808J7147M120J6436K9714
567C7174k7644k9840O725n346K1071L1450l0676j3952J7011k8108J2862M8915
579C9642m2983k8416M6708j6310j0696N4106l6218n7277M6490J5262j2956M3749
$$ plain form
591 41101 19619 -42327 -20619 -7266 -7126 45472 30377 -30587 -13240 -11089 -24871 33948 35169
604 35169 -28927 -9347 11106 -17379 10135 22921 -23661 -17928 10649 9662 20960 6683 -27368
617 -27368 -19936 -12665 6847 53373 20030 -38736 -17265 -16149 -20935 46418 43054 -26951 -13830
630 -13830 -6165 -29700 19163 33574 -14522 -1531 347 -22171 23667 18582 -38781 -640 15735
643 15735 -21567 33721 39698 -54522 -29525 22771 -18565 18229 61355 -21843 -45310 233
655 233 -15043 7818 48238 1597 -20674 -7419 -24470 8028 33651 -14949 -7027 18353 -22564
668 -22564 -1316 35457 -21555 -27165 19466 -2024 2832 32605 -10331 -30445 -7908 -8018 23728
681 23728 35669 -16155 -11756 -1004 -38407 11262 53347 -18838 -15347 27040 -33767 -21566
$$ packed form
591D1101k1482o1946K1708J3353J40N2598j5095o0964J7347K151j3782N8819J221
604C5169o4096J9580K0453k8485K7514J2786m6582N733K8577r87J1298j4277l4051
617b7368P432P271J9512M6526l3343n8766K1471J116m786O7353l364p0005J3121
630a3830P665k3535M8863J4411m8096J2991J878k2518M5838n085n7363L8141J6375
643A5735l7302N5288N977r4220K4997N2296m1336L6794M3126q3198k3467M5543
655B33j5276K2861M0420m6641k2271J3255j7051L2498K5623m8600P922K5380m0917
668b2564K1248L6773n7012n610M6631k1490M856K9773m2936k0114K2537j10L1746
681B3728J1941n1824M399J0752l7403M9669M2085p2185L491M2387o0807J2201
$$ plain form
693 -21566 49489 -3239 -28014 23654 -6503 -16405 29248 -6002 -23397 13883 -9144 -481
705 -481 37866 -16529 -27061 23150 -18270 -18452 52221 3478 -39611 17770 -2867 -30336 31579
718 31579 20058 -25469 3301 473 -13416 15731 358 -9357 16595 -13620 -14031 32217 -8021
731 -8021 -26069 28821 -4833 -29993 34688 10814 -35829 13437 8880 -23046 18033 10303 -19202
744 -19202 11268 -3280 -17480 24724 -1563 -22435 28986 -4103 -36376 33351 13460 -40719
756 -40719 21627 19696 -38915 12229 25426 -29297 3789 20196 -20290 2580 10791 -15238
768 -15238 12304 5326 -23149 16844 8600 -28684 18757 16466 -33683 11138 22287 -31001 3973
781 3973 26745 -21228 -4311 15504 -14411 3656 11698 -14914 7497 5370 -20999 16704 11519
$$ packed form
693b1566P1055n2728k4775N1668l0157r902M5653l5250j7395L7280k3027Q663
705d81L8347n4395j0532N0211m1420j82P0673m8743m3089N7381k0637k7469O1915
718C1579j1521m5527K8770k828j3889K9147j5373r715K5952l0215m11M6248m0238
731h021j8048N4890l3654k5160O4681k3874m6643M9266m557l1926M1079p730k9505
744a9202L0470j4548j4200M2204k6287k0872N1421l3089l2273O9727j9891n4179
756d0719O2346j931n8611N1144J3197n4723L3086J6407m0486K2870Q211k6029
768a5238K7542o978k8475L9993q244l7284M7441k291n0149M4821J1149n3288L4974
781C973K2772m7973J6917J9815k9915J8067Q042k6612K2411k127k6369L7703n185
$$ plain form
794 11519 -30049 14758 19421 -34833 8888 30391 -31052 -4755 27125 -21787 -2578 28705
806 28705 -17266 -10930 14486 -14278 3985 20725 -17616 955 14616 -28763 1803 31751
818 31751 -20203 -5153 27479 -24237 -14897 31134 -9674 -16145 22915 -3259 -11487 13257 -8630
831 -8630 -8900 11362 -6918 4697 18651 -17035 -7783 12507 -20872 -715 35045 -8738 -14977
844 -14977 15145 -16806 -15236 24382 1691 -5829 15860 -10951 -13575 10343 -10191 -268 24070
857 24070 -10888 -7321 21539 -19585 -20610 25096 -2797 -9986 31450 -3513 -30647 9401 -799
870 -799 -14413 23588 12547 -12368 4781 -10541 -19740 14209 7638 -3055 19189 -3775 -22740
883 -22740 7405 -2675 -15579 21369 15496 -12309 4192 -3215 -21724 3407 10397 1176 14271
$$ packed form
794A1519m1568M4807M663n4254M3721K1503o1443K6297L1880m8912J9209L1283
806B8705m5971O336K5416k8764J8263J6740l8341J8571J3661m3379L0566K9948
818C1751n1954J5050L2632n1716R340M6031m0808o471L9060k6174q228K4744k1887
831h630k70K0262j8280J1615J3954l5686R252K0290l3379K0157L5760m3783o239
844a4977L0122l1951J570L9618k2691p520K1689k6811k624K3918k0534R923K4338
857B4070l4958L567K8860m1124j025M5706k7893p189M1436l4963k7134M0048j0200
870g99j3614L8001j1041k4915J7149j5322r199L3949o571j0693K2244k2964j8965
883b2740L0145j0080j2904L6948n873k7805J6501p407j8509K5131O990r221J3095
$$ plain form
896 14271 2618 -14659 -3325 -9696 -6784 22087 8716 -7991 10201 -7960 -24343 8386
908 8386 7636 -6386 20122 9640 -21024 -3482 -1920 -13707 13880 16181 -4750 6994 -3491
921 -3491 -25017 1885 10692 -4175 16246 10963 -20800 -4176 4850 -15458 5172 20034 -3704
934 -3704 -205 4979 -16252 -7927 7952 -610 7462 12929 -5660 -6985 -5128 -12645 5133 16738
948 16738 1823 2149 -7 -16554 -5556 7750 -231 7535 10442 -8411 -6624 125 -7368 3065
962 3065 9438 -3518 3554 7032 -11218 -5634 3610 -7113 5506 16594 -4977 -6657 2768 -11935
976 -11935 -5097 15269 3834 -1065 5584 -10557 -11200 8175 3556 -486 7398 -3091 -7046 4271
990 4271 -1777 -4594 6137 746 -3081 5527 -305 -5456 1171 -2795 -2740 7947 4306 -2362 -1521
$$ packed form
896A4271j1653j7277J1334o371K912K8871j3371j6707J8192j8161j6383L2729
908H386p50j4022K6508j0482l0664J7542J562j1787K7587K301k0931J1744j0485
921c491k1526K6902Q807j4867K0421n283l1763J6624R026k0308K0630J4862k3738
934c704L499N184k1231Q325J5879q562Q072N467j8589j325J857p517J7778J1605
948A6738j4915L26k156j6547J0998J3306p981P766K907j8853J787O749p493J0433
962C065O373j2956P072L478j8250N584R244j0723J2619J1088k1571j680R425j4703
976a1935O838K0366j1435m899O649j6141o43J9375m619m042P884j0489l955J1317
990D271o048k817J0731n391l827Q608n832n151O627l966N5J0687l641o668Q41
$$ plain form
1005 -1521 -6597 -3469 7264 3045 72 3075 -5832 -5779 4851 182 -380 7003 -3851 -7592 5753
1020 5753 1471 -3930 4997 -1811 -7008 6997 3805 -6386 2324 548 -6730 4519 5219 -4553
1034 -4553 1781 992 -7926 1882 7153 -1985 -180 417 -6299 983 6738 -1227 -1643 703 -3340 -399
1050 -399 3416 574 491 -397 -3305 -134 1629 1308 2629 -2552 -4464 3070 1788 -1926 2815 -1212
1066 -1212 -4935 4295 2385 -4486 3404 1244 -7373 2365 4843 -3963 2907 2601 -9260 461 7923
1081 7923 -3535 -220 4599 -6765 -2068 7465 -2841 -2564 6239 -3021 -5295 5054 838 -3039
1095 -3039 3197 -944 -4492 3376 3302 -2527 -1024 120 -925 664 1998 429 -1645 -762 982 -1537
1111 -1537 -331 4701 -781 -4900 2378 699 -3119 5139 1021 -7758 3313 4484 -6706 2463
$$ packed form
1005a521n076L128J0733m219k973L003q907N3J0630m669n62P383j0854l741J3345
1020E753m282n401Q927o808n197J4005l192j0191Q710j776p278J1249P00r772
1034d553O334p89q918R808N271r138J805N97o716P282N755p965m16K346m043K941
1050c99L815k842q3q88k908L171J763l21J321n181j912P534j282l714M741m027
1066a212l723R230j910o871P890k160q617R738K478q806O870l06j1861R721P462
1081G923j1458L315M819j1364M697R533j0306K77Q803r260k274J0349m216l877
1095c039O236m141l548P868p4n829J503J144j045J589J334j569k074Q83J744k519
1111a537J206N032n482m119P278j679l818Q258m118q779J1071J171j1190R169
$$ plain form
1125 2463 5579 -7819 267 6953 -6764 -422 8967 -6730 -4955 8662 -2461 -3965 7819
1138 7819 -3443 -6927 7833 945 -6595 5075 1761 -6600 2753 3207 -4389 1701 3472 -4501
1152 -4501 -1818 4109 623 -2238 668 756 -2546 617 4094 -2745 -3127 5375 -971 -5905 6266
1167 6266 2323 -7968 4416 3310 -9633 5174 8183 -11458 179 10080 -9612 -1241 12016
1180 12016 -9132 -4804 13365 -6663 -8212 13490 -2561 -10429 10602 -55 -10251 9916
1192 9916 2479 -12259 5736 6156 -8711 2718 5820 -7541 -309 6107 -3982 -2009 5454 -400
1206 -400 -4742 837 3212 -1884 -1262 4418 -1979 -5387 6649 1747 -9486 5447 6311 -11225 3171
1221 3171 9615 -12281 605 13129 -13030 -3397 17524 -10139 -8779 17006 -7717 -11233 19148
$$ packed form
1125B463L116j3398Q086O686j3717O342R389j5697J775J3617j1123j504J1784
1138G819j1262l484J4760o888p540J1670l314q361R353M54p596O090J771p973
1152d501K683N927l486k861K906Q8l302L163L477o839l82Q502o346m934J2171
1167F266l943j0291J2384j106j2943J4807L009j9641J1637R901j9692Q371J3257
1180A2016k1148M328J8169k0028j549K1702j6051p868K1031j0657j0196K0167
1192I916p437j4738J7995M20j4867J1429L102j3361P232O416j0089J973P463n854
1206d00m342N579K375n096O22N680o397l408J2036m902j1233J4933Q64j7536J4396
1221C171O444k1896J2886J2524k6159R633K0921k7663J360K5785k4723l516L0381
$$ plain form
1234 19148 -3679 -16199 16927 1336 -18303 13643 6288 -17567 9469 8575 -17301 5425
1246 5425 12521 -13590 -510 11139 -8930 -2179 9981 -5535 -4452 7324 -1253 -4812 3194
1259 3194 2380 -2530 -1477 2889 95 -4148 4054 3169 -9258 2780 9782 -10547 -1586 13269
1273 13269 -11173 -5729 17993 -9010 -11105 20790 -5920 -18470 20103 1367 -20074 18342
1285 18342 4941 -24384 14613 11465 -23977 9649 15611 -21964 4226 16856 -19746 293
1297 293 19059 -15978 -4698 18823 -10241 -8191 14705 -6336 -8737 13332 -530 -9634 5927
1310 5927 2056 -5955 1399 3933 -423 -2895 849 2890 -5465 -505 10165 -5956 -7722 12443
1324 12443 -3036 -11363 14550 -266 -16258 15220 3911 -20658 14021 9853 -23026 10548
$$ packed form
1234A9148k2827j2520L3126j5591j9639L1946p355k3855K7036q94k5876K2726
1246E425P096k6111J3080J1649k0069O751J2160j5516J083J1776q577l559Q006
1259C194q14m910J053M366k794m243Q202q85j2427J2038P002k0329Q961J4855
1273A3269k4442N444K3722k7003k095L1895k6710j2550L8573j8736k1441L8416
1285A8342j3401k9325L8997l148l5442L3626N962l7575K6190J2630l6602K0039
1297B93J8766l5037J1280K3521k9064K050K2896k1041k401K2069j3862r104J5561
1310E927l871q011P354K534m356k472L744K041q355M960J0670j6121j766K0165
1324A2443j5479q327K5913j4816j5992L1478j1309k4569L4679m168l2879L3574
$$ plain form
1336 10548 14168 -24242 7295 19041 -25196 1461 25018 -20758 -5739 24136 -17911 -10188
1348 -10188 26528 -9955 -14177 21987 -6468 -18018 17247 1358 -12753 13789 1436 -14988
1360 -14988 6736 3931 -8335 5354 4526 -4396 1167 -573 -3600 -225 384 4796 1709 -4767
1374 -4767 4477 -1188 -12813 7221 8313 -10044 9944 8421 -22971 1213 15649 -17347 4291
1387 4291 24396 -18498 -8402 19539 -19194 -9953 29905 -7212 -13469 23830 -10285 -22960
1399 -22960 19986 -1205 -15531 26125 4865 -24370 9385 525 -21349 15964 16016 -12970 6949
1412 6949 4735 -22488 -1981 12255 -2127 6870 9086 -8616 -7345 -2988 -3693 4088 5764 6736
1426 6736 5451 -10244 -8603 1782 -7721 3615 19982 -2557 -5555 7314 -18533 -13858 20956
$$ packed form
1336A0548L620l8410L1537J1746m4237K6657K3557m5776J5019K9875m2047P723
1348a0188L6716l6483m222L6164k8455j1550L5265j5889j4111K6542j2353j6424
1360a4988K1724k805j2266J3689q28q922N563j740l027L375O09M412l087o476
1374d767R244n665j1625K0034J092j8357J9988j523l1392K4184J4436l2996K1638
1387D291K0105m2894J0096K7941l8733R241L9858l7117o257L7299l4115j2675
1399b2960M2946k1191j4326M1656k1260k9235L3755q860k1874L7313N2k8986J9919
1412F949k214k7223K0507J4236j4382Q997K216j7702J271M357p05P781J676R72
1426F736j285j5695J641J0385r503J1336J6367k2539k998J2869k5847M675L4814
$$ plain form
1439 20956 2770 -2952 21511 -10425 -25706 12509 -2367 -13705 29071 10440 -23155 8936
1451 8936 -1401 -29103 14584 20073 -14077 12930 13333 -29091 -7220 11349 -12246 10573 25533
1464 25533 -10724 -9884 2392 -17558 -4162 19430 5455 3550 5803 -14560 -13550 1070 1563
1477 1563 8991 11316 145 -2227 -8962 -13105 2387 5089 4025 16383 641 -16891 -341
1490 -341 -5700 -13095 18716 16133 -9185 6778 -2383 -28574 3921 17420 -7870 12667 15933
1503 15933 -23473 -8362 9144 -16182 4871 26943 -7975 -6341 10646 -18931 -12085 18016
1515 18016 -928 -222 20070 -7463 -18695 3571 -4831 -3860 18881 6339 -6861 1182 -9132
1528 -9132 -11346 6290 6410 5135 7734 -5647 -8342 -1624 -5866 2702 10681 -359 2624 3684
$$ packed form
1439B0956j8186n722K4463l1936j5281L8215j4876j1338M2776j8631l3595L2091
1451H936j0337k7702M3687N489l4150K7007M03m2424K1871J8569k3595K2819J4960
1464B5533l6257Q40J2276j9950J3396K3592j3975j905K253k0363J010J4620M93
1477A563P428K325j1171k372o735m143J5492K702j064J2358j5742j7532J6550
1490c41n359p395L1811k583k5318J5963r161k6191L2495J3499k5290K0537L266
1503A5933l9406J5111J7506k5326K1053K2072l4918J634J6987k9577O846L0101
1515A8016j8944P06K0292k7533j1232K2266q402R71K2741j2542j3200Q043j0314
1528i132k214J7636J20j275K599j3381k695O718m242Q568P979j1040K983J060
$$ plain form
1542 3684 -13772 -5373 7394 -4376 5228 14372 -8711 -6459 5667 -13024 -3472 18952 -1394
1555 -1394 -4348 10713 -11755 -12540 13765 -924 -6109 16046 -1622 -14039 7720 -1978 -10481
1568 -10481 12949 4512 -9894 7774 1055 -12839 4475 3662 -6124 8728 4431 -9932 1130
1581 1130 921 -6504 5907 4505 -4473 3480 -794 -7589 3783 2314 -2999 5545 -1003 -6480 5421
1596 5421 -146 -6060 6503 588 -6163 6758 -346 -8308 7170 1710 -8295 6927 2436 -9083
1610 -9083 5628 2453 -9235 6761 5271 -9934 3104 4063 -8588 5038 6423 -8920 2253
1623 2253 5092 -9021 1814 7146 -5927 1839 4958 -8486 105 6420 -5350 958 5796 -5501
1637 -5501 28 4125 -6631 166 6122 -3759 810 4188 -5931 -568 3715 -5071 2034 6443
$$ packed form
1542C684j7456Q399J2767j1770R604R144k3083K252J2126j8691R552K2424k0346
1555a394k954J5061k2468p85K6305j4689n185K2155j7668j2417K1759r698q503
1568a0481K3430q437j4406J7668o719j3894J7314q13r786J4852m297j4363J1062
1581A130k09p425J2411j402q978P953m274o795J1372j469n313Q544o548n477J1901
1596E421n567n914J2563n915o751J2921p104p962J5478n460j0005J5222m491j1519
1610i083J4711l175j1688J5996j490j5205J3038R59j2651J3626J385j5343J1173
1623B253K839j4113J0835N332j3073P766L119j3444Q591O315j1770O308M838j1297
1637e501N529M097j0756O797N956r881M569L378j0119N363M283q786P105M409
$$ plain form
1651 6443 -4533 -740 2499 -6374 1384 6323 -4530 942 4911 -6681 -1029 4657 -5149 1651
1665 1651 7143 -5902 -1448 5364 -6064 -1070 6782 -4415 -2 7208 -6299 -3749 6365 -3961
1679 -3961 -1407 7810 -3878 -3257 6175 -4538 -4138 7357 -1280 -2896 5607 -3298 -4375 5707
1693 5707 -1569 -3452 5609 -699 -3389 3665 -2400 -3093 5096 -715 -2661 3833 -1657 -2490 3523
1708 3523 -2332 -1655 5058 -2022 -2597 3866 -2711 -1588 5162 -3217 -2511 5876 -2825 -3535 5573 -2497
1724 -2497 -3013 6584 -2815 -4878 6693 -1250 -5084 6094 -749 -5141 5955 -641 -6057 5957
1738 5957 1359 -5680 4062 723 -5324 4306 1500 -5186 3554 2016 -4810 2099 1161 -3455 3141
1753 3141 1104 -3737 2389 746 -3169 2171 -172 -2244 4012 -405 -3779 3111 -706 -3108 4419
$$ packed form
1651F443j0976L793L239q873P758M939j0853N472L969j1592N652N686r806O800
1665A651N492j3045M454O812j1428M994P852j1197M413P210j3507K550J0114j0326
1679c961K554R217j1688O21R432j0713M00J1495q637j616Q503q905j077J0082
1693E707p276j883R061o308k690P054o065o93Q189n811j946O494n490q33O013
1708C523n855O77O713p080n75O463o577J123O750q379P06Q387q701p10R108q070
1724b497n16R597r399k063J1571p943l834J1178o843m392J1096o596n416J2014
1738E957m598p039R742l339o047R630k806o686Q740j538o826O909r38m616O596
1753C141k037m841O126j643l915N340k343k072O256m417l374O890l817k402P527
$$ plain form
1768 4419 -631 -3530 5003 -915 -5478 4645 788 -4241 5001 84 -6034 4658 1240 -6199
1782 -6199 4317 2567 -5479 3323 1739 -6232 3211 3294 -5288 2339 3105 -4661 1644 1951 -4685 2390
1798 2390 3118 -3901 1277 1636 -3545 2103 1292 -3778 3028 1643 -4264 2299 913 -3938 3754 1143
1814 1143 -5214 3629 2001 -5613 3170 1990 -5597 3940 2756 -6815 2893 3982 -6318 1922 3948
1829 3948 -5775 2135 4451 -6255 690 4926 -4801 228 4129 -4284 452 3825 -4299 38 3796
1844 3796 -2913 255 2097 -3503 1451 2419 -3723 1538 2031 -3684 2264 1378 -4692 3564 2353 -6084
1860 -6084 2948 3071 -6164 3463 3467 -7709 3161 5419 -7978 1723 6242 -7524 1132 6785 -7773
1875 -7773 34 8166 -7093 -2039 7953 -5156 -2143 7388 -5146 -3139 7584 -3311 -3811 5921
$$ packed form
1768D419n050k899Q533n918m563J0123l857n029R242m917o118J0692l418p439
1782f199J0516j750q046Q802j584p971R443Q3q582P627P66p766O305L07o636P075
1798B390P28p019N178L59n181N648q11n070O806j385n907O563j386m851P692k611
1814A143o357Q843j628p614Q783j180p587R537j184r571R708J089j0300Q240K026
1829C948r723P910K316j0706O945M236r727N029L901q413M736L373q124M337L758
1844C796o709L168J842n600M954R68o142N261M93n715N948q86o070Q256j211q437
1860f084R032J23r235R627Mj1176J0870K258j3397R701M519j3766Q656N653j4558
1875g773P807Q132j5259N054R992j3109L013R531j2534K007J0723j0895n00R732
$$ plain form
1889 5921 -2303 -3002 4886 -2192 -2374 4472 -1880 -2229 2918 -1736 100 2764 -3541 203 3158 -3630
1905 -3630 1285 3084 -5205 1936 4118 -6811 1894 6159 -7278 672 6384 -7980 889 9063
1919 9063 -8516 -1947 9555 -7507 -2774 10687 -6574 -4378 10741 -6020 -6388 11309 -2944
1932 -2944 -7069 9363 -2575 -7405 9249 -909 -7993 7447 826 -6743 5758 403 -6337
1945 -6337 4623 897 -4686 4507 942 -3993 2107 -1574 -1968 5151 -896 -2023 3299 -3981 -1682
1960 -1682 5724 -3744 -908 7458 -5649 -3871 7901 -5042 -3550 10202 -5127 -5714 11504 -4222
1974 -4222 -8709 10267 -2752 -7980 12907 -502 -11249 9326 -711 -12086 10738 4949 -9958
1987 -9958 7552 1462 -13785 6115 6958 -8436 5603 5242 -10358 1802 4434 -7674 3367
$$ packed form
1889E921q224o99P888p078j82O846o352l49N147m654J836K664o305L744K955o788
1905c630M915J799q289P141K182j0929Q705M265j3437P950N712j4364Q869Q174
1919I063j7579O569J1502j7062M733J3461j7261K196J5119j6761l68J7697j4253
1932b944m125J6432j1938m830J6654j0158p084J5440o621p569J2501n355o740
1945f337J0960l726n583R193l565m935O100l681l94P119o047j127N322p280K299
1960a682P406r468K836Q366j3107J778J1772j2943J492J3752j5329n87J7218j5726
1974d222m487J8976j3019n228K0887j3409j0747K0575j0037j1375K2824n789j4907
1987i958J7510o090j5247J9900Q43j5394J4039l61j5600J2160K632j2108J1041
$$ plain form
2000 3367 6182 -5446 1447 2725 -5995 915 1531 -3608 5062 3265 -3967 1401 -3370 -5796 6828
2015 6828 2293 -2864 7121 -2869 -10108 5720 287 -5478 11892 1677 -12293 6326 1189 -11718
2029 -11718 9381 5839 -11560 8124 6259 -15391 3512 7646 -12505 5675 12272 -11181 433
2042 433 7442 -14409 -1004 13916 -4729 252 8595 -11536 -6164 8927 -3411 168 10102
2055 10102 -4515 -5379 3091 -4808 -695 6972 -1596 70 3365 -4674 -681 999 -5301 4144 6077
2070 6077 -4165 2896 731 -11146 2686 6270 -6118 7277 7375 -13701 -1191 6530 -10040
2083 -10040 5219 13340 -11430 -2327 9947 -12176 -2639 14372 -7693 -3368 13650 -8651 -7819
2096 -7819 12309 -6109 -7635 13597 -1436 -7302 9949 -4560 -11220 9327 2499 -5436 8284
$$ packed form
2000C367K815j1628O893J278q720O910O16n139Q670j797p232N368m771k426J2624
2015F828m535n157R985r990p239J5828n433n765J7370j0215j3970J8619n137j2907
2029a1718K1099l542j7399J9684j865k1650J8903M134k0151J8180O597k3453J1614
2042D33P009k1851J3405J4920j8645M981Q343k0131N372J5091j2338L579R934
2055A0102j4617q64Q470p899M113P667q568J666L295q039L993J680o300R445J933
2070F077j0242P061k165j1877J3832L584j2388J3395R8k1076J2510P721j6570
2083a0040J5259Q121k4770R103J2274k2123R537J7011k2065M325J7018k2301Q32
2096g819K0128j8418j526K1232j5033n866J7251j4509o660K0547o828p935J3720
$$ plain form
2109 8284 -343 -9552 3377 546 -3727 6927 1925 -4716 1235 -2344 -2249 4868 -1175 -1173 4520 -3643
2125 -3643 -1536 4867 -5501 -1314 8023 -4918 -1896 8732 -6682 -4855 9171 -5452 -3676
2138 -3676 12835 -5016 -8836 10397 -3726 -8050 13036 -1203 -10705 10619 -313 -11994 10244
2151 10244 3478 -11231 7702 3313 -11483 6624 5517 -10478 3985 5555 -8562 3040 5043
2164 5043 -7657 2198 4877 -6492 1317 4255 -4717 1268 2545 -4537 2027 2380 -3699 2081 596
2179 596 -3558 3701 -115 -4353 5152 9 -5774 5258 283 -6128 7130 993 -9002 6107
2193 6107 2794 -8839 6258 4028 -10038 4712 4863 -10136 4646 7352 -9994 1589 6488
2206 6488 -9107 2587 8847 -9202 -1068 7814 -7290 -604 8962 -5957 -2701 6664 -5503
$$ packed form
2109H284q627r209J2929k831m273J0654n002o641N951l579R5P117o043KN693q163
2125c643K107O403j0368M187R337j2941L022J0628j5414J827J4026j4623J776
2138c676J6511j7851l820J9233j4123m324K1086j4239r502K1324j0932j1681K2238
2151A0244o766j4709J8933m389j4796J8107j107j5995J4463J570j4117J1602K003
2164E043j2700R855K679j1369P809K938q972N985J277p082O564L53o079N780j485
2179E96m154P259l816m238R505n143n783J1032m975o411J3258o137r995J5109
2193F107l313j1633J5097k230j4066J4750J51j4999J4782K706j7346J1583M899
2206F488j5595J1694O260j8049Q134Q882j5104O686R566j4919L256R365j2167
$$ plain form
2219 -5503 -2136 7909 -3120 -3227 4345 -3334 -1087 5392 -3101 -2168 3374 -2476 617 4205 -3891
2234 -3891 -1214 2358 -4148 1967 6102 -3726 -1244 1254 -6505 2246 7979 -3672 -544 3032 -7959
2249 -7959 -322 8007 -4045 -50 6722 -7310 -3210 8187 -4177 -3104 7487 -4202 -2952
2262 -2952 9437 -3281 -7313 4671 -2268 -2490 10176 356 -6931 2069 -3867 -4878 9094 4328
2276 4328 -3286 1788 -4696 -7015 5636 3851 -1311 3577 -1737 -5158 2569 -220 -2598 3813 -145
2291 -145 -1702 4696 -1013 -4366 953 -3570 -1344 9423 2576 -3832 -28 -6974 -5514 8921 4970
2306 4970 -946 4036 -5265 -9782 3921 3346 -590 7227 -586 -8611 2472 1206 -4910 4368 2173
2321 2173 -4456 5217 2953 -7221 -627 68 -4521 6042 7412 -2729 -1167 -3359 -8545 2603
$$ packed form
2219e503L367J0045j1029j07P572p679K247O479q493R33N542n850L093L588q096
2234c891K677L572o506O115M135r828K482K498p759Q751N733j1651L128L576j0991
2249g959P637Q329j2052L995O772j4032M100J1397j2364J073J0591j1689J250
2262b952J2389j2718m032J1984o939k22J2666r820p287R000n936j011J3972m766
2276D328p614N074o484k319J2651j785n162M888n314l421P727k789k378O411l958
2291a45j557O398n709l353N319m523K226J0767o847o408L804o946J460J4435l951
2306D970n916M982r301m517J3703n75l936P817p813q025J1083j266o116R278k195
2321B173o629R673k264j0174O594O95m589J0563J370j0141J562k192n186J1148
$$ plain form
2335 2603 8372 2044 2363 -2152 -9034 -1046 3650 549 4826 2282 -5584 -833 423 -3439 2878
2350 2878 2566 -3394 2766 3354 -3862 -482 -1185 -5498 4179 7106 -1126 386 -1792 -8647 341 6227
2366 6227 892 4132 1981 -8731 -3546 3267 -482 3805 4673 -4905 -2251 2293 -3071 119 3526
2381 3526 -2225 594 3634 -2569 -1187 983 -4158 135 5052 320 1052 505 -6568 -2068 4161
2396 4161 604 2557 2838 -5075 -2673 1943 -2173 1832 5023 -2894 -1961 2110 -3217 -207 4373
2411 4373 -2773 -1398 4411 -1798 -2032 2811 -2713 -1936 4494 -434 -1760 3022 -1785 -3251 2395
2426 2395 162 -503 3222 -1187 -2961 1309 -313 -688 2397 -521 -1046 1594 -1629 -1327 2063 -409
2442 -409 -20 1753 -2447 -846 2465 -1557 -261 2882 -2310 -1254 2739 -2242 -494 4345 -2364
$$ packed form
2335B603N769o328L19m515o882P988M696l101M277k544p866M751J256l862O317
2350B878l12n960O160N88p216L380p03m313R677K927q232J512k178o855Q988N886
2366F227n335L240k151j0712N185O813l749M287Q68r578K654M544n364L190L407
2381C526n751K819L040o203J382K170n141M293M917m732P32n47p073M500O229
2396D161l557J953K81p913K402M616m116M005L191p917R33M071n327L010M580
2411D373p146J375N809o209k34M843n524P77O430m928j326M782m807j466N646
2426B395k233o65L725m409j774M270j622l75L085k918n25K640l223L02L390k472
2442d09L89J773m200J601L311m022J296L143n192J056L993m981J748M839o709
$$ plain form
2457 -2364 -2816 3197 -1362 -1322 4477 -1894 -3782 3722 -209 -2641 3960 -348 -4162 2617 691 -2403
2473 -2403 3556 625 -4923 772 1976 -908 2700 602 -4493 -507 1763 157 2150 874 -2782
2488 -2782 -1377 -301 656 2936 683 -1973 -1223 -1548 1186 3662 -952 -2331 473 -1673 535 4579
2504 4579 -1464 -3331 1548 -1928 -794 6194 37 -5022 756 -1481 -1853 6975 1923 -6078 -81
2519 -81 -95 -2822 5272 3450 -5100 -744 529 -3256 3653 4650 -3903 -2310 416 -1854 3050 4535
2535 4535 -3022 -3472 -149 -201 2687 3339 -1457 -2900 -1939 -316 3258 2791 -321 -1751 -3984 -1333
2551 -1333 4929 2529 -1242 -370 -3803 -2643 5670 2694 -2715 948 -2498 -4638 5154 4286 -3221
2566 -3221 771 -1439 -6148 4380 6532 -3424 -986 -53 -5836 2534 7338 -2627 -2271 917 -4909
$$ packed form
2457b364m52O013m559M0N799o371j888P504l931k432O601m308l814O779j926l094
2473b403N959k931n548N695J204k884L608k098n095L986K270j606J993j276l656
2488b782J405J076R57K280k253k656P50l25K734K476m614j379K804k146K208M044
2504D579o043j867M879l476J134O988o157n059N778k237l72Q828n052q001N997
2519h1j4k727Q094j822q550M356J273l785O909R97q553J593K726k270M904J485
2535D535p557m50L323n2K888O52m796j443R61J623L574m67l112j430k233K651
2551a333O262k400l771Q72l433J160Q313k976n409L663l446k140R792q68p507
2566c221L992k210m709J0528K152r956K438R33n783Q370M804r965L56L188n826
$$ plain form
2581 -4909 98 7162 -128 -2726 -23 -3910 -694 6188 1762 -2672 -1778 -2780 135 4328 1894
2596 1894 -917 -2524 -3082 860 2944 1607 1456 -2641 -5155 1678 3536 400 2470 -1824 -6870
2611 -6870 2008 4799 -1389 2272 675 -7558 473 5833 -1962 1558 2922 -7809 -2204 7278 -646
2626 -646 -575 3557 -6200 -4107 7211 1209 -2309 3075 -3557 -5161 4875 2910 -1646 1931 -2271
2641 -2271 -5085 2634 3819 113 389 -2448 -3483 1623 2825 1260 -31 -2814 -1877 933 931 2726
2657 2726 1254 -4288 -1434 1652 -923 3360 3242 -6231 -2295 4188 -1997 1074 5613 -5527 -4467
2672 -4467 5561 -1401 -1728 6844 -2845 -6816 4549 813 -2672 5982 -996 -7457 3422 2499 -3169
2687 -3169 4226 779 -6725 1869 3250 -3194 2627 2491 -5375 -753 3152 -945 1028 1606 -3023
$$ packed form
2581d909N007P064p290k598K703l887L216O882m426m434Q94j002K915M193k434
2596A894k811j607n58L942K084j337j51m097k514O833J858l136K070m294n046
2611f870Q878K791o188L661j597q233Q031N360p795L520J364j0731N605R482p924
2626f46P1M132r757K093J1318o002l518N384o632j604J0036j965m556L577m202
2641b271k814P719J185l706K76k837j035N106J202j565j291k783R37K810kJ795
2657B726j472n542K854L086k575M283j18r473L936O483o185L071M539j1140J060
2672d467J0028o962l27Q572r689l971J1365l736l485Q654o978o461J0879r23n668
2687c169P395l447p504Q594J381o444N821j36p866M622L905m097J973N78m629
$$ plain form
2702 -3023 -1416 1516 1134 1022 -1058 -1336 853 -1087 226 3436 -1750 -2428 2617 -1632 -1595 4993
2718 4993 -831 -4164 3047 -436 -2829 4821 -414 -4831 4217 376 -5168 4754 1595 -6182 3915
2733 3915 2512 -6888 3331 4500 -6793 1148 5323 -5254 -257 4842 -4211 -773 4922 -2838
2747 -2838 -1968 2930 -1773 -119 2761 -2300 -594 2095 -2066 286 2460 -2122 -507 1554 -1700
2762 -1700 923 2077 -1983 -630 -274 -1067 3659 1193 -3901 1151 -270 -4045 5070 3827 -5688
2777 -5688 1159 2034 -6857 2559 7490 -4689 -1584 3529 -5093 -19 6801 -3446 -2662 3718 -2883
2792 -2883 166 5778 -3916 -3580 3514 -2822 141 8202 -2206 -6462 1289 -1926 -626 8243 1707
2807 1707 -5693 -1811 -1839 -480 4798 2143 -756 -1236 -4200 215 4240 -1340 -360 1804 -4056 697
$$ packed form
2702c023J607K932l82j12k080k78K189j940J313L210n186o78N045m249L7O588
2718D993n824l333P211l483k393P650n235m417R048l841n544R922l159p777J0097
2733C915j403r400J0219J169j1293P941M175j0577M997N099r053L438N695p760
2747b838Q70M898m703J654K880n061J706K689m161K352K174m582J615K061l254
2762a700K623J154m060J353L56p93M726k466n094N052j421l775R115j243r515
2777e688O847Q75q891R416M931j2179L105N113q622N074O820j0247P84O380o601
2792b883L049N612r694L36P094o336K963Q061j0408m256P751l215J300Q869o536
2807A707p400L882k8J359N278k655k899m80k964M415M025n580R80K164n860M753
$$ plain form
2823 697 6601 -2899 -4813 1117 -2314 1702 8381 -863 -5146 -1507 -5413 768 10334 1533 -2630
2838 -2630 121 -8449 -4035 10492 2824 -3308 3687 -3971 -6840 6335 2761 -5033 2474 1034
2852 1034 -3203 4465 2038 -5463 -1948 -1565 188 8666 3697 -5178 -3666 -5615 -2948 9643 7321
2867 7321 -2144 -1842 -5486 -6722 4018 6415 1716 1386 -3689 -4983 2323 1055 -978 2922 -2193
2882 -2193 -2250 7206 645 -6954 311 -2005 -3666 9590 7099 -5448 -2855 -4447 -7246 6382 10089
2897 10089 520 -338 -4984 -9259 2519 6272 188 3884 263 -7844 714 3670 -3987 1320 3342
2912 3342 -3797 2067 5400 -3741 -4085 -1406 -2435 4741 7383 -336 -2646 -5345 -6754 3718 7296
2927 7296 1265 2605 -1981 -9692 -770 5402 211 3271 2423 -6021 -1125 3102 -2685 340 2013
$$ packed form
2823F97N904r500j914N930l431M016O679r244m283L639l906O181R566q801m163
2838b630K751q570M414J4527p668o132O995p658k869J3175l574p794P507j440
2852A034m237P668k427p501L515L83J753Q478m969q875J512j949K667J2591k322
2867G321r465L02l644j236J0740K397m699l30n075j294P306j268k033L900n115
2882b193n7R456o561p599P265k316j661J3256k491j2547K593j592k799J3628L707
2897A0089r569q58m646m275J1778L753o084L696l621q107Q558K956p657N307K022
2912C342p139N864L333r141l44K679j029P176K642p719k310k699j409J0472L578
2927G296o031J340m586p711Q922O172n191L060q48q444M896M227n787L025J673
$$ plain form
2942 2013 -2909 2763 4262 -4280 -1405 320 -5507 2878 8359 -1678 -1593 416 -7871 -1701 8492
2957 8492 1648 -628 1745 -5420 -3753 3894 590 633 3249 -2789 -1901 2368 -2216 -583 2972 -2596
2973 -2596 -276 4980 -1649 -2901 1088 -2907 -412 5499 212 -1685 497 -3710 -1186 3840 -247
2988 -247 754 2615 -4499 -1969 4136 -1889 -707 4415 -3067 -2398 4908 -1898 -3480 3924 -639
3003 -639 -2350 4171 -869 -3427 2734 -882 -2141 4153 -212 -3204 2339 -1135 -2390 4558 291
3018 291 -4079 2025 302 -2493 3202 830 -3292 1263 554 -1856 1909 408 -1835 1211 -559
3033 -559 -905 2977 -1147 -2909 2187 -143 -769 3941 -1252 -4552 1921 626 -1170 4183 93 -4380
3049 -4380 1043 -393 -1753 4808 976 -4224 1306 -277 -2835 4379 1224 -5027 1963 2132 -3344
$$ packed form
2942B013m922N672J499q542K875J725n827Q385N481j0037Q5K009q287O170J0193
2957H492o844k276K373p165J667P647l304M3K616o038Q88M269m584J633L555n568
2973b596K320N256o629j252L989l995K495N911n287j897K182m207K524N026m087
2988b47J001J861p114K530O105o025J182N122p482O69P306o806j582P404m563
3003f39j711O521n040k558O161l616j259O294m365k992N543l474j255O948m267
3018B91m370O104j723k795N695k372m122M555p09k410L765j501k243L046j770
3033e59l46L882m124j762N096k330o26M710n193l300O473j295j796N353m090m473
3049d380N423j436j360O561l832n200N530j583k558P214l155o251O990J69n476
$$ plain form
3064 -3344 2461 1925 -5080 415 3112 -1691 1930 2059 -4535 -1714 1693 52 3174 2003 -4246
3079 -4246 -1806 639 -761 3009 2408 -3091 -930 374 -1763 2027 2257 -2368 -508 264 -1070 2629
3095 2629 1074 -3655 -137 692 -1076 3719 1635 -4943 -465 1258 -2415 3377 3957 -4184 -1856
3110 -1856 1026 -2616 2375 4725 -3056 -2228 1256 -2142 1483 3881 -2858 -1676 1895 -2006 620
3125 620 4029 -2223 -2495 1553 -1372 518 4174 -1507 -3285 360 -522 1121 3220 -1258 -2178 -35
3141 -35 -1487 1221 3351 -1250 -1351 299 -2650 771 4171 -1083 -1940 526 -2116 463 3995 -1192
3157 -1192 -1776 995 -2180 -68 3924 -964 -1617 1485 -2611 -975 4573 -312 -2569 1324 -1581
3172 -1581 -1338 4227 483 -2912 732 -846 -1264 3179 870 -1674 546 -1693 -1576 3292 1035 -1446
$$ packed form
3064c344N805n36p005N495K697m803L621J29o594K821L407j641L122j171o249
3079d246K440K445j400L770o01n499K161J304k137L790K30m625J860P72j334L699
3095B629j555m729L518Q29j768M795k084o578M478J723l673N792N80q141K328
3110a856K882l642M991K350p781Q28L484l398L625K398o739J182L571l901K626
3125F20L409o252k72M048k925J890L656n681j778L645q82J643K099m478r20K143
3141c5j452K708K130m601j01J650k949L421L400n254q57K466k642K579L532n187
3157a192n84K771l175K112L992m888o53L102m096J636N548m885k257L893k905
3172a581K43N565l744l395L644j578m18M443k309k544K220k239J17M868k257k481
$$ plain form
3188 -1446 631 -1738 -1781 3226 939 -1620 905 -1038 -1697 2445 527 -1267 1227 -1480 -1917 2878
3204 2878 608 -1477 1362 -1811 -2483 3582 1342 -2355 1251 -781 -3046 2496 1737 -1812 1345
3219 1345 -251 -3247 1510 1885 -1181 1211 -287 -3093 1599 1927 -1697 787 258 -2571 1231 1894
3235 1894 -1420 649 376 -2341 545 1597 -312 885 -647 -2546 1215 1345 -798 1437 -387
3250 -387 -2871 1550 1295 -1768 1698 789 -3159 749 1569 -1636 1645 862 -3492 662 2148 -1789
3266 -1789 1096 1276 -3415 480 2631 -2221 569 2249 -3082 -736 2658 -1339 108 2251 -2509
3281 -2509 -1341 2297 -390 -179 1341 -1700 -658 1743 -710 96 1385 -1552 -568 1092 -863 674
3297 674 1452 -1833 -529 1221 -853 900 1213 -2319 134 1581 -1735 718 1915 -2484 -85 1929
$$ packed form
3188a446K077k369m3N007k287k559K525j943o59M142j918j794K494k707m37M795
3204B878k270k085K839l173o72O065k240l697L606k032k265N542p59l549L157
3219A345j596k996M757L75l066K392j498k806M692L28l624K484n29k829L802O63
3235A894l314K069k73k717K886J052j909J197j532j899L761J30k143K235j824
3250c87k484M421k55l063L466r09l948L908Q20l205L281p83m354M154J486l937
3266a789K885J80m691L895K151m852K790J680n331K346L394l997J447K143m760
3281b509J168L638k687K11J520l041J042K401k453Q06J289k937R84J660j955J537
3297F74P78l285J304J750k074J753L13l532K453J447l316K453J197m399K399K014
$$ plain form
3313 1929 -2322 428 2962 -2655 -1161 2532 -1713 -319 3105 -2252 -1713 2961 -1222 -1405 2974
3328 2974 -1171 -2090 2517 -809 -1764 2860 -242 -2470 1671 105 -1294 1888 -231 -1915 1403
3343 1403 256 -1021 1266 -184 -1090 1039 -492 -718 1755 -344 -950 829 -931 -177 1960 -1175
3359 -1175 -887 1757 -1279 -583 2413 -1526 -1017 2849 -1680 -1882 3317 -864 -2415 2789 -545 -2365
3375 -2365 3235 64 -3289 2018 483 -2382 2382 618 -2664 1720 410 -2846 1982 1585 -2336
3390 -2336 1152 684 -2657 1128 1719 -2024 416 1519 -1328 25 469 -1019 482 384 -426 1099
3406 1099 -249 -1032 1047 -980 -1329 2724 473 -1964 1351 -467 -2362 2188 804 -1740 2017
3421 2017 271 -2840 1287 511 -2050 2581 856 -3242 2061 1140 -3880 1452 2308 -2999 1648 2829
$$ packed form
3313A929m251K750K534n617J494L693m245J394L424n357N39M674m183j83M379
3328B974m145r19M607l326r55M624l102k228M141j566j399L182k119j684L318
3343A403j147j277K287j450r06K129j531k26K473k099o06J779j760P54K137l135
3359a175K88K644l036O96K996l939N09L866m529k02N199m181j551N204l334j820
3375b365N600l171l353N307j535k865M764j764l282M384j310l256M828l97l921
3390b336L488m68l341L785N91l743K440J103k847J353M44j488J501r8q10J525
3406A099j348p83K079k027l49M053k251k437L315j818j895M550j384k544L757
3421B017j746l111M127p76k561M631j725m098N303r21n020N332Q56n307M647J181
$$ plain form
3437 2829 -3766 -712 2499 -2267 -80 3180 -1085 -834 803 -2085 -325 2140 -344 545 884 -2170
3453 -2170 -153 1158 -1584 600 2145 -1004 -313 520 -1597 -107 890 -504 1294 848 -1469 455
3469 455 -692 -2490 2610 2181 -2535 1302 1302 -4206 338 3061 -2285 749 3319 -3104 -1729 2287
3485 2287 -1672 -320 2829 -1338 -339 2046 -2611 -1336 2445 -1313 -54 3402 -1892 -2205 2277
3500 2277 -1352 -1883 3167 781 -1541 922 -804 -1688 1009 554 337 863 -978 -18 394 -2200 431
3517 431 2523 -1398 -150 2040 -2203 -1201 2208 -1264 -495 2848 -961 -1321 1160 -1611 -219 2684
3533 2684 -1400 -619 2630 -2255 -1716 3060 -1435 -1574 3868 -792 -3159 2730 70 -2865 2108 992
3549 992 -1805 1379 81 -2011 888 370 -653 1510 -644 -1295 1723 -601 -1659 2081 108 -1825
$$ packed form
3437B829o595L054L211m766K187L260m265K51J637k888J760K465k484Q89L39l054
3453b170K017J311k742K184J545l149O91Q33k117J490R97j394J798m46k317J924
3469D55j147j798N100m29m716L837%n508M544K723n346L034K570o423J375M016
3485B287l959J352L149m167R99K385m657J275L781l758J259L456n294l13M482
3500B277l629n31N050k386k322K463j726q84K697m55k17N26j841R60M12k594K631
3517D31K092l921J248K190m243J002L409l472P69L343l809l60K481k771J392K903
3533B684m084P81L249m885N39M776m495j39N442m660k367N889k660k935M973j116
3549I92k797L184j298k092K899n18j023K163k154o51L018k324j058L740j973j933
$$ plain form
3565 -1825 1439 -18 -1599 1486 254 -1554 1062 72 -609 1350 -1087 -1066 2274 -878 -1495 2641
3581 2641 -856 -2387 2708 -107 -2602 2819 669 -3414 1359 1375 -1986 1413 741 -2394 947 741
3597 741 -1579 1527 511 -2033 1360 255 -2177 2006 1200 -2684 741 1327 -1873 959 1166 -2072
3613 -2072 300 1032 -995 759 241 -1353 940 -103 -1512 2136 556 -2612 1223 583 -2349 2121
3629 2121 1562 -3115 418 1693 -1993 835 1779 -1959 42 943 -1825 1124 1811 -1935 152 721
3645 721 -2183 1351 2283 -2331 -176 1724 -2003 -22 2216 -1343 -476 1403 -1200 -84 1465 -990
3661 -990 -270 358 -1281 1465 1747 -2115 -313 587 -2167 1311 2883 -1741 -518 936 -2752 -227
3677 -227 3106 -371 -103 743 -2632 -338 2252 -1139 136 1647 -2074 -78 2342 -2101 -1132 2160
$$ packed form
3565a825L264j457j581L085j232j808K616r90o81J959k437K1L340l152o17M136
3581B641l497j531N095k815k495N421k150m083M773J6l361L399o72l135L341k06
3597G41k320L106j016k544L393j105k432M183q06l884L425N86l200K832K07l238
3613b072K372P32k027J754n18j594K293j043j409L648j580l168L835o40k932M470
3629B121n59m677L533J275l686K828R44l738K001R01k768K949O87l746K087N69
3645G21k904L534R32m614K155J900l727J981K238l559Q67J879k603J116J549k455
3661i90P20O28j639K746K82l862J802R00k754L478J572m624J223J454l688K525
3677b27L333l477K68Q46l375K294K590l391J275J511l721J996K420m443R69L292
$$ plain form
3693 2160 -1581 -500 3436 -561 -2111 385 -1673 -453 3583 1071 -1065 -544 -2527 -918 2503
3708 2503 793 521 1128 -2634 -2002 1692 -73 195 2101 -1328 -1402 1866 -325 -1237 581 -1075 210
3725 210 2949 -124 -1256 -108 -2855 -814 3952 1276 -135 865 -3757 -3431 3079 2133 311 1877
3741 1877 -2020 -3459 1377 768 -408 2081 -427 -1893 1534 12 -1426 1137 -1095 -1799 3224
3756 3224 2085 -1451 -304 -2208 -2826 2757 3441 314 106 -2228 -3514 697 2116 1605 2146 -1480
3772 -1480 -3444 243 845 292 2044 -644 -2367 1420 1036 -1143 414 -1022 -1875 2115 2069 -258
3788 -258 420 -2253 -3369 1761 2614 837 1904 -1998 -4837 831 2562 214 2125 -32 -3969 -59
3804 -59 1807 -578 1327 672 -2774 202 1986 -434 523 -389 -3050 780 3124 49 128 -648 -3461
$$ packed form
3693B160l741J081L936l997j550K496k058J220M036k512k136N21j983J609L421
3708B503j710k72O07l762O32L694j765K68J906l429p4L268k191r12J818j656J285
3725B10K739l073j132J148k747K041M766k676j411J000m622L26O510r46j822J566
3741A877l897j439M836o09j176K489k508j466L427j522j438K563k232p04N023
3756C224j139l536J147j904o18N583O84l127k08k334j286M211J419n11N41l626
3772a480j964L687O02n53J752k688j723L787l84k179J557j436q53L990m6k327
3788b58O78k673j116N130Q53j777J067l902k839N668J731k348J911k157l937L910
3804e9J866k385J905o55l446K976J784k420R57r12k661L830K344l075P9p76k813
$$ plain form
3821 -3461 -73 3140 881 525 -206 -2998 -1031 1814 1240 1348 -395 -2789 -346 1345 411 1263
3837 1263 -326 -2871 438 1928 -412 704 23 -2906 9 2240 -68 886 -10 -3404 -212 2514
3853 2514 57 803 227 -3516 -215 3060 -335 92 1112 -2867 -1160 2855 244 -361 1063 -2086
3869 -2086 -1569 2341 977 -260 171 -1890 -807 2223 541 -480 54 -1657 -499 2191 511 -544
3885 -544 17 -1688 -676 2126 1056 37 -550 -2446 -249 2335 488 267 -17 -2665 -385 2705
3901 2705 -396 -355 1160 -2160 -1156 2863 195 -1175 778 -1797 -1149 3176 961 -1636 -111 -1721
3917 -1721 -988 3331 1189 -1671 120 -1384 -1694 2575 1861 -1254 -133 -946 -1616 1903 2001 -1007 -938
3934 -938 -950 -341 1974 1144 -943 -924 -1408 -99 2578 896 -917 -510 -2056 -913 3000 1665 -907
$$ packed form
3821c461L388L213k259l56p31k792J967K845n74J08j743k394K443J691r34Q52
3837A263j589k545L309J490k340J116o81k929K915K231k308R54q96l394L192K726
3853B514k457P46n76l743L301L275l395M27J020l979J707M015k611o05J424l149
3869b086N17L910j364j237M31k061J083L030j682j021N34j711J158K690j680j055
3885e44N61j705J012K802j070j019n87j896K197K584j847k21k84k648K280L090
3901B705l101M1J515l320J004M019k668j370J953k575O48M325k215k597J525j610
3917a721P33M319k142k860J791j504l10M269p14l115J121q13o70L519R8l008O9
3934i38j2O09K315q30k087J9m84J309K677j682j813M07j546J143L913j335k572
$$ plain form
3951 -907 -669 -2229 -1215 3080 1569 -1193 -163 -1715 -1512 3037 1445 -1712 236 -1047 -2112 2777
3967 2777 2379 -1959 -619 -700 -1990 2498 3169 -1701 -1574 -664 -1397 1863 2835 -958 -1400 -802 -1382 1491
3985 1491 2751 -419 -1325 -1177 -1253 1602 2617 -359 -1403 -1458 -876 1997 1961 -465 -854 -1618 -1330 2193
4003 2193 1968 -647 -238 -1615 -2265 2328 2741 -1035 -496 -1059 -2443 1922 3048 -1292 -797 -290 -2351
4020 -2351 1105 3215 -906 -969 48 -2293 430 3485 -239 -1600 -203 -1660 294 3087 101
4035 101 -1684 -302 -1103 26 2300 458 -958 -573 -1338 100 2135 581 -622 -903 -1447 566
4051 566 2069 2 -509 -552 -1636 607 1923 -433 -27 109 -2148 169 2393 -419 -329 552 -2213
4068 -2213 -346 2810 -271 -1045 828 -1567 -755 2418 -65 -1125 1091 -1160 -1333 2068 433 -1019
$$ packed form
3951i07K38j560J014M295j511k762J030j552K03M549j592l157J948j283j065M889
3967B777l98m338J340q1j290M488O71m870J27R10p33L260R72l793m42N98n80K873
3985A491J260l170r06J48p6K855J015k976j044n5N82K873l6k426l89p64K88L523
4003B193k25k615M09j377o50M593M13l776N39n63j384M365J126m340M95N07k061
4020b351L456K110m121o3J017k341K723L055l724j361J397j457J954K793k986
4035A01j785J382q01J129K274j842j416L85p65J438K035j554j203k81n44K013
4051E66J503k067n11m3j084K243J316k356M06J36k257K317K224k812R0Q81k765
4068b213J867L156l081p74J873k395Q12L173k483j060K216k251j73L401j635j452
$$ plain form
4084 -1019 801 -896 -1486 1863 862 -1192 354 -285 -1027 1104 584 -587 330 -343 -767 658 213
4101 213 110 662 -925 -819 1131 10 -261 959 -832 -925 1274 -210 -662 1355 -468 -1285 995
4118 995 -261 -673 1768 -400 -1763 1205 147 -1096 1628 106 -1925 1050 471 -1478 1228 904
4134 904 -1808 144 550 -877 981 848 -1421 -210 481 -388 904 446 -1266 81 210 -771 983
4151 983 687 -1106 -155 -129 -517 1305 706 -1200 -171 -218 -366 1478 431 -1356 377 -153 -1101 1623
4169 1623 782 -1559 338 176 -1469 1428 1475 -1785 -401 548 -832 1137 1427 -1697 -664 646
4185 646 -770 868 1547 -1337 -773 339 -1002 795 1969 -954 -1276 210 -535 536 1448 -703
4201 -703 -889 209 -145 557 629 -898 -386 130 -428 1222 1081 -1550 -855 59 -449 1653 1819 -1621
$$ packed form
4084a019J820j697n90L349j001k054J546o39p42K131n20j171R17o73m24J425m45
4101B13j03N52j587J06J950j121k71J220j791r3K199j484m52K017j823q17K280
4118I95j256m12K441k168j363K968j058j243K724j522k031K975n79j949K706l24
4134I04k712J952M06j427J858j33k269J211O91q69J292m58j712J347J29r81J754
4151I83k96j793R51K6l88J822n99j906J029m7j48J844j047j787J733n30r48K724
4169A623q41k341J897j62j645K897M7l260J384R49j380J969K90l124J033J310
4185F46j416J638O79k884N64J112j341J797J174k923l22J486p45J071R12k151
4201g03j86J098l54P02P2j527N12N16n58J650j41k631O95R14n08K102J66l440
$$ plain form
4219 -1621 -1279 181 -785 1106 1868 -1040 -687 472 -1169 392 1769 -1081 -738 1001 -696 244
4235 244 1571 -1657 -1700 1405 590 444 1500 -1536 -2359 486 618 782 1914 -528 -2035 -570 -271
4252 -271 723 1869 -169 -1302 -19 -233 115 804 -915 -855 971 643 477 289 -1798 -1516 667 875
4270 875 1692 1636 -2068 -2574 -144 136 1725 2839 -1165 -2501 52 -513 46 2248 -136 -1533 885
4287 885 79 -774 1005 -653 -1897 1286 1635 379 756 -1709 -3290 454 2405 1514 1540 -998 -3480
4304 -3480 -1081 1081 1322 2062 394 -2144 -1452 -77 635 1343 -13 -1130 249 584 414 303 -1671
4321 -1671 -1770 1101 1707 1295 1013 -1999 -3326 -134 1451 2042 2667 -891 -3717 -1097 556 1085 2748
4338 2748 277 -2722 -356 545 -467 1281 494 -2057 254 1722 -104 352 -365 -2846 -332 2717
$$ packed form
4219a621L42J460r66J891P62k908L53J159j641J561J377k850L43J739j697R40
4235B44J327l228m3L105q15j46J056l036q23K845J32J64J132k442j507J465K99
4252b71R94J146k038j133J283k14L48O89j719O0J826l28j66j88k087K82K183K08
4270H75Q17n6l704n06K430K80J589J114m004j336K553n65N59K202k384j397K418
4287H85q06q53J779j658j244L183L49j256L77k465j581L744J951q91K6k538k482
4304c480K399K162K41P40j668k538O92J375P12P08j356j117J379L35j70j11j974
4321a671r9K871O06m12k82l012j327L192J585N91O25l558k826K620J653N29J663
4338B748k471k999K366R01j012J748p87k551K311J468j826M56p17k481K514L049
$$ plain form
4354 2717 1584 724 -822 -3454 -1382 1978 2018 1501 81 -2716 -1946 517 1166 1652 518 -1751 -1273
4371 -1273 318 755 1074 -341 -1783 -155 1258 910 839 -962 -2632 -158 1616 1097 1608 -255 -3278
4388 -3278 -1204 1290 1156 2007 582 -2979 -1533 1222 704 1180 847 -2129 -1139 1369 451 466 723
4405 723 -1795 -1322 1401 967 447 275 -1949 -1582 1475 1552 511 -64 -1821 -1385 1088 1297 698 140
4423 140 -1610 -1331 636 1023 1006 300 -1773 -1415 767 993 1023 348 -1763 -1096 926 533 568 538 -1554
4442 -1554 -961 1142 393 331 671 -1574 -1424 1499 949 242 506 -1729 -1690 1462 1384 167 449 -1207
4460 -1207 -1772 792 976 228 829 -617 -1650 290 819 17 458 -569 -1102 696 982 -131 -269
4477 -269 -759 -716 989 942 65 -96 -1153 -1204 712 956 641 652 -1184 -1670 604 793 156 793 -547
$$ packed form
4354B717j133q60j546k632K072L360M0n17j420k797P70K463O49M86j134k269M78
4371a273J591M37L19j415j442J628J413l48p1j801j670K474J774n19N11j863l023
4388c278K074K494j34Q51j425l561J446K755n18M76l33k976R90K508r18J5K57
4405G23k518M73K723m34n20j72k224L67L057P7j041n75j757M36K473K09n99n58
4423A40j750K79J967L87j7p06k073L58K182K26L0o75k111O67K022l93L5l0k092
4442a554N93K103p49o2L40k245J50K923n50p07K64k235L9L152p8j217K82j656
4460a207n65K564J84p48O01j446j033J940N29q02M41j027n33J798K86j113j38
4477b69m90M3J705m7q77j61j057n1J916K44l15J1j836m86K274J89o37O37j340
$$ plain form
4496 -547 -1290 659 384 -553 612 -118 -933 899 661 -742 232 -371 -1383 1006 1504 -424 -77 -424
4514 -424 -1564 539 1441 -201 65 122 -1241 -144 835 -57 402 214 -926 -16 555 -258 57 -67
4532 -67 -642 600 816 -433 -359 -218 -632 561 725 -326 257 -173 -1127 275 720 -293 524 54 -1397
4551 -1397 324 942 -704 193 482 -941 197 795 -882 -68 810 -812 -171 896 -575 -109 615
4568 615 -845 -112 1103 -431 -350 505 -600 -231 842 -450 -305 758 -382 -361 513 -279 -108 583
4586 583 -446 -303 585 -302 -111 531 -387 -103 452 -689 -220 896 -396 -245 330 -719 -52 971
4604 971 -443 -335 639 -568 -209 823 -503 -372 786 -631 -470 1128 -188 -557 566 -646 -368
4621 -368 1409 -39 -942 391 -297 -404 1099 160 -638 403 -435 -656 927 327 -435 200 -477 -489
$$ packed form
4496e47p43J949k75r37J165p30q15J832k38j403R74o03j012K389M98j928L47l47
4514d24j140K103R02j642K66N7j363J097R79q92M59j88j140R10N71q13L15j24
4532f7n75J242K16j249P4J41m14J193J64j051N83m30r54J402M45j013Q17m70j451
4551a397J721O18j646Q97K89j423J138N98j677Q14Q78j622O41J067j471M66P24
4568F15j460P33J215j534Q1Q55j105L69J073j292J45J063j140K1Q74p92J71O91
4586E83j029J43Q88q87J91O42r18K84N55j141M69J116j292J51N75j049O67J023
4604I71j414J08R74j207L59J032j326J31J158j417J61J598j316l69J123j212K78
4621c68J777j448r03J333o88j07J503r39p98J041q38k21J583o00p62O35o77j2
$$ plain form
4639 -489 1149 189 -686 119 -314 -267 1016 120 -743 140 -364 -463 1072 352 -692 114 -685 -565 1367
4658 1367 519 -808 29 -608 -543 1298 407 -930 195 -296 -708 1081 518 -756 119 -364 -778 1317
4676 1317 809 -876 -193 -370 -564 1274 842 -933 -253 -113 -543 1124 815 -759 -205 -361 -717 1089
4694 1089 986 -714 -407 -457 -573 1285 902 -872 -400 -307 -529 1114 841 -850 -246 -314 -717 1081 1113
4713 1113 -851 -417 -461 -751 1200 1204 -1044 -563 -158 -706 1097 1177 -940 -518 -69 -766 847 1328 -645
4732 -645 -652 -182 -784 990 1505 -751 -942 -103 -435 894 1294 -772 -781 5 -534 680 1326 -476 -773
4751 -773 -294 -587 881 1441 -565 -877 -353 -493 1015 1359 -776 -803 -51 -510 782 1281 -640 -640 -110
4770 -110 -803 782 1533 -620 -920 -110 -643 760 1622 -772 -1061 44 -460 500 1536 -565 -999 3
$$ packed form
4639d89J638r60q75Q05m33M7J283q96q63Q83n04r9J535p20j044Q06p99J20J932
4658A367q48j327Q37o37O5J841q91j337J125m91m12J789n63j274Q75m83m14K095
4676A317n08j685O83j77j94J838m32j775O80J40m30J667l09j574N54j56l56J806
4694A089j03j700L07n0j16J858l83j774M72R3k22J643k73j691O04o8m03J798L2
4713A113j964M34m4k90J951Mk248M81M05n48J803Q0k117M22M49o97J613M81j973
4732f45pM70o02J774N15k256j91Q39l32J329M00k066rP86n39J214O46j802k97
4751g73M79k93J468N60k006l12N24j40J508L44k135k7P52m59J292M99j921%N30
4770a10o93J585P51k153l00Q10n33J403Q62k394k89J105n04R60J036k101m34J002
$$ plain form
4788 3 -579 282 1589 -294 -1046 -138 -487 459 1602 -363 -1305 -18 -143 438 1338 -307 -1095 -62
4806 -62 -258 336 1332 -100 -1049 -279 -456 471 1582 -158 -1171 -182 -288 447 1266 -357 -1025 104
4824 104 -316 193 1293 -256 -1053 -15 -344 194 1564 -220 -1375 -119 -239 313 1531 -193 -1356
4841 -1356 30 -164 -23 1332 109 -1051 -29 -275 -168 1229 222 -1173 46 104 -9 1142 -37
4858 -37 -1438 -18 393 155 1014 57 -1262 -164 43 16 1250 404 -1169 -464 -99 52 1180 274
4876 274 -1121 -170 118 -163 757 33 -959 95 318 -122 775 36 -1199 -201 272 132 1155 247 -1449
4895 -1449 -354 166 10 1077 422 -1184 -131 157 -515 698 619 -850 -79 269 -423 545 527 -1057
4913 -1057 -208 681 53 547 224 -1260 -349 750 43 558 550 -994 -599 227 -85 663 722 -714 -502
$$ packed form
4788Cn82Q61J307j883p52R08l49R46J143j965r42J287j25N81R00j645p88J033
4806f2j96N94R96j432r49P70j77R27J111j740j013R89j06P35Q19j623o68J129
4824A04m20N09J100j549p97J038l29N38J370j784j155J256j20N52J218j724j163
4841a356J386j94J41J355j223j160J022k46J07J397j007j395J219N8j13J151j179
4858c7j401J420M11k38Q59r57j319J098K07k7J234q46j573P05L65J51J128r06
4876B74j395R51K88k81R20p24r92J054K23m40Q97p39j235R98M73j40J023r08j696
4895a449J095N20j56J067o55j606J053K88o72J213p9j469P71L48o92R68j8j584
4913a057Q49Q89o28M94l23j484R11J099p07N15qj544L95Q26l12P48N9j436K12
$$ plain form
4932 -502 136 -135 443 388 -790 -168 532 -153 258 285 -778 -157 525 -195 365 427 -951 -548 405 20
4952 20 555 562 -934 -630 481 -105 290 651 -769 -422 533 -306 26 828 -403 -564 490 -63 47
4971 47 660 -608 -605 562 175 -26 444 -492 -533 502 12 -123 606 -265 -581 319 -29 39 609 -351 -659
4992 -659 291 54 -35 424 -437 -501 496 -86 -287 524 -183 -460 342 -147 -276 654 -122 -636 397 154
5012 154 -237 496 -218 -618 519 135 -379 383 61 -592 279 38 -369 647 249 -758 225 172 -396
5031 -396 441 183 -563 234 229 -604 190 281 -317 281 80 -551 322 375 -503 181 196 -394 320 261 -547 130
5053 130 293 -479 43 334 -290 160 113 -627 153 447 -360 84 55 -564 241 491 -565 16 249 -555
5073 -555 40 376 -258 240 238 -760 -39 664 -145 165 245 -723 -1 565 -415 36 569 -509 -131 483 -385
$$ packed form
4932e02O38k71N78n5j178O22P00o85M11K7j063O21O82p20N60O2j378M03R53l85
4952B0N35Pj496L04J111n86L95L61j420L47R55q39L32Q02j231j61J054n53J10
4971D7O13j268LJ167l87k01M70r36m1J035m90j35P29q71l16R00l48O8N70r60l08
4992f59R50k37q9M59q61o4R97n82k01Q11p07k77Q02m89j29R30p76n14J033k43
5012A54l91P33p14m00J137l84n14P62l22o53Q71k41m07J016l98j007R83n3n68
5031c96Q37k58p46P97nq33P94R1n98N98k01o31Q73N3q78O84J5n90P14n9q08O77
5053A30J63p72N22K91o24M50m7p40P80K94q07M44k9o19Q05K50j056N81K33q04
5073e55N95L36o34M98kr98P21P03q09L10Q0r68P22N66r80M51N33j078L78O14q68
$$ plain form
5094 -385 -2 522 -541 -224 813 -65 -216 200 -677 -207 873 135 -144 287 -664 -529 450 124 154
5113 154 557 -426 -738 199 -23 95 452 -317 -297 308 -204 -334 174 -295 75 691 -130 -239 177 -806
5133 -806 -449 783 290 202 435 -1021 -896 664 142 76 848 -323 -777 393 -322 -420 984 170 -558
5152 -558 480 -11 -775 321 -1 -621 882 755 -586 -185 -303 -721 557 827 11 214 -176 -992
5170 -992 -180 262 311 677 24 -635 -114 -140 -172 438 19 -84 626 -174 -631 179 -250 -278 919 246 -426
5191 -426 492 -486 -1121 758 712 -269 772 -47 -1380 331 625 -711 598 773 -861 -22 409 -886
5209 -886 152 899 -509 68 753 -606 -419 256 -398 137 932 -127 -495 -21 -335 -67 443 81 195
5228 195 -33 -422 -129 -38 -90 451 -28 -563 478 19 -754 458 86 -658 752 458 -1047 201 406
$$ packed form
5094c85L83N24j063L17J037q78j51M16q77M70J080p38k79M31r51J35R79l26L0
5113A54M03r83l12R37k22J18L57p69K0O05n12j30N08m69L70O16q21j09M16r83
5133h06L57J232m93q8K33j456J25J560n22o6P72j171m54J170p15r8J404q14p28
5152e58J038m91p64J096l22o20J503j27j341M01j18m18J278K70q16K03l90q16
5170i92Q12M42M9L66o53o59N21k6l2O10m19j03P10q00m57Q10m29k8J197o73o72
5191d26R18r78o35J879m6r81J041q19j333J711K94j336J309J75j634Q39M31j295
5209h86J038P47j408N77O85j359J87O75o54N35P95j059l68M74l14K68N10l62J14
5228A95k28l89K93R1n2N41m79n35J041m59p73J212l72p44J410k94j505J248K05
$$ plain form
5247 406 -920 436 845 -775 99 582 -1176 13 1271 -646 -314 787 -762 -259 1136 -506
5263 -506 -606 855 -169 -601 781 44 -600 453 20 -383 552 192 -424 -117 18 175 367 -126 -232
5282 -232 -138 -96 405 278 -359 185 15 -743 363 607 -500 145 212 -1116 279 1091 -718 -144 812
5301 812 -935 -145 1139 -734 -552 1135 -486 -726 1236 -169 -950 627 -159 -604 1171 320 -1091
5318 -1091 136 62 -504 737 530 -639 8 76 -566 249 529 -47 -72 -161 -176 163 78 66 -68 -352 356
5339 356 474 -532 -38 249 -695 78 866 -429 -300 561 -955 -604 1289 8 -527 685 -642 -919
5357 -919 1124 126 -863 869 25 -1182 682 413 -903 588 373 -994 458 779 -763 -136 337
5374 337 -602 275 806 -430 -329 191 -317 -3 439 129 -11 -245 -297 54 111 240 269 -467 -255 492 -206
$$ packed form
5247D06j326J356M09j620Q74M83j758J189J258j917L32J101j549N03J395j642
5263e06j00J461j024m32J382p37o44J053m33m03R35l60o16L07J35J57J92m93j06
5282b32R4M2N01j27o37N44j70p58J106K44j107O45O7j328J395Q12j809N74R56
5301H12j747P90J284j873J82J687j621k40J962j405p81J577p86m45J775q51j411
5318a091J227p4n66J241k07j169O47O8o42Q15K80n76k5q9j5L39q5j2j34k84P08
5339C56J18j006M94K87r44P73P88j295J29Q61j516L51J893j281n35J212j327k77
5357i19K043r98r89J732q44j207J864k69j316J491k15j367J452L21j542O27M73
5374C37r39Q77N31j236J01N20n08L14M42l10j40k34n2L51N7J29K9p36K12P47o98
$$ plain form
5395 -206 -139 540 -437 -416 716 -217 -477 804 -214 -1052 723 275 -681 770 -27 -1258 659 732 -863
5414 -863 329 508 -1150 112 789 -662 152 809 -792 -329 783 -263 -71 560 -437 -346 642 66
5432 66 -324 234 -149 -116 168 70 11 134 -125 -115 -82 83 468 -181 -505 281 -3 -206 569 -76 -694 457
5454 457 194 -699 576 376 -915 281 391 -769 506 682 -1006 -102 845 -603 11 818 -785
5471 -785 -254 904 -453 -366 847 -331 -542 566 -123 -311 712 -9 -593 335 202 -205 249 -22
5489 -22 -353 200 9 -67 41 73 -2 -72 -179 250 229 -251 4 58 -309 361 344 -612 73 393 -553 28 542
5512 542 -608 -5 600 -703 -221 830 -450 -373 643 -433 -320 846 -291 -611 778 -81 -598
5529 -598 590 -32 -570 484 57 -694 463 325 -497 147 179 -338 247 173 -389 61 226 -206 -20 75
$$ packed form
5395b06O7O79r77K1J132r33k60J281j018q38J775m48r56J451p97j231J917P3j595
5414h63J192J79j658J262O77j451Q14O57j601M63J112j046J92O31r97R1R88n76
5432F6l90N58l83L3K84r8n9J23k59J0L3J65L85o49l24P86k84k03P75o45o18J151
5454D57k63q93J275k00j291J196J10j160J275J76j688R04R47j448O14Q07j603
5471g85N31J158j357Q7J213j178k11J108o89j88J023p21n84R28j33m07M54k71
5489b2l31N53j91p6J08L2p5p0j07M29k1m80K55N4l67O70j7r56O85L20r46N81N14
5512E42j150O03O05j303M82J051j280P7J016j076J13J166j137l20J389q59n17
5529e98J188o22n38J054m27p51J157j38q22O44L2n17N85p4n62M50J65m32J86R5
$$ plain form
5549 75 -21 183 -35 -119 126 49 76 132 -250 -1 312 -228 -102 342 -196 -63 378 -390 -188 640 -222 -407
5571 -407 493 -83 -395 529 -109 -614 603 106 -643 344 159 -524 321 186 -657 428 475 -644 68
5590 68 412 -448 112 370 -513 12 456 -315 -114 437 -226 -180 186 -162 -15 342 -123 -243 48 46 125 124
5612 124 -99 142 57 -129 79 -3 -122 242 -25 -365 254 65 -311 98 36 -271 393 216 -535 56 195
5633 195 -387 239 355 -493 66 291 -731 -58 710 -278 -134 433 -475 -200 542 -298 -297 604 -46 -317
5653 -317 349 -214 -384 495 103 -247 473 -5 -552 -67 53 -37 530 196 -337 -78 -50 -172 147 185 107
5674 107 192 -197 -133 56 -122 81 297 -160 103 282 -431 -348 203 -36 200 583 -335 -434 155 -322 -268 738
5696 738 152 -227 234 -462 -604 550 268 -388 377 46 -649 183 -18 -550 516 529 -330 110 112 -658
$$ packed form
5549G5r6K04k18q4K45p7K7N6l82K49L13n40J26M44n38J33M41p68K02Q28q62j85
5571d07R00n76l12R24o38n05J217m97p49R87j85o83Q45j35q43J085M7j119P12
5590F8L44q60N60K58q83N25M44p71K01N51o63M6L66l48J47L57m65j20K91kP9j
5612A24k23K41q5j86K08q2j19L64k67l40O19j89l76M09o2l07O64j77p51N91J39
5633A95n82O26J16q48N59K25j022O73P68r88J44N67r08K75P42q40JR01o50k71
5653c17O66n63j70Q79l92l50P20m78n47M85J20r0N67l34n33K59K8j22L19L8p8
5674A07Q5l89O4J89j78K03K16m57K63J79p13Q3N51k39K36L83r18r9N89m77N4J006
5696G38n86l79M61o96j42J154k82o56P65l31o95Q32k01n32J066J3q59M40Kp70
$$ plain form
5716 -658 -93 276 -51 485 419 -574 -386 -125 -86 435 448 -135 -78 -74 -461 -50 223 102 371 54 -420 -27
5738 -27 -12 -299 223 213 50 388 -108 -739 -93 95 -188 524 288 -587 -85 -49 -675 306 721 -211 -10
5759 -10 0 -697 47 451 -259 90 547 -384 -239 224 -441 25 554 -148 -32 376 -337 -368 96 -134 231
5780 231 639 -208 -333 -52 -222 83 607 -24 6 220 -476 -255 344 34 102 340 -352 -119 386 -350 -174
5801 -174 388 -135 23 378 -457 -344 335 -245 -177 482 -140 -219 244 -375 -313 659 -62 -324 283 -214 -246
5822 -246 300 -84 -290 455 -165 -338 259 -59 -135 393 -157 -386 388 -43 -268 305 -95 -151 400 -255 -354
5843 -354 383 55 -219 297 -176 -224 451 -96 -321 440 29 -271 380 -126 -374 332 12 -327 472 129
5863 129 -493 123 -121 -281 517 233 -438 40 -51 -436 256 209 -217 368 -65 -513 141 166 -163 300 -34
$$ packed form
5716f58N65L69l27N36o6r93J88K61L9N21J3n83N7Ml87M11K73j21K69l17m74L93
5738b7J5k87N22j0j63L38m96o31O46J88k83P12k36q75N02L6o26R81M15r32K01
5759a0J0o97P44M04p10L49M57r31J45M63o65M66N29p02J16M08p13l1M64k30L65
5780B31M08q47j25K81j70L05N24o31L0K14o96K21N99l10O8K38o92K33N05p36J76
5801a74N62n23J58L55q35J13O79n80O8O59o22p9M63o19O2R72p21k62O07m97l2
5822b46N46l84k06P45o20j73N97l18p6N28n50k29P74m31k25N73m00n6N51o55r9
5843c54P37l28k74N16m73m8O75n47k25P61m11l00O51n06k48P06l20l39P99l43
5863A29o22O16k44j60P98k84o71M78r1l85O92m7m26N85m33m48O54K5l29M63l34
$$ plain form
5884 -34 -388 296 111 -414 152 25 -215 445 110 -420 107 -89 -509 446 428 -113 186 -298 -727 323
5904 323 569 -151 202 -21 -685 162 283 -271 271 206 -537 1 306 -219 132 -20 -456 240 509 -166
5924 -166 -128 -142 -615 261 498 -114 135 -113 -733 -64 363 96 455 20 -715 -73 385 42 341 58 -562
5945 -562 134 322 -270 162 112 -568 76 507 -111 228 104 -824 -138 688 104 202 105 -783 -311 590 -3
5966 -3 254 284 -584 -408 303 32 271 349 -503 -439 223 110 279 181 -566 -295 271 108 274 190 -571 -253
5988 -253 203 -44 415 319 -648 -347 123 27 481 377 -699 -379 286 -64 240 469 -598 -368 318 -111
6008 -111 290 704 -506 -551 232 -50 280 586 -332 -567 283 97 130 400 -214 -501 98 -20 101 520
6028 520 -151 -422 -88 2 254 486 -241 -460 -22 -56 329 432 -242 -385 -9 -324 180 538 -158 -273 13
$$ packed form
5884c4l54O84j85n25N66j27k40O60l35n30N27j96m20R55j8n41K99m84m29J050
5904C23K46p20L53k23o64Q47J21n54N42o5p43N38L05n25L51j52m36O96K69o75
5924a66L8j4m73Q76K37o12K49k48o20O69M27k67L59m35p35O42M58l43K99k83o20
5945e62O96J88n92M32n0o80O44M31o18L39j24r28O86Q26n84R8r7q88M72R01n93
5966cK57L0q68J76P11k71K39P8q52O4O62j13J69r8p47K71N66j63J66q4p61L18
5988b53M56k47M59r6r67L01M70r6M54j04j076L20O65l50L04K29j067K30O86m29
6008a11M01M14j210m5P83k82L30L06r18k35Q50j86L3K70o14k87N99j18J21M19
6028E20o71k71L34R0K52K32p27k19M38l4L85J03o74j43L76l15N04L58o96j15K86
$$ plain form
6049 13 -313 164 739 -221 -443 126 -216 18 663 -215 -478 190 -165 -146 654 67 -469 61 -162 -124 677
6070 677 225 -466 -48 -102 -60 396 159 -360 31 -61 -184 290 123 -108 20 -258 -111 372 98 -150 -12
6091 -12 -247 -30 385 -60 -221 209 -129 -156 277 -44 -168 346 -169 -321 437 88 -211 282 -103 -352 340
6112 340 99 -326 286 134 -362 192 123 -287 305 191 -424 133 184 -246 149 145 -237 68 118 -277 124 288
6134 288 -178 -28 4 -228 272 174 -152 -66 -111 -72 280 38 -230 98 -101 -331 227 267 -150 68 -245 -377
6156 -377 401 315 -259 6 -142 -486 325 405 -261 16 -46 -527 78 487 -36 -9 -119 -577 137 651 41
6177 41 -146 -115 -375 64 533 131 -154 -114 -511 -75 556 284 -7 -127 -560 -73 516 390 -3 -243 -548
6198 -548 -43 444 256 26 -228 -576 -133 449 237 241 -175 -858 -246 546 370 147 -125 -762 -243 611 360
$$ packed form
6049A3l26M77N75r60k22N69l42K34O45q78k63O68l55J9Q00n87n36N30k23L8Q01
6070F77m52o91M18n4M2M56k37n19L91r2j23M74j67k31J28k78J47M83k74k48J38
6091a2k35K17M15m45j61M30l38k7M33l21j24N14n15j52P58l49k99M93l85k49O92
6112C40k41m25O12j52m96N54o9m10N92j14o15N57N1m30L95ml82L05N0l95M01J64
6134B88m66J50L2k32N00r8l26Q6m5L9L52k42k68L28j99k30N58M0m17K18l13j32
6156c77P78q6n74K65j48l44Q11Q0o66K77o2m81O05M09n23K7j10m58P14N14o10
6177D1j87L1k60M39M69m02k85M0l97M36O31k72k91j20m33M87N89j26l93k40l05
6198e48N05M87j88k30k54l48M43N82k12Mm16o83O12P92j76k23k72o37N19Q54k51
$$ plain form
6219 360 110 -32 -650 -441 373 399 205 67 -736 -565 422 506 241 -27 -630 -513 433 518 177 -25 -543
6240 -543 -486 260 555 334 101 -527 -651 163 620 531 97 -664 -667 168 525 419 172 -452 -642 66 414
6261 414 371 231 -463 -758 3 501 472 204 -516 -805 9 520 399 307 -413 -774 -101 414 416 398 -187 -799
6283 -799 -265 360 497 452 -202 -821 -281 331 388 341 -175 -618 -213 275 334 403 -60 -685 -410 279 433 542
6305 542 -70 -797 -382 348 437 432 15 -623 -377 138 169 384 249 -532 -404 66 166 385 230 -577 -522 239
6327 239 225 291 131 -481 -455 192 177 247 250 -341 -468 2 140 378 301 -388 -486 -91 137 271 252 -219 -296 24
6351 24 1 104 285 -181 -232 -33 -29 208 293 -201 -323 63 -2 161 445 -233 -332 195 -58 -41 339 -32 -303
6374 -303 67 -118 -105 357 48 -292 -17 -47 -58 291 -10 -260 150 23 -270 134 105 -152 103 70 -313 60
$$ packed form
6219C60k50j42o18K09Q14K6j94j38q03J71R87Q4k65k68o03J17R46Q5l41k02n18
6240e43N7P46K95k21k33o28j24Q14M57q9m34p61lQ35L57j06k47o24j90P08L48
6261D14m3j40o94k95P61M98k9k68p20k89Q14N11j21r2p20l61O73N15Kj8n85o12
6283g99N34O25J37m5o54o19N40O12N7m7n16m43M05M88N9O9m63o25K75O89J54J09
6305E42o12p27M15P30Q9nm17o38K46N15L1K15j35p81J28M70J00K19j55q07N5P61
6327B39j4O6j60o12K6O47j5P0Ln91j27M70J38K38p7o89r8L95K28J34j9m71p7L20
6351B4k3J03J81m66n1J99MK37Q5m94j22L86o5J63K84o78r9N27k53J7L80l71k71
6374c03L70j85J3M62l09l40K75l0j1L49l01k50M10j27k93M04k9k57K55l3l83L73
$$ plain form
6396 60 140 -190 56 41 -104 58 -84 -91 232 44 -223 -19 -29 48 302 -75 -275 64 87 -32 255 -11 -189
6419 -189 57 -59 -81 422 184 -365 -38 -190 -121 555 306 -544 -117 63 -208 358 332 -413 -180 34 -249
6440 -249 245 413 -214 -381 -3 -130 330 471 -289 -388 -105 -119 340 443 -194 -313 -148 -213 276 541 36
6461 36 -323 -409 -163 423 526 -13 -264 -407 -247 509 495 -147 -198 -273 -405 413 673 -17 -129 -260 -527 348
6483 348 782 15 -257 -303 -494 280 848 -58 -211 -254 -561 105 821 169 -206 -251 -627 -100 832 408 -323
6504 -323 -393 -551 27 700 415 -192 -341 -478 -110 518 417 77 -371 -642 -133 640 475 76 -389 -766
6524 -766 -41 701 350 101 -227 -709 -134 657 401 198 -40 -962 -396 752 457 236 42 -914 -528 578
6544 578 480 112 94 -567 -573 364 425 158 137 -563 -706 346 563 230 -57 -606 -651 358 707 305 -36 -611
$$ packed form
6396F0Q0l30K46j5j45J62j42pL23j88k67K04j0P7K54l77k00L39K3j19K87k66j78
6419a89K46j16k2N03k38n49L27j52O9O76k49q50M27J80k71N66k6p45K33K14k83
6440b49M94J68o27j67L78j27M60J41p60r9K83j4M59J03o37j19J65o5M89K65n05
6461C6l59q6K46N86J03n39k51j43J60P56j4o42n1p5j32Q18K60o90j12j31k67Q75
6483C48M34p67k72m6j91P74N68r06j53m3l07O66P16o52l75m5l76N27R32m24p31
6504c23p0j58N78O73k85o07j49j37L68O28j01l40m48k71N09P73j65l99m65l77
6524g66P25P42l51k49l28m82N75P91k56k03k38r22N66J148k95k21j94r56L86J106
6544E78r8l68j8o61oR37O1k67k1p00j43J052K17l33k87n49m5J009L49m02l41n75
$$ plain form
6566 -611 -656 152 568 553 154 -581 -671 -9 364 630 360 -592 -697 188 225 354 371 -524 -533 228 249 208 403
6589 403 -428 -766 132 365 350 526 -469 -1039 30 420 363 548 -209 -955 -107 305 149 576 35 -710
6609 -710 -304 148 236 347 -38 -565 -276 217 315 278 -321 -550 -142 85 328 419 -183 -623 -217 -66 292
6630 292 614 -142 -520 -192 -148 213 667 -78 -564 -11 -59 -147 500 131 -549 -38 90 -135 582 251 -671
6651 -671 -177 259 21 392 212 -577 -164 159 -59 240 267 -325 -284 31 -36 205 247 -250 -275 28 101 162
6673 162 83 -201 -116 35 -31 193 -54 -186 108 -28 -227 269 33 -353 204 40 -224 333 30 -521 118
6694 118 292 -132 135 100 -445 137 371 -279 44 233 -368 -12 355 -178 -53 265 -354 -54 454 50
6714 50 -185 -41 -203 -8 455 133 -216 -192 -248 82 344 122 30 -128 -394 -65 293 193 118 -192 -411 79
$$ packed form
6566f11m5Q08M16j5l99p35r0O62L73K66k70r52j05Q85L7J29J7q95rP61K1m1J95
6589D03q31l38Q98K33j5J76r95n70J069L90n7J85p57p46Q48M12j56M27n41p45
6609g10M06M52Q8J11l85n27K89M93R8l7n99k29M08K27K43R1o02m40M06J51L58
6630B92L22p56l78L28M4L61M54p45m86N53m8q8O47l69o80N11J28k25P17l31r22
6651f71M94M36k38L71j80p89M13L23k18K99K7n92M1L15o7K41M2m97k5L03P3O1
6673A62p9k84Q5J51o6K24k47j32K94j36j99M96k36l86N57j64k64N57l03n51O39
6694A18J74m24K67l5n45N82K34o50L23J89o01L56L67n33J25L18o19L00N08m04
6714E0k35J44j62J95M63l22l49K4n6L30K62k22r2j58k66L29L58j00p5l10k19M90
$$ plain form
6736 79 426 1 -93 -241 -460 216 428 -156 -20 -116 -638 100 668 151 59 -140 -743 -141 783 274 -82
6757 -82 -111 -615 -250 741 301 -107 78 -437 -304 503 362 -39 -102 -543 -234 642 557 -86 -375 -481 -202
6778 -202 551 564 27 -353 -593 -255 432 524 343 -188 -789 -426 443 460 254 -141 -676 -330 524 344 174
6799 174 -7 -678 -397 520 433 194 73 -727 -645 507 641 235 67 -732 -698 465 712 123 32 -448 -712
6820 -712 267 578 209 78 -396 -666 153 713 352 -38 -461 -604 155 690 329 -77 -477 -536 66 531
6840 531 467 39 -474 -591 -47 388 537 177 -490 -709 20 364 325 260 -441 -628 90 347 237 322 -213
6861 -213 -682 -62 391 236 328 -224 -764 -66 566 229 178 -122 -636 -113 503 219 137 26 -529 -323 398
6882 398 299 176 92 -487 -407 380 348 106 -153 -369 -302 121 377 163 -51 -256 -257 137 277 254 48 -340 -253
$$ packed form
6736G9L47m25r4j48k19O76K12n84J36r6n22P38N68n17r2j99o03O02R24n09l56
6757h2k9n04L65R91m40m08J85n15J33Q07j41m01o3m41L09Q76q5o43k89j06K79
6778b02P53J3n37l80k40L38O87R2j81n31o01L63Q69J7k06l95n35L46Q54j80j70
6799A74j81o71K81R17q7k39j21q00Q2J152J34m06j68p99L4J163K47n89r1m80k64
6820g12R79L11l69j31m74k70Q19N60l61l90m23j43P59N35l61m06m00n9O02M65
6840E31o4m28n13j17N44M35J49l60o67k19P29L44l9o5p01j87P18K57j10Q5n35
6861b13m69O20M53j55R2n52n40O98O32l37n1l00n14N23O16k84q2j11n55K06P21
6882C98r9j23q4n79Q0P87l2k42k59k16O7M23K56k14k14k05jL94J40k3k06l88Q7
$$ plain form
6905 -253 116 150 248 -8 -393 -132 176 37 195 127 -310 -105 161 0 109 263 -293 -309 203 64 89 281
6927 281 -222 -246 247 68 -129 247 -44 -254 79 68 -39 251 84 -268 -58 203 -75 67 58 -242 -4
6948 -4 92 -121 0 29 -12 -47 -5 -70 62 83 -107 36 -3 -31 125 -74 -68 70 -32 -57 113 -75 -19 216 -90
6973 -90 -230 199 86 -145 181 59 -330 196 141 -246 120 184 -276 -35 128 -168 131 174 -317 -72 352
6994 352 -91 27 182 -183 -138 198 -48 -51 262 -93 -215 106 94 34 88 -123 -193 57 71 37 12 -149 -34
7017 -34 22 -57 38 108 -150 -63 22 -102 166 223 -275 -168 9 -100 163 260 -302 -116 152 -239 9 256 -168
7040 -168 -135 167 -178 -97 387 -110 -352 139 -18 -125 241 38 -269 65 91 -93 206 77 -116 -14 -22 -94
7062 -94 209 137 -103 -100 -49 -50 183 73 -13 39 -68 -70 107 110 78 54 -232 -203 125 7 3 77 -222 -152 295 -61 -221
$$ packed form
6905b53L69L4R8k56l85K61L08j39J58o8m37K05K66j61J09J54n56j6N12j39K5J92
6927B81n03k4M93j79j97L76k91k10L33j1j07K90j67l52K10K61k78J42rl00K38
6948dR6k13J21K9m1l5M2o5J32K1j90J43l9k8J56j99OJ38j02k5J70j88N6K35l06
6973i0j40M29j13k31L26j22l89N26n5l87L66O4m60K41J63k96K99M3m91K45M24
6994C52m43J18J55l65M5L36k46lL13l55j22L21j2o0N4k11p0K50J4l4k5j61J15
7017c4N6p9R5P0k58Q7Q5j24K68N7m98J07J77j09K63R7n62J86K68l91K48K47m24
7040a68L3L02l45Q1M84m97k42M91j57j07L66k03l07L34K6j84K99j29j93J02qp2
7062i4L03p2k40LN1jK33j10q6N2j07kJ77Ll2k4k86K9L28j18mP4k99P0M47l56j60
$$ plain form
7089 -221 134 -96 -286 213 166 -70 153 -156 -413 203 363 9 122 -147 -387 141 266 -1 100 26 -369
7110 -369 -58 209 32 121 14 -234 -51 245 126 24 -147 -276 60 166 74 64 -201 -313 23 147 140 244
7132 244 -128 -462 -154 149 195 286 -121 -504 -60 93 29 219 17 -350 0 163 0 216 114 -462 -117
7153 -117 227 190 161 -94 -522 -259 275 289 218 32 -381 -213 122 215 289 185 -300 -349 72 178 293 82
7175 82 -335 -207 123 117 263 -33 -383 -117 96 41 294 24 -431 -293 38 184 437 242 -470 -413 36 120
7197 120 298 172 -329 -347 67 63 200 205 -174 -287 -33 124 214 145 -312 -355 46 180 263 58 -319 -260 30
7220 30 154 296 164 -246 -264 -78 6 370 253 -296 -224 -18 3 314 244 -354 -233 117 14 180 148 -194
7242 -194 -236 25 -5 83 229 -157 -325 18 101 134 217 -205 -288 15 161 88 143 -131 -309 -9 93 131 156 -72
$$ packed form
7089b21L55k30j90M99m7k36K23l09k57O16J60l54J13k69k40N28J25k67J01p4l95
7110c69L11K67j77Q9j07k48J83K96j19j02j71j29L36J06r2j0k65j12L36J24pJ04
7132B44l72l34L08L03M6R1m07l83M44J53o4J90k02l67L50J63j63K16j02n76L45
7153a17L44l7k9k55m28K63N34J4p1j86m13J68L35R3P4j04m85m9M21J06J15k11
7175H2m17J28L30oJ46k96l50K66K13n5K53k70m55J38L31J46K53j95p12N7M49Q4
7197A20J78j26n01j8M14mJ37Nl79j13K54J57R0o9m57m3M01J34Q3k05l77N9K90
7220C0J24J42j32m10j8J86Q4L64j17n49P2K06K1L11p0n98J21L50j03J66l2l42
7242a94m2K61l0Q8J46l86j68L43Q3L3Q3m22q3L03J46p3N5k74j78L00J02L8K5k28
$$ plain form
7266 -72 -226 -119 60 213 88 -135 -148 -15 7 154 50 -228 -5 86 -33 116 129 -280 -80 123 12 180
7288 180 259 -287 -283 151 63 82 226 -131 -272 182 50 -57 125 -33 -173 39 34 -82 91 39 -146 26 158
7311 158 -11 -30 -190 -108 104 196 163 -24 -209 -66 12 -6 201 102 -191 -91 -30 -84 118 166 -226 -98 228
7334 228 -23 -46 130 -237 -86 298 61 -86 87 -162 -230 180 171 34 167 -154 -403 97 238 5 73 -72
7356 -72 -175 89 172 -42 -45 27 -94 -54 87 39 -108 -122 -135 61 94 103 -96 -353 -125 139 -33 56 100 -193 -110
7381 -110 113 -45 60 244 -87 -250 99 5 -22 224 -145 -224 198 218 -166 94 23 -224 162 188 -155 64
7403 64 40 -297 -26 267 15 0 30 -149 -75 215 9 -67 40 -22 -53 54 30 35 21 -73 63 -29 33 117 -112
7428 -112 -117 98 17 19 125 -87 -111 130 13 -189 86 65 -205 82 27 -132 166 84 -314 -3 172 -183 41
$$ packed form
7266g2j54J07J79J53j25k23j3J33K2J47j04k78K23R1j19J49J3m09K00K03j11J68
7288A80P9n46MM34q8J9J44l57j41M54j32j07J82j58j40K12nj16J73n2j85J72J32
7311A58j69j9j60Q2K12R2l3j87j85J43P8j8K07r9k93J00O1n4K02M8l92J28L26
7334B28k51k3J76l67J51L84k37j47J73k49o8M10rj37J33l21k49N00J41k33O8j45
7356g2j03K64Q3k14lP2j21M0J41m8j47j4j3J96L3Rj99k57K28K64j72Q9M4k93Q3
7381a10K23j58J05J84l31j63L49r4k7K46l69p9M22K0l84K60p1k47L86K6l43K19
7403F4k4l37K71K93k52j5L0j79P4K90k06p6J07o2l1J07k4Nj4r4J36r2O2Q4k29
7428a12nK15q1KJ06k12k4K41j17k02K75k1k70K87n5j59K98q2l98L11J75l55K24
$$ plain form
7451 41 154 -221 24 216 -162 -54 206 -35 -125 107 -69 -51 144 -36 -210 107 7 -48 37 -3 -37 106
7473 106 -12 -71 -30 58 63 -108 -39 117 30 -80 33 -57 -114 93 -62 -133 93 57 -177 0 122 -89 24 111
7497 111 -229 -92 235 -60 -51 133 -124 -73 262 -108 -165 221 -53 -247 220 83 -6 176 -70 -220 163 129
7519 129 -94 -23 -45 -97 94 104 -89 -4 -13 -122 -8 112 62 -46 -72 -153 29 130 40 -75 -103 -48 117 -59
7543 -59 7 35 -154 -36 8 6 20 42 -196 -189 113 62 -107 103 -114 -236 166 132 -122 31 -68 -307 112 151 -71
7568 -71 37 81 -271 -4 291 61 18 15 -207 61 300 23 -145 10 -120 1 146 -59 -82 -9 -137 -101 170
7591 170 57 -3 -92 -195 -24 177 41 -121 -42 -111 72 92 -36 -2 47 -140 -68 139 29 22 5 -256 -6 308
7615 308 -38 -139 21 -156 23 275 1 -89 82 -140 -128 227 60 -68 53 -157 -108 262 113 -167 0
$$ packed form
7451D1J13l75K45J92l78J08K60k41r0K32j76J8J95j80j74L17j00n5Q5m0l4J43
7473A06j18n9M1Q8Nj71O9J56q7j10J13r0n7K07j55p1K26l6k34J77J22k11J13Q7
7497A11l40J37L27k95RJ84k57N1L35l70n7L86k74j94M67j37q9J82k46j50L83l4
7519A29k23P1k2n2J91J0j93Q5rj09J14J20n0j08k6q1J82J01r0j15k8N5J65j76
7543e9O6K8j89J18M4kJ4K2k38PL02n1j69K10k17j22M02l4k54J53r9k39M19L9k22
7568g1J08M4l52K67K95k30m3lk22K68K39k77j68J55j30J21J45k05k3P3j28L6K71
7591A70j13o0q9j03J71K01j36j62P9o9J83K0j28L4M9j87P2K07j10pj7k61K50L14
7615C08l46j01J60j77J79K52k74r0J71k22J2L55j67j28J21k10M9L70j49k80J67
$$ plain form
7636 0 -72 -39 192 100 -166 27 14 -59 137 95 -102 41 -145 -194 139 121 -50 -58 -83 -49 187 20 -118 -16 -72
7661 -72 -32 90 27 -84 16 -62 -119 242 86 -135 6 -239 -131 234 79 -205 -7 -42 -166 182 193 -197
7683 -197 46 41 -153 128 264 -103 -61 -45 -120 179 224 -193 -108 54 -99 111 147 -164 -66 -29 -97 86 163 -91
7707 -91 -53 -36 -134 55 216 -168 -119 -17 -63 60 65 -130 -45 64 -105 91 83 -123 -55 3 -91 139 126 -140 -86
7732 -86 53 -128 90 239 -159 -34 115 -87 5 124 -142 -3 107 -92 21 209 -98 -84 5 -78 42 236
7754 236 -115 -178 32 3 0 246 -24 -105 74 -137 -47 123 -40 -40 13 -106 15 163 -82 -121 41 -61 -18 92
7778 92 -120 -58 119 -133 -64 155 -56 -122 -36 -65 -9 179 3 -157 -8 -84 -11 172 -41 -107 127 49 -56 49
7802 49 15 -121 81 -71 -41 183 -6 -79 36 -27 -28 127 -31 -131 100 40 -117 149 -24 -113 36 -65 -118
$$ packed form
7636@p2L3K31r2k66J93j3p3J96m2j97J43j86m9L33j8j71qk5L4K36j67j38J02n6
7661g2M0J22o3j11J00p8n7L61j56k21J41k45J08L65j55k84J98l5j24L48J1l90
7683a97K43nj94K81J36l67M2J6p5K99M5m17Q5J62j53K10L6l11R8L7o8J83P7k54
7707i1L8J7r8J89J61l84M9J02m6J23Nj95Q5J09j69J96qk06O8N8r4K30j3k66N4
7732h6J39j81K18J49l98J25J49k02R2J19k66J39J10j99J13J88l07J4Q9q3J20J94
7754B36l51o3K10k9lK46k70q1J79k11R0J70j63%N3j19J21J48k45l9J62j02M3J10
7778I2k12O2J77k52O9K19k11o6Q6k9N6J88j76j60J49p6P3J83k13o6K34p8j05J05
7802D9l4j36K02j52L0K24j89p3J15o3jJ55j58j00K31o0j57K66j73q9J49j01n3
$$ plain form
7825 -118 121 96 -144 -53 -15 -124 35 -1 -161 -28 83 -127 24 65 -124 22 59 -68 92 87 -73 -13 79
7848 79 -14 74 16 -158 -19 91 24 57 -6 -39 109 25 -44 135 94 -70 4 -16 -46 131 18 -118 61 98 -93
7873 -93 22 9 -65 106 89 -126 -5 89 -45 -26 91 -165 -46 105 -104 -80 91 -102 -47 31 -94 -34 48 -11
7897 -11 -87 60 38 -55 -17 -42 -28 67 19 -24 -93 50 106 15 -70 -13 27 -8 14 -29 -33 76 66 -76 22 125 -63 56
7925 56 -7 -107 37 16 -126 -34 127 -53 -34 90 -145 -19 104 -75 -109 51 44 -86 96 37 -69 33 -19
7948 -19 -100 40 49 -58 -63 15 -62 -7 41 -29 -75 97 31 -28 -49 147 -25 -35 8 -2 -52 7 11 -131 76 112 -30 -39
7976 -39 -20 -34 29 56 -41 -50 98 -94 -103 121 50 3 4 -31 -119 55 27 -119 20 25 -87 57 42 -105 -5 74 -4
8003 -4 -7 -8 2 -126 -79 -12 14 53 -3 -154 -79 48 -15 -68 24 -19 -27 50 -52 -128 90 53 -78 18 178 -49 -51 25 -105
$$ packed form
7825a18K39k5k40R1L8j09J59l6j60J33J11k10J51M1j89J46L7j27J60nj60O0R2
7848G9r3Q8n8j74J39J10o7L3o3l3J48q4o9J79m1j64P4k0l0J77j13j36J79L7j91
7873i3J15j3p4J71j7k15J21R4j34J9J17k56J19J51k09K4J71j93N5P8j25O0Q2n9
7897a1p6J47k2r3L8k5J4R5m8m3o9J43N6r1q5N7M0l5K2m3mJ09j0j42R8J03j88J19
7925E6o3j00J44k1j42R2J61j80J9J24k35J26J23j79l4J60pj30J82n9j06J02n2
7948a9q1J40Rj07nP8p7N5M8p0m6J72o6n9k1J96j72j0M3j0n0N9Mj42K07L6j42r
7976c9J9j4O3K7r7rJ48j92rK24p1m7Jl5q8J74k8j46J39Nj12J44j5j47J00P9p8
8003dljJ0j28M7O7K6L9n6j51P5J27o3n3R2m3qP7j02p6K18l7j31R6J60k27kP6j30
$$ plain form
8032 -105 74 174 1 -136 29 -60 -63 103 19 -10 63 -28 -135 28 127 -45 -77 76 -82 39 70 -83 -126 24
8056 24 48 9 113 -33 -135 -43 56 32 9 60 -68 -235 32 89 78 68 -17 -168 56 136 -17 6 77 -77 22
8081 22 92 12 14 65 -53 -90 145 66 -42 -67 -87 -68 151 84 -91 -61 19 -63 103 107 -1 9 -47 -94 64 175 35
8108 35 -92 -136 34 25 108 13 -112 -29 4 -49 8 1 -61 -112 -30 -2 30 -38 33 -184 -44 93 31 -66 -16 -129 -50 132
8136 132 33 -69 -15 -82 -218 76 88 -31 16 -61 -115 123 144 -95 0 49 -122 142 95 -82 -36 38 -38 -5 161
8161 161 76 -133 -123 -81 66 189 37 -70 -35 -51 58 63 -25 -31 2 -99 -52 34 -5 1 0 -71 18 28 -35 -86 -129 -88
8189 -88 118 128
$$ packed form
8032a05J79J00j73j37J65q9lJ66q4k9P3r1j07J63R9j72l2J53j58J21L1j53m3J50
8056B4K4l9J04j46j02R2R9k4k3N1j28j67K67N7j1j0q5j51K24Q0j53K3P1j54R9
8081B2P0q0KN1j18l7K35p9j08k5k0J9K19o7j75L0Q0q2J66Mj08J0n6m7J58J11j40
8108C5j27m4J70rQ3r5j25Q3L3n3N7po2n1Q2K8L2o8P1k17J40J37o2r7N0j13P9J82
8136A32r9j02N4o7j36K94J2j19M7p7n4K38K1k39R5M9j71K64m7j77M6P4p6L3J66
8161A61q5k09J0M2J47J23j52j07L5j6J09Nq8oL3j01M7Q6l9Ojp1Q9J0o3n1m3M1
8189h8K06J0
8191A28
$$ Imaginary data points
##PAGE= N=2
##DATA TABLE= (X++(I..I)), XYDATA
$$ plain form
0 0 0 0 0 8 -8 8 -16 16 -24 32 -40 48 -58 73 -90 113 -130 154 -182 213 -252 293 -341 391 -447 512 -583
27 -583 664 -751 845 -954 1070 -1199 1339 -1493 1664 -1852 2055 -2277 2523 -2796 3093 -3424
43 -3424 3789 -4200 4664 -5184 5776 -6459 7255 -8202 9341 -10744 12521 -14856 18073
56 18073 -22798 30410 -44623 79879 -332169 -341956 524067 -178934 -107296 508197 -147971
67 -147971 -476509 255700 66307 -171430 235484 31523 -256595 111495 56458 -80048
77 -80048 125540 -72697 -214542 171636 135580 -82957 74721 -21807 -269666 -11396 247386
88 247386 99038 -64528 -21039 -45455 -200526 -13456 342121 43838 -261570 110553
98 110553 40178 -314448 189689 313393 -335804 -76681 312281 -199573 -84542 322900
$$ packed form
0@%%%Qj6J6k4L2m0N6p2Q8j06J31j63K03k43K84l36L95m65N45o34P32q38R59j095
27e83J247j415J596j799K024k269K538k832L157l516L907m332M800n319N889o517
43c424P213p989Q864r848J0960j2235J3714j5457J7543k0085K3265k7377L2929
56A8073m0871N3208p5033J24502m12048r787Q66023p03001P1638O15493o56168
67a47971l28538P32209j89393k37737M06914k03961k88118L68090n5037j36506
77h0048K05588j98237j41845L86178l6056k18537J57678r6528k47859K58270K58782
88B47386j48348j63566M3489k4416j55071J87070L55577k98283l05408L72123
98A10553p0375l54626N04137J23704o49197K59123L88962n11854J15031M07442
$$ plain form
108 322900 -192420 -234009 263915 -14517 -69912 255764 -166788 -263111 214727 -25878
118 -25878 -76733 356845 -99111 -385658 217980 69976 -252045 287177 168136 -392091
128 -392091 20814 236606 -191308 -8679 220458 -134353 -135378 147072 55049 -68957
138 -68957 -20279 -3574 -20972 -14402 82738 91882 -104293 -99526 55442 -14323 12213 128561
150 128561 -40028 -97079 21081 -52318 30366 145110 -99353 -65618 135880 -122819 -69179
161 -69179 256419 -96912 -217744 242774 15630 -241445 218918 88848 -314121 98772
171 98772 193110 -197826 43626 165353 -198694 -46051 162052 -67388 -4091 93802 -114597
182 -114597 -24208 100107 -67486 10828 94243 -110622 -37833 121654 -43558 -50761 85289
$$ packed form
108C22900n15320m1589M97924k78432n5395L25676m22552r6323M77838k40605
118b5878n0855M33578m55956k86547O03638j48004l22021N39222j19041n60227
128c92091M12905K15792m27914J82629K29137l54811j025K82450r2023j24006
138f8957M8678J6705j7398O570R7140R144j96175M767J54968o9765K6536J16348
150A28561j68589n7051J18160p3399Q2684J14744k44463L3735K01498k58699N3640
161f9179L25598l53331j20832M60518k27144k57075M60363j30070m02969M12893
171I8772R4338l90936K41452J21727l64047J52643K08103k29440O3297R7893k08399
182a14597R0389J24315j67593P8314Q3415k04865P2789J59487j65212p203J36050
$$ plain form
193 85289 -30750 -76593 58965 51669 -34681 -37553 14042 25412 -39587 10856 88130 -72562
205 -72562 -91901 120309 12897 -106805 105626 28020 -165983 64851 105596 -105652 33428
216 33428 67709 -132678 15380 105653 -75802 19652 61613 -127571 18877 121518 -99168
227 -99168 -5097 110091 -126567 -41655 167757 -51761 -87476 106213 -45279 -97892 121830
238 121830 46479 -92277 12809 7685 -49887 39952 50723 -16165 -24651 -30827 -946 35571
250 35571 6733 10322 1590 -56461 -6522 51891 3726 2550 -2479 -53795 7227 45496 -10709
263 -10709 23163 3227 -87592 17783 75691 -43749 15306 55967 -108011 -34276 118316
274 118316 -20647 -37658 74771 -61831 -82123 98900 29911 -54745 42337 -19409 -75457
$$ packed form
193H5289j16039m5843J35558p296q6350k872N1595J1370o4999N0443P7274j60692
205g2562j9339K12210j07412j19702K12431p7606j94003K30834M0745k11248J39080
216C3428L4281k00387J48058R0273j81455R5454M1961j89184J46448J02641k20686
227i9168R4071J15188k36658Q4912K09412k19518l5715J93689j51492n2613K19722
238A21830p5351j38756J05086n124n7572Q9839J0771o6888q486o176K9881L6517
250C5571k8838L589q732n8051M9939N8413m8165j176n029n1316O1022L8269n6205
263a0709L3872j9936r0819J05375N7908j19440N9055M0661j63978P3735J52592
274A18316j38963j7011J12429j36602k0292J81023o8989q4656R7082o1746n6048
$$ plain form
285 -75457 56813 43099 -33929 24033 -16266 -66295 42507 47795 -25704 13640 -8190 -63089
297 -63089 22823 58947 -10942 -10260 -3260 -35629 -3580 40581 24968 -10167 -31570 -15929 5513
310 5513 8561 35730 20508 -53919 -31425 29855 2525 15260 40800 -41505 -50331 30065 8824
323 8824 2085 46442 -24034 -59559 21600 14177 -3944 48280 -11523 -68993 16023 28243 -12710
336 -12710 37206 8413 -68666 -4073 39284 -5711 20301 21322 -52786 -29678 31048 16239
348 16239 15876 14038 -36933 -35085 14288 25849 20812 5607 -27567 -29074 375 22941 27971
361 27971 4536 -23822 -25683 -10456 21067 38816 2628 -28831 -20495 -13436 14807 46840 6229
374 6229 -35703 -16541 -10956 2150 46821 20822 -36081 -23111 -8841 -3141 42122 32318 -32127
$$ packed form
285g5457J32270j3714p7028N7962m0299n0029J08802N288p3499L9344k1830n4899
297f3089Q5912L6124o9889O82P000l2369L2049M4161j5613l5135k1403J5641K1442
310E513L048K7169j5222p4427K2494O1280k7330J2735K5540q2305q826Q0396k1241
323H824o739M4357p0476l5525Q1159p423j8121N2224n9803n7470Q5016J2220m0953
336a2710M9916k8793p7079O4593M3357m4995K6012J021p4108K3108O0726j4809
348A6239l63j838n0971J848M9373J1561n037j5205l3174j507K9449K2566N030
361B7971k3435k8358j861J5227L1523J7749l6188l1459Q336P059K8243L2033m0611
374F229m1932J9162N585J3106M4671k5999n6903J2970J4270N700M5263r804o4445
$$ plain form
387 -32127 -32078 -7165 -405 34638 34336 -24632 -35397 -8086 1007 26898 35222 -12889 -37537 -16125
401 -16125 3235 26475 33845 -5275 -37523 -24716 5645 30085 28278 -3349 -30394 -28387 1032
414 1032 31628 26849 -1986 -23275 -30774 -7439 33354 31617 -2766 -22547 -30525 -11515 33707
427 33707 34569 -5193 -21943 -25278 -14112 27733 36271 -2338 -20973 -22905 -16826 21665 38824
440 38824 3357 -22387 -24797 -15832 20267 37553 4496 -21684 -23272 -14028 17071 33079 6153
453 6153 -17238 -21833 -15649 13808 31532 9051 -14852 -23517 -16809 15490 30874 6790 -13665
466 -13665 -21626 -16810 15539 29372 3377 -11081 -15769 -19068 10268 30452 5315 -11333 -14322
479 -14322 -19092 8194 31135 5659 -13698 -13177 -15869 8212 28784 2884 -13475 -8222 -13989
$$ packed form
387c2127M9K4913O760L5043l02n8968j0765K7311R093K5891Q324m8111k4648K1412
401a6125J9360K3240P370l9120l2248J2807L0361K4440j807l1627k7045K007K9419
414A032L0596m779k8835k1289p499K3335M0793j737l4383j9781p978J9010M5222
427C3707Q62l9762j6750l335J1166M1845Q538l8609j8635j932O079L8491J7159
440C8824l5467k5744k410Q965L6099J7286l3057k6180j588R244L1099J6008k6926
453F153k3391m595O184K9457J7724k2481k3903q665O708L2299J5384k4084k0455
466a3665p961M816L2349J3833k5995j4458m688l299K9336K0184k5137j6648k989
479a4322m770K7286K2941k5476j9357N21k692K4081K0572k5900j6359N253n767
$$ plain form
492 -13989 3678 26951 4468 -13870 -7113 -11694 1852 25727 6600 -15745 -10834 -7886 7046
505 7046 22127 1859 -12918 -8669 -10321 8053 23362 -2141 -11391 -1962 -13992 1465 27398
518 27398 -298 -16197 836 -8493 -238 25090 -2714 -20626 2948 -1608 2363 24172 -7103
531 -7103 -25318 4981 -898 -579 31544 463 -33798 -804 3052 -5076 29355 11890 -32352
544 -32352 -8742 8392 -2141 15320 7546 -20446 -4473 7184 2626 13486 -4231 -24138
556 -24138 784 9451 6856 23099 -4773 -38323 -8508 12559 12795 27731 1224 -34303 -14248
569 -14248 311 8665 31333 2466 -25800 718 -6255 -9743 33794 4400 -39077 10728 17836
582 17836 -15019 22936 8321 -53037 -5138 36066 2891 18446 11130 -50129 -23889 20687
$$ packed form
492a3989J7667K3273k2483j8338O757m581J3546K3875j9127k2345M911K948J4932
505G046J5081k0268j4777M249j652J8374J5309k5503r250R429j2030J5457K5933
518B7398k7696j5899J7033r329Q255K5328k7804j7912K3574m556L971K1809l1275
531g103j8215L0299n879L19L2123l1081l4261L2994L856q128L4431j7465m4242
544c2352K3610J7134j0533J7461p774k7992J5973J1657m558J0860j7717j9907
556b4138K4922Q667k595J6243k7872l3550K9815K1067K36J4936k6507l5527K0055
569a4248J4559Q354K2668k8867k8266K6518o973l488M3537k9394m3477M9805P108
582A7836l2855L7955j4615o1358M7899M1204l3175J5555p316o1259K6240M4576
$$ plain form
594 20687 9204 31896 22471 -44431 -27168 9745 -6406 26470 35527 -33956 -25011 20867 -6158
607 -6158 -591 22475 -19174 -20739 21039 14583 5156 -2546 -30174 -15353 11679 17128 37466
620 37466 7460 -54072 -24378 12373 208 37716 37708 -41534 -34118 9081 -10263 15707 38066
633 38066 -18175 -19348 8723 -13579 10888 23242 -34515 -10428 32834 -10167 8823 32333
645 32333 -50833 -39744 43694 8690 562 44870 -25392 -61898 11471 16487 6848 39102 -3910
658 -3910 -40702 -5805 -3894 7435 34945 -10654 -22819 18527 -9091 -12357 31473 -11620 -34163
671 -34163 24470 14615 -8740 19324 -10243 -37215 3132 13624 18284 26931 -22649 -30197 7317
684 7317 -14043 7122 53091 -14725 -39274 23443 -11344 -26984 47059 10702 -42191 16020
$$ packed form
594B0687j1483K2692r425o6902J7263L6913j6151L2876R057o9483Q945M5878k7025
607f158N567K3066m1649j565M1778o456r427p702k7628J4821K7032N449K0338
620C7466l0006o1532K9694L6751j2165L7508qp9242P416M3199j9344K5970K2359
633C8066n6241j173K8071k2302K4467J2354n7757K4087M3262m3001J8990K3510
645C2333q3166J1089Q3438l5004q128M4308p0262l6506P3369N016r639L2254m3012
658c910l6792L4897J911J1329K7510m5599j2165M1346k7618l266M3830m3093k2543
671c4163N8633r855k3355K8064k9567k6972M0347J0492M660Q647m9580p548L7514
684G317k1360K1165M5969o7816k4549O2717l4787j5640P4043l6357n2893N8211
$$ plain form
696 16020 10712 -23643 20690 5193 -30415 12998 9075 -8943 26681 -8793 -38408 21419
708 21419 6327 -22109 39923 12202 -51962 7029 19387 -26362 21178 28045 -32529 -8417
720 -8417 13570 -11414 10024 9123 -15462 9412 -1118 -18448 24981 4363 -32930 20030 12543
733 12543 -32360 21990 22318 -39691 1934 24482 -21008 6650 19101 -22387 852 9662 -17534
746 -17534 15933 10593 -27196 16065 11224 -36499 20133 28111 -40805 4567 33060 -33921 -3307
759 -3307 35619 -23976 -10966 27774 -15119 -8964 18580 -11395 780 12970 -20617 5594
771 5594 18861 -25353 5093 25596 -29183 -3280 31072 -23518 -9521 32067 -15114 -16569
783 -16569 21165 -7034 -6320 16041 -11530 -3028 12714 -16453 5360 19429 -25821 727 27911
$$ packed form
696A6020n308l4355M4333j5497l5608M3413l923j8018L5624l5474k9615N9827
708B1419j5092k8436O2032k7721o4164N8991J2358m5749M7540O867o0574K4112
720h417K1987k4984K1438r01k4585K4874j0530j7330M3429k0618l7293N2960p487
733A2543m4903N4350L28o2009M1625K2548m5490K7658J2451m1488K3239Q810k7196
746a7534L3467n340l7789M3261m841m7723N6632P978o8916M5372K8493o6981L0614
759c307L8926n9595J3010L8740m2893O155K7544k9975J2175J2190l3587K6211
771E594J3267m4214L0446K0503n4779K5903L4352n4590J3997M1588m7181j455
783a6569L7734k8199P14K2361k7571Q502J5742k9167K1813J4069m5250K6548K7184
$$ plain form
796 27911 -27146 -6205 36008 -22416 -19199 32657 -9833 -16058 28473 -9566 -22324 18801
808 18801 -2467 -5984 21188 -12583 -12713 18268 -16380 -7410 34587 -11522 -20977 26014 -11310
821 -11310 -23638 31196 2835 -25418 19164 5908 -19966 9921 644 -12882 13100 1777
833 1777 -4469 14657 -12754 -16559 16617 -6044 -6597 31889 -4509 -28829 12173 -2078 -16542
846 -16542 24777 10180 -16813 8010 -4497 -18185 12561 2836 -5753 20568 -5208 -19143
858 -19143 16635 -7314 -23592 25821 11468 -18685 18778 2026 -36067 6891 16798 -11954
870 -11954 15939 15276 -21763 -5417 -108 -14536 15358 17447 -9115 6373 -1357 -25495 5118
883 5118 11822 -11167 15224 17794 -19721 -7485 3292 -15481 5196 19923 -393 2815 -77
$$ packed form
796B7911n5057K0941M2213n8424L217N1856m2490o225M4531l8039j2758M1125
808A8801k1268l517K7172l3771j30L0981l4648Q970M1997m6109r455M6991l7324
821a1310j2328N4834k8361k8253M4582j3256k5874K9887r277j3526K5982j1323
833A777o246J9126k7411l805L3176k2661n53L8486l6398k4320M1002j4251j4464
846a6542M1319j4597k6993K4823j2507j3688L0746r725q589K6321k5776j3935
858a9143L5778k3949j6278M9413j4353l0153L7463j6752l8093M2958R907k8752
870a1954K7893o63l7039J6346N309j4428K9894K089k6562J5488p730k4138L0613
883E118O704k2989K6391K570l7515J2236J0777j8773K0677J4727k0316L208k892
$$ plain form
896 -77 -18885 -4449 3507 -1121 19461 10335 -17330 -997 -1681 -20238 9744 19664 -6563 7754
910 7754 7957 -25045 -8647 10394 -5095 10954 18502 -10869 -6551 -833 -19168 3313 21700
923 21700 -1873 3825 8030 -22344 -10052 13754 -5596 2055 21161 -5016 -12037 3505 -10638
936 -10638 -7260 14954 5325 878 7807 -9039 -12958 -120 -2870 6984 18090 -1277 -8856 -2344
950 -2344 -11871 -3496 14683 4299 851 6021 -10073 -10903 4340 -512 2347 10914 -3005 -3795
964 -3795 4967 -9405 -7689 8768 190 1907 13627 -6326 -14076 3465 -3201 -3629 16465 5577
978 5577 -9237 250 -6350 -9819 10812 8883 -4166 2662 -1866 -8959 3717 2808 -4727 5031
992 5031 3389 -5130 2597 977 -6750 804 1818 -1717 6581 3835 -6397 -3571 -2668 -1253 8327
$$ packed form
896g7j8808J4436P956m628K0582r126k7665J6333o84j8557K9982R920k6227J4317
910G754K03l3002J6398J9041j5489J6049P548k9371M318N718j8335K2481J8387
923B1700k3573N698M205l0374J2292K3806j9350P651J9106k6177p021J5542j4143
936a0638L378K2214r629m447O929j6846l919J2838k750R854J1106j9367p579O512
950b344r527Q375J8179j0384l448N170j6094q30J5243m852K859Q567j3919p90
964c795Q762j4372J716J6457q578J717J1720j9953p750J7541o666m28K0094j0888
978E577j4814R487o600l469K0631j929j3049O828m528p093J2676r09p535R758
992E031j642q519P727j620p727P554J014l535Q298k746j0232K826R03J415R580
$$ plain form
1007 8327 4318 -4023 -236 -3680 -5380 6066 3796 -2764 3831 -1892 -8366 5125 5028 -5503 2109
1022 2109 1329 -6680 4902 5965 -7616 -927 3757 -5036 2492 6835 -5113 -2034 2863 -5512
1036 -5512 741 8542 -2218 -4037 1244 -3635 340 7351 -1209 -4411 951 -1292 -478 4071 455
1051 455 -1685 -500 -2317 180 3063 717 462 -1911 -4029 2898 3683 -2767 542 554 -4426 3020
1067 3020 4291 -4922 368 3158 -6019 706 6996 -3529 -1322 3585 -6753 -1174 9633 -2138
1081 -2138 -4517 4470 -3815 -3807 7954 -279 -5423 4965 -438 -6387 4676 3269 -4517 1405 1065
1096 1065 -4202 2526 4072 -3299 -2230 1313 -21 546 1652 -254 -1951 -878 1360 -96 -665
1111 -665 3323 -132 -5343 1586 3241 -3031 2290 2469 -7078 1068 6866 -5443 -1217 6825 -5717
$$ packed form
1007H327m009q341L787l444j700J1446k270o560O595n723o474J3491r7j0531P612
1022B109p80q009J1582J063j3581O689M684q793P528M343j1948L079M897q375
1036e512O253P801j0760j819N281m879L975P011q560l202N362k243Q14M549l616
1051D55k140J185j817K497K883k346k55k373k118O927P85o450L309J2m980P446
1067C020J271r213N290K790r177O725O290j0525K207M907j0338N579J0807j1771
1081b138k379Q987q285QJ1761q233n144J0388n403n949J1063j407p786N922l40
1096A065n267O728J546p371J069L543j334N67J106j906j697J073K238j456n69
1111f65L988l455n211O929J655o272N321J79r547Q146N798j2309M226Q042j2542
$$ plain form
1126 -5717 -3035 8282 -3772 -4135 8636 -3530 -7655 8586 1279 -6914 5824 180 -8244 6257
1140 6257 4311 -7819 2392 4421 -6462 778 5257 -4029 -700 4094 -3507 -2659 4623 1174
1154 1174 -3247 -42 1448 -1575 -149 3458 -1549 -4049 4179 1422 -6141 3734 4755 -7860 839
1169 839 6408 -7566 735 9944 -9059 -4669 11886 -5316 -6332 12036 -4189 -9526 12375
1182 12375 -949 -11869 11144 3029 -13227 7509 5697 -11556 5596 6973 -12318 2011
1194 2011 10009 -8075 -1583 7773 -6031 -3088 7468 -2126 -4098 5051 428 -5297 701 3995
1208 3995 -1129 -2364 3107 -169 -5354 4274 4316 -8654 1604 8800 -9011 -2076 11599 -8311
1222 -8311 -5306 14067 -7148 -9297 16801 -3520 -14737 14953 739 -15740 14893 4341
$$ packed form
1126e717K682J1317j2054l63J2771j2166m125J6241p307q193J2738n644q424J4501
1140F257j946j2130J0211K029j0883P240M479r286L329M794p601Q48P282l449
1154A174m421L205J490l023J426L607n007k500Q228k757p563R875J021j2615Q699
1169H39N569j3974Q301R209j9003M390J6555j7202j016J8368j6225n337K1901
1182A2375j3324j0920K3013q115j6256K0736j812j7253J7152J377j9291J4329
1194B011P998j8084O492R356j3804K943J0556r594j972R149m623n725N998L294
1208C995n124j235N471l276n185R628M2j2970J0258P196j7811O935J3675j9910
1222h311L005J9373k1215k149K6098k0321j1217K9690j4214j6479L0633j0552
$$ plain form
1234 4341 -19568 11376 9671 -19425 7008 13583 -17375 1895 14301 -14923 -1435 16364
1246 16364 -10742 -6785 13661 -5095 -6969 10628 -2258 -7674 7224 1228 -6355 2639 3426
1259 3426 -2881 -1822 2439 1012 -3574 1529 4230 -6841 -800 10547 -6802 -6713 13006 -4822
1273 -4822 -10859 16044 -1243 -16381 16086 3175 -21780 14230 11255 -22240 9287 13996 -23698
$$ packed form
1234D341k3909L0944j705k9096K6433O575l0958J9270J2406k9224J3488J7799
1246A6364k7106L957K0446j8756j874J7597j2886n416J4898n996p583Q994P87
1259C426o307J059M261j427m586N103K701j1071O041J1347j7349Q9J9719j7828
1273d822o037K6903j7287j5138L2467j2911k4955L6010k975l3495L1527M709l7694
$$ [...]
8191a41
##END NTUPLES=NMR FID
##END=
