##TITLE=1H_LY-858.1
 CDCl3, 8 sc, 
 26.7.2019
##JCAMPDX= 6.0         $$ Bruker NMR JCAMP-DX V2.0
##DATA TYPE= NMR FID
##DATA CLASS= NTUPLES
##ORIGIN= UXNMR, Bruker Analytische Messtechnik GmbH
##OWNER= root
$$ XWIN-NMR		Version 3.5
$$ Fri Jul 26 16:37:45 2019 Russian Standard Time (UT+4h)  she@DPX200
##.OBSERVE FREQUENCY= 200.13
##.OBSERVE NUCLEUS= ^1H
##.DELAY= (6, 6)
##.ACQUISITION MODE= SIMULTANEOUS
##.ACQUISITION SCHEME= undefined
##.AVERAGES= 8
##.DIGITISER RES= 18
##SPECTROMETER/DATA SYSTEM= spect
##.PULSE SEQUENCE= zg30
##.SOLVENT NAME= CDCl3
##.SHIFT REFERENCE= (INTERNAL, CDCl3, 0, 15.7039)
##AUDIT TRAIL= $$ (NUMBER, WHEN, WHO, WHERE, WHAT)
$$ ##TITLE= Audit trail, XWIN-NMR		Version 3.5
$$ ##JCAMPDX= 5.01
$$ ##ORIGIN= Bruker BioSpin GmbH
$$ ##OWNER= she
$$ F:/spectra/data/she/nmr/H-F/1/audita.txt
$$ ##AUDIT TRAIL=  $$ (NUMBER, WHEN, WHO, WHERE, WHAT)
(   1,<2019-07-26 16:36:45.51 +0400>,<she>,<DPX200>,
      <created by zg, POWCHK disabled, PULCHK disabled
       configuration hash MD5:
       00 E9 B6 7A A2 85 ED C7 34 08 36 98 17 FE 4E 26
       data hash MD5: 16K
       46 8D 70 10 88 B4 C2 03 DC FD BE 4A 01 C8 68 3E>)
$$ ##END=
$$ 
$$ hash MD5
$$ 34 D0 3F D0 88 35 26 71 E0 2B F4 0D 2D C0 56 9B
##$RELAX= 
##$RELAX= 
##$RELAX= 
##$RELAX= 
##$RELAX= 
##$RELAX= 
$$ Bruker specific parameters
$$ --------------------------
##$DU= <F:/spectra>
##$EXPNO= 1
##$NAME= <H-F>
##$PROCNO= 1
##$TYPE= <nmr>
##$USER= <she>
##$AMP= (0..31)
100 100 100 100 100 100 100 100 100 100 100 100 100 100 100 100 100 100 
100 100 100 100 100 100 100 100 100 100 100 100 100 100 
##$AQSEQ= 0
##$AQ_mod= 1
##$AUNM= <au_zg>
##$AUTOPOS= <>
##$BF1= 200.13
##$BF2= 200.13
##$BF3= 200.13
##$BF4= 200.13
##$BF5= 200.13
##$BF6= 200.13
##$BF7= 200.13
##$BF8= 200.13
##$BYTORDA= 1
##$CFDGTYP= 0
##$CFRGTYP= 5
##$CHEMSTR= <none>
##$CNST= (0..31)
1 1 145 1 1 1 1 1 1 1 1 1 1 1 1 1 1 1 1 1 1 1 1 1 1 1 1 1 1 1 1 1 
##$CPDPRG= <>
##$CPDPRG1= <>
##$CPDPRG2= <>
##$CPDPRG3= <>
##$CPDPRG4= <mlev>
##$CPDPRG5= <mlev>
##$CPDPRG6= <mlev>
##$CPDPRG7= <mlev>
##$CPDPRG8= <mlev>
##$CPDPRGB= <>
##$CPDPRGT= <>
##$D= (0..31)
0 1.2 0 0 0 0 0 0 0 0 0 0.03 0 0 0 0 0 0 0 0 0 0 0 0 0 0 0 0 0 0 0 0 
##$DATE= 1564144604
##$DBL= (0..7)
120 120 120 120 120 120 120 120 
##$DBP= (0..7)
150 150 150 150 150 150 150 150 
##$DBP07= 0
##$DBPNAM0= <>
##$DBPNAM1= <>
##$DBPNAM2= <>
##$DBPNAM3= <>
##$DBPNAM4= <>
##$DBPNAM5= <>
##$DBPNAM6= <>
##$DBPNAM7= <>
##$DBPOAL= (0..7)
0.5 0.5 0.5 0.5 0.5 0.5 0.5 0.5 
##$DBPOFFS= (0..7)
0 0 0 0 0 0 0 0 
##$DE= 6
##$DECBNUC= <off>
##$DECIM= 24
##$DECNUC= <off>
##$DECSTAT= 4
##$DIGMOD= 1
##$DIGTYP= 9
##$DL= (0..7)
0 120 120 120 120 120 120 120 
##$DP= (0..7)
150 150 150 150 150 150 150 150 
##$DP07= 0
##$DPNAME0= <>
##$DPNAME1= <>
##$DPNAME2= <>
##$DPNAME3= <>
##$DPNAME4= <>
##$DPNAME5= <>
##$DPNAME6= <>
##$DPNAME7= <>
##$DPOAL= (0..7)
0.5 0.5 0.5 0.5 0.5 0.5 0.5 0.5 
##$DPOFFS= (0..7)
0 0 0 0 0 0 0 0 
##$DQDMODE= 0
##$DR= 18
##$DS= 0
##$DSLIST= <SSSSSSSSSSSSSSS>
##$DSPFIRM= 0
$$ [...]
##$SUBNAM2= <"">
##$SUBNAM3= <"">
##$SUBNAM4= <"">
##$SUBNAM5= <"">
##$SUBNAM6= <"">
##$SUBNAM7= <"">
##$SUBNAM8= <"">
##$SUBNAM9= <"">
##$SW= 24.9338927700986
##$SWIBOX= (0..15)
0 0 2 0 0 0 0 0 0 0 0 0 0 0 0 0 
##$SW_h= 4990.01996007984
##$TD= 16384
##$TD0= 1
##$TE= 0
##$TE2= 300
##$TE3= 300
##$TEG= 300
##$TL= (0..7)
0 120 120 120 120 120 120 120 
##$TP= (0..7)
150 150 150 150 150 150 150 150 
##$TP07= 0
##$TPNAME0= <>
##$TPNAME1= <>
##$TPNAME2= <>
##$TPNAME3= <>
##$TPNAME4= <>
##$TPNAME5= <>
##$TPNAME6= <>
##$TPNAME7= <>
##$TPOAL= (0..7)
0.5 0.5 0.5 0.5 0.5 0.5 0.5 0.5 
##$TPOFFS= (0..7)
0 0 0 0 0 0 0 0 
##$TUNHIN= 0
##$TUNHOUT= 0
##$TUNXOUT= 0
##$USERA1= <user>
##$USERA2= <user>
##$USERA3= <user>
##$USERA4= <user>
##$USERA5= <user>
##$V9= 5
##$VALIST= <valist>
##$VCLIST= <CCCCCCCCCCCCCCC>
##$VD= 0
##$VDLIST= <DDDDDDDDDDDDDDD>
##$VPLIST= <PPPPPPPPPPPPPPP>
##$VTLIST= <TTTTTTTTTTTTTTT>
##$WBST= 1024
##$WBSW= 4
##$XGAIN= (0..3)
0 0 0 0 
##$XL= 0
##$YL= 0
##$YMAX_a= 156867
##$YMIN_a= -152810
##$ZGOPTNS= <>
##$ZL1= 120
##$ZL2= 120
##$ZL3= 120
##$ZL4= 120
##$ABSF1= 10
##$ABSF2= 0
##$ABSG= 5
##$ABSL= 3
##$ALPHA= 0
##$AQORDER= 0
##$ASSFAC= 0
##$ASSFACI= 0
##$ASSFACX= 0
##$ASSWID= 0
##$AUNMP= <proc_1d>
##$AZFE= 0.1
##$AZFW= 0.1
##$BCFW= 1
##$BC_mod= 2
##$BYTORDP= 1
##$COROFFS= 0
##$CY= 11.3945322036743
##$DATMOD= 1
##$DC= 2
##$DFILT= <>
##$DTYPP= 0
##$F1P= 20.1537800932815
##$F2P= 0.134698688090026
##$FCOR= 0.5
##$FTSIZE= 0
##$FT_mod= 4
##$GAMMA= 1
##$GB= 0.15
##$INTBC= 1
##$INTSCL= 1
##$ISEN= 128
##$LB= 0.24
##$LEV0= 0
##$LPBIN= 0
##$MAXI= 10000
##$MC2= 0
##$MEAN= 0
##$ME_mod= 0
##$MI= 1.114404
##$NCOEF= 0
##$NC_proc= 0
##$NLEV= 6
##$NOISF1= 3.799351
##$NOISF2= 2.8
##$NSP= 1
##$NTH_PI= 0
##$NZP= 0
##$OFFSET= 15.70392
##$PC= 1
##$PHC0= -9131.313
##$PHC1= 14.20097
##$PH_mod= 1
##$PKNL= yes
##$PPARMOD= 0
##$PSCAL= 0
##$PSIGN= 0
##$REVERSE= no
##$SF= 200.130013532006
##$SI= 16384
##$SIGF1= 3
##$SIGF2= 2
##$SINO= 400
##$SIOLD= 16384
##$SREGLST= <1H.CDCl3>
##$SSB= 0
##$STSI= 0
##$STSR= 0
##$SW_p= 3612.71676300578
##$SYMM= 0
##$S_DEV= 0
##$TDeff= 0
##$TDoff= 0
##$TI= <>
##$TILT= no
##$TM1= 0
##$TM2= 0
##$TOPLEV= 0
##$USERP1= <user>
##$USERP2= <user>
##$USERP3= <user>
##$USERP4= <user>
##$USERP5= <user>
##$WDW= 1
##$XDIM= 8192
##$YMAX_p= 0
##$YMIN_p= 0
$$ End of Bruker specific parameters
$$ ---------------------------------
##NTUPLES= NMR FID
##VAR_NAME=  TIME,          FID/REAL,        FID/IMAG
##SYMBOL=    X,             R,               I
##VAR_TYPE=  INDEPENDENT,   DEPENDENT,       DEPENDENT
##VAR_FORM=  AFFN,          ASDF,            ASDF
##VAR_DIM=   8192,          8192,            8192
##UNITS=     SECONDS,       ARBITRARY UNITS, ARBITRARY UNITS
##FACTOR=    0.0002004,     1,               1
##FIRST=     0,             0,               0
##LAST=      1.6414764,     0,               0
##MIN=       0,             -152810,         0
##MAX=       1.6414764,     156867,          0
$$ Real data points
##PAGE= N=1
##DATA TABLE= (X++(R..R)), XYDATA
0@%%%%%%%%Qj6J6j6J6j6K1k9L2m0M8n4O2p2Q6r9J13j28J45j65J87k09K35k66K98
$$ 0 0 0 0 0 0 0 0 0 8 -8 8 -8 8 -8 13 -16 16 -24 24 -30 32 -40 46 -53 60 -68 77 -88 99 -110 125 -141 157
33A57l30L67m10M56n07N64o26O91p61Q41r33J034j147J276j425J594j789K022
$$ 157 -173 194 -216 240 -267 297 -329 362 -399 442 -491 543 -604 672 -753 841 -948 1074
51A074k304K652l094L675m477N661p569J1130j9871P5913R4077k53115J0274K12268
$$ 1074 -1230 1422 -1672 2003 -2474 3187 -4382 6748 -13123 62790 156867 -96248 -85974 126294
65A26294r3764j85340J48389J20583j47571l6707J44975l2555j16060N3709N4880
$$ 126294 32530 -152810 -4421 116162 -31409 -68116 76859 44304 -71756 -18047 36833
76C6833o7099J0883O7277l8447l7022N1740j1602n9324L6182M5063m4524r457
$$ 36833 -30266 -19383 47894 9447 -27575 24165 12563 -46761 -10579 34484 -10040 -19497
88a9497N0847j0218m2462J0673J0754r542J2787J650j3865K7555Q601n5697J322
$$ -19497 31350 21132 -21330 -10657 97 -9445 3342 4992 -8873 18682 27283 -28414 -27092
101b7092O0833l2448n5922O9188M9246q2303k1117P8049k3759p2660N1668M9827
$$ -27092 33741 1293 -54629 14559 63805 -18498 -39615 38434 14675 -57985 -6317 43510
113D3510n7174k724N8941l7107m5985N3427J581o4902M8752O8657p7277m0047
$$ 43510 -13664 -16388 42553 5446 -40539 12888 14469 -50433 -1681 66976 -10301 -50348
125e0348R6754r101j13804M6144J03981p3917o6189J03757L1505j14144n536R2288
$$ -50348 46406 37305 -76499 -30355 73626 -291 -66480 37277 68782 -45362 -50898 41390
137D1390k6882o3643N1895M3421m8367j8042L0861p805j8791J1305K498J981K0614
$$ 41390 14508 -49135 2760 46181 -2186 -20228 10633 2828 -15963 -4658 -2160 -179 20435
150B0435j0316k7518J8363J3184l6262P72M6444j0608l5116K8665J8940m4430
$$ 20435 10119 -17399 964 14148 -22114 -21342 25102 14494 -20622 8043 26983 -17447
162a7447p749L8973j1282k2677L5443J2116m2408K070L1823k6077k2376M0845
$$ -17447 -25196 13777 2495 -20182 15261 27377 -15031 -12961 18862 -7215 -29591 11254
174A1254J1916l7326R581L1540k8015k6940K8215J0688k1566J0170J7991j6703
$$ 11254 23170 -14156 -4575 26965 -1050 -27990 225 10913 -10653 -483 17508 805
186H05o765J2251j2419q535K2275j496k0575K2136J9240l7395j3965L9168m320
$$ 805 -5960 6291 -6128 -14663 7612 6116 -14459 7677 26917 -10478 -24443 14725 10405
199A0405l8800K4034L7078l2416k3446L7019M466m1520N174L4547j0147j7217
$$ 10405 -28395 -4361 32717 301 -23145 13874 18340 -23180 -18006 16541 6394 -10823
211a0823J8566O312k0286l390R016k310J141N780l015K928O601j3609j1361J4792
$$ -10823 7743 14055 -6231 -9621 -605 -2915 -1774 4006 991 3919 10520 -3089 -14450 342
225C42M500j4749R775J8986j6422j6104J7709L428k2088N918K1881r233j0939
$$ 342 4842 -9907 -132 18854 2432 -13672 4037 7465 -14623 -8705 13176 3943 -6996
238f996J5444N28k0542K402J4473o302l869J2100p52r980M333J631j0088K319
$$ -6996 8448 8976 -11566 -9164 5309 -993 -4862 7238 6486 -3494 839 2470 -7618 -5299
252e299R003m321M44J0594p016j3363Q803O199j3776K243J8263o116j3731J2460
$$ -5299 3704 -617 -173 10421 3405 -9958 -1155 5044 -8732 -6489 11774 5658 -8073 4387
266D387N926k0664l150K0167q36j2528J0296Q739j5340p061J1806L80r113N273
$$ 4387 10313 -10351 -13501 6666 5830 -6698 3598 12337 -3003 -10064 1742 2122 -6991 -1718
280a718R218k847m530j79k161j660J153J079M038M057n053n054N722P26j0168
$$ -1718 7500 4653 123 -56 -2217 -3877 -2724 -1645 2393 6450 1397 -3657 2065 2791 -7377
295g377J098J1704j952p149P398M078j2529m058J1095P02q010M496P600m989m828
$$ -7377 -6279 5425 3473 -3676 3722 7800 -4729 -8787 2308 3010 -5000 -504 7096 2107 -2721
310b721L584p26n128J613N060J376j04j131k944k04R11k722p1N539J024l557K337
$$ -2721 863 137 -4991 -3378 1682 3058 2954 1823 -1121 -1325 -414 -3136 -3207 2332 3356 -201 2136
327B136K112p469m379P219L709m417J624N233m234n942L156K340m567M02O672
$$ 2136 4248 -3221 -7600 -381 3328 -1089 535 5768 1534 -4408 -1252 1088 -3479 -3077 3595
342C595J075m004q37j22k692j62L315J620m00o5m36p48l37j564j476K376L303
$$ 3595 4670 666 -171 -293 -2985 -3147 168 1788 1388 1323 887 139 -198 -1762 -3238 -862 2441
359B441n95j274R13j239l330J015L557r56k373K450K642k340k499R70J36j781
$$ 2441 1846 572 1485 246 -3084 -2069 1488 532 -1841 609 3251 911 -1588 -618 -482 -2263
375b263J185L485J47k855o97J810k08k587l74K730J193j266O51J668k795m076
$$ -2263 -1078 2407 2554 -301 -998 812 604 -1983 -2357 373 1566 300 951 2619 -176 -4252
391d252K305M410j825k571L688J904m908j747M212p80m555L354O276l111n641
$$ -4252 -1947 2463 638 -1933 1755 3659 -1249 -2996 1216 436 -4119 -765 5511 2400 -3241
406c241K532K681m194q98N525N67m857P06M364k130m843J659M177j067k169K227
$$ -3241 -709 1972 -2222 -3120 2405 2972 -1885 -1179 3185 1055 -3788 -2129 2048 981 -1188 1039
422A039J359l672j853L909J861l949j348M237R33l835K25L168k158l184L539K948
$$ 1039 2398 -1274 -3127 782 2643 -1306 -2654 1583 2516 -1319 -1094 2074 -84 -3268 271 3219
438C219l861j970M049Q07l576J60K192j773j234L167J441k592j047Q13k81OQ34
$$ 3219 -642 -2612 1437 2244 -1332 -1172 1020 -753 -1987 1180 2621 29 -1018 -205 -486 -480 354
455C54l62k10J233m5j451P4N1j310J159K862p62k808M56J341j251l19J769n4j439
$$ 354 -8 -218 1015 970 -481 -407 -356 -1666 -507 2355 1593 -1215 -759 582 -669 -988 781 727 -712
474g12P14J158q11j233k08O91J381J18j626n8J262r55q70K249K63l467M75M168
$$ -712 2 1160 349 -884 -1092 -401 980 1098 -528 -586 676 -279 -1149 1100 1363 -2104 -1629 2539
492B539j052l746J877K475l159r92L907k39m048J492L759k027k893J801J095j786
$$ 2539 1487 -2259 -382 2093 -1066 -2058 1849 1610 -2438 -946 2813 786 -2107 -306 789 -997
508i97O95K250j143k204N10J303q6m91k72L81R71l99j131M11M34j522N65L016
$$ -997 -302 1948 805 -1399 -889 414 328 -163 -435 -54 917 518 -613 -202 232 -1290 -725 2291
526B291p87l552R21K769j742j749K859P31l411M73L712j540l805J862L054j829
$$ 2291 1504 -2048 -1127 1642 -100 -1849 1010 1741 -1670 -1197 2515 975 -2830 -968 2086 257
542B57j624K181L00k608L61K761n89k618N03K131j82j409L85P50j054p18J618
$$ 257 -1367 814 1114 -1494 -1133 1628 1039 -1579 -1076 1055 873 -536 -151 599 -455 -1173 445
559D45J034j818j144J872J100j799q53J414J42j096R77J290j664j785J465J630
$$ 445 1479 -339 -1483 389 1489 -310 -1163 251 393 -703 274 1564 -100 -1885 -420 1210
575A210q87p50P42M7q03K17O50n21o90O48J099j9j077o91J62N50M57J70m34m52
$$ 1210 323 -427 315 362 -441 -224 426 -95 -785 -137 962 943 -134 -825 -663 -113 344 514 80 -372
595c72K97M18k93j51J58n93k15J546M66k104l53K233j45k038J022J249k349m43
$$ -372 -75 343 50 -101 57 -536 -751 795 1261 -843 -1196 1037 892 -1146 -124 1125 -1224 -1667
613a667L558M8l645O08K569j849j218K974j66l160J633K832k838j997L093L62
$$ -1667 1891 1939 -1706 -1098 1471 -378 -1596 1378 1212 -1948 -315 2517 -321 -2318 775 1137
629A137k643J785K102l284j651L384O18k269R39J020j952J02J669j398p84K042
$$ 1137 -1506 279 2381 -903 -2554 830 1448 -821 118 1138 -814 -712 957 -441 -1225 817
645H17l06j310K288M2m269R25M577k306l227M036J325n179J030N072l305l992
$$ 817 511 -799 1489 1531 -2738 -1813 2764 458 -2769 1267 2592 -2587 -1557 3515 210 -3782
661c782M502J868m490J075L585l674j681N094p86n182L005L421m828j66O142k870
$$ -3782 720 2588 -1902 -827 2758 -916 -2597 2497 1711 -3471 -466 2955 -1873 -2039 4103 1233
677A233o017M972L961o296r16O424k053n021M574K695n904l12N391j870l091L613
$$ 1233 -4784 188 4149 -2147 -3063 3361 1308 -3713 861 3556 -2348 -2660 2731 861 -2230 1383
693A383P8m436K420L729l777j563M128j206l345L319J515m474Q79M121k749j964
$$ 1383 1461 -2975 -555 3174 -603 -2166 1962 756 -2589 730 2245 -2229 -1350 2771 22 -1942
709a942L838j324m187M358L140o274o37O843k639n918O022L776q499j031R106
$$ -1942 1896 572 -3615 743 3883 -2391 -3028 3815 1176 -4742 1280 5056 -3443 -4474 4632
724D632j883p880M581N347o223k058O449j204n594L193L666l504n82K882k373
$$ 4632 2749 -5131 -550 4797 -1426 -3484 2965 1761 -3833 -640 3026 -478 -1060 1822 -551
739e51j674L805j99l827K325K778l780o08M205j893l981L614K842l925o77L219
$$ -551 -2225 1580 1381 -2446 -121 2657 -1123 -1731 2474 581 -3400 214 3056 -869 -1546 1673
755A673j775j997L464K54l806J615L002l118j100L907j294m014L287L253m198
$$ 1673 -102 -2099 1365 1619 -2187 -572 2430 -688 -1788 2119 825 -3189 98 3351 -847
770h47j664M010l64l018K130J606l117n6K770j213j211K157r92k443K928J939
$$ -847 -2511 1499 1135 -1883 247 1853 -1264 -1320 1450 237 -974 1183 191 -2252 676 2615
786B615m343o83M860j003m235K857L050m497j805N018P39m357L61L087j177j722
$$ 2615 -1728 -2411 2449 1446 -2789 68 3118 -1379 -3184 1834 2573 -1784 -1423 1664 487 -1235
802a235J357L86j064L25O07k7K89p14j402J221J837j627j267J989L84k008O16
$$ -1235 122 508 -556 -231 376 349 638 -76 -1478 -257 1580 -47 -1314 675 1059 -949 -333
819c33J557j690j002K120N18j473K89L76j366N25J825j242j457J767Q02j867J33
$$ -333 1224 -466 -1468 652 1170 -303 -14 362 -1004 -479 1346 104 -1353 414 1216 -651 -518
836e18J436j208j047J772Q31j400l93L87r3N15K52j158J00J388p02j028J679J93
$$ -518 918 -290 -1337 435 1266 -134 -527 -140 -233 282 534 -624 -524 864 162 -866 813 1006
854A006k663M33L066j022k563J522J716j791n33J653o41j436J078R82n20K1k32
$$ 1006 -1657 -1224 1842 820 -1743 -221 1495 -296 -829 824 183 -1253 -175 807 287 308 76
871G6r06Q07J043j605n74K014j04j702J444J065k761n76L005k46k294J356J279
$$ 76 -830 -23 1020 -585 -1159 855 751 -951 493 1558 -1203 -1779 1226 980 -1314 42 1321
888A321k276J57K538j581k243K443J257k618M20K313k050j784L073R08l231J60
$$ 1321 -955 -798 1740 159 -2084 359 1616 -1002 -582 1731 -319 -2103 970 1878 -1353 -1193
904a193K560j167j342J882L9k100R27J629j198n44R72q31n84J837j03k005R96
$$ -1193 1367 200 -1142 740 779 -1321 -394 1235 37 -507 465 -366 -950 887 784 -1221 -225
921b25J563j676m33K032j137k210K137J861k412n12K249r68j726K051O98k859
$$ -225 1338 -338 -771 1261 124 -2086 51 1912 -500 -1012 1237 269 -1457 594 1292 -1567
937a567M30K815j083j740J907J60k518R59K317j788j552K308N93j958O70J138
$$ -1567 -1137 1678 595 -1145 762 922 -1596 -637 1680 -108 -1660 648 1241 -717 -47 1091
953A091j868o79K164P3j505P46P08j238K73J292j338j172J740O64j405M20J000
$$ 1091 -777 -1456 708 781 -724 22 730 -508 -235 1057 -281 -1453 287 951 -454 -34 966
970I66j513o62J907K35j854L88J360p47n28J001l40j178P71J039o54m54L53l20
$$ 966 -547 -1209 698 933 -921 -533 827 80 -448 553 213 -965 -194 845 191 -263 90 -230
988b30j32Q81j72j002N16P83o51j54P47q66r43J384R83j343l72J247m19j139R68
$$ -230 -362 519 347 -655 -139 644 -7 -161 586 -280 -1223 161 1144 -199 -571 676 257 -882 86
1007H6O62j501k15J871K40j592J6P84p25l98J180L18j143l5J096r4r32j31L74
$$ 86 748 -753 -968 903 1143 -449 -433 351 -374 -772 408 726 -417 -452 644 550 -382 -513 -139
1026a39K7J25L33R9m29n06J46P01j8q35L5R50J9p29J89K79q23k04J406L07j401
$$ -139 -112 13 346 445 16 -490 -344 357 339 -496 -461 489 508 -221 -32 247 -576 -780 626 933 -468
1047d68j89J241j49j076M25P14p76k90J274K70j439m64R90L32o02J56M87l24m43
$$ -468 -657 584 435 -641 -216 498 -278 -568 706 976 -463 -927 63 395 -207 -51 436 112 -331
1066c31L76L84n75o90N48J001r0q92L9M01m38l12R24L10j079j23J220rj344l3
$$ -331 45 429 -146 -836 -288 713 623 -269 -230 171 -267 -579 345 655 -424 -547 673 664 -680 -713
1086g13R43j45l92P56K63j051m46R24M08p84k93O80K71l55j39K23k53n84M02J026
$$ -713 230 85 -307 449 712 -339 -785 139 547 -237 -530 150 421 66 -73 150 -103 -687 -285 741
1106G41j92r84J00Q35l39p08M72M26p12M1J136j02j378j25J077On67K92L98m49
$$ 741 549 -435 -335 500 161 -547 -75 351 -361 -320 816 714 -664 -789 288 294 -273 19 417 -32
1126c2l54N64K13p71l95Q15P40m57o54L46J54o43N2J032j61j186M48J289o36j337
$$ -32 -386 178 391 -380 -775 40 780 323 -331 15 169 -474 -422 610 449 -737 -289 1000 364 -973
1146i73O01Q64p18j82J175j16j440J38J229j95j014K83Q28k52m22L45J39o58l34
$$ -973 -372 492 -226 -408 767 651 -789 -651 578 383 -631 -348 480 228 -194 151 290 -368 -702
1165g02P45P50n64q34M87P05o28n65P05K57q79K31J358n47j487M74J173o26o59
$$ -702 43 793 229 -605 -118 587 -41 -606 99 356 -523 -292 1066 519 -968 -494 679 53 -606
1184f06R31K39j068K21R80m75r91L78P69j13j96M6j43k00M8J78J79j70l91K85
$$ -606 325 564 -504 -283 697 222 -769 -391 378 265 69 115 -28 -228 -180 -2 177 7 -384 -99
1204i9P62l56j010L95P54p06j56J194k82j456N76J385r34j095J109N88j062K01
$$ -99 663 307 -703 -308 446 -260 -416 778 496 -960 -384 1001 67 -1028 81 669 -393 -192
1222a92J056p69j081Q50P04o34j25L36j96N6L68m80l47N61q0l80Q24L46j464j38
$$ -192 864 95 -986 -136 568 -66 -191 145 -51 5 373 -107 -454 107 27 -353 471 817 -647 -785
1242g85J520l09j369R40Q84j360q2J629o52j720R70J264j102k62J114n31r08R38
$$ -785 735 426 -943 -3 881 -479 -561 1068 416 -1304 -334 930 -172 -434 680 149 -759 179
1260A79L98j043R0P38m87Q1P88q39q73J205K97j289P05J153j638n25K258l77k479
$$ 179 577 -466 -376 362 -125 -44 744 -95 -968 237 534 -755 -50 1103 -535 -1060 1198 821 -1658
1279a658J163K040j849q86K465l44k729J290K252k004j242K363J27k050R72J351
$$ -1658 -495 1545 -304 -1190 1275 931 -1798 -508 1744 -260 -1502 861 988 -1062 -90 1261
1295A261j848o34J885m3j236Q81L25j330M87J185j270n63J537k53j163J234N00
$$ 1261 -587 -1221 664 621 -615 266 591 -739 -252 933 -337 -900 637 384 -779 455 955
1312I55k069K22K082r83j350J774L07k106P90J849j832j239K348K72k064J024
$$ 955 -1114 -892 1190 207 -1143 631 938 -1168 -378 1471 -361 -1600 748 1020 -1044 -20
1328b0J397k148n90K497m55k120J528J283k123J0K127j396j835K284J071k461
$$ -20 1377 -771 -1361 1136 681 -1439 89 1372 -751 -741 1386 -10 -1845 439 1510 -951
1344i51L02K236j751j574K583N42k888O78K580j508j607K059K30k385Q42K069
$$ -951 -649 1587 -164 -1738 845 1387 -1501 -823 1757 249 -1358 701 931 -1454 -612 1457
1360A457j311j187J538J69j364O29O85j214P0J238n17o25J010m70j200J243R32
$$ 1457 146 -1041 497 666 -698 -69 616 -598 -528 710 193 -432 578 108 -1092 151 1083
1377A083j730j28J960q85j597J801O57k545L27K785j193k141K075R00k704L32
$$ 1083 -647 -775 1185 300 -1297 504 1161 -1384 -1057 1728 535 -1606 469 1369 -1335 -1003
1393a003K711j497k088K396J134k624L8K223j348j554K265Q17k433K39J935j187
$$ -1003 1708 211 -1877 519 1653 -971 -933 1290 -58 -1612 653 1470 -963 -724 1211 24
1409B4j129J655P0j685Q78J428j376o88J311l86j003J221N31j427J57J302q50
$$ 24 -1105 550 620 -1065 -187 1241 -135 -823 488 102 -901 320 851 -576 -419 883 33
1426C3q04J113q9j185R75J070j316m29J199n27r14J226L34j532N28J467j147r25
$$ 33 -771 342 253 -932 43 1113 -203 -632 567 40 -874 352 686 -846 -318 1149 2 -923
1444i23J443r5j657J159J520j738q89K013j02j983J058J456j794o80K194l9k067
$$ -923 520 425 -1232 -73 1447 -291 -1180 833 731 -1252 -194 1262 -532 -1212 982 943 -1124
1461a124O45J457j159o94J539m7j453N60J088p68o03O93M5m36M17K03n15o2J93
$$ -1124 -479 978 -181 -875 664 617 -836 -276 812 44 -559 134 179 -257 160 363 -152 -214 -21
1480b1j32K47K53m94j63P64j64p79L90L78p32J23J126l53j117N97O93r34k80J011
$$ -21 -153 94 347 -147 -310 454 290 -489 -99 279 -453 -330 796 443 -674 -77 616 -318 -598 413
1500D13k32p45O67P06q99n04O49Q7m95L59L89m83j79N14Pm24j3R0k8K18J59k58
$$ 413 181 -564 103 809 -90 -594 55 142 -353 6 395 -88 -267 247 254 -170 -183 -93 -121 97 256 -2
1522bj43J76k7l6J37p5k87J72L55j43k56JJ06N6J29J4k22j58J15J27R3m8j76L2
$$ -2 -145 31 4 -32 105 30 -257 -85 270 127 -129 -128 -22 34 163 177 -45 -203 -88 39 132 84 -92 -60
1546f0K54n1k78j8J09j29P4M62j13m71N2L68j83k87K16J20j28J41K95k21m04P
$$ -60 194 143 -135 -153 -44 -173 -99 363 250 -221 -169 199 16 -271 -55 65 -63 78 373 152 -252 -245
1568b45K08Q5p3j6K8O5L9k4m8j62j53K34L20q3k90J20Q4j82J3K38k16k54L41L46
$$ -245 -37 48 -25 -41 -13 52 91 67 19 -143 -296 -62 258 175 -115 5 89 -93 -80 158 -58 -312 29 375
1592C75k93l18K78J3k40K19K74l64k89L89K31l11j48K17J4j04K03kk11j65J44
$$ 375 82 -236 42 55 -185 34 308 -56 -345 44 275 -36 -184 33 47 -57 146 144 -67 -232 -88
1613h8J78N8j26j92J35K02j55j57J25J3j88K44L45l31l98K75K83l20q1K84l5k22
$$ -88 90 148 22 -170 -35 167 12 -145 -20 -7 -195 49 394 63 -335 -60 223 -97 -178 106 71 -151
1635a51K25K58l49k83K02J39pM2Pj37RJ34m2j36pjR1K05Ml18m5J77n5j7J91q4
$$ -151 74 332 -17 -300 -98 41 34 76 83 -54 -45 89 47 -89 -96 -97 -6 199 203 -115 -160 17 -38 -55 136 52
1661E2j99J40K62k19k93J68J25n4R2J86k85k54K38K09j84j65J92P6m0pP1j95j49
$$ 52 -147 -7 255 36 -257 -89 36 -18 74 260 -25 -279 -41 168 -16 -181 11 87 47 40 111 -84 -233
1684b33J18K66K2k18q4J78M0j48k8R9r0l2K48J42k86l15K25K26j60o2J88l4j60
$$ -233 -115 151 173 -45 -129 49 89 -59 -87 12 -78 -110 138 280 -6 -321 -96 130 -30 -92 96 62 -98
1707i8Q7J55j73k50J99K82n9j22K3l7j42N7J89k8j81P1K04Ok65m9K6K0R4J50K2
$$ -98 -11 144 -29 -279 -80 202 143 21 44 7 -135 -78 111 83 -98 -27 177 183 -82 -131 -105 -85 9 159 181
1732A81k52l5J38j2j19l1Q5J04O7K1o6j85j36J04K33K2j47rJ48l0j52Kpq2J14
$$ 181 -71 -106 32 20 -99 -130 -45 59 126 147 81 -104 -240 -136 97 119 -28 -37 111 81 -71 -69 -76 -158 -44
1757d4L36p8k95r2J55l3m3J63L0j28N4J59j05k77j2J58J07R8rp1j08n1L7P7l1
$$ -44 292 214 -81 -173 -18 -51 -94 69 99 -29 25 184 79 -198 -210 -52 55 153 144 73 -35 -86 -49 28 -3
1782cj13J43K38o6l16l5R7q3M0L29Ql46J4K65j31k76J10J95n5O2K11j86l33oK23
$$ -3 -116 27 265 199 -117 -152 -55 -138 -98 231 239 -107 -93 172 41 -235 -125 70 15 77 288 102 -231 -237 -14
1807a4J8k0P1J0K3J0j10j50J1L2R3K67N9l54j13J60j4j95J51J78j24L0K88j68
$$ -14 4 -16 55 65 88 98 -12 -162 -151 -119 -26 241 300 -54 -167 -7 -21 -216 -65 113 -11 19 307 139
1831A39m52L6K87l0N0K14r2k50N0J40k06j07K11R9JJ29j09l02n4J72N7L0J56j10
$$ 139 -313 -277 10 -20 30 244 152 -98 -48 92 -114 -221 -10 89 90 219 110 -192 -246 -74 -17 13 169 59
1855E9q5J71l7l68MK77k9L1K95r6m87K2L59j56k47L56J75k97K5K39k78l31K64
$$ 59 -26 145 108 -260 -256 21 -8 23 318 222 -265 -243 116 -40 -287 69 244 -53 -28 211 -67 -398 -134
1878a34K76p4N0M1k15n6J41j11j54K76Q3r3J48R6m65k11L94J07k72K36K90l92
$$ -134 142 68 118 159 -56 -112 29 -82 -236 40 123 30 178 274 -191 -402 -8 99 -173 63 353 -39
1900c9j52L84j42m67K65M21j90l9K86l35m05L09K93l55L0M48j71k61K46o5m74
$$ -39 -191 193 51 -416 -151 270 80 41 327 -8 -413 -104 189 -166 -136 312 141 -120 126 61 -413
1921d13J32M87j01j21K66j95l50K14J81l46M8N03j66k51L48n8p38K32O83k79l20
$$ -413 -281 206 105 -16 250 55 -295 -81 100 -246 -198 305 139 -112 236 178 -560 -328 355 76 -244
1942b44N26M7o46J52M14m05l12O25K30m47J17J39m59r1N39p8l25L71K26n14O0
$$ -244 282 329 -317 -165 249 -156 -468 157 387 -60 57 196 -263 -354 185 107 -218 153 379 -135 -75
1963g5L32n03k65O67K35n09J26L70n64k43N98m3m65L25M91m59j63L76l24m29N37
$$ -75 257 -246 -511 156 391 -118 8 378 -186 -429 169 126 -339 -14 477 18 -145 231 -93 -522 15
1984A5L71m66j0M68l73l79M02M5m81L17N56l50k19L33l03m47M84L86n17L7O34
$$ 15 386 -80 -90 378 5 -374 28 73 -408 -91 465 115 -104 229 -74 -521 -37 349 -168 -131 503
2005E03l73n16M46J09o96K44Q60k89o15N00Q4p19J56O86l55l30N75J68o33K5K66
$$ 503 130 -386 60 169 -527 -283 577 288 -327 173 257 -462 -306 380 25 -305 270 438 -195 -170 96
2026I6l53m1O15Qm63K42J21m83N2L61k62j53N98M9n12P2J51m69K7O73j16m78M36
$$ 96 -257 -298 317 325 -138 104 225 -258 -206 155 -107 -260 338 387 -125 -53 98 -371 -344 329 213 -265 171
2049A71K43p05n3N44l27l10P05K86p19k9M56m46l13O70J07n65L36M61n57l54M94
$$ 171 414 -291 -344 200 -127 -437 268 554 -165 -194 262 -184 -497 173 280 -285 51 512 -45 -399 95
2070I5j63l91N79M45o46j19M41k63m35M75K49m70J71N12l47m71L22O6l30L06L37
$$ 95 -68 -459 120 565 -81 -200 241 -22 -457 18 267 -203 -32 480 133 -338 -16 50 -280 26 363
2091C63l32j42L21j74l43K89O6l11L57L84m72k30L51j92l62M87L35n40qO08l45
$$ 363 31 -111 210 36 -307 -18 48 -263 94 478 6 -224 127 -65 -427 60 395 -145 -153 455 110
2112A10n98M48K23n53K22P57m13o11N08J44o63J65N97l25k51N70O6p03K2L93k79
$$ 110 -488 -40 183 -370 -148 609 196 -415 93 237 -426 -261 336 11 -240 330 396 -307 -285 108 -171
2133a71k7M99j6m44J92J59l97K0L04j77k8M06m8n06J29K22l55O7N21j96l97L96
$$ -171 -198 301 285 -159 33 192 -205 -185 119 -58 -86 320 272 -234 -105 117 -238 -171 350 154 -243 153
2155A53J46n86J7M51k65j48N80P4p02J21M06l90k60O26mm94L61L48n96k87N50
$$ 153 299 -287 -270 181 -84 -232 348 422 -280 -159 247 -143 -403 223 219 -275 86 434 -162 -449 101
2176A01m5l87N16K97o19j43N20k32m40M50K19m14J73M18m27m07M18J05l87L17
$$ 101 56 -331 185 482 -137 -280 240 8 -432 18 237 -177 -4 414 -13 -420 -2 103 -284 33
2196C3L69m31j49M01j34m39K19L07k56R3L73l39l97L71R7l61J85L86l53j22M57
$$ 33 402 -29 -178 223 89 -350 -131 176 -80 13 386 47 -350 21 118 -243 -58 328 -25 -147 310
2217C10j78n23K27L93l78J2N29k61n38L99K72n63P0N07k00k98M30O9o21N0N03
$$ 310 132 -391 -164 229 -149 -137 392 131 -407 -8 264 -299 -229 278 78 -220 210 279 -342 -292 211
2238B11k12k27M63K2n41K05L53m37j94M87M7l07K57J60m71j04M47r6k55L16J20
$$ 211 -1 -228 235 257 -284 -79 274 -163 -357 130 177 -130 127 287 -184 -288 159 63 -192 124 244
2259B44l63P0L19l86k41M06J33k93K01K03m06j59M02m0l72K65K94k94l5K77k08
$$ 244 -119 -49 270 -116 -357 49 182 -111 90 293 -113 -272 130 90 -282 -17 277 -17 -52 225 17
2280A7l50K96K24k22K9K69k89j95L08l6l07J42L36k21m6K34j97l11K53K25k20
$$ 17 -333 -37 187 -35 -6 263 -26 -221 87 51 -256 -114 222 1 -45 189 -8 -319 -66 159 -61
2301f1m1L22j61k45K77L8m06O0M24j15j76K17j6l44P2L11j81j78K87J08j91J8
$$ -61 -102 220 59 -186 91 129 -277 -217 207 92 -84 133 117 -227 -155 156 -25 -203 84 192 1 19
2323A9P6k51m6K70O0j31R5mj72L9J36j77j40K91R3j82N1O9k24r0K81O1k08N0J46
$$ 19 95 -156 -202 68 128 -3 92 88 -84 -45 91 -86 -226 65 158 -24 27 96 -128 -218 63 124 -84 -34 112
2348A12j33r1J32l2j55J55J87q7j55M6l2o9J41L3p9NJ15p7l9N2p5j25J99J38j44
$$ 112 -21 -112 20 -12 -167 -12 175 88 -67 -21 -53 -122 19 52 -27 -22 93 16 -23 29 -46 -171 28 166 22
2373B2m0J05j06j06J40O2j68k3K53M0j97KK2j49O2J82J0j57KJ02l0n6k4j9J2J24
$$ 22 -18 87 -19 -125 15 77 -91 -114 139 179 -18 -16 6 -143 -81 101 111 -46 -44 58 28 -28 -52 -71 -59 65
2399F5K8q5L9j25l9J29O2p3o6J17J4j18J8K2p8j8K18Oj34j06J18J1l3J9L5n9K3
$$ 65 93 8 47 -78 -117 12 74 1 -65 52 66 -52 -34 -12 -90 -108 110 116 -18 -124 -6 5 -28 -9 26 -33 -10
2426a0M0j2j1r4k2J20Q0o6n0J5ol0M2M1j08n5K09P8j56o4L6m5L3R0L5j34K7J17
$$ -10 30 18 7 -87 -109 11 91 25 -25 -10 -16 -46 -4 37 -71 -126 83 161 5 -59 -23 -68 -35 55 90 -44 -17 100
2454A00pr3m9rJ5Q5K0l2n4n0M2O4N0j52pJ04L9o5j5J4q6M0J54K2j97j9J11l2l1
$$ 100 93 0 -49 -58 -43 42 62 30 -24 -74 -32 32 82 -70 -77 27 66 1 -14 0 -86 -46 108 130 -67 -86 25 -7 -38
2483c8J05j1j34Q6N2J5r9p4M0P5N9p6o5N9J3l4M3N7j47m2J88O8k05PR5n0p0J51
$$ -38 67 56 -78 8 60 75 -24 -98 -58 17 76 0 -65 -6 7 -27 16 73 -74 -116 72 140 -65 -58 37 -13 -83 68
2511F8M1j75j0J62j4r8j7K0J1P3J9m9p0j0L4K5M2j10o1J52P1j51j7J04q9p0K05
$$ 68 109 -66 -76 86 72 -26 -43 -23 -12 61 80 31 -39 -49 -15 10 52 -58 -119 33 104 -47 -64 40 -49 -119 86
2538H6R3k78m8K12k7j34R4N6j40k1K34k9j97mJ48l0k6Q0r5l0O3Qm2M9n2q2J82
$$ 86 179 -99 -147 65 38 -96 -2 54 -86 -107 127 98 -99 -103 45 15 -11 69 -26 -56 7 15 -27 22 -30 -112 70
2565G0J03j80j03J16L5j19J35P2k13o1K69Nk81P5J74j18o4K23ql46J18K11q8r3
$$ 70 173 -7 -110 6 41 -78 57 129 -84 -145 124 129 -152 -77 97 -21 -85 138 130 -216 -98 113 25 -68
2589f8O8K3j19J44L2j27m0J09l5J1J10j12j91J98J60k02j03K00m9j44J80J90k58
$$ -68 0 23 -96 48 80 -47 -87 22 -13 -2 108 -4 -195 3 163 -39 -142 58 9 -135 45 235 -23
2612b3j76K78N4j95J8J38j16n0J76m1j29K6N8rJ04k7j87OJ97o8j36J74Qk28J03
$$ -23 -199 79 133 -62 -44 94 -22 -72 104 63 -66 -40 18 9 113 86 -101 -95 102 34 -102 72 80 -148 -45
2637d5K62j85k53K57J50k66J3K25k27k00L47J33l08l2K73r7k02K54M5k93J1K59
$$ -45 217 32 -221 36 186 -80 -67 158 -69 -269 78 211 -97 -129 144 47 -155 99 144 -149 -138 121
2659A21n1k11J13M2n8R5M7j40k2N3k2Q2P7j45j73J93J55k60qK87j12k01K19J08
$$ 121 70 -141 -28 14 -44 51 98 -42 -64 -11 -33 49 126 -19 -192 1 156 -104 -112 175 63 -138 81 189
2683A89l06j25L83K2k48M7J61j71n7K24n5j03L8Q2p9K7J9j76L7J90l3r2J7O7j52
$$ 189 -117 -242 141 163 -85 -38 123 -48 -105 119 64 -39 -1 81 2 29 48 -128 -91 99 66 -26 -9 58 -94
2708i4Q0J28q5j79R3J23n3pL1o1n4J16M2j37n2J12K6QK6j21o0R0P4Rrm6k4oJ03
$$ -94 -14 114 29 -150 -57 66 13 6 37 -24 -78 38 80 -57 -109 3 29 37 63 -58 -118 -28 46 55 46 0 -24 -30 73
2737G3q8p9Q5M1lK2L5j45j07J35J34m7j05Q3L2j06K2M7o4j03J09J67o2j43k9J34
$$ 73 -15 -94 -9 32 29 51 86 -59 -166 -31 103 56 -49 34 66 -40 -18 29 -35 -138 -29 138 76 -67 -96 38
2763C8or5R5Q1j73n1K39J0k63jJ53j4p0J24J9j63J3J62n7j37M4O4M3K6j5j03o8
$$ 38 32 -63 32 113 -60 -111 128 138 -125 -126 27 13 -57 67 86 -77 -64 98 41 -96 -52 12 55 81 66 -37 -105
2790a05N9O1J3M8k0p5P6M6j36q9J00J2M0J18n8j88j4J74k2j01J20J8j21J12R5
$$ -105 -46 15 28 76 56 -19 57 103 -33 -122 -22 -10 30 148 90 -98 -112 62 40 -61 59 77 -44 68 163
2815A63k28j16J44J13r9J12M1j75o9K14l8j99J24R3j03M1J64k24k28K45J61j99
$$ 163 -65 -181 -37 76 -23 89 130 -45 -114 100 62 -137 -13 80 -23 18 182 -42 -270 -25 136 -63
2837f3kK41j69j98K60O2l23K0K98J6j78J21k2k07L6K29r4r6J54j5r0J01k7k22
$$ -63 -65 176 7 -191 69 131 -192 -172 126 142 -36 85 63 -144 -108 121 27 -69 85 70 -20 81 54 -168
2861a68PK35j5p6R6J0k23Q2K09j93p9J92P3j77R8O4k95k9L02l6j35J03Q7k17M0
$$ -168 -161 74 59 -17 79 89 -134 -52 157 -36 -115 77 150 -27 71 135 -160 -189 113 77 -58 45 132 -85 -45
2886d5J82k12j48K67J40k18M5J29k61r5K93N4k74J27J78j93q0K50j41l18L15K78
$$ -45 137 -75 -223 44 184 -34 11 140 -121 -216 77 131 -143 -16 162 -31 -111 139 -2 -320 -5 273
2908B73k69j05J91j16j86K38J10k36RK24k4j44P4m9j43J32J73j26p2J16l2j47
$$ 273 4 -101 90 -26 -212 26 136 -100 -91 133 109 -35 39 -10 -153 -21 152 26 -46 70 38 -109
2930a09J65K2k56O1K74o3o5O4j09j63J56J66j68p9K17j6j54R2J2k46P4L16p0j78
$$ -109 56 78 -178 -117 157 94 29 93 -16 -179 -23 143 -25 -104 113 97 -57 35 47 -199 -125 191 121 -57
2954e7R6j5j86J22J60j26j59K47K1j80O2M5j42%K98rk72M4J23j41kJ76n5j55J24
$$ -57 39 24 -162 -40 120 -6 -165 82 103 -77 -15 30 -112 -112 186 177 -95 -51 72 -69 -71 105 50 -105 19
2979A9J08q1j11O1n4K3J39k9j04K7P3n8RKj10n8K51N1j28j0L8j41j0J52m9j05
$$ 19 127 46 -65 -4 -58 -35 104 75 -29 -2 71 13 22 24 -86 -144 107 158 30 20 58 -83 -93 59 10 -95
3005i5J15J34j10o9N2j65k5K54N0j78KJ04j09o3J75o8j71J51J65j29r5P9l0n0
$$ -95 20 154 44 -25 27 -138 -163 91 141 -37 -35 69 -40 -103 72 4 -167 -16 149 20 -75 4 -26 -76
3029g6J47O3j86l9J44oj01P7K0j31M9K10j00j33N5jk9Q3K4j00j5J29j6r0N3o3
$$ -76 71 134 -52 -91 53 47 -54 23 43 -88 -39 171 71 -62 -7 -8 -37 46 70 -30 -45 84 68 -22 31 -32
3055c2j04J33J89j56j12J02jj40J03Q2j54K4J97K2k10l2O8j08J14J65j17j04Q2
$$ -32 -136 -3 186 30 -82 20 19 -121 -18 64 -90 -66 131 153 -57 -89 -21 -129 -15 150 33 -71 11
3078A1L8j21N6O8j32LK45r1j96N3J21j17J8J55q6j91J92J73j89j02R3k5m6J67
$$ 11 49 -72 -16 52 -80 -77 168 77 -119 -66 55 -62 -44 111 25 -166 26 199 10 -92 1 -24 -70 97
3102I7J9j94L6Q9j2n9P0o8n2J44K5j17nO1p0k0K03n4k32Q7J90j57j30K13k4j53
$$ 97 116 -78 -42 47 35 -24 46 -22 -74 70 95 -22 -27 34 -36 -56 147 93 -139 -52 138 -19 -149 64 40 -113
3128a13J19K08k44j46J70M8j07P1Q2j51m1J73K4j44j2K4m7J38L5j13o2J50m5j02
$$ -113 6 214 -30 -176 -6 42 -65 6 88 -63 -104 69 93 -51 -63 -39 -86 52 87 -26 -88 62 17 -85
3152h5J57lj95R8K16j37k01J39Q1j66N5K29j71k07K33J04j98p6J74o0n0J59Rj89
$$ -85 72 69 -126 -28 188 51 -150 -11 70 -96 -41 188 17 -190 43 147 -51 -127 47 -13 -63 96 105 -84
3176h4J3J19j2k9L1j01KJ57oj67N5R5j65OK60j08k72J65K65k62j25K30l2k41K31
$$ -84 -71 48 36 7 38 -63 -61 96 90 -77 -22 73 -92 -86 174 66 -206 -41 224 -38 -163 67 35 -206 25
3201B5J88k26j74J99O6j62J06M3j52M6J55o5j27Q8j9r3J71R9k61j7K00l6j45J49
$$ 25 213 -13 -187 12 78 -84 22 65 -87 -41 114 49 -78 10 -9 -102 69 168 -93 -110 90 54 -91 58
3225E8P0k68P6K73j36k67K11J03k45P1K45k19k17L37J19l12J1J67q4r3J84N3k27
$$ 58 128 -140 -64 209 73 -194 17 120 -125 -54 191 -28 -245 92 211 -101 -90 77 -7 -100 84 137 -90
3248i0j6J39l7j5P5j69j2L04n5k81J19J41k38jL72j08l93J95L48l05j78L27k0
$$ -90 -106 33 -4 -19 56 -113 -125 179 124 -157 -38 103 -135 -136 236 128 -265 -70 278 -27 -205 122 102
3271A02k75J60K34k52j71K45M2j09N1J8j57P9K02j19j01R8l4r6J67M7k29j6K81
$$ 102 -173 -13 221 -31 -202 43 85 -24 27 45 -112 -33 169 50 -51 47 13 -83 84 131 -98 -114 167
3294A67r5j86J78M1k79J12L02k04k46K54N4k34O7K22j99j62L05J12l26KK10q2
$$ 167 72 -114 64 105 -174 -62 240 36 -210 44 98 -136 -69 153 -46 -208 97 209 -117 -115 95 13
3316A3j03J88m1j66O2O4l4J4J00j84j1K71n7k55O6J88j66n9K82m9l54J60K72j18
$$ 13 -90 98 57 -109 -47 17 -17 -3 97 -87 -98 173 116 -139 -73 115 -51 -110 172 123 -231 -71 201 83
3340H3k54J60O1j11J05P6j26q1P5L2JN5j08o6J39J40k19l5J23p1o9J88L1k24%
$$ 83 -171 -11 50 -61 44 120 -6 -87 -12 20 21 76 -32 -98 41 181 -38 -73 50 -21 -90 98 129 -95 -95
3365i5J94l7j36J10L5j88P9K16j47j94J11J12q2j4J41r5j27R3J23r8j25Q3P7N1
$$ -95 99 62 -74 36 71 -117 -38 178 31 -163 -52 60 -22 -36 105 10 -117 -24 99 1 -124 -41 36 87
3389H7m6q1J3J0l6M1J16q0j59J35K11j59j73J33M1j15M1J42j07j59J28J04m7n5
$$ 87 41 -40 -27 -17 -53 -12 104 24 -135 0 211 52 -121 12 53 -62 -21 121 14 -145 -17 87 40 -15
3413a5l%O1O6j02q5Q6mm2J07L0j51p1J99J9j19lJ6n5L1J33q5r5M2N4m0M6M5j56
$$ -15 -18 -18 43 109 7 -78 8 4 -38 69 99 -52 -123 76 95 -24 -27 -11 -66 -35 98 13 -82 -40 14 -26 20 65 -91
3442i1J7J99p9j24P5Kk7N2J04j57p0J47rp0Q9Oj76L1K60r3k56J36J63k02kK68
$$ -91 -74 125 46 -78 -3 -1 -28 24 128 -29 -99 48 39 -31 58 64 -112 -81 179 86 -170 -34 129 -73 -75 193
3468A93j27l05K40K30k28j16J42j3r3J21R0j73l5J04Jk9O2j00j04K27P3k13j3
$$ 193 66 -239 1 231 3 -113 29 16 -77 44 134 -39 -74 30 31 2 64 -36 -140 87 160 -53 -66
3491f6J81j21j26K36Q0l65N8K77j14j72J52N2k14J35J76j86j49K39m1j46J53M8
$$ -66 115 -6 -132 104 184 -181 -123 154 40 -132 20 72 -142 -7 169 -17 -166 73 32 -114 39 87
3513H7k22M8K80j43k22K21P6l14J83K26k67j75L41L9k81P8J55j88j19L80l5l45
$$ 87 -135 -87 193 50 -172 49 125 -189 -6 220 -47 -222 119 158 -123 -45 110 -78 -197 183 148 -197
3535a97J00K27j53q1K51p7k34J45K10k11r9J49K9j30J43J5j60KJ12l7l4J04j34
$$ -197 -97 130 -23 -104 147 70 -164 -19 191 -20 -119 30 59 -71 72 87 -73 -71 41 4 -30 74 -60
3558f0p7J97O5k48J5K25r1j49K36K5l39O0L19j07k19J68Q6k07N6K13j59j95K23
$$ -60 -137 60 125 -123 -108 117 26 -123 113 138 -201 -141 178 71 -148 20 106 -101 -45 168 9 -186 37
3581C7O9j43N9O4j59j4K25q4k37J72J39j89N7J74j79k17K17K17k42p0K36r3j38
$$ 37 106 -37 22 86 -73 -87 138 54 -183 -11 128 -61 -4 170 -9 -226 -9 208 -34 -104 132 39 -99
3604i9J48P7k48lJ96K8j37P0k8j20J05J36j30p0R4j4k6P6k8j49M0J63m0o4Q8q4
$$ -99 49 126 -122 -125 71 99 -38 32 4 -116 -11 125 -5 -75 19 5 -21 55 27 -122 -82 81 41 -23 65 -19
3630a9j09J74R9k02r6K31m5j49J81P2k74j5L15l7k29K9J87j11l8J46o3j56Q4J38
$$ -19 -128 46 145 -57 -153 78 33 -116 65 137 -137 -152 163 126 -103 -74 113 2 -36 110 47 -109 -25 113
3654A13p5n5L6p8J2J87o0j78O9J00j28M3J14j31r2J24J47j42o6M2L5k6M4K6j01
$$ 113 38 -17 19 -59 -47 140 80 -98 -29 71 -57 -14 100 -31 -123 1 148 6 -60 -18 17 -9 35 61 -40
3679d0l8J04j8kJ4q9LR5K4o8k8K6J0QP6j04p9M6J18o1L2K1m1q6J60L4j69o8J89
$$ -40 -78 26 8 6 20 -69 -66 29 53 -15 -43 -17 -7 1 77 -27 -106 -60 58 -3 29 50 9 -77 83 117 -52 -120 69
3708F9K4j35J14Pj54J4J42L6j23m8R7Ml9Oj1p5K5Q5N9o3n8qM1J1l8k8jM7O0pm8
$$ 69 93 -42 72 79 -75 -61 81 117 -6 -54 43 47 8 14 3 -72 -47 38 97 34 -24 -32 9 20 -18 -46 -47 0 60 53 5
3739Eo5J4L7L0n%o3K9L2ro7J3P0j7L0K2m5r6L6Q2j1lk5K6l5O2j4o0m2M7Q9Kko4
$$ 5 -60 -46 -9 21 16 16 -47 -18 14 5 -62 -49 21 4 34 56 11 -85 -49 33 22 19 -6 20 -15 47 33 -27 -69 -22 67 69 67 3
3773Cm9L2L9M3o7m4N5P2m1n1m2kJ5P1O4q1p9M8M1K0q2K4OK3J4O2j13q7N1P8ML
$$ 3 -46 -14 25 68 1 -43 12 84 43 -8 -50 -52 -37 34 98 17 -62 -14 27 47 -35 -11 -5 18 32 94 -19 -106 -55 23 27 30
3805C0jn7J0J8J5j03K8O3N4m3O0p6q6K7J12j4r1KR3J7k7j3l5p1N3Q5K1m5q6L3
$$ 30 29 -28 -18 0 15 -88 -60 3 57 14 74 -2 -88 -61 51 37 -54 -52 41 58 31 18 -17 -88 -35 50 71 26 -60 -27
3835b7M5rn1PL3JM0P7j09j03OJ32Nn9qM2r1L0Q6m7p0M3P7j3l4Rp5m0J13P3j03
$$ -27 18 9 -42 -35 -2 -1 39 116 7 -96 -90 42 47 -12 -20 22 -69 -39 47 0 -70 -27 50 37 3 12 -63 -103 10 83 -20
3866b0m1R6j7m7N2k8j03O2J37l2o4k6L1o2P8M4j19j6J43mn2qPr3K6J89l6j50O1
$$ -20 -61 35 18 -29 23 -5 -108 -46 91 59 -5 -31 0 -62 16 60 -59 -75 68 64 12 4 11 -82 -56 133 97 -53 8
3895HN6o4J9K8o1n7O4P2m5mj0k2K7N1p7p9R6L7n7L5N7j34m5J68M9j45j2Q3p2k5
$$ 8 64 0 19 47 -14 -71 -7 65 20 16 6 -16 11 62 -15 -94 2 39 -18 17 74 -60 -105 63 112 -33 -45 38 -34 -59
3925e9J03k9q0QJ45o4q1K5j8MP4Q1q8n9O0j4k2L7k8m4N5J24p1j19P2K0q9R0O0
$$ -59 44 15 -65 -57 88 24 -57 -32 -50 -46 28 109 21 -38 22 8 -14 23 -5 -49 6 130 59 -60 12 32 -57 33 93
3954I3q2j29J55N9p8o1N3k6j9P6M6j00k9N8jLJ4j04PJ19Nq1oLn8J6J60l9j13l
$$ 93 11 -118 37 96 18 -43 10 -16 -35 41 87 -13 -42 16 15 18 32 -72 -65 54 59 -22 -28 -25 -83 -67 93 54 -59 -62
3984f2J17n7r2R3j0m8O7J35j06j90R4J13q0J6P6n9r9P5J05p6j40J41P3q7k7N9
$$ -62 55 -2 -94 -1 -11 -59 8 143 37 -153 -59 54 -26 -10 66 7 -92 -17 88 12 -128 13 86 -1 -28 31
4010C1k4p8L3J10M7j50k1J27L7q9r9P8N0p9L2R7o5j64J20J29j04j57J13J25j27
$$ 31 7 -71 -38 72 119 -31 -52 75 112 23 -76 2 52 -27 5 102 37 -127 -7 122 18 -139 -26 99 -28
4035b8NJ02n7j79Q6J44nj14M3J0k7K1Nn0KM1N1Pk2o5q4J19O8q4m8J08k3n8L4O1
$$ -28 -23 79 22 -157 -71 73 68 -46 -3 7 -20 1 6 -44 -42 -1 50 57 35 -30 -114 5 73 -11 -59 49 26 -32 2 63
4065F3j44k4J98lj50M3R6j06n1J60j2j54RK08n6j49J4J08o6m5J94k4j51qQ1K9
$$ 63 -81 -105 93 90 -60 -17 79 -27 -78 82 70 -84 -75 133 77 -72 -58 50 -16 -61 133 109 -42 -50 31 60
4091F0q1l8J7R9j2o7L3L9j22q9K55P5k55n9K80m9k43R4K11k40j04L33O7l10k9
$$ 60 -21 -59 -42 57 45 -22 11 50 -72 -161 94 169 -86 -145 135 86 -157 -63 148 -92 -196 137 204 -106 -135
4116a35K59r0j70J54J00j70j7J96l4j79N2L3J4M1Rq4j2J02r7j8J14o9j02J77J32
$$ -135 124 34 -136 18 118 -52 -69 127 93 -86 -34 -1 13 54 63 -21 -33 69 -28 -46 68 -1 -103 74 206
4141B06k67n9K01o0j71J79J67k82q7L31m7l10Q7K45j50r5J96N2k62KJ96k2j11
$$ 206 -61 -120 81 21 -150 29 196 -86 -173 158 111 -199 -112 133 -17 -112 84 136 -126 -124 72 50 -61
4164f1P1n4L7O5p2q8J10j2j29J65J84k66j73K76P9l19P8L33k09k17K93J70m08
$$ -61 10 -44 -7 58 -14 -102 8 -4 -133 32 216 -50 -223 53 132 -187 -109 224 15 -202 91 261 -147
4187a47q0L74k6k52J25J71k03m9J67J3k01LJ55K2k2np3k9O8l7K3Q5o3j77J97J30
$$ -147 -227 147 121 -131 -6 165 -38 -87 80 93 -108 -105 50 72 50 45 -28 -57 11 -26 -3 82 19 -158 39 169
4213A69k82o7K86l0k18J30J86k62j28K90P7k84J2K47q5j46J22O5k17L9J64L4j18
$$ 169 -113 -180 106 76 -142 -12 174 -88 -216 74 151 -133 -121 126 41 -105 17 82 -135 -96 68 102 -16
4236a6Pk1K7K8n3q0J26L3j09N0J84j57j97K00J31k12o3K55l2k32J48K06k74j47
$$ -16 -9 -30 -3 25 -28 -108 18 51 -58 -8 176 19 -178 22 153 -59 -122 133 101 -131 17 223 -51 -198
4260a98K62J10k26k4J59r1j03J18Q4j12m0J03K9l4q2m4L6Q6m3J7P1q5j33J74Q3
$$ -198 64 174 -52 -76 83 -8 -111 7 91 -21 -61 42 71 37 -45 -89 -53 33 -10 7 78 -7 -140 34 117
4285A17j96j02K35M4j79O9J36j66j43K36J17k23m8J70k1j50P4Q4r9l6J18R6j20
$$ 117 -79 -181 54 98 -81 -12 124 -42 -185 51 168 -55 -103 67 46 -104 -30 54 -45 -81 37 133 13
4308A3o6qR2L5r0k9P9M3j19N4Q4j24j34J90J07j36p1J55p0q0M7J17j30n5J39J07
$$ 13 -53 -61 31 66 -24 -53 26 69 -50 4 88 -36 -170 20 127 -9 -80 75 5 -75 -28 89 -41 -96 43 150
4334A50j66l9J5jK6RO0k6n1l1Q0J8j13n1J64K0r3k9J13j12q5J55J23j82n8J72
$$ 150 -16 -55 -40 -41 -15 -6 54 28 -23 -54 26 44 -69 -120 44 64 -29 -58 55 -57 -142 13 136 -46 -104 68
4360F8j7j13M7L6m6o9J58M0j21n6O1O0o6j3QL5Jl2Q8j1o2r6J18Q6j36k1J34k8
$$ 68 51 -62 -15 21 -25 -94 64 104 -17 -73 -12 48 -18 -31 -23 12 13 -19 69 58 -4 -100 18 104 -32 -53 81 53
4388E3j34Q7P2j75l6J67J08j42n2N1K4p7N6L5n0j6nM9N2j24n5J05O2o1oO2r3o3
$$ 53 -81 6 78 -97 -133 34 142 0 -52 -1 23 -54 2 37 -13 -29 -34 15 67 -57 -112 -7 55 -6 -12 50 -43 -106
4416a06J31Q9j38j06J63P1j45j4R8n5r6J25P8j06k5N6N5q0jj2j0J6N6L4m3k1o4
$$ -106 25 114 -24 -130 33 104 -41 -55 43 -12 -108 17 95 -11 -36 20 75 -5 -6 -18 -28 -12 44 78 35 14 -50
4443e0L4Q2o9m3O1M6n5k7P2p9r8J29J10j07q0P7jm9M8L6q2n2P5J00o7m0rK0N4
$$ -50 -16 66 -3 -46 15 61 6 -21 51 -28 -126 3 113 6 -74 3 2 -47 1 37 -45 -97 -22 78 11 -29 -38 -18 36
4472C6n5m8O1L2k9J4O1o7j35R9J52j12j02J19K1j41N4J38o8q7N4J20j28p6R0M
$$ 36 -19 -67 -6 26 -3 11 72 5 -130 -31 121 9 -93 26 47 -94 -40 98 30 -57 -3 117 -11 -87 3 7
4498Gl1O0N9p9o5K8N5l2m4LK1P7j0m5%J2p2K9J30o2j64R1J11o3n3R2p5r8J24P8
$$ 7 -24 36 95 16 -49 -21 34 2 -42 -39 -18 59 49 4 4 16 -56 -27 103 41 -123 -32 79 16 -37 55 -20 -118 6 84
4528H4q6r8R1J9o9N9K6n2oM9M5o9m7JJ0Q6M7j61P2K7o7k2J33k5j65P1J87j50j10
$$ 84 -2 -100 -9 10 -59 0 26 -26 -32 17 62 -7 -54 -53 -43 43 90 -71 1 28 -39 -61 72 47 -118 -47 140 -10 -120
4557a20R2J29j24j6J76p2j93R0J43r6p1N9J3k7M2mk9l6O9%pj4n4%Q5J2q1J8K6
$$ -120 -28 101 -23 -39 137 65 -128 -38 105 9 -62 -3 10 -17 25 21 -8 -44 25 25 18 4 -50 -50 35 47 -34 -16 10
4586A0q0lJ60o7j21L5J53j16p7J33qj26J41J30j50j69J36R6j08K9O9q7o5J16N
$$ 10 -70 -73 87 20 -101 -66 87 -29 -106 27 19 -107 34 164 14 -155 -19 77 -31 -2 67 -20 -85 31 36
4611C6m8qOK6NL4p2m8O9j7K2K5K5j20j4J84n3j55M6J52q9n9J02Pj44KJ68n7j44
$$ 36 -12 -20 -14 12 17 51 -21 -69 0 -17 5 30 55 -65 -79 105 52 -103 -57 95 6 -53 49 56 -88 -86 82 25 -119
4640a19O2R0j9oK6o7l7L6O2j0Nn9m2O8L7j03J0J26l1q3Q1L3j57L2J15K0j16O8
$$ -119 -57 33 14 8 34 -33 -70 -34 28 18 23 -36 -78 -10 27 -76 -66 60 29 -54 27 60 -97 -65 50 70 -46 22
4668B2K8p0LJ10j02r0Q5J12p3o1R9n0j00O2J10r6p4Q7N8n9J2j1o6J7P5k0J3lm2
$$ 22 50 -20 -17 93 -9 -99 -14 98 25 -36 63 13 -87 -25 85 -11 -85 2 60 1 13 2 -64 -47 28 8 21 18 -24
4697b4k3P6Nj11J1R9j2l3K4k6p0J9J29j7q8M3Mlk1N3q9MJ13K0q4kL1r1OR0oq4
$$ -24 -47 29 34 -77 -66 33 21 -12 12 -14 -84 -65 64 47 -41 2 6 3 -18 35 -54 -50 63 83 -1 -3 28 -63 -57 33 27 -57
4729e7N5N8m4o6M4kp9R8R6o2q9M8N7n4l8K7j1oP2Kn2n9L3J9J3L7nn1l1O1Mo2N
$$ -57 -2 56 12 -54 -10 -12 -91 7 103 41 -48 0 57 3 -35 -8 -19 -25 47 49 -3 -62 -29 -10 3 40 35 -16 -47 14 18 -44 -39
4762c9RK2N8rm9k7j8JK7O2m2l1O4K8o6n9J5K9rJ02J2j24rN3J1n2RP0o3M4K1m7
$$ -39 -30 -8 50 41 -8 -35 -53 -52 -25 37 -5 -36 28 56 -10 -69 -54 -25 -34 68 80 -44 -53 0 11 -41 -32 38 -25 19 40 -7
4794gp4L8P0j3k1O7m0m5M5N7q4p7J13J5n6N5L1j05p6R7P0n5k1N6n5pP0l8r2nQ9
$$ -7 -81 -43 27 14 -7 60 20 -25 20 77 -7 -84 29 44 -12 43 74 -31 -107 -10 60 5 -16 40 -15 -22 48 10 -82 -87 2
4825BM9l1l7l1K0qL1j3J9m1lR4Lj39l4J26J7m1J4P8q4p8J12M8j42l1J88l6r1N2
$$ 2 51 20 -17 -48 -28 -36 -5 -18 1 -40 -43 51 54 -85 -119 7 24 -17 -3 75 -9 -87 25 73 -69 -100 88 52 -39 13
4855A3M3j17jJ31Mj12N7K2o2N5k9k1k0N1K7k6j5k1j9J4M9Mn1J3O4l9n4N1m1m9
$$ 13 56 -61 -62 69 73 -39 18 40 -22 33 4 -17 -37 14 41 15 0 -21 -40 -26 23 27 -24 -11 53 14 -40 11 -30 -79
4885g9R4N8m4o9L8Mp4O8M6r8RP1J8p3l1L2M0J9Pj4oj8k4K5N0q7kO7P8j02l9Q2
$$ -79 15 73 29 -40 -2 2 -72 -4 42 -56 -47 24 42 -31 -62 -30 10 29 36 22 16 -2 -26 -1 49 -38 -40 27 105 3 -36 46
4917D6n3o6R2J09j41r7J55N5j23k9R1p6n7R2R0j23l7N7O9p1m7P9ojK5K3r1l0M6
$$ 46 -7 -73 19 128 -13 -110 45 100 -23 -52 39 -37 -94 -2 88 -35 -72 -15 54 -17 -64 15 9 8 33 56 -35 -65 -19
4946a9M4Rl2k9JK2k6K2L6o5K6O2J4q4l5K9M9m8M7L7p1KL7L5n9k9%L7K2l1K4n2
$$ -19 25 34 2 -27 -26 -4 -30 -8 28 -37 -11 51 65 -19 -54 -25 24 -24 23 60 -11 -9 28 63 4 -25 -25 12 34 3 27 -25
4978b5lQL9L3n9k8L8R6p1o2K3Oj4J5M1k5o4K5R3p2m0N1J9m8N4N7j04r2Q2P1l5
$$ -25 -28 -20 19 52 -7 -35 3 99 28 -34 -11 -5 -19 -4 37 12 -52 -27 66 -6 -46 5 24 -24 30 87 -17 -109 -27 44 9
5009Im4N5Mo6J6P6n9o4M8J10o0m5L6k5l2L4N3n1o1O0N9k7o3M7k9K2k7N7j2l7j9
$$ 9 -35 20 24 -42 -26 50 -9 -73 -25 85 25 -20 16 -9 -41 -7 46 -5 -66 -6 53 26 -37 10 -19 3 -24 33 21 -16 -35
5040c5M0N2o1j7K2N8rl0K7j06K0Q4K9m7j4qqn9N6K2o5M5N6Kn7%m9PL4P1r6j2L0
$$ -35 5 57 -4 -21 1 59 50 20 47 -59 -39 45 74 27 13 5 -3 -62 -6 16 -49 -4 52 54 -3 -3 -52 -45 -11 60 -36 -48 -18
5073a8K6k9M8k0m8JJ27l3r8K4O5o9J3O3jj27Q1N2k0o7K6K5l3%K9j2n5L0N4j1n4
$$ -18 8 -21 27 7 -41 -40 87 54 -44 -20 45 -24 -11 52 51 -76 5 57 37 -30 -4 21 -12 -12 17 5 -50 -20 34 23 -31
5104c1J3L1J8k1jpj8mM1M9n1p3O3J7l3m2M6j8p4J23O7j36m0K2J29j24N1M2o9o7
$$ -31 -18 13 31 10 9 2 -16 -20 21 70 19 -54 9 26 -7 -49 -3 -21 -95 28 95 -41 -81 -59 70 -54 -3 39 -30 -97
5134i7Q9O8j05l5P1j2J1J7L2m8l7L4J9m5OM4rL4j9l5k3O7k3RL9l9m8M4P7q8k6
$$ -97 -8 60 -45 -80 -9 -21 -10 7 39 -9 -46 -12 7 -38 -32 12 3 37 18 -17 -40 27 4 13 52 13 -35 9 86 -2 -28
5165b8N1j2l3M1M9j14l2R0M1p5K0Mk5kO8nq7j1M7K4J9Np0K4L5m1j6OL1l9K9P1
$$ -28 23 11 -22 19 68 -46 -78 12 53 -22 -2 2 -23 -25 43 38 -49 -60 -13 11 30 35 -35 -11 24 -17 -33 -27 4 -35 -6 65
5197F5k0j43P0R0m9l7O1n6k8Q0L7r0o8R4K5n3M3K0p2kP9j2m7j2%K8K1Jm8J1L6
$$ 65 45 -98 -28 62 13 -24 37 -19 -47 33 70 -20 -88 6 31 -22 21 41 -31 -33 46 34 -13 -25 -25 3 24 25 -23 -12 24
5228B4j4K6ml9o2M6Q1o4m1P3Oq3R0K5j10m2J23K3j01l2J17j0r3Q9J7j18RP4J6
$$ 24 10 36 32 -7 -69 -23 58 -6 -47 26 32 -51 39 64 -46 -88 35 58 -43 -75 42 32 -61 28 45 -73 -64 10 26
5257B6k0m7K8NlKk2J9L6o9O9Nj9j01R1Q0q3j5O8k8q0P4N7j01o4J43L6j12J3M6
$$ 26 6 -41 -13 -8 -11 -9 -31 -12 24 -45 24 29 10 -91 0 80 -3 -18 50 22 -58 16 73 -28 -92 51 87 -25 -12 34
5287C4p2k5J33Qj13m0J07ln1LL2k8K7j8J5Jl9l7Q1K6q9j1M4J5o0L4P6q8m5J35
$$ 34 -38 -63 70 78 -35 -75 32 29 -22 -19 13 -15 12 -6 9 10 -29 -66 15 41 -48 -59 -15 0 -60 -26 50 -38 -83 52
5317E2M8j46J8O8l6o2Q6M9j10j5N8M3o6j3K7P%J7pm1J0J9K0%m4j9M0O8m6j3J1
$$ 52 100 -46 -28 40 4 -58 28 77 -33 -48 10 53 -13 -26 1 8 8 25 18 -23 -13 6 26 26 -18 -37 3 71 25 12 23
5348B3j5k2K3M8q2m0R4J2m2OJ6l1j0L5J9p0k4N9J7Mk8k3K8mKL5n2mk8R7J5m8n4
$$ 23 8 -14 9 57 -25 -65 29 41 -1 5 21 -10 -20 15 34 -36 -60 -1 16 20 -8 -31 -3 -7 -5 30 -22 -26 -54 43 58 10 -44
5381d4N4Qo0L9N7o9j0L0O8n5r4R9J2k2k4L8l4k7L1K8J5q2J3P0j2n0QM3p1K1Q1
$$ -44 10 18 -42 -3 54 -15 -25 5 73 18 -76 23 35 13 -11 27 -7 -34 -3 25 40 -42 -29 41 29 -21 -13 30 -41 -20 61
5412F1m6q5O4M9jj7j2J0m8J3O4n1m3QJ3PN1o3OnKK4J2m4jK5M6j6m5j6N1j0k6N0
$$ 61 15 -70 -6 43 42 25 13 23 -25 -12 52 1 -42 -34 -21 -14 37 -26 -20 -25 -23 1 13 -31 -32 -7 39 23 -22 -38 13 3 -23 27
5446B7mp3L2Q5m9n5J2M7j8KqQo8O1M0j8j7Jk9lQ8l9l7J6K0l7N4K8p8j4N8jl0k3
$$ 27 23 -50 -18 67 18 -37 -25 22 4 6 -2 6 -62 -1 39 21 4 5 -24 -27 61 22 -15 1 21 -16 38 66 -12 -26 32 31 1 -22
5480b2M7k8l6Q9m3p2J5P6K1o0M0m2p1P8O1o8JqN4k8K8qn8K3P1l3k1J8l9k2P3j1
$$ -22 25 -3 -39 50 7 -65 -50 26 47 -13 27 -15 -86 -8 53 -15 -14 -22 32 4 32 24 -34 -11 60 27 6 24 -15 -37 36 25
5512B5n2k7J06l9l4Q3l7p1J5R4k5o6M1K3o6L2O0n6o1P0L7n6m6O2j7l5R1m3k7k6
$$ 25 -27 -54 52 13 -21 62 25 -46 -31 63 38 -28 13 36 -30 2 62 6 -55 15 52 -4 -50 12 -5 -40 51 8 -19 -45
5542d5L6K9oK1o0k7N6K9n2OJ2k0qL4J5p7L2M4k9qK6j1n3M1N5n5k3L0L8k1Rqm3
$$ -45 -9 20 14 35 -25 -52 4 33 -19 -13 -1 -21 -29 5 20 -57 -25 19 -10 -18 8 -3 -56 -15 40 -15 -38 -8 30 9 18 10 -33
5575c3L3L3Ko3K4Qk4L7J0m6kN8j0j7j3M2o2J5Q7o3n5L3j4J2K7pk3o4P2L3m8j0
$$ -33 0 33 35 -28 -4 4 -20 17 27 -19 -21 37 27 10 -3 39 -23 -8 79 16 -39 -6 -20 -8 19 12 -11 -75 -3 30 -18 -28
5607b8NRj9L9J9q4N1K1mMjk4l2L3M3m6m1N9qmK9No4oL3L7l1k3PL2pK5m9kK2M2
$$ -28 -23 -14 -33 6 25 -59 -8 13 9 13 12 -12 -44 -11 32 -14 -55 4 -4 -8 21 26 -38 -44 -11 26 -5 -28 -21 11 4 29 -20 -22 0 42
5643D2l5%q%j1L9Ql2l6M3J5%J4m4l8pQ1j3rl9jRN8n0j2jK7K5j3j7m2jM2K1j0l8
$$ 42 7 7 -1 -1 -12 27 35 3 -33 10 25 25 39 -5 -43 -50 31 18 9 -30 -31 -22 36 -14 -26 -27 0 25 12 -5 -47 -48 -6 15 5 -33
5679c3ML1%Rll9L2jOj6mqJ7M7ml4j9jL1kJ5nl2j4O0j9lk2qL5J7kk7Jj8P7n2K8
$$ -33 -29 2 2 11 8 -31 1 0 6 -10 -14 -22 -5 42 38 4 -15 -16 15 13 28 23 -9 -23 37 18 15 -7 -15 20 37 35 8 9 -9 68 16 44
5717D4ml6KJ1j2JK6Ll4M5m4j0k8O1k5k2K1Ml3L1K7j8n4K3RJ4j5k4J5K6j8M7Pn4
$$ 44 40 4 6 17 5 6 32 35 1 46 2 -8 -36 25 0 -22 -1 3 -30 1 28 10 -44 -21 -12 2 -13 -37 -22 4 -14 33 40 -14
5751a4NJ2J3K1j7m6M5k0K1L9n6m0K9M7%n0nJ7k5L8J2l2l3L8L3k5%m4K7K7j0j5
$$ -14 -9 3 16 37 20 -26 19 -1 20 59 3 -37 -8 39 39 -11 -16 1 -24 14 26 -6 -39 -1 32 7 7 -37 -10 17 7 -8
5783hpK2J0rLj9j3mJ2MLpJ8k0LN0n6n7M1N3%k4%Rl7J4O7p3l3L5M1J4j9k7k1J6
$$ -8 -15 7 17 8 11 -8 -21 -25 -13 -9 -6 -13 5 -15 -12 38 -18 -75 -34 19 19 -5 -5 4 -33 -19 48 -25 -58 -23 18 32 13 -14 -35 -19
5819a9L6KMk9NK8K9J0r0LJ7jPJ6ll3m6J01no3J3Pk2JK7Pl8J3N8oj5m9lJ0N1k2
$$ -19 17 19 23 -6 -1 27 56 66 -24 -21 -4 -5 2 18 15 -18 -64 37 32 -31 -18 -11 -33 -32 -5 2 -36 -23 35 29 14 -35 -38 -28 23 1
5855AJ0o0N1j3K4m2pJ0K4J0l3M0k8Kj3P8l6o1L1Q7l3p6L6Nk8M8j2Ll2J9Pj1kK7
$$ 1 11 -49 2 -11 13 -29 -36 -26 -2 8 -25 15 -13 -11 -24 54 18 -43 -12 75 42 -34 2 7 -21 27 15 18 -14 5 12 1 -1 26
5889B6j3o0P0k3Qj3k8j3P5pm6K7L7m0k7N5rn6OR1k4o5LO7p3ML4j8k3J9O8n9k1
$$ 26 13 -47 23 0 8 -5 -33 -46 29 22 -24 3 40 0 -27 28 19 -37 -31 60 36 -29 -26 41 -32 -28 6 -12 -35 -16 52 -7 -28
5922b8J4j2K6J3j2J2Lk5KL2j6m7K0M5J6p7M2Rl7oN4j5n0L7M0l7j4L7j1m8L5O0
$$ -28 -14 -26 0 13 1 13 16 -9 -7 25 9 -38 -18 27 43 -34 8 17 -20 -26 28 13 -37 0 40 3 -11 26 15 -33 2 62
5954F2l6p1L8K7j7k7PK9joJ1j6k8J1J7L9j6q4K8K9k4QJ8J8o4M4N8k2r3N1L6n5
$$ 62 26 -45 -7 20 3 -24 -17 12 11 5 16 0 -28 -17 0 39 23 -61 -33 -4 -28 -20 -2 16 -48 -4 54 32 -61 -10 26 -29
5986b9QL6ro1M7M4m0m4L0K7LJ5ln4K5J5qL0k1l0L2L0l8m5K4J6j4J0K9Lp5J0J00
$$ -29 -21 15 6 -55 -8 36 -4 -48 -18 9 12 27 24 -30 -5 10 2 32 11 -19 13 43 5 -40 -16 0 -14 -4 25 28 -47 -37 63
6019F3m7o1M9M5o5%N7l4o1L4O1rn9L1rnK2qrm6J7M8K0m6j3K4j9K4L0kk3m0P1l
$$ 63 16 -45 4 49 -16 -16 41 7 -54 -20 41 32 -27 4 -5 -10 12 4 -5 -51 -34 14 34 -12 -25 -1 -20 4 34 32 9 -31 40 37
6053C7l3k0QM8k9kM1k8o5J8R3l9q1O7L1k9l0M8qo4M5K6j4o4M5L7j9l7J4oJ5%k
$$ 37 4 -16 -8 40 11 9 50 22 -43 -25 68 29 -52 15 46 17 -13 35 27 -37 8 34 20 -44 1 38 19 -18 -4 -10 5 5 3
6086CNl2koL8Lj2m9O7j4j5rJ1j0pJ6K4k0j3J5j3lqM8m5k7R6k2k6k3N5K0l3NPj6
$$ 3 8 -24 -26 -32 6 9 -3 -52 15 1 -14 -23 -12 -22 -29 -13 11 -9 -22 -7 -20 -23 -31 17 -28 -55 41 19 -7 -30 25 45 12 17 24 8
6122Hk1PJ1K6j7k4M2j6j6J2K8p3J6L0Qo4j0Q7l6j1k4R6q0L4L8jq8j5P2j1j8J5
$$ 8 -13 -6 5 31 14 -10 32 16 0 12 40 -33 -17 13 21 -43 -53 34 -2 -13 -37 59 -21 13 51 50 -38 -53 19 8 -10 5
6154Ek6m2M1O1m3k1LPK4%k3jK4k8M5l6nj9M7rN3j05K3M7m4K3M8o3l8Q0J3l2nR
$$ 5 -21 -63 -22 39 -4 -25 -22 -15 9 9 -14 -15 9 -19 26 -10 -15 -34 13 4 57 -48 -25 22 -22 1 49 -14 -52 28 41 9 4 13
6188A3Ll4L8O4q7k8L8mlj6M0n5K0L2n7LL4k6J7M5m0J7n2L6k5K8qJ0j9K9Lmn5j
$$ 13 16 -18 20 84 -3 -31 7 3 0 -16 24 -31 -11 21 -36 -33 1 -25 -8 37 -3 14 -38 -2 -27 1 -7 3 -16 13 16 12 -43 -44
6222d4N0J5prl0J5j%Qj7j1M6K3m6J9k2kJ0J0J5J8l2rM0j3m7J5kJK6mj9n5N1L4
$$ -44 6 21 14 5 -25 -10 -11 -11 -3 -20 -31 15 38 -8 11 -11 -13 -3 7 22 40 8 -1 39 26 -21 -6 -8 -7 19 15 -4 -59 -8 26
6257B6Ok8J1L6n8qN0o0k0K4M4qk4k0J8j3J2Lnk2l1P8j5k7NK4j5MK5kl2J4K0Oo2
$$ 26 32 4 15 51 -7 -15 35 -25 -45 -21 23 15 -9 -29 -11 -24 -12 -9 -14 -36 -67 11 -4 -31 -26 -2 -17 -13 12 10 -22 -8 12 18 -44
6292d4nK9L9l1K1j4J4j0j2K5MprK3rl1ONKK9mJ1n9j4N5kj7k1K5nJ2K3k6n2PN6
$$ -44 -49 -20 19 -12 9 -5 9 -1 -13 12 16 9 0 23 14 -17 -11 -6 -4 25 21 32 -27 -41 14 12 -5 -26 -1 -6 6 29 3 -49 -42 14
6328A4Ml3j5L7k5K2mLl5j7L7K0k4J8k5J8Ql4K6Pk6pO6m4k1j4O7k3lK2k4j4MN1
$$ 14 18 -15 -30 7 -18 4 0 3 -32 -49 -12 8 -16 2 -23 -5 3 -31 -5 2 -24 -31 35 -9 -30 -44 23 0 -3 19 -5 -19 -15 36
6362C6k5k8j2PK5qK3m6lM7k2K1l2L2J1n8L9K6o8J1L3k1lj2%%L5K1m6jLKJ8l7J7
$$ 36 11 -17 -29 -22 3 -5 18 -28 -31 16 -6 15 -17 15 26 -32 7 33 -35 -24 9 -12 -15 -27 -27 -27 8 29 -17 -18 -15 -13 5 -32 -15
6397a5k0J1O5n1j1K9k7K4l4O6l0k5J5jnL9l0k0P2l9j7M8o5L1j8K1K7m6m8L0Q1
$$ -15 -35 -24 41 -10 -21 8 -19 5 -29 37 7 -18 -3 -4 -9 30 0 -20 52 13 -4 44 -21 10 -8 13 40 -6 -54 -24 57
6428E7o9J2L8m8l2O1K1m6J3K2Jk8oRo2M3L9mm4OK0l3K5kk2kO1l5oRrj1K1k1k3
$$ 57 -12 0 38 -10 -42 19 40 -6 7 29 30 2 -4 5 -57 -14 25 21 -23 -17 3 -30 -5 -7 -29 -31 30 -5 -11 -2 -11 -22 -1 -22 -45
6463d5L6J4Kk8L1Ln1KO1op3M8L6m1rM4%m8K4N3k4k9J8qk0L1J3k0l4lP1p2P8p1
$$ -45 -9 5 7 -21 10 13 -38 -36 25 19 -54 -6 30 -11 -20 24 24 -24 0 53 29 0 18 10 -10 21 34 14 -20 -23 48 -24 54 -17
6497a7lL0K7m1j0K5o9M1N0j3o8L5O5n5l7N5lm0J9M7n1k5L1jKk6K2LKNL9l6j9K0
$$ -17 -20 10 37 -4 -14 11 -58 -17 33 20 -48 -13 52 -3 -40 15 12 -28 -9 38 -13 -38 -7 -8 -6 -32 -10 -7 -5 0 39 3 -16 4
6531Dol1M0k8k9N0j0OjJ8n6K3L4J3n7L3J6k8J8J8j3n8K4O4pl3j5J1k8N2Pm3k9
$$ 4 -2 -33 7 -21 -50 0 -10 -4 -5 13 -43 -20 14 27 -30 3 19 -9 9 27 14 -44 -20 44 37 4 -11 0 -28 24 31 -12 -41
6564d1M3j9KJ6l4jL3L1m0J1J7rm8M9K2o4KN1j9k3j6M9k9PK6j0j0Pkj1K9Rm8oN1
$$ -41 2 -17 -15 1 -33 -34 -1 30 -10 1 18 9 -39 10 32 -32 -30 21 2 -21 -37 12 -17 -10 16 6 -4 3 1 -10 19 28 -20 -26 25
6599B5Nj9j4mK6k1J6k9J5Kj1j2L9K0n2j9O0ml9L1J4n3N3k5j3%J7Rj0m2RlJ3J9
$$ 25 30 11 -3 -7 19 -2 14 -15 0 2 -9 -21 18 38 -14 -33 27 23 -16 15 29 -24 29 4 -9 -9 8 17 7 -35 -26 -29 -16 3
6633CJ2k3j5J8Jj6J2k4LL2k0j8K6jNk0M3J4o8KN1k1nmjpJ3K3l3J4J7j2NK7k2O
$$ 3 15 -8 -23 -5 -4 -20 -8 -32 -29 3 -17 -35 -9 -10 -5 -25 18 32 -36 -34 17 -4 -9 -13 -14 -21 -8 15 -18 -4 13 1 6 33 11 17
6669A7k6RK2MLo0K2P0m3k6pM4k2j3K6l4J1k7K8J0j9k2K5jPk7K1kKm%Qk0k2N3J4
$$ 17 -9 0 22 26 29 -31 -9 61 18 -8 -15 29 7 -6 20 -14 -3 -30 -2 8 -11 -33 -8 -9 -2 -29 -8 -10 -8 -12 -12 -4 -24 -46 7 21
6705B1m7RK7l6K9L1m0j0qNPmM2l2JL9nm6k%K9Mk2J9m3L3j6M9k2Nj5k1J5ml5L4
$$ 21 -26 -17 10 -26 3 34 -6 -16 -24 -19 -12 -16 26 -6 -5 34 29 -17 -19 -19 10 14 -8 11 -32 1 -15 34 12 17 2 -19 -4 -8 -43 -9
6741iJ8K2l9okk1L5L2k9j1lJ7j6RJk4j6M2jj7J0J4k4RL4k8k3L0j5J3j1Om2K2K8
$$ -9 9 31 -8 -14 -16 -37 -2 30 1 -10 -13 4 -12 -3 -2 -26 -42 0 -1 -18 -8 6 -18 -9 25 -3 -26 4 -11 2 -9 -3 -45 -23 5
6776EO%oK7l8j0K4Pn4M2MnJ4k4k2lL6kj9K4j7k3L8Qn0L6PK1l5j9L9k5j2L5j5m
$$ 5 11 11 5 32 -6 -16 8 15 -39 3 7 2 16 -8 -30 -33 3 1 -18 6 -11 -34 4 12 -38 -2 5 26 -9 -28 11 -14 -26 9 -6 -10
6812a0J3K7j2l9L7k9k8K1L6pl3J2qJ3k8K1k0oNM9nl7mK8PKnj3K5k2J5J0rk2K4
$$ -10 3 30 18 -21 16 -13 -41 -20 16 9 -24 -12 -20 -7 -35 -14 -34 -40 -35 14 9 -28 -32 -4 3 5 0 -13 12 -10 5 15 6 -16 8
6847HQOk7OJ8j9kK3Lj2kJ8j3j6J3j2QMk5Rj3%oJ3J2Jn5K9mJ9oK5l0rM1k0k6J9
$$ 8 16 22 -5 1 19 0 -2 21 24 12 10 28 15 -1 12 0 8 12 -13 -4 -17 -17 -23 -10 2 3 -52 -23 -27 -8 -14 11 -19 -28 13 -7 -33 -14
6885a4Rj1LJ2j4j8K2JJ7kk5RJ6J7Pl8kJ8K8n7L0jJ7l0K0K0k7J5j0j0Jj2Lk%J8
$$ -14 -5 -16 -13 -1 -15 -33 -11 -10 7 5 -20 -11 5 22 29 -9 -11 7 35 -22 8 7 24 -6 14 34 7 22 12 2 3 -9 -6 -8 -8 10
6921A0oj7K9l2M6Mm3J1j9K3L7n3rK8ok4K4j9oJ7k2L4j4jk0L8m9M3qj6J9K0MNk8
$$ 10 4 -13 16 -16 30 34 -9 2 -17 6 43 -10 -19 9 3 -21 3 -16 -22 -5 -27 7 -7 -8 -28 10 -39 4 -4 -20 -1 19 23 28 0
6956@%LJ9j4l4L0jj1JK4l3LL1ll3K5njOQk0j3jL4l0O4o0k2L6j9nL7l0j4M2j7l0
$$ 0 0 3 22 8 -26 4 3 -8 -7 17 -16 -13 18 15 -18 7 2 1 7 15 -5 -18 -19 15 -15 49 -11 -33 3 -16 -21 16 -14 -28 14 -3 -33
6993c3k3M8k8K8jkK4m5nPK4mj8LQK2MOl5K3rJK5j5l5L9m1K7qj1L7Jl9J7J0MJ1
$$ -33 -56 -8 -36 -8 -9 -11 13 -32 -37 -30 -6 -10 -28 -25 -17 5 9 15 -20 3 -6 -5 20 5 -30 9 -32 -5 -13 -24 13 14 -25 -8 2 6 17
7030A7j2J9l2lJ6k0K2kl9L2PJ9n7K9j1J0OK3nm9qM8Nk8Ol1L6j4J2pj6J2Ojk4N
$$ 17 5 24 -8 -11 5 -15 7 5 -34 -2 5 24 -33 -4 -15 -5 1 24 19 -30 -38 10 15 -13 -7 -38 -2 -16 -4 -11 -27 -15 -9 -10 -34 -29
7066b9RJ0m6M4J0k4k7N7K0k0%%j0K4k4rJ8j1J5K5Kn1LQN1rl9J1j0J4kk1L5jn0
$$ -29 -20 -10 -56 -12 -2 -26 -53 4 24 4 4 4 -6 18 -6 -15 3 -8 7 32 34 -17 -14 -6 45 36 -3 8 -2 12 10 -11 24 23 -27
7101b7O2k5k1J9j2QK2k5J6j9k0K1k4M8p3L9K3Lm0M0k7nj9K3Pj9J9j4J6K4J4j9
$$ -27 35 10 -11 8 -4 4 26 1 17 -2 -22 -1 -25 23 -50 -11 12 15 -25 15 -12 -17 -36 -13 -6 -25 -6 -20 -4 20 34 15
7133A5j9PJ6m1JK6lk7J4j1J3PL9Ln4j8J6J6LpJp%L1l7K8mm2J0M5k4j3mPK2mJ2
$$ 15 -4 3 19 -22 -21 5 2 -25 -11 -22 -9 -2 37 40 -14 -32 -16 0 3 -4 -3 -10 -10 21 -16 12 8 -34 -24 21 -3 -16 -20 -13 9 5 17
7170A7l5MLJ0rL0j3m5K9J7J4k3JplLKj9L1m8L4j4K6k9qN6k1J1J2k7j0J8j7L1k3
$$ 17 -18 -14 -11 -1 -10 20 7 -38 -9 8 22 -1 0 -7 -10 -7 -5 -24 7 -41 -7 -21 5 -24 -32 24 3 14 26 -1 -11 7 -10 21 -2
7205bk5L8j0lJJ9k0LJ5Ol5J5nN5n1l0K8K0pJ1Mj5j3j3K5j4J2nk0K1roOj2Mj6K3
$$ -2 -27 11 1 -2 -1 18 -2 1 16 22 -13 2 -3 52 1 -29 -1 19 12 23 27 12 -1 -14 11 -3 9 4 -16 5 -4 -10 -4 -16 -12 -28 -5
7242ej5Rj2K2J7l6RJ8l6M0nK2n3J5K0nKk2K4K1j9mj8K2j5J8J7j1j4K0k3lK2L7
$$ -5 -20 -11 -23 -1 16 -20 -11 7 -29 11 6 28 -25 -10 10 5 7 -15 9 30 11 7 -11 11 -4 14 31 20 6 26 3 0 22 59
7276E9o0llL2mk8JJ7J3j4j5k4M0k9J6K5rm0QK9qj2j4NK2jmk2l5K8KM6k7oJ2pJ
$$ 59 -1 -4 -7 25 21 -7 -6 11 24 10 -5 -29 11 -18 -2 23 14 -26 -18 11 3 -9 -23 -18 4 3 -1 -23 -58 -30 -28 18 -9 -15 -3 -10 -9
7313i%QK0j7l0O6l2j5K9Lj1OQp8M5MK1l8L9k5J7K3j8nj6J4j2JkJ0j4J6pJ4k8o
$$ -9 -9 -1 19 2 -28 38 6 -9 20 23 12 18 26 -52 -7 -3 18 -20 19 -6 11 34 16 11 -5 9 -3 -2 -4 6 -8 8 1 15 -13 -19
7349a9K2k6rL0OJk9K7j0j6OK0j4k2L2Mk2RJ2Jk3J5k7K3J5Jj4L5k9oL4k7J1k3O0
$$ -19 3 -23 -32 -2 4 5 -24 3 -7 -23 -17 3 -11 -33 -1 3 -19 -10 2 3 -20 -5 -32 -9 6 7 -7 28 -1 -7 27 0 11 -12 48
7384D8l2l0L2jMl0RK9m4qO1m1NL2m2pL3L1p7J6K9j5KL5l5l7K7K7l3LJ1k7QkJ1
$$ 48 16 -14 18 17 21 -9 0 29 -15 -23 38 -3 2 34 -8 -15 18 49 -28 -12 17 2 4 39 4 -33 -6 21 -12 -9 2 -25 -17 -19 -8
7419hMk6J1PKJ0Mk7L7qj0k2NK5m0QN2m3Pj5N5n3oJ4J2K8j8J4k0j7k0J5K5K1m6
$$ -8 -4 -30 -19 -12 -10 0 4 -23 14 6 -4 -26 -21 4 -36 -28 24 -19 -12 -27 28 -25 -31 -17 -5 23 5 19 -1 -18 -38 -23 2 23 -23
7454b3J9M3m4j1JJ0j9M2lj7onM6j4Pl6Oj4mM5m5Mj9N4rK2k5J4j5pk2J0rMKK8l
$$ -23 -4 39 -5 -16 -15 -5 -24 18 15 -2 -8 -13 33 19 26 -10 -4 -18 -22 23 -22 -18 -37 17 8 30 5 19 4 -3 -25 -15 -24 -20 -18 10 7
7491Gk0K5j4k8J9rK4j9J6K8l3OpK8k1j2N3o5K8j6J9orJ7mJ4l5NMJKJ3J0Qn4L1
$$ 7 -13 12 -2 -30 -11 -20 4 -15 1 29 -4 2 -5 23 2 -10 43 -22 6 -10 9 3 -6 11 7 21 -14 -9 -5 -4 -2 11 21 29 -25 6
7527FJ6j5k1Mj3NK4pJkJ8l3J9l7kL4Okj5qJ2k4KK3k2J3j5J3J2mJ5k4MNJJ4j4R
$$ 6 22 7 -14 -10 -23 -18 6 -1 0 -2 16 -17 2 -35 -37 -3 3 1 -14 -22 -10 -34 -32 -9 -31 -18 -33 -20 -8 -12 3 -21 -17 -12 -11 3 -11 -2
7565bK8k3k9K8RoJ6KMok7MK8pj4j3J7rMJ5l3oK1K6n3K3J0jnl8M7k8k1L8K5l6j6
$$ -2 26 3 -26 2 11 5 21 23 27 21 -6 -2 26 19 5 -8 9 0 4 19 -14 -20 1 27 -26 -3 7 6 1 -37 10 -18 -39 -1 24 -12 -28
7602b8J7K2l1J0J4j3j3j1lL5k0j5J9J5qPj2kJ9k8J1K8l4J2kJ6pLomrN2nn6K6k2
$$ -28 -11 11 -20 -10 4 -9 -22 -33 -36 -1 -21 -36 -17 -2 -10 -3 -15 -17 2 -26 -15 13 -21 -9 -11 5 -2 1 -5 -9 -18 34 29 -27 -1 -23
7638b3M3o3N8j9j2L9j8k3JK4Qj8K3k2o2P6k5K6Pl5m0K9J8mj5L1k4Pj4K5k0J0k4
$$ -23 20 -43 15 -4 -16 23 5 -18 -17 7 15 -3 20 -2 -64 12 -13 13 20 -15 -55 -26 -8 -12 -27 4 -20 -13 -27 -2 -22 -12 -36
7671c6L2k1NJ5J9j5J9j0l2PjL0k8M0j3kJ3nj3k8L4n2M9J4j9j6jK7rLkQk3K1j5
$$ -36 -4 -25 -20 -5 14 -1 18 8 -24 -17 -18 12 -16 24 11 9 22 17 4 -24 10 -42 7 21 2 -14 -15 12 3 6 4 12 -11 10 -5
7706eqQLlnJ0%OqLnKj7Ol6L9K0l2nQj9L7l5RoJ8jJ8k1L5J6m8K7j6Knj3L0Jl0M8
$$ -5 -13 -5 -2 -5 -10 0 0 6 -2 1 -4 -2 -19 -13 -49 -10 10 -22 -27 -19 -38 -1 -36 -27 -33 -15 -16 2 -19 16 32 -16 11 -5 -3 -8 -21 9 10 -20 28
7747B8l2j1J9nJ1j8K2qQkJ3l6lK4rl2K5J7kJ0j1n5J9L8Jm5L8Ln3K2J6J4ql4L0
$$ 28 -4 -15 4 -1 10 -8 14 6 14 12 25 -11 -14 10 1 -31 -6 11 9 19 8 -47 -28 10 11 -34 4 7 -46 -24 -8 6 -2 -36 -6
7782fJPJ4m7j2M6J4l5K1oj4K2Oj5m0K7L6l8J8J2JpLk4J2J1J8j4l8L9l8K6j7L7
$$ -6 -5 2 16 -31 -43 3 17 -18 3 -3 -17 5 11 -4 -44 -17 19 -19 -1 11 12 5 8 -16 -4 7 25 11 -27 12 -26 0 -17 20
7816B0lmj2kkrJ4l0pP3m3J9j9jOj4M0l3k1K3jl6L8K3k4j1kL4j9oj5J7m2N5k1K1
$$ 20 17 13 1 -1 -3 -12 2 -28 -35 38 -5 14 -5 -6 0 -14 26 -7 -28 -5 -6 -42 -4 19 -5 -16 -18 16 -3 -9 -24 -7 -49 6 -15 6
7852Fj5J2j0oJ4qk4LN9l1K9Ql5j7M1l8mJ3M0n4J9K6k5J6Jj1k6N5k8mj6J5J0j8
$$ 6 -9 3 -7 -13 1 -7 -31 -28 31 0 29 37 2 -15 26 -12 -16 -3 37 -17 2 28 3 19 20 9 -17 38 10 6 -10 5 15 -3
7886cKRj1K9Mn7K3j0J9k8K0JLrJ0k3mK7npK1k0M9m9mK5m2OJ0J8k4L5l4rN2j9j
$$ -3 -1 8 -3 26 30 -27 -4 -14 5 -23 -3 -2 1 -8 2 -21 -25 2 -3 -10 11 -9 40 -9 -13 12 -30 -24 -14 4 -20 15 -19 -28 24 5 4
7923Djj5%J5J3%j4j6N1j0l1K0Mj5JJ6J0l3J6j1J5JoJ5l2J1rJ9l1K2KQj8k9JM4
$$ 4 3 -12 -12 3 16 16 2 -14 37 27 -4 16 20 5 6 22 32 -1 15 4 19 20 14 29 -3 8 -1 18 -13 9 11 19 1 -28 -27 17
7959A7Nmn0K8kj1K2L0l7j2lJ6j7J7JqmL2n1KM0pj2LK6k2jK0j2KPj2j7K8nj8K9
$$ 17 22 18 -32 -4 -6 -17 5 35 -2 -14 -17 -1 -18 -1 0 -8 -12 20 -31 -29 11 4 -8 -5 21 -1 -2 18 6 8 15 3 -14 14 9 -9 20
7996B0ll5JK4J7l2K4%Lll0J4k0M2m2J8QkqPj7L4l3j6N1k6lNQl1J9Nl2L8j8L7j8
$$ 20 17 -18 -17 7 24 -8 16 16 19 16 -14 0 -20 22 -20 -2 6 4 -4 3 -14 20 -13 -29 22 -4 -7 -2 6 -25 -6 -1 -33 5 -13 24 6
8033Fj9k2L2Mm%k6K8J4j8K9j6rOj0OJ5Jj1k0K6j1k3L6J8k6mJ0J6k7kj4J9j4K6
$$ 6 -13 -35 -3 1 -3 -3 -29 -1 13 -5 24 8 -1 5 -5 1 16 17 6 -14 12 1 -22 14 32 6 2 12 28 1 -1 -15 4 -10 16
8068A6j3Mk1RqNJ4K0n2L7Ol3pJ8J3mk5K6k3MJ6k4kM3m0L2n1MM5kKk4M5m4J4j0
$$ 16 3 7 -14 -5 -13 -8 6 26 -26 11 17 -16 -23 -5 8 4 -21 5 -18 -14 2 -22 -24 19 -21 11 -40 -36 9 7 9 -15 30 -14 0 -10
8104a0K9k7%j8O2k9rL3l0%kL2l4rJ4M1k9l4K1j7NQqJ8k0rK7J4j6j3j5J3pL5n1
$$ -10 19 -8 -8 -26 36 7 -2 31 1 1 -1 31 -3 -12 2 43 14 -20 1 -16 -11 -3 -11 7 -13 -22 5 19 3 -10 -25 -12 -19 16 -35
8139c5kL4J0jj8j9J6MjJ5Jjm3N0L3m2j8nK5qNl6K3j4J1MJk7K7K3r%JqNpJ8Pk0
$$ -35 -37 -3 7 6 -12 -31 -15 -11 -12 3 4 3 -40 10 43 1 -17 -22 3 -5 0 -36 -13 -27 -16 -12 -11 -38 -11 12 3 3 4 -4 1 -6 12 19 -1
8178aJ3RJ2mk9L3l4J9k4M0l0Oj4
$$ -1 12 21 33 29 0 33 -1 18 -6 34 4 10 -4
8191d
$$ Imaginary data points
##PAGE= N=2
##DATA TABLE= (X++(I..I)), XYDATA
0@%%%%%%%%Qj6J6j6K4l2M0m8N6o6P5r0J06j26J49j72J97k26K58k94L34l78M28
$$ 0 0 0 0 0 0 0 0 0 8 -8 8 -8 16 -16 24 -24 32 -34 41 -49 57 -69 80 -92 105 -121 137 -157 177 -201 227
31B27m84N44o09O80p57Q45r41J045j158J282j421J574j742J928k135K369k636
$$ 227 -257 287 -322 358 -399 446 -495 550 -608 674 -747 827 -915 1013 -1122 1247 -1389
48a389K940l288L693m173M754n473O386p589R261j1763J5953k4667P0681j20834
$$ -1389 1551 -1737 1956 -2217 2537 -2936 3450 -4139 5122 -6641 9312 -15355 55326 -65508
62f5508p0370K51589o6729j90252J20766J64447j56509p4836J42628O1j38459
$$ -65508 -135878 115711 48982 -141270 -20504 143943 -12566 -87402 55226 55287 -83172
73h3172M9884Q6344n8047k0761P2044l0547n5013M3911J3132n8126K8595N5189
$$ -83172 -33288 53056 -4991 -25752 46292 15745 -39268 4643 17775 -40351 -11756 43433
85D3433m0101k8342M8810m404m9480J1114K8469j0163M288P677j5152J0647J1258
$$ 43433 3332 -25010 23800 19396 -30084 -18970 9499 -664 3624 11301 -3851 6796 18054
98A8054m4042n387O0796j4036n8373N2520N3805p9278l8747Q0704j327p5859M1332
$$ 18054 -25988 -31375 29421 15385 -42988 9532 63337 -15941 -54688 26016 24689 -51170 -9838
111i838O4923n5908k7773N8238k0246n6126M7306K7063n8811K5468O9504o5685
$$ -9838 55085 -823 -28596 29642 9396 -46730 576 27639 -31172 -5704 63800 -1885
123a885n8861Q6804J5546j06864K9999J13540n9858q6716Q9276M7011j13158j8589
$$ -1885 -60746 26058 41604 -65260 -35261 78279 18421 -68295 20981 67992 -45166 -63755
135f3755J06149r852p6877M2215N3116n3604l2017L9529L552k4234J2937J2148
$$ -63755 42394 32542 -44335 -2120 50996 -2608 -34625 4904 8456 -15778 -2841 9307
147I307n115R452p250k7367J3266K1765k6583n143M3911n274m2879J8495K6336
$$ 9307 4192 13644 6394 -20973 -7707 14058 -12525 -17668 26243 20969 -21910 -3415 22921
160B2921l8464j3340M4448j45l0663K4149J6746m2014o499L8052j3685k6418L5933
$$ 22921 -15543 -28883 15565 15420 -15243 8906 25652 -16362 -22861 15191 1506 -24912 11021
173A1021J8308m0583k299L3804k0714k9923L0228K0506k4542N77J9824j5669j4009
$$ 11021 29329 -11254 -13553 20251 -463 -30386 -158 20348 -4194 -3617 16207 538 -13471
186a3471J4843k880j0359J9318N099k2018J1188J9597l1579j7975L9415O201l8641
$$ -13471 1372 -1508 -11867 7451 12550 -9468 1720 21317 -10262 -28237 11178 17379 -21262
199b1262J5215L8902k9514l1946L4520J3438l9908J725M0104p411k6168J4220
$$ -21262 -6047 32855 3341 -28605 5915 19353 -20555 -18830 21274 13863 -12305 1915
211A915J0245k1174m644J5704J071k789N247k625k783M083r143r738J5260R703
$$ 1915 12160 -9014 -13658 2046 3117 328 5575 2950 167 4250 -4893 -14631 629 10332
225A0332j4090K810J6859j4404j9197J6965J0238j9568K313K3365p706j7357J1764
$$ 10332 -3758 -948 15911 1507 -17690 -725 9513 -10055 -7742 15623 7917 -9440 2324
238B324M768j9044J583J8910l745q812R608Q03j2354K147N780p371J118J0919
$$ 2324 7092 -11952 -10369 8541 4796 -4016 5592 6395 -5959 -3812 1968 -5403 -4285 6634
252F634k891m669P054m616j3209P990J0736j0726j378J6782m402j7196Q642R430
$$ 6634 3743 -926 6128 1512 -11697 -3707 7029 -3697 -5075 11707 7305 -9891 -1249 8181
266H181j7012m038K1912J927j6472N316R875j4087q258J4218M249r811L289R296
$$ 8181 -8831 -12869 9043 10970 -5502 -186 9689 -4398 -12656 1562 5811 -4000 -711 8585
280H585m850p678O99O91l91K764K225J575J399n060n525M904L004p676P06J1809
$$ 8585 3735 -3943 -3244 -2553 -2944 -180 2045 3620 5019 -41 -5566 -662 2342 -5334 -4628 7181
296G181j167r820M173N021j0669m090J2604K972r247K171P704n448o812M045J900
$$ 7181 6014 -3806 367 5388 -5281 -9371 3233 6205 -3042 -871 6833 1385 -5427 -1382 518
311E18m084K040N819j29k921j795k163R0K241p44J4M651P29m999mK301n284l065
$$ 518 -3566 -1526 4293 4164 1243 -552 -2715 -2625 -384 -1128 -1114 3537 4266 -733 -737 1564 -3720 -6785
329f785Q145M757n493j224M356l626o093L763M489l390m09O005P6n965j554J586
$$ -6785 1360 6117 624 -600 3756 130 -5963 -2200 2289 -1101 -1510 4495 4571 -1394 -2948 -1362
345a362q77N85L688J204j974j145m75p78o8k39k06K407K739j515k696L02l07k155
$$ -1362 -2239 -1654 2034 3238 1264 119 -356 -1134 -1202 -1441 -1647 760 3499 1984 -712 -410 -717 -2872
363b872J400L795o81k847J643K311k756k821J565J475j067R44K781o65l472p20
$$ -2872 -1472 2323 1642 -1205 438 2749 -7 -2828 -1263 212 -855 89 2870 2205 -1267 -1987
379a987K160J83j995J09K947J007j984n95J050j971k896K818M693j780l520K577
$$ -1987 173 356 -1639 -1530 1417 2424 440 -155 895 -1076 -3972 -1154 3539 1759 -1761 816
395H16J989m601k004M674P47m096K366N478l587o405K594M216l168j450N071P82
$$ 816 2805 -1796 -3800 874 1621 -2475 -109 5369 1782 -4623 -2029 2187 -981 -2431 2640 3422
411C422n365j69M485j571m601K110M758j216l184J473J523l083j555L885K001
$$ 3422 -1943 -2112 2373 802 -3799 -1689 3069 1853 -1331 142 1665 -1418 -2973 912 2913
426B913l886j605M181J115m160m58L428j210l069L010L166l767k554L972J353
$$ 2913 -973 -2578 1603 2718 -1442 -1900 1528 318 -2751 259 3425 -342 -2896 1076 2429
441B429l943l66K947q92j553K697J201l177j366J683M34k76P29m3o32P71n0j542
$$ 2429 -1514 -1880 1067 175 -1378 1319 2520 -657 -2023 -340 94 -182 547 504 -128 643 593 -949
459i49j2Q86m81O69K196j093l121N23K092p74o71J589J34j591L57J158q70j219
$$ -949 -961 -75 -556 113 2309 1216 -1905 -1382 710 -64 -735 854 988 -603 -246 912 42 -1177
477a177L80J077Q80k91j581k35J474l77j096J618O14k931R6L974p57m098J356
$$ -1177 -797 280 1160 869 -712 -947 527 150 -946 672 1286 -1645 -1549 2425 1668 -2430 -1074
494a074L146k460j699L625L78m055Q66L978j887l452J976K105j752r1K007j123
$$ -1074 2072 -388 -2087 1538 1916 -2139 -1273 2705 818 -2634 -658 1447 -305 -396 1611 488
510D88k311Q77J770k38p71q5M49N19m16j178L77Q79q15J57K239p44l470P67L314
$$ 488 -1823 -946 824 586 -185 -270 179 698 282 -896 -519 360 -455 -298 1941 1197 -2273 -1506 1808
529A808j268k290K367J245l165j63L553j064l841J763L590j831k358J928R07k405
$$ 1808 540 -1750 617 1862 -1303 -1466 2087 1023 -2818 -1055 2535 704 -1654 274 1181 -1224
545a224P9K750n52k716N91K454l49j799K17R59o55o36J397Q73j769j129J871J108
$$ -1224 -1145 1605 1053 -1663 -1072 1382 1033 -766 -549 410 -245 -881 516 1389 -380 -1509 362 1470
563A470j875r90J623N78j223M43J131j473j541J688J825j165j229P11L40p91J01
$$ 1470 -405 -1395 228 806 -417 26 1157 -316 -1857 -169 1656 491 -738 -27 313 -478 -377
580c77P67l32n78O20Q78m18j209l80O72P42K47k14m76l99L01N11l03l51K38j50
$$ -377 390 58 -520 100 978 560 -649 -1029 -357 385 632 418 -58 -457 -156 355 52 -299 -61 -211
600b11j49J067L66j856n08K169J60k179N13J732j619q30L062K08l789J99L189
$$ -211 -360 707 1073 -783 -1291 878 1038 -1141 -628 1104 -515 -1345 1717 1925 -1864 -1665 1524
617A524j183j911K539N64l219R03L016k302k477L092J246k865O80K364k689j922
$$ 1524 341 -1570 969 1533 -1686 -783 2233 -69 -2546 546 1792 -1073 -393 1971 -718 -2640
633b640L540J265k913J77J585j584m73J908p34j258J891K87j819J255O41l456
$$ -2640 900 2165 -748 -571 1014 -570 -1043 865 131 -1127 764 1051 -768 487 1128 -2328
649b328N04M672j539m027L190K273m761j27N226k259m639M085L110m654m36M147
$$ -2328 -1824 2848 1309 -2718 472 2745 -2016 -2143 3083 824 -3815 270 3380 -1274 -1710 2437
665B437k474k768M531M60n375J992M565l936j953N643j465o295M033N154n718
$$ 2437 -37 -2805 1726 2186 -3189 -1197 3368 -568 -2521 3122 1657 -4638 -605 4549 -1169
680a169k538O561n83n940L446L935n479j442N877q08m386K861J519m208J338M305
$$ -1169 -3707 2854 2271 -3669 -223 3712 -1767 -3209 2668 1860 -2526 335 1854 -2354 -1016 3289
696C289l292k791M100J66l921K407K561m050l18M512j827l296L352L84m180K970
$$ 3289 -3 -2794 1306 1472 -2449 -42 2519 -1531 -1849 2663 836 -2460 892 1276 -2904 66
712F6L907n499k036O738r28o601M334M955p412k409R008m09q662L354O679n560
$$ 66 3973 -1526 -3562 3176 2248 -4353 -19 4936 -2476 -4885 4123 3714 -4948 -1594 5085 -475
728d75l771O485L64o179K435M787l527k209L238r95k355L275Q67m021J363L409
$$ -475 -4246 2239 2603 -3576 -1141 3646 119 -2090 1148 153 -2202 1073 1940 -2081 -718 2691
744B691l165j823M074o45m182K904L545l929j887L673n64k696K784J205l792O95
$$ 2691 -474 -2297 1777 1132 -3050 -146 3399 -530 -2417 1256 692 -2004 780 1985 -1807 -1112
760a112L502k439k144L621j25m012K373L734l883k567M260O56l617J311K395k789
$$ -1112 2390 -49 -2193 1428 1303 -2709 -336 3398 -485 -3052 1208 1864 -1753 -442 1953 -836
776h36p75L059o03k094J701J43k381K002K329l786j368M778j46m673J911L679
$$ -836 -1611 1448 845 -1249 452 595 -1786 216 2545 -1241 -2609 2169 2023 -2650 -739 2940
792B940l775k384M955J238m860j27L764q71k368J349R81j205L5R54l05k96l12
$$ 2940 -835 -3219 1736 2974 -1886 -2013 1751 880 -1488 -139 842 -363 -328 626 321 25 -287
809b87q92J078J732j431j651J813Q52k051Q5J809j174j252K048P82j958j84R79
$$ -287 -1179 -101 1631 200 -1451 362 1214 -837 -752 1057 -117 -1369 679 1461 -497 -681 298
826B98q60J08J710r07j700J519J146j861l58J650o54j217J585R19j663o62R33
$$ 298 -562 -454 1256 349 -1351 168 1314 -547 -905 745 91 -1126 459 1378 -285 -947 -14
843a4J43O0K48q69j47J368l93j255J138O08k197J19L009p17k902J296K181j722
$$ -14 129 189 437 -432 -579 789 396 -859 279 887 -1310 -1191 1818 1101 -1801 -505 1676 -46
861d6j155J711n8j560R72J291q41n72J03n25N58J084j217q48J852L49j964O92
$$ -46 -1201 510 452 -1108 -136 1155 314 -258 -155 -680 -122 962 -255 -1103 749 1098 -866 -174
879a74J376k166q13L081J72k722P95J815j882n97K472r30k434K118J859k604m83
$$ -174 1202 -964 -1777 1304 1476 -1246 -451 1364 -518 -1115 1357 427 -2007 111 1970 -634 -1117
896a117K474j285k045K645J362l238l55K948p01j986J607O83k096N03J980j131
$$ -1117 1357 72 -1973 672 2034 -1204 -1559 1389 688 -1298 309 992 -1104 -601 1379 248
912B48j195J151j70q08J450K87k061O02J837j409j052J865l28k170J748K117k322
$$ 248 -947 204 34 -774 676 963 -1098 -496 1341 -68 -1120 745 417 -1753 -5 2112 -210
929b10j251K339k18k108J564J255k473n7K915p70k408J499Q99k272M31K582j437
$$ -210 -1461 878 660 -1448 116 1371 -1102 -1159 1756 986 -1422 77 976 -1296 -865 1717 280
946B80j932K134J067k173p0J531j320r14K189M51j914L08J171j076k79J274q07
$$ 280 -1652 482 1549 -624 -694 837 -483 -1397 792 1243 -671 -363 808 -268 -547 727 -80
963h0j227J641R76j614k10J194r53r16J828M51j929J08J661o00r83Q51Q6j113
$$ -80 -1307 334 1310 -304 -514 680 -273 -1189 639 1090 -839 -731 930 330 -653 198 284 -829
981h29O24J215q37p54N03P5k49O40j7r62L65R07o08n42P04l59q00J181J022j374
$$ -829 -205 1010 173 -581 -78 -3 -252 388 371 -591 -226 681 73 -469 235 -124 -924 257 1279 -95
1001i5p77J286m0j190O90R46j230m15J749K34j848j72J136l15n11J036L78j233
$$ -95 -872 414 374 -816 -126 820 -410 -825 924 1158 -690 -862 274 -41 -552 484 862 -371
1019c71j70J077r8j006p0O77K13o8J15o9m34l34L38O30j13p62P6R15j7q84MN10
$$ -371 -541 536 438 -568 -638 39 252 184 299 230 -204 -538 -200 430 317 -445 -369 546 529 -355 -351 159
1041A59m92j94J191K60j463l16J362Oj150L00R24n84m94J032K19j392l99J271
$$ 159 -333 -527 664 924 -539 -855 507 513 -637 -337 587 3 -491 541 760 -632 -1031 240
1059B40M02o83r1N12k91m46K98L64m56m88O49Q87l54j021j0N93j50l20P29L31
$$ 240 642 -41 -132 380 89 -357 -59 305 -151 -639 10 897 543 -478 -488 105 -45 -365 364 695
1079F95j015k73J133O2j351k4J192K9o02M03K64r79l54J037M38q18l54P32L01
$$ 695 -320 -593 540 602 -749 -773 419 448 -154 249 513 -466 -820 217 655 -163 -517 215 516
1098E16n12k87K42m7l47M00Q48l30j035P6R16k34p96M74O16o01j63R16j42j331
$$ 516 4 -283 -41 -88 -435 -35 813 483 -552 -476 440 206 -590 -116 500 -101 -264 652 510 -821
1118h21j5J286J20p85J25M95l94m27M67K97o44k80Q25O23o55q03L38M34m44j7
$$ -821 -836 450 570 -215 -90 405 11 -416 51 348 -296 -576 249 872 217 -586 -248 186 -258 -275
1138b75Q86j33j134L21J186n46j335O39J163o67n03R01J6j334R8J399j47j151
$$ -275 611 478 -656 -335 851 305 -1030 -391 772 105 -398 503 519 -815 -717 682 535 -616
1156f16L01R18k93o26K47K44m89j85P45N44o48q08M82P37n13o53O29M85p58k9
$$ -616 -315 603 310 -316 -69 175 -314 -499 246 790 142 -666 -184 553 40 -613 16 501 -257 -286
1176b86J108l75j499M56J380m93q89P56L91r47pR65l62r57M68R17k18n14K1l1
$$ -286 822 447 -1052 -596 784 291 -598 158 549 -398 -405 560 198 -759 -291 626 408 -106 -85 -116
1196a16j28J70J95N9j62k62K11N89l73r62M12R18m87m33Q79m1j368L78J497p50
$$ -116 -244 -74 121 180 18 -244 -33 556 183 -779 -367 551 64 -369 510 469 -899 -521 976 226
1216B26j281J052Q86j103j56R99n47j077Q81R35p43m34M93m7j87L07k69m07N57
$$ 226 -1055 -3 883 -220 -376 623 76 -1001 -120 815 72 -362 131 84 -103 204 -65 -472 85
1235H5K06m78M33L45j213k34J535m8j461O54J179j195n50J520l03j751Q92J556
$$ 85 291 -187 246 591 -622 -856 679 631 -830 -176 1003 -192 -742 778 475 -1276 -384 1172
1253A172j060p50J073j74j055P69P17j066j00R43l32l27O39n27q94J149O70j291
$$ 1172 112 -638 435 261 -794 -25 692 -374 -474 469 137 -190 449 -78 -972 177 847 -444
1271d44J49J285j238q45J896J76k455P79K387j524j535K186K34k707R01K579j686
$$ -444 -295 990 -248 -1093 803 979 -1476 -697 1690 166 -1369 817 1051 -1656 -755 1824 138
1288A38j789K273O70k247M02J702j469r73J997K86j632N21P20j176J15J328r20
$$ 138 -1651 622 1292 -955 -553 1149 -320 -1293 704 990 -642 -121 599 -577 -462 866 -54
1305e4q65J480J80j446P44Q12j699j47K178n93j759J425Q67k049K04K058j329
$$ -54 -919 561 741 -705 39 851 -848 -995 1183 590 -1169 256 1123 -926 -722 1336 7
1322Gj618K196Q31k295L36J747j623j015K430R2k399J034J737j856p08K155p14
$$ 7 -1611 585 1416 -879 -543 1204 -419 -1434 996 1088 -1311 -277 1460 -396 -1104 1051 337
1339C37k079J966J562k452m23K371j046j977K209J117k746O8K796j154k129J774
$$ 337 -1742 224 1786 -666 -1089 1282 236 -1741 468 1585 -1161 -1093 1703 549 -1580 194
1355A94Q99k250L69K341j117j675J432O49j504K84J056r54k69J306l45j021P51
$$ 194 1093 -1157 -788 1553 436 -1239 193 842 -662 -378 678 -276 -545 761 416 -605 146
1372A46M8j077Q64J226j585n68J894m05j835J309J187k194j11K756p77k600J683
$$ 146 194 -883 -19 1207 -378 -946 948 543 -1292 17 1204 -990 -1101 1655 878 -1722 -39
1389c9J523k418k97K788r21k428K004J611k609n81K496p04j908J893J202k417
$$ -39 1484 -934 -1231 1557 636 -1792 212 1823 -786 -1367 1129 425 -1483 410 1612 -805
1405h05l04K194p49j523J458O27j696M36J608j258j096J396J31j190R25Q61j464
$$ -805 -1109 1085 336 -1187 271 898 -798 -362 1246 -12 -1108 288 419 -771 154 1015 -449
1422d49j86J421n69j093J034L69j180O14J175j233q26J247k3j097R85O41j431
$$ -449 -635 786 217 -876 158 527 -653 -39 1136 -97 -923 324 301 -796 189 830 -601
1439f01J31J542q65j308J330M47j595O83J694j534j282J945L99k062N58J742j425
$$ -601 -470 1072 207 -1101 229 676 -919 -236 1458 -76 -1358 587 986 -1076 -518 1224 -201
1456b01j050K062L15k249L66J813r46j038J401K68j526K99J325o98q28P66K87
$$ -201 -1251 811 1126 -1123 -757 1056 110 -928 473 741 -785 -486 839 141 -687 79 366
1473C66n50K03L17n65j20M05k4L6K36m17k28O55k5p83K44O44n40j07R69k93j190
$$ 366 -184 19 336 -229 -349 56 32 68 304 -113 -341 314 289 -494 -250 394 -146 -253 716 423 -767
1494g67M59Q97p56m25R52O3q84M85P30q81o42Q20K72n40J64M75m72k58N22K2m91
$$ -767 -308 589 -167 -592 360 423 -461 24 754 -127 -769 51 323 -217 -53 422 -50 -308 214 236 -255
1515b55j6L26oQ8J01k61k15K40P1q7K9j8j75J35L17j86k85J15J23%K6mk12j8J46
$$ -255 -271 55 49 137 238 -23 -238 2 73 -14 15 -3 -178 -43 274 88 -197 -82 41 41 67 63 -149 -167 -21
1540b1J37K1p1j60K9K48j07k81J0K46m8K6K96j50m76O5M05j19k93K07K00j43L6
$$ -21 116 137 66 -94 -65 183 76 -205 -195 51 3 29 325 175 -301 -236 169 50 -243 -36 164 21 57
1563E7J98k23m11J39L46J8j00l1N5J3Op0l7r5o1K28K78j45l24P9J74j32n1K28
$$ 57 255 32 -379 -240 106 124 24 -7 48 61 67 -3 -40 -135 -196 32 310 165 -159 -80 94 -38 -89 139
1587A39j19k69L07K98l19l37K86J67k48J11K60l23k72L97K39l68j46K58M7j67
$$ 139 20 -249 58 356 37 -300 -14 153 -95 16 276 -47 -319 78 317 -51 -197 61 108 -59
1607e9J02R0k37r3J79J91k0j48j30J18J61j38k07J43J15j65J99K30l19l98K79
$$ -59 43 133 -104 -197 -18 173 153 5 -125 -7 154 16 -191 -48 67 -98 101 331 12 -386 -107
1628a07L49k46j60K61K9k44J57K14l81k38K83K57m8q8j3j20J8J41m0j26L6R4N2
$$ -107 242 -4 -164 97 126 -118 39 253 -128 -366 -83 174 126 38 25 -95 -77 64 24 -102 -66 28 80
1651H0J19j26k52m8K63M6p7Q6k0k13J08K23k34k22K17K47j73J9R0j92k63K75K56
$$ 80 199 73 -179 -227 36 82 5 91 71 -142 -34 189 -45 -267 -50 197 24 43 133 -59 -322 -47 209
1674B09j77k16J93J85j46r5Q1j14j25J78K31l0k70j6J30N1j43l5J20K3n6J82N2
$$ 209 32 -184 9 194 48 -47 34 -80 -205 -27 204 174 -96 -112 18 69 -74 -109 11 34 -22 160 212
1697B12l32k17K81K61j47j13J24Lj87Q2J47j99j37K20K65p3k78K5J1o6O5J93m3
$$ 212 -120 -337 -56 205 58 -55 69 72 -115 -33 114 -85 -222 -2 263 190 -88 -63 -52 -118 -53 140 97
1720I7j96Q0K00q1k54p2J74P2P5N1m9k26l2J64M6r0n5J44R6j8q4j10m3l5J26K25
$$ 97 -99 -19 181 100 -154 -226 -52 20 95 146 97 -129 -161 3 49 -41 -96 48 144 126 42 -68 -111 -146 -20 205
1746B05l4k16k4J39m2j41QJ04l6M8K11l5m06j8K65K5r1R8O4j46j3J20r4k33O8
$$ 205 171 -45 -69 70 28 -113 -105 -1 -37 11 222 187 -219 -237 28 53 -38 60 124 -22 -35 85 -9 -242 -174
1771a74K52J40n3r9j16o5J6P1O4Qo9P4J60j23l01nJ93L1K3K00rl45n0K79p1k62
$$ -174 78 218 165 66 -50 -115 -99 -28 36 44 -25 49 209 86 -215 -220 -27 4 27 227 218 -127 -177 102 31 -231
1797b31J67K24k8o9Q7j80k73J32K44P3r6Qj1m9Jp7q9O2J26Q8J06k5l33j44K28
$$ -231 -64 160 132 63 150 -30 -303 -171 73 146 50 58 47 -2 -1 -78 -167 -105 21 109 215 190 -143 -287 -59
1822e9R0j55J28K05j48q8J52j13l88J50L70M7j29J27j32k53Q4J64j40n1K32J44
$$ -59 31 -124 4 209 61 -27 125 12 -376 -226 144 191 62 189 57 -196 -112 52 -88 -139 93 237
1844B37j36k5q3k43L1K33J47p8N1q2j40Q9N8l12O7L76Nj69J48j02m28P9M47o9
$$ 237 101 76 -7 -250 -219 14 161 83 134 52 -88 1 59 -253 -186 190 195 26 174 72 -356 -277 170 101
1868A01k60K60K16l75p9J93j50k66L27L56j75j78Q1j58p9J96lj44K00J68j88K2
$$ 101 -159 101 317 -58 -137 56 -94 -360 -33 323 148 -30 51 -107 -186 10 7 -137 63 231 43 65
1890F5N9l84j28M83J94l54P7K63l50k50L57L1m08K65M96k40k82K02j27l90L32
$$ 65 124 -260 -388 95 289 -65 12 275 -75 -325 32 63 -345 -80 416 176 -106 96 -31 -421 -89
1911h9M07l17j45M16j22l83K00Q4l71J32N46j09l56J99j07l19K27L08l12j0M73
$$ -89 318 1 -144 272 150 -233 -33 51 -320 -188 358 249 -107 92 -15 -334 -107 201 -111 -121 352
1932C52j41m17K42O3n64K15P10k07n25M09J78o49L5N32k35l47N56L06n87o3K24
$$ 352 211 -206 36 99 -465 -250 460 253 -272 137 315 -334 -299 233 -2 -349 207 513 -74 -137 87
1953H7l51q8N62Q0m25K05K57n36l4L83k40l17O67K74o29r4M23l84k97N97J79n48
$$ 87 -264 -352 210 290 -135 70 327 -209 -243 140 -100 -417 250 524 -105 -199 224 -160 -457 140 319 -229
1975b29K33M84m82l52L61l8m08N26M69n51k09L94k08m02L78K61m58K02N17l69
$$ -229 4 488 6 -346 15 -23 -431 95 564 13 -196 198 -10 -412 -34 227 -231 -29 488 119
1995A19m56L44l7l65M12M59m98j55N22k48n81L95L38n53R5Q31l09p76L70L41o16
$$ 119 -337 7 -30 -395 17 476 -22 -177 345 97 -484 -89 249 -304 -209 622 313 -463 -93 248 -368
2016c68O8P36k56m88M80K31o69j17M84j23j37N28j7n41P5K50l47o0M87j30k61
$$ -368 -300 436 180 -308 172 403 -266 -383 101 -22 -159 369 352 -189 -114 136 -211 -271 216 86 -175
2037a75M82L1o05k7M01l30j7O28m5o20K47L70o12j49O48j20l98N84K65p89j76
$$ -175 307 338 -267 -294 107 -223 -240 388 343 -277 -30 340 -272 -421 227 107 -291 293 558 -231 -407
2058d07N75k57l24O07K48o35R2M94m77m16N11J12l75M03L95o26l09N28j00m40
$$ -407 168 -89 -413 194 442 -193 -101 393 -84 -500 11 123 -252 151 546 -80 -389 139 39 -401
2078d01M26L52m69j5M83l26m99L23K52k68J94L63m04k51L09k3l53K59K31k66J31
$$ -401 25 377 -92 -107 376 50 -449 -126 126 -142 52 415 11 -240 69 46 -307 -48 183 -83 48
2099D8L59m11m08M00R1l68L60L90n04k07N09j64o37M00M59m49K8O49l22p79M49
$$ 48 407 -4 -412 -12 79 -289 71 461 -43 -250 259 95 -542 -142 317 -132 -104 545 223 -556 -107
2120a07L71n83R4O57k38m90M99J25o74n5N88j20j85L99j2n24J64K41l32m8M18
$$ -107 264 -319 -225 432 194 -296 203 328 -346 -401 187 67 -118 281 269 -255 -91 150 -182 -230 188
2141A88o5k34L47n6n23J42L24k38m9N06j40n04K84K47n10m6N69j02l24M33P2o88
$$ 188 123 -111 236 180 -343 -201 123 -115 -164 342 202 -302 -18 229 -281 -327 242 140 -184 249 321 -367
2163c67K3N69k60k58N39R9n97J52M76n35l29O01J14m30K99L56o03k83O13p2m48
$$ -367 -344 225 -35 -293 246 345 -252 -100 376 -159 -488 113 227 -203 96 452 -151 -434 179 107 -341
2184c41L52L60m07r0M08l27m10M27K78l66J20L28l46k80M14l0m52K63L90k42j14
$$ -341 11 371 -36 -126 282 -45 -455 -28 250 -116 4 332 -14 -294 120 90 -362 -99 291 49 -65
2205f5L28k45m13L41K61l55R8L98l51k28M02o5n06K51M79l19j54M38j76n66L59
$$ -65 263 18 -395 -54 207 -148 -50 348 -3 -231 171 106 -400 -149 330 11 -143 295 119 -447 -88
2226h8L80m50o9N22r8m36L24J50n54oO01j17l43L23J06n09M9M40k86k72M92J41
$$ -88 292 -158 -227 295 197 -239 85 235 -319 -325 276 159 -184 139 245 -264 -215 225 -61 -333 159 300
2248C00m20J08J95l62j60N17jl41K09K31l61p9L26k04k97M70J72l63L5K73l53
$$ 300 -120 -12 183 -179 -339 178 177 -164 45 276 -85 -164 162 -42 -339 131 303 -60 -25 248 -105
2269a05k39M65Q1m19J80L18k72j63K72j56k93K97L31k51j06K20j86k25K67J05
$$ -105 -344 121 202 -217 -37 281 9 -154 118 -38 -331 -34 297 46 -60 160 -26 -251 16 121
2289A21l00J20L23j70k22K09p1l46K74L37k64j35K78r8k94K26J59l25OM38n6l26
$$ 121 -179 -59 264 94 -128 81 10 -336 -62 275 11 -124 154 56 -238 -12 147 -178 -172 266 210 -116
2311a16J15R5l07K7L63j01k24K48P9k46k2R5j03l4K41Q3j92j8P2j71K2K26j21
$$ -116 -1 94 -213 -186 177 76 -148 100 179 -67 -89 6 -97 -131 110 193 1 -17 55 -116 -94 132 11
2334A1j38K09J64k87q6J65j88j8K43J40k55k8J71r8j43J37N8j50J24J54j67j30
$$ 11 -127 82 246 -41 -127 38 -150 -168 75 215 -40 -68 103 5 -138 -1 57 -93 31 185 18 -112
2356a12N0K4j9J33K7j55J4J08p6n0O4n8n9J53J02j14j58J19j1j06J36Q2j15m9
$$ -112 -62 -38 -57 76 103 -52 -38 70 -6 -56 8 -50 -109 44 146 32 -126 -7 -18 -124 12 94 -21 -70
2380g0K09Nj90p6P8pJ4J53j8j69KJ30o9o2J7J0N6Q4rj01m5k3MJ09O6j22p3J43
$$ -70 139 144 -46 -122 -44 -51 -37 116 98 -71 -69 61 -8 -70 -53 -43 13 97 88 -13 -58 -81 -77 32 98 -24 -97 46
2408D6K9j32j0Q0n5K4J39pj89n7J15N4k9kL9p2rN8Lo6k0L7R6M6j02o5J2M4j7k
$$ 46 75 -57 -67 13 -42 -18 121 114 -75 -132 -17 37 8 6 45 -27 -36 22 25 -41 -61 -24 72 118 16 -49 -37 7 -10 -12
2438a2M8m8p5J67P6j86p0O9L1l3Q7Rr3m1J11J1q4j3J5L7O1oo2m4j8K1R0K1j04
$$ -12 36 -12 -87 80 156 -30 -100 -31 0 -33 54 63 -30 -71 40 51 -33 -46 -31 6 67 61 -1 -45 -63 -42 48 69 -35
2467c5m5J17K0q7K4J4p0J5J64j3j86j8J25K2o1N7j4r8K5R6l9j02j4R6N7Lo8o9
$$ -35 -80 37 57 -30 -6 8 -62 -47 117 104 -82 -100 25 47 -14 43 29 -69 -44 52 13 -89 -103 -7 50 53 -15 -84
2495h4P4N3n8NJ5m4m0J53N2j67n8J19j3l5N4O7j49l1J68Lj34k7P1NN6Jp2n1M1
$$ -84 -10 43 -15 -10 5 -39 -79 74 126 -41 -99 20 7 -28 26 93 -56 -87 81 84 -50 -77 -6 -1 55 56 -16 -67 -26
2524b6J9Q8l3m4j09J74O1j74m9J39n6o0J65P1k64q3K72L6j95J2R9r5m4K08j2k52
$$ -26 -7 81 48 4 -105 69 130 -44 -93 46 -10 -70 95 166 -98 -181 91 127 -68 -56 43 -52 -96 112 100 -152
2550a52L0J95m1k8J5m2m8O8N6q0l6L6l7J11Q9j60j13J35R9j58P6Q8j63p6K51J6
$$ -152 -122 73 32 4 19 -23 -71 -3 53 -27 -63 -27 -64 47 136 -24 -137 -2 97 -61 15 103 -60 -136 115 131
2576A31k78M2K43j18j20J73Jk35N3K70j06j54P4M4p2P5P8j52k0J04j3l2O2n9j38
$$ 131 -147 -105 138 20 -100 73 74 -161 -108 162 56 -98 -24 20 -52 23 101 -51 -71 33 20 -12 50 -9 -147
2601a47J57J86k22j30K00L8j70J11J76k66j46K89Q9k40jJ49q1p8J60pj79P4R5
$$ -147 10 196 -26 -156 44 82 -88 23 199 -67 -213 76 165 -75 -76 73 -8 -86 74 67 -112 -38 57
2624E7j1lk2j40J4J98mj87J30P7k13M1K41j32k53J99K30k97k6K09j26k09K64J99
$$ 57 46 43 21 -119 -105 93 89 -98 32 109 -104 -63 178 46 -207 -8 222 -75 -101 108 -18 -227 37 236
2648B36l43r4L37n9j93J31J21k67pK82l8k56J17P4m2O4pj01n4Q7M6LM1r4k08K01
$$ 236 -107 -201 136 77 -116 15 136 -131 -138 144 106 -150 -33 41 -1 63 56 -45 -99 -12 34 37 78 -16 -224 -23
2674b3K05k30j43L08j0k56J42J57k79r3L63Q8l35L7J57j26j20K19J9j76O1J40
$$ -23 182 -48 -191 117 107 -149 -7 150 -129 -222 141 229 -106 -69 88 -38 -158 61 80 -96 -35 105
2696A05p7l9Rp2J7J53M0k22L6R4o6j2J33o6j58R0J66j06p3Q5n9p0J33J4j11j5
$$ 105 28 -11 -2 -74 -57 96 136 -86 -50 44 -22 -34 99 33 -125 -35 131 25 -48 37 -22 -92 41 55 -56 -71
2722g1P3N4m4rn7q8J27J08j7n6l4l9JJ10o5m4P4M0j3m4L1j19o7J27J51p4r4L6
$$ -71 2 56 12 3 -54 -142 -15 93 76 20 -14 -53 -52 58 -7 -51 23 63 50 6 37 -82 -149 -22 129 55 -39 -3
2750cJ8l2j2K9k1n8J02J02p8j80M6J33j9r1P3R8j72j1J80J4k80j2K64mj06N9K5
$$ -3 15 -17 -29 0 -21 -79 23 125 47 -133 -87 46 27 -64 9 107 -65 -76 104 118 -162 -174 90 86 -20 39 64
2777F4j63J7J42k4j56M0J46l2K6p7r3l2J31J08q1M6n6m9L0N8r0p8J27Q7m8L2o0
$$ 64 -99 -82 60 36 -120 -80 66 34 60 -17 -110 -142 -11 97 16 62 6 -43 -13 45 -45 -123 4 91 43 75 15
2804A5j55J4K11j0j46J02P4j21RQ4j31j16J39J95j66L3L1j18p9K01Mj71P7J39
$$ 15 -140 -126 85 75 -71 31 105 -16 -7 77 -54 -170 -31 164 -2 31 62 -56 -135 66 70 -101 -24 115
2828A15r6n7J27j31k33K67K16k41m0J96r6j99J79J38l28L1L22k1k47J04N9k11
$$ 115 19 -38 89 -42 -275 -8 208 -33 -73 123 27 -172 7 145 -183 -152 170 149 -98 6 65 -146
2850a46J8K48p9j33J52kj35M7N9j77K9K82J4k08M7Nj65O7K17j26j59K03R4j95
$$ -146 -128 120 41 -92 60 58 -77 -30 29 -148 -119 163 177 -31 16 21 -144 -77 140 14 -145 58 152 -43
2874d3K4O6k06m4L42K2k46J06Q9k03k4K26j33j65K65J56k72l3J69j75j36L18R1
$$ -43 -19 47 -159 -203 139 161 -85 21 110 -93 -117 109 -24 -189 76 232 -40 -73 96 -79 -215 103 194
2897A94k97M1K49k25j53K56k7k44K15L11k78k02K08n1j72J75J76k16o4K30k8k12
$$ 194 -103 -62 187 -38 -191 65 38 -206 9 320 42 -160 48 -3 -175 0 176 -40 -104 126 98 -114
2919a14N1O6j18J26J53j20j25J10K8j59J07P4j75M3K12n5j55K5J5j41J41J88j74
$$ -114 -63 3 -115 11 164 44 -81 29 57 -102 5 79 -96 -53 159 104 -51 -26 -11 -152 -11 177 3
2942Cr7K26%k43N8J07j92K3L24o4k55L9J16j74O6J92j10j47K05K0j66m4J74j11
$$ 3 -94 132 132 -111 -53 54 -138 -115 209 145 -110 -71 45 -129 -63 129 19 -128 77 97 -69 -113 61 -50
2966e0m6K78j4l04J7J61p7kJ42l4j86J29J19j96r0J28J8jJ12rj62L0Q1n8k8N0
$$ -50 -96 182 168 -136 -119 42 -35 -37 105 71 -115 14 133 -63 -153 -25 -7 -8 104 95 -67 -37 44 -14 -42 8
2992Hm5o2K05R6k13q6J15p8JJ19kj04J01J05j57j13R7m3o9K18J07k61n5J30Qj19
$$ 8 -37 -99 106 202 -11 -97 18 -60 -59 60 58 -46 55 160 3 -110 -13 -56 -125 93 200 -61 -116 14 22 -97
3018i7J20K2j38Q1J89j31k03J14Q7r1P4R8j83j04J97N4j72P1Q2j07MJ41m9j77
$$ -97 23 45 -93 -12 177 46 -157 -43 44 -47 27 125 -58 -162 35 89 -83 -12 70 -37 -33 108 59 -118
3042a18O7O5k8O4M5j38l6J32k1j08K3M2o2R8J50j69j68J56M0j47P7J61j22p0J86
$$ -118 -51 14 -14 50 95 -43 -79 53 32 -76 -53 -11 -73 25 175 6 -162 -6 34 -113 -36 125 3 -67 119
3067A19kk31J9R3OKJ42q7j82J06R1j36j5J41j15j0J80l0k57O9J66o4o8J30l4j83
$$ 119 117 -114 -95 -2 4 6 148 61 -121 -15 76 -60 -75 66 -49 -59 121 91 -166 -97 69 5 -63 67 33 -150
3093a50J15K19j99j27J51Rp2R9K6j87J7J93m8q1P3rj24J18J26j85n9J13k0l7J66
$$ -150 -35 184 -15 -142 9 18 -54 45 71 -116 -99 94 46 -35 38 29 -95 23 149 -36 -95 18 -2 -39 127
3118A27l3k05J6K17r1j63J81L3j76R3J91j87k24K17J62j99j1J12p2o6J42K7j59
$$ 127 94 -111 -95 122 31 -132 49 82 -94 -1 190 3 -221 -4 158 -41 -52 60 -12 -78 64 91 -68
3141f8J4O9m6R5J9j20n9J23J8j22R4M3j64M7K63j48k66J65J84j90j6J87q1k26
$$ -68 -54 15 -31 64 83 -37 -96 27 45 -77 17 60 -104 -57 206 58 -208 -43 141 -49 -65 122 41 -185
3165a85K00J49k20j22K16mq7J13O1j95l8J70k8o9K9Kn2J32L6j69j3J44j28j9K02
$$ -185 15 164 -56 -178 38 34 -53 60 121 -74 -112 58 30 -39 -10 -8 -60 72 108 -61 -74 70 -58 -77 125
3190A25m4k89J34L04k45j74K42Oj85J24K28k40j70J95J33j79jJ34j36m0J93p2
$$ 125 81 -208 -74 230 -15 -189 53 59 -126 -2 226 -14 -184 11 144 -35 -36 98 -38 -78 115 43
3212D3j66R6O3n0N5J11k19o8K41J7k17Q8R9k02J9K88j22k75J68J98k27LJ87j11
$$ 43 -123 -27 36 -14 41 152 -67 -135 106 123 -94 -6 93 -109 -90 198 76 -199 -31 167 -60 -57 130 19
3236A9k01K41J79l04q3K44n2j22J52N4k71N5J73l9j08J18q6q6K31k6k41O1J95
$$ 19 -182 59 238 -66 -149 95 43 -79 73 127 -144 -89 84 45 -63 55 -31 -117 114 88 -153 -92 103
3259A03j74n9L43p4m06J60L48k04k90L28N5k85J08K82k56k15K61J32j95oJ13j46
$$ 103 -71 -130 213 139 -267 -107 241 37 -253 75 130 -155 -47 235 -21 -236 25 157 -38 -44 69 -77
3281g7N0J64j07j76J74Nj14R0R7k13l2K71n1k04J11J11k25O3K65j49k97K11J53
$$ -77 -27 137 30 -146 28 33 -81 9 106 -107 -139 132 81 -123 -12 99 -126 -63 202 53 -244 -33 120
3304A20k05kK48j57k07L20Q2l24m3K66n9q6J10%j74M2J86j29l7J25j33j5K40o2
$$ 120 -85 -87 161 4 -203 117 199 -125 -168 98 39 -47 63 63 -111 -69 117 -12 -49 76 -57 -72 168 106
3328A06k70P6K32j57j24K40K5l09J06K83j09l03J52J75j59L2Q6j00q8R0O7k4J0
$$ 106 -164 -88 144 -13 -137 103 128 -181 -75 208 99 -204 -52 123 -36 -4 82 -18 -106 -16 51 27 37
3351C7o8l1Q9R0j79m5J46j1n3J10J3k19MK01J1k17R3P7j10J3K11j27k27J55K04
$$ 37 -31 -62 27 117 -62 -107 39 28 -25 85 98 -121 -117 84 95 -122 -29 48 -62 -49 162 35 -192 -37 167
3376A67j53r8J50k7j51Q2J79j50j31J03J13J1q2o9M7j5klJ23q4j69J33J61j17
$$ 167 14 -84 66 39 -112 -30 149 -1 -132 -29 84 95 13 -56 -9 -24 -26 -29 94 10 -159 -26 135 18
3400A8j97J46J50j27l9J63r6j44J03J37q2r2M7J6J9L0p8k7M0J9j4L3P2j46j7J62
$$ 18 -179 -33 117 -10 -49 114 18 -126 -23 114 32 -60 -13 3 22 52 -26 -53 -13 6 -8 25 97 -49 -66 96
3426I6Jj82MJ07l8j4P7k2j24M3J26r1QK4p2OJ64j9j97O8P1o4J8R9j07j24J78M5
$$ 96 97 -85 -81 26 -12 -26 51 29 -95 -52 74 -17 -9 15 -57 -51 113 94 -103 -35 36 -28 -10 89 -18 -142 36 81
3454H1j41L4O0j26L3K03q0k64J29K19j88q3K26j2l09J85K66k44j92J93Q6j04K8
$$ 81 -60 -26 34 -92 -59 144 64 -200 -71 148 -40 -123 103 91 -218 -33 233 -11 -203 -10 76 -28 0
3477@P2j34l9J48np6N4j6j09J73P3k63k4K64j10j13K04K4k58rL21q8k74J81J12
$$ 0 72 -62 -101 47 42 -34 20 4 -105 68 141 -122 -146 118 8 -105 99 123 -135 -144 177 89 -185 -4 108
3502A08j87Q6J48j91j28K25L5j88R6R2k20J8K66o8k94J92J42k18L6K26j80k24
$$ 108 -79 7 155 -36 -164 61 96 -92 4 96 -124 -106 160 92 -202 -10 132 -86 -50 176 -4 -228
3524b28K88J44k81k8K32j39j38K67J9l41O8L13j27j64K21k2k39J09K16j88j39
$$ -228 60 204 -77 -105 127 -12 -150 117 136 -205 -137 176 49 -115 106 84 -155 -46 170 -18 -157
3545a57K02Q5j62R8J4j97j5K30o2q4Q8k8j51J87J08k70n9L22p5k05J99O3k90j7
$$ -157 45 130 -32 66 80 -117 -132 98 36 -48 40 12 -139 48 156 -114 -173 149 74 -131 68 131 -159 -176
3569a76L93j26k55J31J65j99j8K19j19j72J61J53j87l2J61j83j3K14k0k56R7K39
$$ -176 217 91 -164 -33 132 -67 -85 134 15 -157 4 157 -30 -62 99 -84 -97 117 97 -159 -62 177
3591A77k24k7K13j07k27J93K16k45j45K79m2j51J11R1k20K9J94Oj65J6J3o6Q0
$$ 177 -47 -74 139 32 -195 -2 214 -31 -176 103 61 -90 21 112 -108 -79 115 121 -44 -28 -15 -81 -1
3614aJ01r7r7J10J7l9N0kj38N9J39o8q1P8j7p1Q4R6k23n0K05K6j66Q1J40k21l3
$$ -1 100 3 -94 16 33 -6 44 42 -96 -37 102 34 -47 31 14 -57 27 123 -100 -150 55 81 -85 -4 136 -85 -118
3641a18K53k2l03R8J89j02p4J51l5j69J09J65j21r1O6l8M9O3Jj85Q3J21q3k5O5
$$ -118 135 113 -190 -92 97 -5 -79 72 37 -132 -23 142 21 -70 -4 -42 7 70 71 -114 -31 90 7 -18 47
3666D7n1j05J22J29j54r4J15M2m4KK7j03pJ34L6j03lj0pO0rp2kN3K1JO0j16p8
$$ 47 -4 -109 13 142 -12 -106 9 51 7 9 36 -67 -74 60 96 -7 -10 -20 -27 33 24 -48 -50 3 24 25 85 -31 -109
3695a09J09R5q8m6O6m8m3J18K3j50o2K41Jj41K3N3q8n9J89O1j85n5J46j8q4K9
$$ -109 0 95 7 -39 27 -21 -64 54 77 -73 -135 106 107 -34 -11 42 -46 -105 84 145 -40 -95 51 33 -51 -22
3721b2joqN8N5q8n7K4O5K1n4l9L9J4J6j9l0l9M4M9LQm4n1M1Q5j2j00JQ7j2JQm9
$$ -22 -23 -29 -37 21 76 -12 -69 -45 20 41 -13 -52 -13 1 17 -2 -32 -71 -27 22 25 33 -11 -62 -21 64 52 -48 -47 40 28 29 37 -12
3755a2p5N1J13np1l0J6jM7l1m5J9M2O2l8k4l9l3L3M1K6p8nN6K7k2p6J0M7J4K7
$$ -12 -87 -36 77 72 1 -29 -13 -14 33 2 -43 -24 18 80 42 18 -21 -54 -21 20 46 -32 -37 19 46 24 -52 -42 5 19 46
3786D6M3j06n2N0Q7m4l1%L8kQK0j07m3N7J18n1Qm1rMJ0M4r7jQ0M0o1nj5j06O2
$$ 46 89 -17 -69 -19 68 24 -7 -7 31 29 37 57 -50 -93 -36 82 31 39 -2 -11 -7 3 47 -50 -51 29 69 8 3 -12 -118 -56
3818e6J18Pj17K7O9m3Ok4j5o6J02O9kj13mpP1nm2J3K0J3rM9p0p9J6J36pj16N9
$$ -56 62 69 -48 -21 48 5 11 -13 -28 -94 8 77 75 -38 -42 -49 22 17 -25 -12 8 21 12 61 -9 -88 -72 64 57 -59 0
3849@K3o4L0O5l3j07N9J13n5k5k1pk4R2M0j40K7K9L7n4K4jj01J11J13o6j08PJ2
$$ 0 23 -41 -11 54 21 -86 -27 86 31 6 -15 -22 -46 46 86 -54 -27 2 39 -15 9 8 -93 18 131 65 -43 -36 -24
3878b4l9O8P8q6m1J05O3j35k6Mp1Q0J25k7r9j5R2n5RK4m5l1R4K0o5m2ONJ5Q1o0
$$ -24 -63 5 83 -3 -44 61 124 -11 -37 -33 -104 -24 101 74 -25 -40 52 -3 6 30 -15 -46 48 68 3 -39 -33 -28 -13 68 8
3909Hq2P1R4q7j0L8q3p5J86R3k11qJ21l9q7J02K7j24J9J40l1j24J0L4J7N5N7j00
$$ 8 -74 -3 91 4 -6 32 -51 -126 60 153 -58 -66 55 16 -71 31 58 -66 -47 93 62 -62 -52 -18 -1 54 111 11
3937A1j00O9M1m2M0K2r3M1J53j09j32R6L6m9N1L3p2q4J14J07j32p8Q0kJ2M7J2
$$ 11 -89 -20 21 -21 19 41 -52 -11 142 33 -99 -3 33 -16 35 68 -4 -88 26 133 1 -77 3 1 13 60 72
3964G2j08j4P2QQk5n0J8J09j7j25jN9m6K9Q1lj55J6J62p2o6N4K4p5O1P2p8j61
$$ 72 -36 -50 22 30 38 13 -37 -19 90 73 -52 -53 6 -40 -11 70 67 -88 -72 90 18 -48 6 30 -45 16 88 10 -151
3993a51J31R7q6kN7l1j02Q1O5q5j03J32R9o2p3O5m8nL7O5j7j22NR3L1q6q0Q9R0
$$ -151 -20 77 -9 -11 46 15 -87 -6 59 -26 -129 3 102 40 -33 32 -16 -21 16 81 64 -58 -53 40 71 -15 -95 -6 84
4022H4o3l0P3l5j39Q3J61j07j51J31J21j11q0J30m2j55Q2J78o2j12k3J06l5jk
$$ 84 21 -9 64 29 -110 -27 134 27 -124 7 128 17 -63 67 25 -130 -48 130 68 -44 -67 39 4 3 1
4047Am0K7M3J1k1jp7oP7J01j01n8O2mo3N1M0j09J3J42N3k00mJ30o5j01J81J5j73
$$ 1 -39 -12 31 42 21 20 -57 -63 14 115 14 -44 18 14 -49 2 42 -67 -54 88 141 -59 -63 67 2 -99 82 97 -76
4076g6K9J67o5j37L5J02p3j7J19J6j42p3J32N0p3o9R2Q0m5o4nL9j07k6K16P0k44
$$ -76 -47 120 55 -82 -47 55 -18 -35 84 100 -42 -115 17 67 -6 -75 17 97 52 -12 -17 22 -85 -111 105 175 -69
4103f9q1K80Mk92R5K16j39j49K56P9l43m0L12pk34J01J31j56k3J41mj92P6J00
$$ -69 -150 130 134 -158 -63 153 14 -135 121 200 -143 -183 129 122 -112 -11 120 -36 -59 82 78 -114 -38 62
4127F2m5K0j1m7mO3m1k3R0n2r9J64R2k43o2K21nj98J72J70k83j49L27lk76L9K89
$$ 62 17 37 26 -21 -25 38 -3 -26 64 12 -87 77 169 -74 -136 85 80 -118 54 224 -59 -208 119 116 -160 -121 168
4154A68j27j38J77Rk17j1K31k9r2pJ2K3L3l0n9N4N7j43J23J46k17j61K46J59l15
$$ 168 41 -97 80 89 -128 -139 92 63 -29 -36 -24 -1 32 2 -57 -3 54 -89 34 180 -37 -198 48 207 -108
4179a08n4L13p0k80K03K56l71j79M21K6k80M6K30j67j45K32L7k08NK02J0r9j3
$$ -108 -162 151 81 -199 4 260 -111 -290 131 157 -123 -77 153 -14 -159 73 110 -98 -93 109 119 20 7
4202Go0PR6l8k2N8k8j03J00J19j86j24K86K2k48P7K01k13j46K80J03l25LK87p7
$$ 7 -53 -46 50 12 -10 48 20 -83 17 136 -50 -174 112 134 -114 -37 164 -49 -195 85 188 -137 -134 153 76
4227G6k06J25J06j79l9J99L4j45k0J8J5N8n4n5J03O7j39j4J61j19j89J95K18k37
$$ 76 -130 -5 101 -78 -117 82 116 -29 -49 -31 -16 42 -12 -67 36 103 -36 -50 111 -8 -197 -2 216 -21
4251b1j02K30Rk70J11K10k04j59K79J21k63m2J40nj40J37R9j30m3P7Nl0o0qR3
$$ -21 -123 107 116 -154 -43 167 -37 -196 83 204 -59 -101 39 34 -106 31 130 0 -43 34 39 9 -51 -59 34
4276C4O5r5J5N4p3j47J69Q2j25j16K30O6k36mJ50r5j41K46J16k57r2K41lj71O4
$$ 34 99 4 19 73 0 -147 22 104 -21 -137 93 159 -77 -81 69 -26 -167 79 195 -62 -154 87 84 -87 -23
4301b3Q7q2o6J63M6j37p8O9L8N1o3j8O7L1j33M3P6j03r7J86J29k24o9J48N7j93
$$ -23 64 -18 -84 79 125 -12 -90 -21 17 68 5 -13 54 85 -48 -5 71 -32 -129 57 186 -38 -107 41 98 -95
4327i5P7J33j53n3J28R7j27j24Q3O9j9qN3l1p7j2O7M6q9k5J04Q9j62l9R0n3p1
$$ -95 -18 115 -38 -91 37 134 7 -117 -34 35 16 8 61 30 -47 -59 8 54 -35 -60 44 133 -29 -68 22 -31 -102
4354a02J27J18j49j26J64M5j55M2Q7m4n9J23M0j43q8J08N9m7k1oJ6K6JK5l8n0
$$ -102 25 143 -6 -132 32 77 -78 -36 51 7 -52 71 111 -32 -120 -12 47 0 -21 -27 -11 15 16 41 3 -47
4380d7j1R9P1j44l2R7L4j04LJ11j27o1J77P4j49p7Q4K2l7M4L8p1o2O0M8k0n4k0
$$ -47 -58 41 112 -32 -64 33 67 -37 -34 77 -50 -111 66 140 -9 -86 -2 20 -17 27 65 -6 -68 -8 40 20 -34 -54
4408e4O7O3q9k4O1j6p3Q8P8j19r8J62Q2j62m3J11k4r2J20O0j26k4J02Jo5m5L6
$$ -54 13 76 -13 -37 24 8 -65 23 101 -18 -116 46 128 -34 -77 34 10 -82 38 98 -28 -52 50 51 -14 -59 -23
4435b3j4L6M4J4m8n9pM8Q0n8p7J07L9p2n6O1Qq9R8Q4j21p3O3M5k6pK5l9m6J09
$$ -23 -37 -1 43 57 9 -50 -57 -9 71 13 -64 43 82 10 -46 15 23 -66 32 116 -5 -78 -15 30 4 -3 22 -17 -63 46
4465D6N8j08n1M7K1J0qn1NN8k6RL5m4r7Q1J08m8j56J15O7j38K6J66j03j16J25
$$ 46 104 -4 -55 -8 13 23 15 -36 -31 27 1 10 45 1 -96 -15 93 45 -111 4 71 -67 -41 125 22 -94 31
4492C1Q3j12j11J10P1p2N7N0j13n1K7P6kn3JJ5O8m7p1J8L6m0J1J28q9j12R5Q7
$$ 31 114 2 -109 1 72 0 57 107 -6 -57 -30 46 44 -9 -8 7 75 28 -43 -25 11 -29 -18 110 21 -91 4 91
4520I1p6j01R7Qr7J01J09j03j11P4R1j38L8O8l9m3K3P6j16mL6K2P6l4r1lQ3l9
$$ 91 15 -86 11 19 -78 23 132 29 -82 -8 83 -55 -17 51 12 -31 -8 68 -48 -52 -16 6 82 48 -43 -46 37 -2
4548bo5J10L1j47P0J60j20j79J07J14q2j9J24o1j79Q7J65p7j22P8P2n5j6M1n1
$$ -2 -67 43 74 -73 -3 157 37 -142 -35 79 -3 -22 102 41 -138 -51 114 37 -85 -7 65 10 -6 35 -16
4573a6l3J6L7K9l1l6J7R3k1j05jO0l7lJ01Kj74K8J51o7r1R6M8j25N4J00j17j10
$$ -16 -49 -33 4 33 2 -34 -17 76 55 -50 -51 9 -28 -31 70 72 -102 -74 77 10 -81 15 63 -62 -8 92 -25 -135
4601a35J12J35j20k9O6n6l3P7M5q3m2R3J9n6J2k0JL0K5m9K6L2q2k4J58k3j90P7
$$ -135 -23 112 -8 -37 29 -27 -60 17 62 -21 -63 30 49 -7 5 -15 -14 16 41 -8 18 50 -32 -56 102 79 -111 -34
4629c4J46q0j21J01L7j22J5J48l5j11K1Q7kp4Lk0j8P2K0J2m1l8j6Q0Om8k4P9J6
$$ -34 112 32 -89 12 49 -73 -58 90 55 -56 -35 52 50 -24 -21 -41 -59 13 33 45 4 -34 -50 30 36 -12 -36 43 59
4658E9j06N2K5j14j4J99lj47N1M2o3m7J20k0j31N9J60j02q5N8j7n9P6Q7q2o1R0
$$ 59 -47 5 30 -84 -98 101 98 -49 2 44 -19 -66 54 34 -97 -38 122 20 -65 -7 -24 -83 -7 80 -2 -63 27
4685B7L8j09M3m4M2oP7l2j7Lj7j2J9j0k7MR2or1K0J1p3K7J23m5q8L0M9m9J0Jl4
$$ 27 65 -44 -1 -45 -3 -9 68 36 19 22 5 -7 12 2 -25 -21 71 65 -26 -6 5 -68 -41 82 37 -51 -21 28 -21 -11 -10 -44
4717d4LJ12j7p0rM5o3%J02l1m3pJ00m3p2RN9p1O7J10j10r4M9K7l9K0O0n0JN3K5
$$ -44 -41 71 54 -16 -25 20 -43 -43 59 28 -15 -22 78 35 -37 -28 31 -40 27 137 27 -67 -18 9 -30 -10 50 0 1 54 79
4748G9j15j2J4O4rNK6m5k0M0J1p1j1M0M6K2j1q3k4M2K8j9L3o4k3O7K8p4j1L3J0
$$ 79 -36 -48 -34 30 21 26 52 7 -13 27 38 -33 -44 -4 42 64 53 -30 -54 -12 16 -3 30 -34 -57 10 38 -36 -47 -14 -4
4779dK9RK3p1o4Q9J8l9NL9l1lN3m6r7K2J19ml1PLo0K9P9o2r0Q5O0k4n3J5m1l1
$$ -4 25 34 57 -14 -78 11 29 -10 -5 34 3 0 53 7 -90 -68 51 47 16 23 26 -34 -5 74 12 -78 7 67 43 -10 5 -36 -67
4812f7J14K0m7n0N3k0j5%L3m5jO6M0p3l2lJ7MoK7K8m3j9N9Oj17j9J39M8q6l0M6
$$ -67 47 67 20 -30 23 3 -12 -12 21 -24 -25 41 81 8 -24 -27 -10 -6 -12 15 43 0 -19 40 46 -71 -90 49 97 11 -19 27
4844B7n7n9J34L6j14m1J40K7j27OM9m4k2J02Rj19RP5k1j3K7k2m0M9R6j06n2J4
$$ 27 -30 -89 45 81 -33 -74 66 93 -34 -28 21 -23 -45 57 66 -53 -44 31 10 -3 24 2 -38 11 107 1 -51 -37
4872c7K0L6K3j0p3N7L6o7qK6Ro5R3P2r0j05R6J0k2J4N5q7nO0L2q1q7P6L6K3J5
$$ -37 -17 19 42 32 -41 16 52 -15 -23 3 12 -53 40 112 22 -83 13 23 1 15 70 -17 -22 38 70 -11 -98 -22 14 37 52
4903E2l5j2K8l9J7K0m6k9Q5P4j24n6O8M3r5P8Q4j02j02J16O9j24m0J20j2r6R3
$$ 52 17 5 33 -6 11 31 -15 -44 41 115 -9 -65 3 46 -49 29 113 11 -91 25 94 -30 -70 50 38 -58 35
4930C5N6j07o2P8O0q2j1Q1j4k6M7k1q6k2O6N1J2m1m2lM6qlPl3RM7jm1r5J04L2
$$ 35 91 -16 -78 0 60 -22 -33 48 34 8 55 34 -52 -74 -8 43 55 14 -28 -31 15 7 4 11 -22 -13 34 33 -8 -103 1 33
4962C3k5kJ6l8k2N0Mm1k5M4N3k4k4k1qrRM8pOn2O8M6o0q1L9K2K6mRNr9N1O8mj11
$$ 33 8 6 22 -16 -38 12 16 -25 -50 -6 47 23 -1 -22 -30 -39 -30 18 11 17 -35 33 79 19 -62 -23 -1 25 21 30 35 -64 -13 55 51 -60
4998f0P1N6m1l4J7l7p4J10J00p6j00Q7J0o1J2Q7o4o9O9M6m9q4P2P%kO3m8p7N6
$$ -60 11 67 26 -8 9 -28 -102 8 108 32 -68 19 29 -32 -20 67 3 -66 3 49 0 -84 -12 -5 -5 -7 56 8 -69 -13
5028a3Q5l5n5m6Q5L7m1J2j6m1MJ9K7k6o2P6P1q3rPl1j2P9M3p6l0L1Pj4J8nl7M0
$$ -13 72 37 -18 -64 21 58 17 29 13 -28 -24 -5 22 -4 -66 10 81 -2 -11 -4 -35 -47 32 75 -1 -31 0 7 -7 11 6 -31 9
5061IM1j4q5K9L%J5K8n3lL4k6j0L5K7p8L1R1k7j16L5O4n5MM1jn3J5R6o1q3K9P1
$$ 9 50 36 -49 -20 -17 -17 -2 26 -27 -30 4 -22 -32 3 30 -48 -17 74 47 -69 -34 30 -25 -21 20 19 -34 -19 77 16 -67 -38 33
$$ [...]
8191C0
##END NTUPLES=NMR FID
##END=
