##TITLE=1H_LY-857.60
 CCll4, 8 sc, 
 26.7.2019
##JCAMPDX= 6.0         $$ Bruker NMR JCAMP-DX V2.0
##DATA TYPE= NMR FID
##DATA CLASS= NTUPLES
##ORIGIN= UXNMR, Bruker Analytische Messtechnik GmbH
##OWNER= root
$$ XWIN-NMR		Version 3.5
$$ Fri Jul 26 14:19:15 2019 Russian Standard Time (UT+4h)  she@DPX200
##.OBSERVE FREQUENCY= 200.13155
##.OBSERVE NUCLEUS= ^1H
##.DELAY= (6, 6)
##.ACQUISITION MODE= SIMULTANEOUS
##.ACQUISITION SCHEME= undefined
##.AVERAGES= 8
##.DIGITISER RES= 18
##SPECTROMETER/DATA SYSTEM= spect
##.PULSE SEQUENCE= zg30
##.SOLVENT NAME= CDCl3
##.SHIFT REFERENCE= (INTERNAL, CDCl3, 0, 15.7039)
##AUDIT TRAIL= $$ (NUMBER, WHEN, WHO, WHERE, WHAT)
$$ ##TITLE= Audit trail, XWIN-NMR		Version 3.5
$$ ##JCAMPDX= 5.01
$$ ##ORIGIN= Bruker BioSpin GmbH
$$ ##OWNER= she
$$ F:/spectra/data/she/nmr/H-F/1/audita.txt
$$ ##AUDIT TRAIL=  $$ (NUMBER, WHEN, WHO, WHERE, WHAT)
(   1,<2019-07-26 14:17:58.78 +0400>,<she>,<DPX200>,
      <created by zg, POWCHK disabled, PULCHK disabled
       configuration hash MD5:
       00 E9 B6 7A A2 85 ED C7 34 08 36 98 17 FE 4E 26
       data hash MD5: 16K
       E7 5D E3 CF 44 41 92 E8 EF 94 0E 8D C4 E6 26 7F>)
$$ ##END=
$$ 
$$ hash MD5
$$ 15 92 81 EF 46 A3 28 69 4D FC 01 4E A4 AC 98 8D
##$RELAX= 
##$RELAX= 
##$RELAX= 
##$RELAX= 
##$RELAX= 
##$RELAX= 
$$ Bruker specific parameters
$$ --------------------------
##$DU= <F:/spectra>
##$EXPNO= 1
##$NAME= <H-F>
##$PROCNO= 1
##$TYPE= <nmr>
##$USER= <she>
##$AMP= (0..31)
100 100 100 100 100 100 100 100 100 100 100 100 100 100 100 100 100 100 
100 100 100 100 100 100 100 100 100 100 100 100 100 100 
##$AQSEQ= 0
##$AQ_mod= 1
##$AUNM= <au_zg>
##$AUTOPOS= <>
##$BF1= 200.13
##$BF2= 200.13
##$BF3= 200.13
##$BF4= 200.13
##$BF5= 200.13
##$BF6= 200.13
##$BF7= 200.13
##$BF8= 200.13
##$BYTORDA= 1
##$CFDGTYP= 0
##$CFRGTYP= 5
##$CHEMSTR= <none>
##$CNST= (0..31)
1 1 145 1 1 1 1 1 1 1 1 1 1 1 1 1 1 1 1 1 1 1 1 1 1 1 1 1 1 1 1 1 
##$CPDPRG= <>
##$CPDPRG1= <>
##$CPDPRG2= <>
##$CPDPRG3= <>
##$CPDPRG4= <mlev>
##$CPDPRG5= <mlev>
##$CPDPRG6= <mlev>
##$CPDPRG7= <mlev>
##$CPDPRG8= <mlev>
##$CPDPRGB= <>
##$CPDPRGT= <>
##$D= (0..31)
0 1.2 0 0 0 0 0 0 0 0 0 0.03 0 0 0 0 0 0 0 0 0 0 0 0 0 0 0 0 0 0 0 0 
##$DATE= 1564136278
##$DBL= (0..7)
120 120 120 120 120 120 120 120 
##$DBP= (0..7)
150 150 150 150 150 150 150 150 
##$DBP07= 0
##$DBPNAM0= <>
##$DBPNAM1= <>
##$DBPNAM2= <>
##$DBPNAM3= <>
##$DBPNAM4= <>
##$DBPNAM5= <>
##$DBPNAM6= <>
##$DBPNAM7= <>
##$DBPOAL= (0..7)
0.5 0.5 0.5 0.5 0.5 0.5 0.5 0.5 
##$DBPOFFS= (0..7)
0 0 0 0 0 0 0 0 
##$DE= 6
##$DECBNUC= <off>
##$DECIM= 24
##$DECNUC= <off>
##$DECSTAT= 4
##$DIGMOD= 1
##$DIGTYP= 9
##$DL= (0..7)
0 120 120 120 120 120 120 120 
##$DP= (0..7)
150 150 150 150 150 150 150 150 
##$DP07= 0
##$DPNAME0= <>
##$DPNAME1= <>
##$DPNAME2= <>
##$DPNAME3= <>
##$DPNAME4= <>
##$DPNAME5= <>
##$DPNAME6= <>
##$DPNAME7= <>
##$DPOAL= (0..7)
0.5 0.5 0.5 0.5 0.5 0.5 0.5 0.5 
##$DPOFFS= (0..7)
0 0 0 0 0 0 0 0 
##$DQDMODE= 0
##$DR= 18
##$DS= 0
##$DSLIST= <SSSSSSSSSSSSSSS>
##$DSPFIRM= 0
$$ [...]
##$SUBNAM2= <"">
##$SUBNAM3= <"">
##$SUBNAM4= <"">
##$SUBNAM5= <"">
##$SUBNAM6= <"">
##$SUBNAM7= <"">
##$SUBNAM8= <"">
##$SUBNAM9= <"">
##$SW= 24.9336996594482
##$SWIBOX= (0..15)
0 0 2 0 0 0 0 0 0 0 0 0 0 0 0 0 
##$SW_h= 4990.01996007984
##$TD= 16384
##$TD0= 1
##$TE= 0
##$TE2= 300
##$TE3= 300
##$TEG= 300
##$TL= (0..7)
0 120 120 120 120 120 120 120 
##$TP= (0..7)
150 150 150 150 150 150 150 150 
##$TP07= 0
##$TPNAME0= <>
##$TPNAME1= <>
##$TPNAME2= <>
##$TPNAME3= <>
##$TPNAME4= <>
##$TPNAME5= <>
##$TPNAME6= <>
##$TPNAME7= <>
##$TPOAL= (0..7)
0.5 0.5 0.5 0.5 0.5 0.5 0.5 0.5 
##$TPOFFS= (0..7)
0 0 0 0 0 0 0 0 
##$TUNHIN= 0
##$TUNHOUT= 0
##$TUNXOUT= 0
##$USERA1= <user>
##$USERA2= <user>
##$USERA3= <user>
##$USERA4= <user>
##$USERA5= <user>
##$V9= 5
##$VALIST= <valist>
##$VCLIST= <CCCCCCCCCCCCCCC>
##$VD= 0
##$VDLIST= <DDDDDDDDDDDDDDD>
##$VPLIST= <PPPPPPPPPPPPPPP>
##$VTLIST= <TTTTTTTTTTTTTTT>
##$WBST= 1024
##$WBSW= 4
##$XGAIN= (0..3)
0 0 0 0 
##$XL= 0
##$YL= 0
##$YMAX_a= 152126
##$YMIN_a= -154113
##$ZGOPTNS= <>
##$ZL1= 120
##$ZL2= 120
##$ZL3= 120
##$ZL4= 120
##$ABSF1= 10
##$ABSF2= 0
##$ABSG= 5
##$ABSL= 3
##$ALPHA= 0
##$AQORDER= 0
##$ASSFAC= 0
##$ASSFACI= 0
##$ASSFACX= 0
##$ASSWID= 0
##$AUNMP= <proc_1d>
##$AZFE= 0.1
##$AZFW= 0.1
##$BCFW= 1
##$BC_mod= 2
##$BYTORDP= 1
##$COROFFS= 0
##$CY= 11.3945322036743
##$DATMOD= 1
##$DC= 2
##$DFILT= <>
##$DTYPP= 0
##$F1P= 20.1537800932815
##$F2P= 0.134698688090026
##$FCOR= 0.5
##$FTSIZE= 0
##$FT_mod= 4
##$GAMMA= 1
##$GB= 0.15
##$INTBC= 1
##$INTSCL= 1
##$ISEN= 128
##$LB= 0.24
##$LEV0= 0
##$LPBIN= 0
##$MAXI= 10000
##$MC2= 0
##$MEAN= 0
##$ME_mod= 0
##$MI= 1.114404
##$NCOEF= 0
##$NC_proc= 0
##$NLEV= 6
##$NOISF1= 3.799351
##$NOISF2= 2.8
##$NSP= 1
##$NTH_PI= 0
##$NZP= 0
##$OFFSET= 15.70392
##$PC= 1
##$PHC0= -9131.853
##$PHC1= 14.80097
##$PH_mod= 1
##$PKNL= yes
##$PPARMOD= 0
##$PSCAL= 0
##$PSIGN= 0
##$REVERSE= no
##$SF= 200.130013532006
##$SI= 16384
##$SIGF1= 3
##$SIGF2= 2
##$SINO= 400
##$SIOLD= 16384
##$SREGLST= <1H.CDCl3>
##$SSB= 0
##$STSI= 0
##$STSR= 0
##$SW_p= 3612.71676300578
##$SYMM= 0
##$S_DEV= 0
##$TDeff= 0
##$TDoff= 0
##$TI= <>
##$TILT= no
##$TM1= 0
##$TM2= 0
##$TOPLEV= 0
##$USERP1= <user>
##$USERP2= <user>
##$USERP3= <user>
##$USERP4= <user>
##$USERP5= <user>
##$WDW= 1
##$XDIM= 8192
##$YMAX_p= 0
##$YMIN_p= 0
$$ End of Bruker specific parameters
$$ ---------------------------------
##NTUPLES= NMR FID
##VAR_NAME=  TIME,          FID/REAL,        FID/IMAG
##SYMBOL=    X,             R,               I
##VAR_TYPE=  INDEPENDENT,   DEPENDENT,       DEPENDENT
##VAR_FORM=  AFFN,          ASDF,            ASDF
##VAR_DIM=   8192,          8192,            8192
##UNITS=     SECONDS,       ARBITRARY UNITS, ARBITRARY UNITS
##FACTOR=    0.0002004,     1,               1
##FIRST=     0,             0,               0
##LAST=      1.6414764,     0,               0
##MIN=       0,             -154113,         0
##MAX=       1.6414764,     152126,          0
$$ Real data points
##PAGE= N=1
##DATA TABLE= (X++(R..R)), XYDATA
0@%%%%%%%%Qj6J6j6J6k1K9l2M0m8N6o4P2q8J04j20J36j52J73j97K21k50K82l14
32a65L52l94M38m89N43o02O69p42Q21r08J004j108J226j364J519j694J897k133
50a130K414k753L175l714M422n403O843r158J3429k3608Q3699M9476k71805J89553
64C5440O6760k39879J54153R9917k16614R8640P9704j60002Q0990P2534j22387
75e0744N3419K9861q2914O4938J8589o8774N3427n385n2903N9617j03m4900M1359
88A5487p450l3194L0815N348j3087L021o145R673p867q719L4473k0477k8787M9475
102B2566j8885l7653O2427j3345n2549N6205n465m7422N3651l416m4333M2996
114A4777q082l1838M3992j3724k4492M1043k7281j8712N2962l0285k2763N4398
$$ y = [0, 0, 0, 0, 0, 0, 0, 0, 0, 8, -8, 8, -8, 8, -13, 16, -16, 24, -24, 32, -32, 40, -48, 56, -64, 72, -80, 93, -104, 117, -133, 149, -165, 187, -207, 231, -258, 285, -317, 352, -390, 431, -477, 527, -581, 645, -719, 800, -894, 1003, -1130, 1284, -1469, 1706, -2008, 2414, -2989, 3854, -5304, 8125, -15483, 68216, 117692, -154113, 35440, 102200, -137679, 16474, 116391, -100223, -1583, 78121, -81881, -891, 71643, -50744, 2675, 32536, -50378, 14560, 33149, -35625, 17802, 12417, -40486, 19131, 19028, -25872, 15487, 8037, -25157, 5658, 11006, -2081, 940, -5205, 4468, -3399, -12118, 22355, 1878, -26909, 22566, 3681, -33972, 28455, 15110, -37439, 18766, 13301, -34121, 19530, 16114, -28219, 14777, 6695, -25143, 18849, 5125, -19367, 21676, -5605, -24317, 28645, -1640, -24403, 29995]
126B9995l3986k7744O1088k4739l3441N4393j9995l7822M9677m389l4600L2718
138A1155k314k8093K4208M387j7322J1700j198r138P974j294J096M088j0609L018
152b342O882r255O193N816j3679M174P261r866N451N781j0683K721L814n988O249
167B529J180q107N451J54n879Q106l63p682O632o17o588P832Q40p000M308J08
183I04l953M695k24k866K785k276p68L912l063L25L711n761K51O156n071o34N849
200C972n520j723O710l673k304N761l085l439M850n83k417K704p44k104J656N45
216F06n78J57j18l6o23N0J624p16j158J239p26p17K125o25j454J533n23j137J788
235G11r5j214R54m45p96J479j08r08O08k87l99Q01j18k57L01m63j00M78o9J24
$$ y = [29995, -3991, -31735, 29353, 4614, -28827, 25566, 5571, -32251, 17426, 13037, -21563, 11155, 8841, -19252, 4956, 9343, -7979, 3721, 2523, -6615, 1359, 65, 1161, 5249, -5360, -2342, 4540, -4715, 1478, 7294, -6385, -2211, 5050, -4816, 635, 6416, -4267, -1546, 2268, -3720, 2529, 3709, -4398, 1053, 1207, -4672, 3434, 3071, -4611, 2021, 1404, -5184, 2648, 3488, -3512, 796, 904, -3049, 1646, 1422, -1444, 1341, -935, -1703, 2209, -854, -529, 3182, -2579, -2328, 3828, -1243, -1877, 3972, -1548, -3271, 3439, -234, -2538, 3223, 138, -3301, 1549, 966, -1451, 1253, 509, -1595, 61, 606, 28, 185, 67, 31, -592, -542, 1082, 366, -792, 447, -279, -996, 1129, 504, -950, 583, 60, -1077, 711, 616, -598, 356, -89, -885, 594, 486, -422, 186, -101, -500, 301, 183, -74, 227, -236, -336, 142, 73, 197]
255A97p0n52L20K96l88L89R2p15L84K44n12N33K15q00J60M63l87J48L29n23k4
276b01L55j96oK55j75k06Q8J55J6p4Q2j22j97L24M8k43J81Pl36K17J97k45R8J08
300A30k98P7K89k07o3J59j53l9J44Ln4O9q2r3Q8J01l7m7J4J9q4J03O0j27RL6o3
327d6L3J35j20n1M8Kk1P4m7l5O4m7l0P8Mo7rM8J3J8j8l4J0jK0j9L1m8J7n0N0K1
359B3j6J8k5oj0K2j3PK0k2pK9j4J2k6Mk1N3m2k1K5J6OJJ4Km9J5j6k1L9J4l9J2
393a6K4Ok4K2l3M6j4nj5L5k9OJ0oj9L1J7l0j7KL8n9N5j9nL1l7J8J0j6Jj2K5j4
427GK6m5N2l0n7K2pK6k4K2M3k0j2nj2J1rjOkK4k9L8l4j3L2RNl2K9l1K1J0l4RP
463BJ1oj5J7KqJ0%l2N8p1K8j2K9J2k8K0j5j5PJ3Oj3K1l6j2K5K4j8jJ2m4L3J8q
$$ y = [197, 127, -425, -105, 191, -197, 192, 284, -431, -47, 197, -315, 218, 433, -367, -207, 256, -131, 17, 346, -177, -201, 154, -42, -48, 207, 32, -174, -86, 69, 85, 11, 93, -29, -226, 98, 146, -97, 84, 91, -245, -28, 169, -76, 22, 130, -168, -91, 198, -9, -72, 87, -66, -105, 39, 42, -12, 57, -25, -118, -30, 71, 34, -13, 1, 20, -64, 39, 99, -28, -19, 17, -46, -13, 122, 2, -49, -1, 1, -20, 54, 7, -28, 36, -11, -41, 37, 41, -26, -35, 13, 26, 44, 26, -8, 2, 1, 21, 2, 33, -15, 2, -48, 2, 23, 7, 25, 0, -6, -16, 6, -7, 0, 20, -2, -9, 20, 6, 18, -8, -4, -25, 28, -14, -35, -10, 6, 12, 13, 27, 29, -20, -5, -21, -42, -3, 11, -28, -16, 8, 14, -10, 12, -21, 25, 11, 6, -9, 26, -3, 3, 13, 7, -12, 19, 36, 6, -11, -9, 29, -30, 25, 6, 1, 32, -5, 13, 23, 7, 8, -4, 21, 7, 33, -12, 40, 10, -47, -25, -32, -6, -30, -8, 35, 15, 3, -2, -14, -3, -12, -13, -7, -9, 15, -14, 24, -10, -23, 9, 18, 23, -9, 20, -11, 10, 20, -14, -5, 2, 13, 7, -8, 9, 11, 3, 13, 13, -19, 39, -32, -4, -16, 13, 25, -3, 17, 2, -13, -6, 7, 13, 0, 21, -15, -27, -2, 22, 4, 3, 15, -29, 4, 22, 14]
498A4Pn0K4J2ro%lJ1J6k0oM4k2jk0L4K8l6jk9QLPK4k0k7J1J0ll1LRL7l2J6Nj4
536gJ5QpoLnJ7%MnLo5M4j1j4J2JlL7kn4L7k3j4K3j7K8J6oml5lL6j3mJ2k7NK3j1
576a2K5omJ9j3Jj6mMM6l2j4K4j3JKj5J1j6jJ8Mj3j6L1j5KJ4l0PlJ0J6l1PMoOK0
615A2j7JoPK3j8k5L9rKLqJ5rmJ7m7JMK7Ql0PqJ8lJ0qLJJ2j0j7L4k5J6JK5l6oL
656Cj5M6m5PpK1J1k9j4J7%KkjlJ4J0N%k0k1L3j0Pk6k1N1nk5nK6Mj4j1L3l2K4L
694A1Nll0M5k1J0pJ3j9j9J2MKKjnk3K5j1L0j1oK4k3J2j4O%j9JrpP%J5kk8O0m0
733a4oK2rLnQL7l9k1OJ3oJ0oj1NpQK2j9pM1j0l2J6NK%rL7l2j3J0J8j8j2RlJ5j5
773gJ4M5n9J7j7K7j8K7k0Rj6j6L9l1J7pJ8j6JmPl2K0QK3k4qjL3k6l9K1j4K3J2
$$ y = [14, 21, -29, -5, 7, -2, -8, -8, -11, 0, 16, -4, -10, 34, 12, 11, -9, 25, 53, 17, 16, -13, -5, -2, 5, 29, 9, -18, -7, 3, 0, -31, -28, -19, 18, -14, 2, 7, -7, 8, 16, 9, 3, 6, 1, 18, 18, 22, 17, 20, -45, -1, -12, -26, -14, -13, -16, 21, 19, -35, 2, -21, -35, -12, -29, -1, 15, 9, 5, -30, -33, 3, -10, -14, -2, -29, -24, -1, -12, 13, 7, 3, 22, 9, 10, -6, -10, -6, 40, 8, -6, 18, 5, 6, 8, -7, 4, -12, -13, 5, 9, -4, -20, 11, -4, -2, 12, -18, -11, -14, -4, 12, -19, -12, -8, -14, -8, 12, -5, -4, -10, -3, 20, 2, -23, 16, 7, 9, 12, 4, 19, 10, 6, 23, -24, -23, -19, 8, 16, -14, -7, -15, 3, 0, 10, 2, 5, 6, 18, 8, -9, 25, 0, 16, 17, 42, 6, 0, 3, -12, 34, -11, -4, -11, 10, 21, -8, -22, -5, -5, -3, -5, -6, -9, 5, 15, 20, 20, 0, -21, 12, 2, 9, -17, -38, 13, 8, -17, -22, 4, 8, -6, -17, 16, -16, 8, 11, 16, 13, -17, 28, 7, 17, 10, 23, 4, -15, -3, 1, 3, 5, 4, -1, -24, 1, -10, 20, 9, 3, 27, 4, 16, 2, 8, 8, -11, -10, -19, -26, -19, -19, -4, -6, -34, 26, -14, -20, 2, -7, -4, -9, -1, 36, -3, -24, -18, -5, -11, -1, -7, -18, -13, -20, -12, 10, -9, -16, 25, 15, -17, -1, 4, 6, 6, -3, 34, 2, -11, -1, 17, -1, -13, -4, -7, 8, -7, 7, 52, -7, 10, -7, 20, 2, 29, 9, 18, 2, -14, 25, -6, 11, 4, 22, 6, 7, 3, 10, -22, -2, 6, 29, 5, -3, -4, 29, 3, -36, -15, -29, -6, 6]
808FJ4m7K1J5k2J3Nlj7K0J9k4rK0j2K9j6jnj8J4j4L5jl5KJ0j6O6j9%l5j6L0J7
843B6Jl4j1J2J5qK0m5OOLK2l2K1mK7m2KJ6l7M6l0L1Jmj8J4l5N4k9l2K9Qj2J3J3
879A3lj9J7Qj2jj8K2rJ2j6K0pj5K6Qk8l1J4K0J8Jj4J6k5Pk4J4L8l0J0l0L0k9L1
914A4j2m3L6K2k0k6M5ql0K9j2qK2k5K1qPk0J4qK7l4J1L3m9J9oJ5Qj7nJ1J2j7o
949hK4Oj1oJ3k7J5J7k0K3Km6J1K4j1j8NOrMK6m4M4rj5Oj3J8K3k3n4K5K5J5j9k
985cKpj3L1k9J9Ok0RlJ1lRjjloJ1LmJ5ql0kK4J5k0oJ8l5J5L2l5KLRj3J1MJ9m6
1026b0J4LpqL4okk7Nj7L3L0m4L2j7Mj5Ojjj7J2J8j6jJ3j4J9kMm1M6pkL3l3J3l9
1064a8L5Mj7J0MK2l9J9%l0J1pKlkJJ1Jk4M6k9lMj2J9JQl0mPJMm%RJ8k9Jk8M9k1
$$ y = [6, 20, -27, -6, 9, -13, 0, 5, 2, -15, 5, 24, 0, -9, 11, -1, 28, 12, 11, 6, -12, 2, -12, 23, 22, -13, -11, -1, -17, 49, 30, 30, -5, -21, 9, 26, 27, -7, -18, -6, 9, 1, 21, -24, -18, -12, -9, 13, -19, 2, -2, 25, -17, -15, 1, -36, 10, -20, 11, 12, 8, -10, 4, -31, 23, -6, -38, -9, -1, -13, 0, 13, 10, -9, 8, 16, 4, 3, -15, 7, -2, 10, -6, 14, 7, -8, 18, 26, -2, -33, -19, 1, 19, 20, 6, 22, -3, 4, -20, -6, 32, 2, 12, -18, 12, -17, 14, 2, -41, -5, 17, -3, -29, 16, 8, -22, 7, -5, -13, 9, -16, 5, -3, 4, -16, -2, -10, 17, -17, -6, 27, -22, -3, -9, 6, 14, -3, -8, 3, 15, -2, -8, 16, 22, 11, 5, 18, -9, 6, 23, 3, 26, 28, -18, -7, 17, 6, -12, -7, -1, -10, -6, 20, -24, 20, 11, -4, 2, -11, 7, 30, 7, -47, -22, 3, 18, -1, -3, -1, -8, -21, 10, -19, 0, 6, -14, -5, -8, 3, 0, 9, 8, 7, 4, -2, 9, 12, 8, 23, 15, -15, -17, 7, 22, 2, -4, 14, -21, -6, 26, -9, -7, -4, 5, -8, 3, 7, 26, -20, -6, -3, -10, -18, 16, 10, 8, -19, -14, -31, 2, 32, -12, 20, 3, 7, -8, -2, -3, -4, -21, -9, 9, -7, -8, 5, -9, 10, 8, 12, -29, 17, 10, 8, 41, 8, 21, -18, 17, 21, 4, 14, 18, 40, 1, 20, 20, -10, 1, -6, -4, -7, -9, -8, 3, 4, -20, 26, -3, -6, -2, -14, 5, 6, 14, -16, -20, -13, -12, -8, -12, -12, -3, 15, -14, -13, -41, 8, -13]
1105a3KqK9k4L1l8L0k2MK9m4M0j8%l1L2MLJ2qPLl2QmJ1k1j9OL5RPk7J0nJ4nj2
1143ek2J2J1K1Ml2K2Mk3kk4L4K7l1l1L1k1J3L4n5K0Olj9LL7%k9NLoN6m7K5l1p
1179b0K2qRJJ4l5L6Rj4Rk1lnK9J1j3j8J3Pj2j9J2k4j1K6Ml8M8k6L2k7k8M6oj9
1214a9J8mj6PJ4Mk9k2M2j3j0M2k3kj5J5J1nj2kJ1kJ6rJMJ8j5J6j6l2K6KL5k7K2
1250C1l7OK6l6k2J3K9Jjj2j0N1n5PJ3kn1N1J5l2j7J8K2kk0pK0l0J0J0j4rL4j3
1284a3J3j4J2j0mJ4j6J1oj0Qk6M5jj2nQk0J4J0pL5om8J3L1qj9K5j5L0n3K2K4k3
1319aj4OJ4l5J5kJ2J3k7J0K3k7J6Kk7J6nllOj4k2J2N8k8qK1j0Qk6K3k2K8qj3N
1355gk0RJ4k4J1K8j6omj5M2k4L1k9K6k4J1J0J7k2oJ1k7rK0K1k1%J1l1oL0LnmJ0
$$ y = [-13, -11, -19, 10, -14, 17, -21, 9, -13, -9, 20, -24, 16, -2, -2, -33, -1, 3, 6, 18, 10, 17, 20, -12, -4, -8, 3, -18, -37, -31, 4, 13, 20, -7, 3, -2, 12, 7, -5, -27, -15, -4, 17, 21, -11, 11, 15, -8, -10, -34, 0, 27, -4, -35, -4, -25, -12, 22, -33, -13, -7, -10, -29, -26, 11, 11, -18, -13, -10, -16, 40, -7, 18, -13, -20, 2, -6, 3, 4, 18, -17, 19, 28, 14, 23, 2, -1, -6, 23, 34, 21, 3, 16, 23, 11, -8, 4, -20, -31, -5, -1, -39, 9, -17, 15, -12, -40, 6, 0, -19, -1, -5, -21, -14, 0, 4, -25, -47, -5, -18, -28, 14, -9, -11, -26, -11, 0, -5, -17, -19, -8, -10, 6, -3, -2, 2, 20, 5, 21, 5, -27, -1, 1, 36, 9, 31, -6, 0, 26, -10, -32, -19, 10, 11, 10, -2, -12, 39, -16, -9, 4, 2, -49, 2, 17, -15, -32, -14, 8, 6, -14, -21, -1, -31, -21, -11, -25, -34, 0, -13, 0, -14, -2, -12, -16, -2, -18, -7, -13, -23, -15, -41, 4, 3, -9, -14, -6, -26, -12, -2, -9, 26, 20, -28, -15, 16, 8, -11, 14, -1, 29, -24, -2, 22, -1, -15, -9, 5, -30, -15, -17, -5, 8, -19, -9, 14, -13, 3, 5, -22, -6, -11, -14, -17, -11, -25, -47, -35, 23, -5, -13, 8, -2, 6, -20, 3, -19, 9, 1, -12, -7, -27, -18, -4, -28, -17, 11, -5, -11, -15, -30, 12, -12, 19, -10, 16, -8, 3, 13, 30, 8, 2, 13, -14, -23, -3, 18, -3, -3, 8, -23, -29, 1, 4, -1, -5, 5]
1391ERk3pK5Jj0k5K1k2jO0o8M3nPNk7nJ3njL4l5J1pRJ7l3LRJ1rJ9j2mK1mm8M3
1430A5j5J4Kpj1qL1j5J6k1Nj9L8m5K8j2J7J3o5O2j7qJ5qoj7K0j8L3k6PKK1l9J2
1465fMrKMJ0j0J4k5J6pRk9K3J4j2k0J5M6k8m5O4Lj5J3n2L3J2j5kPl1N5k6qRl1
1501a8L5jpm0K9K3j2j0j4j2K2J6k3J3J7l6MJ4k2J7J9j3qj7J4QJ0l7K8pOJ7k4J4
1535EJj7rJ2j4lL3K1j7n6O8k8pJ0%LJ1k3J4LlmLLK7n2L4k2nK5k2M5l1NJ1l7nJ3
1573hL7j3j9RMK0l4K2l9K0k7K1K2k8lmlL6J3j9j4Mk1K9J2j7oj3L9m8O4n4%K4o
1608@PK1k2M6o1j1J5J2JJ2l6K3oQlKk2lJ3j9lK4j0kL0l5L9k5l2M8J3k8j2QJ2j4
1644a0OPj7OMJ4j5kk9K1rM5k3J6k4JJ6j1jKnj3L2j3J9j6nJ9Ok2L4j8QJ7kk1j2
$$ y = [5, 14, -9, -16, 9, 10, 0, -25, -4, -26, -27, 33, -35, 8, 3, 10, 15, -12, -17, -4, -9, -10, 24, -11, 0, -7, 2, 19, -14, -11, -2, 9, 0, 19, 7, 3, 24, 20, -28, 15, 0, 14, 16, 9, -2, -10, 21, 6, 22, 1, 6, -13, 25, -20, 8, -4, 13, 26, -39, 23, 6, -2, 13, 5, -1, -18, 2, -16, 17, -9, -2, 0, 21, -18, -6, -2, -11, -9, -5, 5, -5, 9, -16, 0, -7, 2, -27, -4, 10, -2, -22, -7, 39, 11, -34, 30, 33, 18, 31, -21, 12, 24, 9, 7, 14, -17, 38, 12, 4, 13, -18, 17, 16, 9, -31, -2, 21, 9, -1, -15, -27, -5, 11, -12, 1, 18, -18, -14, 0, -22, -5, 14, 1, -7, -24, -10, -2, 8, -29, -1, -8, -2, 15, -9, 5, 6, -11, -20, -8, -22, -25, 8, 29, 12, -44, 24, -4, -11, -1, -1, 2, 13, -10, 4, 7, 4, 0, 3, 6, 33, -19, 15, -7, -12, 13, -9, 36, 5, 10, 21, -16, -21, -8, 29, 16, -3, 6, 10, 30, -4, 18, -21, -1, -28, -7, 15, -13, -16, -20, -23, 13, 26, 7, -7, -3, -24, 5, 17, 0, -6, -19, 20, -28, 36, -18, -18, 6, 0, 7, 28, 6, 52, -9, -20, -5, 7, 8, 20, -16, 7, 1, 9, 6, 8, -14, -17, -4, -23, -26, -2, -12, -14, 16, -19, 20, -5, -37, 11, 24, -4, -16, -8, 4, -10, -4, 3, -14, -8, -4, 10, -5, -7, -36, -15, -24, 21, -2, 14, -10, -9, 7, -4, -5, -3, -8, -21, 11, -2, 17, 1, -4, 15, 21, -1, 33, 15, 23, 40, 38, 17, 5]
1681Ek7L0L5p4L2lK6J2l4lKJ8jm9L8nJ6k6K2k7J1jK1mj5J1j7K7k1kj%kJ1nK1l0
1718iK4m8N2k6JK1k2K7OJo4P0j9k1jOL6%rk8mkM4l6K2l5L2l1J2jM2m3mJ7k9J5
1754dk1K6k6K5Komo%K1K2l6j2L1jk5QPJ5k1llK7k6K0J4l7K2mj6J2nQJ5j4ojQo
1793@mj2L6j7K8m4J9oL6oQn1J9J6Lk3J1J0Kj5J4m6L0j1Rj3J2m5J6J5kKJ5Kj1k1
1829b4K8j9J2qk2L7m7M8Oj1NpLqJ6KrLj0J4k1K4k0J8J9l7J7j3%J4rK3J5n1OjL8
1866C1pl7M4k8j5J2J2j2pk6O5k9MpL8m7J9k5K1j4K2qRk1rj1PJ8J5j1jl2K8j5j5
1901c2N7qk0OKlQjk9M5k7k7K6K5j6mnJ2j5pM0l4lJ2QrPkKkLl2K9j7K1J9k5jJ0
1940A3k1J5j4J1jj7qL0l8JK9j0K3l0j3K3j3J3J3j5OqK9kQm2L4nQmlj0kMJ4m4N4
$$ y = [5, -22, 8, 43, -31, 1, -2, 24, 36, 2, -1, 1, 19, 18, -31, 7, 2, 18, -8, 14, -13, -2, -3, 18, 14, -1, 10, -7, 20, -1, -3, -4, -4, -6, 5, 0, 21, -9, 15, -33, 19, -7, -6, 15, -7, 20, 26, 27, -37, 33, 14, -7, -8, -2, 34, 34, 25, -3, -7, -9, 35, -1, 21, -14, 18, -13, -1, -2, 40, -3, -7, 10, -19, -4, -25, 1, -25, 0, 2, -4, -8, -14, -14, 7, 29, -7, -19, 12, 11, -14, -6, 1, 16, -5, -8, -11, 16, -10, 10, 24, -13, 9, 5, -11, 1, -4, 4, 19, 5, -1, -2, 6, 0, -4, -16, 20, 3, 31, -13, 6, 0, 36, 30, 38, -13, 6, 22, 25, 2, 13, 23, 25, 10, 24, -22, 8, -3, 6, -7, 5, -40, -24, -9, -11, -9, 6, 8, -3, -24, 4, -15, -3, -11, -33, 4, -43, 5, 11, 0, 5, -2, 1, -7, 9, 11, 2, 5, -5, 9, -12, 12, -8, 10, 29, -8, 9, -4, -4, 10, 1, 24, 39, -12, -6, -7, 31, 24, -13, 31, 3, -12, 0, 12, 0, -7, -33, 32, 3, 7, 0, 38, -9, 10, -15, 6, -8, 14, 6, 15, -6, -15, -26, -19, -1, 14, 3, 2, -30, -2, -17, -32, 25, 17, -3, 3, 5, 2, 10, 9, -20, 25, -2, -29, -3, 22, 6, 2, -3, 9, -6, -13, 27, -7, -10, 2, 10, 1, 8, 6, 8, 6, 9, -23, 6, -11, 10, 29, 4, 3, 13, -8, 7, -7, 4, 3, -14, -22, 8, -30, -29, 0, -10, 13, -17, -30, -7, -20, -7, 6, -9, -3, -11, 18, 16, 24, -18, 16, 11, 19, 15, 12, 2, 0, 4, 18, -26, 28]
1977B8l2J9oPlK3mk7%K0j0k4L8m1RrnM2j6%L2j3k7J1qNj6k1J6MK3m6N6j4Rj3N
2014A2J5l6OOj6PJ0Lk4K4%k1M7p2L6K0j9LNj7J1K5%l0Qm0K9MK3k1K4k8RqkK4k7
2051a0RnjK2j8K7l3L4l6lM4j3j7k8L7mOj0mqqrQJ9k7O0n9J3K4j4Mj9K6l5PJ5j1
2088a7K3M%pJ0j6Pj1L5j8kpNk4O2l2j1Kk0J9ppL7l4M1oK4pj3l9%K1k3K7k4LnL
2126gp%J5NJ0l1L5n1K1J1J4k1j4K6j6mj8L1KKl3lM5j1PrqL4k8Ok2K1j2K1j3J5
2162A3j0Kj4KK0k0RL2l4qL%K7l6L1j7J2J0l3J3%j3K0k0K4k6j6M2J0k2nK9k7k6
2196b8J2k2N0mj8j4K0k5L8pnJ2jJ1k1K3k8Pj2J8k2L4k7k9J1M8j8j0L3pRj6J7l1
2230bJ0J6lk0k2J4J7J1j1Pj0mK5m0L4j3jk1K6j2lJ2j5j8K4mk0M1rj7J5Pj9k7L9
$$ y = [28, -4, 15, 9, 16, 13, 36, 32, 5, 5, 25, 15, -9, 29, -12, -3, -12, -17, 25, 9, 9, 41, 28, 1, 12, 4, 9, -7, -28, -12, -8, 15, -31, 25, 11, 20, 7, 12, 27, -9, -3, 3, -13, -6, 4, 7, -17, 7, 7, -14, 33, -39, -3, 17, -2, 1, 6, -11, 0, 25, 25, -5, 3, -37, -8, -4, 19, -2, 22, -6, 3, -5, -7, 17, -10, -1, -6, -7, 15, -3, 24, -9, 25, -11, -14, 30, 17, 0, -28, 9, 5, 11, 1, -3, -11, -19, -28, -20, -1, -28, 32, -27, -14, 10, -4, 0, -19, 7, -28, -21, -6, -17, 6, 10, 10, 3, 13, -3, 4, -7, 28, 10, 8, 1, 6, -18, 44, 12, 1, 3, -17, 2, -5, -12, 25, -9, 32, 26, 50, 43, 30, -9, -9, 12, -11, 16, -8, -5, -10, -7, -14, -14, 1, 6, 16, -15, 20, -31, -10, 1, 15, -6, -20, 6, -10, -14, -32, -1, 1, 3, -30, -33, 12, 1, 8, -1, -9, 25, -3, 3, -19, 2, -10, 11, -2, 13, 3, 5, -9, -7, 13, -7, 2, 34, 0, -8, -5, -5, 22, -14, 17, 0, 12, 22, -11, 2, 2, -11, 9, -11, 13, -13, -29, 13, 23, 1, -4, 25, -2, -28, -16, -38, 12, 8, -10, -24, -4, -29, 9, 2, -3, 9, 8, 19, -2, 21, -7, 0, -12, 6, -16, 18, -9, -38, -27, 21, 3, -7, 26, 19, 28, 12, 29, -2, 8, 24, 21, 1, -21, -7, 10, 21, 10, 17, 7, 3, 28, -12, 22, 9, 8, -13, 13, 1, -2, 10, -5, -23, 1, -3, -23, 18, 9, -8, 7, 14, -5, -32, 7]
2265Gm1K5j1K9JlMm5M1j5L0Qk6J3%%j5QJ4m9K1J4J5pl3M0jJ0o2J7Pj8%L2k2K0
2301Hrk9L6j1K5Mm7M1k2mL0m3J1j0J6J2k3mK3j1OJ5j7loL1kj6mk9J4J7M1j6n2
2336b8M4j6K3k6J3mJ1k5PL3nn8L8j4K2k2L3l8%J5KJ3j7J4mj6OL7m7K3k5LJ6Pm0
2371b5J9Orj8LK1k4K1oK2k9lL7oj7L3k1oj9RL8k1kj5J6K0j2j2Qj8J9l6N7kLl4
2407crJ1L4l3K7l6kP%J1L1p1M0rj5L5pqk3J4qJ1mQk6K8j7K1Ml5K1j5J2pQJ4Ln
2445Gj3JNk4J5l0L3k9M5%ok3M7m1oK3qqlK4pMOLk5K5k3J2kJ0j1j1J0J0J4k9pj9
2483c1L5K7l5n0M5N5k9j2k6N2l6lqk0K1NJ8NLnk1K1n2J6L2%j5NoLK7k1K7l3K3
2518A7j9J9k8J6L9o3M7k7j9K7Mk5l0M1K2k0j3lK9pjLJ8m2jjJ7J6k4K3k6K5m2L9
$$ y = [7, -34, -9, -20, 9, 10, 7, 11, -34, 7, -8, 22, 30, 4, 17, 17, 17, 2, 10, 24, -25, -4, 10, 25, 18, -15, 25, 24, 34, -28, -11, -4, -22, -22, 10, -12, 8, -1, -30, 6, -5, 20, 24, -23, 18, -4, -8, 22, -21, -10, -20, -4, 8, -15, -19, 4, -7, -1, 14, -3, -6, -12, 19, 17, 1, -3, -32, -18, -1, 40, 24, -28, 16, 0, 23, -3, 10, 6, 17, -8, -1, 32, 27, -31, 7, -7, 15, -7, 26, -12, -12, 3, 5, 18, 1, 15, 11, -5, 1, 38, -9, 14, -11, -8, 8, 15, -25, -6, 0, -9, -27, -24, -3, -27, -6, -12, 10, -19, -22, 15, 9, -8, 25, 4, -2, -21, -12, 26, 5, 3, -12, 4, 24, 12, 0, 8, -10, 9, -27, 30, 28, 31, -3, -12, -1, 33, 0, 27, -9, -11, -4, -4, 7, 38, -33, 7, -2, -17, 18, 11, 3, -20, -6, -14, -3, -7, 1, -25, 3, -14, 7, 11, -24, -3, -18, -6, -13, -5, 9, 12, 7, -6, -5, 0, -24, -9, -39, -6, -35, 10, 10, 4, -19, 28, -13, -19, 4, -4, -12, -15, 9, 2, 6, 12, 15, -10, 15, -8, 4, 2, 12, 1, -10, 0, 10, 24, -5, -12, -31, 4, 31, -4, -54, -9, 46, 17, 5, -21, 31, -5, -8, -16, -36, -15, -10, 8, 13, 16, 11, -10, 11, -41, -25, 7, 7, -8, -3, -9, -6, 21, 0, 27, -6, 17, -2, 17, -11, 5, 44, -19, 28, 1, -18, 9, 13, -12, -42, -1, 21, 1, -12, -15, 14, 7, 6, 9, 27, -15, -16, -17, 0, 16, -8, 15, -11, 14, -28, 11]
2552A1k8J0JJ6k7jJ5k1K4mNnjJ5j1J0j6Qj9K6J7l2J3k3J3Rj1oPJ5nj8%J9mNj5
2589hkJ8j9J1Mk7L3J7l7KrPL1k1MJ7j8lj5J4jl2P3l0%j1j6Q%K5k1Ll0j2L4J7k
2626Dj4oK9m3L3Lj4lJ4JrPl3J8J2Rj7pK3j1LJ3nj%J9k5nK4j6j8k0lN8p%l5L0P
2665A5j3j9M2j9jJ4Jj3j2J9pk9L1J3pj5Omk7L9k6L6m8J9NMlL2k6OLk0J1%mPJ6
2702B6oj6kj7NM2j3lOQj4j6K5j7J0j3J9j3J3m4K7j0KLj1K3k7l3O4J1l1k1L0l7
2736c0j0L4J7rJ6k3qOj4J8j3NL6k2lPmk8L7j0MJ5k6L4j9Mj7J2jk4j2J3K9l0L4
2771A8k8OJ1J6rMl8J9K7l4rK3K5m5K0ppl0M8j0mJ2j5j1k3M4kK3m8M7j7j4J2J1
2805A5%k6L1l0OoKLJj0J0K7j2J3m5L4l5K5lJ2j2j2j0N3o8N6mj1l3L4k1J1Jk1M7
$$ y = [11, -17, -7, -6, 10, -17, -18, -3, -24, 0, -4, 1, -4, -5, 10, -1, 9, -7, 1, -18, 8, 25, -7, 6, -17, -4, 5, -6, -12, -5, 10, 5, -13, -13, 6, 2, 7, -8, -10, 8, -11, 0, 4, -23, 10, 27, -10, -8, -17, -10, 21, 0, 4, 21, 3, 0, -15, -1, -2, -34, 39, 9, 9, -2, -18, -10, -10, 15, -6, -3, -33, -45, -11, 6, 4, -10, -16, 13, -30, 3, 6, -8, -11, 3, 4, -5, 2, -31, -13, -1, 8, -9, -16, 7, -4, -1, 12, 7, 6, 6, 25, 0, -5, 19, 3, -15, -35, -38, 20, 13, 13, -22, 8, 15, 2, -17, 25, 6, 5, 19, 20, 7, -5, 14, 7, -22, 9, 22, 15, 0, 6, 2, -25, 14, -12, 24, -24, -5, 0, 4, 1, 33, 7, 13, 16, -4, 7, 7, 3, 10, 26, 20, 4, 2, -15, -10, 32, 19, 16, 22, 30, 16, 0, 25, 8, 18, 5, 24, 11, 24, -20, 7, -3, -1, 2, -9, 14, -13, -46, 18, 29, -2, -23, 7, -30, -40, -6, 11, 2, 18, -5, -13, -7, -21, -3, -16, -11, 25, 3, 0, 7, 3, -25, 12, 2, 6, 21, -5, 29, 10, 14, -3, 9, 8, -16, -28, -15, 14, -16, 18, -10, -4, 7, 23, 14, 18, -20, -1, 26, -8, -17, 6, 31, -14, 6, -1, -8, -38, 10, 0, -4, 8, -7, -18, -41, 3, 1, 24, -24, 23, 6, -8, 4, 15, 15, -11, 20, -10, -4, -10, -8, -5, -4, -14, -4, 23, 11, 24, -21, 13, -22, 3, 0, 12, 0, -12, -22, 31, -37, 19, 15, 4, -29, 5, -16, -5, -4, -25, 22]
2840B2j5j7j4L2ojmk4kM9j4J6j2PJ5m5Rk2N%l%J1LK7m6J6J4j1J2j2j0MJ9j5J8
2876FoQk5J8kK6jn1L1l3L6%j7J1noM1l5J2J2kpj5PL5j3m6JJ4K3j4k7L8pK8l3L
2913Ej4K1j0QJ4l7%MK3k4JOLl4L7jj5jL5j8k4K3rJ0j1PJj6K5k4K5Qj1mj1J4k0
2950a4K0J6k3K0j3Ok1k9Q2q2M7J1j8k1OK8k1K3K5o5J4R%j9PL2k8l1K8L7l7K6o
2983Ik6J0jJ1oj4J7lJ8j8lj7J5K2r%rK1l9M8j9j4Kj3J5K0k7JJ5J2l5J4okJ7J3
3019A9k3l2L4Rk3M3m0NM2k8Rj2k1kQK9l5K2jJ4l2J3j8J8j7j2jLM1jl0J2lJ2jl1
3055c0J2l6P8j6Lm1L5lMj1J9pLj5JJ6rK4k5J7rQj8K1l9J2M6k5mk5jK8Lk3Rl0J8
3092a0mJ0J5J1l1M0%m1J6pK6j1mPm3K2J2rl%J6j5KRQmk1Oj8K8k4Qj7L9j1Ok1J3
$$ y = [22, 7, -10, -24, 8, 2, 1, -3, -27, -29, 20, 6, 22, 10, 17, 32, -13, -4, -26, -21, -21, -24, -24, -13, -10, 17, -29, -13, 1, -10, 2, -10, -20, -16, 3, -12, 6, 0, 8, -17, 1, -1, 25, 24, -27, 4, -29, 7, 7, -10, 1, -4, -10, 31, -4, 8, 20, 18, 11, -4, 3, 38, 25, -21, -20, -6, 17, 3, -24, 14, 7, 35, 2, 5, -9, 12, 2, 10, 24, -13, -13, -9, 14, -10, -9, -3, 0, -34, 3, 2, -13, -14, 21, 3, -21, 2, -7, 3, -8, -1, 0, -16, 9, -15, 10, 18, 7, 3, -8, 6, -14, 6, 22, -1, 19, 6, 12, -9, -38, 44, -38, 9, 20, 2, -19, -13, 15, -6, 17, 42, -23, -9, 0, 0, -19, -12, 20, -8, -39, -11, 26, -11, 15, 9, -17, -7, -8, 3, -3, -17, 0, -3, 15, -3, -6, -23, -8, 14, 5, 5, -4, 17, -22, 26, 7, -7, -5, -18, -3, 17, -10, -9, 6, 18, -17, -3, -9, -11, 6, 19, -4, -36, -2, 7, -16, 27, -13, -8, 34, 6, 15, 3, -18, -20, -12, 17, -18, 4, 3, 17, -15, -2, -20, -2, -19, -31, -32, -29, 12, 11, -19, -7, -10, 2, 1, -30, -18, -54, 24, 8, 11, -30, 5, 2, 6, -5, 14, 7, 10, -5, -4, 12, 3, 27, 2, 19, 10, 18, 0, 21, -18, -6, 40, 15, 11, -14, -15, 13, 16, -7, 2, -28, -10, -14, -4, 11, 22, -9, 31, 31, -10, 6, -1, 25, 14, 10, 17, -26, -4, 8, -1, -4, -4, 12, -3, -1, 8, 16, 12, -9, -3, -21, 7, -17, -9, -26, 13, 2, 8, -13, 0]
3130@pJ8LL2n6K2Oj1J4nrk8L4oOj3qRJ8m2K2%pK3k4qML9l3jLmpoK2qlOmJ8j0K1
3172B0k3mJk5K2qK0oJ6j7%K9l0J4J8m9L4j3QpL1l6K6j8qL4j8PJk9OQQjJ7l5kJ5
3210FrL0k3qKJ4j6KJ8k8QJ3J0j8k2j0J1NLJJ4KJ2k8L1j4oMnOJ0LOl5kRQmj3L2
3250A9j3nj0J9j9j5J4J3k7N3j8nKOk0mJ3rJ6Orl3J0J5j4K5j9NMK5j2k3Pj7OJ9
3286EK2n9L2j9K5j4J8l5K3JRj1%K8k8J5K1k4J5k8J5j5qj5N4j9K1rK1k9j3J6Nk3
3320cL1j2J1j5rlK3k4qJ6m1O1l1J6ljJ3l4KJ6Mm1J8KL0k5kJ2qj2Pj1L6o6O3j1
3356Ak2L5j8RqkmJ3kLm7J8L2k6M2j7l8M2joJ3j6J1k4L1J7n2J7KK3k9QJ1jn5M1
3392A%j9pNL8qJ1oNj8k0K5jNj2j4%qL4j9J3l7K8k0K5J2k6Rk2KK6Rk2NRk1N1j0
$$ y = [0, -7, 11, 14, 46, -10, 12, 18, 7, 21, 16, 7, -21, 13, 7, 13, 0, -8, 1, 19, -23, -1, -1, -8, 15, -9, -17, -13, 26, -7, -8, -5, -9, -16, -22, 0, -8, -11, -5, -9, 9, -1, 20, -3, -7, -6, -31, -9, -17, 3, -3, 13, -4, -4, 25, -5, 9, 27, -22, 12, -1, 7, 0, 31, -5, 21, 3, -5, 29, 11, 18, 19, -10, -4, 4, 12, 11, 28, -7, -9, 6, -3, 27, 4, -4, -2, 12, -4, -2, 16, -12, -4, 9, 19, 1, -21, -31, -20, -15, -12, -11, 3, 5, 17, -11, 20, 6, 0, 4, -1, 5, 15, 18, 24, -11, -13, -4, 4, 0, -13, 19, 6, 1, -9, 10, -9, -24, -10, 3, -24, 29, 11, 6, 8, 14, -6, -10, 3, -6, 10, 16, 7, -26, -16, -1, -15, 10, -9, -4, 0, 25, 13, -10, -3, -20, -14, 5, 27, -32, 0, -19, 6, -8, 10, -25, -2, -1, 8, -3, -3, 25, -3, 12, 33, 9, 24, -4, 11, -4, -12, -27, 27, 8, 29, 20, 41, 12, -1, 15, 20, -3, 28, 16, 27, 12, 3, 0, 23, -1, -9, 7, -34, 27, -4, 12, 9, 8, 21, -13, -11, 5, 9, -32, -14, -12, 18, -7, -9, 3, -5, -17, -10, -21, 15, -51, 12, 1, -21, 14, -4, 5, -3, -5, -9, 4, 2, 5, -42, -24, 8, -18, 24, 7, -31, 11, 10, 4, 17, 1, 12, -12, 19, 36, -16, 1, 3, 26, -3, 5, 16, 15, -40, 1, 1, -18, -25, -20, 18, 10, 21, 15, 20, 2, -18, 7, 6, 11, -1, -15, -15, -23, 11, -8, 5, -32, -4, -24, 1, 13, -13, -4, -26, -24, 2, 11, -11, -6, 3, -18, 33, 23]
3430B3m2K1l6M6Rk4LKkK3k7lqJ5k9M2mjjlJ%k3N3l3mrNJ0nj6J3Lj9lNLJ1OJ7j9
3471@oJ7k5Q%Pj7J7k2kLJmL7m2K2lJ2K5pj1nJ6l7L5Ql3Nj7L6jPk1J1l7L1L4l8
3509DoMK4l0J9qk2K9MPMj8l3K2j3PNKj4OL0l7RRJ9m1K3nj7J4J1j4k0K1K2k1j1
3546a5MK6j4k2L2m3J6M1m9J3K9j3OoNJ4m9L1nKK5jl4OPl8L8J6k3J2j5K1k6K3j9
3581eJ9m4L3K8ok4k0K2l3L5J6l0Nj6JmM1Kj1J1m9J5L7Nk4PmJ5k4K2lj6J6j0J0
3616A7j5Lk0J0J5j9RK1Jk7K1m0N7n0J2j3N7k0l8K3Qjj7LOk1K8n4L6L3k8J5j6J3
3650IKj5NMj8J5m6M3rpPJJK2j3LKqQql0K6Mj1J1K6nj0jmj8QK1j1Qn%Kj0K1j2j7
3692iQK4j3l0kK5k0K6nk4j1J7L4k7j8K3ML2m3pj4L2n2M2J2j5j4K9k0K3J1k2nK1
$$ y = [23, -19, 2, -34, 12, 21, -3, 0, 2, 0, 23, -4, -7, -15, 0, -29, 13, 9, 8, 7, 4, 5, 5, -18, 35, 2, -2, -11, -6, 4, -1, -17, -4, -1, -20, -23, -18, -15, -4, 2, 19, 0, -6, 11, -14, -6, -6, 1, -16, 1, -21, -23, -20, -19, -23, 14, -28, -6, -9, 3, 28, 21, 10, 5, 21, -16, 19, 27, -6, -1, -18, 18, 17, 24, 3, 14, -23, 8, 42, 4, -2, 2, 26, -4, 15, 7, -15, 14, 18, 25, 29, 11, -22, 0, -13, -6, -1, 1, -13, -7, 23, -14, -5, 4, 23, -18, 5, 0, -17, -3, 8, -6, -26, -5, 17, -4, -15, -11, 15, 1, -21, 11, -32, -16, 25, -24, -11, 18, 5, 11, 5, 10, 24, -25, 6, 1, 3, 28, 27, -7, -1, 6, -32, 6, 22, -1, 11, -4, 17, -9, 14, -5, 14, -30, 3, 31, 25, 1, -19, 3, -30, 5, 21, -9, -4, -20, -19, -23, 18, 20, 9, 20, -29, -14, 23, 28, 4, 11, 7, 22, -2, 20, 17, 1, 17, 7, 17, 2, 5, -15, -5, 10, -9, 0, 21, 22, -5, 16, -24, 33, -17, -5, -18, 39, 19, -19, 4, 12, 11, -6, -3, 3, -18, 10, -44, -8, 25, -3, 12, -4, 9, 11, -4, 1, 5, -13, 2, -44, -1, -10, -17, -10, -9, -8, 14, 1, 4, 6, -2, 6, -2, -32, -6, -2, -13, -2, 24, 19, 9, 8, 4, -14, -6, 15, 4, 12, 7, 7, 9, -1, 20, 8, -9, -1, 23, 10, -20, -22, 3, -17, 9, 4, -20, -31, -14, 20, -7, -25, -2, 2, 34, -9, -16, -30, 2, -50, -8, 4, -11, -25, 4, -16, 7, 18, -4, -9, 12]
3726A2j8%Lj3J9j5QJ5Lj7PMJ7J9k7j9oJ2J3k3PL2j2rk8L4k8L7j7k6pOK9qOJ7m9
3763b2OlK2j1J1j4Jj5K6mnK2l0LmmOJ9ljl4J7J8KlLnj6mL2k7M2l2L6l6J1%nnn
3803a1J8j1jJ5J1l0JoL4l9K8k6j2M2k8K5k4K2k4k6L4K8m4L0l7K2lL2k6J8k3J7
3835Fl0mK5k5L6k6lJJKj0J5Plmmj1K3J7j2k1NMK3pjMrRK1l4K1Mk0Pk9mO1l6j7
3875a8Oj6N1lk9KK4k8PK5ojj4j2k3K9K0j7L3o0RK5l7M7l0J0j2K%KjJ6Rl4M4oj8
3912dLmjL9l3q%%J6nOmoJ6k3qJ1J4J0Lj9j4NJ1J2Jj8OnJ9j0j3j2J9j8OJ2Nlk2
3952a6nK4kj9J7j2RJ0j0NOj5K2j1njJ4pj4K7j7k4L3j2OK9m0LK2j2kL5l0k6L8J1
3988C1n0N4lm0J3L7l0K8m4M6m9L1rnk4J8j9K5qJ0k5J0K5j7J7l1J5j1rKPJ4kpm2
$$ y = [12, -6, -6, -3, -16, 3, -12, -4, 11, 14, -3, 4, 8, 25, 44, 17, -2, -8, 4, 17, -6, 1, 33, 21, 12, -16, 18, -10, 27, 10, -16, -23, -17, 12, 4, 10, 27, -22, -16, -19, 3, -8, 3, -11, -10, -25, 1, -3, -8, 14, -16, -13, -17, -21, -15, 4, 1, 0, -34, -17, 1, 3, 0, 3, -2, -18, -22, 10, -17, 25, -7, 29, -7, 4, 4, -1, -6, -11, 7, -4, -5, 10, 21, -9, -8, -14, 20, -19, 9, -17, -29, 13, -15, 10, -14, 8, -16, -42, -8, 20, -24, 6, -31, -9, -12, 20, -6, 12, -11, 6, -24, -28, -3, -28, 8, -18, -21, -20, -19, -17, -27, -12, -5, -8, -12, -16, -27, -4, 13, 1, -20, -15, -11, 12, 5, 4, 8, -1, 8, 29, -5, 16, 20, 0, 7, -22, -26, 35, -1, -18, -12, -28, 23, 20, -9, -7, 17, -11, -4, 21, 15, 14, 0, -12, -35, -6, 14, -3, 30, -30, -21, 4, -33, 14, -16, -6, -18, -16, -16, -14, -15, 1, 10, -24, 20, 14, -4, -1, -5, -6, 33, 0, -8, -8, -8, 8, 3, 9, 5, -1, 15, -8, -16, -5, 9, 19, 22, 3, -11, -6, 5, 17, 18, 0, 6, 1, 20, 10, -3, -15, 4, -14, -8, 4, 9, 6, -16, -21, 3, 1, -18, -1, -13, -4, 6, -4, 1, 7, -8, 14, 3, -2, -3, 11, 4, -10, 17, 0, -24, 9, -3, 3, 32, -8, -5, 17, 5, 3, 38, 8, -18, 20, 31, -19, 35, 32, -8, 5, 42, 12, 40, -4, 42, -7, 24, 15, 10, -14, 4, -15, 10, 2, 12, -13, -3, 22, 5, 22, -9, 6, -5, -14, -12, -5, 9, 7, 0, -42]
4023d2M0k4J5K8l1J4J2K9l7j3QjKJ0m4M7j8Qk0J3j3kN0m8L7Pk4KJqJ8rj4J0j4
4058a1K8k8K8kj9J6j0KJ1j9nJ8Nj3J6l1K0l1K0K4j0j6J2PmMjqQJ4n0M0j7%rLL5
4095B7k7j9N0n3J0JNlJ0Rj6L9k2j8OJ9lj3RK3k7J9j9%J%%j1M2m1J0Lk9K9j0K3
4131B4k9Qj0nJ5l3L2l7O7m3j1nJ5J0K2j5jpPmk0K6l9L9njlN0m2l9M6k0JN6l4P
4167B2j9Ok4J6mj0K0j4L9l0J3k8K3j6kJ5j4j8J7K9Lj8Lj7k2L0MrQrmpK0j4K5j6
4203bK2k6j3J6O%qKL0k6Lj4pJ3j6L5pOk7K6lMo0N5K1l0lJ7Ml0LK8l5M4l6L9j7
4240A4j8J1Jl1J8K6k2j3J1mPllJ2QLl1M8n2M5k9Rl4L4Rk0J1qk4L0j8J9j3klOk4
4277c0K6Pk9MK3Pj5Nj5J3mK3l4%K1J9rj8NpK5Mk8K2M3o2J7%k1J6mK2k8L9n4Nj1
$$ y = [-42, -2, -26, -11, 17, -14, 0, 12, 41, 4, -9, -1, -2, 0, 10, -34, 13, -5, 3, -17, -4, -17, -19, 31, -17, 20, 27, 3, 5, 6, -2, 16, 7, -7, 3, -11, 17, -11, 17, 15, -4, 12, 2, 4, 15, -4, -9, 9, 14, 1, 17, -14, 6, -25, -5, 19, 9, -7, 5, 12, 8, 12, 11, 3, 11, 25, -25, 15, -2, -2, -11, -8, 27, 0, -19, 31, -22, -12, -11, -6, -9, 1, 10, -6, 33, 11, -7, -1, 18, 15, 2, 11, 34, 7, 26, 7, 7, 8, 8, 8, -3, 39, -2, 8, 11, -18, 11, 1, 24, -5, 3, -7, -12, 3, -30, 2, -35, 32, -11, -22, -27, -12, -2, 20, 5, 4, -3, 4, 0, -20, 6, -33, 6, 1, 0, -3, 47, 5, -34, 12, -8, -7, 49, 15, 22, 3, 9, -15, 1, -3, -13, 7, -7, 32, 2, 15, -13, 10, -6, -8, 7, -7, -25, -8, 21, 24, 6, 9, -8, -30, 0, 4, -5, 3, -6, -10, -17, 3, -11, 14, -2, 20, -6, -19, -3, 3, 3, -5, -3, 27, 1, 4, -10, -17, -4, -20, 15, 8, 14, -13, 13, 10, 14, -46, 9, 30, 0, -3, 14, 18, -12, -9, 19, -16, 28, -8, 31, 14, -4, 7, 8, -23, -5, 21, -1, -14, -3, -7, 0, -3, -6, 6, 14, 17, -14, 34, -18, 27, -2, 7, -27, 7, 16, -4, 7, -1, -25, 5, -13, 6, -7, -9, -12, -6, -30, -4, 3, -26, -22, 1, 8, -7, -2, -17, -4, -8, 15, -19, -19, 2, 21, 12, -6, -1, -8, 17, 21, -7, 15, 58, -4, 13, 13, -8, 8, 4, 26, -2, 37, -17, -12, -23]
4314b3J6pk7RL8jnKj4J9l4L8jj5J3k5j4L4rK3l6L7j5NqorL4j9J3k8J7J4lm5J7
4350a5K9jj9QJoJ6KrNl8M1k3J3mj2L0nk9J2mkjjK8j2L5m4oj4L4k0J6kk3J9j1J
4388a1J4jk5K4pooM5j3k7JM4j8l0L3m3K8RK6j9l3K1J1PJ1j8j8Lj2J3J1kj9J1M0
4423D4l7k0K5j3qJ6l3K9KL2l8kJK8m1jM4n4M5j2j8k2K6JOmPLj8K3l6K8Nl2L6K1
4459C3l4K4k3Mk1J9Nj1L2nJk2j3K6pOj6qK1J6l1jj4L0%PKj1Ql2M5j1n1L7lnor
4497a8J4nJ9k2QnJ1j8K9LJ4qk1Ql4K7J8kJl2j8K3L4n6L9Oj6OPkk2lJ5PK6m2K3
4534A4J6n5J1M2Qj5kj0K6m8M0m7L2pJj6pL0m3J2K3j1j0J3LnJ3k7L2k6l3M0jnJ7
4569Ek3JJ6mL1j7k3M2l3J8l3K1J4mJmlj2NNMPqj1J8qOpmJ0JJ2k8%J6J0k2J6mj8
$$ y = [-23, -7, -14, -41, -32, 6, 5, 0, 2, -12, 7, -27, 11, 10, -5, 8, -17, -31, 3, -6, 17, -19, 18, 3, 8, 0, -6, -15, 19, 0, 13, -15, 2, 16, 13, -32, -15, 14, 13, -6, 2, 3, -3, 13, 15, 6, 11, -27, 14, -9, 4, 0, -12, 18, 13, -16, -4, -8, -10, -11, -12, 16, 4, 39, -5, -11, -25, 9, -11, 5, 3, -20, -1, -12, -11, 3, 2, -23, 1, -6, -12, -18, 27, 14, -13, -12, 32, 14, -16, 17, -26, 2, 11, 37, 18, -15, 6, 17, 24, 35, 17, -1, 2, -10, 3, 14, 12, -7, 4, 44, 7, -13, 12, -1, -9, 7, -26, 3, 5, 37, -1, -3, -2, 26, -15, -16, 28, -26, 19, 7, -11, -33, -7, -6, 0, -4, 3, 6, -12, 11, -25, 3, 8, -24, 12, 33, -1, 23, 0, 4, -17, 2, 7, -4, 28, 23, 24, 2, -11, 15, 8, 14, -2, -10, 11, 27, -4, -5, -19, 11, 11, 18, 20, 9, 17, -15, 30, 19, -32, 5, 2, -3, -9, -18, -4, -9, 10, -12, -4, -9, 2, -16, 13, 16, 30, 22, 1, 9, -25, 2, 20, 18, 19, -13, -31, -8, 26, -30, 9, 15, -1, 5, 12, 10, -12, -15, 0, 7, 33, -9, 14, 30, -25, -14, 28, 36, 21, 19, 9, 35, -13, 27, -20, 12, 5, 6, -10, -17, 13, -30, -18, 5, -6, -16, -3, 0, -5, 8, -19, 13, -13, -46, -6, -7, -12, 5, -18, -17, -1, -5, 26, 9, -14, 28, -5, 13, -20, 1, 15, 11, 12, 8, 5, -7, -2, 3, 7, 14, 6, -5, 13, 5, 11, 4, 0, 10, 11, 23, -5, -5, 11, 21, -1, 15, 11, -7]
4609gj4KL3k0jjJ7lpPl6L4kJ2m0Rj7N3j2k2RoQJ5l1K5m1M3j5jJ8j4J5j0Kk5J7
4646fqL2l1K4j4J3rj3K5j8L8l2J1Nj1k2K9J2n2L2K6Jj8l1J2J0j8oL0OPn8M3j8
4680imJ0K2j7oOqkRLk9K4mOj1mJ0K8Mk4OpJ2n7K4K5NQj3onrL2k7L4kk1K6j9Lk1
4721hQj1mQK8l6J6PJ5Kj3k5jj2K5j2J1JL%J5j7Qk2jj5K7J7j6Nl5M2j3mJ4pJk0
4759a9M1o0K1JJ8lL4j7Pj7Nl0mnJ9J0l0M4mN%%k2j0JL2Knk9lJ2QKJ5Mm2L3l7J6
4798gJ1J3k6LK5p1K3L9Pl1KpJ3J6j0J1l6K1J3j8oK6nk0NPj7J6j3J5lLL4m0k6N8
4834B5n2K9j0qK7rNj3J6JQj1k1J7nj5J7lLk6J8J3j7K8k9L9m1oJ0nK0j4j1kL0k7
4870a9K8rNKj5j1JL9n4K2J0Mj4L4k5Pkj7pK7nJ2j6mK7K0k9jLk6J5MJ2lJj2k2J2
$$ y = [-7, -21, -19, 14, -6, -7, -8, 9, 6, -1, 6, -30, 4, 2, 14, -26, -17, -34, 19, 7, -15, -6, -12, -4, 11, -20, 5, -36, 7, -8, -9, 9, -5, 10, 0, 2, -23, -6, -14, 18, -13, 11, -3, 10, 1, -12, 13, -5, 33, 1, 12, 17, 6, -16, 13, 25, -27, 5, 31, 32, 14, -17, -5, 5, -13, -19, 11, 17, 24, -34, 9, -9, -13, -3, 19, 2, -4, 2, -6, -8, 1, 4, -25, -1, -5, 1, -10, -14, -4, 24, 28, 4, 10, 3, 15, -42, -18, 7, 12, 20, 7, 1, -4, -13, 19, -8, 26, 24, 3, 29, 10, 13, -8, 0, -11, -15, -7, 21, -15, 1, 8, 23, 25, 12, -13, -14, -26, -1, -13, -2, -1, 2, 2, 17, 0, 8, -14, -15, -30, -3, 14, -2, 3, -32, 10, -3, -7, 7, 0, 1, -19, 22, -38, -17, -16, 2, -1, 33, 16, 23, 6, 11, -19, -23, -28, -9, 1, -29, 15, 11, 16, 16, 16, -6, -16, -15, 17, 19, 14, -15, -18, -6, 2, 4, 19, 23, -19, 14, -23, -7, 4, 17, -9, -6, 19, -52, -29, 10, 17, -14, -12, -19, -6, 10, 0, 11, -25, -4, 9, -9, -15, 11, 6, -14, -9, -2, -19, -3, -16, -1, -4, -1, 33, -7, -33, 25, -27, 2, -8, -16, 11, 2, 7, -6, 10, 11, 19, 8, -13, 4, -1, -16, 1, -2, 1, -25, -7, 6, -11, 17, -12, 27, -14, -20, -10, -15, 5, -9, -20, -22, 8, -19, 9, 0, 5, 7, -8, -19, -18, 21, -33, -11, -1, 3, -11, 23, -2, 5, 3, -14, -21, 6, 1, 13, -3, -7, 20, 40, 11, 10, 13, -13, 2, 6, 18, 15, 16, 4, -18, -6]
4908fk3M1Pl8J9j5J6J0pK4l2L7m3J7K2m9K8l4MKmK0K4l3qJ9k9J5Lmj2J7J6J5l8
4943a9K6jk0J2J1PPk1pNOk2O5p1MK8j6J7oJ1k1j0kK9k9J2L5m0K6k5J8j2j2JK4
4978A0j6lJ0j0j0KnK7Ppk9ML3k6KPm%kk3L6j7%mJK4m0QM5ll5K6m1K0J4Nk1L1m4
5017b8K0j4QL3j7Kj9J8kJ7nJj8J7k6L6l3J4l4M1n9K3K1Rj6Rj6mOpL2Jk0j1L9j5
5053Cj9k0M9l8L5mmk2K6J3l3lOK1q%KNj5pL6jk6mL1n6M5K9m2J8l3M8m8j4N1j6
5089Ek0J6mJ3m4J5M0l5L7m5nM9l%m2K0Jj5QOJ5k7K8pk7JK9j8j8K0Mj9%J1K1j8
5125hJLNk3nK2NJ4k1K1mJ1j4qoLLj2P%Pj2J3J5j1n0O5m8K1lQj3mJ1j8K8j2NOm2
5165d0L3J8j8%K9l9rM4nk6opJ8plK0Npk0KL0K0j3k8j7K9j6L9k8Nk1K2m0K7pL1
$$ y = [-6, -29, 12, 19, -19, 0, -15, 1, 11, 4, 28, -4, 33, -10, 7, 29, -20, 8, -26, -22, -20, -24, -4, 20, -13, -21, -2, -31, -16, -13, -17, -29, -12, 4, 19, -19, 7, 6, -14, -2, 9, 16, 23, 2, -5, 0, 6, -16, 49, -22, -18, 10, -6, 11, 5, 16, -5, -15, -17, 12, -17, -5, 30, -10, 16, -9, 9, -3, -15, -14, 10, -6, -9, 1, -9, -19, -17, -22, 5, 12, 5, -24, -20, 13, -13, -11, -4, -8, -8, -10, -33, 3, -14, -14, -18, -17, 7, -33, -25, 20, 17, -18, 8, -33, -13, 1, 6, -15, 16, -28, -8, -22, -14, 19, 2, 4, -15, 3, 1, 18, 13, 14, -4, 13, -13, 23, -10, 4, -30, 11, -48, -25, -4, 5, -11, -2, -18, -22, -16, -23, 9, 10, -10, -21, 18, 3, -16, -36, 13, -25, 10, 6, 2, -20, 6, 19, -14, -17, -11, 10, 2, 2, 4, 9, -6, -13, 23, 22, -4, -8, 23, -33, 12, 41, -1, 17, -16, 32, -16, -30, 21, 5, -15, 1, -3, 10, -34, -19, 21, -14, 23, -22, -27, 22, 19, 19, -23, -3, -2, -17, -9, -3, 12, -15, 13, 6, -21, -20, 9, -9, -27, -7, -3, -22, -22, -11, 10, -8, -7, -4, 1, -22, -27, -5, 0, 14, -7, 14, 10, 21, 7, -1, -7, -4, -1, -13, -6, -6, 1, -11, 2, 17, 6, -44, 21, -27, -6, -9, -1, -14, -18, -7, -25, 3, -9, -4, 2, -40, -7, 11, -7, -7, 22, -17, -26, 18, 13, -13, -19, -26, -8, -15, -18, 2, 7, 0, -20, -18, 12, 32, 19, -9, -26, 3, -13, 26, -2, 3, -18, 4, -36, -9, -16, 15]
5201A5J2j7Nj6J4jj7K6onpLk3j1L3nk5L0LJ0j1k4K2j7K4mm8K6Mj4L4k1J3k8L3
5236Gmj3LJ0Kj5J1l9M5k0Pj4j1QJ3J9j2lj4RjJ0%Kj2K7j8K3k3QjJ4l2KJ6%j9L1
5274A6Lj2l1K6LQk6J6j6JJKrK3kk7NJ4K4m8N1l6lJ3J9mo0OM0J2k9K0J7oPlrKL
5313A1j4J2pj4nnNJ1K5l2JJ2Rj9K0l2K9%pj3L3m9J3L0l1K2NK3o2N0k0k4OK2jK
5349FJj1QJ3k5J7k9j8M7nm%rJ8j5QomL6Kj6k0M0l9J2Nl3RNPj7K9k3pK4Qj8K3l1
5388a2%K3l1N3j5J9lj6j4J8kl9K1k0J1K4Pk8LMoLJj1K2l3L7k4k5M5l5M1l2J7N
5423Hl3MM4n4L7j5J1K0j5J6k8J8j5j2J9rk7J5OJ0oK0j1oj7M7p3M3k%L5k3oKJ9
5458B2m4j5M6J2m1J7J8J6k3rj8L8k1j1K8n%Ll1K1Ml5J0J5pKMpNMOj5K7j1j5J0
$$ y = [15, 27, 10, 15, -1, 13, 12, -5, 21, 15, 10, 3, 6, -17, -28, 5, 0, -25, 5, 8, 18, 7, -17, 5, -12, 12, 8, -40, -14, -10, -24, 10, -11, 2, -26, 7, 3, -10, -7, 3, 5, -10, 1, -38, 7, -13, -6, -20, -31, -23, -10, 9, -3, -6, -20, -11, -12, -2, -2, 0, -12, 15, -3, 20, -3, 5, 4, 18, -14, -12, 4, 4, -15, 16, 19, 7, -24, 2, 5, 13, -13, 3, -13, -12, -11, -9, -18, 5, 3, -24, -19, -5, 19, -29, 22, -14, -17, -4, 15, 11, -49, -43, -3, 9, -20, 0, 17, 11, 18, 15, 6, 8, 11, -3, 9, 2, -12, -17, -22, -17, -6, 19, -13, -12, 0, 9, -10, 10, -22, 7, 7, 0, -13, 20, -29, -16, 14, -17, 5, 10, 33, -29, 21, 1, -23, -17, 5, 4, 6, 7, -4, 4, 17, -8, 9, -20, -38, 9, 4, 0, 0, -9, 9, -6, 2, -4, -8, 28, 30, 14, -6, 34, -5, 7, 12, -21, -12, -7, 0, -17, 12, -11, -18, 6, 14, -4, 19, -12, -12, 11, -20, 33, 18, 37, 34, 18, 4, 22, 20, -19, 2, -18, -7, 17, 24, -4, -1, 3, -3, 0, 1, -10, 12, -21, 16, -8, -33, 12, -23, 18, -14, 3, 8, -25, -21, 23, -31, 6, -9, 2, 22, 7, 23, -5, 13, -2, -14, 5, -4, -31, -16, -10, 0, -6, 14, 3, -3, -20, 27, -46, -3, -5, -5, 30, 7, 1, 3, 22, -22, -37, 9, 21, -20, -3, 15, 31, 8, -1, -19, 19, -2, -13, 15, 10, 10, 13, -18, 3, 7, -28, -18, -3, -10, -8, -4, -11, -6, -2, 4, -11, 16, 5, -10, 0]
5494@k3NRJ6k6kM0k2L5j2k2k5RMJ8n3L9K7m3J3J5J7k5NJRkok0K2k7MpK3mrK2m
5532Ak7M3l0llK5K8m3j2K2NPnk4QL5k5oj2J0lJ%m0N6lJ6k4njJ3Opk7K8jQk3K1
5571Ik3J2ql6L9J0J1Ok0j2pL4k6k9M2m1L2KmRj0kj9K1%J4j0j1Oj1nQmJ3j2J9j7
5608b0L2oNj0J1Nk2K4l4J1k6L4pJ4k5L7j6k5J0K6j9J0j1nJ5k8M8l0pJ2Ll6M5J4
5642B9l5l0L6j6K6l8K2Klj6J6j3kK9j7K9j6k1lK0JJ4k4mJ2OqnK5m6J5J3kOj1L4
5678B5l5N5l8NrLJ4Mj2m1J2M5j4lk7J9Rk4Kl%J6m1M2j5kK3j9J4Rkl0L8m8J2oL
5715a9J5j7K2k0L7lqj1j1J2pJj4PJ9k3M5l6L0l0K0j0lqJ4j6nM1Ol5pK1JQk3j2
5751a9J5Lk2PK4loK0l7PJ5pM2n5J3nLJ0k1j8L4k4j0O5m1K2k6jJ4j2j7mK4J5J0
$$ y = [0, -23, -18, -9, 7, -19, -21, 19, -3, 32, 20, -2, -27, -18, -14, 4, -49, -10, 17, -26, -13, 2, 19, -6, -1, 0, 9, 7, 1, -19, 3, -24, -20, -27, -4, -8, -17, 5, 1, -26, 17, -13, -16, -19, 6, 34, -9, -21, 1, 6, 13, 8, -16, -8, 27, 2, -4, -16, -6, -9, -8, -8, -48, 8, 5, 21, -3, -8, -9, 4, 10, 3, -24, 4, 3, 11, -12, 9, -14, -2, -10, -46, -7, 3, 14, 20, 0, -12, -19, 15, -11, -40, 2, -39, -7, -5, -9, 0, -10, -12, -31, -10, -10, 4, -6, -17, -11, -22, -27, -19, -23, -10, -22, -3, -20, 12, 6, 11, 1, 12, 17, -5, 19, -15, -4, -30, 4, -3, 11, -14, 23, 7, -18, -8, 18, -1, 9, -2, -7, 8, -20, 28, -2, -9, 3, 6, -30, 15, 29, -6, -36, 0, -16, 10, -28, -6, -4, -7, -23, -7, -20, -22, 7, -10, 19, 3, -18, -21, -1, 0, 14, -10, -14, -2, 4, -4, -9, 16, -30, -15, -2, -4, 2, -9, 25, -10, 45, 7, 12, 3, 6, 20, 24, 12, -29, -17, 28, 14, 11, -16, 3, 12, -12, -10, -13, -13, 3, -38, 4, -11, -13, 10, -9, 5, 14, 12, -18, 20, -28, -16, -22, -19, -4, -21, 1, -19, 18, 15, 7, -4, -15, -3, -10, -9, -23, -16, 3, -20, 25, -11, 19, -11, 9, -1, -4, -12, 2, -14, -19, 22, 28, -7, -14, 7, 8, 16, -7, -19, -4, -1, -23, -16, 8, 5, -1, 19, -18, -11, 4, -3, 39, -16, -3, -8, -5, 5, -16, -34, 0, -24, -34, 31, -10, 12, -14, -15, -1, -13, -30, -34, -10, 5, 15]
5786A5j8j8N2j2j8nJ2J1j1Pl1K5j7oL2k7J3j8K5mk0L7k3J6qk1JJMmK1Llj5K6k5
5822cnL5n6L6jnlj2J7nj5K3rJ2m0RJ8pJ1oNj9K5qj5mK3k5K2J7k3j6NL4m8L5mj7
5860a9L4k7L4k2j4K0j4j7J8J5L%m0L2pKK7k8kk7L5rqoM4k9Lj7L2m5K7K0j5j9N7
5895C8k6j0j1Rm1L1J2rnk0N2j3j7KK0l2j3J7Pj2M5j6k3J1J4ml3J1k1K8KK3l8L6
5929A4%j2J4l4M9m7M0j8k2J5j1J9j7L0j6mOj7L9m0J2Lj0j1RQpoL4k1j0J0l0K2
5963iJ8k5lJ3j6J5j7L4j1qRk1J0LK2k3J3l4QLJ3kkJ1mqK5j1j7M0nj3pJ6m6K9o
6000fpnLK7j3oJ3jpk6J0%kJ3j0l9M7l6L0Nj0nK7rk7L7nl2L3pOJ8k4lJoJ5L0n5
6039b6L9l8J0K8Mj1Qj3J6l8K5k5L5PrJJ6m4j5L1mk4L7qj9J0RNJj8lk7K0J2K0k3
$$ y = [15, -3, -21, 31, 19, 1, -4, 8, 19, 8, 15, -16, 9, -8, -14, 18, -9, 4, -14, 11, 7, -13, 24, 1, 17, 9, -12, -11, -10, -6, -10, 11, 14, 11, -4, 22, -3, -8, 27, -29, 7, 6, 1, -2, -14, 3, -2, -17, 6, -3, 9, -31, -22, -4, -11, 0, -6, -1, -20, 5, -3, -18, -22, 1, -24, -2, 15, -8, -24, -19, 15, -33, 2, -2, -19, 15, -12, 22, 0, -14, 6, -8, -25, -7, 8, 11, 11, -29, 3, -4, -2, 25, -3, -5, -32, 3, -6, -14, -20, 24, -5, -2, -19, 13, -32, -5, 15, 0, -19, 38, 12, 2, -9, 0, -41, -10, 2, -7, -12, -32, 20, 7, -10, -8, 12, -20, -33, -16, -9, -21, 24, 8, -15, -4, 10, 6, -27, -16, -37, -9, -7, 16, -22, 14, 14, 2, 16, -18, 31, -16, 24, 6, -16, -1, -12, 7, -10, 20, 4, 0, 6, -11, 28, -12, 0, 3, -7, -18, -9, -1, -8, -14, 20, -1, -11, -1, -31, -9, 9, -16, -19, -6, -22, -7, -24, 10, -1, -9, 0, -21, -11, -8, 14, -9, 4, -30, -22, -19, -6, -8, -10, 1, -3, -11, 14, 3, -14, 26, 21, 8, 1, 17, -29, 0, -6, -13, -18, -15, 12, -1, -7, 6, 5, -2, -28, -18, -18, -20, -7, -17, -56, -9, -45, -15, -10, -20, -25, 2, -7, -34, 3, -2, -34, -1, -8, -2, 16, -8, -11, -10, -16, -1, 29, -26, 13, -25, -15, 13, 17, 6, 14, 1, 17, -21, 4, -21, 14, 21, 12, 13, 29, -15, -30, 1, -3, -27, 10, 2, -17, -7, 2, 7, 8, -10, -13, -40, -20, -8, 12, -11]
6075a1K3k0L2l9K1mm9L8j1L6j6J7m3L0NMj9K3l3J3NNmJ5l4J5krMj5L3%Lj5M7m6
6111anpL3qk7M8j7k5L2J4j5k2qJ0JJqj1K8KLl6J7Rqm3K4j6M5l4J6j1J5J0qk1o
6148b9J8J5kJ3J3m0j2K5%J6m8L6Klj0j2M3j5Kj5M1n0J8%MpRj0rK4j4J5j3J5lk3
6184fJ7nK8k2j1l0J2J0J4qj4K6l0mRK4jnJ2j9m2O7m8N4k4rpK0%k8R%L2m9P3k7
6220A8rj6j4J3J3Poj0pK1k4QJ4lpL2l1J8k1Qj9L2Kk9kk8M2m9O1j5jj8J3k3J5K
6256a3L1j3J1o4M7j7K5rk2J1k%j1M5Ro1L3%J2l3M3m8K8lMmqPrK3k5J7J6k0K5p
6292A8qK4m0%J8l2M2l9N6l0j2K5l8L4jpk1%MkJ2Mj9ORkJ1ojm5J8Jj9L5K1l8K5
6329CRmNk5LJ0MK2k8KnJ3j6j9Q4o6K5Km4nN0l1J4qj8lK4mQK4j4nK3j7%j0Mjj5
$$ y = [-11, 12, -8, 24, -15, 6, 2, -47, -9, -20, 16, 0, 17, -26, 4, 9, 13, -6, 17, -16, -3, 2, 7, 3, 18, -16, -1, -3, -12, -8, -23, 10, 10, 13, -2, 45, -1, -6, -13, 20, 12, -15, 33, 16, -9, 23, 37, 22, 0, -8, 2, 3, 4, -4, -15, 13, 15, 18, -18, -1, 8, 0, -43, -19, -35, 10, -24, -8, -19, -4, 6, -2, -23, -29, -11, 4, 2, 15, 28, -12, -24, 1, 1, 17, -31, 5, 7, 4, -6, -18, 25, 10, 12, -3, 38, -12, 6, 6, 10, 3, 12, 2, -7, 17, 3, 18, 5, 20, 17, -6, 11, 6, 34, 12, 1, -29, -17, -7, 7, -1, -15, 11, -19, -23, -14, 10, 9, 4, 16, -3, -45, 22, -26, 28, 4, -5, -12, 8, 8, -20, -11, -11, 21, -28, 45, 18, 9, -7, -21, -8, 5, 12, 6, -4, -11, 10, -14, -6, 8, 5, -2, 30, -1, 17, -4, 4, -15, 17, 19, -10, -12, -40, 2, -47, 14, -1, -2, -20, -7, -30, -15, -13, 18, 5, 16, -48, -1, -18, 7, -2, -24, -13, -15, -15, -26, 19, 28, -33, 0, 0, 12, -21, 22, -26, 2, -1, 3, -1, -9, -2, -11, 12, -13, 4, 20, 0, 25, 18, 10, 34, -6, -6, 12, -20, 22, -17, 39, 9, -3, 22, -16, 18, 17, 10, -11, -11, -7, -9, 3, 7, -12, -6, 3, 1, 12, 6, 5, -40, -22, -21, -40, -5, 16, -22, 3, 12, 8, 13, -12, -9, 1, 5, 27, -1, 1, -4, 9, -7, -26, 58, -8, 17, 19, -25, -30, 20, -11, 3, -5, -23, -26, -2, -6, 2, 26, 12, 7, 30, 13, 13, 3, 7, 6, -9]
6368iK1J2l5KJ7J3j7j8L1l1MK0J2k6j9J9JK5l4pKJ6K7ppLkj6Nj2K5l2KJ4nJ1K0
6405B5k5K6j3j1%J1Kj9J3qj3J4L2k1jJ2k7j1%K4JRjj1K1m9mJ9J7Jm4M8l0J6j3
6440a0%j0M2j7jn4L6J4mJ8l2K4k2J6k0J6j9J8K3j2j7nPmqJ3j9K9oK3mOk9L6pl0
6476iklM9l2qMNqK2l9M9m2oK6j4mk4L8K5l5jJ3Jl4L7Jl9L1j8L2qj5k0K9J6k4Q
6513AQml1K6J0lnoK2j6K4n4K5j2PL3m1K1QoOj4J7j9Rm1L4LJ1j1j2mqM5l8K5j9
6550iJ8MPqNj4l2J0L1k0mj1K7Jk5J9J1Ok1l5K4J1l6M3J3k3k3L8J0m5ORK7rRj5
6586aJ0J5l0J9j6kqJ2J4rj6M4j6j0k0L3J7k4j6L4l3J7Qj2M6m8kk4J9NJ7m0K3l
6620Ck8M2%l6JJOK6l2K5j1J4l2J5k4MJ8Lj9M2Mn3PNJ6%J8j3j6lN0m4Qjk1J6Nk2
$$ y = [-9, 12, 24, -11, -9, 8, 21, 4, -14, 17, -14, -10, 10, 22, -4, -23, -4, -3, 22, -12, -19, -17, -1, 26, 19, 12, 15, 13, -3, 2, -10, 15, -17, -15, -1, -6, 5, 25, 0, 26, 13, 2, 2, 13, 15, -4, 9, 1, -12, 2, 34, 13, 12, 24, -3, -14, -14, 10, 11, 20, 19, 8, 29, -20, -24, -5, 12, 13, -31, 17, -13, 3, -10, -10, -20, 22, 5, 4, -50, -14, 0, -4, 14, -18, 6, -16, 0, -20, -4, -23, -5, 18, 6, -11, -16, -9, -13, -21, -8, -27, 2, -4, 19, 15, 21, -8, 28, 21, -9, -11, -14, 35, 3, -5, -1, 4, -4, 18, -21, 28, -14, -20, 6, -8, -12, -36, 2, 27, -8, -9, 4, 5, -29, 8, 9, -30, 1, -17, 15, 7, -8, -28, 1, 17, -7, 1, 9, 5, -26, 0, 10, 7, 2, -4, 18, 2, 26, -28, -3, -15, -8, 25, -16, 5, 13, 7, 13, -1, 16, -3, 6, -35, -1, 2, 13, 2, -10, -14, -22, 23, -15, 10, -9, 9, 13, 20, 12, 17, 3, -29, -19, 12, -8, -12, -23, 4, 5, -20, -1, 10, 16, -5, -40, -16, -5, -41, 2, 15, -8, -31, 7, 17, -28, -22, -13, 14, 5, 14, -1, 9, 24, -6, 13, -3, -5, -13, -1, 13, 4, -12, 32, 16, 6, -14, 19, 36, 12, -4, 30, -3, 14, 22, 10, 56, 8, 6, -18, 1, 6, 23, -17, 6, 3, -25, 17, 17, -19, -18, -17, -11, 15, -17, 8, -3, 11, -21, -6, -30, -26, -8, -5, -24, 18, 22, -31, -24, -19, -3, -3, 15, 2, -14, -17, 33, -11, -3, -4, -25, -9, -4, -26]
6658b6jK3j8K4J%J2Jl5QPJ5k0L2k7M0m1j8K9k3rKM7k9K6k2jqj1K4Pj9L8Nl2Qm
6695ELOl9jK3j0K5qoj3J3K4n4K7j6K2rJ4%J3Pj2jpj9K6J2j7j7J4J3mk3JJ8l9N6
6732B7l1k4L1Ok5J3j9Nj%J5oK4j6JRk2J6mpk3L2k4J6n%j2L9l9LK7m5J0J0jK8J5
6769B3j3j1J8Ljj7QkK4ol5J0%j0L2kk5L5l5L9n7pM3k4J0J6k5KJ3k0rL5k2J2%k9
6805b7N3l9KJ4J6m1rK4j9QJ1PJ7l1lk7L0J2K1l0J8J9j4mK3n8L3J2j2pl2N8m6K5
6839DPoJ8rMj4mk2L6pJ1rk8K2l1K0kKJ5Nk9K1j9K1jk8L9k4JJ3j0k0J4l5M1kkl
6877a1oOK9Qm0K4l7L4KkoLmKQpk3J4K3mlnk6K1nm0N2j8M3l7J7j0K0k3J0pmpj0
6916a9M2j0mJ9m4RJ4j6KJ8l0LK0%kk5K9j3K1Rl6qK3Mj9kJ6rK1lk3lM7m7L0J0k1
$$ y = [-26, -27, -4, -22, 2, 3, 3, 15, 16, -19, -11, -4, 11, -9, 23, -4, 36, -5, -23, 6, -17, -26, -24, 23, -6, 20, -2, -3, -11, -22, 2, 9, -10, 28, 33, 1, 9, 5, 8, 14, -25, -26, -3, -13, 12, 4, -2, -15, -2, 22, -32, -5, -21, 1, -8, 6, 6, 19, 26, 14, 13, 6, -13, 13, 25, 8, -9, 5, 18, 14, -9, -8, 10, -29, 27, -4, -28, 3, 9, -16, -3, -22, -17, -18, -18, -3, -9, 15, -1, 0, 9, -13, 3, -1, -8, -31, 1, -23, -7, -12, -12, -24, 15, -24, -21, 6, -39, -29, -19, -20, 8, 23, 10, -1, 17, 20, 19, 2, 10, 8, 32, 26, -9, 1, 1, -9, 23, 21, -4, 31, -4, 35, -22, -29, 14, -10, 0, 16, -9, -7, 6, -14, -23, 12, -10, 2, 2, -27, 26, -13, -11, 3, 19, -22, -31, -7, -26, -18, -7, 0, 17, -14, -17, -44, -14, -2, 19, -11, 7, 26, 12, 8, 31, -27, 6, 18, 6, -1, -33, 25, -21, 4, 11, 5, 23, 14, 18, 4, 0, -22, 14, 7, 18, 9, -19, 3, -28, -8, -10, -8, 7, 12, -17, 4, -15, 6, 5, -23, 16, -8, -7, 6, -4, -24, -10, -45, -4, -6, -8, -11, -17, -11, 18, 26, -14, 10, -27, 7, 9, 7, 1, 4, 0, 2, 10, 3, -20, -6, 17, 13, 10, 5, -21, 0, -5, -45, 7, -11, 32, -5, 12, 2, 22, -1, 9, 2, -2, -9, -19, 23, 13, 9, 28, -16, -7, 7, -9, -7, 11, -19, -16, 4, 4, 2, -23, 6, -7, 14, 23, -13, -21, 2, 6, -13, -15, 1, -8, 13, 10, -13, -16, 31, -16, 14, 24, 3]
6953Ckj1J2j8K0JJ5k4K2J6j4l9L4kk6J4J3Lk1J4k7M8n4L3j6OJ6l6K6j7%J4j7J3
6987ajk7L9lk9M2k4K5k6j0nL7l2Qj1KJ7mj5K9j5j4oL0mNj2L2j2k1mJ0k0M6lkq
7024A3k1K4j4J4j3QK4n6K4Kkk9K4rK4k8J2J5lJ2nj6pL0n1K1j7KL5k6j4RQ%N%k
7061gJ1j4J1n%POKlJ7j0%j7JQLk4NK6m1KK4PPk3K0mOmpj3K0J9l7K4qk5J5K3k3
7101aj0QJ3j1j0klOjkO%K6lk0nJ2oJlj7J5j1J0K3m4KM4rJ8l1OJlj2j2J1LK7j3
7141CRJ0jl5Qj0KK4J4m5L0nPPj7k0jMJ6L9l3j8QJ4j7k0K5k7K8j9J9kl0N0k2J7
7177A2j9OLm1L9Nj8pJ9J6j6mJ3j3J2Nk5J8k1K2k2L3Km7K9J3k6NPJ2j4J0J3j6m
7212AJ2k1Rj9j0L3J6j9rK1j8JkK9ml2pK1j2J1K7m2nK0rrPj6ONJ5j0%mjJ0K1j6
$$ y = [3, 1, -10, 2, -16, 4, 5, 20, -4, 18, 34, 20, -19, 15, 13, -13, 1, 14, 17, -4, 10, -17, 31, -23, 10, -6, 0, 16, -20, 6, -11, -11, 3, -14, -1, -2, -29, 10, 7, -22, 20, -4, 21, -5, -15, -20, 17, -15, -7, -18, -16, 1, -3, -18, 11, -4, -18, -24, 6, 2, 7, -5, 27, 15, -6, -10, 0, -20, 26, 23, 21, 13, -8, 16, 2, 16, 3, 11, 35, -21, 3, 5, 3, -26, -2, -11, 13, -15, -3, 12, 9, 21, 16, 0, -7, 23, -28, -7, -24, -22, 13, -13, -27, -18, -10, -10, -5, -5, -7, 4, -10, 1, -4, -4, 3, 9, 11, 8, 25, 15, 15, -2, -1, 7, 10, -14, -9, 17, -24, -22, 2, 9, 16, -7, 13, 9, 15, 11, 4, -9, 11, 30, -7, 17, 9, -16, -1, 22, -1, -11, -3, 10, -1, -11, -13, -16, -10, -11, -13, -7, -7, 19, 16, -4, -9, 3, -3, -2, -5, -22, -7, -18, -8, 15, -29, -27, 17, 8, 26, -5, 1, 2, -1, -13, -25, -14, -11, 16, 3, 12, 22, 21, -14, -6, -16, -14, 10, 24, -21, 9, 4, 11, 18, 1, -19, -20, -16, 0, 39, 6, -12, -4, 10, -7, -27, -2, -29, -1, -20, -1, -3, -33, 17, -5, 12, -7, -1, 2, -39, 0, 5, -13, -20, -1, 15, -1, -5, 8, -5, 7, 12, -13, 5, -16, 6, -16, 17, 19, -28, 1, 14, -12, -7, 0, 12, -2, 8, 21, 5, 1, 13, -8, 1, -18, -28, 5, 21, 2, -7, 14, -4, -3, -5, 24, 20, -12, -19, 2, -10, 1, 28, -14, -19, 1, -8, -17, -10, -26, -20, -15, 0, -10, -10, -14, -15, -5, 16, 0]
7250@nj7NpqM9k2oqJ4K6k3j5k0L4j0J2K5ol2L1rk8K5kJ6noLj3j2MK1j2Rj9OpJ6
7289Dk2L1Pm9J7lK2oj1PMjnk2K5J3j7k0K6j0J4ljJ9qj0K1k3J3jpj9PQj4MQRmJ
7329Dj7L4k0k5LJ7L3n8L2l2L7k5K0Kml0K0l4L6KnK0k3jk3K2L5n3M2Lj0%l5L1j6
7364a8K2RMLk6Qm%Rk2KK6k8L8rk2L9k0o%npq%L3l4K1KJ0kk7JLNOqj5J5L3k9Nk2
7406a8RLMj4oL0Rj7j4NlL%J9j3j8K0pqNK1n1L8K5j3j3l3L4jK7m2qJ0MrJ8j1J1
7444dj4J3pL0k4K2nLj8JK1j1j1oK8mk5J5K1m0JNJ9rJ1j2j5L4l4K0Pk4L3k7L7r
7480B2k2Nk1pJ8k9L9Kkj9J9Qn3N3j1L7m5L2l5K8j4kJ7l0K9k9L1j6mmqJ0PQk0J2
7516Fk9L2k8J4mklM4j3k6k2L1k1L1J5k2k1MMJ8Jjj8J9j6QPj2J1k9L1J0j7lj4J5
$$ y = [0, -5, -22, -17, -24, -32, 17, -5, -11, -19, -5, 21, -2, -17, -37, -3, -13, -1, 24, 18, -14, 17, 8, -20, 5, 3, 19, 14, 8, 11, -2, -14, -10, 11, -1, 8, -11, -5, -12, 4, -18, 13, 20, -29, -12, -15, 7, 1, -10, -3, 1, 0, -5, -27, -2, 11, -6, -26, 0, -10, 4, 1, 0, 19, 11, 1, 22, -1, 12, 11, 4, -15, -8, 0, -14, -10, -2, 7, 3, 4, -13, 21, 1, -24, -21, -4, 29, -29, 3, -29, 8, -17, 3, 5, 1, -29, -9, -43, -7, -5, -10, 10, -13, -14, -37, -15, 20, -33, 9, 12, 2, 2, -33, -2, -18, 4, 13, 17, 20, -6, 2, -2, -2, 7, -15, -13, 13, -15, 23, 14, -8, 31, 11, 5, 5, 0, -7, -15, -15, 18, -16, 5, 7, 17, 15, -12, -11, -8, -3, 3, -5, -20, -5, 28, -1, 4, -18, -9, -6, -2, -16, -22, 8, 17, 0, -14, -9, -12, -9, -9, 10, -3, -21, -1, -8, -16, -11, 10, -41, -3, 22, 9, -4, -37, -3, -4, 23, -19, -27, -17, -13, -22, -4, -15, -4, -18, -5, -12, 18, -6, 16, 11, 14, -4, -3, 18, 7, -4, -10, 18, 14, -11, 4, 25, -15, -14, -9, 10, 1, 12, 0, -15, 19, -15, 5, 12, -12, 21, -6, 31, 22, 0, 5, -16, -23, -5, -34, 5, 7, 5, -14, 5, 13, -40, 13, 2, 39, -6, 26, -9, 19, 5, 3, 20, -10, 19, -10, 21, 5, 1, -3, -11, -1, 6, 14, -6, 6, -23, 9, -19, -5, -9, -11, -14, 30, 17, -9, -31, 0, -21, 10, 25, 3, -18, -14, -10, 8, 9, 8, -10, 9, -7, 1, 8, -4, 7, -22, 9, 19, 2, -1, -15, 0]
7552@J4j9lJ9J2j7qk0J5RK4j1Lm1L3KoPJ1Pj7lMl0L5j1k7L4j1jPkK7k9j9L3k3
7589bK8j5j8J0Jk1M9l3j8J0k3O1k3j8K3j8k2QK0oOj4J6NpOpJ8l9J9jJnj0PoK6
7626Hj3J1K3j7Lk1J9%rkJ1j6j4L9j2l8K1lQJ0l3MJOORK1k4j4OQk2oJ6L3j2l0L
7664b0J0k9K8OnJ3%Kj9kK7nJ9j8rK0j2J4J7l7j0J7Nj1nL1l2J6K5m3J8pL0m4LJ0
7700CJ6l8MKj0J8J0L0k2k6j4L6KqKk9K6j7Mqj1pL0J1J1k7J2ronMj4M4k8RNJ2K8
7738D0k1k1pjJ4k6J7j3M1l2nK4j0j7K3j2J8K0k1jK2m6J9Kj4Qk3QJ9KjmJ1j2J0
7773A1k5RK8j9mk7M4Pj8Rj1rj8MK0k6K6K2l5j3J1J0j3OnK4K3j6k7j1L3J5l9L3
7807A9oJ0j4J6j1k1K3Kj%j3J2K0m2K4j1%J5j1j9L7m3K6j2J0j1k0nL5kl2lL2l0
$$ y = [0, 14, -5, -8, 11, 23, 6, -2, -22, -7, 2, 26, 15, 18, -23, 10, 12, 6, 13, 24, 31, 14, 11, 15, -15, 20, 9, -18, 16, 5, 4, 11, 9, 36, 7, -12, 21, -2, 26, 11, -7, 3, 4, -17, 32, -1, -19, -9, -32, 29, 6, -12, 11, -7, -29, -21, -1, -7, -1, -15, 1, 6, -1, 5, -2, 16, -23, -4, -5, -4, -9, -19, -12, -18, 8, -5, 6, 29, 12, 15, -6, 13, 13, 4, 2, 13, -3, -17, 22, 10, -28, -7, -10, -2, 8, -25, -21, -20, -14, -8, 1, 22, -2, -16, -10, -2, -24, -30, -14, 19, 7, -23, -20, -10, -39, -11, -5, -10, 3, 3, 5, -14, -16, 11, 6, 25, 7, -2, 18, 6, 20, 37, 0, -10, 7, 12, 1, -4, 27, -5, 11, 36, -7, 11, 4, 34, -10, -7, 3, 19, -19, -15, -13, -23, -5, 5, 35, 13, -13, -27, 9, 11, 3, 5, -24, 2, -15, -11, -19, -30, -37, -7, 4, 15, -12, 0, -9, -15, -20, -16, -30, 14, -14, -5, 0, 12, 40, 19, -2, -9, -10, 4, -22, -5, -18, 23, -9, -14, 10, 0, -17, 6, -6, 12, 32, 11, 10, 32, -14, 5, 7, -7, 1, -22, -14, 5, 7, 6, 2, 13, 1, 11, -14, -5, 23, 4, 0, -27, 17, 24, 6, 15, 4, -5, -23, -19, 1, -25, 1, 23, -12, -25, -14, -4, -17, -11, -16, 8, 31, 15, -12, -23, 10, 25, -14, 19, 13, 23, 9, 25, 14, -7, 16, 18, 17, 17, 4, 16, 36, -6, 18, 7, 7, 22, 11, -8, 29, -14, 12, 0, 10, -1, -21, -26, 9, 7, -25, -28, 4, -26]
7841b6J9Nl3J3rM6l3Qk0LJ4QpM3n8K2j2J1K0pPk3J7%j2k3M5j5k1L9j9L2k3Mnl
7877Gk6K8lJ3k8J3J1J3j4Ok7Nj2K9k8RnNKJ3Jm3QJ0JJ7k4rK3LJ5j4j4RJ8j1k3
7914b2K7K4l5J4j5LlJ9Ll1%J8qK4l5L3J0Pk0Pm5K4K1Ll5k8M3K2k8L6k5j8J4j8
7948a4K7Jj5rkK5j6kj2j4L5%j3k3J9J1%j3OqL7j6kj3loK8k7K4j9L4ql6K1l0J7
7984a6J1K6n2N5l0Kj3K2K4k4j0QK9l7j2K4qjk1J3K3qj1M4m5J9k3j7K8qL1l7NJ5
8018Fk5J5J5J2m0K1k2j4K6J9j4k4J5KlNJ9j5J3kPl6J6J7Om1lL4j7Qj4K7k8K8j9
8053fl5M0J6j9J1l%Qj2kk4K9K3k3j9M8k8oqJ1lM1n3m1K8JK1mj2pJ5K1mj3L4l7
8089a2Pnj1J1J2L3l6j3PKrmK3k2K8k0L7l9K7j6pK2j1okj4kJ6j2L9l2LoK1m7L6
$$ y = [-26, -7, -2, -35, -22, -31, 15, -18, -10, -30, -27, -13, -5, -12, 31, -27, -5, -17, -6, 14, 7, 14, -9, 8, 8, -4, -27, 18, 3, -18, 21, 2, 34, 11, 15, 10, 7, -19, 9, 6, 19, -9, 4, 15, 28, 14, 20, -7, -2, -14, 15, -13, -4, -9, -4, -2, 11, 12, -31, -23, -13, -12, 5, -19, -28, -5, -2, 13, -1, -15, -6, 12, 1, -22, 5, 29, -6, 8, -7, -4, -7, 12, 15, -16, -16, 2, -6, 18, -17, 16, 26, 33, 13, 20, -25, -1, 20, 23, -12, -40, 3, 25, -3, 33, 8, -10, 4, -14, 13, 14, -1, -10, -12, 13, -3, -5, -17, -31, 4, 4, -9, -32, -13, -2, -2, -15, -9, -17, 20, 4, 2, -11, -14, -20, 8, -19, 5, -14, 20, 12, -24, -3, -33, -16, -5, 21, -31, 24, -6, -4, -17, 5, 29, 5, -5, 3, 32, -5, -17, 7, -1, -2, -23, -10, 13, 5, -6, 38, -7, 12, -11, -28, 0, -8, 23, -14, -9, 6, -19, -4, 11, 23, -17, 4, -18, -32, -6, 13, -1, -25, -10, -8, -11, -6, 13, -2, 11, 9, 16, -20, -4, 13, 19, -22, -25, 9, -8, 0, -14, 13, -15, 13, -6, -41, -1, 15, -4, 7, 4, 4, 12, 0, -2, -26, 3, 26, 3, -16, 32, 4, -2, -10, 1, -2, 39, -14, -55, -27, -26, -5, -9, -21, -28, -13, 8, 4, -9, 25, -12, -5, -10, -21, -10, 2, 35, -1, -14, -7, -5, -14, -18, 5, -17, 11, -9, 28, -11, 16, 0, -7, 15, 4, -2, -4, -18, -20, -4, -16, 23, -9, -6, -12, 9, -38, -2]
8125bl0K5L8k2k2j5K0K3k1Kk3K9kJ2j8pj3L7j8j4K6jkj4rOL5l8LOj4K1J3j6k5
8160c0K5J2j1QK7n4jJ8mK2QkJk8K2k1J1Qk5K4j6LJJ6k6J1k1K9j2J6j9
$$ y = [-2, -32, -7, 31, 9, -13, -28, -8, 15, -6, -4, -27, 2, 0, 12, -6, -13, -26, 11, -7, -21, 5, 4, 2, -12, -21, -15, 20, -18, -15, -9, -23, -2, 11, -5, -30, -5, 7, -4, 4, 31, -23, -24, -6, -10, 12, 20, 18, 19, -9, 13, -8, 3, 11, -14, 10, -6, -3, -2, 14, -12, -1, -22, 7, -5, 11, -8]
8191h
$$ Imaginary data points
##PAGE= N=2
##DATA TABLE= (X++(I..I)), XYDATA
0@%%%%%%%qJ6j6J6k4L2l2M0n6O4p2Q8j04J25j49J74k00K30k67L04l46L94m46N03
31B66n67O37p12P98q92R94j105J226j360J507j669J848k046K265k509K784l094
48a629L446l851M323m880N547o364P396q747J0598j3302J7677k6265O7527j55602
62a04126M6516K09736k58672O6713J79332k05578j43J70283j56747J3567J26270
73H7151j18320p151Q8870q5920K7711N6090p8476K1599L7222o4513M1362K7952
85C3577n9676K5214J9659m3514K5877J8190k4832K210Q50K252L577j3084K2773
98A3073l411l7509L7814Q411n0053M5127J4695o5438L9323K6628n9169L4896K4323
111B8710n6878K8141K0149m4127L1812J0254m1175L2793q88l5946M6553n597m4372
$$ y = [0, 0, 0, 0, 0, 0, 0, 0, -8, 8, -8, 8, -16, 16, -16, 24, -32, 32, -40, 48, -56, 69, -80, 94, -106, 124, -143, 161, -185, 209, -237, 266, -301, 336, -376, 422, -470, 524, -581, 645, -715, 792, -877, 971, -1075, 1190, -1319, 1465, -1629, 1817, -2034, 2289, -2591, 2956, -3408, 3988, -4759, 5839, -7463, 10214, -16051, 51476, -104126, -57610, 152126, -106546, -39833, 139499, -66079, -66222, 104061, -52686, -39119, 87151, -31169, -38320, 50550, -35370, -7659, 48431, -30045, -8446, 28776, -35737, 5625, 33577, -26099, -885, 18774, -24740, 1137, 19327, -5505, -3295, -2445, -193, 3384, -9700, 13073, 9662, -27847, 9967, 18378, -31675, 13452, 28147, -37291, 2032, 28660, -30509, 4387, 28710, -28168, -27, 20122, -24005, 7807, 18061, -23114, 9679, 8791, -27155, 19398, 13801, -30571]
124c0571M8270n876m6960N4108J592n3385M4924O718n1530M0175J7417m7160K2349
137G1J6389l4377J6919J6828k3862N870P797j2413O895L803m702M188o975j263
151d832J0629p007p00Q914j1514j022J2102q177p66Q964r671j427Q452n449J655
166A51M368q658K546M930o698M644L278r210M014M038p560M992M087q492K203
181a367L819m850L009K028m597K045K31k282L857j248k376M021l342k150O785
196C583k906l898O172k822m243O937j167m961N335o64n055M582J372l921J975
211C19O43k667J582J282j228k5Q0j59r7l2J212l31j645J129K44j112J607P2k038
230a164J201N12j506J385N49j744O50M04r68J113L76j369M09L30o23P11J32o50
$$ y = [-30571, 17699, 11823, -35137, 18971, 20563, -32822, 12102, 18820, -32710, 7465, 24882, -22278, 71, 16460, -17917, -998, 15830, -8032, -2162, 5635, -6778, 117, 3920, -782, 3406, -3569, -4832, 5797, -1210, -1910, 7004, -4510, -5532, 6570, -1607, -2373, 6591, -3080, -4507, 3945, -1504, 151, 4519, -4139, -1593, 3337, -3361, 1283, 4561, -4649, -635, 3403, -4157, 835, 4922, -3570, -1367, 2452, -2398, 611, 2639, -1958, 87, 318, -1964, 1893, 645, -1731, 2290, -1052, -3202, 3583, 677, -3221, 2951, 129, -4114, 2823, 1656, -3305, 2030, 1366, -3689, 893, 2265, -1656, 319, 962, -1705, -123, 1159, -69, -94, -14, -173, -270, -302, 910, 579, -1066, 63, 307, -805, 802, 874, -1164, 37, 549, -957, 428, 977, -767, -117, 287, -681, 432, 808, -561, -152, 178, -445, 266, 398, -252]
248b52L18j64k59O17m2k47R1m04J76N53m35L1K92o43J46O13n49J44L62o92j6P47
270C87l90p9L56m06j43M34n8j84K58j23k53J25K14k5j52L0j9j08J91J44k62J8
292d5J71k97Q1L11j89j20K20k35QL01j62j62J50k2j33J83L3j49M0Qr2J11P1q6
316dp9N6K2J4%N2q8k9O7m9M0R2q9j31J26K2n9O3K0r0L8M1o8O8K5r4k7O8KNJ4k8
348@m2L3KK3nL0k9m2O1%Qj5l5nPM4l1kN0o1k0O1k3nMj7l4O4rl9rL0J2m3N4qm4
385c5O2n3K5jL8n4j0J9oJ2J7j2oPj7J3J9Mj6QJ0j3j9K8l4K1J6m0J2L7rk6j6J9
419@OlJ1k9L1Ml8J9jj7J1J9j4k4J6N7n2K0j9Rjjl2OK9k1Lk0K9qOJ9m0K3j2L4l4
456a4M5rm0rL6J1k9QMmK1Nj3lj3QJ6k6M7k3j1j0OJ8Rk5J8k2J2k0lJ5rOrKK4k0
$$ y = [-252, 66, -98, -357, 260, 218, -29, 62, -342, -166, 387, -48, -17, 275, -368, -222, 391, -158, -14, 348, -344, -360, 387, -3, -82, 274, -132, -275, 159, 101, -83, 175, 52, -201, -76, 138, 113, -39, -9, -28, -136, 55, 199, -63, -45, 126, -171, -90, 221, 32, -88, 132, -103, -95, 206, 44, -118, 32, 10, -123, 60, 93, -56, -16, -8, -100, 11, 82, -4, -83, -27, -5, 9, 9, 61, -27, -56, 11, -38, 2, 94, 5, -126, 0, 22, -37, 26, 46, -44, -6, 35, -33, 35, 60, -34, -61, 7, 9, 14, 28, 0, -42, -9, -7, 16, 11, 41, 12, -30, 31, 31, 39, 24, -11, -16, -9, 35, 4, 2, 52, -9, -29, 32, 9, 4, 8, -9, -43, 21, 12, -27, -36, -6, 6, -37, 17, 9, -35, 27, -26, -1, -2, 36, -18, -28, -9, -15, -3, 14, 2, -4, 3, -14, -1, 18, 22, 6, 14, 24, 11, -8, 20, -14, 7, 23, -17, -5, 32, 23, -3, -19, 0, 6, 3, 14, -15, 16, 20, -18, 1, 0, -17, -6, 13, -1, -25, -9, 48, -4, 16, -3, 6, 5, 4, -28, -22, 7, -14, -11, -31, -2, -10, -4, 15, -25, -2, -14, 20, -14, 31, 22, -18, -27, 9, 20, -9, -1, 3, -1, 20, 25, 12, 9, -4, 4, 20, -6, 41, 18, 7, -3, 3, 21, 30, 5, 23, 1, 13, -7, -10, 5, -4, 2, -7, -5, 19, -1]
494ak4J7MK3k4j5K1Pj7J6Jl9M0l3K1J3ql3L8Jl1L3jl8J1nK9j6L0k0kL1m8N1o1
529b9J7L0l0K9J6k3QqPl0jJ6J2lj5MJ1j3Nkk1MK6k5K6j0K3m2K5Qlm2KN0k7j7K2
566@%j0rK5k8nLK6J3k5oJ6m6N3nMOj9K9l4J9k4M1l3J3Jj0J5mJ8k4K0Kj5rJ6l5
603b1K5qj3M0j5k9OL6m2K8nj5M0m6L2j8j7K1k4R%L0Mj3%j9j2K8MK1k9J8Lj5lJ9
639B0lk4JK0J0k0J0Rk7K8m1L7qRj8j4J8LMj6J5J0Qk7Oj1j0J2JOj3K6j2%k1K1j3
676dJ1JLKqJ8j3qj1J7k8J2kmJ2jk2KPMK9lj4J8n1QK7Qj6J4k0J5%Ok0QJ1k1K2k3
716a4M8n7L8l4QJ0J8j9pL2k0J9l9L7qk6%MmM5n1K6j3K1ol1j8L6k3jL9%l2J3J1
751BNk3J2LMj3PK0pl9J5K6m5N1k8L2Nm9K6MRkJJ0j2j3J6K6m2k2L5l0L0j8K9j1
$$ y = [-1, -25, -8, -4, 19, -5, -20, 1, 8, -9, 7, 8, -31, 9, -24, -3, 10, 2, -31, 7, 8, -23, 10, 9, -29, -18, -23, 6, -10, 20, 0, -2, 29, -19, 32, -29, -12, 18, -12, 17, 33, 10, 18, 10, 17, -13, -14, 2, 14, 11, -4, 0, 11, -2, 3, 1, -20, -16, 10, -15, 11, 1, 24, -18, 7, 15, 12, -30, -28, 22, -5, -22, 0, 0, -10, -19, 6, -22, -27, -24, 2, 15, -10, -16, 0, -46, 7, 2, 6, 12, -7, 22, -12, 7, -17, 24, -9, 4, 5, -5, 10, 6, 24, 0, 20, 22, 7, -2, 14, -21, 4, -4, -17, 23, 8, -21, -15, 21, -21, 7, 2, -13, 27, -19, 13, -5, -22, -1, -25, -16, -16, 14, 18, 5, 5, -14, -26, 2, 6, 27, -2, 16, 19, 4, 1, 20, 17, -7, -6, 14, 24, 4, 14, 23, -4, 24, -17, 20, 12, 21, 3, -11, 7, 10, 14, -2, 13, 23, 31, 4, 10, -1, -11, 1, 2, 8, -5, 21, 9, 9, -12, 9, -4, 7, 8, 11, 13, 5, 23, 10, 2, -9, 8, -20, -8, -10, -14, -2, -3, -25, -23, -16, -12, 17, 14, 0, 18, -33, -25, 2, 10, -6, 8, -12, 3, 3, 9, -11, -3, 8, -13, 9, -14, 34, -23, 15, -19, -11, -1, 17, -2, -9, 23, 3, 22, -17, 20, 12, -14, -14, -10, -14, 31, -20, 6, -7, 14, 8, -23, -41, -5, -28, -29, 10, 10, -22, -9, 2, 7, -16, -4, -1, 3, -10, -3, 17, 10, -29, -14, 12, -33, 18, -10, 22, 27, -22, 4, 8, 17, 15, 16, 26, 14, 1, 17, 43, 1, -21, 14, -16, 14, -4, 25, 14]
787A4mk5L3j1k4K7k6PnK6m6MM7j2l0L2qj5K5K1m4JQk5K2j1K4k5J8JJ2rk5N6n6
822b3L4l0J1J1J3l1K7L5j1j9m3K2J2mJ2nj0M0l1k6K4Rk7oJ8Pk0lN8k8k7J4%LK
857HNj5j7jK4j9J7J5j8KK6n0Qk5L0J7j9qL5om4rJ4NL7l5M0k5K5l3K2j0K4j1rJ
893AnRL0j9Nk8J0k9L8j5K7ml3rL1j7K6J2k9j0nJ5J2j8k4L0k0K0Mk3J8K0n2K8k4
928b8K7NqpK6l5J4J2j1OJ1rrK1k3J1oJJ4l9JM2l4J8j4j1K4Pj2K6l3L2k8oK3j8
964a0J3QpL1m2OJ3l3j5N9k9j3K6k2OM3l7j8%%qL0j6k2N7l8J0rL3J2n1j7L2J5r
999bNJn6L3K0rj0Kjj6M2Om0K1KRJ2k7mK1K6k7rK5n9O4m3nJ7mL5k7l5K8kK7l0J6
1037FqK3m4J2J1j5L3l3j6P1k4k0K3Qlk3Pj9k4jL5qj4LL1m0J0J0Qj0mJ1j6K2J0
$$ y = [14, 10, -15, 18, 7, -17, 10, -16, -9, -14, 12, -34, -30, 17, 5, -25, 7, -1, -16, 9, 30, -14, -13, -5, -30, -8, -19, 5, -20, -2, -1, 11, 2, -23, 33, -23, 11, -19, -8, 3, 16, -15, 12, 47, 36, 17, -26, -4, 8, 4, 16, 11, 1, 41, 10, -16, 8, 17, -10, -16, 2, 9, -11, -14, 44, 16, -11, 3, 3, 6, 8, 13, -2, -19, -20, 4, -15, 2, 17, -1, 1, 27, -23, -15, -40, -10, 7, -12, -20, 15, 9, -35, -44, -30, -25, 12, -23, 17, -8, 17, -16, 6, -4, 20, 9, 0, 1, -4, 5, 35, 16, 21, -7, 3, -26, 12, -3, 24, 20, -13, -22, 9, -8, 18, 30, 1, -9, -14, 1, 13, -5, -29, 1, -19, 1, 5, -18, 0, 20, -32, -4, -28, -1, 4, -4, -11, 15, -20, -6, 6, -5, 1, 12, 3, -6, 15, -8, 3, -3, -2, 12, -27, -26, 16, -18, 0, -14, -25, -1, 6, -6, 20, -13, 19, -9, -15, 8, -10, 3, 11, 4, 35, -7, -1, 12, -21, -36, 23, -6, -19, 7, -15, -9, 34, -3, -21, -21, -21, -29, 1, -15, -37, 20, -18, -8, -17, 16, 28, -23, -40, -8, 7, -2, 3, 4, -52, -19, 1, -8, -18, -16, -17, -33, 9, 15, -25, -4, -2, 7, 19, -8, -12, 9, 35, 8, -1, 24, -35, 29, -14, -19, -2, -6, 29, 2, -33, -5, -7, 20, -10, 6, -2, 21, -23, -11, 0, -15, 18, -15, -31, 40, 16, -4, 19, 27, 24, 1, 8, -11, -35, -36, -1, -9, -23, -20, 11, -29, -19, -9, -1, -11, -15, -4, -20, 2, 12]
1072A2k3J6j4L2j1L1k6Nk9Mk6K7L9k7k9J8k6N3j6m0L4JJ3l8K1J8k3qL6o3M2l6
1104c3M0k0K5k6j5J3j2L7pmJ5k7JL1m0L5k3J4k4K4oj3L0j5pk0L6j1J0OqJ3j0J5
1138B4j3%JrNJ0Lokj3rMJ8K7j6k4M9m8J4jMjk6J6l5J2J1pMj5QJLj4J9J7l3K3q
1177gJ1k2Pj8O4m5J0Pm3N3j8j5K3K7l4J5L4l5k0l5M2LJ7J7n6N3j8rPP%m1OK9L
1212A9k6j3OJ2rPJ9j2k1mK0J6j2j1K9m0nJ5M0p5L9PPl4K0Jj9M7l5Lj4mlRM4l1
1248hK2k8J3oKK1mj6%J6j5L9j9k3J5J1j3L0j5J2m6K0kkPJ8l1j4J3j3j2J0K0qJ7
1283A1Jj2jj0ONk8K1j0oM0K6o8L2mj1qL2j7J5k9JOJ1JkJ0ORj7J0J2l4k8L4k8L2
1320HoJ6j8J9%j6km%PJ5j3OrJ0Ln3O7n8QMLM1l8OPk8J0oOJ1J5k9J7J8k6K3Rj9
$$ y = [12, -11, 5, -9, 23, 12, 43, 17, 22, -7, -3, -29, -2, 37, 10, -19, -1, -27, 26, 10, -30, 4, 5, 18, -20, 1, 19, -4, -12, 24, -39, 3, -33, 7, -13, 12, -14, -29, -16, -28, 9, 2, -2, 13, -14, -13, 18, -22, 13, -10, 4, -20, 4, -2, -15, 15, 0, -7, -27, 9, -2, 8, 14, 6, 19, 9, 24, 11, 11, 12, 3, 8, 18, 21, 15, 13, 0, -9, -5, 13, 40, 24, 0, 49, 1, 15, 14, 18, 17, -9, 7, -28, -16, -5, -12, -8, -23, -15, -14, -11, -25, -6, 11, -22, 1, -7, 4, -18, -11, -29, 35, -10, 0, 7, -36, 17, -1, -16, 7, 34, 0, 15, 49, 14, -6, -41, 1, 4, 21, 38, -18, 35, 17, 8, 15, 22, 22, -19, -13, 16, 19, -7, -20, -14, -2, -11, -4, 15, 3, -18, -22, -2, 14, 2, -9, 20, -20, -25, -10, 30, -45, -6, 1, 8, -26, -6, -5, -24, 23, -12, -9, -23, -27, -30, -21, 23, -8, 14, -14, -1, -7, -5, 16, 12, -4, -4, 12, -3, 36, 17, -6, 9, 20, 7, 37, 22, 34, -12, 8, 6, 4, 11, 29, -2, -16, -3, -16, -28, -18, 2, -6, 11, 12, 0, -1, -11, -5, 0, -28, -7, -17, -23, 17, 43, -25, 7, 3, -8, -16, 16, -1, 14, -15, -14, -8, 3, 4, 2, 12, 18, 27, 10, 20, 32, -2, -30, 4, -24, 8, 2, 18, 0, 19, 19, 3, 1, -3, -3, 4, 19, 6, 12, 3, 13, 16, -37, 30, -28, -20, -16, -13, 28, -10, -4, 3, -25, -15, -21, -15, -4, 11, -18, -1, 17, -9, 14, 23, 4]
1359Dl0M6k3k6K5K4l0K7j5mK1k1J0L4l5OmK9m8KL6l3K0OMl6J7rJ6NLJ7j0k3%J3
1395A8J3k2kK7k4%j2kL1m2J9k9RK9l7L2l9L0kj6K1K7n5K5J3qNqoQnj6j1K3l1L0
1431gL3ok8K8l8M0l0JJ2nRlmj4L3Kj0j8j1M5m0jJ9%j1MK0qj1J8k5L6k6j2j5L4
1467A1j7Ql3L1J0p%l6L0j8PkLj1lkpK2K5k7J5ljj7J2Kj4K8%MlJ8Nl0oM0m8L5k3
1506bJ1QMrJ7Kn7K8J5l%j5j7L4k2lk7L4J6Pj4J0k9j6L2rqN4p5K8J2JK9m5MK8o5
1543d2N0oL2n2J4l0L7j7%K1pMk4K6rJ8l1L1J2ol3j0J8M2j6l7LL5k0K5m5NJ4K0
1577B2l1k9L4Mk2jLJ1J4J0j5j4j7L3j5oK4k7K3J6j7Rj2nmJ1J0l1%K1J6j9qK0j9
1612a1PJ1Kk2K0k3L7J5k0j7J0k4J2J2j8J2l1J8K2r%J8Lm2RLMk2K0Rl2PM0q%j7
$$ y = [4, -26, 20, -3, -29, -4, 20, -10, 17, 2, -2, 19, -2, 8, 42, 7, 13, 9, 38, -10, -8, 28, -5, 15, 21, 25, -11, 6, -3, 13, 18, 21, 38, 28, 5, 5, 18, 31, 9, 7, 34, 10, 10, -2, -4, 27, -15, 4, -25, -16, 13, -24, 8, -31, -1, -3, -19, 2, 29, -26, -1, 12, 4, 9, 1, -5, 3, -2, -18, -29, -6, -37, -7, 26, 20, -8, 20, -18, 22, -8, -7, 5, 0, 9, 6, 2, -12, 21, 23, 13, -5, -16, 29, -11, -12, 7, 7, -4, 0, 20, 12, 1, 19, -6, 30, 4, -8, -23, 11, -6, 2, -31, 0, 10, 3, 3, -33, -3, -21, -14, -16, -13, -24, -27, -29, -36, -14, 11, -16, -1, -4, -5, -22, -10, -8, -22, 6, 6, 10, 7, 25, 30, 0, -6, 34, -14, 21, -2, 9, 17, 21, 12, 29, 31, -26, 2, 17, 14, 14, -1, -18, 16, -6, -9, -36, -2, 14, 21, 7, 17, -12, -28, 4, -5, -13, 41, -34, -6, 6, 7, 36, -9, -5, 23, -42, 8, 2, 34, -18, -4, -34, 3, -14, -14, 7, 0, 4, -20, 6, -3, 15, -16, 15, 27, 21, -12, -22, -4, 38, 22, -15, -12, 23, 3, 28, -17, -12, 2, 22, -9, -38, -4, 0, -22, -23, -20, -9, 5, 15, 0, -14, -31, 2, -13, -19, 5, -22, 1, 17, 0, 9, -3, -8, -12, -1, 9, -22, -22, -1, 15, -4, -12, 8, -11, -4, 7, 9, -13, 7, -16, 21, 36, 16, -1, 9, -15, -3, 9, -9, 3, -28, -10, 12, 3, 3, 21, 24, -18, -9, -6, -2, -24, -4, 5, -27, -20, 20, 12, 12, -5]
1648ek0K7j4kmnQklJ8Nk8L1Lj9MrJ8j1J4k8L0l5K8k1M2j9Nj8K0j1J2oj7J8j9J
1685a2J6j5L3l0J0k6J5J9rNj3NK1l0QkL6k5J7k1k9K8oJJ7j2k5J9j8M9k3J2j1j2
1719hK0l1kK6k7Rk2K8J0Mkkl2Rj1L0k7M9j0JL7o2NJ6pjjMkoRKK7k3Jj5K5kl3K2
1759HmrJ4pk0OJ8nKl4L5j8PlJ%%K1j8K2lk5MJ5Ql7L2j7K3Jl6L5k6OJ1L5n5mK0
1798CnK2rPrK2j2k5k5M4mJ2l2J5N%PkmLj2K6qJj3J6pJ1j6j5j7RK8k1k0L3l8J4
1836a6qL2Mk9J3J4k5pMJ3k5J7J7nJ9j6K8n5J7M3j9lomJk6L3J5Oj8K2j7k2K9l4
1871hJ7J2Kl0J3N4m2k0K5j9NJ7j2j9K8m0J2NLrLK1j7j5Kk3K6Kj2J0mK4l5J8j7
1906b3L3J9m7K4k9M4m7K7Pj0J7J0l2MkmnK7jKJ0oJ6l4J7k4j1M6j0Rj7pJ7%J0l7
$$ y = [-5, -25, 2, -12, -14, -18, -23, -15, -17, -20, -2, 3, -25, 6, 9, -10, -6, -15, 3, -8, 6, -22, 8, -27, 1, -20, 22, 3, 8, -10, 10, -1, 11, 5, -12, 6, -13, -12, 4, -11, 22, -8, 2, -24, -9, 10, 1, 6, -7, -2, 19, -11, -3, -5, 31, 6, 23, 2, -27, 1, -5, -4, 13, 1, -24, -5, -23, 26, 3, 15, 4, -8, 12, -19, -21, 5, -22, -13, -35, -7, 3, 7, 5, 3, -29, -20, -31, -1, -28, 21, 11, 12, 49, -13, -8, 8, 1, 0, -1, 3, 1, -5, 4, 6, 33, 10, 11, -4, 21, 19, -14, 8, 4, -5, 9, 2, -18, -12, 6, 1, 3, -31, 4, -14, -7, -10, -9, -9, -9, 12, -6, 16, 13, -12, -8, 7, 15, -22, 10, -7, 16, 17, -19, 16, -10, -4, 7, 42, -13, -17, 3, -2, 20, 11, 18, 9, 31, 19, -6, -31, 13, 9, 21, -11, 4, 9, 9, 16, 14, 10, 13, 1, 27, 19, 20, 7, 23, 16, 27, 11, -4, -21, -12, 16, -5, -25, 8, -30, -16, -24, 8, 12, -17, -4, 10, -15, -22, -18, -5, -30, -13, 4, -1, 18, 2, 30, -25, -8, 35, 16, 13, 7, 3, 4, -22, 11, 26, 32, 14, 36, 19, -3, 26, -8, 9, 21, 23, -7, 6, 60, 18, -2, 23, 4, 9, 26, 14, -5, 23, -17, -5, 0, 3, -6, -3, 18, 1, -14, -12, -35, -9, -7, -19, -9, -13, 11, -24, -6, -23, 10, 29, -18, 6, -23, 21, -26, 1, 8, -2, 15, 25, -7, -3, -5, -9, -14, 13, 12, 14, 24, 18, 34, 0, 17, -7, -18, 28, 18, 27, 10, 3, 20, 20, 30, -7]
1942gRn2M3K7n9M3l2L3k1PoJ0LJ3j8NK2n7O7n5nJ5J3lk0K3k0L8l3nL5j1k0K1k4
1977b1K3k4J1J1Pj0L2k0j7k7N6l2K7j4pL0l0J7k4K4k6K0K6l2K8k8J2PJk2%K6k3
2010AJ8Rk7pL2k7j3L1l0j7oN3j7k1J5J5mk4J8Kk9L4K3o4J6K8kj3J1l1P0m2jK7
2044B8lj6j5L1k1J0lPOJ8l2k0qN7m3L2k7J2j6J3K3k6Jm1K4mK9j2j2K0l2J3lJ8
2078Hl1L4Nk4JKl8J3pJ4L0nJ6pl2L5k7kL4l4l0M6%L9k8mj5L6l3pK3m4L7k3J7J3
2114A2Jpk9L9Nl0K3k2J0MOl3M1m2K5%j4J0k9M6oj2J2nJ1l0J2kk0J1k1J7j1j5J4
2149b9J7K9k2PpK1Lk6%L9j4J0k1n0P2k2Lk4L9j8K0j4nJ4j9MnJ6k9K1j1L1l1rK6
2184A6l5pN2rMm2M6l7LrN2k3k3J1l1P1n2L1k0l3J1j1K4QnmK3k0j2J7n%J2J9k9
$$ y = [-7, 2, -50, -7, 20, -39, 4, -28, 5, -16, -9, -15, -5, -2, 11, -7, -2, 20, -37, 30, -25, -30, -15, -2, -5, -25, -2, -22, 16, -17, -22, 13, 2, -18, 3, -21, 2, -22, -11, 0, 7, -3, 29, 9, -8, -35, 21, -11, 16, 2, -5, 25, -5, 12, -12, 12, -14, 6, 32, 0, 28, 0, 12, 19, 20, -2, -2, 24, 1, 19, 28, 1, -6, 26, -1, -14, 17, -13, -30, -36, 17, 0, -21, -6, 9, 5, -19, -1, 1, -28, 6, 29, -35, -19, 9, 7, -6, 5, -26, 44, 2, 1, 28, 25, 9, -6, 25, 4, 14, 11, 18, 24, 42, 10, -10, -18, 39, -4, 28, 1, 13, -3, 10, 33, 7, 8, -33, -9, -13, 16, 4, -8, 12, -20, -7, -10, 8, -23, 11, 16, -8, -7, -5, -43, -30, -37, -23, 7, 2, 18, 11, -21, 14, -13, -15, 19, -15, -45, 1, 1, 40, 12, 8, -7, 29, -4, -11, 12, -32, 5, -18, -1, 12, 13, 6, -23, 16, 21, -9, 14, -8, 2, 6, 12, -21, 20, -22, 3, 3, -11, -1, -30, 16, 10, -2, 10, 5, 16, -14, -2, -4, -24, -13, -34, -17, -28, -43, -29, -12, 17, -5, 2, -5, 16, 19, -7, -7, 32, 18, 28, 7, -43, 29, 7, 10, -14, 25, 7, 27, 13, 8, 22, 3, 7, 2, 18, -11, 10, -1, 30, -1, -10, 16, -19, -26, 26, 17, 21, -21, 25, -12, -9, -18, 34, 11, -12, -1, -32, 39, -13, 18, -2, -35, -24, -35, -11, -3, -8, -12, 11, -9, -21, -4, -9, -9, 3, 22, -7]
2219gN2j4l7jJ3K6k2J0j6J0pj0K8k0j4L5j8j6K6Kj3lj5K2j4M5k0k9j5K6mJ2qj5
2253a1k0L2ql7K3oL0j9qj9N9m6L2j2KK0mJ2m0K3oj5NNJ9J0jJk0nJ8k5PnJ9r%q
2291gj4L2l8O3j4j4lJRJ1m0L8j3Mk4K1k3J9j1RK0k7l9M7K2m6KRpJ5j2Pj4J5j2
2326a4J2K8l3nj6K9lnK5l4J9j8KJ8k6M2j6mj1J5j5pK2jj7K7J1l1PlJ8j3Jj1K1
2361A4l1J1l3N8l8J0J6rK3rj4kKqKqL2l7K7PKrJ0l0l0L7j1QJ1lj2JKJ8k0pJ2N
2399cpJ2Pj2K1n1L1RnJ9j7QJ2j8j4K3rk0K7j8KRORl0M7o3O2m7%J9mk4K7Nl2N3
2436C4m5JJ4Rj3J2l6L6k8K0pMJ2l9K0pj1M1PMk4Kj7k5KM1kj0QLQoj2k5K8J7Rk6
2474aJ1K5k6Pk9K1Lj9oM6ql1J7j0NL1m3l1L2MK4l2J2K1j8j5K0n%j9J3L3l1J0m
$$ y = [-7, 45, 31, -6, -7, 6, 32, 10, 20, 4, 14, 7, -3, 25, 5, -9, 26, 8, -8, 18, 20, 7, 4, -11, 11, -3, 42, 22, -7, -22, 4, 0, 12, 4, -11, -31, 1, -7, -44, -21, -27, 3, -16, -24, -43, 16, -30, 2, -10, -8, 12, 8, 20, -20, 3, -3, -18, -13, -8, 11, 21, 20, 21, 1, -4, 14, -11, -4, -9, 10, 1, 1, -7, -21, 11, -27, 36, 22, 8, 5, 6, 15, 26, -14, 24, 11, 15, -9, 12, -11, 8, -3, 6, 26, -1, -40, 7, 29, -17, -15, -6, -13, 2, -10, -3, -17, -2, -14, -2, 26, -7, -12, -28, 1, -2, -7, 18, -16, 3, -15, -13, 5, -21, 21, 5, 1, -10, 5, -10, -17, 5, 4, -13, 14, 25, -6, 1, -2, 16, 3, 4, -7, 14, -17, -6, -39, 19, -19, -9, 7, -2, 21, 12, -2, -4, -2, -10, -8, -16, 16, -21, 6, 13, 15, 6, 16, -14, -44, -7, -18, -10, 1, -2, -14, -13, -11, 7, -13, -20, -8, -3, -10, 2, 9, -3, 18, -33, -2, 7, 2, 21, 4, 12, 24, 6, -8, 15, 6, -14, 13, -5, -3, 6, 12, 21, -9, 38, -25, 37, -10, -10, 9, 5, -19, 8, 13, -19, 34, -11, -10, 4, 13, 0, 12, -24, 12, -16, 4, -3, 1, 13, -26, -6, -13, -24, 17, 24, 28, 4, 6, -11, -36, -34, 7, 5, -5, 3, 6, 14, 8, -4, -29, -1, 16, 25, -1, 10, 35, 9, 16, -13, 8, 11, -8, -14, 32, 24, -7, 10, 0, 5, 36, -7, -38, -6, -2, 22, -10, 2, 23, 5, -10, 10, 5, 5, -14, -1, 32, 1, 11, 7]
2509Gk8%J2K4rk3J9Pj2J2rk2M6k4j1J2m4N3J3k7JJJ3J5l8PJ7Olj4kL7l1L6l2j5
2545fL5Rl7pOj9K2j7K9Kj7rK3j4J4j4MomRKj7k0K0j1KJ1JmJ0j9PK6Rk3qjJ7qK6
2585B3l4k5K7PLK0m5M2k1lK1qJ9k6lmK0j2j8K4j1L0l3j0oL6k2K5k3lPk3N0l6J4
2620BK0m5L1Nj1j4LL1k7Om1L1K1j2NJ3mj1%KNk3L4k3j9J3L5m6J9j0J2KK0k1JL
2656Gk4L3Lj3mJ2j3%J1nk3J1J6mj2kK3kll0K3nkk0J6jJJqKjJ0M%J6k0OoK2k6l
2697a0j0L9l0j2J5j7L3k1nM6l1J4j0QK2ol0KJ3J1n6M9PJ3k8k4K1OKRqmk2L1l5
2732a8RPmL9k8%K0k9j4L0l1K9nOk8Oj8kJ7K4NPk6%j3K6j2K0j1k0OJ5j7k3L6J2
2768A5kj3K1qk0K3j2k7L2Lj4MQjj8J4oK2j9J1OJ4k7omlJ2m%J7n4L3J6j3oqLKK5
$$ y = [7, -21, -21, -9, 15, 6, -17, 2, 9, -3, 9, 0, -22, 24, 0, -11, 1, -43, 10, 23, -4, -3, -2, 11, 26, -12, -5, 12, 18, 15, 1, -1, 36, 5, 41, 9, -6, 29, 38, 1, -6, 0, -19, 3, -14, 15, 17, 0, -9, 14, 0, 14, 0, 4, -2, -6, 3, 5, -12, -32, -12, -23, -21, -10, -9, -13, -3, -22, -15, 11, 20, -3, -11, -12, 5, -3, 23, -11, -36, -9, -2, 1, 21, -24, 18, -3, -6, 15, 7, 26, 0, -3, -7, 13, 1, -17, 7, -4, 26, -7, -17, -23, 13, -9, 16, -7, -10, -3, -26, 24, -12, 2, 22, -23, 8, 13, 2, -12, -9, 22, -5, 1, -40, -9, 12, 0, 5, 18, 14, 3, 3, 5, 10, -13, 21, -2, -21, -8, 27, -19, 0, -10, 2, 4, 24, 3, 4, 7, -17, 16, 19, 6, 2, 14, 1, 1, 12, 7, -16, -5, 11, 7, -5, -7, 16, 14, 11, -19, 4, -1, -3, -23, -7, -8, -7, -6, -14, -12, -13, -3, 1, 1, 17, -3, 3, -3, 19, -7, -10, -20, 19, -11, -23, -8, -25, 8, -13, -18, 28, -3, 11, 1, 9, 31, 25, -5, -3, 10, 21, -35, 14, 21, 34, 6, -18, 3, 9, 11, 20, 12, 8, -14, 17, -18, -9, -2, -6, 33, 5, 5, 25, -4, -18, 12, -19, 10, 5, 11, -17, -11, -29, -31, -14, 10, 15, 22, -4, -4, -17, 9, -3, 17, 6, -14, -8, 7, -10, -33, 3, 15, 13, 0, 21, 13, -7, 16, 4, -23, 9, 12, -2, 2, 10, 9, -9, 5, -1, 21, 2, 13, 19, 33, 6, 0, -4, -7, 5, 1, 1, 18, -36, -3, 13, 0, -6, -14, -11, -9, 16]
2807A6m1L4J3p6L5K3k4QL3j0k0nqJNJ9mk2K1j1j0M4J2k2J1pJ1p5O9J1m1M2k4J1
2841A9K2j6j5Ol8L4MJ1Ok6k1L4k7j0L7j0J4k6oqK5l6L0k1J0LpK5l2K2j4J2k5J7
2875gK2j1k2K5J5l0nmK1J6k4%J3l1J4M0l0k2L0kk5K0LK9Ol3J1j5lj5J9j2LRNJ
2911A1lJ1j6Jj2kj0M6l3J7lJ0j1J3l8jLJ8JJ5j3pNk1K0M%j6lmJ2LK2Oj9rjJL3
2950C0k0oQj4J3K2l0Qj1J1JJ6l2J0rkmK9k8K7LlKk1J4j7J0K2k5J3m1MM0m3MkJ9
2987bOm7oO1j1J3pk7J6J3kj1j1pL3Pj8j3pjJ3J6J7Rl5L%NmOrJ1Lj5j8K2K7k9q
3026gL9rlrJj8J4k2M1k7MK3k0k4L0k1K0J0m5NJ7j6QQJ4j5pK5rk8J9J7j8N%k1L8
3063A9k0RJ3l0MQQk3J6Jnj1L1JJ2m0JNj6L5k0oL5k1j1mJ4J3pNK0rj5j3K3omrJ4
$$ y = [16, -25, 9, 22, -54, -19, 4, -20, -12, 21, 11, -9, -14, -22, -21, -16, 3, -1, -23, -2, -13, -23, 21, 33, 11, 22, 15, 26, -49, 20, 31, -10, 32, 8, 19, 41, 25, 10, 16, -22, 12, 16, 27, 33, 7, -14, 20, -7, -17, 20, 10, 24, -2, -8, -16, 9, -27, 3, -18, -8, -5, -12, 13, -19, 3, -11, 1, -24, -7, 15, 4, -18, 7, 22, -8, -13, -17, 4, 20, -4, -4, 9, -22, -8, 32, 2, -20, 10, 8, -17, 3, 6, 35, 41, 8, 19, 4, 1, -14, 5, -7, -4, 5, 10, 11, 8, 19, 3, 4, -8, -10, -20, 26, -7, 10, 7, 17, 6, 19, -19, -20, -17, 1, 2, 17, 4, -3, 2, -19, 1, 5, 5, -11, -14, -18, -6, -3, 19, 25, 6, -3, -4, -3, 30, 10, 4, 12, -2, 11, 33, 3, 11, 0, 11, 12, 28, -4, 6, -3, -5, -9, 20, -8, 19, 22, 19, 21, 0, 14, -3, 7, 29, 4, 17, -24, -20, 20, -23, -19, -21, -2, 4, -43, -49, 12, 1, 14, 7, -20, -4, 9, 7, -4, -15, -22, 11, 18, 0, -13, -20, -21, -8, 8, 25, 34, -1, 2, 2, 7, 3, 9, 0, 11, 14, -1, -19, 3, 30, 1, -7, 32, 23, 20, 11, 12, -6, 8, -14, 27, 0, 4, 27, 7, -17, 13, -8, 12, 22, -23, -18, -1, -17, -9, -1, 13, -2, -9, 16, 7, -21, -2, 15, -3, 2, 2, -19, 19, -1, 8, 21, -9, -5, 3, 11, -12, 4, 5, 0, -11, 20, 21, 33, -7, -6, -1, -17, 18, -2, -8, 27, 6, -5, -9, 5, 18, 11, 16, 36, 27, 12, -1, 22, 16, 12, 3, 17]
3102A7k0nj4N1j9k4J0Nk1J5k6M3j2m7N9j4j6j2K4J7pRk6PK%J5%oj2K4J9j1oJ5
3137C4j0j0l2L8l0J0J2%K1m6j2L9k4K2J7k5j1MM8k4rkk0J0k4kL8k0J1mj5j8M3
3170Ij7K0rk4K1qJ2Ll2J1J1Jj3k%K9j5J4K2l2J1Rk0L0l7j1kL0rj3L7j8pl1M1k3
3206a2J3RJ3j8J5pnkmk4L1rOnnK3l3Oj7L7pj9K7jK1k2nJ1l9L0Rj4n3N0j0Ql9M9
3244Hm4OOK6j5j1RRJ5mjQJLk3j8K7J2j4J7qKNj6J3K3m5K0qK1n7L8LLJ9l2j5K2
3282EJPk0k1L7k6J9J1pJ8j6nnK2j1Kl0kOJ4J6k2Jj9PjL1j3j4%ML8k9j6J6M7k9
3319A6qj5L4m2K8Qk8J2LJ3j9K8j9jqJ9k3jK5k4K6l3PJ1pj5NNrolJ5pK6j2k3MK7
3357Ioj4K3j3l2K6RJk7j7K3M0n7L4lJ8oMK0m9K8Rnnqk3M3n4M2J9k4%j1L5k1rJ9
$$ y = [17, -3, -8, -22, 29, 10, -14, -4, 1, -20, -5, -31, 12, 0, -47, 12, -2, -18, -30, -6, 11, 4, 13, -13, -6, -4, -4, 11, 11, 5, -7, 17, 36, 25, 19, 34, 24, 14, -18, 20, -10, 0, 12, 12, 33, -13, -25, 14, -10, 12, 29, 4, -7, -3, 45, 21, 12, 10, -10, 0, -24, -26, 12, -8, 3, -1, -16, -34, 9, -8, 12, 3, -21, 0, -8, 4, 7, -25, -14, -3, -2, -15, -17, -17, 12, -3, 11, 33, 1, 12, 21, 1, 31, -6, -17, -19, 11, 2, -11, 26, 8, 1, -30, 11, -12, 1, 10, 23, 5, 20, 13, 8, 6, 2, -22, 9, 0, 6, 1, -4, 19, -14, -8, -25, 12, 5, -14, 13, 12, 33, 11, 6, 17, -22, 8, 17, 3, -50, 0, -10, -2, -41, 8, -36, -30, -24, 2, -13, -24, -15, -6, 9, 5, 4, 12, 13, 16, -7, -25, 2, 14, 0, 17, 9, 11, 16, 0, 13, 36, -9, 11, 3, 24, -33, 5, 8, 11, 30, -2, -17, 5, 6, 13, -7, -28, 9, -17, 2, 13, 6, 24, 8, 3, -2, 20, 9, 11, -19, -21, -15, -1, 15, -7, -6, -25, -18, -19, 12, -1, -15, -15, -11, 27, -2, -18, -2, 45, 16, 8, -7, 27, -15, 13, 21, -7, 5, 8, 21, 2, 30, 11, 10, 2, 21, -2, -3, 22, -2, 24, -9, -2, 9, 2, -13, -8, -3, -12, -18, -21, -6, -13, 13, 1, -22, -18, 9, 3, -11, 12, -1, -33, -7, 2, 3, -24, -41, -18, 22, -35, -1, -4, 14, 8, 12, 32, -17, 11, 20, 15, 10, 2, -21, 22, -32, 10, 29, 5, 5, -6, 29, 8, -1, 18]
3394A8LpoK2k8j0QkrJ7LJ2j5oJ5j0k4J6kK6%j8j3m5N3J0nJ1MOk0l2J2k9N2orK3
3432A5j2OJ2rrK0l4N7m8k2K2J0k2Nj1K9Qj1K1l4L1k4J0knk8K2Qj3J1qOqrM9k1
3468A2j6J2k7K8Lj8J1K0k4j2J0lOqL8k8m7J4K9j6J5j9J6j0jJ1jL2j2j2j2J9j2
3501bk6K8J1nK5m4K9mlLQlQJ0j4Lk0K0j6LlqRj2k7M4J5k2j1%JJ4Rj8j9pL1k6K8
3540InnNk1rJ6%K5k0j0J0J3pj3JJ3k7L1Lj7J6qjjJ4l4MM1k1j2kL4m1M0Jj1K0k8
3578CJ2j0J1j0rK1J4k8M%j5K8j9m4M5rj4J7jj0J2j0J9m4L8K4m3L9j6j9kJ9M6l2
3612A7j9%J5qk7K9k0M3n3J2J3jJ0j1L5l5K3k9K8Nk3Qk6L7k9M2nk6NK5l1qJ5Qk
3647A7l1NJ7K0Mn8L3%rj3K3j6J7j8J4j4nJ9m1K1JK2k3K9jl7RJ0%JK8k2j2L6j5
$$ y = [18, 21, 14, 8, 30, 2, -8, 0, -2, -11, 6, 9, 21, 6, 0, 15, 5, -19, -3, -5, 21, 21, 3, -10, -55, -2, 8, 3, 14, 18, 24, 4, -28, -16, -45, 7, 1, -8, 15, 3, 9, 21, 12, 3, 23, -11, 46, -2, -24, -2, 8, -14, -9, -20, 9, 17, 6, 27, -7, 24, 0, 10, 8, 3, -25, -3, 5, -8, 3, -5, 1, -7, -16, 33, 12, -4, 8, -19, 9, 12, -6, 5, 25, 1, -11, -1, -4, 2, -6, 32, 4, -43, -29, 0, -16, -1, -20, -4, -14, -15, -4, -5, 27, 15, 3, -9, 10, -2, -28, 0, 11, 6, 31, -13, 16, 12, 9, 12, 20, 17, 25, 35, 21, 24, 4, 24, 8, 11, 8, 0, 9, -3, -30, 14, 29, 7, -4, -4, -3, 11, 20, 2, -17, -24, 7, -19, 9, 4, -1, 4, -17, -26, -10, -10, 15, -5, -15, -5, 8, 1, -12, -11, 2, -25, 6, 9, -8, 8, 0, -1, -2, 12, -22, -18, 23, 2, -10, -12, 22, -19, 21, 22, 11, 31, 3, 15, 5, 16, 6, -3, 18, 32, 4, 8, 8, -7, 21, 2, -42, 3, -6, -20, -3, -4, -14, -2, -12, 7, -37, 1, 25, -18, 21, 5, -14, -16, 3, 49, 17, -2, -2, 13, 5, -22, 7, -13, 30, -23, -11, 2, 1, 11, 0, 35, 0, 23, -6, 22, 27, 4, 12, -14, 23, -6, 36, 31, 5, 10, 35, 4, -4, 11, 19, 17, -14, -9, 8, 28, 32, -26, 7, 7, -2, -15, 8, -8, 9, -9, 5, -9, -14, 5, -36, -15, -14, 8, -15, 14, 13, -24, -15, -5, -5, -4, 24, 2, -10, 26, 11]
3682A1kJ4Jomj1K7j1m1L5qJ5Ol8L3k4NK0Nl0J5j0j6L0l4J2N%K1l6kK8J1pk9J8
3718CL5j7Kl8J7j2mqJ6k5K8J0Mk1J5j8k8L6OL0k1kjpLJ5j2J5lKNk1kmJ2J7j5j5
3756cJ1kJ0j2L9l1L9n0Nnj9L1j9j8qO0m2J5J1ook3J5J7ok0J9rJ8l7J7J0oOj8N0
3792C3k7j6Rl0N1j8K0nj3J0j8J1jJ6n2K8MJ7k7pK5LJ7l1Kj1J3J5KJ2j6Lk0JK0
3827B0l2K9j5j6J3K7l2Pk3qKL3lk7J3j4KLj6L1J9k7MN7m8Mj6J5%lJ2J2j4PMl9
3863a9K3mK7m9O8m0J3oj8qQL1Kk4OL8n2J8K1k7j9K1j2j6L1K1Jm2qJMLOK6k0KO
3900A3%J6n1M5qpJ7k0Jk7k1K5%oJ5J0lj5j1L7KLk1J1mJ6j5J6pj7oJJ1M1j7j7R
3937A6J9k5j5J1j3K7j5j1j4K0qKJ2j4J2Qk1J1lPk5J7J6l1M7l7J4l4J2J1j2Oj7
$$ y = [11, 9, 23, 24, 18, 14, 3, 30, 19, -22, 13, 5, 20, 26, -12, 21, -3, 2, 22, 27, -3, 12, 2, -14, 16, -18, -6, -1, -1, 20, -16, -18, 10, 21, 14, -15, 3, 38, 21, 23, -15, 2, -10, -14, -22, -6, -31, -3, 7, 11, -10, 5, -13, -41, -5, 1, 31, 10, 8, 7, 0, 3, 18, 6, 21, 18, 20, 25, 4, 2, -2, 10, 27, 12, -3, 8, 6, 16, 4, 43, 12, 51, 1, 6, 1, -18, 13, -6, -24, -32, 28, -14, 1, 12, 6, 0, -23, -8, 9, 3, -17, 2, -7, 11, -26, -9, 1, -5, 1, -17, 33, 6, -10, -1, -31, 20, 2, 22, 17, 4, 14, -4, 7, 6, 22, -30, -2, 2, 19, -8, -15, 10, 13, 30, -1, 1, -10, 3, 18, 20, 32, 16, 19, -1, 0, 20, -12, 17, 2, -14, -1, 26, -6, 1, -22, -30, -28, 5, 2, -25, -12, -26, -24, -21, -37, -6, 13, -14, -10, 47, -1, 3, -13, 2, 2, -1, 11, 23, 9, 16, 20, -19, 4, 0, 27, -22, 46, 6, 19, 13, -5, -13, -5, 26, 28, 4, 10, 48, -4, 14, 35, 8, -11, 10, -2, -18, 13, 34, 35, -7, -15, -14, -10, -7, -1, 25, 5, 7, 13, 13, 29, -22, 23, 15, 8, 25, 5, 6, -21, -42, -17, -17, -23, -8, 2, -1, -16, -27, 10, 12, 15, -6, 5, 1, 17, 2, 18, 11, -6, -12, -11, 0, 41, 24, 7, 16, 35, 10, -5, 6, -7, 20, 5, -6, -20, 0, -8, -6, 6, -8, 4, 12, -9, 2, -1, 6, -19, -2, 14, -17, 30, -7, 7, -27, -15, -4, -16, -10, -27]
3970b7QK5Lm2K2LJ2Kk3j3M2j0knQJ7k4PKJ8qk5J3K7k0lJ8l1K8j7j1RJ9ok3jL2
4007B4l2J4Nl6KJ6QmL2k6Kpkj0K5rRoJqjjj0K4j1k0J5K0j7k2J9MMk4KKPmJ7L2
4047C4j3l4RJ9j1J3k0lqj5M9j1K7k7nL1ok2j0j6K2J0J0k0k4L6j5K1j5J3l3Lj0
4080b1J0J7j5J6k9K3nj5mM9l8l1K8K0l9M5k8kmNM4k2k1K3qMj6J3RoK7k7L7lm0
4115dJK1j%pJ4K5k8m3K3njqK8%J4qj0k6J9mqJ7j8J0J0Jj7k2J8nNpJ8j9KMj4N6
4154C1j7Nn1M8j1j4Kj0M0l1mN5m0QJ3Kj1j0j3jJ5k3J4J2k6K3J2L5o0L4j3L%J3
4188C0%l5pQJ9rQk3k4M6j2l3K3Nj8K3oK3Lo0M9rJ4K1l0Kj8LK2j6J4j8mMPJ2j0
4225DQjj7K6qj5K8j8M3n5K8l2L0jrJ3j1J1k7OK7l2KkK9oMj0l3L3Jjk0pK7j6k3
$$ y = [-27, -19, 6, 9, -33, -11, -8, 4, 6, -17, -30, 12, 2, 0, -5, 3, 20, -4, 3, 5, 23, 15, -10, 3, 30, 10, 7, 25, -6, 22, 5, -6, 3, 22, 16, -7, -8, 24, -8, 6, 11, -25, -23, -7, 1, -3, 29, 3, 5, -2, -4, -14, 11, 2, 11, 5, 6, -2, -3, -4, -14, 10, -1, -21, -6, 14, -3, -25, -6, -2, 2, -22, -20, -18, -11, -15, 2, 34, 21, -13, -4, 15, 4, 17, -3, -6, -14, -29, 20, 9, 36, 9, 4, 35, 29, 7, -3, -19, 3, 13, 23, 3, -21, 15, 0, 21, 6, 19, -14, -11, -21, -11, 6, -9, 7, -22, 1, -4, -19, -23, 26, -12, -43, -15, 5, -34, 11, -17, -19, -23, -18, 26, 4, -17, 6, -2, 2, -14, -1, 8, 2, 29, 2, 39, 36, -4, -3, 18, 17, 17, 10, 24, 49, 21, -22, 1, -4, -5, -13, 15, 15, 29, 21, 11, -15, 4, 0, -8, 9, -9, 1, 11, 12, -5, -27, -9, -14, -9, -16, 2, -17, -15, -11, -25, 31, 14, 19, -32, 16, 5, -9, -7, -17, 23, -8, -12, 43, 3, 11, 24, 26, 15, 5, -8, -9, 6, -17, -3, 9, -17, 6, 18, 53, -7, 27, 14, 17, 17, 30, 30, -5, -12, -4, 15, 6, 14, -9, -33, 13, 1, -32, -9, -4, -22, 1, -5, 18, 21, -39, 10, 1, 15, 36, 6, 8, -10, -7, 15, -1, 13, -5, -9, -5, 2, 14, 4, 12, 11, -6, 20, 12, -3, 25, 7, 50, -5, 23, -9, 21, 20, 11, 24, 13, 24, -3, 3, 30, -2, 0, -2, 27, 21, 25, 15, -18, 15, 16, 15, -5, -12, 15, -1, -24]
4262b4K4Lj6NROLj1k5L8rlj6J3k4J6JK7k1Ll4O2%k9J7l5M7j1J1k8j9J9pJ5QJ6
4298C1k9lL7n8M4j3MJ6k2%j2MJ8j2j8N6l7pK4Jmj7k6K9Lqj7J8j4QMjj2qJ6K1j6
4335@OqoJQNql8PL2L4rk1Lj4RJ0j8Kj2J7j3L1k9K9lJ2l5L9j4l6K3j9k1K5j4M8
4372B3ol0OoQmmllKL6j7j6j6K6%J4rkK3l4J4j6NK2l7%OK1j2RJ2plj3J9mJ8j3J1
4412B0l0M3m1ORJ3k1j5M3k6jJ4O%olk7L1j0rMlLJ0k5J1%J4l1K4J2j5Ol4J6RkN
4450@j6L1j9j4K4nj8NmqJ9j4M7j3k9L1l8K8j8K1k2M0k2plK1k2rJ6JK0pnj8K7K1
4486D1n0rK9k0K4j5oMKK6k0J3k3K8nl5L1k5OK4l2Plj2L2l2J8jj6J2j3JNj5L6k
4522Ek0M1j9m3N7n2L5NkOj3l7K5L7k2rQj7J2pMK3qK7k0nj2J0pK5j1l3OK3Jk7M0
$$ y = [-24, 0, 3, -13, -8, 1, 7, 10, -1, -26, 12, 3, 0, -16, -3, -27, -11, -10, 17, -4, -1, -35, 27, 27, -2, 15, -20, 27, 16, 27, -1, -20, -1, -8, 7, 15, 31, 2, -1, 36, -22, 22, 9, 13, 29, 7, 7, -5, -1, 17, 5, -13, 43, 6, -1, 23, 24, 20, 3, -23, 6, 9, 1, -16, 2, -12, -4, 0, -1, -13, -21, -5, 16, 0, 6, -2, -8, -7, 1, 6, -2, -40, -33, -1, 33, 24, 3, 6, -8, 1, 11, -7, -5, -17, 0, -13, 18, -11, 18, 15, 27, -8, 31, 17, -19, 4, -15, -36, -11, -25, 23, 17, -13, -7, -13, -5, -9, -13, -16, -19, -17, 19, 2, -14, -30, -4, -4, 10, 1, -1, 22, -12, 2, -14, -9, 13, -24, -24, -18, 3, -9, 0, 12, 5, 2, -11, 8, 4, 22, 9, 20, -10, 33, -8, -2, 7, 20, -1, -16, 27, 1, 0, 14, 20, 20, 14, 11, -16, 15, 5, -4, 0, -3, 0, 10, -15, -4, -4, 10, -21, 3, 15, 0, 6, -28, -12, -3, -5, 0, -16, 15, -4, -18, 6, 1, -17, -12, -16, -24, -5, -19, 28, 15, -14, 17, -21, 7, -11, 10, -12, 28, 6, -1, -4, 17, -5, -14, 2, 3, 23, 16, 11, -7, 20, 41, -9, -18, 11, -9, 15, 0, -6, -2, 0, 26, 6, 19, -4, 24, 19, -16, 15, -10, -4, 20, -12, -5, -8, -20, 12, -20, -2, -3, -19, -7, -20, -19, -14, -29, 7, 5, -15, 26, 7, -36, 21, -31, 4, 9, 7, 13, 0, -37, -12, 25, 3, -6, 2, -15, -3, -10, -6, 17, 9, 36, 16, 11, -1, 9, 2, 27, 16, -17, -11, 12, 13, -14, 26]
4559B6Lm2k2L4pk0K6Mj6KJ5j9okOjNl%J2k7J6L1l4jjNOpK0LK5k4J4k4k5K3j7J9
4598cPlLj2J8J3l2J6KQk8K5J0j0j6J6j1J0J7n3L2k1Rj4L2m9K8J8k6LK2J0m9K6
4632bj2QJ2k5J3JmqL1m1K8j6K0J3Kk6LNj8J7l1J3L1k3j2J1pQlLL2j9m%NJqL2l2
4671bkj0mJ4%J0pk1L0j1Noj0K6J2j6Ll7KL7l7K4rNj7kJ6jK7ok6j4OLJ9j6j4J7
4709a2MJK0kj0MR%J4j0kk2J1k4j5K9PK0KJ7l9M7p7K9j7RJ0Qj2J6j4kj7M2Jj3m2
4746c0L6j9KJ4k4K0K3m0Pj1lNOJ5j6J4oQm7K7%M2kj0nm1M7Jpj2J9k0JqmjJ5L3
4784B9l7M4l0K2m2kM2k2K0l2%kK0J4J0n0j9M6j2J3Pk4NJ1l1J1mJ4K5k1KLj7rJ9
4819Cj0MNk2j7O2k6k5JL3j0j1mJ7j0NMjK5l2OJ2LNkl8O5j7Kk3M%k2M9n0RpK5k5
$$ y = [26, 29, -13, -35, -1, -8, -28, -2, 2, -14, -12, 3, -16, -22, -24, -18, -19, -14, -17, -17, -5, -32, -16, 15, -19, -20, -21, -16, -10, -17, 3, 6, 31, 7, 21, -3, -28, -5, -22, -3, 4, 1, 4, -8, 10, 23, -9, 7, 9, 17, -11, 14, 24, 14, -2, 14, 3, 13, 30, -23, 9, -12, -3, -17, 15, -34, -6, 12, -14, -11, 11, 21, -28, -2, -14, -6, 6, -19, -6, -5, -9, -17, 14, -27, 1, -15, 5, 18, 20, -6, -3, 2, -16, 1, -30, -17, 14, -9, -21, -10, -17, -9, -12, -9, 23, 4, 0, 0, 5, 6, -2, 30, -2, -4, -14, -18, -4, -4, 6, -1, -22, 8, -3, 2, -4, -14, 12, 24, 8, 11, -26, -24, 13, -24, 0, -9, -4, -21, -23, -7, -8, 19, 13, -13, -27, -21, -18, 1, -15, -29, -12, -8, -7, 13, 11, 1, 5, 14, 14, 28, 18, 16, -6, 5, -19, -34, -5, 2, 22, 24, 41, 2, 49, -28, 1, -16, -7, 3, 11, -1, 15, 1, -1, -18, 24, 25, 12, -30, 6, -13, -11, 3, -21, -1, 22, -18, -11, -22, -25, -20, -14, 1, -15, -1, -7, 1, -46, -19, -19, 23, 21, 11, 6, -35, 12, 13, 6, -6, 13, -7, -6, -14, -18, -19, -4, 29, -8, 36, 6, 28, -14, -16, 26, 4, 24, -8, -8, -10, 10, 24, 34, -16, -35, 11, -1, 12, 19, -5, 0, 11, -20, -9, -13, 1, 26, 5, 7, 10, -7, -16, 3, -7, -3, 2, -20, -37, 25, -1, -26, -25, 8, -2, -13, -17, 0, -10, -5, -1, -2, 23, -9, -3, 9, 12, 17, 15, -23, 42, 25, 27, 4, 8, 8, -14, 35, -15, -6, -13, 12, -13]
4858a3RK3l7J9K0oMk1j2pMj5J7k1J4%J7J0rRorlJ3j0Qj9J1J6J1l1jqON%K3j3o
4897hK3k8J0OJ2Ll8N8m5k3L2J4J0pqMJ3j3k9J5LQJ0j2k6j1M0j1Nj3qQJ0%l0L0
4933Dj1qK2m5N8l2j2J8j5OPJ9J4j2j1K2ok9MJ6m5M7oNlj3K7j8J3j7J7qrM7k8l
4969A5j5K5l3J8J6k1%R%k0K5l4RJ8j3J0J2m3J6L4n4J3L2rk0P%j6J9lPk5J6mJ7
5004Hk5PJ5m3J8MLJ5rL4j5j5j8NK2QK2m8QQk5M3lm2PM3l1qMOO0m7QNk4K1l4jm
5043a8J8mnJ5l0L1Jl9PK2k5K9nJl2L3Lk1mqM0l3PJ8L5l4J3j8kmjj3Rk5M7k2j2
5080b6J4J2OrK5Rj8l2J0LJ2Qk5L7j0j1j3JK7Oll2QJ7j1okk7J7J3J3k8j5M2j6Q
5116Dqk1PpJ3mqJ0KMj4K2J0kK0l3K8nqkK5m0J5j2L1l6LJ4J7j1L0j7m8L1Ok7lJ3
$$ y = [-13, -4, 19, -18, 1, 21, 15, 19, -2, -14, -21, -17, -32, -15, -36, -22, -22, -5, 5, -4, 5, -1, -10, -13, 0, -10, -2, -21, -10, 6, 17, -14, -15, -23, -17, -12, -12, 11, -2, -8, 15, -13, -3, 3, 15, 18, -20, 38, -7, -30, 2, 16, 26, 19, 11, 15, 28, 15, -14, 1, 4, 12, 22, 10, -16, -27, 13, 2, 7, -6, -14, -6, 4, 4, -26, 4, -7, -15, 7, -38, 20, -12, -24, -6, -21, -15, -8, 11, 25, 13, 2, 24, 18, -11, -7, 9, -36, 11, 5, 10, 7, -6, 21, 3, 16, -1, 16, 8, -1, 46, 18, 15, 0, 25, -8, 10, 26, 5, 5, 14, 14, -6, 19, -15, -6, 12, -1, 9, 21, -22, -6, 28, -26, -13, 19, 10, -10, -3, -3, -19, 0, -3, 4, -21, -5, -9, 8, -17, -10, 5, -38, -20, -16, -13, 2, -7, 27, 12, -3, -21, -16, 6, 14, 36, -12, -4, 4, -21, 22, 19, -23, -16, 27, -4, -12, -8, -2, 58, 11, 19, 24, 0, 21, -13, -14, -18, 0, -4, -9, 6, -24, 7, 8, -31, -24, -2, -27, 2, -3, -2, -34, -1, 2, -19, -23, -31, 9, -24, -17, 1, 36, 2, 15, -3, -5, -9, -10, -23, -14, -39, 8, -14, -26, -12, 0, 6, -3, 22, 31, 13, -19, -9, -6, 6, 14, -11, 26, 16, 5, -8, -7, 20, 26, 23, -9, -1, 16, 5, -1, -3, -30, -13, 0, 13, -15, -30, 12, -4, 4, -4, -25, -18, -25, -12, -16, -24, -14, -12, -8, -22, 0, 10, 8, 28, -5, 23, 18, 10, 8, 33, -7, 8, -4, 27, -9, -6, 8, 25, 14, 44, 27, -21, 10, 16, -11, -14, -1]
5154aLK9k3j9J4J0j2nLK0l5J0k6L0KJ2JJ0j4k4mJL9j8l1K3j8J8rRk0K0J8k1j5
5189b3K5K4nk3k0K0%qJ1k6J0K1k3L9l7K1%L9m4oJ9nJ8j5Kj4L2k8J1l1K0J4j5K2
5223B5NK9m0m4J1J9pK6j2n1M2K4l8Mpj4Oj1%J5K5j1JqL7k1k1K0k7j4N0l5Q%kJ0
5259f%R%rkL9l2K9j2J3k0J6j5qmj5L1j6J4j1K5m5J4M0k9Lj0J7k0joLJ9qoj1J0
5296dl2L4l1K0k5K3K0j2k3J6K8k3J1j5J8j1j0nK6OlQj5L0k2jj3k5N9o6N7k6L7
5329C1l3Nj6J6J2k5K2rOoJ3j6j6LL5k5jJ0JRj7Kj5MJ0k3L4l2J2jnJ3lKJ2j5k3
5366b9L3j3k7M8k5J8l4J7J3L1o3J8J1j7M6l4pQj5K5k7K1j1LL9n3J8K9k2R%K4l8
5399dL7j1l5PRLk5J7oL0j7L2m6Pj0oK6l3L5k2JQj4qK0j0k4K5J6Okk1L2k9nj3K6
$$ y = [-1, 2, 31, 8, -11, 3, 13, 1, -4, -1, 19, -16, -6, -32, -2, 0, 12, 13, 23, 9, -15, -19, -18, 21, 3, -28, -5, -23, -5, -14, -5, -25, -5, 13, -8, -23, 2, 26, 21, -2, -22, -2, -2, -10, 1, -25, -15, 6, -17, 22, -15, 6, 6, 45, 1, -5, 14, 9, 27, 12, 14, 0, 32, 4, 15, -16, 4, 18, 3, 25, 30, 59, 19, -25, -14, 5, -2, 24, 12, -39, 3, 27, -11, -7, -14, -28, -22, -33, -33, -18, 7, -4, -3, -11, 26, 5, -16, 4, -23, -37, 13, -22, -14, -14, -16, -6, -6, 3, 3, -6, -8, 31, -1, 28, 16, 29, 9, 25, 10, 2, -2, -17, 14, -2, 12, 1, 26, -19, -5, 35, 6, 9, -1, 16, -4, -5, -11, -8, 11, 3, -3, -14, -4, -36, -2, -33, -13, -38, -15, 5, -7, -30, -14, 14, -9, 2, -13, 5, -6, -16, -21, 5, 11, 8, 16, 1, 31, 9, 8, -5, -30, 29, -37, 20, -6, 31, -2, 3, -13, 3, 15, -10, 12, 3, 9, 3, 16, 0, -16, -13, 22, -3, -4, 6, 7, 16, -1, 1, -14, -10, 0, -23, 11, -21, -9, -10, -15, -2, -5, -3, 9, -6, -29, 4, -9, -36, 12, -13, 5, -29, -12, 1, 32, -31, -13, -2, -19, 27, -7, -14, -6, -21, 4, -23, -2, -13, -10, 29, -24, -6, 23, 1, 10, 10, 34, -4, 33, 22, -13, -6, 3, 6, -19, -2, -8, 22, 5, 37, -9, -2, -12, -18, 8, -25, 10, -12, -11, -3, -17, -25, -5, -15, -39, -14, 2, 8, 6, -15, 17, -12, -17, -30, -4]
5436djj0J9jj1K1k2J1J2m3K9j5L3l1J1M4m5L9n7rL6J1jL4l6k0MrL4qk6K9ko0M5
5471Aj7mLJ5l9P0p5L4nKrJ8Mk7M1l4N2k9K5j4Pj8JJ0k1nppK3j0J5j0M3k3J8k1
5507Gk1lOM1m6O1l9K8J2j4l5Mj5K3k1L4j8NJ1m7J7KrJ4K1l4M0n1J8JJ6k0K0j5
5541gqj1P%j2L2l7K8K4k7kRRk4J5K3l4K8j8j0OPj4MJ3mPpJ6lJ8l1Nj3J8J3l8%
5579a8K0j0J0Jk9L4l3L0j3J6J6J2l7MJ0%k9j5K0PpK2JKkl1pK2nL6l1%pONlonK3
5618INK1l4pK3j1mj4K1Mj0nJ2Qn9O3k0KJ4kjRm0N1qk8j1j%K2J4l1Rjj3K2%j7J7
5657IJ0l3M6Kl1Ql6k4N0kj8K2j4j1NJ9k0OPj7L1K4k3j3J7k6rN6l5J6rRlk1J%K
5694ejJ8j5J0J1k6lL0Qj9qk0N7%k5L4m6orL1k5J8k2K7%Nj6m9K3JK1j6RJOj0K0
$$ y = [-4, -5, -15, 4, 3, -8, 13, -9, 2, 14, -29, 0, -15, 18, -13, -2, 42, -3, 36, -21, -30, 6, 17, 16, 50, 14, -6, -2, -11, 23, 15, -11, 18, 16, -44, 1, -16, -20, -17, -2, -41, 29, -46, -12, -17, -15, -24, -6, -2, -29, 12, -22, 30, 1, 26, 12, 19, 1, 2, 12, -9, -14, -21, -28, -5, -15, 0, -10, 33, 10, 28, 7, -14, -17, -11, 30, -16, 45, 6, 34, 46, 32, -3, 1, -14, 9, -12, 22, 4, 9, 20, -27, -10, -8, -17, -3, 18, -16, 24, -27, -9, -8, 8, -12, 8, -7, -15, -26, -19, -19, -31, 1, -36, -8, 16, -11, -13, -4, 5, -19, -4, 19, -15, 13, -5, -15, -9, -2, -16, -12, 1, -3, 4, -3, 13, 10, 28, -3, 2, -11, 7, 20, -18, -18, 2, -8, 2, 3, -26, 8, -25, 5, -8, 8, 24, 36, -1, 3, 13, 13, -16, -31, -11, -4, -11, 11, 12, 14, 12, -19, -26, -4, -9, 27, -4, -4, -11, -5, 0, -3, -9, -14, 9, 14, 35, 1, -6, 17, 6, 2, -12, 9, 13, 3, -2, 10, 18, -41, 22, 2, 4, 18, 16, 15, 24, -16, 35, 27, -1, -12, -13, -13, 9, 23, -8, 1, 0, -13, 9, 9, -8, 9, 19, -14, 32, 34, 3, 11, -25, -49, 1, -1, -19, 3, -11, -22, -17, 2, -18, -12, -5, -22, 9, 33, 10, -3, 14, -12, -21, 35, 0, 16, 7, 16, 13, -8, -7, -7, -5, -6, 12, -3, 7, 18, -8, -11, 19, 27, 8, 0, -20, 37, 37, 12, 46, 0, -6, -15, 16, -9, 9, -13, 14, 14, 19, 3, -46, -23, -22, -1, -17, -8, -7, -1, -11, 9]
5731Ij0l7O1m9M6n2K6jml7L8J8Mkk6N0l2MmK2prKK9l3mNNj6J0l4J8K3J8o1L8J2
5768B0jqLj5Lj5K4j9J%j7K7j4oJ8L4o6O2l1j9K0J2jNj5Ll3M7l9k9N2k0J6rj1L3
5804A2kjk6RJ3knj5L0j4PJ2Oj7pj9N8l2j5Rk2K0K1k2Nj2J6k4J0K7l9J8l0ML1l0
5840b6L2k6LK8n6N3j9oK8l0k1L3LJ5Mk9Mk0RNrJ8MMPQk5k4J5K9P%j0j4j7jKM6
5878B4k1J7pk1K0j2Ok4kJ5MlL3m3JK5j6j0K9j5NoJ5k1rLJ4rjJ0k1M1m4J5k4K5
5914glLPj4JL7k0J3%m9K6k4K6J1Rk1JJ4k1K2qj3PJ2%J6k2j0L2k2J7k7J3qK5j1
5950A2rl1N1l9K1k0JK5rm2M3%J4k1Lj4L3l4pMJ2J1k4K0jJ6l6J0j0J4j0m%L1pj9
5986a6M9l5K9k1k1K8J1j8Rl8L3jj8QL1j1pMK0nj7MLJ1qk9j1J4N0m7RmLl2L5nl0
$$ y = [9, -1, -38, 23, -26, 20, -32, -6, -7, -11, -48, -10, 8, 12, 10, -16, 34, 2, 6, 2, 24, 17, 8, 10, 39, 6, 2, 7, 12, -4, 6, -28, -10, 13, 31, -30, 8, 20, 19, 11, 14, -1, 2, -13, 11, -8, -7, -7, -24, 3, -11, -17, 1, 35, -31, 31, 0, -19, 1, 13, 12, 17, 2, 5, -28, 19, -20, -49, 3, -17, -1, -10, -21, 12, 10, 9, -17, -8, 5, 3, -2, -17, 13, -1, 6, 18, 24, 7, 0, -19, 39, 7, -8, 1, -21, -1, 20, -2, 3, -9, 7, -17, -7, 20, -19, -1, -31, -27, 4, -26, 6, -20, -17, 11, -45, 8, -11, -17, 11, -19, -40, -7, -4, 11, 15, -14, -10, -30, -21, -16, -25, -7, -3, 1, 8, 16, -9, -33, -18, 11, 18, 18, 8, -6, -23, -24, -22, 24, 3, 20, 13, -8, 12, 0, 6, -18, -20, -5, -1, -4, 29, -14, -13, 12, -4, -14, 15, 0, 5, -1, 14, -7, -16, -13, 1, -8, -9, 1, -20, 21, -23, -8, -32, -7, -10, -7, 0, -14, -13, 24, 4, 17, 17, -32, -6, -30, -4, 7, 16, -5, -4, 10, -11, 11, 3, -10, -3, 9, 9, 25, 3, -7, 25, 3, 20, -7, 6, -2, 23, 12, 3, -28, 23, -16, 5, -15, -14, 11, 2, -40, 3, 3, 17, -4, -1, -15, 18, -16, -23, -19, -7, 4, -20, 0, -1, 15, -21, -11, -21, -7, -17, -21, -21, 10, 3, -16, 33, -2, 27, 6, -15, 13, 24, 6, 15, -23, 10, 9, -9, -1, 30, 19, 12, 16, 36, 31, 14, 18, 21, 32, 24, -5, -16, -2, 48, 1, 10, 6, 9, -23, 12, 7, -23]
6023b3J4PM3n2lK2k1j8L6%JRm1J6K5n1J4K3j6J7Rj6LK9l4K7J1nj6m1L6j3J1J2
6057A5m6PM3omk3L8j6j0qK7Qm1M3jj1pL7m6nj5nK1K2l0J6%j5J5j5J6j3rJ4k6L9
6093Ij5lj0J1j3QJ8pomqK2LQk9J1kkL2j3Mjl1K0qJ6k0M8Nj5rl5M3m2OK4Nj4j0
6132dJ8j%qJj0l6K3J9m8O1mk1Rk0L8k3%oK5j3rk0j1K0Pjl6M9k6M0l5J3k0M6J6
6168C3j6Pk1N1k5k8j7%J6L0m8K4oNnJ1J1qk3J7JJ8l6J0J7m1K8J0Ok8j7qL0J1q
6203Ak8K6J4k4Pj7J0L5pj5J4n1K2rmJ8qj1%R%%j5O2j7nnj3OJ9k9K7m4J5J6QJj0
6241bLJ0mMqPj7QL%j3J6knLNkJ7k4J3NrJ9m9QK6j2K2k9kJ0k3JJ2qK4KJk7l%lO
6284a7OPNRk6L3j6NJ0lj2L2m5kK5j1L1l0K4l2J3J9j5j3J9j5k7K6J0qL1l8K8k9
$$ y = [-23, -9, -2, 41, -11, -14, 8, -13, -31, 5, 5, 6, 15, -26, -10, 15, -36, -22, 1, -15, 2, 11, -5, -2, 27, -7, 20, 31, 26, 10, -31, 5, -8, 3, 15, -31, -24, 19, 13, 9, -14, 24, 8, -2, -10, 17, 25, -16, 27, 26, 15, 8, 45, -1, -6, -21, -26, -5, 17, -13, 3, 3, -12, 3, -12, 4, -9, -18, -4, -30, 9, -6, -9, -19, -8, -21, -13, 5, -2, -8, -12, -20, 2, 5, 13, -16, -5, -7, -9, 23, 10, 14, 13, -18, 2, -6, 10, -10, 38, 43, 28, 19, -16, 27, -15, -9, 15, 20, 6, -4, 14, 13, 13, 5, 6, -4, -40, -17, 2, -46, 15, 11, -10, -1, -21, 17, -6, -6, -12, 13, 0, -9, -29, -40, -20, -13, -14, -50, -1, -27, 13, -22, -9, -29, 17, 33, 17, 24, 3, 54, 29, 1, -16, -16, 0, 30, -18, 6, 0, 5, 0, 11, 22, 14, -9, 8, 9, 27, -9, 1, 18, -23, 5, 15, 21, -7, -24, -32, -2, 9, 1, -27, -1, 13, -11, -4, -21, -11, 24, 17, 2, 16, -35, -13, -22, -26, -8, -16, -27, -27, -18, -18, -18, -33, 29, 12, 7, 2, -11, -5, 14, -15, 12, -32, -17, -1, 7, 8, -2, 1, 11, 7, 11, 3, 10, -7, 1, 4, 4, -9, 7, 5, 0, 3, 8, 6, 23, -1, 12, 17, 8, 27, -22, -14, 12, 0, 22, -7, -9, 1, -22, -21, -9, -17, 7, 9, 10, -17, -20, -20, -23, -17, -11, -4, 1, 10, -16, 17, 1, 6, 16, 13, 1, 33, -12, -14, 11, 0, 31, 1, 25, -7, 6, 25, 10, -3, 16, 1, -26, 0, 10, 2, 33, -5, 23, -6]
6318fnm2N2lQj4kJ9kj1K1m4L0J4j0nl5L1J3j0Lj1j6kJ1K4qK2j8j7M6m4RJ4Lj1
6354DpKK4Kl1J6Qj3p%MJ1oJ2nJ8jl3L1%m0J0KJ2k0J1k5OM9m7J4Kprj3L7j7K1p
6393Hjj2k2L9k3JpmJ2K1k4j5K8pjjjJ3J2l9L5m1K8mJ0k7L6Qj9J8jl1J3L5k4mJ3
6430B2J7j5k0oJ2nk3%J4j2J7k0lK9j5J6Ql2K6kk7K7l4J4P%J9k9j2lL7j6MKk0M4
6466B1m4J8l4J7LK7J4j2J2j0j0j3J3Pk2J4kMk5M0Qkj2OK9m9J8j3J0Qk9j6qO4l3
6501akj4L0mj9j0L0%j9J0ok5L3jj2RjJ1k4Nj0J5j6M6k7J3l8L3J0jjj2j1OMK9m4
6538a4OL0qqK2mj0kOrOL1m1K6jprk4J4J3Km4M1pj6MqkLJ3l2L6MPk1k0K%j2L0N
6579Bk2K0mk9J1L3j8J9k0J1j2%K4l3J6j5L9j7k0J9Nm2N5mroKj3J0j2K7Pk4K6r
$$ y = [-6, -11, -53, -1, -4, 4, -10, -12, 7, 5, -6, 15, -29, 1, 15, 5, 0, -35, -4, 9, -1, 2, -9, -25, -27, -16, 8, 0, 22, 4, -13, 33, -11, -2, 12, 15, 4, -3, -1, 23, 25, -6, 10, 18, 5, -2, -2, 2, 13, 7, 19, 14, 32, 31, -2, 29, 29, -11, -1, 1, 13, -7, 4, -21, -15, 34, -13, 1, 3, -4, -13, -26, 11, -6, 15, 8, 7, -5, -27, 12, -11, -10, -17, -21, -9, 12, -12, -27, 1, -6, -7, -8, -9, 4, 16, -23, 12, -29, -1, -5, 5, -22, 14, 22, 3, 21, 20, -11, 2, 37, 13, 9, 22, 39, 24, 4, -2, 10, 5, -18, -18, -4, -16, 1, -19, -22, 7, -8, 8, 16, -16, 10, 8, -19, 8, -26, -12, -5, -5, 14, -15, -27, -30, 7, -9, -5, -3, -23, 21, -23, -5, -39, -22, -19, 8, 22, 10, 22, 12, 2, -11, 2, 9, -13, 1, -1, 3, -22, 18, 26, 24, 12, 18, 47, -2, 16, 3, 13, 21, -8, -24, -32, 32, -1, -3, -17, 13, 9, -10, -20, 10, 10, -9, 1, -5, -30, 3, 2, -10, -1, -2, 9, -15, -10, -20, -5, -21, 25, -2, 11, -27, 6, 16, 15, 14, 2, -9, -3, 1, 30, -14, -8, 22, 14, 6, 28, 24, 14, 12, 18, 9, 15, 46, 5, 31, 30, 23, 14, -10, 4, 17, 19, -25, 16, 9, -7, -3, -11, -13, -10, 3, -29, 7, 11, 18, -3, -23, -21, -21, -33, -3, 2, -20, 0, -4, -33, -22, 11, -7, 12, -8, 3, -9, -9, 15, -18, -2, -17, 22, 5, -15, 4, 9, -33, 22, 18, 9, 3, 5, -8, 2, -10, 17, 24, 0, 26, 17]
6614A7J2qj6oj3jK9k0J0Oj2J4j3rj1lNMK8k8%J7J1lj6l8L7j4J2jK3qj3pQk2K1
6651hK5k6PK5m1J5Kk0K1K1m0J7L2l1KmJ4Lj8mJ3K0k0K1k0qrk3M3j6J2j4Nk6K7
6686cjrqJ3K9l4J0pj3LK5j3l2K8J2j1kLJ2Plj8K3k9L7l9L5nk0%J8j8j1M1j0K6
6722C6Nk4j3Ok2J9K1qnPj0LNj3rrJ7kj0PpJ8PlkNj5j9JJ3K9l0J1pj0k1j3M8Jj3
6762fNnpJ1Qkj7L6mk4J7J0k7llJ6J7j3m2N1l0MJJL9k2l4J6JNJ0j6k7K9K8j4j7
6799hNK6k1j1M0l4j3K4pL4k9j2Lok5N7l5Rj4L5k2kpMjj3L4j5K7l7QQj4K1lKk0
6836a2J0Nk7M1Lqk0L2j6pJ7j5mK3k0K1k3OJ9j7k5OJ7Rj7nK7kkl3PJ5Pl5L7k0N
6873aol3M3j1l2L6j0mlK6kk4L8rl5L3j0pJ2l8L8pJ8k2mJ0J4kkkpJ7j7J5m1N1k5
$$ y = [17, 29, 21, 5, -1, -14, -15, 14, -6, 4, 10, -2, 12, -1, -10, -21, -24, -19, -15, 13, -15, -15, 2, 13, 10, -6, -44, -7, -21, -9, -10, 13, 5, -8, -15, -7, -29, -8, 17, -9, -2, 23, -18, -3, -1, -21, 0, 21, -19, -2, 30, -1, 1, -3, 11, 14, -4, -8, 5, 25, 5, 26, 6, -2, -11, -34, 9, -7, 5, -9, -4, -30, -3, -4, -13, -21, -8, 21, -13, -3, -10, -23, -20, 5, -8, -40, -12, 0, -11, -13, -10, 2, 9, 6, -12, 11, -18, 19, -20, 15, 10, -10, -10, 8, -10, -21, 20, 10, 36, 41, 17, 4, 10, -12, 7, 28, 20, 15, 22, 12, 15, 20, 7, -2, -11, 6, 4, -6, 1, -6, 12, 19, 16, 14, 19, 4, -15, -14, -1, 28, -2, 9, 2, -8, -29, -42, 6, 7, -6, -1, -6, -13, -2, 6, 4, -13, 23, 19, -5, 12, 22, -5, -8, -11, 5, 22, 9, -33, 18, -12, -8, -7, -6, 33, 11, -23, -7, -6, -1, 9, -7, -34, -5, 23, 9, -8, -3, 23, 2, -9, 31, -3, -16, 8, 1, 35, 6, -6, -3, -9, -34, 23, -12, -3, -17, 18, -4, -6, -13, -9, -10, -23, 11, -4, 23, -14, -6, 2, -12, 9, 6, 8, -12, -2, 3, -24, 17, 20, 12, -8, 24, 8, 1, 18, 3, -1, 22, 2, 23, 0, 6, 25, 8, -17, -11, 6, 15, -2, -7, 20, 18, 16, -17, -10, 5, 12, -23, 14, -6, -1, -7, -40, 3, -8, -40, -4, -14, -18, -21, 5, 3, -21, 17, 8, -27, 6, -4, -11, 1, -37, 1, -6, 12, -10, -14, -4, 10, 8, 6, 4, -3, 14, -3, 12, -29, 22, -3]
6910cNJ8l5K5koj1J5K9l3K7m2J5KLlk0j1N1j9J8n2J1K4oJjNj2k5K2k1M1j5k2J0
6946a7RL3l3pK6j9k6J9J3j4K2l3K5J1n1N6%kQk%j1J7m9L5j5K3Pm3L3LklL0j9p
6982A7m4L6k1kLJ5k0qJ7j3K6j6J5krRQk2k0L9l4J5K3j8k6L8k8jK6%rK9m4%LJ4
7018dj2K1QroqJ6Nj4oK7Ok6PQoJJ7k4J1l3K2K0k0Qk3J0k8O0m1k0J5J6j8L0j5%
7055ej0rJ8ok1L6kNj9k5N8Rk0m0J2Nj5L5k8kk5J1M1j5JK2l7K6mOj5L0j8Qj6kM
7092gL1m2K2jJ0j6j2L1k5LMOlJ7pj8j5K2k9K1K0J0l6K8k8jj7K8j3K0k9J8rk4M3
7127BjJ4j5k4K0j4OqLJ0kJ4LJ0l8K1Mk4L2k3PmL2j7j4J0oK8m2k5N7k2K1rQl3L2
7164A3k5K8J0k0k7J4K9k0j1j2%L1j4%j5J2Lj6J0Qj5K7k0MRj9PnJ7QqLj5K2j5j4
$$ y = [-3, 2, 20, -15, 10, 8, 2, -9, 6, 35, 2, 29, -13, 2, 4, 7, 4, -16, -27, 24, 5, 23, -29, -18, 6, 0, 1, 0, 5, -7, -32, -10, -31, 10, -5, -27, -17, -8, 25, -8, -15, 11, -8, -34, -15, -2, -16, 6, -27, -2, 9, -42, 14, 14, 12, 20, 18, 18, 7, 24, -25, 10, -5, 18, 25, -18, 15, 18, 16, 13, 43, 24, 17, -27, 9, -12, -14, -11, 4, -16, -24, -7, -20, 6, -10, 5, 3, -6, 3, 11, -11, -31, 8, -26, -11, 12, -6, -32, 6, -22, -23, 3, 3, -6, 23, -21, -21, -18, -4, -16, 5, 13, 4, -2, -10, 6, 11, -3, -9, 18, 24, -2, 5, 13, 7, 8, 25, 1, 12, -21, 1, 21, 1, 9, -14, -4, -32, 28, -13, -33, -18, -2, -20, 10, -5, -5, -15, -24, -6, -12, -33, 3, 1, 6, -13, -38, 20, 29, 9, -31, -19, -14, -29, 6, -22, -24, -49, -38, 3, -12, -11, 11, -26, 0, -4, 2, -13, 17, -1, 7, -9, -11, -7, 24, -18, 4, 3, 13, -3, -15, 16, -9, -6, -2, 4, 1, 18, 11, -7, -22, 0, -29, -8, 12, 22, -14, 14, -14, -15, -32, -4, -17, 3, -26, -8, -17, -41, 2, 1, 15, 0, -24, -4, -18, -12, -20, -17, -7, -9, 5, 8, 18, -20, 1, 5, -19, 13, -10, -3, -7, 25, 8, -6, 4, -2, 26, -16, -41, 16, -6, 15, 6, 14, -19, 13, -12, 16, 26, 6, -21, -7, 22, 2, -9, -21, -21, 10, -4, -4, -19, -7, -4, -20, -10, -2, -17, 10, -10, -6, 3, -16, -9, -14, 3, 11, 3, 6, -9, 13, -2, -16]
7200a6JJ5OnqrNN9o9K3j4J9jJ3Lk0nmQj8N5k7l2J5J4Rk3K9k5mRJ7k1j8L0j0J3
7237A4J1l8JK4l5Mj0LK5Kjk6K5%J6j2k6Kj3K6OLj6JL2qj1J9j8MK3Rn4J9J4mk5
7274a4K3%m%qJj2%J4J1K1m1j4M2l7RkkpL6j7j2j0K7KK5j7n2nL3J0m2O1k8K4l5
7310b0J5Mk7K1pK2Oj5M8n8J6kk4N9m4Rj5ML8k8Jk7N3K8n5J2QNj2j3j6J5j6M0j7
7345HJ8j3llJ9j5j4J9l6J9j1k3L7k7L4Nl7PK0k4pL1j3Mk8J8J4j0k1K7k2OROJ4
7380HLj6K6k9K5nl5J9J5jLk6K8%%J7Pj9j5k1L3L2k5k5J4jLj6OL0m0J1%oj4K3k5
7417a6L%PoK6Jj0j2J4%j0qj0J1J1oj1J1j7N7j9j8jLoNNll2M0rk9K4N2m7N2k4r
7455A9oJ3rml0RK1j5Kj8J7p%O5o9J9Oj7%j9K2k4K3j5L5n5K1M2m0M5m0qkK9l5L2
$$ y = [-16, -15, 0, 6, 1, -7, -16, -11, 48, -21, 2, -12, 7, 6, 19, 22, 2, -3, -7, 1, -17, 38, 11, -21, -6, 8, 17, -6, 23, -2, -6, 3, 20, -1, -19, 11, 1, 14, 25, -13, -12, 12, -23, -19, -29, -26, -1, 1, 0, -26, -1, -1, 15, 3, -23, -21, -34, -8, -2, 1, -15, -14, 18, 10, -1, 18, 0, 4, 27, 36, -18, 1, 15, 11, -14, 9, 9, 5, 5, -3, -2, -14, -14, 0, 11, 32, -9, -23, 19, -18, -9, -11, -13, -20, 16, -1, -13, -23, 4, 6, 31, 14, -38, -43, -10, 0, -42, 19, -9, 15, -20, -5, -1, -28, -7, -14, 8, 14, -1, 47, -11, 5, 3, -21, 38, -6, 3, -12, -8, 30, 2, 3, -24, 29, 57, 2, 14, 22, 27, 15, 2, -14, 1, -15, 25, 8, 26, 13, 10, 7, 26, 11, -3, 16, -20, -1, -12, -35, 2, -25, 9, 14, -23, -16, 4, -20, -27, 4, -9, -5, -33, -15, -1, -11, -32, -5, -27, -21, -12, -6, 8, 11, -5, 21, -8, 17, 12, -23, -4, 11, 10, 13, -13, 15, 15, 15, 32, 39, 20, 5, -16, 17, 49, 24, -1, 13, 12, 15, -1, 5, 35, -5, 6, 6, 0, -14, 9, -16, -13, -13, -6, -12, 14, 15, 5, -7, 7, 7, -3, -11, -21, -10, 1, -5, -16, -5, -22, 35, 16, -2, -3, 0, -6, -1, 4, 1, -31, 9, 0, -29, -5, 47, 0, 52, 28, 19, 13, 26, 17, 13, -17, -8, 13, -2, 0, -18, -1, -8, -8, 57, -12, 7, 13, -4, -4, -23, -1, -25, -2, -17, 18, -37, -16, 26, -14, 31, -9, -17, -19, 10, -25, 7]
7491Gl5J4J4%j1ONrJ1J1Rm7O6o3L7JNK3k9lk1L2lk8pL6l6J7J5J9j6Pl4J1Oj1J2
7528A1PQml3L0j9j6K5pRj5kK2j5j9pJ0KJ9k5KJ8j2J8Nj2qj5NQL6k2k9J9J8k8L
7565a3K3j7lJ5Jk8N2j4kj6NPKpj0L2j3k9M3nrPj6J3j5JKJj0J7J2om6L3m5L5J6
7602A3j9j5L6kRm8K7kOk2PL2m3J8lRKj9L8Mm5J7K9j6%k6L8k4j8K8j4L1m7J2QM
7638Ej6M9j8m2K2J5j1j6K0j4PJJ0J8mpm4K7kj1K4l0oL0j1Oo%K%j3K4n%l3L3k4
7675b0kL4j3k5K9k3MNj3J4j2L6k5J3k1L3k9QK7k2MJ3l7M7Oj8l1M2l0K5k7M0k3
7708IJ1j4MJj1K9m7LoL2qj0NM5q8P3j7j5j5M2m0K3mL3k5k9K5l2L1j7Oqj0M3k8
7743ioK0J9Qk6J5l2RJ9rJoJ6J4k8kqKMJ5Km2M9k9NK0l3K8j7lL%K0k5L8m0NJ9m3
$$ y = [7, -28, -14, 0, 0, -11, -5, 0, -9, 2, 13, 22, -25, 41, -22, 15, 16, 21, 44, 15, 12, -9, 23, 20, -8, -15, 21, -15, 2, 17, 36, 20, 27, -7, 4, 10, -1, 11, 18, 26, 22, -11, 19, 0, -16, 9, 2, 11, -4, -6, 16, 1, -18, -25, -15, -13, 6, -19, -17, 1, -11, 7, 12, 0, -8, -23, -18, -10, 26, 4, -25, -6, 12, -16, -13, 10, -7, -10, 5, 6, -22, 30, 16, 14, -2, 3, 10, 12, 5, -5, 27, 14, -15, 28, 23, 14, 21, 5, 18, 3, 4, 6, 7, -3, 14, 26, 20, -26, 7, -38, -3, 13, -6, -21, 15, 13, 22, -26, 1, -1, 5, -17, -10, 22, -21, -3, -6, 3, 5, -14, 24, 28, -17, 0, 29, 13, 13, -13, 25, 1, -17, 11, -3, 28, -19, -7, 1, 5, -11, 38, 20, -22, 0, 15, 4, -12, 8, -6, 1, 2, 12, 30, 26, 19, -25, 2, 0, -11, 13, -17, -23, 7, -4, 2, -4, -4, -2, -2, -15, 9, 4, 4, -29, 4, -20, -22, 12, -1, -26, 3, -20, -16, -11, -24, -10, -22, 14, -11, 2, -19, 14, -15, -7, 20, -2, 2, 15, -22, 25, 31, 13, -18, 24, -6, 19, -8, 32, 9, 20, 6, 10, 11, 0, 29, -18, -15, -21, 11, 3, -7, -2, 43, -45, 28, 11, -4, -19, 23, -17, 6, 2, 35, 10, -19, 6, -26, 5, -12, -6, -14, -24, 19, -9, -15, 5, 24, 32, 6, 21, -11, -2, 17, 8, 9, 3, 19, 33, 5, 3, -5, -3, 1, 16, 18, -24, 25, -4, 1, 21, -12, 16, -1, -4, -1, -1, 19, -6, 32, -8, -3, 16, -27]
7782b7P0l8j1K6Ln3M6k1K2j8k3K2K6k4n1O4j0j2PJl0N0l0mJ4%j8M4Ok1j7K3pQ
7816A7q%k6N2k3l6N9k2j7K2j6J4J4%j8j4lJ4LK0m4j2J4Oj8J8pM1l6J5kj4K4k7
7850a0J8jj8K1jrJ3Jk8J1J1J6nm2L0Jj1K5j5JK6j9j3j0KKj1K6j3J3K4rj3JJ0R
7886C3j3lnM0n1L2j4%l2K5rj0J5lj3jJ2K%j1nK0j3M4m6nK1l8M3j9rJ9nk6M2j7
7922@l7L8Nj2J9l2j5K9J8k0O1o5OLJRK2k4j8K6k0RJ7oj6L3jnk8J2J0k1j3K3j0
7957bl3K8NjRj7J5Jk7J8QJ8k3KrJ3j8K3j7k5L1j5J6qJLnj0J0K4k5K1MOk2k1K5
7994CkL3Pqm7J2K1qj5L3k4L3Oj0j9k6oK6J9j5mlK8j3m4J4K1k9N1m3L8j2lk0Pj3
8030a2K4mj2J4k9J5Rk0J7J3Jjk1L7m8K0K4k2rj1J3Qj6J0J0oq%J3j0OmLJ3nJ2k5
$$ y = [-27, 43, 5, -6, 20, 23, -30, 16, -5, 17, -1, -24, -2, 24, 0, -51, 13, 3, -9, -2, -1, -31, 19, -11, -15, -1, -1, -19, 25, 31, 10, -7, 16, 9, 17, 9, 9, -17, 35, 12, -24, 35, 13, -4, 18, 2, 16, 30, 30, 12, -2, -5, 9, 12, 32, -12, -24, -10, -4, -22, -4, -11, 30, -6, 9, 7, -7, 17, -10, 8, 7, -11, 10, 9, 0, 13, 14, -14, -3, 8, 24, 19, -23, 7, 8, -3, 22, 7, 8, 34, 15, 2, -8, -6, -4, -15, 11, -2, 11, 35, 26, 13, 14, 24, 33, 20, 17, 12, 52, 1, 33, 19, 19, -13, 12, 3, -7, 8, 5, -8, -9, 3, 5, 5, -6, -11, 9, -4, 40, -6, -11, 10, -28, 15, -4, -13, 6, 1, -25, 17, 0, -37, 1, 6, -6, 13, -19, -34, -5, 13, -7, 54, -11, -5, -2, -1, 8, 30, 6, -12, 14, -6, 3, 20, 14, -2, 31, 30, 25, -3, 9, 19, -2, -15, 8, -2, -35, -7, -2, -3, 6, -11, 4, 5, -22, -4, 4, 22, -1, 1, -8, 5, -13, 10, -7, -32, -1, -16, 0, -8, -7, -4, -9, -19, -9, 15, -10, 11, 15, 21, -1, -22, 3, 1, 34, 41, 33, -14, -2, 19, 11, -4, 29, 5, 38, 44, 34, 15, -11, -17, 9, 28, 13, 9, 6, 34, 21, -23, -9, 12, -17, 34, -9, 29, 17, 14, -6, 1, -12, 12, 8, -4, 10, -19, -4, 5, -15, 2, 15, 16, 15, -6, 31, -17, 3, 27, 5, -4, -15, -2, 6, -10, 0, 10, 4, -4, -4, 9, -1, 5, 1, 4, 17, 12, 24, -1]
8067aL2k9J8m2K2K2k6K6j4l6QJ9Rjj9K5k4L8k1Lj0J4j5kj0%L2m0M3m8K5j2K3k2
8101a3K6k6QL0l4oK7l7K6QK4k3j5L6j4mKOMj5oj4K6j5L0j3qj6J1JPNkjl9J2kK2
8139Hj0j5J6j0K8poj5j3OL0k3J5J7m2J1j2%RpJ2J2l1kN0j8k5J2K0l1J6j5J2J7
8173Ij2QOk0NKK5nj5%J0k6kL4j9MJ3k
$$ y = [-1, 31, 2, 20, -22, 0, 22, -4, 22, 8, -28, -20, -1, 8, 7, -12, 13, -11, 27, 6, 9, -1, 13, -2, -4, -14, -14, 18, -22, 21, -27, -2, -14, 9, -13, 13, -13, -5, 25, -9, -15, 12, -25, 1, 9, 33, 10, -5, 31, 17, 13, 15, 21, 25, 10, 4, -10, 16, 1, 31, 18, 10, -6, 5, 6, 13, 18, 16, 15, -24, -12, -14, 8, -2, -17, -1, -11, 17, 10, 4, -11, -24, -18, 12, -11, 4, 21, -21, -10, -22, -22, -13, -20, -8, 4, -27, -29, 21, 3, -22, -10, 10, -21, -5, -20, -8, 9, -3, 5, 11, -9, -4, -2, 23, 18, 3, 3, 13, -13, -15, 19, 0, 4, 17, 15]
8191A5
##END NTUPLES=NMR FID
##END=
