##TITLE=1H_LY-857-40
 CCll4, 8 sc, 
 26.7.2019
##JCAMPDX= 6.0         $$ Bruker NMR JCAMP-DX V2.0
##DATA TYPE= NMR FID
##DATA CLASS= NTUPLES
##ORIGIN= UXNMR, Bruker Analytische Messtechnik GmbH
##OWNER= root
$$ XWIN-NMR		Version 3.5
$$ Fri Jul 26 14:14:52 2019 Russian Standard Time (UT+4h)  she@DPX200
##.OBSERVE FREQUENCY= 200.13155
##.OBSERVE NUCLEUS= ^1H
##.DELAY= (6, 6)
##.ACQUISITION MODE= SIMULTANEOUS
##.ACQUISITION SCHEME= undefined
##.AVERAGES= 8
##.DIGITISER RES= 18
##SPECTROMETER/DATA SYSTEM= spect
##.PULSE SEQUENCE= zg30
##.SOLVENT NAME= CDCl3
##.SHIFT REFERENCE= (INTERNAL, CDCl3, 0, 15.7039)
##AUDIT TRAIL= $$ (NUMBER, WHEN, WHO, WHERE, WHAT)
$$ ##TITLE= Audit trail, XWIN-NMR		Version 3.5
$$ ##JCAMPDX= 5.01
$$ ##ORIGIN= Bruker BioSpin GmbH
$$ ##OWNER= she
$$ F:/spectra/data/she/nmr/H-F/1/audita.txt
$$ ##AUDIT TRAIL=  $$ (NUMBER, WHEN, WHO, WHERE, WHAT)
(   1,<2019-07-26 14:13:21.68 +0400>,<she>,<DPX200>,
      <created by zg, POWCHK disabled, PULCHK disabled
       configuration hash MD5:
       00 E9 B6 7A A2 85 ED C7 34 08 36 98 17 FE 4E 26
       data hash MD5: 16K
       84 BF 30 59 B1 6A C7 1E E6 21 AB E0 A9 16 54 C5>)
$$ ##END=
$$ 
$$ hash MD5
$$ 84 2C 9B 9A B8 A9 5B C0 27 B3 13 A2 D4 26 30 8D
##$RELAX= 
##$RELAX= 
##$RELAX= 
##$RELAX= 
##$RELAX= 
##$RELAX= 
$$ Bruker specific parameters
$$ --------------------------
##$DU= <F:/spectra>
##$EXPNO= 1
##$NAME= <H-F>
##$PROCNO= 1
##$TYPE= <nmr>
##$USER= <she>
##$AMP= (0..31)
100 100 100 100 100 100 100 100 100 100 100 100 100 100 100 100 100 100 
100 100 100 100 100 100 100 100 100 100 100 100 100 100 
##$AQSEQ= 0
##$AQ_mod= 1
##$AUNM= <au_zg>
##$AUTOPOS= <>
##$BF1= 200.13
##$BF2= 200.13
##$BF3= 200.13
##$BF4= 200.13
##$BF5= 200.13
##$BF6= 200.13
##$BF7= 200.13
##$BF8= 200.13
##$BYTORDA= 1
##$CFDGTYP= 0
##$CFRGTYP= 5
##$CHEMSTR= <none>
##$CNST= (0..31)
1 1 145 1 1 1 1 1 1 1 1 1 1 1 1 1 1 1 1 1 1 1 1 1 1 1 1 1 1 1 1 1 
##$CPDPRG= <>
##$CPDPRG1= <>
##$CPDPRG2= <>
##$CPDPRG3= <>
##$CPDPRG4= <mlev>
##$CPDPRG5= <mlev>
##$CPDPRG6= <mlev>
##$CPDPRG7= <mlev>
##$CPDPRG8= <mlev>
##$CPDPRGB= <>
##$CPDPRGT= <>
##$D= (0..31)
0 1.2 0 0 0 0 0 0 0 0 0 0.03 0 0 0 0 0 0 0 0 0 0 0 0 0 0 0 0 0 0 0 0 
##$DATE= 1564136001
##$DBL= (0..7)
120 120 120 120 120 120 120 120 
##$DBP= (0..7)
150 150 150 150 150 150 150 150 
##$DBP07= 0
##$DBPNAM0= <>
##$DBPNAM1= <>
##$DBPNAM2= <>
##$DBPNAM3= <>
##$DBPNAM4= <>
##$DBPNAM5= <>
##$DBPNAM6= <>
##$DBPNAM7= <>
##$DBPOAL= (0..7)
0.5 0.5 0.5 0.5 0.5 0.5 0.5 0.5 
##$DBPOFFS= (0..7)
0 0 0 0 0 0 0 0 
##$DE= 6
##$DECBNUC= <off>
##$DECIM= 24
##$DECNUC= <off>
##$DECSTAT= 4
##$DIGMOD= 1
##$DIGTYP= 9
##$DL= (0..7)
0 120 120 120 120 120 120 120 
##$DP= (0..7)
150 150 150 150 150 150 150 150 
##$DP07= 0
##$DPNAME0= <>
##$DPNAME1= <>
##$DPNAME2= <>
##$DPNAME3= <>
##$DPNAME4= <>
##$DPNAME5= <>
##$DPNAME6= <>
##$DPNAME7= <>
##$DPOAL= (0..7)
0.5 0.5 0.5 0.5 0.5 0.5 0.5 0.5 
##$DPOFFS= (0..7)
0 0 0 0 0 0 0 0 
##$DQDMODE= 0
##$DR= 18
##$DS= 0
##$DSLIST= <SSSSSSSSSSSSSSS>
##$DSPFIRM= 0
$$ [...]
##$SUBNAM2= <"">
##$SUBNAM3= <"">
##$SUBNAM4= <"">
##$SUBNAM5= <"">
##$SUBNAM6= <"">
##$SUBNAM7= <"">
##$SUBNAM8= <"">
##$SUBNAM9= <"">
##$SW= 24.9336996594482
##$SWIBOX= (0..15)
0 0 2 0 0 0 0 0 0 0 0 0 0 0 0 0 
##$SW_h= 4990.01996007984
##$TD= 16384
##$TD0= 1
##$TE= 0
##$TE2= 300
##$TE3= 300
##$TEG= 300
##$TL= (0..7)
0 120 120 120 120 120 120 120 
##$TP= (0..7)
150 150 150 150 150 150 150 150 
##$TP07= 0
##$TPNAME0= <>
##$TPNAME1= <>
##$TPNAME2= <>
##$TPNAME3= <>
##$TPNAME4= <>
##$TPNAME5= <>
##$TPNAME6= <>
##$TPNAME7= <>
##$TPOAL= (0..7)
0.5 0.5 0.5 0.5 0.5 0.5 0.5 0.5 
##$TPOFFS= (0..7)
0 0 0 0 0 0 0 0 
##$TUNHIN= 0
##$TUNHOUT= 0
##$TUNXOUT= 0
##$USERA1= <user>
##$USERA2= <user>
##$USERA3= <user>
##$USERA4= <user>
##$USERA5= <user>
##$V9= 5
##$VALIST= <valist>
##$VCLIST= <CCCCCCCCCCCCCCC>
##$VD= 0
##$VDLIST= <DDDDDDDDDDDDDDD>
##$VPLIST= <PPPPPPPPPPPPPPP>
##$VTLIST= <TTTTTTTTTTTTTTT>
##$WBST= 1024
##$WBSW= 4
##$XGAIN= (0..3)
0 0 0 0 
##$XL= 0
##$YL= 0
##$YMAX_a= 78017
##$YMIN_a= -77413
##$ZGOPTNS= <>
##$ZL1= 120
##$ZL2= 120
##$ZL3= 120
##$ZL4= 120
##$ABSF1= 10
##$ABSF2= 0
##$ABSG= 5
##$ABSL= 3
##$ALPHA= 0
##$AQORDER= 0
##$ASSFAC= 0
##$ASSFACI= 0
##$ASSFACX= 0
##$ASSWID= 0
##$AUNMP= <proc_1d>
##$AZFE= 0.1
##$AZFW= 0.1
##$BCFW= 1
##$BC_mod= 2
##$BYTORDP= 1
##$COROFFS= 0
##$CY= 11.3945322036743
##$DATMOD= 1
##$DC= 2
##$DFILT= <>
##$DTYPP= 0
##$F1P= 20.1537800932815
##$F2P= 0.134698688090026
##$FCOR= 0.5
##$FTSIZE= 0
##$FT_mod= 4
##$GAMMA= 1
##$GB= 0.15
##$INTBC= 1
##$INTSCL= 1
##$ISEN= 128
##$LB= 0.24
##$LEV0= 0
##$LPBIN= 0
##$MAXI= 10000
##$MC2= 0
##$MEAN= 0
##$ME_mod= 0
##$MI= 1.114404
##$NCOEF= 0
##$NC_proc= 0
##$NLEV= 6
##$NOISF1= 3.799351
##$NOISF2= 2.8
##$NSP= 1
##$NTH_PI= 0
##$NZP= 0
##$OFFSET= 15.70392
##$PC= 1
##$PHC0= -9129.073
##$PHC1= 11.60097
##$PH_mod= 1
##$PKNL= yes
##$PPARMOD= 0
##$PSCAL= 0
##$PSIGN= 0
##$REVERSE= no
##$SF= 200.130013532006
##$SI= 16384
##$SIGF1= 3
##$SIGF2= 2
##$SINO= 400
##$SIOLD= 16384
##$SREGLST= <1H.CDCl3>
##$SSB= 0
##$STSI= 0
##$STSR= 0
##$SW_p= 3612.71676300578
##$SYMM= 0
##$S_DEV= 0
##$TDeff= 0
##$TDoff= 0
##$TI= <>
##$TILT= no
##$TM1= 0
##$TM2= 0
##$TOPLEV= 0
##$USERP1= <user>
##$USERP2= <user>
##$USERP3= <user>
##$USERP4= <user>
##$USERP5= <user>
##$WDW= 1
##$XDIM= 8192
##$YMAX_p= 0
##$YMIN_p= 0
$$ End of Bruker specific parameters
$$ ---------------------------------
##NTUPLES= NMR FID
##VAR_NAME=  TIME,          FID/REAL,        FID/IMAG
##SYMBOL=    X,             R,               I
##VAR_TYPE=  INDEPENDENT,   DEPENDENT,       DEPENDENT
##VAR_FORM=  AFFN,          ASDF,            ASDF
##VAR_DIM=   8192,          8192,            8192
##UNITS=     SECONDS,       ARBITRARY UNITS, ARBITRARY UNITS
##FACTOR=    0.0002004,     1,               1
##FIRST=     0,             0,               0
##LAST=      1.6414764,     0,               0
##MIN=       0,             -77413,          0
##MAX=       1.6414764,     78017,           0
$$ Real data points
##PAGE= N=1
##DATA TABLE= (X++(R..R)), XYDATA
$$ [...]
421c82J876j152k356K056J626k365j34J980j076p82J210r81o3K250j506k277K455
438C79R94k040O38M60j133J101J02j779J451J313j912m42Q62Q0O53n31j280J131
456D7P32j130K4M61k6L65q43o85J596N49j538k23O68J87J31l66m42O17M14o05
476f7p33O12J326r14j419J201O12q46O40l66j204K048J30k821J706J964k554p3
494g58J557j466O85J568k625k45K893j279j659J770R9r34O54m11n24J424J44j766
512h73n8J706k0j450L58Q44o65J38L88j154P00J542k096r03K679l66j772J291
530B89k17r58J911m11k393K122J317k803K71J978j149k83R32j271P1K009j199
547B16j705J746Q67j682J80Q84o93K82N45j432J76J965j044j648J490O49j046
$$ plain form
421 -382 1494 342 -2014 42 1668 -697 -831 1149 73 -709 501 -480 -543 1707 201 -2076 379
438 379 1373 -667 -29 431 -702 399 501 -1278 173 1486 -426 -868 -6 74 727 196 -1084 47
456 47 779 -351 -327 134 108 473 -370 -1055 541 1090 -448 -671 -3 184 315 -51 -493 124 538 -67
476 -67 -800 -188 1138 224 -1195 6 618 -228 412 46 -1158 890 1020 -1801 -95 1869 -685 -758
494 -758 799 -667 18 1586 -1039 -1284 1609 330 -1329 441 540 -394 260 -151 -675 749 893 -873
512 -873 -931 775 755 -695 -337 507 -158 -20 368 -786 -86 1456 -640 -1543 1136 770 -1002 289
530 289 72 -886 1025 614 -1779 343 1660 -1143 -872 1106 -43 -326 606 -665 -594 1415 216
547 216 -1489 257 1124 -558 -378 506 -187 95 640 -792 -616 1349 305 -1343 147 796 -250
564b50K25qn25J146n0j544P84J197r77n22L79J10N00k38q97M78P31l02n51j82
584d96O37N96r98n14J093J53n53p0k67M79P05j032n05J106J16n16k06k42R68K46
604G00j389M14P04o58O62l67j269K123K47k884J678J480k388J116O40k566K371
621F14J329l897J462K500l138O88J855k768J403J822l593R65K775k566q8J334
637F97j666J291Q86k495J143J183j675P11o1p90K162j307j924K935n14j797K468
654A247j632j328L956k121k600M390j258k807L765j613j994M492k338l076M973
669B056j207l056L866j652j991M512k545k690M963j675k830M009j807j789M293
684B457k670k309M791j827k461L472j675j091L502k766j328L920k015j405K698
$$ plain form
564 -250 -25 -33 -558 588 538 -1006 -222 975 -2 -524 -145 -35 465 227 -670 -192 539 237 -314 -496
584 -496 141 737 -261 -775 318 471 -82 -152 -419 60 765 -267 -772 334 450 -66 -272 -514 454 700
604 700 -689 -275 429 -229 433 66 -1203 920 1167 -1717 -39 1441 -947 169 809 -1757 614
621 614 1943 -1954 -492 2008 -1130 -442 1413 -1355 48 1870 -1723 -758 2017 -549 -637 697
637 697 -969 322 1208 -1287 -144 1039 -636 75 14 -776 1386 79 -1845 1090 576 -1221 1247
654 1247 -385 -1713 2243 122 -2478 1912 654 -2153 1612 -1 -1995 2497 159 -2917 2056
669 2056 849 -2207 1659 7 -1984 2528 -17 -2707 2256 581 -2249 1760 -47 -1836 2457
684 2457 -213 -2522 2269 442 -2019 1453 -222 -1313 2189 -577 -1905 2015 0 -1405 1293
699A293j883K1K284l032M21K866k751J88J752k662J870J605m244K031K492m161
715a910J808K054m199K645K086n494K701L607n453J376L163m535K007K998n259
730b405J582L745m596O61L230l527J036K227l896J442K880l606M73K138k507J318
746A95J221l119J640J763k901Q53J301j747J350k0k129K318K77k349J770o7j573
763a217K569j123k326L481m05k910K765k51k158K923r90k513L575l43l105K660
779F32R3j956K473j110k089L375o20k594K737m22j933K621r96j986L243n62k797
796a891K282M40j569J427n75j251J921k86j333J131j01l70O02j102M25J488j622
813c84l49J306r38M07R25j931M47J758j703k47J431q59Q0M83j342Q65J185j646
$$ plain form
699 1293 -590 -569 1715 -1317 -896 1970 -781 -593 1159 -1503 367 1972 -2272 -241 2251 -1910
715 -1910 -102 1952 -2247 398 2484 -3010 -309 3298 -2155 -779 2384 -2151 -144 2854 -2405
730 -2405 -823 2922 -1674 -1013 2217 -1310 -274 1953 -1943 -501 2379 -1227 -754 1384 -1123 195
746 195 1416 -1703 -63 1700 -1201 -348 953 -794 556 536 -1593 725 1002 -1347 423 356 -1217
763 -1217 1352 229 -2097 1384 979 -1931 834 583 -1575 1348 358 -2155 1420 1077 -2028 632
779 632 725 -1231 1242 132 -1957 1418 798 -1796 941 519 -1414 1207 211 -1775 1468 906 -1891
796 -1891 391 831 -738 689 114 -1137 784 498 -835 296 195 -175 427 -675 -250 1238 -384
813 -384 -733 573 -365 42 967 -964 -517 1241 -462 -709 722 -137 -57 426 -916 -51 1134 -512
831e12M4R47q78O42K53j416J053Q13j608L04Q75o45L29n1q55R31M09r93J96K96
851A34r0L42p16k05J199l59p92N44p4j0N20p72j47R38l70n69L92O9L34j65r03
872g00N87O70o66M9J06m82Q74p7j192R67O50j210J61L53k77O90l52r52R56K70
892D25o63L84k80j32R39q27p29J547j84j100P84k06l56J183p27j047J472M5j122
911e94O26J55l27N33n39m65J055m4o59J87r9K81L36q33N8Q71n42k24K50k91O30
932C65J45j289N57R84j016M5M91p68O82M95j558O24J291j366j57Q90p45L22P12
951G04j296J16J339q82n79P83m9j19J78o26K40P53n31l42K69QL45k63n78O92L67
972E29p78Q0K84j84M43k62p99Q09M52q04j6M14j59K10k27m35P12K19p36J6L03
$$ plain form
831 -512 -468 479 -399 243 496 -920 133 946 -662 -358 517 -128 201 150 -705 226 635 -358 -162 134
851 134 44 386 -330 -535 664 305 -487 57 -17 -27 493 -279 -426 512 142 -427 -35 34 368 203 -700
872 -700 -113 557 -109 -60 46 -436 438 361 -831 136 786 -424 -263 90 -187 503 151 -801 155 425
892 425 -238 146 -134 -266 673 -154 -883 664 480 -620 164 -42 -398 785 58 -989 483 528 -594
911 -594 32 187 -140 393 -146 -611 444 400 -259 -72 -171 110 446 -387 -329 542 0 -224 26 -265 365
932 365 510 -779 -222 762 -254 -209 282 -486 196 691 -867 -243 1048 -318 -475 415 -330 -8 704
951 704 -592 -476 863 -19 -598 185 136 17 195 -431 -191 562 31 -311 -42 -34 311 48 -530 162 529
972 529 -249 -169 115 -69 374 112 -687 122 574 -230 -246 168 9 219 -8 -443 269 488 -248 -232 71
993G1kK25m22l37Q00M4p27K51J76j05L07m75l31R55L0r46L23L69k46J97k14m05
1015d62P32J84r22J94O63k72k09K7j58L44K36n42j79N44J30m08k27L62L09l49
1035cj86J28M0K96j08o44L68P11o96l80P17o8k85K60l97l8Q58l56q55N71N06n45
1057a06nJ50j36L03k3n84K02O61k69n87K07M36j01k21k2L0J38J36l93j71O72P3
1079C90p50P3M93p8n2q2l30L66M28o24j90O36K3n51N9K52R7Q0k87k87L14M01l37
1102D4l40L19K83l56j69K11J37M0o2m51J35P08k89n93K52M25l32q1J37n7K15k6
1124A50m93M7P03q8o48J26L36q8k7J4k42K60K25n41j31P57Ko82O6L41j10K14j13
1147G8m58L86M65o83j82P57j10m65J47J4j3M53k65o03M24N27n41j99M50K4k72
$$ plain form
993 71 69 294 -128 -465 335 379 -348 -97 79 -26 281 -194 -525 430 460 -486 -163 206 -40 157 -57 -462
1015 -462 270 454 -468 -274 389 117 -92 -65 -223 121 357 -185 -364 180 310 -98 -325 37 346 -3
1035 -3 -189 -61 -21 275 167 -477 -109 602 -94 -474 243 175 -110 150 -247 -285 573 217 -638 -67 439 -106
1057 -106 -111 39 -97 206 183 -401 -199 462 193 -394 -187 249 148 -73 -95 -65 73 209 -184 -355 317 390
1079 390 -360 -287 206 128 76 -6 -336 30 458 -166 -356 280 303 -248 -189 63 160 240 -47 -334 -20 381 44
1102 44 -296 23 306 -50 -219 -8 129 169 107 -344 -209 499 210 -383 -131 294 -38 -119 18 -39 176 150
1124 150 -343 -296 407 319 -329 -203 133 45 18 32 -210 50 275 -266 -397 360 362 -320 -254 87 -23 191 78
1147 78 -380 6 471 -212 -394 363 253 -212 -65 -51 -64 389 124 -479 -55 472 -69 -268 182 206 -66
1168f6jr4J20M06j95o15K70N92l42l74L61M6j80J68k20j11N91j23o99K71N26k29
1190A02j62k7k2J95Q0l96M6M73j09m44J1M23Q8l12r5Q9M5K42j94l94M72L17o65
1213b37l0M86j50Nol87K77N13n40k55N19o1j80n2j1L24L2m47K4J94M6K19m19k64
1237d00P86j85o71N64J51m77M57k99m77J004m6j041N76L91n57L22j8m38O04j0
1257B36p09M53K66k27O3l49P4O38m41k48M05k79J45K54p42M23P96j060j15Q64
1277D47o57J55O63j173K62J180j184k64J228p34k35P82q31Q1J103r77m20R99m04
1296B1j54M33o16K51N70r02Q9P06m89Q9J77p39O76M62j090L64N73o85K72K15p16
1317d93O76L41j126M27O01o31L24O9p41Q21J63j027O09M59p85L92K5n93R00J9
$$ plain form
1168 -66 -67 -161 -41 365 170 -445 -175 417 75 -299 62 108 -72 96 -124 -235 356 233 -466 -195 331 102
1190 102 -60 -87 -109 86 166 -230 -184 289 180 -264 -253 170 258 -54 -149 -60 -15 227 33 -361 111 428 -237
1213 -237 -267 219 69 74 68 -319 -42 471 -69 -324 195 134 -46 -98 -109 215 247 -200 -176 18 64 283 -136 -400
1237 -400 386 201 -470 94 245 -232 225 -74 -551 453 407 -634 -58 333 -224 98 80 -358 246 236
1257 236 -473 -20 246 19 82 -267 -193 445 4 -244 161 -118 27 281 -461 -38 758 -302 -417 447
1277 447 -210 -55 608 -565 -303 877 -307 -571 657 -77 -312 470 -361 -280 823 -154 -574 425 21
1296 21 -133 300 -316 -65 505 -397 -308 398 -91 -2 175 -564 112 574 -516 -152 421 -264 8 223 -493
1317 -493 183 524 -602 -175 426 -205 119 188 -553 268 431 -596 13 472 -313 79 104 -489 411 430
1337D30j087P01L33p20N92q5o83R34p7j141R97L90j006N54N3q39J061J12j299
1356g80Q41N22j054M06M18o82M99J61r61O04N01o53J76L6k99N58j92n60P07Po23
1377c68M67j73k07Q47o15o40J062j90n99P76l74m07R93o92n56J272l75p72Q80
1396C29m00l32J155p82o68J301m09q19R96k95m44R41p14n15J279m27o69P98l97
1415g2k39Q49p28k78J099o29m68P69l65p9O77q23j62R52m65l65N24k76OL21n38
1436b90J46O10n63q1K48k93M34N1p77N48L60p35L25K62n45N56Oq70O72M62q24
1457b98K00L50n24M16J74p86M83N10q13M3N29l16J19J21n24K25M86m25j79L05
1477I6j3j20nl7J30J52k12k07J31K76o1l08P5K38j20q3J0O9J00k6k69L4L23l1
$$ plain form
1337 430 -657 44 377 -343 249 164 -519 415 338 -803 194 584 -422 132 185 -654 407 519 -780
1356 -780 61 583 -471 -65 353 -329 170 331 -630 -26 475 -178 -2 34 -265 293 101 -459 248 255 -368
1377 -368 99 -74 -281 566 -49 -689 373 183 -416 360 -14 -421 572 -120 -676 596 221 -551 329
1396 329 -71 -403 752 -30 -698 603 194 -625 371 76 -368 573 -141 -656 623 196 -473 325 -72
1415 -72 -311 538 -190 -468 631 2 -466 303 -62 -141 536 -287 -449 503 38 -327 197 -79 -73 248 -290
1436 -290 -144 466 -97 -178 70 -223 211 262 -515 33 393 -342 -17 245 -300 256 262 -608 64 526 -298
1457 -298 -98 252 -272 144 318 -468 15 525 -288 -245 284 -32 87 208 -316 -91 395 -30 -209 96
1477 96 83 -37 -42 -79 51 203 -9 -216 -85 191 130 -178 -103 135 15 -68 -58 11 111 85 -184 -150 173 142
1501A42k37o0J44J22n3j59P1J47n2k08l7K80J13k53q8P3J11J20k33j09K96Jk52
1524a21P0J15PM9j92j50L71N4k92lJ36QN8k23m1L64j18l34J92J12j6R4k45j29
1548b34M59p7l94K48J34k22J24j11j05L65pm29R3K99p4q1q7J8K17m7k42J27J87
1571A61o7r4j71J19K73j82j78J61P0j01N7j47N7K91k38k69L32R1j78N7j43J3L12
1594B26j88k95L63M3k58O9J0m9L26k11l51L54J53k62K4RkJ43j46j48L13J6k16
1617g7k8m4J80K02l44j02L77j58j40K11j34N1K17l64q6M78j03k67J46p2K6K15
1639A84k43o7K93p5k49J24N7J06J7l43M2L29j17p9L0p8J28L6k81J63K48k43j05
1662a23R1m2J97N9l87J42K53k08j05J60k4M2k8k67J83K85k24j69J20M2P2n1q8
$$ plain form
1501 142 -95 -155 -11 111 58 -101 -30 117 65 -143 -180 100 213 -40 -128 -55 56 176 -57 -166 130 131 -121
1524 -121 -51 64 71 120 -72 -222 149 203 -89 -92 44 52 110 -113 -154 210 92 -242 -50 62 46 140 -105 -234
1548 -234 225 148 -246 2 136 -86 38 -73 -178 187 180 -249 -156 143 69 -12 -99 -81 136 89 -153 -26 161
1571 161 94 0 -171 -52 221 39 -139 22 92 -9 48 -99 -42 249 11 -258 74 165 -13 44 -99 -86 226
1594 226 38 -257 106 149 -109 -40 -30 -79 247 36 -315 39 192 -70 -46 -37 -39 104 -42 -190 123 139 -77
1617 -77 -105 -149 31 233 -111 -213 164 6 -134 77 -57 -6 211 -153 -239 239 136 -131 15 -57 -31 184
1639 184 -59 -126 167 92 -157 -33 24 130 147 -196 -154 175 58 -21 9 -69 59 95 -186 -23 225 -18 -123
1662 -123 -32 -74 123 182 -205 -63 190 -18 -123 37 13 55 27 -240 -57 228 4 -165 -45 -3 69 18 -70
1685g0L7J38j21j16J04J42Q7k94q2K31O3j37J7k8J4J63j87q6K91K0l27L3J37M1
1709G0N3j03j69J87J23k13m9J51N1r8j00L3J82M5j85j44J36J43p0j24O1Q5p7o9
1733h1J1J34Q5j15k03O1K51j4j87J7K4M4l8n6P8R5q0j63M4J97L0j42q1N9O6L4
1759G0r8kJ38k1k12Q3J45Qp4j18m8K05Q9j55q3P4O1j04p5J54J02j01j48nJ38J34
1785A57j16j84J06Q1o9k3P2k1J3o9j12J28K38j65k02Q2R2L4j5n9L1O6r8p9J14
1810BJ48q5j68nJ07J22q5j17N9MM7m2pJ54rk06n7J79L8K6p1j62Q5J75j41k4J14
1837H1o6o2k0K0J58N6k49r1J56R9l7k2o7M4M4j60M6J69nj12j02L5K11rk07K6O9
1864Em3M7L4p9J33k6k99J68K69j63n2pj06J50J26k41L7J93j82j07J40P2P1q6k32
$$ plain form
1685 -70 -33 105 -16 -132 -28 114 201 -93 -175 56 119 -18 -1 -29 -15 148 -39 -125 166 186 -141 -108 29 70
1709 70 123 20 -149 38 161 -52 -101 50 101 3 -97 -64 118 163 -22 -166 -30 113 43 -81 -20 65 -12 -81
1733 -81 -70 64 149 34 -169 -108 143 129 -58 -41 -17 27 -11 -67 11 106 26 -137 -93 104 134 -8 -89 -30 36 70
1759 70 -28 -30 108 87 -125 -42 103 111 37 -81 -129 76 165 10 -73 1 62 -42 -117 37 139 38 -110 -115 23 157
1785 157 41 -143 -37 44 -25 -48 24 3 16 -53 -165 -37 201 36 -166 -84 8 42 27 -32 -1 65 -33 -112 2
1810 2 150 65 -103 -108 -1 121 36 -81 -22 -18 29 -13 -20 134 125 -81 -138 41 79 105 34 -128 -43 132 -9 -33 81
1837 81 15 -47 -67 -47 111 167 -82 -173 -17 82 45 23 -44 0 44 -116 -70 99 94 -18 -120 -85 126 117 -90 -64 5
1864 5 -38 9 43 -36 97 71 -228 -60 209 46 -6 -13 -119 31 157 -84 -47 146 -36 -143 -3 69 140 54 -178
1889a78J13J78p1M2j04q7K13r7j63K63K9k20N0m9K7K67j39l11K18N6j30J50l5
1912B2p5J45j71j70L69M5k74O4k7k3K49j28j67J91k4j82J53K5M9P1k69q1L34m0
1936H6q9N8j80O9K03k20KK92j78k13K09q5P1K24l12j65L31o8q7J56q2o9J25j99
1960a21N3L15j83k04J08n3J30J42k71k2K36k43J5K22j25KJ12l38R2L51j74j43
1982i9J20j49O7J34j82J05J79k91p4K36j9M0J0k67J15K30j87N5O7j43O0J1j75
2005a57K99Q7l88J08M3p7K82p0l65K82P1l16K35J67k78J05j1k58L11K11m21J01
2027c9P0j86K24L1j92J76J9l29J79J79j00K6j34j66L09J0j30Q9n8m8Q6j00N5K54
2051B25k37j86K18p0Q3J94l36l5K75j69o6K45r8j01R8j86R1L24k33j65J28o8R2
$$ plain form
1889 -178 -65 113 42 84 -20 -107 106 9 -154 109 138 -82 -32 -81 -54 213 74 -237 -19 37 -93 57 22
1912 22 -53 92 -79 -249 120 165 -109 -45 -72 -95 154 26 -141 50 26 -156 -3 22 71 142 -127 -208 126 86
1936 86 -3 55 -125 -56 147 -73 -71 221 43 -170 39 -46 25 249 -63 -228 103 35 -52 104 22 -47 78 -121
1960 -121 -68 247 64 -140 -32 -85 45 187 -84 -106 130 -113 -98 124 -1 1 113 -225 -133 218 44 -99
1982 -99 21 -128 -61 73 -109 -4 175 -116 -190 46 27 67 77 -190 -75 155 -32 23 90 -53 7 18 -157
2005 -157 142 229 -159 -51 -8 -85 197 127 -238 44 115 -201 34 201 -77 28 17 -241 70 281 -140 -39
2027 -39 31 -155 69 100 -92 84 103 -226 -47 132 32 58 -76 -242 67 77 -53 36 -22 -70 16 -84 -29 225
2051 225 -12 -198 20 -50 33 227 -109 -144 131 -38 -104 141 43 -58 40 -146 -55 269 36 -129 -1 -69 23
2074B3J01j89L2J42k24J6K02o1M8o9k16J43K32j78l8O3j14P5Nm9J61lk43J3J19
2099iL9R8j63j02J57%r3J34p0n0J12k19P0K90j18j86J04q2J0K86k58m9K48k11
2123f2q2K84k9j22J28k59K0K99p6j80J30p4l0J18r3N4R4j48j00J23J6J17o7k20
2147a59J23J36j48R1Jj01P0m3j24K09J39k86K7N0p0J97j3k52J47P6k17J55Q3j17
2171b6O2o3k01K81J19k36K5N6j44J75M2k10K28lk77J74R8j15J23j22j72K73Rj95
2195i9J40j1j05J15j6j25K60o3k82J65N9n6J32r3j41J64l8r1J56kr8N5j40J1K84
2220A81j74j22J34o9l0K28k25j8K50k54p4K73n2p0J41k24m6L19j63j19J87q1r2
2243a00J77j35N1J56j67j05J75qJ1K3j60M2J53j49K0J24j17oK0j10J51J38k64
$$ plain form
2074 23 124 -65 -33 109 -115 -99 103 42 90 21 -195 -52 180 2 -36 27 -87 -12 -7 -56 105 102 -141 -128 -9
2099 -9 30 128 -35 -137 20 20 -73 61 -9 -59 53 -166 -96 194 76 -110 -6 -88 -78 208 -50 -99 149 -62
2123 -62 -144 140 111 -11 117 -142 -122 177 101 -79 51 -23 -53 65 -28 26 120 -28 -128 -5 11 128 61 -159
2147 -159 -36 100 -48 43 44 -57 13 -30 -154 55 194 -92 -65 -15 -85 112 99 -153 -6 70 -147 8 91 -26
2171 -26 36 -27 -228 53 172 -64 -39 17 -127 48 90 -120 108 105 -172 2 100 -15 108 -14 -186 87 96 -99
2195 -99 41 30 -75 40 24 -101 159 96 -186 -21 38 -18 114 21 -120 44 6 -85 71 69 -29 26 -114 -103 181
2220 181 7 -115 19 -50 -80 148 -77 -95 155 -99 -173 100 48 -22 119 -105 -151 168 5 -114 73 -8 -100
2243 -100 77 -58 -7 149 -18 -123 52 44 55 78 -82 -40 113 -36 -16 108 -9 -15 5 -105 46 184 -80
2266h0L8J10j21N0J06j97N4J48k35L3J94r7n4N0j02J18J05j65pR8j09M5M3n4J00
2291G1n9j39J12O3k9J9n8p6J44j8j34J25O4j16L2j8j8J22Jk31J27R7p8N3k2o6
2317c2N8k2r5J00Q2o8o2pKJ15n0l9L1Om8L4k0K2N6r9r4J34O4j17M4m8j6J37o7
2346Ao9J02%p8nP6mK5o9r4R6M3nl1k7N5Qo4L6N2Mm8k6k4J00J7o6l7P8k7l8M9j5
2379A5%L8r1oJ39qj20k4P8k0K4l6j5N5ln3oO7rk9k9NP3k2%m8K8Lm1o7J14L9p1
2412b0J2k1RO4j9q3K8Q3m4n2L8N1j5l1k2K3R5n8q8K5P0K9o4j5M7Lm5jj9M8J9o3
2444a6k3Q2J7m8k7PL0nk3k0M8J6p0k9P2L9m9n3K3N6qqp6L9P6q5qK4K6%j2m4k0
2477f9J11l0o2M4MK6mm1J5N6j8p6P4LPl1m0P0J6r4L2K9NqNp0P4O8j01n1P0K5m9
$$ plain form
2266 -80 -42 68 -53 -3 103 -94 -40 108 -127 -94 100 3 -51 -1 -103 15 120 -45 -52 46 -63 -18 25 -29 71
2291 71 12 -127 -15 48 19 38 -20 -96 48 30 -104 21 85 -31 1 -17 -35 87 88 -143 -16 81 3 56 34 -32
2317 -32 26 4 -91 9 91 23 -39 -46 -44 71 21 -18 13 19 -29 5 -15 7 63 -36 -130 4 68 -49 -5 -53 -69 68 1
2346 1 -68 34 34 -44 -49 27 23 48 -21 -115 -19 24 19 -12 -39 16 24 -40 -4 48 52 4 -22 -46 54 71 5 -32 46 19 -19 30 15
2379 15 15 53 -38 -44 95 87 -33 -57 21 1 25 -11 -26 29 26 -27 -33 34 25 -4 -33 -28 45 23 23 -25 3 6 -35 -102 12 51 -20
2412 -20 -8 -29 -20 44 25 -58 -30 53 9 -43 -5 46 31 0 -22 1 96 38 -50 -25 45 74 10 -5 42 45 0 -1 -20 28 47 -16
2444 -16 -39 43 60 12 -15 -8 22 17 -6 -26 22 38 -32 -61 11 50 1 -52 -29 27 19 11 -65 -26 50 -35 -43 -19 7 7 -5 -49 -69
2477 -69 42 12 -50 -6 -2 24 20 -21 -6 50 32 -44 30 33 40 9 -31 39 55 -39 -7 22 27 19 24 -46 28 96 -5 -56 14 39 -10
2510a0K9o8N9N7p3m2N0N0p9j2K4M7jp4J6J5J6Nl8j5R8o8o3N4L9j4J5l5m5Q9L6
2541F2j43O0P7p6pL5qL2j3o9L7N2k7K0l5k4N8K9j01O6J6l0Nk5K2M7k1j10J00J5
2571D4l9Qj6n0J07l4j00P5K3o5K6oJ3N4o8l7R1l5n1P4o3L1P3q8l1J05j1m2K2l2
2601b2lJ21j49j6J26k8n9K5pJ2P0o7n6J08j0q5M4j2M6Qr4M2P9l9m9J1j2N8j7p0
2631d5K9Q8j06QM8l4L6N6j61O6Q3q3j4M7k3K3J5r1M6N6o7j0K0oO1m0o5P5N2r4
2661c0QM7m6P4l6r0O4P8j08K9Lk2J00q5l3R5jp7M6LJ1J3n9k9J04k6m8KK8J4mk1
2693Dk4M7k5k1J7k3L2J7q2LP9rk6K2j1J3J3m7k7O6J4r3J0L6P3l5l7qK2Krl4K2
2726a9L3jm9N7J8k7j3RJK6on4M8J6l8%L9k9K4k7l0M4K4j9kj0M3l8m0K2K5j9k6
$$ plain form
2510 -10 19 -49 10 67 -6 -48 2 52 -27 -39 -15 32 31 -43 -27 -12 4 9 -29 -44 54 -14 -77 -23 16 2 17 -18 -63 26 62
2541 62 -81 -21 56 -20 -27 8 0 32 19 -50 -13 39 12 32 -3 -27 31 60 -41 25 41 11 16 -9 13 60 39 -71 29 44
2571 44 5 13 -3 -53 54 20 -80 -5 18 -47 -21 -27 -14 40 -28 -65 26 -9 -60 14 -49 -18 55 -33 -64 41 30 -12 10 -22
2601 -22 -25 96 -53 -69 57 29 -30 -5 -12 0 70 3 -53 55 45 -40 4 -8 38 46 -48 -6 73 34 -15 -4 -16 42 25 -45
2631 -45 -16 72 -34 -26 22 -12 24 80 -81 -15 68 -15 -29 18 -5 18 33 -58 -12 44 -23 -33 -13 -19 42 2 -63 12 64 -30
2661 -30 -22 25 -21 53 17 -73 -9 69 -39 -10 -7 -29 71 -14 -47 48 47 -30 16 19 30 43 -16 -45 59 33 -15 -13 15 29 25 4
2693 4 -20 27 2 -19 -2 -25 7 24 -58 -55 24 15 -11 11 0 13 26 -21 -48 18 32 -61 -51 -15 58 23 -14 -22 0 2 -7 -41 -19
2726 -19 14 13 -36 21 39 12 -1 8 9 35 29 -25 23 39 1 1 40 11 35 8 -22 22 46 27 25 15 58 20 -20 2 27 8 -18
2759a8mJ8M1j0m3nM0j6QOp9R7k9l9NN5p7K7Qk1Q2n6lJJ9j2k3K3LM5j4n9O1J8o4
2794a5J9J0l4N4j1o5N7L9k5l6LK0L9l0k6QL6l5k7K1%J7k1m3L6K2j1J0n4J7O7n5
2826a3l3K7Nj7NOj1N9o4l4R9rl8L6m2MM1j1o4J14l3m6K7kj7M7o3oO5kp3R3l9k6
2860a5Q3j14K0J12n4o3M9k7jK3m2j0Q4n5l8N0j4M0Rp6J8N5pn4L5pj0K9r7Q0K3
2891B6n9L3J0m1P3k4r8Q8K9r6L4K3m9P8j2p6N1N6q7K0M6n4M0jm1O6J1n8K3K8l6
2922CNrm8Q3J3r4O6k3kK8Lo8P2Pj01K6N6l1K0k9%K5K4l5J4lkk1orQ2n6l8O5qk
2958GJl7RN3k1n8N2L3k0Mm7J7N5m5%j2J3j0M2k9j7O5q0%M2Mjk4qJ3L3lk1k8L6
2993A8qk8J3K6nk4l1M6J2MKn2J6lqJL6pj0ol1L4J0n7L1K9k7N0o3K2L9k8k3J3k
$$ plain form
2759 -18 -22 -4 37 27 -16 -21 19 3 11 17 -62 35 6 -33 -28 27 -50 -23 -15 -36 46 -10 -13 -12 7 -5 -28 -5 -2 43 29 -30 31 49 -15
2794 -15 4 14 -20 34 23 -42 15 54 29 -7 -4 16 55 25 -1 7 43 8 -19 2 2 19 -2 -45 -9 13 2 12 -42 -25 42 -13
2826 -13 -46 -19 -14 -31 -26 -20 -31 28 -36 -70 29 20 -18 18 -24 -20 21 10 -54 60 27 -19 8 6 -11 36 -27 -33 32 30 -43 50 11 -15
2860 -15 68 -46 -26 86 32 -31 18 -9 -10 13 -29 -39 45 -10 -48 2 -12 28 37 -39 -21 34 27 -27 8 1 -9 20 -77 3 26
2891 26 -33 0 10 -31 42 18 -80 8 37 -59 -25 -2 -51 27 15 -61 -10 46 -41 -21 25 -29 11 10 -31 35 46 -12 11 39 3
2922 3 8 -1 -49 34 47 -47 19 -4 -6 22 25 -43 29 36 -65 -39 17 -14 6 -23 -23 2 26 -9 5 2 0 -21 -27 -36 46 -10 -48 17 9 7
2958 7 8 -29 -20 33 12 -46 6 39 19 23 -24 -7 48 3 3 -9 4 -6 36 7 -10 55 -25 -25 17 21 20 -4 -12 1 34 31 10 -18 18
2993 18 10 -18 -5 21 16 -8 -39 7 19 23 25 -27 -11 -14 -22 -21 15 8 -2 -8 -39 -5 5 -52 -21 8 -19 31 -32 -10 29 1 -22 -9 -11
3028a1K6l7k0K4J6ROj3PJ3m2JL4J9j8Mj3J6kMk6J0N1n8%LPJn5K2J9K8o3LL2K2
3064A9ll8jK4rPj4NK7k8k3M4Rk4Nj1OJ0J2m0kL5Ln4J3M5k0K5rl8O9l0Jk7j4L8
3100A2K5j2l5M0L2r1J8K2J9pj7J7Jk1l1K7NL7j2n7LN4j7k1J9l5M2j5m1L0M3o3
3132b9qN5l2L6k0m1J5L0nj8QkL2n1jL4Ok3LJ6OL7p8J0K6M0n1J8J0rK8n9j6O9J7
3167E3p9N0J3l4L3m1QoK4l6J0K1Pj1l3L2Pk8j4K7nk8PL5m5N6j6l5LJ4J8pk5j0
3201c5P2o3k4L8K9J3k1mkJ0nm2M6j4j6K2k6O1kj7l2K3j3k6M5l5QL7m0RK3jl2p
3235b1J6NK1k8Pk5K0J6j4j0J6Lk2J3j5Nok6J2L9Ko0L0Nk7M6k1k4N5j3j9J5L6l1
3269@j4NQJ3rqmJ1J1oJ5n3M7J9k5k3N1j6nm3%M6nj5j2N5n6K6ok0NNJ4Ok3Rj9J2
$$ plain form
3028 -11 15 -22 -42 -18 -2 7 13 0 7 20 -22 -21 13 32 14 18 5 21 19 23 -3 7 58 0 0 3 10 11 -44 -22 -3 25 -38 -35 -3 19
3064 19 16 -22 -23 1 -8 -1 -15 -10 17 -11 -34 10 19 -5 0 -11 -5 5 17 -23 -25 10 13 -41 -28 17 -3 22 13 -25 44 14 15 -12 -26 12
3100 12 37 25 -10 30 62 -29 -11 11 30 23 6 23 24 3 -28 -1 4 41 29 -28 -25 29 12 -9 10 -25 17 2 -39 -9 34 -29
3132 -29 -37 18 -14 22 2 -39 -24 6 1 -17 -9 -11 21 -30 -31 3 9 -14 -11 5 11 48 -30 -20 6 46 -5 13 23 14 42 -17 -33 36 53
3167 53 -26 24 37 3 36 -5 3 -3 21 -15 -5 16 23 12 -21 11 18 -10 -24 3 -2 -30 -23 12 -33 23 7 -28 -25 -11 7 0 -25 -35
3201 -35 37 -26 -50 -12 17 30 9 5 3 13 8 -34 12 -2 -18 4 -22 39 37 20 -12 11 -2 -28 17 -18 -10 27 -13 -4 19 18 -14 -21
3235 -21 -5 0 21 -7 0 -25 -5 11 -3 -13 3 6 -16 -3 -18 -13 -19 -45 -33 6 8 -52 -22 -17 -44 2 -19 -43 12 -1 -20 -5 31 0
3269 0 -14 -9 -1 12 3 -5 -9 2 13 7 22 -31 16 35 10 -13 38 22 17 -26 -26 20 15 0 -12 43 -13 13 7 -13 -8 -3 11 17 -6 3 -16 -4
3307dk1L6k7j9L6J1Oj9qj9J9J5k4kNK2rl6M2%nl0M8j4j3J9k4K5%pl2N3k1L%qJ6
3344A4Ok4Rj6L8k0j6kL9J8m5j7QL0l3J0QnK2m9L5Ol0J6j9MRj6KJ5J0j2j8NL4J
3380A7j2pJ1m1K7kmQMj6J5pK1Nk5%j1L2pJ5k0K3jlk5j4M2l5j1L0rK7qmlPk3J1
3418GK2j7rjj1L9l3K8m2J6qj3Qj3J0M8k6j6k1K3RrorJ0pLPJ1qoL0Pk7J1K6j2j1
3456A0j3K1Rm2L9l6L6kjj8QrJ6l1k1M7L0m8J8K8l7J4n1L5k1L0m2N8k2oLj9j1J5
3490a3K3m6M0q%jRm3L1j6K3l1K4qK6l4j7L5K0jj6JOj4l1K8J1J1J2j2MJ8j3j4%
3525Dj1K5k2K6k1KK3k4L6k1m5K0J7l1QK8j5OJkmJ7m0J5L7o3K5MnMnJ5k8Ql1J6
3561c1K2Jk3J5J7j3J9l9L8j8K1Nk2Qlnk1K5L2j1k3J1J4j3L1m7j3M6j7Mk5J2LJ9
$$ plain form
3307 -4 -25 11 -16 -35 1 12 18 -1 -9 -28 -9 6 -18 -20 -15 7 -2 -38 4 4 -1 -31 17 3 -10 9 -15 10 10 3 -29 24 3 6 6 -2 14
3344 14 20 -4 5 -11 27 7 -9 -11 28 46 1 -16 -8 22 -11 -1 7 2 24 -25 10 16 -14 2 -17 -13 -4 -20 -18 -3 7 -5 -23 -18 16 17
3380 17 5 -2 9 -32 -5 -7 -11 -3 1 -15 0 -7 14 19 -6 -6 -17 15 8 23 3 26 25 22 -3 -17 25 -10 -21 9 0 27 19 15 12 19 -4 7
3418 7 29 12 3 2 -9 30 -3 25 -17 -1 -9 -22 -14 -27 -17 31 5 -11 -32 -9 0 -9 -15 -24 -14 -21 -18 -11 0 -8 -14 16 23 -4 7 33 21 10
3456 10 -3 18 27 -15 24 -12 24 22 21 3 11 2 18 -13 -34 13 43 -5 13 41 4 18 -33 2 -19 11 -31 27 5 -1 2 -17 -28 -13
3490 -13 10 -36 4 -4 -4 -5 4 -39 -8 -24 -1 -32 -8 -16 10 -24 -41 -6 14 13 -3 -2 4 -10 -41 -13 -2 9 21 9 13 31 18 4 4
3525 4 -7 18 -4 22 1 3 26 2 38 17 -28 -8 9 -22 -14 14 -1 5 6 4 0 17 -23 -8 29 -34 -9 -5 -10 -6 -11 4 -24 -16 -47 -31
3561 -31 -9 -8 -31 -16 1 -12 7 -32 6 -12 9 14 -8 0 -3 -8 -29 -4 28 17 -6 5 19 6 37 -10 -23 23 6 10 -15 -3 0 19
3595A9j0%pL3j3l1OOjkKJ5m3J6j3J0j8K2oJ4j1lk3J7%oJNK2k3omK6LJ7J0k4J5
3633A5J9j2l7Mkj1K3j1K3PnM%pNMnQRlRn5O0j5j6jlqQPk4J6Qk1Mj4Qj8K3Ok9J1
3675a6j5pK4rJ8rLk0K8NMj1pOk0J9K9l5j5J1J4K5ml3J0J9%Pk9lj0N2k6J3J0nj0
3712A3k2J5Ql2N9l8ojjM2m3J0nL3l1J7J6k9k4L3k1J3l2k2L9J5j6l3J3M0j9K6j6
3745Aom0J9L6pJ2l4l2N7Lnj9j0L6K6m4m%jJ7k4K3NQ%j5L6k3k5j7L7%Rk3J7K5j1
3782B7k3J4K3l0Lj1jk0L0j6lj1K9j7j6J1Nj7j4K2J1Nl6J3J8K4J2p4K9K8l0K1m3
3815c7K2K8l1K5J3k4QmlJ7pJ1l2M1j6pL8l7K4j3j2KLpJ0mj2KK8l1rRL6j8k2J3
3851Dk7L6j7k9K4J9k3J7j5Qrj1Oj1L8k4j6J9L3rm1K8kl4J7J9Qj5J4j1rM8J2l1
$$ plain form
3595 19 9 9 2 35 22 -9 -3 3 2 0 2 17 -26 -10 -23 -13 -31 -9 -15 -1 -12 -15 -38 -21 -21 -27 -26 -21 1 -22 -28 -32 -6 -3 14 24 0 15
3633 15 34 22 -15 -11 -13 -24 -1 -12 11 18 13 17 17 10 15 19 14 22 31 28 37 -18 42 27 11 10 7 -1 7 14 -10 6 14 -7 -3 -17 -9 -27 -4 2 -27 -16
3675 -16 -31 -38 -14 -23 -5 -14 -11 -31 -3 2 6 -5 -12 -6 -26 -7 22 -13 -28 -17 -3 22 18 -15 -5 14 14 21 -8 -11 -21 31 5 18 28 23 13
3712 13 -9 6 14 -18 41 3 -3 -4 -5 37 -6 4 -1 32 1 18 34 5 -19 14 -7 6 -26 -48 -9 6 -10 -43 -30 10 -9 17 1
3745 1 -5 -45 -26 10 3 15 -19 -51 6 9 4 -15 -25 11 37 -7 -11 -11 -12 5 -19 4 9 17 17 2 38 15 -10 -27 10 10 19 -4 13 38 27
3782 27 4 18 41 11 14 3 2 -18 12 -4 -7 -18 11 -6 -22 -11 -6 -23 -37 -15 -4 1 -35 -22 -4 20 32 -42 -13 15 -15 6 -37
3815 -37 -15 13 -18 7 20 -4 4 0 -3 14 7 18 -14 27 11 4 42 5 29 16 4 6 9 2 12 8 -4 -2 26 -5 -14 -5 31 13 -9 4
3851 4 -23 13 -4 -33 -9 10 -13 4 -11 -3 -12 -23 -17 -28 10 -14 -30 -11 22 13 -28 0 -2 -36 -19 0 8 -7 7 -4 -13 35 47 16
3885A6J%j0J0nLNqm4K9jL1Rk8J3joK2o0M2jJ4k5MLj2lj0L0l2J3j8N6k2k8j8KJ7
3923a2K2nm6L8pK3qQk2J6k8J0K7J3m4MRPL0n3qJN6j4k6%L7k3j0m2N9Rl1%K4k1
3959gK7jm4M5lk1LK9j9nqQk5J4Lj8%L9k1k3%L5m8KL1K4J9k3n0PN2Pn7J6L7m8N2
3996B9k1k5K0K2n9N8k9K3l6%K8J3j3k7J4M1K9o8PL7pk5Lk4N0l3j3nOM8n6MJ2l1
4030b8J1lPnK4lk5J7Oqk4L8Oj2k4J1k7N3l2lOL9j0m2kM3kk8J1Pk4O2k2m5N1N3
4066G6q0j1L6l4M2pk4KN3k6m4P2ok4Km0K6K8l5l8K1L3po0M9J6J2k6l0J6J8j3k4
4099b7MJ5Jk3K1L3p6K8pLM2J3r0P2Mn2M4J1k3jJ0j4LJ3K3k3nqO2o1JL0mk9J4%
4135DrP1pr5N8L0p4M9l0oJ4Om8O6Mp1N2k1pL9j8k6K2j3K0m1J8lPl3J0M5k2oK9
$$ plain form
3885 16 17 17 7 17 12 15 20 12 -32 -3 -4 27 36 8 21 20 14 36 -24 18 17 31 6 10 13 1 -2 -12 18 -14 -1 -19 37 15 -13 -31 -29 -12
3923 -12 10 5 -41 -3 -10 13 5 13 -9 7 -21 -11 16 29 -15 -11 -2 5 35 -18 -26 -25 31 17 -9 -9 28 5 -5 -47 12 21 -10 -10 14 -7
3959 -7 20 19 -25 20 17 -4 -1 28 9 4 -4 4 -21 -7 -4 -22 -22 17 -4 -27 -27 8 -40 -38 -7 17 36 13 -37 -30 22 29 -28 -12 25 -23 29
3996 29 8 -17 3 25 -34 24 -5 18 -18 -18 10 23 10 -17 -3 38 67 -1 6 43 36 11 14 -10 40 7 -6 -11 -5 43 -13 -9 3 -28
4030 -28 -17 -20 -13 -18 6 3 -22 -5 1 -7 -31 7 13 1 -23 -12 -39 14 -18 -21 -15 24 14 -28 -30 13 11 -17 -6 1 -23 39 17 -28 23 76
4066 76 -4 -15 21 -13 29 22 -2 0 53 27 -17 55 49 25 27 -13 13 41 6 -32 -11 22 15 -45 4 20 32 6 -24 -8 10 -3 -27
4099 -27 -23 -8 -7 -30 -9 24 -52 -24 -31 -28 14 27 -63 9 13 -39 5 16 -7 -8 2 -12 -9 4 27 4 -1 -9 53 -8 -7 23 19 -10 4 4
4135 4 -5 66 59 -36 22 52 -22 27 -3 -9 5 11 -37 29 33 -38 14 -7 -14 25 7 -19 3 -10 10 -31 -13 -16 -9 -42 -32 13 -9 -15 14
4170A4o4L2K2k1l4P1j3oqPrL9l7l8Q5rl0LL6n3L1%j7M1Kl6j6K2J1K2o1%M6qmj5
4206Ek0J8K2n7rQ8l6m9M3prL5l8l4M3K9n3J8j0K2Ql2J2J6J3k9n9P1jk5jL8J9p7
4240d6N7k5mN2k1m9L4P3j05M8j7k1L4K4o7J7N6m3Mk3L1J0K2n6M0J3l4j7NO0k2
4271C0o1lL3Lj1M%j7O2l4k1K8j3m9L6L8k6ln1M3J0rL5k9J8J5l6MMJ4Nm1l4P3K0
4306C7k7m3M1M7l0k9nJ0J7k2k3J5N1k5l2M1pJ5j6qJ5J6j8n0J8N1k9qpJ0JMl0J9
4340ak4L1k1OL7l6m5M1J5j8M8m5l2N6J2o6PL8Kl2NJ6jPrK3m0P0n1OK8J5n5oK0
4375AMJ6J3o0j3Q8n5JJ2K3pk5%kM7l3l8L9Jj3J9m4M7jk6k9J9N4l1k8m0Q0j5k3
4409a9KQm2N6j2m6P3ll3JJ9Kj2%j0PN3m1m7Q5pno2J1O7k9k2N0p5O9L0q0NN0kq1
$$ plain form
4170 14 -50 -18 4 -17 -51 20 7 1 -7 0 -9 30 -7 -45 40 31 1 4 40 -13 18 18 1 42 44 8 -8 14 25 47 -14 -14 32 24 20 5
4206 5 -15 3 25 -32 -41 47 11 -38 5 -2 -11 24 -14 -48 -5 24 -29 -11 -21 1 9 -23 -11 5 18 -11 -70 1 0 -25 -26 12 31 -46
4240 -46 11 -14 -18 34 13 -36 -2 71 -34 14 -3 -24 10 34 -33 -16 40 -3 1 -22 9 19 41 -15 25 38 4 -13 -8 52 30
4271 30 -31 -34 -1 2 -9 -5 -5 -22 40 6 -15 13 0 -49 -13 25 -1 -4 -55 -12 -2 -11 24 -5 13 28 -8 -4 0 14 19 -22 -56 17 37
4306 37 10 -33 8 55 25 -4 -9 1 18 -4 -27 -12 39 14 -18 23 16 31 15 7 22 38 20 -30 -12 39 10 2 -5 5 6 10 -20 -1
4340 -1 -25 6 -15 -9 28 -8 -53 -12 3 -15 33 -12 -44 12 24 -42 -35 3 5 -27 -22 -6 -7 0 -9 14 -26 44 -7 -1 27 42 -13 -19 1
4375 1 5 21 34 -26 -39 49 -6 -5 7 30 23 -2 -2 -4 43 10 -28 11 12 -1 18 -26 21 20 -6 -35 -16 38 7 -21 -61 19 4 -19
4409 -19 -17 -9 -51 5 -7 -53 20 17 -16 -15 4 6 -6 -6 -16 -9 44 3 -44 41 34 29 -33 -22 45 16 -6 44 -31 38 68 -12 -7 43 41 -40
4445d0O0j2LNk8j7M7J2o9M5K4m9J7jj2J9ol3NNN4o7l0M3N2q2K5K3k6L2m0k2O2
4478aL6p8QP4j1n3N9o2K2L3m3kP6n3MJ3j4OO2o0m2M5J5k8RJ5J2pj4k4mJ8%l9k9
4513e7Q5j1o6K2O7n9QM2p9L3N9r1K0K2Pl0K3MJ9o6OJ8oO8j0o9L8K0l2k4L2J5k6
4546a8L0k1QM9m4l3L9J8j9NK7p0Q0l0o1O3L7m8nJ1j8J3Mk8OM7k6n2KL7K8p1J7
4579b3M1k5mL0l8J1M1p0j7N4J0o1K1M6j6K2k2n5R5K4o0%j8L2L3n4RK9j1m1K4j2
4611eL4nm0qO3j3j9NPJ7J5o4j5O6ll9K9k5J1L8q9PP7k2k7RjmOkqK9K1j09L9L5
4647A0J8o5K6K9j1rpJ5j4L3l9n9O1M1l4lJ8l3NM5p0L3O1o5moP3j9m9J3J4Mmk5
4681a7K3M8j3l8JQL4o0nLM8n1MPJ4k2Rl0M5K1n9J8m5M5Om8M1J6k8J9k5J6MK6l6
$$ plain form
4445 -40 20 8 11 16 -12 -29 18 30 -39 6 30 -19 -2 -3 -15 4 -2 -35 -30 -25 29 -38 -68 -25 27 -55 -30 -7 -33 -1 -41 -63 -1
4478 -1 35 -43 -35 39 28 -25 34 -28 -6 27 -16 -18 58 5 9 22 8 14 76 16 -26 19 34 6 15 30 42 35 21 -3 -7 11 11 -28 -57
4513 -57 28 17 -49 -27 40 -19 -11 31 -48 -15 44 -47 -27 -5 2 -28 -5 -1 18 -48 -42 -24 -30 38 28 -41 -3 17 -15 -39 -7 8 -18
4546 -18 12 -9 -1 48 4 -29 10 28 9 14 41 -29 51 21 -40 23 60 12 7 18 0 13 17 -11 -5 42 16 -36 -34 3 31 -40 -23
4579 -23 18 -7 -11 19 -19 -8 33 -37 -54 0 10 -51 -30 16 0 22 0 -55 40 64 4 4 -14 18 51 -3 6 35 24 -17 7 -5
4611 -5 29 24 -16 -24 39 26 7 12 19 36 51 -13 -28 38 35 -4 25 0 11 49 -40 -33 44 22 -5 4 3 -1 5 3 -5 24 45 -64 -25 10
4647 10 28 -37 -11 18 7 -2 -9 6 -8 25 -14 -73 -12 29 -5 -8 10 -23 -18 27 -43 -10 51 -14 -18 -24 49 30 -19 -6 8 12 8 -17
4681 -17 6 54 41 3 4 12 46 -14 -19 -16 32 -19 -15 -8 6 -16 -7 -37 8 29 -30 -12 -57 -12 -6 -54 -13 3 -25 -6 -31 -15 -11 15 -21
4716b1j6N5Np1LJN3JJ6n5M9k0Lk3J0L6lm8J3Q1m0k5J1j4j1L4j6RK5l5Pk6K2K4
4750C4j9m6K4O4n6k8L2J5J0pk6j3L6n5Oj5O4j3l3NJ1Llm3K8N1j8l0l4J3Q1n5j7
4783c4L5QK2n7mM9K6j8k6J6L3j2m5oJ5N0n4KL7k6QRj9OL1m2J2rJ7kJ2m5M0j3n0
4818c4kL6J8m0J1Qk0P1n8l6P3j3k6kJnqmK3KN1l2l8K0K6qm7LM2k1k0kJ8L7j5l9
4854c0J6Q7q0K4Nk2J9J2n1L7K9o2J3J5lN0n9o8P1K9k4j0Jj0K5%n5L6P8q1j9J1
4886a6J4Qml7L1L3m1mj5L2Pp2K7M8nk6rJ9RLl1J8kQl9PK5L0K7n3qN9k6l8L6j%
4923A4J7p8M0N2km8NPK9l5pj3L8Kk2NJ3Nj3l1j1O5qm3j0K6nRl3J0L8j5m8L5J0
4958bQl6L6k2J7j5m9L2M8l9j4J8M5J6n8k7L9mJ0%j6M3J0%j2J4n2K9m0K0K5qj6
$$ plain form
4716 -21 -37 18 23 -48 -45 -44 9 10 26 -29 20 0 3 -20 -10 26 23 -25 -12 69 29 4 15 1 -10 24 8 17 42 7 14 -12 10 34
4750 34 15 -31 -7 57 1 -27 5 20 30 23 -3 -16 20 -35 -29 -44 20 7 -26 -21 -10 -7 -10 -53 -25 26 8 -22 -56 -43 38 -17 -34
4783 -34 1 9 31 -26 -30 19 45 27 1 17 50 38 -7 -13 2 52 -2 0 37 11 19 28 9 15 46 4 16 7 24 22 34 -11 29 16 -34
4818 -34 -36 0 18 -22 -11 -3 -23 48 -10 -46 27 14 -12 -14 -13 -18 -26 -30 -7 -5 46 14 -24 -4 22 14 -33 -30 12 -9 -29 -31 -13 24 9 -30
4854 -30 -14 73 -7 17 22 0 19 31 -20 17 46 -16 -3 12 9 59 0 -68 3 32 8 -2 -1 -11 14 14 -41 -5 73 -8 -27 -16
4886 -16 -2 6 2 -35 -4 29 -12 -16 -31 1 8 -64 -37 11 6 -20 -29 -10 -1 2 -29 -11 -13 -5 -44 -37 -12 18 45 -8 -16 43 17 -21 15 14 14
4923 14 31 -47 -7 45 43 -5 0 7 36 1 -6 -19 19 21 -1 4 17 22 9 -22 -33 32 24 -19 -29 -3 -8 1 -32 -22 16 1 -47 -12 -2
4958 -2 6 -30 6 -16 1 -14 -63 -31 17 -22 -36 -18 27 43 -15 -42 -3 -7 3 3 -13 30 40 40 28 42 -10 19 -21 -1 24 16 0
4991@rL9k6J3k1k3L0K4m6j7M9Lk9J7j4K5J8o0%jM6j3n4N1Ok0rk5O1qJ6m8M7kj7
5026Ckm6O2K6p1PN7j6ol1j5M2L3k6l9N1jl0J0QrL0m6j2O2Rl4m3RM4k9J8m4M7l
5061A5k4m7O9qJm6L6PJj3l9M3K5m7k1O9j9k0K0k6L9K4k3l1K1lJk0j3J6M1l0n6
5094e8R5k2ll2K0oJ3jk9M1Jll0K7K0l5J0MML1j7o3L3r%j6L1KQk8j8J9K7rj7n3
5130f3O2L5n8k5N1k2J4k5j5O1j6k0l7M1PM3n1%O3k0m8KK0K8j2o0M3L1J7n7jJ3
5162AQjl2L3K6m5%LM7j8L0l2m9O9j3l5QL5J4q1PRJ9K6p7L0K5Jnk8L3Kl0k0M3k7
5198b4Qk0k2M9M2m5qK4L6o2J0%j3N9l8j7qP6o9K4k9L4L4j6m8N0Mm0L1k6N8lp3
5231b2K6J8J9m1oJ3J9k2k7kL9qj5k4ON1K9r4J6M0j0k4Nj7kJ3l1KP6k0k3kL3k6
$$ plain form
4991 0 -9 30 4 17 -4 -27 3 27 -19 -36 13 16 -13 4 -10 15 33 -27 -27 -28 18 5 -49 2 8 -12 -21 -46 15 7 23 -25 22 20 3
5026 3 1 -45 17 43 -28 -21 36 20 14 -17 -32 10 43 17 -22 29 28 -2 8 16 7 37 -9 -21 41 50 16 -27 -18 26 -3 15 -29 18 15
5061 15 -9 -56 13 5 6 -40 -4 3 4 -9 -48 -5 20 -27 -48 21 2 -18 2 -24 15 39 16 -15 6 3 4 -16 -29 -13 28 -2 -58
5094 -58 37 15 12 -20 0 -6 7 6 -23 18 19 16 -14 13 33 -2 8 12 16 47 30 -33 0 -9 -9 -25 6 8 16 -12 -30 -11 16 7 -10 -63
5130 -63 -1 34 -24 -49 2 -20 -6 -31 -46 15 -1 -21 -58 -17 -10 33 -18 -18 45 25 -23 -21 -1 27 15 -45 -2 29 46 -11 -12 1
5162 1 9 8 -24 9 35 -10 -10 -7 40 22 52 20 -29 40 27 -8 0 35 49 -32 -25 -16 3 29 -48 -18 7 8 3 -25 8 10 -20 -40 3 -24
5198 -24 -16 -36 -58 -9 33 -12 -20 4 40 -22 -12 -12 -25 34 -4 -21 -29 47 -22 2 -27 7 41 25 -23 27 31 -9 22 -4 54 51 -22
5231 -22 4 22 41 0 -6 7 26 4 -23 -25 14 6 -9 -33 -27 24 53 -41 -25 15 5 -19 -14 -31 -33 -20 -51 -49 27 7 -16 -18 15 -11
5265a1j8J5K1J6j7ol6K5M5l7l6L8J5j7qL5o0P7j3k2lrNPj8K8pK7o5J9J3RKj3n
5300dL3k8k8J3M3l6k5J6L0mk4k7M3J0n0M1j3JK6n3j6N3RNl9J5K2k8k9M4j8L6k3
5333em0N4L8j9n1kM0NljqN3l8m1RM4j5l3mN2j4Pk1pK9rk9QJ5ol1J7K3k2J7l8o
5370c2O8J4p5jK3Lk2J5j4K7qj9j1PK0J1m4J3J3N1m3j5J9M9n9j1L7J1k3l3K7L8
5402C6k0%k5L0K9k3k5nM0k1m9J7J6RK7m4JL7Po2j7L7O2m4l5N3l3K1rn1M0N2n1
5435@o4N6JlmnNJ8n9J3L1pQL0k4K2k5mm3O5qK1m9J4L6Nl5J2MJj7k7K5L5j0l5j4
5472c1O3j9m8L9k6Q5p2k8M2Rjk0qj5N8l0m2N2J2l9j0L2okJ6n7N4J2j1k7J2m2N9
5505A1j7l5J3K9Jm4LL7M1j8l6J5j6K7Lk6K8M3p8l1P9k3oJ2k3K7J0m1j9N9pk0J0
$$ plain form
5265 -11 -29 -14 7 23 6 0 -36 -11 34 -3 -39 -1 14 -3 -11 24 -36 41 28 6 3 -6 -1 6 -12 16 9 36 -29 -10 3 12 14 1 -4
5300 -4 29 1 -27 -14 29 -7 -32 -16 14 10 -14 -41 2 12 -38 3 -10 -9 17 -36 -52 1 10 15 -24 -9 13 -15 -44 0 -18 18 -5
5333 -5 -45 9 47 28 -23 -25 15 20 17 16 8 61 23 -18 -9 35 20 -13 -17 35 21 28 7 0 29 20 -9 -1 14 8 -23 -6 17 -5 12 -26 -32
5370 -32 36 50 -25 -26 -3 0 -22 -7 -21 6 -2 -21 -32 -25 -5 6 -38 -25 -12 39 -4 -19 0 49 -10 -21 16 27 4 -29 -2 36
5402 36 16 16 -9 21 50 27 2 -3 37 16 -33 -16 0 9 36 -8 -7 30 37 -25 -42 -5 57 13 -22 31 -2 19 10 -41 -1 51 0
5435 0 -64 -8 -7 -10 -14 -19 -14 4 -55 -42 -11 -18 -10 20 -4 18 -7 -11 -54 11 3 24 -25 -11 25 30 -5 7 11 12 -5 -32 -7 28 18 -17 -31
5472 -31 32 13 -35 4 -22 63 -9 -37 5 14 13 -7 -15 -30 28 -2 -44 8 20 -19 -29 3 -3 -5 11 -46 8 20 9 -18 -6 -48 11
5505 11 -6 -41 -28 1 2 -42 -39 -2 39 21 -15 0 -16 11 14 -12 16 59 -19 -50 29 6 0 12 -11 16 26 -15 -34 25 18 -2 8
5538Hj6K1K3l0l0M4J4m6jPL2nm7j7O8l9k0K2l2M8J4k6k7N8rl3KmM7k0k0KK6Nl1
5573a2pLM3Kk7QJ6%Ln0M5oj6j3%L4j0k7m5O7rL7m5PN7n9%M1Qk2k4k2J3J5nm2M8
5610Fqj9oJ1k2J7J1j8OL5l3JkJ7m7M3k0jJ2j2K5j2j1M0j9kkOK4l4JJ6lRk2lO5
5647D9n8koL6J1l1j2J6L2j2m7L5k0J1oqJ1J8k8NK7nk2jKK6pl8j0K4L0Ko5K8J6
5682Alnj4J2LOn0K4N8m1qrmL3Mj3j0NJ3j9L3rJ9l6LJK4Oj3j7K3Nk8j5K9J4Nk7
5720@j7L3K7m6j5K6J9j2k3QmK9o3M2kk2J3j2k8P0l6k7j7M4L0m9kK2L4m7K0k6K1
5753a0L0Km9K5Nonj7QL1%n4M0L1m0nL4jk2kkK5nj4%mM7k0j6l1L3J4m3ML5J3k3
5790Hj5jK0lj6j8O1l8k4L0k8L0ll1k6L4oJ5j5mM1pl5%K3L7l6k2J7L4o9K4K6K3
$$ plain form
5538 8 -8 13 36 6 -24 20 34 -12 -13 -6 26 21 -26 -43 25 -14 -34 -12 -44 4 18 -8 -35 23 14 -19 -17 -21 26 6 -14 -12 14 19 -12
5573 -12 -19 -16 27 29 2 10 26 26 29 -21 24 18 2 -11 -11 23 13 -14 -59 8 -1 36 -9 -2 55 -4 -4 37 45 23 -1 -23 -10 5 0 -42 6
5610 6 -2 -21 -27 -16 -38 -21 -10 -28 -22 13 -20 -19 -21 -4 -51 -8 -28 -29 -17 -29 -4 -16 -27 13 -6 -8 -10 -4 20 -14 -13 3 0 9 -13 -16 49
5647 49 -9 -11 -17 19 30 -1 -13 3 35 23 -24 11 -9 2 -4 -12 -1 17 -11 -6 21 16 -6 -7 -5 21 14 -24 -34 -10 20 22 -43 -15 1
5682 1 -2 -7 -21 -9 -6 0 -50 -26 32 -9 -17 -26 -30 3 7 -6 -16 -11 2 -17 16 7 26 -10 -7 -6 18 24 11 -6 17 22 -6 -21 8 22 27 0
5720 0 -17 16 43 -3 -18 8 27 15 -8 0 -4 25 -38 4 2 -20 -7 -19 -47 23 -13 -40 -57 -13 17 -32 -34 -12 22 -25 -5 -31 -10
5753 -10 20 22 -27 -2 3 -3 -8 -25 -17 14 14 -40 0 31 -9 -14 20 19 -3 -5 -7 18 13 -1 -1 -5 42 22 6 -25 8 22 -21 -17 18 31 8
5790 8 -7 -8 12 9 -7 -25 36 -2 -26 4 -24 6 3 -28 -54 -20 -26 -11 -26 -30 11 4 -31 -31 -8 29 -7 -29 -12 22 -47 -23 3 26
5824B6njm7J6M6l9j1K2NJ0ml7L7%L1p7L4J4J9k5l8L9j1rm1M1JL7k5k3J1K6n6J6
5858a8%J9loj5RK7m2J4J2kJ0j5k9N4K1m1kk6J9KJ8n3P6j1l9J1k0L2k3K9m9J09
5891F8l9n0K5J2j4L5m9l2Q0Qo6J2L0K7m6j1KM8oq9L8K2j4j3j4JO3k7k2J0M0l4
5923ej1l1M9ll8KK7J5k1J4j7K6J3k7l0K2L6j8j8rL5L5p3K8%L2l1Kj5L5pk5RJ5
5957A6j0pJ7m5M4L3m6j0J4Pk1Pn1P4kj6m0ON4k5m1RK1J9j2k5N1j2mk8J2Q%k8p
5992c8N4l4j9K0j1M4m3J8jL3j8LmRM5n8l4K5J3%J1j4KJ5J0j2LK0j9mk6J6L4m4
6026dNPJ7J4m9K1rJ6l4J7j4jj2oK0Mjj2JM1Ql2l0qM2J7k2mNlk2kOM7l4kJ3kL2
6065C0k0j1J1L7m5PJ5kj5k7K3ML8l1m6N0J1jk1PLKl5L4k3K3ml8j2L6J9n3L1k5
$$ plain form
5824 26 21 20 -27 -11 35 -4 -15 7 12 22 18 -19 18 18 49 -28 6 20 39 14 -24 15 4 -5 -46 -5 -4 33 8 -15 -4 22 -34 -18
5858 -18 -18 1 -2 -8 -23 -14 13 -29 -15 -3 -5 5 -10 -39 15 36 -5 -7 -33 -14 -12 6 -47 29 18 -21 -10 -30 2 -21 8 -41 68
5891 68 29 -21 4 16 2 37 -12 -44 36 44 -22 -10 20 47 1 -10 -8 40 34 -55 -17 5 -9 -22 -36 -35 28 1 -21 -11 29 -5
5923 -5 -16 -47 2 -1 -39 -37 -10 5 -16 -2 -19 7 20 -7 -37 -15 21 3 -15 -24 11 46 -27 1 1 33 2 4 -11 24 17 -8 1 16
5957 16 6 -1 16 -29 15 48 2 -8 6 13 -8 -1 -52 22 20 4 -36 -30 24 -1 -42 -33 -12 7 -5 -30 21 9 5 -23 -11 -3 -3 -31 -38
5992 -38 16 -18 -37 -17 -28 16 -27 -9 -10 23 5 8 4 13 58 0 -34 -9 4 4 15 1 3 18 28 16 19 39 20 16 -10 6 40 -4
6026 -4 1 8 25 39 -10 11 2 18 -16 1 -13 -14 -26 -32 -12 -8 -9 -21 -20 21 29 -3 -33 -41 1 18 -4 -8 -3 -6 -28 -30 -24 23 -11 -13 0 -2 30
6065 30 10 -1 10 47 2 9 24 22 7 -20 3 7 45 14 -32 18 29 28 7 14 17 19 -16 18 -5 18 14 -24 -36 0 19 -34 -3 -28
6099b8M0qk2l5N0M4r3K3O1l8j9J7l3N1j9l5K9J8L0j6m4QN2l9J1k2L8Npl7QL9k2
6132Gk8J7K2j6K1j9pL9l7k2K2Rl5J6j2K4J6Jo4N2j0J7Kl5J5K3j5n9O6l2J9K5n7
6165c5K3J6Jm0pO0j4k3J0nJ1j2JJ6lj7mK4K6j3m7K8PK8l4J2PmL2k6k4N0mro9L5
6201cM4m3k0L7l%j2j4J6J4J5p3K3K5jj7K5pK5k4l5J9LnMl5J1N5k7m0RN2m9J3Q
6236a0J0j2K9m2J8jj7%RK1J5J3o6M9J3j2k1pM4k1mj1L0qJ5l2QJj5J3nk5O3l0k1
6271iKK0J6n7K6j0L8l1k5J4M7l7ooJ3pJ8k4PL8k4j9orM2k4m1M5O0o1Nm9N7Orj5
6307a5kK9j4K7m7M5l1jj0K1K3l7j2L5jK5l6oL0K8k9n3K6J4%j5k5N0j8J7j2m7O2
6340B1l9j1J8K9k2Kl3N1k1L3p1J4L0Ol2J0M6l5J0k0jL3%l0PJ4Mlj6%Nj4j1LO6
$$ plain form
6099 -28 12 4 -18 -53 -3 41 -52 -29 32 -6 -25 -8 -41 10 -9 -44 -15 3 33 17 -27 -19 33 -6 5 -17 21 26 19 -18 -10 29 7
6132 7 -21 -4 18 2 23 4 -3 36 -1 -23 -1 8 -27 -11 -23 1 17 18 -46 6 -4 13 15 -20 -5 18 3 -56 10 -22 -3 22 -35
6165 -35 -12 4 5 -35 -42 18 4 -19 -9 -14 -3 -15 -14 2 -1 -18 -22 2 28 15 -32 -4 3 31 -3 9 16 12 44 18 -6 44 40 31 -38 -3
6201 -3 41 -2 -22 15 12 12 0 -14 2 16 31 -42 -19 6 5 -12 13 6 31 7 -28 -9 -6 -11 -7 -42 -31 24 -3 -43 -34 18 -31 -18 -10
6236 -10 0 -12 17 -25 -7 -8 -25 -25 -16 5 20 33 -33 16 29 17 -4 -11 33 12 8 -3 27 19 34 2 10 11 -4 9 4 -21 42 12 -9
6271 -9 -7 13 29 -28 -2 -12 26 -5 -30 -16 31 -6 -12 -18 -5 -12 6 -18 -11 27 3 -16 -22 -31 11 -13 -54 -9 51 -10 -5 -54 3 9 0 -15
6307 -15 -17 12 -2 25 -22 23 -8 -9 -19 2 25 -12 -24 11 10 35 -1 -7 23 51 22 -31 -5 9 9 -6 -31 19 1 18 6 -41 21
6340 21 -18 -29 -11 18 -4 -2 -35 16 -5 28 -43 -29 1 7 -25 -15 31 -4 6 -14 -15 18 18 -12 -5 9 13 10 -6 -6 -1 -15 -26 -23 43
6375D3k5k4k6O1Qk1k1J6JQj2m3K6N2n7nM2qPl3Oj3K8k4k3K5L8k7l0KK3Rk5kLK7
6411Fll5NJ6K9k3J5k8L5Ml2mL3K1m4kL8m4J2k1k1L4M1m1OM6k9m3NJ5L3Rk3J%k7
6447a6POJ3lj6J7n1L7LOpK1jLm7RM0l0ooJ8QMn4K2L9k4j5J2%L9l9k1M7l8PJk2
6485c7M7O%n1N5J5k6K4k7K2Pj9m8N0j2j3OL3j4j6j1oJ0KJ6m7J7L6j6k1L0qNj3
6519dk3Q%J3l5j2M1Pj5lqK9Nl9j1N4l8jL7j8%K7j2k4M1k2j0J8K8k2J6q5QO4L2
6554D6m3NNQm3K2njK2Mj8OnRnpK8l6j1K5l0M3rl0K1Oj6kk8L1K9l1k6K2K4Ql9j7
6592c8L0j3k2j1M6K2l6jK3Qrl3J9RL0o2QM1j4J6m3RL2Qk0lk5L3kj4nK7k3L4l6
6627a5K7J2Nm3K4L9k2n7L1J4K7m9j2J6J6pj4j4L7l5l0L0nN2j1l7j4K0Pjk4K7p
$$ plain form
6375 43 18 -6 -32 29 37 16 -5 11 12 20 8 -35 -9 43 -14 -19 23 15 22 -11 -5 -18 10 -14 -37 -12 26 -1 -31 -29 -6 3 -22 -24 -21 6
6411 6 3 -32 -27 -11 18 -5 10 -18 17 21 -11 -15 18 39 -5 -7 31 -13 -1 -22 -43 -9 32 -9 -3 43 14 -29 -24 -9 24 33 10 11 11 -16
6447 -16 -9 -3 10 7 -9 8 -43 -6 -3 3 -4 17 16 19 -28 -19 21 -9 -15 -21 -3 5 9 -45 -23 16 -8 -23 -11 -11 28 -11 -32 15 -23 -16 -15 -37
6485 -37 10 16 16 -35 20 35 9 33 6 28 35 16 -32 18 6 -7 -1 32 18 2 -9 -15 -5 -3 13 -34 -17 19 3 -18 12 4 9 -4
6519 -4 -27 -19 -19 -6 -41 -53 -12 -5 -20 -23 -31 -2 3 -36 -47 7 -31 -32 5 -13 -13 14 2 -22 19 -3 -13 5 33 11 27 -58 -50 14 46
6554 46 3 8 13 21 -22 0 -5 -6 16 20 2 8 3 12 7 0 28 -8 -19 6 -24 19 10 -20 1 7 -9 -11 -39 -8 21 -10 -36 -14 10 18 -21 -38
6592 -38 -8 -21 -43 -54 -8 14 -22 -23 0 8 -1 -34 -15 -6 24 -38 -30 11 -3 13 -30 -21 11 19 -1 -4 -29 4 2 -12 -17 10 -13 21 -15
6627 -15 12 24 29 -14 10 49 27 -30 1 15 42 -7 -19 -3 13 6 -8 -22 15 -20 -50 -20 -25 27 16 -21 -35 -15 -8 -9 -33 -6 -13
6660a3Ok5M5j7jmkJ7K8l5Mk4J3K7n5J2M4J5m9jK0K9j6l2J9L1l4NLK0pl4RJ7pj2
6696dLoJ8oj3j4J7K9k6qK9QLm3nLKOJj2MM7n5j7kN1l1qLM2Kl8PM1J6n8j5L7k4
6735a6L5j7k6K1N9o4nK5k0L0k2LoM4l6k5N3j4J5l9kJ2OMl8M1lKm5L4MJ6n6K2M
6770dj8J7rrj1L5k2lJ2J9%j6k6N5J4l1l4O0k6nj2J6K3j7Rj5k4OM0j3pL7l6j6L1
6805B0%qj9mL8L1n5k4K1J1Km0JN1L5p0l0K9k0J1J9m7O5l4j8J0K0pK5j3k4L2%m
6839Dm5N4ll0pj0M0Kk0k8M7Oj4k9J3N5rj7J3j9K1j8m4M4K0k1l5O7j4KJj8K0J2
6873D0j8k3J8j3J4l4qJ0L4om5K6K5pm8K0lL1nk4MRPl2J2%L2om8L9Lnj3j2K9J5
6909A8j6j5K9J0ok4K0J5k2porO3m4JkmJ8kj5kL1k5k4N6rj3k6k0L4L5m8JK6J3m8
$$ plain form
6660 -13 -7 -32 13 -4 -5 -9 -11 6 34 -1 3 -21 -8 19 -36 -24 20 35 -14 -15 5 34 18 -14 5 36 2 7 10 30 23 -11 -2 15 8 -4
6696 -4 -1 -7 11 5 -8 -22 -5 24 -2 -10 19 27 30 -13 -18 -15 -13 -7 -6 -18 -14 33 -22 -39 -41 10 -21 -29 -26 16 18 -20 -13 28 44 -14 -29 8 -16
6735 -16 19 2 -24 -3 56 -8 -13 12 -8 22 0 3 -3 41 5 -20 33 19 34 -5 -7 5 11 15 -23 18 15 17 -28 6 10 26 -30 -8 -4
6770 -4 -22 -5 -14 -23 -34 1 -21 -24 -12 7 7 -9 -35 20 34 3 -31 29 3 -2 -14 2 25 8 17 2 -22 -16 24 11 4 41 5 -11 20
6805 20 20 12 -7 -11 27 58 3 -21 0 11 13 -27 -26 25 60 -10 -40 -11 -31 -20 -1 -48 17 -17 -35 -25 -5 -12 13 0 -24 8 8 4
6839 4 -41 13 10 -20 -27 -37 3 5 -15 -43 4 10 -4 -33 -20 35 26 9 22 3 24 6 -38 6 26 5 -30 37 23 25 26 8 28 40
6873 40 22 -1 17 4 18 -16 -24 -14 20 14 -31 -5 20 13 -35 -15 -18 13 8 -16 -12 -3 4 -28 -16 -16 16 10 -38 1 4 -1 -14 -26 3 18
6909 18 2 -13 16 26 20 -4 16 31 9 2 -4 -13 50 6 7 5 1 19 17 2 0 31 6 -18 38 29 16 -10 -30 4 39 -9 -8 18 31 -17
6945a7k2L9RL6m7k2K8rj5NK0L0j5l7l0K6J1K2l7OL6pl4%K8rL7l5l8N3j6kJ6oL3
6980C7m6J5oN3m4j9NJ6J4k6jJ6K0j7m3M6j6K8n0jK1qNm7K9J0Ll0L1jjM8l7k4J6
7015dK1l9L3J0k4l3KM1j5Mmj1L1J3m7j3M0j9M9j1k9M0j0n4QJ6K2j3j1j6QM4l3
7048dnOK6Nl1L4k1J3Kj5%j5J8j8J9j1j5omJ9kl5K9K1pl9RM1j0onj4J9JPk5L3J9
7086C3p2M2j0mJ6oL3l5L1l9nk3M8j2J2j9kN1j7m9J6K0mkm0N6K7l9k0J2N1p0M2
7119B2l8OK6j2m8J9L1nj7J4Jj2Pj9j5K3kRMm6N0Oj2K2j7k6J9k7N4j6oj6LJ5qP
7155dj0J5%j7j5P0k7%%Mj7K2l1K8J7k7J4j4K0j4Pk9K0jjmpj2MJ6Pk7K0npKroM4
7194B6p9M4J9Lk6mpK3%j5j4KJ3j2K9k0K0k5OK2Ooj4k5N0k7Pj0K3L0j4m0lN2j0
$$ plain form
6945 -17 -39 0 9 45 -2 -24 4 -5 -20 -15 5 35 20 -17 -47 -21 -10 12 -25 -19 17 10 -24 -24 4 -5 32 -3 -41 12 -4 -6 10 4 37
6980 37 -9 6 0 53 9 -10 -5 11 25 -1 -2 14 34 17 -26 20 4 32 -18 -19 2 -6 -1 -48 -19 -9 -6 -36 -5 -6 -7 41 4 -20 -4
7015 -4 17 -22 11 21 -3 -36 -34 7 -8 -4 -8 -19 12 25 -22 -35 5 -14 35 24 -5 35 25 -29 -21 -5 17 4 -7 -23 -15 29 -4
7048 -4 -9 -3 23 28 -3 31 10 23 25 10 10 -5 13 -5 14 3 -12 -18 -22 -3 -5 -40 -11 10 3 -36 -27 14 4 -2 -7 -21 -2 -1 6 -19 14 33
7086 33 -39 3 -7 -11 5 -1 32 -3 28 -11 -16 -39 9 -3 9 -10 -12 39 22 -27 -11 9 5 3 -37 19 46 7 -13 -1 50 -20 22
7119 22 -16 -10 16 4 -44 -25 6 1 -16 -2 -1 -13 -6 -25 -40 -17 -19 -10 -6 -52 -2 4 -8 14 -3 -29 -10 -37 17 1 -5 -21 -18 -3 -11 -4
7155 -4 -14 1 1 -16 -31 39 12 12 12 16 -1 21 -10 18 35 8 22 8 28 14 21 -8 12 11 10 6 -1 -13 -9 7 14 -13 7 2 -5 -3 -12 -18 26
7194 26 -53 -9 10 13 -13 -17 -24 -1 -1 -16 -30 -28 -15 -27 2 -18 2 -23 -17 5 11 5 -9 -34 16 -11 -4 -14 9 39 25 -15 -18 34 24
7229B4j7l6O5j8J8n7N1j5qk3K1j2RlJKoJ0Pl9K9J7j5j8oL5l4J0j7M0j7l8K4K6
7263A0l1K0j2JM1j0o0RK9j3K1ql3O7l5J1m1M5j4Jj0N3l7j5K1k3J6M5l4l6L0Pj3
7296Bk1M5k2Rl5K6j6K6k5JRL1m0k7K9J8KJ9o1nN1j6oj4oJ3K3n0M9m8M8k8jK9j
7331Hk7j0N3%k0l2PJ4K3l2k5N2Omj2L3l9N6j3j9j7K1k8mK9j5J8rl4QJ7l0J2PK6
7366B0kj7j0ML3n8K4K7k8ponJ9Mk2Rk2QK4Ml4K6K6j8l7M2j6j9OJ5ML0k3kQk1M5
7403C1j3qJ2Ll1J3jJ3M2q6J3J8K3m3mO6Rn4j4K0%kJ4rJ9n9qK6pJ8l1L0j2K8J4
7438C0j6l0J4KJ8l7J9JRkk0MkNj6N2k5k0L6qPl1J8k3K5l0K3j3nM7k5j8MJ7j1L1
7474C0k2k1K8J7l4lL9k3j9K1j7MM6k9k6L2m3K0K8l4qJQK2kmnl6K9j4l4L8%j4K9
$$ plain form
7229 24 7 -29 36 18 36 -21 30 15 7 -16 5 -7 2 -1 0 2 -4 6 13 -26 3 20 5 -13 -19 16 -18 -8 -25 15 -2 -40 -16 10
7263 10 -21 -1 -13 -12 29 19 -41 -32 -3 -16 5 -3 -36 31 -4 7 -34 11 -3 -2 -12 41 4 -11 10 -13 3 48 14 -22 8 15 2
7296 2 -19 26 4 13 -22 4 -12 14 -11 -10 -1 30 -10 -37 -8 10 12 31 -30 -35 16 0 -6 -20 -26 -13 10 -40 9 -39 9 -19 -20 9 8
7331 8 -19 -29 24 24 4 -28 -21 -7 16 -16 -41 11 17 13 1 34 -5 51 38 19 2 23 -5 -9 20 5 23 14 -20 -12 5 -25 -13 -6 20
7366 20 18 1 -9 -5 28 -30 -6 21 -7 -14 -20 -25 -6 -2 -24 -15 -37 -29 -5 -1 -35 -9 17 -1 -38 4 -12 -31 -25 -10 -6 24 1 -1 7 -14 31
7403 31 18 10 22 25 -6 7 6 19 61 -25 -12 6 29 -14 -18 48 57 3 -11 9 9 7 21 12 31 -28 -36 -10 -17 1 -30 0 -12 16 30
7438 30 14 -16 -2 0 18 -19 0 1 10 8 -12 -8 -10 -5 -21 31 6 -14 22 14 21 -10 8 -15 10 -20 3 -10 -15 32 7 -11 -7 10 -1 30
7474 30 8 -13 15 32 -2 -5 34 11 -8 13 -4 0 46 17 -9 23 -20 0 28 -6 -14 -13 -5 17 15 11 6 -30 -1 -15 -49 -11 -11 -25 4
7509Dj9kK8kl5j6K0L2j4pJ6j0L0m0J3MJj6J2pJ8Lj4Mj7K4Nj4%PJ9j3k0J7nJ5l0
7546iJ7J4n2K9j1j0K4jo5O4Nj3MNj2J9k8rL6k5J3kj0%K1Jqj1L8m3J1qL2j0l8L0
7582bpNJ6j9JJ8KpqJ1Mj9LK3J3k9kj9M2J3j8k8K2k4Rnl1N0j3j9RM3m4%j9M5k7
7619a1Lnl3N9j9l1M2jl3M8m2K0Oqj0k3N8l9jMRJ0j3J4mJ6oJm7K9L1l1j0MK3J7
7655B7nk8j4K5Oj7J6K6m9J6nnK6j6k4J1QJj6J4k3K5l1K6J9L0m3l2J1kK0k3j3K2
7689a7kK1pn8N4J0k1j1MJ6noK1nqJ6jQj5K4oj8J8Knj2L4l5LM1m8L1j7j4K7m1L7
7726A5j7kk1L3J1l8JjK9l6j7L0rN%mJ0KoJ4lK5l5k4K8J0j2OomN3m5l2K1K1J2n
7763Ij9K0K6l9k4J9J5kK6l2K1M3p2j5M7J3m0j6mN8k2pJ1J7k6k5L1k3J9j8j7lK6
$$ plain form
7509 4 -15 -17 11 9 -26 -42 -22 10 -4 -11 5 -5 25 -15 -2 2 3 -13 -1 -8 10 13 -1 3 -14 10 15 1 1 8 27 14 -6 11 6 21 -9
7546 -9 8 22 -30 -1 -12 -22 2 1 -64 0 5 -8 -4 1 -11 8 -20 -29 7 -18 -5 -7 -17 -17 4 5 -3 -14 24 -19 -8 -16 16 6 -32 -2
7582 -2 -9 -4 12 -7 -6 12 14 7 -1 10 14 -5 -2 21 34 5 3 -16 26 39 21 -7 15 -9 0 -5 -36 14 1 -18 -9 34 -10 -10 -29 16 -11
7619 -11 -8 -13 -46 13 -6 -37 5 4 -29 19 -23 -3 3 -5 -15 -38 20 -19 -20 -16 -7 3 -10 4 0 16 10 11 -36 -7 24 -7 -17 -13 10 27
7655 27 22 -6 -20 5 11 -6 10 36 -13 3 -2 -7 19 3 -21 -10 -2 -1 -17 -3 -26 -1 -32 -6 13 43 0 -32 -21 -23 -3 -26 -39 -17
7689 -17 -19 2 -5 -63 -9 1 -20 -31 -27 -11 -16 -22 -1 -6 -14 2 1 9 -6 18 12 -6 12 14 9 -3 31 -4 -1 40 -8 23 6 -8 19 -22 15
7726 15 -2 -4 -25 8 19 -19 -18 -19 10 -26 -43 -13 -22 -17 -17 -21 -11 -9 -15 -1 -4 21 -14 -38 -10 0 -12 -6 -12 -16 37 -8 -40 -19 2 14 9
7763 9 -10 10 36 -3 -27 -8 7 5 31 -1 20 63 -9 -24 23 36 -4 -20 -24 34 12 5 16 33 7 -18 13 -10 9 -9 -26 -29 -3
7796c%j8%k2K3J2j6OQnROl5K2RnJ8Mk2k0J5QK5k9k0M3rj0j8J3M4j7ll7J2%K6o
7834HJ0kK4m0j7J9L0j7Qql4L9k5k7L0J2k1J7l8K8J4k2qPj1M3n8K4mJ5Noj2Nj5
7869b7rK4J9k3j9K3LL0l0J4k1J5Pl5L0Lmj2J9j3K9mjJ2j5j4qk2L6J9j4Nj6PMj9
7905gmjJ3K7m8KK8k6K5j6oj1K8rQQnj9L4nj5kk3K8Rl1j9J9kLl4K7j1L7jmRj7K5
7944A4k7j3K5jNJ8k7K6PqL0l7Nnj7J0J5j6J4k8K5J6l7MJ0jJ5nk3j1J5l3LL5Ml
7980Dj2K3k3Oj2J5k9M3j1k9PJ9j1j6J0K7k8jJ7lmllJ0K1j2nqK0l0M5k6j1J2MN
8016A1J0k3L6k3JMj2Kj2JRjK0l3K5j0j6Rj2K0l9K2J7J1n1N1m6L6j2j8k2N6l3L9
8050A7k6k9RL8j4l3L3JL1k9k6J8k2J1M3l5N0j4k8j0K8K4j8NKj2qj4K1Rjk5J0p
$$ plain form
7796 -3 -3 -21 -21 -43 -20 -8 -24 -18 -10 -15 -6 0 -35 -13 -4 -9 9 13 -9 -29 -14 -6 19 -10 -30 13 4 -6 -24 -11 33 16 13 -24 -12 -12 14 8
7834 8 18 16 40 0 -17 2 32 15 23 15 -19 20 -5 -32 -2 10 -11 6 -32 -4 10 -12 -20 -13 -24 19 -39 -15 -19 -4 1 -5 -17 -12 -27
7869 -27 -36 -12 7 -16 -35 -12 -9 21 -9 5 -16 -1 6 -29 1 4 0 -12 7 -6 23 19 18 30 15 1 -7 -29 7 26 12 17 1 8 12 -7
7905 -7 -11 -12 1 28 -20 -18 10 -16 9 -7 -13 -24 4 -5 3 11 6 -13 21 16 1 -1 -24 4 13 -18 -37 -18 -20 -17 -51 -24 -35 2 1 -3 6 -11 14
7944 14 -13 -26 -1 -2 3 21 -6 20 27 19 49 12 17 12 -5 5 20 4 18 -10 15 31 -6 -2 8 7 22 17 -6 -17 -2 -35 -32 3 7 4
7980 4 -8 15 -8 -2 -14 1 -28 15 4 -25 -18 1 -10 -26 -16 11 -17 -18 -1 -4 -8 -11 -14 -4 17 5 0 -8 12 -18 27 1 -10 2 6 11
8016 11 21 -2 34 11 12 16 4 6 -6 -5 4 3 23 -10 15 5 -11 -2 -14 6 -33 -11 6 17 -34 17 -29 7 -5 -23 -45 11 -22 17
8050 17 -9 -38 -29 9 -5 -38 -5 -4 27 -2 -28 -10 -32 -21 22 -13 37 23 -5 -15 13 37 19 24 26 14 6 -8 13 22 21 -4 6 -1
8084aqL0l4N2n4L2j4j8KnpM2k5k2K0LJ0j0j7K3Pk8J4Nl6L7k7N4l6K2Jj6J4k8%
8119a8L7l5J5J7l5J3%MmM4k5jjj9K5J7j8k0k6O9m4qK1mj0nJ6LJ6j0J0m3M6j6o
8154EMnjRnmj2mJkL2qk5j9J5lQoLlJJ2nJ7j0RKnQQn5L7%Oj0lM0
$$ plain form
8084 -1 -9 21 -13 39 -15 17 3 -15 -13 -18 -25 17 -8 -30 -10 -7 3 -7 -24 -1 6 -22 -8 -3 -39 -2 -29 25 -11 11 12 -4 10 -18 -18
8119 -18 19 -16 -1 16 -19 -6 -6 -2 -6 38 13 12 11 -8 17 34 16 -4 -30 39 -5 -13 8 4 -6 -11 5 8 24 14 24 -19 27 11 5
8154 5 9 4 3 12 7 3 -9 -13 -12 -14 18 10 -15 -34 -19 -22 -14 -20 -17 -20 -19 -7 -12 5 -5 4 6 1 9 17 -38 -1 -1 5 -5 -8 32
8191C2
$$ Imaginary data points
##PAGE= N=2
##DATA TABLE= (X++(I..I)), XYDATA
0@%%%%%%%%%%Qj6J6j6K3l1L2m0M8n6O5p3Q8j04J20j36J57j81K05k30K58k94L33
33A76l72M13m62N17n74O36p06P84q66R57j062J174j301J444j603J788j998K243
51A188k532K880l307L844m551N519o936R249j3825L6390p9906J6817J13187j28084
65e0067K3666J00236r9737j6611R4964p2582q810P4647n0530k0942M7991l7277
77a5052O627L6402l8690K323K4707l6094J7419K5074l4790R483J7429l2088J1271
90e979K1529j6222m01O78n336R157p362N711J2735k7592N696K5686l4074Q042
104g732L9012m3330q374M4045l2222o708M2752l2822j2357L6439k7389l194L4107
117B2227k9391p0K4625l8085J4673L7012m8573P277M0429n3326O170N5001n0802
$$ plain form
0 0 0 0 0 0 0 0 0 0 0 0 8 -8 8 -8 15 -16 16 -24 24 -32 33 -40 48 -56 64 -72 85 -96 109 -121 137 -157 176
33 176 -196 217 -245 272 -302 334 -372 412 -454 503 -559 615 -686 758 -845 943 -1055 1188
51 1188 -1344 1536 -1771 2073 -2478 3041 -3895 5354 -8471 27919 -51987 -35170 78017 -50067
65 -50067 -26401 73835 -25902 -42513 52451 -20131 -28941 45706 -4824 -25766 22225 -15052
77 -15052 -8425 27977 -10713 -8390 16317 -19777 -2358 22716 -12074 -2591 14838 -17250 -5979
90 -5979 15550 -672 -1073 -395 -5731 3426 -3936 1775 14510 -13082 -7386 18300 -15774 -7732
104 -7732 31280 -12050 -20424 23621 -8601 -15309 27443 -5379 -17736 18703 -8686 -11880 22227
117 22227 -7164 -7234 17391 -20694 -6021 30991 -17582 -10305 30124 -23202 -17032 37969 -12833
130a2833p809N5361m6640j8692O1543k5491k8820M1900j6987k4631L6023l407
142I517k0323J6372m236r544R692j373M880J066j6857R036Q316j4393J3213N451
156A0817k4183J1175J2006j9697J0895J2055k1025L692R055j1876J1142N305j7660
169h299P483M514j2019J3190K649j6101J1499J387j6150J4973O838j5980O418
182D02J919j0195J0995K087r336P405l657o016J1515n802l547J5256j3569j0239
196a2782K2212p052j2165K0926q745j7463K2518j385j8408J9186K262k1183J0936
209a143P670j1625P357L747j1512K351N485j926N49q39P52l31n957N367O213p959
225a801J285L436r457N453R100j0653J35P464r093P35Q636o055O32M043q781J687
$$ plain form
130 -12833 -20642 34719 -11921 -30613 30930 5439 -23381 18519 1532 -23099 12924 9517
142 9517 -10806 5566 1330 -8214 1478 105 4985 6051 -10806 -1770 6546 -7847 5366 10817
156 10817 -13366 -2191 9815 -9882 1013 13068 -7957 -4265 4790 -7086 4056 9361 -8299
169 -8299 -816 3698 -8321 4869 7518 -8583 2916 4303 -11847 3126 9964 -6016 402
182 402 2321 -7874 3121 5208 -4128 3277 -380 -6396 5119 -683 -4230 11026 -2543 -12782
196 -12782 9430 2378 -9787 11139 2394 -15069 7449 6064 -12344 6842 9104 -12079 -1143
209 -1143 6527 -5098 2259 6006 -5506 -3155 2330 404 953 114 866 535 -5422 -55 6158 -1801
225 -1801 -516 2920 -6537 -1084 8016 -2637 -2502 4962 -4131 -3396 5240 -815 -183 3860 -4921 -3234
241c234P731m288K63J269n817L642L006m820M110J086o555K999R42k610O757k133
257B348p885O161Q40m858P103j292p339O929n19p404Q769K531r377L284K170n251
273c790N553K607p176J368L377l598N14L167n21j690j597O69J473P7J875j536
289G72m638L747K894n129K516L790o259K4M411l943J817M830o834k081O442j858
305E01j795L721k285k246K690j039n40L103n91k805n23J117K148o7j880K93k80
322d78o57J875j28j096K147j614l393L440K463k592J30j29k143K394J684k672
338g69O98J437k446l98J879M45K74q87k013P97J869N5n45q11j58R62p95n54K317
357A357L2k485J84O66m9J824m21k876J086J930j717j62J890q88j147N94m28K84
$$ plain form
241 -3234 4497 209 472 1741 -4076 -434 2572 -2248 1862 2948 -3607 -608 334 -2276 4481 2348
257 2348 -5537 624 1464 -3394 3709 2417 -4922 2007 1488 -5916 2853 5384 -3993 -709 1461 -3790
273 -3790 1763 4370 -2806 -1438 1939 -1659 -1145 2022 1501 -189 -1786 -1117 356 433 2308 772
289 772 -3866 -119 2775 -2354 162 3952 -2307 -2283 2128 -1815 2 4832 -2002 -4083 2359 501
305 501 -1294 2427 142 -2104 586 -453 -993 2110 1519 -1286 -1809 -692 1456 1389 -491 -198 -478
322 -478 -1135 740 612 -484 1663 49 -3344 96 2559 -33 97 -32 -2175 219 1903 -769
338 -769 -71 1366 -1080 -1478 401 846 1120 233 -1780 -983 886 941 396 -415 -573 389 -406 -960 1357
357 1357 1389 -1096 -912 -246 -295 1529 1108 -1768 -682 1248 -469 -631 1259 371 -776 -182 -610 -326
375c26K157r21k812J003K090j059o62J229m89j014R25k16o75K139O3l504P82L028
393A738j534q38J664j675n61K727j634j624L571m66l943K117K089k148Q40O71
409I94k822J391K578k863o42L088j263k173J851M58q99J206m84k265J647K150
425A952k315r43K302n39j521J333o1p54J700p39k434K147J665k394p6J339j131
442d69M01P83j612P29J616j854q32J536J41p3k34j108Q76J109j231l02Q52j57
460A71k2l67o14J327P12j745l76J161J36j68k21m25N23M32o10n55N60J041p01
479B59j483J096J172j209K4L69j059J229Q16k595P60K601k320j089K275p94m92
496d40J705j791j022K972n80k458J716Q54j471L73K92o82J044L02j690n1J745
$$ plain form
375 -326 1831 910 -1902 -899 1191 132 -530 699 210 -804 121 -95 -770 1369 1432 -2072 -1290 1738
393 1738 204 -634 1030 -645 -1206 1521 -113 -1737 1834 1368 -2575 -458 1631 -517 323 994
409 994 -1828 -437 2141 -722 -1364 1724 461 -1712 139 597 -302 904 420 -1845 -198 1952
425 1952 -363 -1306 996 457 -1064 269 208 -546 1154 415 -2019 128 1793 -601 -677 662 -469
442 -469 -68 715 -897 -168 1448 -406 -1238 298 439 366 132 -976 -100 1009 -222 -524 328 171
460 171 149 -218 -832 495 1207 -538 -914 247 383 215 -6 -431 92 524 -86 -641 -81 960 259
479 259 -1224 -128 1044 -165 -141 228 -831 398 1214 -1381 -621 1980 -340 -1429 846 52 -440
496 -440 1265 -526 -1548 1424 844 -1614 102 956 -515 -142 150 -532 512 814 -876 -927 818
513H18N7j566J52J147n43l79O62p21P9J497j485j310K564K91k445R71Q29j346
531g28J218M22k402J352J930k564n37K551q31j191J171n23m92J735o78j972J537
548bJ362j763l81J361m83l19O87r28k39J855o73j877J336J163j335j50N77n25
566c34O13L71j507M17J499r54q66P54K72L8j24p80M24Q40n02n83J10M52M88p88
586a60o02J068L71q78p9J14K38N87p95o89J199K66q66p1P8N33L55j238N1J151
606F33o33l3L23j150J245R73k737P45K410k285k20J801k152Q67K301l490N2L598
624B248k693r45K931k091k63K637k801m63L539k064j485K275j079l6J596k221
640i15J80K060j706j02J001j061J187p2k360K346Q55k765J742J57k279L178k80
$$ plain form
513 818 875 -691 -539 608 65 -314 348 -373 -294 1203 -282 -1592 972 1263 -1182 -211 618 -728
531 -728 490 912 -1490 -138 1792 -772 -1309 1242 411 -780 391 -132 -624 1111 433 -1539 -2
548 -2 1360 -403 -784 577 94 -225 462 -466 -705 1150 477 -1400 -64 1099 -236 -386 191 -334
566 -334 279 650 -857 -440 1059 105 -761 -7 265 303 179 -601 -177 663 161 -422 -312 140 628 -160
586 -160 -762 306 677 -201 -280 -166 72 659 -136 -825 374 640 -226 -297 -219 314 669 -569 -518 633
606 633 0 -33 290 -860 385 1358 -1379 -634 1776 -509 -729 1072 -1080 -213 2088 -1402 -1350 2248
624 2248 -445 -1390 1541 -550 -813 1824 -977 -1440 2099 35 -1450 825 -254 -290 1306 -915
640 -915 -735 1325 -381 -483 518 -543 644 572 -1788 558 1413 -1352 390 547 -1732 1446 1166
657A166l831L661Q06m138K919P15l411L506j29m325M191R61m591L060P37l453
673b156L578k31m166M298N07m462L390N12l404L591m67l827M260K14m098L149
689F88L44k756L142r30k847L827m51k976K810m38j570K535j749j176L452j865
705D0j540K726j765k3K620l467J25L852l520m37L682l508K08L732m611K92N112
722C518m573j197M901l460o71M385m177q14N110l560j645M416k462j209L324k844
738i58m29L872k968j245L253j815m24K242k607K23K772k617l96K423j697J28J115
755H72k098J290J413k689R26J353k063J532L47k825K550J159l651J856J511k912
771a429J884P32l180K548J265l793J786J739k701J476N32k726K559Q80l364J938
$$ plain form
657 1166 -2665 996 1802 -2336 583 1298 -2113 1393 1264 -3061 1130 2091 -2500 560 1297 -2156
673 -2156 1422 1191 -2975 1323 1830 -2632 758 1270 -2134 1457 990 -2837 1423 1637 -2461 688
689 688 1032 -1724 1418 488 -2359 1468 1017 -1959 851 413 -1157 1378 -371 -1547 1905 40
705 40 -1500 1226 -539 -562 2058 -1409 -1284 2568 -952 -1389 2293 -1215 -1007 2725 -1886 -1594 3518
722 3518 -1055 -2252 2649 -811 -1482 2903 -1274 -2088 3022 -538 -2183 2233 -229 -1438 1886 -958
738 -958 -1387 2485 -483 -1728 1525 -290 -714 1528 -1079 -856 1916 -701 -1097 1326 -371 -243 872
755 872 -1226 64 1477 -1212 -286 1067 -996 536 883 -1942 608 1767 -1884 -28 1483 -1429
771 -1429 455 1187 -1993 555 1820 -1973 -187 1552 -1149 327 859 -1867 692 1572 -1792 146
787A46J177k718J824N53k674K404P48l360J740J665k223O78N67j649J492N51j850
804i29R09N72r26N37m01j98J488j093j080J674l72n40J148j316l29K070j237j039
822a062J794m40p63Q74q63J46J460j400n86J446n81j97O93j125L94J214j446k71
840g13J443o34k61L85p67N72P37j103p2P54k42M3l03l57J068j02j111N29M02l53
860h5L78m05m28R93j30q61M77K80l3m5p09L64Q97o94l23M50l87M50K72j119N67
881i1R59j224j87Q62k88J93j1r53P12P17r45J25K66m16O74k56r80J299K93j464
901g15N52N00o77Q23j76j279J204N90j414L98O70o38L03j09o13R40J65r47K14
920b09K42L8L20o36j80R32l37n70M63r5J47L39j051J43J281q58m19P84n03O5P85
$$ plain form
787 146 1323 -1395 429 982 -1692 712 1460 -1900 -160 1505 -718 -40 527 -1122 370 921 -929
804 -929 -20 552 -374 163 -238 -436 1052 -41 -1121 553 181 -359 789 -527 -856 1214 -23 -1062
822 -1062 732 292 -471 403 -460 -314 1146 -254 -840 606 25 -172 521 -604 -210 1004 -442 -713
840 -713 730 96 -165 220 -547 25 762 -341 -413 341 99 142 -161 -518 550 448 -663 -134 268 -85
860 -85 293 -112 -540 453 323 -538 -61 219 186 141 -568 -204 693 -1 -324 126 -261 189 461 -658 -91
881 -91 868 -356 -543 319 31 224 213 -740 -28 689 -256 -131 135 -281 393 137 -843 456 749 -715
901 -715 -163 337 -340 483 307 -972 232 822 -592 -194 476 -162 141 32 -581 359 524 -423 -209
920 -209 33 71 391 -245 -425 507 170 -400 63 -32 115 454 -597 -454 827 -31 -450 334 -169 -104 681
941F81j243L1J572j087p54J216l44l58Q63q86l51J460n80r95R42J86n07K56l27
960b25J1P77m62n51M57J11P2q7n49M87N29p79j22N64j78O6K8p01N38O99r12k53
982d80O75r2r6jl76M92M22q51p3N90p0j2j65l98O65K32q36J56M45j82L6j42l92
1005d53P63K45j031J92O95l40j14O8l73N17L20r08M0Q23k59l99J49j2J85K33n04
1026a63k04N44J40m74j42L73K92l77k73K62J11J14j00m87K47O92n35n69O83K05
1046C39n31J76k3k20O29p4r54N40O71n97k48L42l5M2P4m09O1O58k18o46K44N04
1068C25j26l69O5J27O5N0k26j83N46J09p32OO62j03k74Jj58K52L98n44l02O57
1090B46P9n52nM00L7j05k00k16L33L67l57l88L60L17l20k41K89J54j42r8k03O4
$$ plain form
941 681 -562 -531 1041 -46 -800 416 72 -286 577 -309 -660 800 220 -775 167 353 -154 102 -225
960 -225 -214 563 101 -450 7 118 190 103 -446 41 570 -209 -331 233 55 121 149 -552 -14 685 -227 -480
982 -480 195 103 7 6 -370 122 544 -307 -380 210 140 128 -37 -435 230 462 -374 -218 227 45 81 -61 -453
1005 -453 310 555 -476 -284 411 71 -43 25 -348 169 489 -419 -379 444 185 -214 -65 -77 108 341 -163
1026 -163 -367 177 317 -157 -299 74 366 -11 -284 -22 89 203 103 -384 -137 555 20 -549 134 339
1046 339 -192 -16 -39 -259 370 296 -658 -118 553 -44 -292 50 15 57 131 -278 -217 441 223 -423 -179 325
1068 325 199 -170 -105 22 87 137 -89 -272 274 383 -349 -343 319 216 -58 -57 -215 37 435 -109 -411 246
1090 246 325 -227 -232 168 205 100 -100 -316 17 384 27 -361 -1 316 -4 -245 44 198 56 -42 -245 -181
1112a81N95j40p52L04N26l26k04K06K6qP3l94O3N89q8o82J22N20j17j79J4o6J28
1135B9K47m17j84O66Q4p82L4N23p7n8Ml47K08M92n47l11P51L2o29J28K14l2K14
1158B42j24n93L67O20n28l62N16P6l69J6J12K2K76j41n40K08O52l00n00L49J81
1179A80k81O2M4j44L73L2p09J77P33l19l57J56M0O5J16k99m2M69j18m38M7M36
1201B23N1l61j00J82J06L7o6l26L07L41n93j50O35p4l15J33k48J33N38m71l97
1222d15N68Q0l86N0N1J85M0m02M0L33l9L4k25l04O71N8q01M50M12o31K44J25n88
1245d50P07K75j108L17P59o19K2L11m60L66K15p32K96N04m31m3o7k9N25k43m71
1266c56M80jk54L91m80J3R01q05n68J156l48m37P55o82k87J294p72p92J375l62
$$ plain form
1112 -181 414 274 -478 -174 352 26 -178 28 54 46 119 -275 -212 377 289 -393 -271 249 132 -47 -33 -99 29
1135 29 276 -141 -325 341 425 -357 -323 200 123 65 69 -278 -70 422 -125 -436 315 347 -282 -154 60 28 242
1158 242 118 -475 -108 512 -16 -378 138 214 -155 -139 -27 -5 271 130 -410 -202 450 150 -350 -1 180
1179 180 -101 -39 5 -139 234 266 -443 -266 467 148 -209 -53 -13 52 168 -131 -173 296 178 -260 -213 223
1201 223 274 -87 -187 -5 101 138 72 -254 53 394 -199 -349 286 212 -103 30 -218 -85 453 -18 -415
1222 -415 153 233 -153 -103 -52 133 173 -229 -189 144 105 139 -86 -390 281 339 -462 -12 400 -231 13 138 -450
1245 -450 257 532 -576 -259 500 -119 -97 214 -246 120 335 -397 -101 403 -28 -71 -138 -167 358 115 -356
1266 -356 124 123 -131 260 -220 -207 694 -111 -679 477 129 -308 447 -235 -522 772 0 -792 583 221
1286B21q06R13l31m60J144o16q18J099m3o48N71l22j16O90o54k60R13l78l28M12
1306A83m67K45O46r37n0Q90n71j82N87o49K65O13j034R7R46o16j21M12o11M28
1326G4N13j050K59Q31q63L1M67n80M89L62j128M12P47q24J88M13p99N78L73j152
1346f59N73Q29j111J59O01q64N36O16j322L46J030j071j7Q33o44R0M83q84K76
1365b00Q10p25j47M28l61L16J49o97N19L22p88L09K63m18N63j79q69R39K88r86
1385d64N75J30o72P62j29q86J052J50j174P39J79o95R01k03j052J123J59j175
1403f80Q40K52q56P41j86p82J107M1j107P07J35o27P70k83o78J016j75q61Q39
1422B13J7n03O02l83m70R77j81p34N98l6k94L87l08p7O05m10l05M35j69J15K19
$$ plain form
1286 221 -585 328 -3 -463 681 65 -753 346 303 -345 226 -96 -212 478 -176 -436 477 99 -229 183
1306 183 -284 -39 607 -330 -380 510 -61 -243 344 -305 -40 573 -461 -364 582 -34 -155 257 -354 74
1326 74 587 -463 -204 627 -236 -205 262 -318 171 533 -595 -183 564 -260 -72 341 -458 120 493 -659
1346 -659 -86 743 -368 -209 392 -472 64 680 -642 -296 734 -337 -354 479 -165 -75 408 -476 -200
1365 -200 610 -115 -262 166 -195 121 270 -427 92 414 -374 -65 198 -220 343 164 -705 234 522 -464
1385 -464 111 241 -431 331 202 -684 368 518 -656 83 262 -433 468 265 -787 336 495 -680
1403 -680 160 412 -444 297 111 -671 436 477 -630 77 212 -415 355 72 -606 410 235 -626 213
1422 213 230 -273 329 -54 -524 453 272 -462 136 100 -194 193 -115 -192 413 3 -302 133 -36 79 298
1443B98o56K24O06o85l8N84n03J46L65q01L42P69r12p7O54m58R0M13p05J92P11
1464E59p62j85P33k81j89K87l64K8N54l30l79M37N6k82N4M9P4L8j58j65J76K32
1486A82o1l01M1K96q5j85Q7O5M7n0k12Q1K92k4k99j3J85P7p7j19M8J42o6j69J3
1511a05K39P5k88q5J61P8K3j73q7K37R5k87J0K08m3k4j47q6L44P0l72LK22l0J1
1536D9j43o9L08j1m13K04K39j89O2j03j57L57N3m29K02K31k62J6M8j05K28Q4m28
1559b28L4L98r9j73M1l6J59l6k04J31K02j14j47k4P5K37j23l07K13J58j67rj4
1582c3j0K05j25l02K71K09k36o2L0j7K43j17l20L03J90l72N7J25n9J33m8l86K95
1605b6K88l54LR2m7J32q4j90K79P7k62k4J05P7J21k44k26M16k4k56J59N4r6J96
$$ plain form
1443 298 -358 -134 472 -213 -251 333 -170 -24 341 -460 -118 651 -261 -338 316 -142 -52 361 -344 -152 559
1464 559 -203 -388 345 64 -125 162 -202 -174 380 50 -329 108 164 -118 -64 -15 59 97 -61 -226 -50 182
1486 182 121 -180 -139 157 72 -113 -26 39 86 36 -176 -95 197 173 -126 -139 46 123 46 -73 -25 117 51 -118 -105
1511 -105 134 209 -79 -164 -3 75 98 -75 -162 75 170 -117 -107 101 58 34 -113 -199 145 215 -157 -154 68 38 49
1536 49 -94 -163 145 134 -279 -75 164 -25 37 -66 -223 134 187 -242 -40 191 -71 -55 -7 -112 116 200 -228
1559 -228 -194 204 105 -68 -27 -63 96 60 -144 -13 189 75 -72 -96 -21 216 93 -214 -1 157 -10 -19 -33
1582 -33 -43 162 37 -265 6 215 -21 -83 -53 -70 173 56 -264 39 229 -143 -86 39 -20 113 65 -321 -26
1605 -26 262 -92 -89 3 -44 88 4 -186 93 170 -92 -116 -11 66 187 -57 -283 133 109 -147 12 66 -30 166
1629A66j99k31M67ll76J10R3o7J80j59j93L34nk91J19J07O1n7k09K7L05q7k29
1652a37J01L4J4O0j99L2L24k24k12K11N0L1M4l29L5L59j58j97K21J3r0N9k00P7
1676h1L26k12k41J59J20k8n1m4J4J24p5q2P0J34K1k47j06K70J11j92n3K9L3Q1
1700H0p5j07K07K6k64k8K72k4m2o0j25J60J19j41j14J85Pj13n4N3J56m2j52p4
1724a50J31J53j11j08J8J33l1j22Q0P4Qr7j47J27J84n3j95l9J80J3m2l4L5R1p5
1749B3j61Q9J94Mk06l2L3J45Lj17n1J24J7j76M8J90l5j31o5M5J40O4j54p0Q2P8
1775H1j51rR3P1j16r7N9R8J10j13j64Q5J29m6o3O6J7p8j9l1J14J47j49k54J70
1800e0J61m4m3o3J8N9m5q5J50P6j12j26k5J98J11j26j84R4N5K1k4j6L8N6k20k9
$$ plain form
1629 166 -33 -264 203 200 -176 -66 27 -40 140 -19 -212 122 117 -174 -55 52 113 56 -153 -126 179 92 -137
1652 -137 -36 -2 12 72 -127 -95 229 5 -207 4 54 85 129 -200 -165 194 36 -161 60 73 -17 42 -158 -81
1676 -81 245 33 -208 -49 71 43 -8 -52 -38 86 11 -71 -1 133 154 -93 -199 71 182 -10 -63 -34 -1 80
1700 80 5 -102 105 131 -133 -161 111 87 45 -15 -140 20 139 -2 -116 69 76 -37 -91 -38 118 76 -76 -150
1724 -150 -19 134 23 -85 -67 66 35 -87 -7 67 75 -22 -169 -42 142 89 -106 -145 35 48 6 -28 7 98 23
1749 23 -138 -49 145 149 -57 -89 -56 89 92 -25 -76 48 65 -111 -63 127 92 -39 -104 -59 81 145 -9 -79 3 81
1775 81 -70 -79 14 85 -31 -128 -69 29 139 26 -138 -53 76 30 -33 33 50 -28 -47 -78 36 183 34 -220 -50
1800 -50 111 67 24 -39 -21 38 -7 -92 58 134 22 -104 -129 69 180 54 -130 -36 19 40 16 0 38 94 -126 -155
1826a55K73K3j19o1j18J23J70j43q9J36j5j51P2O3Q0L8k43j09K79J05j22q9oK7
1850c1Q1o7m7J68l9j38n8Q0J91Jk50K4J41o1M1K3q4N2M5k35J01L13j82j94J09
1875a6o7J28J47k71J1J67j26r6J52N2jm0k24J17K24j05n1k4q4J41rj58J95R7k96
1900a37J6J54o1J76j02k93J74K39k01L7Q9j47O5j2k04L27J09l61%J45p1J69kk63
1924a54J64O5k25J68R0o7L7j60r8L07J9j98Q8o5o7K33j39j37L19j36k71K50P2
1947I5j33K18k06k29L49M8k34J56k4j67J64r9n0L13j50k78J71P8QJ42k30j12K86
1970A16j10j44K80p3j53J44j98M5L32j30k80J81j6k6J89j78n6K03k13j26L39%
1992A26q9Lk19O0K96j09j33R5q7L4R4j37J39J39l47l5K44p9P5M8l41J33K77l36
$$ plain form
1826 -155 118 141 22 -39 -157 -34 136 -7 -96 40 25 -126 -54 9 89 127 -116 -225 54 159 37 -52 -58 -31
1850 -31 50 -17 -64 104 65 -73 -131 -51 140 141 -109 -85 56 -5 36 59 -25 27 72 -163 -62 251 69 -125 -16
1875 -16 -83 45 192 -79 -68 99 -27 -123 29 81 80 40 -184 -67 157 52 1 -23 -107 34 25 -133 62 159 -137
1900 -137 -121 33 -28 148 46 -247 -73 166 -35 2 91 -56 9 -3 -207 120 229 -132 -132 13 -58 111 109 -154
1924 -154 10 75 -150 18 108 41 78 -82 -180 127 146 -52 36 -29 -96 137 -2 -139 180 44 -227 23 95
1947 95 -38 180 -26 -255 94 142 -92 64 40 -127 37 -62 -112 201 51 -227 -56 22 30 172 -58 -170 116
1970 116 6 -138 142 69 -84 60 -138 -93 239 109 -171 10 -6 -32 157 -21 -77 126 -87 -213 126 126
1992 126 37 40 -179 -119 177 68 -65 30 -57 -23 71 -66 73 212 -135 -170 74 -5 70 118 -223 -90 187 -149
2016a49O2K85k59m4J48k11K22K37m09r5L00j30O6J31k51P9J62l16J16K29j18q7
2038c2l8j13K80P7k25K8M0j19J47k3n3K00j65k19K43P2p5J09k02j51L62q5j83
2061a25K35n7k14J68q5K0L24k33k56K34J8l6J83k10q6K38j78l4K06k6j00Oj41
2084a49P0K82j93j19J21o0L7Q0j07Q2L2k35N1J82k7L5r1j47K07L7j12O2K4j25
2108f3J00o0l8K66j04k83J62N0p1K04j50j92K61q3j79L21Ok15J07n8j59L57l3
2131A46k89J36J3m9R4l6m9R7j34p3J39O2rk7k03J27J88j30m0R7j29JJ16j23J08
2156C3J54l46MK41j07Q9O2k79P4J88j66QK16k07rO7j34J93J19k62j9J12o7N3P7
2181I4j69J13O2k41P8K02j47K1mj65J95J61l04Q0J15j95Q8J05j56J48K8k76J02
$$ plain form
2016 -149 -87 198 -61 -105 43 -168 54 291 -118 -213 87 -43 23 154 -97 -18 144 -172 -56 173 55 -32
2038 -32 -70 -183 97 174 -51 -23 17 -102 45 22 -31 169 4 -215 28 100 25 134 -68 -219 143 58 -125
2061 -125 110 53 -161 7 -78 -58 266 33 -223 11 29 -7 176 -34 -120 118 -60 -94 112 86 -14 -8 -149
2084 -149 -79 203 10 -109 12 -48 -11 69 -38 44 76 -159 -108 74 47 82 -9 -156 51 88 -24 38 62 -63
2108 -63 37 -23 -61 205 101 -182 -20 30 -41 163 13 -179 82 -1 -180 141 147 -68 39 -19 -178 179 146
2131 146 -143 -7 6 -43 51 15 -34 63 -71 -144 -5 57 48 21 -182 -55 133 3 -37 60 -69 -68 48 -75 33
2156 33 187 -159 -155 86 -21 68 130 -149 -75 113 -53 -45 171 -36 -45 22 -112 81 200 -62 -81 31 -36 17 94
2181 94 -75 38 100 -141 -63 139 -8 13 9 -156 39 200 -104 -24 91 -104 -16 89 -67 81 109 -167 -65
2204f5J93j33M0mj68J76J0j34J22M7j46M2l5J3J73o3k48J75N6j13J72j06j05K14
2228A13j17j78L38l3k07J25p7j16L29p7k63K35k9j61J85j6j32K04j12j91K56L3
2250A09j24M9j08qJ97j23q9K30j17j11J04n8M7J42j97j15K51p6rJ08j57n4K05
2273I6j59l0K28r4j38J09l5J9J11j36m2O5Qk8O0k7J6j3j13Q7J23o0o0J9q2J09
2299C3P7j91O7J14j50QJ03o6O1J5k13N4K06j21n8P7q3K5R9j47P2J27j26p5Q2J0
2325@M9j7j28O6M5m3%L6l6O7n6p9J07P8j26JJ6k3Q1k0q6Q0M8r8KP6jl4po0L5R5
2357F8o2p0M5N1k4m1M0M1%o3j0JO2K5j06j1Q9j3j9nJ1k6J0qm0J29Nj44LQ3J4k5
2389A0lm4M9L7p5pP8k0l1l8L6N5j1n0mJ9M4l5n7N5M5m9o5O0N2l2j4o3K5P7Rj03
$$ plain form
2204 -65 128 -5 35 31 -137 39 49 -85 37 84 -62 -20 -55 -42 131 68 -180 -5 51 -62 110 4 -101 113
2228 113 -4 -182 156 123 -84 41 -36 -152 177 100 -163 72 43 -118 67 51 -81 123 11 -180 76 109
2250 109 -15 34 -74 -82 115 -8 -97 133 16 -95 9 -49 -2 140 -57 -172 79 3 -6 102 -55 -109 96
2273 96 -63 -93 135 41 -97 12 -23 -4 107 -29 -71 -6 2 -26 34 7 23 10 -103 -16 107 47 -13 6 -76 33
2299 33 110 -81 -14 100 -50 -42 61 -5 56 71 -142 -88 118 -3 -61 16 -67 -42 57 -90 -18 109 -17 -92 -10 0
2325 0 49 32 -96 -30 15 -28 -28 8 -28 39 -17 -96 11 89 -37 -36 -20 -43 38 18 -68 12 60 -38 -36 40 39 5 -2 -62 -27 68
2357 68 6 -64 -19 32 8 -33 7 48 48 -15 -25 -24 38 63 -43 -54 35 22 3 -2 9 -17 -7 -15 -55 74 79 -65 -62 21 35 10
2389 10 7 -37 12 49 -26 -33 45 25 -6 -44 -8 47 36 -14 -18 1 45 10 -47 8 53 4 -61 -1 51 19 5 -58 -33 44 53 -50
2421e0K8N2k2n8P3j5O5n0p6RP8Qq4L2J1J3k3k7nO3nn1k7R2Ln0JL6j3J2l4mKK7
2455A1m1l0M8P1o8n2M6LRl1J2QO1p1j3N8K4n6Pqj4P5Kr1N0J2jm5QJ8J5k4n0O3
2489FL1k0n5K5M8K5o4n0P6K0l5mn9N8R8j39j8J22o5k5J0j7RN6n5m5Q0J1m7k2o
2520e1P3J8p1j2O5l6J2j8l5J00k8n9QQ3l2j0j2k7P0J1r0K5Q1m9m7J4NP9J4j30
2550d9J4J06m5pl4JL2kn4O3j0qm2L1jN9l6r2P2N2p7l4M4J1M4m1n5N2M8o7j8L9
2582dlN9m7p2O4L7l2k6L4j1M4m1n2J15k0o6J2M0l0P5n9m6R3Nj18P2j1j8O1m4q4
2613g3R9J2q0K5L0m0L5k0l8P4L2j20J8M4L7Rr0j1J18m2m9N6n3J9L7r0PJ27n1r7
2643g5Q3j7QJ8n6%R6n5j7L5j3K2j3l8K1P8q6nJ5j3M8Ro6N6K9q5mM4l8O1k9q8J04
$$ plain form
2421 -50 -22 30 8 -50 23 8 73 23 -53 -44 34 42 -42 -10 1 14 -9 -36 -41 22 17 -34 -61 31 34 -16 -15 21 8 20 -14 -18 -16 11
2455 11 -30 -60 -12 59 -9 -61 -15 -12 -3 -34 -22 -14 47 -24 -37 21 45 -11 -4 -12 -26 49 51 -40 10 22 21 -24 -16 2 17 -7 -57 6
2489 6 37 17 -38 -13 35 60 -4 -54 22 42 7 3 -56 2 100 -39 -57 65 0 -25 -15 -32 -23 33 -22 -67 13 24 -23 -45 -51
2520 -51 22 40 -31 -43 22 -14 -2 -20 -55 45 17 -42 -34 49 17 7 -5 -32 38 49 -41 -16 65 16 -31 -17 -12 67 81 -49
2550 -49 -35 71 26 19 -15 -14 18 16 -38 25 15 7 -35 -4 -5 54 18 -74 -2 50 -27 -61 -17 -6 38 -3 -58 -6 42 -25 -43 -4
2582 -4 -7 52 5 -67 -3 34 2 -24 10 -1 43 2 -50 65 45 -21 -9 31 1 76 17 -29 64 69 -49 23 12 -6 55 11 -73
2613 -73 26 38 -42 -17 13 -27 8 -12 -50 24 56 -64 -46 -2 35 44 -46 -57 61 19 -30 26 -27 -8 29 -61 -54 73 22 -75
2643 -75 8 -9 -1 17 -39 -39 57 2 -15 20 7 29 16 -22 -1 77 -9 -14 1 -12 36 45 -21 35 64 -21 -25 19 -19 42 13 -75 29
2676B9Jq4K1Q%M5j5p4O1O1o4pK1j1L6j2n1P2j7n2K7J0JJ8n0j7Q7j9l4j0L4k7M3
2709C1k7o6Q8j0m9J2K6M0n3%L5J1pl3k6N1Rl9j1M4L5p2k8M1jJok1PN4l6k6M1o
2743IK9o1l0J7O7j8m5lL7rj8K0%Jk5ojP4Mq2RO3l6L6J0o0M4K9q8j1R9o9j2K5j0
2778a1M3oo6L2N3n2k2L5NJ9Mq5N9M6m5K5m2RL0kl4K9K9l1m0J3K5K%p2M8K7k8j3
2812a6RJ5j1k2rM0Mk7J1j8j7J01o8p4J09Lp2N8j7K0M1o2n1J03j5l9L4j2k8Q1p3
2843bl2N8J9j25M9M8%J6k0n6P5K1r6O7lo9P4o1RJ04p8l5M4%k0O1m0m6P3k4m3L9
2875Gj1rM5p1j6J06m7m6L0L8j1kl4PP4n7k6P2m6%K0q4P6L6n2qO6o5L3Po4L9P1
2908G8r1J0M2m6J0N0q1L4O6o1j3L8l1Lk5j1O1K0p3rN6l9Qj7j4L7Ro6J4P2l5J6
$$ plain form
2676 29 30 -54 -33 -25 -25 20 5 -69 -8 53 -11 -18 3 -8 28 16 -35 37 20 -32 -5 5 6 24 -26 -43 44 25 -9 -19 15 -12 31
2709 31 4 -62 26 16 -33 -21 5 45 -8 -8 27 38 31 -2 -28 23 32 -7 -18 26 61 -11 -39 2 1 2 -4 -25 -18 36 0 -26 15 9
2743 9 38 -23 -53 -36 31 13 -32 -35 2 -7 -25 -5 -5 -4 -29 -35 -36 38 42 -40 -31 32 -4 32 42 -18 26 55 -33 -44 55 -14 -26 -1 -11
2778 -11 32 26 -40 -8 45 -7 -29 6 11 30 34 -51 8 54 9 34 -8 1 31 29 -5 24 53 22 -18 -5 20 22 22 -50 -2 25 -3 -16
2812 -16 -7 8 -3 -25 -34 6 10 -17 -6 -24 -41 60 -8 -82 27 30 -42 16 -1 19 60 -2 -53 50 35 -4 30 18 -10 71 -2
2843 -2 -34 24 43 -82 -33 15 15 31 11 -45 30 51 -45 22 19 -50 24 -37 -28 76 -2 -37 7 7 -13 48 8 -38 35 11 -32 7
2875 7 -4 -13 32 -39 -55 51 4 -42 -12 26 15 13 -21 -14 60 3 -23 49 3 3 23 -61 15 51 -1 -9 57 -8 25 32 -32 7 78
2908 78 -13 -3 39 -7 3 53 -28 6 72 11 -2 36 5 8 -17 -28 33 53 -20 -29 27 -12 -4 -21 -35 2 11 -55 -41 31 -4 12
2940A2k1j1L4K7n1QL1n7j3K0M5J4k7o0L2OJ8j5J3n3Q7l9l9M5nL2j2k5kN1k7n0
2972c2N8J2k9J2%qJ4m0PJ1K1nl5J5j2K0Mk8QJ5j6pj5M2j3k9J1K6J9m7J7Pj2J6
3006Gk5J3L1k7Kl7RQ5k4o2nM5rJ0Jl7L3K5l2QN3m4Kl8K8OK9p5k1P0l4K9l9L8K
3041A7n0j3K4K1J3o0J9N0pj1m8M4j7K6l7jO1ql0j3oN4j6J3o3J9M3p0L2J1K7nl4
3074a5j5O2qj5l2J5K8k5kJK1J6m3k3N3K9m4j0l4P3ql1J0j8J9k4K9j4K8Op4RM7
3107A1K3jq5N8NJ4m9qK1Kk5J3qM6ml3L2Lk5rK0k4L2k9j7K9K3mk1rK0K7J8o2J0
3142fQOroRJ5k3l0L8J0QJ9o3J3K9n6M3NRj9KlqM5k7k5L8pj6Rm8N7Pm6l1P7o7O1
3180A8j2m7N8m3PJ3J0k4j0L1J5Oj3k3jlJO3k6l1L2j8m3N6K5m1J2%l1P8p2PONj5
$$ plain form
2940 12 -9 -20 14 41 -10 -2 29 -28 -41 -21 24 38 11 -49 -17 -11 7 -8 5 -48 39 0 -39 6 1 33 21 -4 -6 45 18 -32
2972 -32 26 38 9 21 21 13 27 -13 -6 5 26 21 -14 1 -11 9 13 -15 -7 8 -8 -15 -30 12 -1 -30 -19 7 26 -21 -4 3 -9 7
3006 7 -18 -5 26 -1 1 -36 -27 58 34 -28 -33 12 3 13 14 -23 10 35 3 11 64 20 22 -16 12 18 47 -28 -49 21 -13 16 -23 15 17
3041 17 -33 -46 -22 -1 12 -48 -29 21 14 3 -45 -1 -18 8 -29 -30 31 23 -7 -20 -26 28 12 25 -38 -19 24 -46 -14 -3 24 19 -15
3074 -15 -30 32 24 9 -23 -8 20 -5 -7 -6 15 31 -12 -35 18 47 3 -7 -41 32 24 -7 3 -15 4 -20 9 -5 23 29 -45 -36 11
3107 11 34 33 -52 6 11 25 -24 -32 -11 -9 -34 -21 -29 17 13 -20 12 15 -10 -19 1 -23 9 -20 -37 -8 15 11 -10 -19 1 28 46 -16 -6
3142 -6 2 8 -1 -7 2 17 -6 -36 2 12 20 39 -24 -11 18 -38 5 10 19 0 2 -1 -9 36 9 -16 22 15 -1 8 -40 17 24 -22 -53 24 -43 18
3180 18 6 -41 17 -26 -19 -6 4 -20 -30 1 16 22 9 -14 -15 -18 -17 46 20 -11 21 3 -40 16 41 0 12 12 -19 59 -13 -6 0 5 -10
3215a0j4J0ROJ6k6NJ5l2M6l0PLmk0L3k7j4J1LOKrk9M6nk2J3kN1pm8rL4OqJ6n2
3253c0M4Mm0ON1n2lK3k0L1k7J1J1J8pj3pL2ppl6J5K1rk1J4nK7k2j5j6K5j3L8k6
3288ej5M2j7j2rL6n3j1M1k3KJ3k7M4Nj3J1j7J9K4o4j1J3Rj3K6J5k4NLlN1l2j8
3322hj1J0j3M1j6Mk0L4j6J5%l7K8m4jK7L1m6K4L6j9pj2oqM9k6m5J0K4oJ0lMj7
3357a4M2j2k0%K1k7J1J9j8qKJ0JJj9qjJ8j8Qj6N8n4K5k5O0k3Ml4K6j7L3m0jM1
3392B5k3J5k2oJ3l0OL9m8K8L8j8pJk9J7j4K1j3j9L5k2RJ0rnrkqL5qnprM1k4nJ5
3430Fnk2J8JMrjj3nJ1M3l8j4J7K9k1K4ml9K1K4l4jL2jj2KJ4jQj3k8nRM7m4K5k0
3468EL9p4J6K2k2J7k8N1l7NqkJ5k7J9K2j9l1L5kJ7j1k8M2j8j3L5j4k0J6j0J1n
$$ plain form
3215 -10 -24 -14 -5 1 17 -9 -4 11 -21 25 -5 2 5 1 -19 14 -13 -27 -16 -13 -7 -5 -14 -43 3 -2 -24 -11 -13 38 31 -17 -26 8 14 6 22 -30
3253 -30 14 18 -22 -16 35 -17 -20 3 -17 14 -13 -2 9 27 20 7 0 32 25 18 -18 -3 18 9 -12 2 -3 24 2 -13 -29 -4 -17 21 -5
3288 -5 -20 22 5 -7 -16 20 -33 -44 -3 -26 -24 -11 -38 6 11 -2 9 -8 11 35 -29 -40 -27 -18 -31 -5 10 -14 -9 -6 -9 42 10 -8
3322 -8 -19 -9 -22 19 3 7 -13 21 5 20 20 -17 11 -33 -34 -7 24 -22 2 38 19 12 0 -6 -14 35 9 -36 -26 -2 -8 2 -1 3 -14
3357 -14 28 16 -4 -4 17 -10 1 20 2 -6 -4 6 7 8 -11 -19 -20 -2 -20 -12 -28 30 -24 1 -24 36 13 17 -17 9 -8 25 -15 -16 25
3392 25 2 17 -5 -11 2 -28 -22 17 -31 -3 35 17 10 11 -18 -1 -15 6 -7 -26 9 -13 -4 6 -3 -8 -17 -19 -27 8 0 -5 -12 -21 20 -4 -9 6
3430 6 1 -21 -3 -2 2 -7 -8 -21 -26 -15 28 -10 -24 -7 22 1 25 21 -18 3 27 -7 -8 24 23 11 13 27 26 34 21 -7 -12 -3 44 0 25 5
3468 5 44 -30 -14 8 -14 3 -25 26 -11 -6 -14 -16 -1 -28 -9 13 -6 -37 -2 -4 13 2 -26 16 -2 -15 20 6 -14 2 -8 3 -2
3501bK7m6L1oj9L7j1Ql8L3Pmj0k1M7l2j2J6LJ2krk9K4J2J1m8RK4qj8RRj3J9k1
3537a1j2J9moLkJ4JMj4JK3k5j0Oj1klJ0NJ8j1J4J5l5kK0j1RpPJ1jj2L4k6J3l5
3575a3M2J0m0qj1K9J5l7J4Pj8pM0Jl6J3Jk7K2Nk3j1MK4OnRj5k1K0J0J2nj4KoM
3612gj8J2Mj6j1L6j6K0Qk3J7jj3L4k7NqL0j5j8OqJ3rK0pJ8j%k0L6l9Klj8K7J1
3649B1l0J7j1PK2m6L0k7K2j4lJ1k1qJ4L6j9jj6KLk4Q6l9k4oQj2RmK4J6J3l6oj4
3685b0J9L1j8l3L5Ooj1oOLMnj3L6J5l8rOj5J2oML8j3nQm9J5j4m%K0J6j0PQj1j7
3724a4K3qK1nl9LJ6k2J6KnJ2m%j5J3JMj3L4oJ2k3J7kpjm9L3K7lj0j5K4j9L1l3
3761dL7l5j0MqKK0Pk2J2J8m3K0J5j5k6OL7Pl0j9lJ6K4rj0J6Qk3nk9N4j0kk3K0
$$ plain form
3501 -2 25 -21 10 4 -15 22 11 19 -19 14 21 17 7 -14 33 1 -11 5 8 20 18 9 -20 4 16 27 -21 -12 12 4 -14 -5 4 -9 10 -11
3537 -11 -23 -4 -8 -14 -11 -13 1 2 6 -8 -7 16 -9 -19 -13 -24 -26 -29 -19 -14 4 -7 7 22 -13 -15 5 -6 3 -4 3 14 13 1 35 9 22 -13
3575 -13 29 39 -1 -9 -20 9 24 -13 1 8 -10 -17 23 24 -12 1 2 -25 -3 2 -21 -32 -28 -4 2 -3 6 -9 -30 -10 0 12 7 -7 -5 -11 -7
3612 -7 -25 -13 -9 -25 -36 0 -16 4 12 -11 6 5 -8 26 -1 4 -4 26 11 -7 -1 -9 4 -5 15 8 26 25 25 5 41 2 4 1 -17 10 21
3649 21 -9 8 -3 4 26 -20 10 -17 5 -9 -12 -1 -22 -30 -16 20 1 0 -16 -14 -11 -35 51 12 -12 -18 -10 -22 -13 -17 7 23 36 0 -6 -20
3685 -20 -1 30 12 -21 14 20 14 3 -3 3 6 10 5 -8 28 43 5 -4 2 -13 -1 -7 -3 35 22 17 25 -24 -9 -23 -27 -27 -7 9 -1 6 14 3 -14
3724 -14 9 1 22 17 -22 -19 -3 -25 -9 -7 -12 0 -4 -4 -19 -6 -5 -1 -14 20 14 26 3 20 18 11 10 -39 -6 21 18 8 -7 17 -2 29 -4
3761 -4 33 -2 -12 -8 -16 -14 6 13 -9 3 21 -22 -2 13 -2 -28 -22 15 22 -8 -27 -30 -14 10 1 -9 7 15 -8 -13 -42 12 2 0 -23 -3
3797c%L4m6M8jj3kJ2j5Nrj1kK6jk5J1l5J7K4k6N2j1rj9K3m8L5J2m5L4lj0k0K9
3832HoQj3k1j1L5k6QK0pL9m5oK7%J3n5NJ4M6k1n7N3J6o3J5RK8j7j1j7N3k2OkJ
3868DoJ8l4K0M0n2j6J6J%N0l8k5M2nm3M9J2j9r%J7oJ0l3LRQK5m3lM6l4J3l6kM1
3905B0J7n8L1Ppk0K0k2J4Rm0%L4Jm0M3l6L8%j2J2K8n2j8K9L6%l2OJ4j2j5m4P7
3939B8l1Poj5O0k0l0jL3l6lQn6R2Kl8l0M6j6lk5M2j7M6l1j9JO2p2J4J9J3k6m5
3973d7L8oK9Jn1L1L1m4rJ7L0j1J2j3KL3j1q0K8L4rK2nj2qJ2lk6K9Nk3J7LLK7p5
4009b9M0%j2K2l8K1k8J9k7M6NJl5J3j4J6Lk6M1Lm2K3k5NJ1K5n3NM2m5J9J0Opl9
4044d4L8J0J0m3J2l6L9J3l2O5l2j0K4k0J3R%j3m2P0%n6J7K4oj0j1Qj3L6m5%L4
$$ plain form
3797 -3 -3 31 -15 33 32 19 17 29 14 19 10 -1 -3 23 22 -3 8 -27 -10 14 -12 40 29 20 1 24 -24 11 23 -22 12 9 -1 -21 8
3832 8 2 10 -3 -24 -35 0 -26 -18 2 -5 34 -11 -17 10 10 23 -32 -27 -13 33 12 -45 8 24 -39 -24 -15 13 -4 -15 -32 21 -1 5 3 4
3868 4 -2 16 -18 2 42 -10 -26 -10 -9 -9 41 3 -22 20 15 -28 21 33 14 5 5 22 16 26 -7 -4 5 13 38 -5 -8 38 4 17 -19 -21 20
3905 20 37 -21 10 17 10 -10 10 -12 2 11 -29 -29 5 6 -34 9 -27 11 11 -1 11 39 -13 -31 -2 34 34 2 8 22 10 -5 -49 28
3939 28 -3 4 -2 -17 43 23 -7 -8 25 -11 -14 -6 -62 30 32 -6 -36 10 -6 -9 -34 8 -9 37 6 -13 -12 50 -22 -8 11 24 -2 -47
3973 -47 -9 -15 14 15 -36 -5 26 -18 -27 -10 20 9 21 8 10 43 32 -48 -20 14 5 27 22 10 2 14 11 -15 14 19 -4 13 16 19 46 -29
4009 -29 11 11 -1 21 -17 4 -24 -5 -32 14 19 20 -15 -2 -16 0 3 -23 18 21 -21 2 -23 -18 -7 18 -35 -30 12 -33 -14 -4 2 -5 -44
4044 -44 -6 4 14 -29 -17 -53 -14 -1 -33 32 0 -10 14 -6 7 16 16 3 -39 31 31 -25 -8 16 10 0 -11 -3 -16 20 -25 -25 9
4077IL0o7L8j0k9N7k1m1N4jj2%j3K1%n5nN3Rj0j0l5P6J1q6K4K9j4j5K5k8K3Pp5
4111f1K4O4l2l4N6j8NJ5m9pO3lm0MK1jNj5RJ3n4K9k1J7M1m0n2L8N2k7j4J1k6L7
4145A0Qn9M5K8o4nO3o0Q5o6l7N0K4j8j9j6K7K8l3J8J7j7j2j5j6L5M9n0m9Q5rn2
4177b5N3om5M4k7n8R8J1o3%N2rk3mj0MNk0J3j8M3J3p7J9O9m3qL1k5j1M5r1M0O9
4211D6m0l7J7L3l2K2j8k9N9Rn6L8J6k1k7PJ8K3L8q1m1M0L3kn5L5Qlk4L6NM8n0
4244A5p2N5P4p5l1M7j3NJ6l2J3J4m2m7O1M4p6M7j2jN3m7k5L0j6JLL6qk8jj8M2
4277A2j5K2j5Kj1J7o2rP4jm2K1nNK8m0l5O7Mk3J8rM9k8m9QK2N8p6j5K1M0j8n8
4311d3P3j0k9j1QPK6l6lM3j8j2pK3o3N6j8k4L7L2n8%QL1j6kJ2k4NL6l2k8Q0k0
$$ plain form
4077 9 39 -28 10 0 -29 28 7 -34 20 19 7 7 -6 15 15 -40 -45 8 17 7 -3 -38 38 49 -37 -13 16 2 -13 12 -16 7 14 -61
4111 -61 -37 27 -5 -39 17 -1 4 19 -30 -37 26 23 -17 -13 8 7 12 -3 6 19 -35 -6 -27 -10 31 -9 -61 -23 29 2 -12 -1 -27 10
4145 10 18 -41 4 32 -32 -37 26 -34 51 -15 -52 -2 22 4 -15 -31 -4 24 -9 9 26 9 -3 -18 -34 1 50 0 -49 36 27 -25
4177 -25 28 22 -23 21 -6 -64 34 45 -18 -18 34 25 2 -2 -12 -8 -3 -23 -10 -28 15 28 -49 -30 39 -4 -12 19 -6 -17 28 -63 -23 46
4211 46 6 -31 -14 19 -13 9 -9 -38 21 30 -26 12 28 7 -20 -13 5 28 66 -15 -56 -16 17 15 -40 -5 3 0 -24 12 17 65 15
4244 15 -57 -2 72 -3 -34 13 0 5 21 -11 2 16 -26 -73 -12 32 -44 3 -9 -10 43 -4 -29 1 -15 -14 -11 25 17 -11 -12 -30 12
4277 12 -3 19 4 6 -5 12 -50 -59 15 14 -28 -7 -12 -7 21 -19 -54 13 17 -6 12 3 52 24 -25 -17 5 63 -13 -28 -7 33 15 -43
4311 -43 30 20 -9 -20 -12 -5 21 -15 -18 25 7 -5 -12 11 -52 4 -14 -38 -1 31 -27 -27 -19 12 -4 -6 6 -18 -13 23 -9 -37 43 23
4345B3q9N4L3j0Lm4mK2M5o7K1K9ml4%K5K3kJ3n4KK3M2o1L4Kl1l3O7k4moJj7M4
4380B2jm2L7J2n1L3j6l7N9k6k7K1M7k5m6L5J1j2K4k0NJ0J6n1j3K9K5m2PN1n5M3
4412B3l5n7Q2Pm1JN0Nl2Pj8L9j5j4l8K4L4k9k7J6K8k3J1l5K1J6Kn8J7N7km6M9
4445A9k8MoOqJ9L8j01K4N6n5ML1oJ4qk7m0Q4On1ML0K8o9L3J3kMl8m1Q2L8n4k6
4480b3M4Rm6N9p6J8O7l0o3O1K2q7N3Kj4L5k9k0J4L6k8m1L0N0k4m1qL1l1K5j4l5
4512e4M2O6r4K3M2m3J4J6qJ4k0l0mO7Qq3L6J6j0J5ml6N2J5o3qJQ3m7o0P5Lk2J4
4546A6k0j6P7l7q4O5N5j04M2K3k8L2oo6J7Q2n4j0L7Lj1K0l8MK9l5Kl9O1k6k7J5
4578b1M1l2k6O2j5k4M4k6m4K5O9q7J8K5k4kN0p2P1Ro5%NL9k6Jm2O9Rj9n3J1M9
$$ plain form
4345 23 -66 -12 21 11 14 -30 -34 -12 33 -34 -13 16 12 -22 -22 3 26 24 37 -17 -15 8 50 -11 23 25 -6 -39 28 4 0 -6 -5 -22 22
4380 22 21 -21 16 28 -23 10 -6 -43 16 -10 -37 -16 31 6 -40 -5 6 -6 18 -2 3 13 29 -22 -35 -6 19 -23 -16 35 -20 23
4412 23 -12 -69 13 20 -21 -20 30 35 3 10 -8 31 16 2 -36 -12 22 -7 -34 -18 10 -13 -2 -37 -16 0 2 -56 -39 18 16 -30 19
4445 19 -9 -5 -11 -5 -13 6 44 -57 -33 23 -32 -28 3 -3 11 3 -24 -64 20 26 -25 -21 9 37 -32 1 14 12 16 -22 -63 19 57 3 -23
4480 -23 21 30 -16 43 -33 -15 52 22 -41 20 42 -45 8 10 -4 31 2 -18 -4 32 4 -37 -7 43 19 -22 -30 1 -30 -5 -19 -54
4512 -54 -12 54 -40 -17 25 -18 -4 12 4 18 -2 -32 -36 31 39 -44 -8 8 -2 13 9 -27 25 40 -23 -31 -30 53 6 -54 21 24 2 16
4546 16 -4 -20 57 20 -64 1 56 -48 -6 17 -11 21 15 -51 -34 48 -6 -16 21 24 13 33 -5 -1 28 -7 -5 -44 17 -9 -36 -21
4578 -21 20 -12 -38 24 9 -15 29 3 -41 -16 53 -34 -16 9 -15 -17 33 -39 32 41 -24 -24 -19 20 -6 -5 -47 22 31 12 -41 -30 19
4611A9l4l1J0O6l8k8J5K5k2Mj7NQ7n6n4M6L0l9J8k3l1Q9o1m7N1K7n5J0RKJ9K2
4643A8l2j4N4k0l1LK4N8j09J1N6j3%j9kK9N5p1l4L6Qj3RQMN0n8o5O5L4l3pk4K5
4677BM3n3l6M9K3m1j5M2k0K0j5k6N9j7j3lj1M0k5rj3P7l9l6JNK8opo9P2K6j7n7
4711d1L7K7m1Rj7K7L6p2LL4L2j2l3J1J9Lo2K4L0Qk2k9K7L4j1j9MJ2nOl9k6N2j3
4745gk8M1J2qo6K9j8P6k1p4M2K7l4K6j8PN6m3l0J8J7K0qk2j3N0j8n8L4J0K6m2
4777a7j0L9kkl9L5N3p0L2J3m3N5l7k2OJ4mJ2m5M6K6p4J4L9%n2L8j5J4K5p3KJ02
4810F0l4n0oLK0K3m2j6M9J0l9N4j9Kol5j9Q1J2o9K0L5KPq6oQ9m9lOK7j5K2n3k3
4845d8P9k1m3M3nK5k0p1L1N4Qn9L4%K5lo2M6Jj1k3Nj0L2J8r9M5Q4r5M4m3J5L5
$$ plain form
4611 19 -15 -46 -36 30 -8 -36 -21 4 -18 -14 -31 -26 61 5 -49 -3 27 -12 6 -17 -48 41 -20 -67 -16 11 -44 -34 -25 -23 -4 18
4643 18 -14 -28 26 6 -25 -22 2 60 -49 -38 18 5 5 -14 -16 13 68 -3 -37 -1 7 -6 3 11 15 65 7 -58 7 41 8 1 -23 2
4677 2 45 -8 -44 5 28 -13 -28 14 -6 14 -1 -27 32 15 2 -1 -12 28 3 -6 -19 58 19 -17 -16 -11 17 11 4 -65 7 33 16 -41
4711 -41 -4 23 -18 -9 -26 1 37 -35 -32 2 34 22 -11 0 19 22 -40 -16 14 22 0 -29 -2 32 21 2 6 18 13 19 -20 -46 6 -7
4745 -7 -35 6 18 10 -56 -27 -45 31 10 -64 -22 5 -29 -3 -21 -14 42 -1 -31 -13 4 24 16 -6 -19 31 13 -45 -11 -1 25 -17
4777 -17 -27 12 10 8 -31 4 57 -13 19 32 -11 44 7 -15 -9 5 1 13 -32 14 40 -34 -20 19 19 -33 5 -10 4 29 -44 -42 60
4810 60 26 -24 -30 -27 -7 16 -26 -42 7 17 -22 32 13 15 9 -26 -45 36 48 -21 -1 34 36 43 -43 -49 40 -9 -12 -6 21 6 28 -25 -48
4845 -48 31 10 -33 10 5 30 10 -61 -30 24 32 -27 7 7 32 29 -33 13 14 3 -20 -15 -25 7 25 -74 -29 55 -40 4 -39 -24 11
4878A1pm7K8P8r4k0P0J9j7rl4L7pPn5O7j9Nk5LJ3J5m1J3KM6j6j0k1L0mk4NRK2
4913C0k4m5J6L1Ml0oK3QOk3k3P0Lm6k4L2RMn5J5M1l1k3K8K1Ml0k2kM4J6m6K9j4
4948a0RqLRL6k6k1JM9l1j4kJ8K7ko9K8L3Lk6mK5k1J4n3RK5NJ2m5M6k0k1J9L4n2
4984b0K2jj6O2k9j9k4M4j0k1j5L3j0L8l5k6L4J6l4j6ML6k4pj5K3K2Rj6j0J1Mk9
5017a9K3j0M4k1j9Nk5J6jpK3LOm2N0%k8j0k1M5K4n7LJ4K5l2OJ3ppk2j2O8no0J4
5053b3K3L1k2m5lL0J7k3K8k0nK9o7%N9jm2L5Jjj2j8K1K6j7k3J9J8j8K9p6J6O9
5086C5k4KoK9j8l0k9J4N4k6n1M4K8j9K9n0kM2k0l0M9lrj1k3qK7K6l2J3K5n1L1
5119Fn0P1Rn8J8ppM0m4rK5L1n2K7J2l3MJ4l8O0%k5J3j5K9j2nJK2l4J3k0J4J5j6
$$ plain form
4878 11 4 -43 -15 63 -31 -51 19 38 21 12 -22 15 8 15 -40 27 8 13 -12 -9 4 19 -22 -9 -7 39 23 13 -8 22 18 -6 -1 8 30
4913 30 6 -39 -23 8 12 -18 -24 -1 7 13 -10 -33 37 40 -6 -30 2 11 15 -40 -25 16 -15 -38 -10 11 15 -15 -37 -39 5 21 -25 4 -10
4948 -10 -1 -9 -6 3 39 13 -8 -7 42 11 -3 -5 13 40 38 -31 -3 30 33 7 3 28 7 21 -32 -23 2 7 19 -26 20 0 -21 -2 32 -20
4984 -20 2 1 -15 47 18 -1 -25 19 9 -12 -27 6 -4 34 -1 -27 7 23 -11 -27 -23 13 -11 -18 -33 -10 12 21 5 -5 6 10 -19
5017 -19 4 -6 38 17 -2 3 -22 -6 -7 -14 9 12 18 -24 26 26 -2 -12 -33 12 36 -21 -18 -4 21 -11 -5 8 1 -6 -28 -40 28 23 -37 -23
5053 -23 0 31 9 -36 -39 -9 8 -15 13 -7 -12 17 -50 -50 9 8 -34 1 2 1 -11 -29 -8 18 1 -22 -3 15 -3 26 -50 -34 35
5086 35 11 13 7 36 18 -12 -41 -27 27 1 -50 -6 22 3 32 -18 -20 22 2 -28 21 18 9 -2 -25 -33 -6 20 -12 1 26 -25 6
5119 6 -44 27 36 -22 -4 -11 -18 22 -22 -31 -6 25 -27 0 12 -21 -17 -3 -41 19 19 -6 7 -8 21 9 4 5 27 -7 6 -14 0 15 -1
5154ak1M0j1RJl7M6j4j1j3pM5Jn3M7k2j9jJ4j1J2L6o0kL2Lk8J4K1lK9p1j5O1l6
5189b5L6n7J3M7j8J1l1L2J5m0j5M4Oj3o2P1J3n0Jj2K6L4l2n4N8L3m3J0J6J7Pm3
5221enL7jj3m2K2M5jn0rJ7K2j5j1l3K2K0l9LK2K3l2L5k5lJ6j7QO3n1j9jpK3K1
5256B0k4l2N8j1l3L1k4L0J0m8L4J3k9lL1k7L4j9m5RN6k5l0J8oLK6n8K7M9j4o7
5288d6K8L1nJ8n4kO2l9k6L1J8j3n7L3K3Pj0n5N5k7M1n6K7j4N4k5j5J5j4KJ1l3
5320c5L0N8m7kLL8m4l2J1M2J4m1j0K9nJ6q0N0K6J8l9j2j0J3rl6M9M2m5rJ3K8k8
5353dj7jNJ6L0p5N0lJ0m2PM1j6pm7K9M0j2k9kL1k5K7j7J4jPm4OK8JlOolL0l5j1
5391b2M8Mo1J3J5L5m0L8j9Kk1K9m4L6J6l9J5j5MQj9MQK6m0k4N9k2J5m0jK1M9m6
$$ plain form
5154 -1 -22 18 7 16 17 -20 26 12 1 -12 -19 26 27 -26 21 -1 -20 -21 -7 -18 -6 30 -30 -32 0 3 -25 -11 10 7 36 -35 -50 11 -25
5189 -25 11 -46 -33 14 -4 7 -24 8 23 -17 -32 12 18 5 -57 14 27 -23 -22 -34 -8 26 -6 -60 -2 31 -12 -2 14 31 38 -5
5221 -5 -10 27 26 13 -29 -7 38 37 -13 -22 -5 17 2 -9 -42 -20 0 -39 -36 -14 9 -23 12 -13 -16 0 -17 -9 54 3 -16 -17 -24 -1 20
5256 20 -4 -36 22 11 -22 9 -15 15 25 -23 11 24 -5 -8 23 -4 30 11 -34 -25 31 6 -24 -6 -12 -9 17 -41 -14 35 21 -46
5288 -46 -18 13 8 26 -28 -30 32 -7 -33 -2 16 3 -54 -21 2 9 -1 -56 -1 -28 13 -43 -16 -30 24 -1 -16 -1 -15 -13 -2 -35
5320 -35 -5 53 6 4 7 45 1 -31 -20 22 36 -5 -15 14 9 25 -55 -5 21 39 0 -12 -22 -9 -18 -54 -5 37 -8 -17 -4 24 -4
5353 -4 -21 -22 -17 -1 29 -46 4 1 11 -31 -24 17 1 -6 -53 -24 16 4 -25 -27 4 -21 6 -11 3 2 9 -35 -29 -1 0 -3 3 -3 -6 24 -11 -22
5391 -22 26 30 -31 -18 -3 32 -8 30 11 13 -8 21 -23 13 29 -10 5 -10 -6 2 -17 -13 -5 21 -19 -43 16 -6 9 -31 -32 -11 38 -8
5425hl5O1k8K6k0k3J4L2j2o4L8J4j8K4j5N6jl7k3K3jl5L3k8P7l1l8j6O9j8m8J9
5457a3JK6Mo6K6L4QJ3m8J1%Mk3J1J2j6J2l2j2N4j6m4N2Pj2rjkL0K1n3j0O8n0j3
5492b6qK4%Pj8j8J08p8j9L8j5L6l9m6P4K2o4QJ7k9L9j0k0J2M7l7j2JJ4K6l8l0
5524c4M9%m3rQK5M1m0%ONl0j0M2l5M0j3m1N2Orp0M9K0%l4RL4ko2K7J2pM9o0MM9
5561B8J5m7JMK4j6l6K7J0Ll9L7j0J5m9J6J0K8l0j4JK6K2k2%pM2l5k0J9J2K6n3
5594a2K3JK0l2k3JL7J5m7k8L1L8l3j4J3L3l3Lm1M9Lrj3JK5oj7lK4L2l8k3L0K0
5628B7Oo2J5M4%n9j5N4j2pJ1l5K3K3ok6J8J3j4l9L2J7kj4k7N1Mk1m0M1J6Pl3j5
5662b5L7lk8jKj1J2lj4K4rkJ5NJ1pp0L2N9k1npRJ2Lk7j1L6L4p2RK7j5jk9M6Nj3
$$ plain form
5425 -8 -43 18 -10 16 -4 -27 -13 19 7 -57 -19 -5 -23 1 -14 42 41 4 -19 4 3 -32 1 -27 50 19 -19 -35 34 16 -32 -13
5457 -13 -12 14 18 -48 -22 12 20 33 -15 -4 -4 0 -23 -12 0 -16 -4 -36 -48 6 -10 -54 -2 5 -7 -16 -17 -19 11 32 -21 -31 37 -13 -26
5492 -26 -34 -10 -10 -3 -21 -39 69 -9 -28 10 -5 31 -8 -54 20 42 -22 -14 3 -26 13 3 -17 -5 42 5 -7 -6 8 34 -4 -34
5524 -34 15 15 -28 -37 -29 -4 37 -3 -3 3 8 -22 -32 10 -25 15 2 -39 13 19 10 -60 -11 9 9 -25 -16 18 16 -46 -19 -7 -14 35 -25 -21 28
5561 28 43 -4 -3 1 25 9 -27 0 10 13 -26 11 1 16 -33 -17 -7 21 -9 -23 -22 4 26 4 4 -3 39 4 -16 3 15 41 -12
5594 -12 11 12 32 0 -23 -22 15 30 -17 -45 -14 24 -9 -23 -10 23 -10 -7 -48 1 4 -5 -18 -17 8 2 -15 -18 6 38 0 -23 7 27
5628 27 33 -29 -14 30 30 -29 -44 10 -2 -9 2 -33 -10 13 7 -19 -1 12 -2 -41 -9 8 6 -8 -35 16 20 -1 -41 0 16 23 -10 -25
5662 -25 12 9 -19 -20 -18 -29 -17 -20 -34 -10 -19 -21 -6 -1 10 3 -67 -35 24 3 -2 -9 0 12 15 -12 -23 13 47 -25 -16 11 -4 -5 -34 12 17 4
5700DpjqK0K4p7N0J3j8l0qN3nnk8RK7om0K2K7ll0J3%qmj2J1N7l6l5J8NJ0k8M3
5737A7j5k2K0j4NMJ6j8J3j9L1rk2l%M7j6l3J9K2JK4m9K9J0j8lk4M6k8lk0L5qj2
5772Ck6J8J1j5rL0qL1m3j4N7j6k5%K3Nk5k2k2L4J5l4kO2k2l7K1J2L4n4J3lJ1o
5806cj8J3K6oRm1qN4j3j7nJ8L2no4L2L7k6j7qlL5K1p4K0L7m6MmJ8J2K0n9J8K7
5841A6j4Kk4kL0%KqL8k6l1oJ3M4n1%J7Ok6L7j2K5nl0j2L0L6p9J9k1K5L7j9l8N1
5876B4jj3k5lLJ8RK1k0LL1l9m7R3l5k3k3L2j1kJ8k5LL6l0j1L2on6O2l2MK4j8r
5911a6Rj5Jk4L8J4l1Rj3M9k1J5j0J6lj2j3J7K4l3j8K3pJ9Lo4N7K0l8K2k3OJ5k5
5945iJ8k2J9ol1LK6Ok7NK1J4kj7j2J5R%n9Q7k6l8N0l0k6M6l6QK6Lm2K0J0Mj0J5
$$ plain form
5700 4 -3 -4 -12 8 32 -45 5 18 0 -30 -38 15 10 5 -23 -14 13 7 -33 -11 16 13 -17 -4 -4 -12 -16 -28 -17 40 4 -31 -13 -8 2 -26 17
5737 17 2 -20 0 -14 -9 -5 11 -7 6 -13 18 9 -13 -16 -16 31 15 -18 1 23 24 48 -1 28 38 20 17 -7 39 11 8 -12 23 15 3
5772 3 -23 -5 6 -9 -18 12 4 35 -8 -22 35 19 -6 -6 17 22 -3 -25 -47 -13 2 -32 -34 28 6 -31 -10 2 36 -18 -5 -8 3 -3
5806 -3 -21 -8 18 12 21 -20 -28 26 13 -4 -9 9 41 36 -28 4 41 15 -2 -10 -13 22 43 -31 -11 26 -20 -16 -20 -2 10 30 -29 -11 16
5841 16 2 4 -20 -22 8 8 10 2 40 14 -17 -23 -10 34 -17 -17 0 6 -20 17 5 30 25 -5 -17 13 49 -30 -11 -32 -7 30 11 -27 24
5876 24 23 10 -15 -18 -15 3 12 33 13 16 47 8 -39 54 19 -4 -27 5 -6 -8 10 -15 -12 24 -6 -17 15 9 -47 15 -17 -13 11 -7 -16
5911 -16 -7 -22 -21 -45 -7 7 -24 -15 -28 21 0 15 5 21 18 6 -7 10 34 1 -17 6 -1 18 21 -43 14 34 -4 18 -5 1 16 -9
5945 -9 9 -13 6 0 -31 -28 -2 4 -23 -18 3 17 15 -2 -14 1 10 10 -49 38 12 -26 24 -6 -32 14 -22 -14 12 15 -27 -7 3 7 -3 12
5981A2k5L4J6n7K0pL4%n4K9MLpj4J0L1Pm0k9Q0l2k9mJ5RJ0j2J0K0k5j2MoJ7l8
6016b6pK7K5%k9k8L8J2k4K1nK5l3j0j1N9m7Kk8J1L9k7k0K8j9J0MkJ8qj1l4N5%
6050Ek4MlJ1K6j9n3K0P7m0J6J9k5l3RKOJ2k3Pk1N0l3pJ6j1J5omj3J6kMkjj7J4
6087hj0J3J7j7%j1M6Ml2j9L6j0mlj9M6k0m4K1PlPnk2K0L6k0J4mJ4j6j5oL2M3j02
6123c4L9J7Po1Rj4N2K0o1K3JK3l1lL2j6%J1JJ1m5J7J2l4N5l3m0N5Qrnj4j8N7l0
6158Bk8J5M6k7Lk6J5J2Jl3J9J6%k9L6j5%K3l6mM4l5Pjj1J6Rk3J6MJk7qK1j7K0
6194Fn2R5j1j3l9J0PM6o8j3K7Pk0RjrJ9j3J2oLl2K7J5m5M4l3KP3o6QJM2j1lk2
6230dj2J4K3k0LK0k7OJ4k1K2k6Rj4K6K1l3kPJ4k9QKJ4j7l4J3M1J1k8j7J4J5ML
$$ plain form
5981 12 -13 21 37 -20 0 -7 27 27 -27 2 6 9 2 -12 -2 29 36 -4 -33 47 15 -14 -18 -3 6 16 4 14 34 9 -3 1 -5 12 -26
6016 -26 -33 -6 19 19 -10 -38 0 12 -12 9 4 29 -4 -14 -25 34 -13 -11 -39 -28 11 -16 -36 -8 -27 -17 -13 -15 3 -5 -16 -50 5 5
6050 5 -19 -15 -18 -7 19 0 -53 -33 44 4 20 39 14 -19 -10 -8 -2 10 -13 -6 -27 23 -10 -17 -1 -12 3 -3 -7 -20 -4 -6 -2 -4 -5 -22 -8
6087 -8 -18 -5 12 -5 -5 -16 30 34 2 -17 19 9 5 2 -17 29 9 -35 -14 -7 -10 -3 -8 -30 -10 26 6 20 16 30 14 -1 -7 25 68 -34
6123 -34 5 22 29 -32 -23 -37 15 35 -26 -3 -2 21 -10 -13 19 3 3 14 15 26 -19 -2 10 -24 31 -2 -42 13 21 12 7 -7 -25 32 2
6158 2 -26 -11 35 8 11 -15 0 12 13 -20 -1 15 15 -14 22 7 7 30 -6 -10 34 -1 6 5 -6 10 19 -4 12 16 17 -10 -18 3 -14 6
6194 6 -46 49 38 25 -14 -4 3 49 -19 -32 -5 2 -18 -9 -10 -19 0 -13 -1 -7 -4 -36 -9 6 -39 5 -28 -26 47 -19 -11 -10 32 21 18 -4
6230 -4 -16 -2 21 1 4 24 -3 3 17 -4 18 -8 1 -13 13 34 1 -1 6 20 -9 -1 1 15 -2 -36 -23 18 29 1 -16 -2 13 17 20
6265B0o9M6J9o0OM0Kjj9KJM0Mm3M5j9K0q3L9OM3l3nK4Rj4m1K8j1K5qj6J7Qj4j0
6301bk7P2l7j0PMPm3K2j9J2L9n9l7J36k1n3l6N5j2L3l6J0K1l2Jj8PL3mm8%J0L4
6335In5N8j4K6j5l0L4k3M7m7pN1m1J1Nm3M0J4m4J5MK2J2l1K7J3k1m6J2L9Jk6k2
6368b5J5K5Lj9k4M9J3o5MN8nj4l9L1j5K3pJ0qj0J1m1L4mol7M5j6K0prpK7J0k6
6403fk0L4mml0L5K6k1l1lK2K3j0j8J9K2k5l0M2j7L2m0j2M0j0J4p0J6K5J3%k3J4
6436Ckj9L8j4K4j3m8J9K9%l0l0L2L0ol3rJ9J4m6M1oPK6n3J5L4k6l9K8L1oj2lJ2
6471GKJ9k6jlM8m3j6L2Rk5k7M8k2K4j7l4K3J5m2L2J7lPj4l6J4L2j8J3n3N3Lk7
6505ij3pO9m3n7N0J5J5k6K1k3K4k2k0K6J4rK3l9K0Nl3Nj8J7J1L%QLl9K4J7PJ3
$$ plain form
6265 20 -49 -3 16 -44 -38 2 4 3 -16 -14 -13 27 31 -12 33 14 34 -49 -10 -4 39 6 1 25 34 20 -21 7 -4 21 13 -3 14 22 8 -2
6301 -2 -29 43 6 -4 3 7 14 -29 -7 -26 -14 25 -34 -71 65 44 -9 -45 10 -2 31 -5 5 26 -6 -5 -23 -16 17 13 -35 -35 -25 9
6335 9 -46 12 -2 24 9 -21 13 -10 37 -10 -17 34 -7 4 9 -34 6 20 -24 -9 -5 17 29 -2 25 38 17 -29 -17 22 23 -3 -25
6368 -25 -10 15 18 -1 -25 24 37 -28 -24 34 29 15 -24 7 -8 15 8 18 10 0 11 -30 4 0 -6 -43 2 -14 6 -1 -10 -17 10 20 -6
6403 -6 -26 8 4 0 -30 5 31 10 -21 -24 -2 21 11 -7 12 34 9 -21 21 4 36 -4 -16 24 14 28 -42 -26 -1 12 12 -11 3
6436 3 1 -18 20 6 30 17 -31 -12 17 17 -13 -43 -11 19 13 -20 -29 -10 4 -42 -1 -7 0 26 -27 -12 22 -4 -43 -15 16 10 -2 -5 7
6471 7 9 28 2 1 -2 46 3 -13 19 28 3 -24 24 2 26 9 -25 -2 13 -29 3 20 17 24 10 -26 -12 20 2 15 -38 15 18 -9
6505 -9 -22 -29 40 -3 -60 -10 5 20 -6 15 -8 16 -6 -26 0 14 5 28 -11 9 14 -19 -14 -32 -15 -4 -1 -1 7 10 -29 -5 12 19 32
6540C2rk4K4k2k5J9K6l0K0k6PK5Nm2K2J7k0J8Pj2J3k1pl3J3mL4k2j8O1k2l6J0
6573b0O6l2l3MjJ4J9o0N8j8K2m4JM8j9k7J5rK2L0m8ML2j9j8K3J8l3K6k4oL2nM
6607B2n5K8j5RJ2l1L3Mj6K8J5k3Rm0J0J6j4qK2Jj6Lj3OJ8j8j0pK9qJ1k4j7L9J9
6642A9n5J3K9k6j8J2K4K4l5j4J1M9JJ0p9N2jk1k2M1L1o0OJ8K9k8j0j1M4m2K2l1
6674a8K2J8k0omrK9Kjj1jKj9RJ6mJ2l9j0J0N5m8k0J3L7j5k3K6j6L1m2L4j0lj8
6709b1j1J8M5l2J2j7J7k0M2n6N2Lm5j1K0L2k8Ol5J8K6l3J0rL5Nm2j4M2j3M5p1
6741c0O0k0rlk0J6mJ3LLoK0m6K2K8qnj5oJ4nk3N6m2J6k0%l2N6qpJk5M2l4J2K4
6778A8Ml0j7PN0j3j7j6O3l1Jk7J8Rj0j3K7K2m1k0j5L5K4rk6j6M3m0J1mJ6LJ2k5
$$ plain form
6540 32 23 -1 23 1 -24 -5 21 -9 11 -15 -8 17 22 -20 2 19 -1 17 24 12 25 4 -3 -36 -23 -27 7 -15 -33 28 6 -30 -20
6573 -20 46 14 -19 -15 -16 -2 17 -43 15 -3 19 -25 -24 24 5 -22 -7 -16 6 36 -12 -8 24 5 -13 10 28 -5 21 -3 -9 23 18 22
6607 22 -33 -5 -20 -11 1 -30 3 7 -9 19 34 11 20 -20 -10 6 -8 -16 6 7 -9 -6 -19 -13 5 -13 -23 -30 -1 -9 2 -22 -39 0 19
6642 19 -36 -23 6 -20 -38 -26 -2 22 -13 -27 -16 33 34 44 -35 17 16 -5 -27 14 45 -15 -9 9 38 10 0 -11 33 -9 13 -18
6674 -18 4 22 2 -4 -8 -17 12 14 13 2 1 3 -16 -7 9 5 17 -22 -32 -22 33 -15 -35 -22 15 0 -23 3 -13 18 -24 10 0 -3 -21
6709 -21 -32 -14 31 -1 11 -6 11 -9 33 -23 29 32 -13 -24 -4 28 0 6 -29 -11 15 -18 -8 -17 18 23 -19 -33 9 -4 41 -30
6741 -30 30 10 1 -2 -22 -6 -10 3 6 9 3 23 -23 -1 27 19 14 -1 -7 7 2 -21 35 -7 9 -11 -11 -43 13 5 -2 -1 -26 16 -18 -6 18
6778 18 22 -8 -25 -18 32 19 2 -14 49 18 19 -8 10 19 9 -4 23 45 4 -16 -31 4 28 19 -7 -23 20 -20 -9 -13 3 6 18 -7
6812gJ5Qj7j2qK0Ok2JN1l9k4M9l7lN1n8J3L6m0MRlM6qpn3M7rk8K7PMnm2L1KM6
6850E1m3k6O2kk6m3J7K3J8k2k3QML3m9pL5j8l2J9L4J2k4MQK9l8pkmOL2l4NM0m3
6886cm0M3K0pJ0l7J3K9qn1J6J9J7J3n4K2J4pLj0LNn1L1J0L8j5l7L5LJ1m9k3N0
6920A3MqRk7oK9J7m7J9K3m2j2K2K3k0K1n0M7J8k8k2M9qm8J0J5J9l5J1J0jj3K2
6953A4n3K1M7j4l8rM8j0mj5J5RJ4l7j5M5pk5J2K7lk3j0J8PL5n6J2J5K7n7J4%%
6987DJ9l3k0K6K6om0pK2J5k3QRlnk5K5K9k6JJ0j9L5m4k1M4K2j8n2P7qj3j1qJ1
7022AJ8k3l7K0M0J8l6j9J8Mjl9L7J5kRj6J0Rk1l8L9J8k3j0J9nPl4J2M7k3j6k1
7056b3L2j8KK1Jj1j4K0l8K7k7QK8l5N6l9k0K8k5L6J6m9pK5Ql5L2J0JLk8PM2nk3
$$ plain form
6812 -7 8 16 -1 -13 -21 -1 5 -17 -16 35 -4 -28 21 -16 -19 32 -26 -13 23 -17 -13 -4 -7 39 31 24 -29 18 9 -19 8 15 19 14 -28 3 5 51
6850 51 8 -18 44 42 16 -27 -10 13 31 9 -14 -6 -2 31 -18 -25 10 -8 -40 -21 13 25 1 5 13 42 4 -3 -5 -9 -3 29 -5 0 40 -3
6886 -3 -43 0 20 13 23 -14 -1 28 20 -31 -15 4 21 34 -20 2 16 9 12 2 5 10 -41 -10 0 38 23 -14 21 24 35 -14 -37 13
6920 13 17 9 18 -9 -15 14 31 -16 3 26 -16 -28 -6 17 -3 18 -32 15 33 5 -17 32 24 -24 -14 1 20 -15 -4 6 5 -8 14
6953 14 -39 -18 29 15 -23 -32 16 6 2 -13 2 11 25 -12 -27 18 11 -14 -2 25 22 -1 -11 7 14 49 -7 5 20 47 -10 4 4 4
6987 4 23 -10 -30 -4 22 16 -24 -31 -9 6 -17 -9 0 -3 -8 -33 -8 21 -5 -4 6 -13 22 -22 -43 1 23 5 -47 30 22 9 -2 -10 1
7022 1 19 -4 -41 -21 19 37 1 -18 0 4 3 -36 1 16 14 23 7 17 26 5 -33 6 24 1 -9 10 5 12 -22 -10 37 14 -2 -23
7056 -23 9 -9 -7 14 15 4 -10 10 -28 -1 -28 -20 8 -27 29 -10 -30 -2 -27 9 25 -24 -31 -6 2 -33 -1 9 10 13 -15 -8 34 29 6
7091FJJ1RJ9l0j8J4nqk4J7M5l5j7qL5k5j2M2j4J0j4l5J8M7p7N7nl2N9l5l7N3Q
7125B0m9mL2J8k7J2l1PM0Ml2J4K6l6rK0mJ5qj8jL5J0m4MK3l5L5m2L8JK8k1l2M0
7160B9ml8M3l6L3k8K4l7J7Qk0J2qJ8l3OQj0O1m8qJ3Noj7M9l8J2k9J3J5j8K5m0
7194b7L3J8j5j3j7NNK4Jk3k0K1j9J7K9j6K3m1J7pPoNJ3n0N9m3M6j4%j7K4k2j6
7228a9J8j1l5P0j6n7L9Qkj3k1K7MJ4m0J3KK9j8j5M8l8pJ3KJ1J9l4j8L7Ol3L2L7
7262E2l5jK1p5O0No7M2K7lk2j2RM5n8M4n1J8L3k9rJ9Jj7Lj8K0K6mm5J1K6j1J6
7296B1j6qJ0j4j4K1%Rj8KnK0k6K4rL2j4j3RNJm9OL1j9Kk4K2K8jk5NJ0Ql6NK2J7
7334A9mm7ML7joJ5LJ8o0J4J4K6m1J6K9k8J0l0J4J4oj5QK4j8%k1k5LL3Rm4M0J0
$$ plain form
7091 6 7 18 27 46 16 -2 12 7 -1 -25 -8 37 2 -15 -23 12 -13 -25 17 3 13 -1 -36 -18 29 -48 9 4 -28 31 -4 -41 12 20
7125 20 -29 -33 -1 17 -10 2 -29 -22 18 22 -10 4 30 -6 -15 5 1 16 8 -10 -11 24 34 -10 -6 17 -18 17 -25 13 14 42 21 -11 29
7160 29 25 -13 30 -6 27 -1 23 -14 3 11 -9 3 -5 13 -20 -14 -6 -16 45 -3 -11 2 7 1 -16 33 -5 7 -22 -9 6 -12 13 -27
7194 -27 6 24 9 -4 -21 -16 -11 13 14 -9 -29 -8 -27 -10 19 3 26 -15 2 -5 2 -4 1 14 -36 23 -20 26 12 12 -5 19 -3 -19
7228 -19 -1 -12 -47 23 7 -50 -11 -3 -5 -18 -39 -12 -8 6 -34 -21 -19 10 -8 -23 25 -13 -20 -7 -5 6 25 -9 -27 10 16 -17 15 52
7262 52 17 16 37 -38 22 27 -40 2 29 26 4 -8 1 46 -12 32 -19 -1 32 3 -6 13 14 -3 0 -18 2 28 24 -21 -10 16 5 21
7296 21 5 -3 7 -7 -21 0 0 9 -9 -7 -12 8 -18 6 -3 29 15 2 11 16 17 -32 -26 5 -14 -12 -36 -14 14 13 -12 -7 3 11 -25 -20 2 19
7334 19 15 -32 -28 9 8 2 17 20 38 -22 -8 6 32 -9 7 36 8 18 -12 2 16 10 -5 3 27 9 9 -12 -37 -34 -1 8 -36 4 14
7369A4j3l0LM2pK8k0l4K7Nl1LM1j5ljK4l0K7l9j2L3J0k0l%K3j5j3J6J2k4kpJ7
7404FJj4J5qK8l5r%K1K6l6j2K1L2j1jl4kO%j3OjJ7l2K3K0J0l8j3N2Jmjk1M3m3
7441@J5j2j1M1j7mk2K7K6l8k8N7k8M%j0K5K2l0j9k3M8j8j1k4K7Rj3k5M6k7Mj7
7474b6L4jjk2KL5m4K6l1K2J8j1j0j1J2J9k8K8Lk5qR%J5k0%j1M1j2l5K9K2Mk0n
7509bk8K6K9l9K2J4k9J7k7N4m6M2n5PK6LmNl9L6ml3J8K4J9k5n6K5K5Nl4N2j7k
7543I%k6rL4Jj2OPl2JK9%JJ2l1rL0k5mj1N0j1j6l4L6k4K8Lk6M3mpm8M1J4k8J9
7580GmJK1K3m4JMk9K3J4J8nm7N0k2K2lm8J2M1n1j8L8k9K3jjm1K5M0j9j4K6k4N
$$ plain form
7369 14 1 -29 -26 16 9 37 17 -17 10 15 -16 -13 28 13 10 9 33 3 30 -9 -21 12 22 2 -1 -1 22 7 -6 10 22 -2 -4 -11 6
7404 6 7 -7 8 0 28 -7 -16 -16 5 31 -5 -17 4 36 25 24 -10 -12 -6 -6 -19 -13 -14 3 -29 -6 14 24 -14 -27 25 26 22 21 0 43 0
7441 0 15 3 -8 33 16 12 -10 17 43 5 -23 34 6 10 10 0 25 47 17 -2 -25 23 5 -6 -30 -3 6 -7 -32 14 -13 -9 -26
7474 -26 8 7 6 -16 -14 21 -23 3 -28 -6 12 1 -9 -20 -8 11 -17 11 14 -11 -19 -10 -10 5 -15 -15 -26 15 3 -32 -3 19 23 3 -2
7509 -2 -30 -4 25 -14 8 22 -7 10 -17 37 -9 33 -22 -15 11 14 10 15 -24 12 8 -25 -7 17 36 11 -45 -20 5 10 -24 28 11 9
7543 9 9 -17 -26 8 9 -3 3 10 -22 -21 8 8 9 21 -10 -19 11 -14 -18 -29 21 10 -6 -40 -4 -28 0 3 -23 20 16 9 -39 2 16 -12 7
7580 7 3 4 25 48 4 5 9 -20 3 17 35 30 -17 33 11 33 30 -18 -6 35 -16 -34 4 -25 -2 -3 -4 -45 -20 20 1 -13 13 -11 -6
$$ [...]
8191C0
##END NTUPLES=NMR FID
##END=
