##TITLE=1H_LY-857.24
 CCl4, 8 sc, 
 26.7.2019
##JCAMPDX= 6.0         $$ Bruker NMR JCAMP-DX V2.0
##DATA TYPE= NMR FID
##DATA CLASS= NTUPLES
##ORIGIN= UXNMR, Bruker Analytische Messtechnik GmbH
##OWNER= root
$$ XWIN-NMR		Version 3.5
$$ Fri Jul 26 14:23:39 2019 Russian Standard Time (UT+4h)  she@DPX200
##.OBSERVE FREQUENCY= 200.13155
##.OBSERVE NUCLEUS= ^1H
##.DELAY= (6, 6)
##.ACQUISITION MODE= SIMULTANEOUS
##.ACQUISITION SCHEME= undefined
##.AVERAGES= 8
##.DIGITISER RES= 18
##SPECTROMETER/DATA SYSTEM= spect
##.PULSE SEQUENCE= zg30
##.SOLVENT NAME= CDCl3
##.SHIFT REFERENCE= (INTERNAL, CDCl3, 0, 15.7039)
##AUDIT TRAIL= $$ (NUMBER, WHEN, WHO, WHERE, WHAT)
$$ ##TITLE= Audit trail, XWIN-NMR		Version 3.5
$$ ##JCAMPDX= 5.01
$$ ##ORIGIN= Bruker BioSpin GmbH
$$ ##OWNER= she
$$ F:/spectra/data/she/nmr/H-F/1/audita.txt
$$ ##AUDIT TRAIL=  $$ (NUMBER, WHEN, WHO, WHERE, WHAT)
(   1,<2019-07-26 14:22:46.51 +0400>,<she>,<DPX200>,
      <created by zg, POWCHK disabled, PULCHK disabled
       configuration hash MD5:
       00 E9 B6 7A A2 85 ED C7 34 08 36 98 17 FE 4E 26
       data hash MD5: 16K
       C3 9D 1D 91 8D CE 40 F6 1E 63 5E 56 36 74 C6 7C>)
$$ ##END=
$$ 
$$ hash MD5
$$ 23 25 D4 53 BE 36 51 F4 02 F8 B7 DE 81 4B 2B 89
##$RELAX= 
##$RELAX= 
##$RELAX= 
##$RELAX= 
##$RELAX= 
##$RELAX= 
$$ Bruker specific parameters
$$ --------------------------
##$DU= <F:/spectra>
##$EXPNO= 1
##$NAME= <H-F>
##$PROCNO= 1
##$TYPE= <nmr>
##$USER= <she>
##$AMP= (0..31)
100 100 100 100 100 100 100 100 100 100 100 100 100 100 100 100 100 100 
100 100 100 100 100 100 100 100 100 100 100 100 100 100 
##$AQSEQ= 0
##$AQ_mod= 1
##$AUNM= <au_zg>
##$AUTOPOS= <>
##$BF1= 200.13
##$BF2= 200.13
##$BF3= 200.13
##$BF4= 200.13
##$BF5= 200.13
##$BF6= 200.13
##$BF7= 200.13
##$BF8= 200.13
##$BYTORDA= 1
##$CFDGTYP= 0
##$CFRGTYP= 5
##$CHEMSTR= <none>
##$CNST= (0..31)
1 1 145 1 1 1 1 1 1 1 1 1 1 1 1 1 1 1 1 1 1 1 1 1 1 1 1 1 1 1 1 1 
##$CPDPRG= <>
##$CPDPRG1= <>
##$CPDPRG2= <>
##$CPDPRG3= <>
##$CPDPRG4= <mlev>
##$CPDPRG5= <mlev>
##$CPDPRG6= <mlev>
##$CPDPRG7= <mlev>
##$CPDPRG8= <mlev>
##$CPDPRGB= <>
##$CPDPRGT= <>
##$D= (0..31)
0 1.2 0 0 0 0 0 0 0 0 0 0.03 0 0 0 0 0 0 0 0 0 0 0 0 0 0 0 0 0 0 0 0 
##$DATE= 1564136565
##$DBL= (0..7)
120 120 120 120 120 120 120 120 
##$DBP= (0..7)
150 150 150 150 150 150 150 150 
##$DBP07= 0
##$DBPNAM0= <>
##$DBPNAM1= <>
##$DBPNAM2= <>
##$DBPNAM3= <>
##$DBPNAM4= <>
##$DBPNAM5= <>
##$DBPNAM6= <>
##$DBPNAM7= <>
##$DBPOAL= (0..7)
0.5 0.5 0.5 0.5 0.5 0.5 0.5 0.5 
##$DBPOFFS= (0..7)
0 0 0 0 0 0 0 0 
##$DE= 6
##$DECBNUC= <off>
##$DECIM= 24
##$DECNUC= <off>
##$DECSTAT= 4
##$DIGMOD= 1
##$DIGTYP= 9
##$DL= (0..7)
0 120 120 120 120 120 120 120 
##$DP= (0..7)
150 150 150 150 150 150 150 150 
##$DP07= 0
##$DPNAME0= <>
##$DPNAME1= <>
##$DPNAME2= <>
##$DPNAME3= <>
##$DPNAME4= <>
##$DPNAME5= <>
##$DPNAME6= <>
##$DPNAME7= <>
##$DPOAL= (0..7)
0.5 0.5 0.5 0.5 0.5 0.5 0.5 0.5 
##$DPOFFS= (0..7)
0 0 0 0 0 0 0 0 
##$DQDMODE= 0
##$DR= 18
##$DS= 0
##$DSLIST= <SSSSSSSSSSSSSSS>
##$DSPFIRM= 0
$$ [...]
##$SUBNAM2= <"">
##$SUBNAM3= <"">
##$SUBNAM4= <"">
##$SUBNAM5= <"">
##$SUBNAM6= <"">
##$SUBNAM7= <"">
##$SUBNAM8= <"">
##$SUBNAM9= <"">
##$SW= 24.9336996594482
##$SWIBOX= (0..15)
0 0 2 0 0 0 0 0 0 0 0 0 0 0 0 0 
##$SW_h= 4990.01996007984
##$TD= 16384
##$TD0= 1
##$TE= 0
##$TE2= 300
##$TE3= 300
##$TEG= 300
##$TL= (0..7)
0 120 120 120 120 120 120 120 
##$TP= (0..7)
150 150 150 150 150 150 150 150 
##$TP07= 0
##$TPNAME0= <>
##$TPNAME1= <>
##$TPNAME2= <>
##$TPNAME3= <>
##$TPNAME4= <>
##$TPNAME5= <>
##$TPNAME6= <>
##$TPNAME7= <>
##$TPOAL= (0..7)
0.5 0.5 0.5 0.5 0.5 0.5 0.5 0.5 
##$TPOFFS= (0..7)
0 0 0 0 0 0 0 0 
##$TUNHIN= 0
##$TUNHOUT= 0
##$TUNXOUT= 0
##$USERA1= <user>
##$USERA2= <user>
##$USERA3= <user>
##$USERA4= <user>
##$USERA5= <user>
##$V9= 5
##$VALIST= <valist>
##$VCLIST= <CCCCCCCCCCCCCCC>
##$VD= 0
##$VDLIST= <DDDDDDDDDDDDDDD>
##$VPLIST= <PPPPPPPPPPPPPPP>
##$VTLIST= <TTTTTTTTTTTTTTT>
##$WBST= 1024
##$WBSW= 4
##$XGAIN= (0..3)
0 0 0 0 
##$XL= 0
##$YL= 0
##$YMAX_a= 115324
##$YMIN_a= -113638
##$ZGOPTNS= <>
##$ZL1= 120
##$ZL2= 120
##$ZL3= 120
##$ZL4= 120
##$ABSF1= 10
##$ABSF2= 0
##$ABSG= 5
##$ABSL= 3
##$ALPHA= 0
##$AQORDER= 0
##$ASSFAC= 0
##$ASSFACI= 0
##$ASSFACX= 0
##$ASSWID= 0
##$AUNMP= <proc_1d>
##$AZFE= 0.1
##$AZFW= 0.1
##$BCFW= 1
##$BC_mod= 2
##$BYTORDP= 1
##$COROFFS= 0
##$CY= 11.3945322036743
##$DATMOD= 1
##$DC= 2
##$DFILT= <>
##$DTYPP= 0
##$F1P= 20.1537800932815
##$F2P= 0.134698688090026
##$FCOR= 0.5
##$FTSIZE= 0
##$FT_mod= 4
##$GAMMA= 1
##$GB= 0.15
##$INTBC= 1
##$INTSCL= 1
##$ISEN= 128
##$LB= 0.24
##$LEV0= 0
##$LPBIN= 0
##$MAXI= 10000
##$MC2= 0
##$MEAN= 0
##$ME_mod= 0
##$MI= 1.114404
##$NCOEF= 0
##$NC_proc= 0
##$NLEV= 6
##$NOISF1= 3.799351
##$NOISF2= 2.8
##$NSP= 1
##$NTH_PI= 0
##$NZP= 0
##$OFFSET= 15.70392
##$PC= 1
##$PHC0= -9130.678
##$PHC1= 13.80097
##$PH_mod= 1
##$PKNL= yes
##$PPARMOD= 0
##$PSCAL= 0
##$PSIGN= 0
##$REVERSE= no
##$SF= 200.130013532006
##$SI= 16384
##$SIGF1= 3
##$SIGF2= 2
##$SINO= 400
##$SIOLD= 16384
##$SREGLST= <1H.CDCl3>
##$SSB= 0
##$STSI= 0
##$STSR= 0
##$SW_p= 3612.71676300578
##$SYMM= 0
##$S_DEV= 0
##$TDeff= 0
##$TDoff= 0
##$TI= <>
##$TILT= no
##$TM1= 0
##$TM2= 0
##$TOPLEV= 0
##$USERP1= <user>
##$USERP2= <user>
##$USERP3= <user>
##$USERP4= <user>
##$USERP5= <user>
##$WDW= 1
##$XDIM= 8192
##$YMAX_p= 0
##$YMIN_p= 0
$$ End of Bruker specific parameters
$$ ---------------------------------
##NTUPLES= NMR FID
##VAR_NAME=  TIME,          FID/REAL,        FID/IMAG
##SYMBOL=    X,             R,               I
##VAR_TYPE=  INDEPENDENT,   DEPENDENT,       DEPENDENT
##VAR_FORM=  AFFN,          ASDF,            ASDF
##VAR_DIM=   8192,          8192,            8192
##UNITS=     SECONDS,       ARBITRARY UNITS, ARBITRARY UNITS
##FACTOR=    0.0002004,     1,               1
##FIRST=     0,             0,               0
##LAST=      1.6414764,     0,               0
##MIN=       0,             -113638,         0
##MAX=       1.6414764,     115324,          0
$$ Real data points
##PAGE= N=1
##DATA TABLE= (X++(R..R)), XYDATA
0@%%%%%%%%%qJ6j6J6j6J6k4L2l2M0m8N6o4P2q8J01j14J30j46J65j84K06k35K63
33A38k92L27l62M02m48M95n47O05o68P39q18R06j008J122j250J400j576J785k034
52a084K342k742L268l994N061o781R969j7609O3148M4184k09400J29847O7354
65H3563j85026R6617J05107j63213M3189Q5838j19394L0498Q3808q2817J2688
76i142L6501o3467L3502L4605n3420L1073Q829n5631M0690K0428m5467L2280Q800
89A9581m6230K0537J8356j4393J0084r047m011R287k0824K1445K1851m8443J7847
102c960L2043o1637K2421N8547o6248j628N5949n7838J00O1757m8703p006M4256
115B8053m8139M786M4321m4834J5744L1158o8072K6671N2907p2908K2276N9499
$$ y = [0, 0, 0, 0, 0, 0, 0, 0, 0, 0, -8, 8, -8, 8, -8, 8, -16, 16, -16, 24, -24, 32, -32, 40, -48, 53, -61, 69, -77, 88, -96, 110, -125, 138, -154, 173, -189, 213, -235, 260, -287, 318, -350, 389, -429, 477, -531, 591, -659, 741, -835, 950, -1084, 1258, -1484, 1784, -2210, 2851, -3930, 6039, -11570, 51578, 95762, -113638, 16209, 83563, -101463, -4846, 100261, -62952, -19763, 66075, -53319, -22821, 60987, -21830, -9142, 27359, -36108, -2606, 31999, -21421, 9652, 18481, -37150, 3540, 23968, -21499, 10781, 19581, -26649, -6112, 12244, -2149, 7935, -1112, -5123, 4164, -16660, 4785, 26636, -21807, -3960, 28083, -33554, -11133, 47414, -18834, -20462, 35487, -22351, -22251, 39506, -9197, -16203, 28053, -20086, -15300, 29021, -15813, -69, 31089, -36983, -10312, 42595, -30313, -8037, 51462]
127E1462q8226P839Q1742p3933p682Q4973o8264l5249Q3781l0616l6468O0727
139C0086k2112m0869M2043N44k0472K0831n596j1719N023o544J5961P368k6091
152a1547J1369P618k6733K3515J7481l5707J1051J6732l1735J3835K4112k5926
164e935L701R914k3272J4922J5598k2268R681N387k4348J7279J1925k2898J5137
177D823P253k9086J2786J6289j7592Q451M883j8780R502N824r517J2933m522j3195
191i948J6260q514j0643K9920j0298k6057K8245l449k5762L2731K697l5207K3328
204C303R643l2213J9633J9188k8184K852J3809j6079M599J4123r852m660K897
217i41n87J863j483M207M008j3762K9J2973q547J277J1981j6525m308J7829q856
$$ y = [51462, -36764, -28925, 52817, -21116, -28798, 56175, -12089, -47338, 36443, 5827, -30641, 30086, 7974, -32895, 9148, 9692, -10780, 10051, 4455, -7264, -2241, -8785, 7176, 14544, -11547, -178, 7440, -19293, 4222, 21703, -14004, -2953, 13779, -17956, -4121, 19991, -5935, -2234, 7680, -15592, -670, 14928, -7340, 2341, 7728, -16620, 659, 12584, -10314, 4823, 12076, -17010, -4224, 12065, -5527, 2924, 7807, -10973, -1471, 4353, -5164, 7769, 3247, -9948, 6312, -2202, -12845, 17075, 6777, -19280, 8965, 5516, -20246, 12485, 15182, -20025, 3303, 12946, -19267, 366, 19554, -8630, -5778, 8031, -8048, -3449, 10674, 822, -3838, -941, -1528, 335, -1148, 3059, 7067, -6695, -6666, 6307, -2240, -963, 11018, -5507, -9815, 8014, -842]
232h42m285J5353j0417q676J2418m912j606J2352r055p535Q621l009Q47P295p783
247a234j363M742p026L889P386p282J189R90r247Q734P005j1395M050L611j2304
262h255P651Q130j2172N523O612j5779L211J3064q966l38P076j0334q56J0517
276E084m038l068N315k962m362K282L509J317k733j161L88l418L741O335p376
291a147k158P520o716l132J1505l181o626P098m180n972J1586O67r559M687J383
306A775o365M772L670m499J065L82m185J644M163K54k300k642Q58J815q61J939
322A485Q89m166N86J812l227L333M472o359k597M666j445K9M234l694k959L870
338I29j190j804M332K45l749k94L50Q79K440n84k397m55L95J187M98p99J087j91
$$ y = [-842, -5127, 10226, -191, -8867, 3551, -1361, -2967, 9385, 330, -7205, 1416, -1593, -746, 6549, -1234, -2597, 2145, -4881, -992, 6394, -888, 301, 1291, -7956, 778, 7783, -3612, 438, 4049, -8255, -604, 7526, -4646, 877, 7489, -8290, -5079, 7985, -981, -1319, 5757, -4577, -5433, 5084, 1046, -2022, 3293, 331, -4031, -1749, 1760, 3077, 344, -817, -429, -3847, -106, 6229, -1147, -3305, 4215, -2501, -5633, 5872, 2691, -3935, 3163, -1017, -6989, 4597, 5264, -4295, 392, 1775, -4590, 182, 3852, -647, 418, 800, -3385, -1741, 2422, 2676, 376, -2266, -1408, 407, -454, 1485, 2374, -1792, -1206, 606, -2621, 712, 5184, -1175, -3772, 894, -551, -522, 3712, 18, -2941, 929, -261, -2065, 2267, 2512, -1237, -1531, -1181, -302, 2138, 1554, -843, -1298, -903, 284, 782, -17, 1070, 879]
356H79l369Q18L472p71o14L32k905L27M059j336k271K623n87l130J941K050j319
373A99N83j19l204R77L995j139k678J628M33k378J173K217j613k09J332k956o17
390b376N106o35m473K304J234l389K528K304m274J140L174n039j83O339k561l931
406b732L753q05k687M462j08m709L186K010m883J162M365k786j791K434j530r81
422a640L851p75m064K499K255l659K84L455k197j266K437k048r02M360j458l986
438b854L223J176l129J784J137k530J489Q08l070J486K639k178r31R21l58Q40
454D53K29j444O60P84j045m7L40K81Q39j262j323J764Q81j215r8N3p1O09m03n23
474e38P07M67l87j058r8K100k32k271J173Q43j610J452L13k653K402J454m336
$$ y = [879, -2490, -1672, 1800, 1029, 415, 747, -2158, -1831, 2228, 892, -1379, 1244, 657, -2473, -532, 1518, 199, 782, 663, -2541, -1564, 2431, 1292, -1386, 242, 675, -1703, -530, 1687, 74, -135, 1197, -1759, -2376, 2730, 2095, -2378, -74, 1160, -2229, 299, 2603, -1671, -531, 2643, -2396, -2579, 3760, 1199, -2732, 1021, 216, -2471, 1991, 1883, -2826, 360, 2370, -2513, -1351, 3014, 228, -1563, 871, -659, -1640, 2211, 1436, -2628, -129, 2126, -1533, -1249, 2206, 9, -1257, 1180, -868, -1770, 2590, 1132, -2854, 369, 1545, -1584, 200, 1337, -1193, 296, 1104, -1966, -480, 2159, -19, -950, -29, -387, 453, 682, -762, -102, 682, -363, -410, -70, 211, 1050, -212, -1535, 229, 1110, -105, -203, -150, -221, 388, -15, -538, 169, 636, 249, -809, -907, 1193, 961, -1310, -137, 706, -904, 548, 861, -1792, 610, 2064, -2272]
491b272J186L664l095n77K558k625J22L550k910j737L838q40k692K116N90j373
507d97R38k94j446J431J432j662j299J577R29j692m3J574j081l43J471j795m23
524a223L446j633l185L269Q22k972J937O30l016K332J621m106J184L631l231j487
540a981L173q61j311K173j146j950K820P70l292Q03K538j930r96J980p84p36K040
557A310j239k083K904Q27l113P36J864j619K24Q91j630P05J707k079o87K245l09
574F54j089L07j87L64O91r24m88Q53L26l23p50J01J353m35j362P60N41k84L14
593D22q85k63J703n63j384R82J82KL55j553N07J998j916m73J982j753L70K072
611A785l544O39M334m169j402M823k942j131M571m170j513O361l785l259O287
$$ y = [-2272, -1086, 2578, -517, -1094, 1464, -1161, -1039, 2511, -399, -2136, 1702, 862, -1830, 286, 876, -497, 441, 147, -1299, 132, 1564, -98, -1397, 180, 1109, -583, -626, 948, -133, -476, 995, -800, -1223, 2223, 590, -2595, 674, 1496, -1476, 461, 1091, -1925, 407, 2028, -2078, -894, 2737, -494, -1981, 1192, 331, -980, 1193, 47, -1903, 917, 1687, -1605, -802, 1736, -194, -1190, 790, 6, -730, 1310, 71, -2012, 892, 1719, -1394, -658, 1206, -413, -189, 702, -928, -223, 1484, -595, -1282, 963, 654, -435, -128, -315, 49, 740, -184, -672, 181, 507, 184, -566, -465, 888, 453, -909, -149, 392, 108, 422, -463, -726, 977, 414, -970, 12, 194, 196, 551, -1002, -495, 1503, -413, -886, 1096, -657, -287, 1785, -1759, -1120, 3214, -955, -2357, 2466, -476, -1607, 2964, -1206, -2719, 3642, -143, -3402, 2885]
626B885k272l406N080k374k658N805k422m015N011o33k663L161j857j234L644
641B052k422j213L297k073r4J778l544K339L009n618J623L681n355K591L237o962
657c674L377M768q258K444N955p548K094M864q054L299O069r095J974O576p848
672c057J985N366q150L100N909r150K391O575q043J971N232p872L118N502q611
687c734K236N923p046J848M045o602L341L713p136K964L748n897K764J805n006
702c034M608P07o109M910R15m975N221j395n067P558j748o648Q317j163p154Q202
718C145j552p259R902j364r732R533R87r273Q035P35q962Q082J294r232P250K382
734C971q472N252J769o405N885O83p111N465J646n869M342M50m726M966m16m932
$$ y = [2885, 613, -2793, 2287, -87, -2745, 3060, 638, -3377, 1634, 1001, -1662, 1499, -358, -1592, 2052, -370, -1583, 1714, -359, -453, 1325, -2219, 120, 3129, -2489, -866, 2815, -2540, 51, 3288, -3674, -297, 4471, -3787, -1343, 4612, -2936, -842, 4022, -4032, -733, 5336, -3759, -1785, 4791, -3057, -1072, 4294, -3856, -756, 5153, -3997, -1606, 4969, -3074, -1103, 4129, -3743, -625, 4877, -3734, -1498, 4425, -2621, -773, 3272, -3330, 11, 3724, -3412, -448, 3300, -2597, 167, 1972, -3034, 1574, 2281, -3828, 1082, 1997, -2978, 2243, 848, -4219, 3339, 1591, -5057, 3260, 2097, -5057, 3145, 1593, -5666, 4236, 2872, -6860, 2673, 3660, -5613, 2422, 3157, -5805, 2277, 3571, -5661, 1589, 3971, -4501, 751, 2520, -3885, 2000, 2683, -4428, 1037, 2683, -3186, 1156, 1606, -3120, 1846, 1430, -3502]
750c502N135J56m314L650q83k302M716k674k898N488k350k605N078l462j782O444
766C895m533l026P307l352l678O416l235k766O660l991l521P186k671l706N489
781B474k938k036O055m046k706O625l496l128O104k992k482N888l731l304O686
796B973j759l945M218j213k186L719j684j777L277j501j477K085j138O20J421
811A633l445R15K967k936M39K023l158J286K351l809J064L118l384j63K145k004
827i58J374J163l373J369K120k778Q44J355k339J558Q77l052J778J922k714L63
843d91J053j283J204J93j824J304O21j314N40k32m3J558j516j160K230l56j198
860g14J206o24l82J423j138p08J624k01o64k7n65J249N39j860O75Q58j385R01
$$ y = [-3502, 1633, 1789, -2525, 1125, 242, -2060, 2656, -18, -2916, 2572, 222, -2383, 2695, -767, -2549, 3895, -638, -3664, 3643, 291, -3387, 3029, -206, -2972, 3688, -303, -3824, 3362, 691, -3015, 2474, -464, -2500, 3555, -491, -3197, 3428, -68, -3196, 2908, -84, -2566, 3322, -409, -3713, 2973, 1214, -2731, 1487, 274, -1912, 1807, 123, -1654, 1623, 122, -1355, 730, -408, 212, 1633, -1812, -897, 2070, -866, -427, 1596, -1562, -276, 2075, -1734, -670, 2448, -936, -1099, 1046, -958, 416, 1579, -1794, -425, 1695, -1083, -239, 1116, -1223, 335, 1212, -1840, -62, 1860, -854, -491, 562, -721, 483, 676, -1148, 156, 777, -537, 3, -229, -272, 1286, -230, -1390, 840, 484, -714, 492, -132, -514, 909, -229, -937, 687, 486, -178, -205, -770, 479, 1018, -842, -167, 691, -694, 207]
878B07L25j642J871L97k810J323J559j643N97M5j426J763L41k042J466L91j594
895h72J312m37j194K680o69k873K424N87j983J794l61j985K450M5k573J975Q84
912A204j986P74L1p25J734n44j643J342J15o61Q25q39k1J559j564p11J918p40
930F8k81R26j803O13K241k430m05K485j778l94J974k134J90K868k754j129L260
947A517j305j357K282j410q25K573j431j626K473j04j660R04q3j91J056r66o34
964g87J238l16k87L15o98P78O92j809K88J521j016j42N87j117P79J114j850QJ658
983I56r79m35P24o18N27O59j591J14J430p09l34L91n74P11L54j404M77J167r92
1002a26j53M06o05Q87M64j798M66J471j195k95Q85o58K65O68j383O2J663p61j028
$$ y = [207, 532, -1110, 761, 1158, -1652, -329, 1230, -413, 184, 229, -1197, 566, 907, -1135, 331, 722, -872, 440, 3, -1191, 1489, 820, -2053, 371, 958, -1025, 769, 408, -1577, 873, 918, -1655, 320, 1204, -782, -8, 23, -702, 1032, 488, -1155, 187, 302, -359, 466, -373, -394, 1165, -399, -1110, 808, 68, -213, 713, -1090, -477, 1764, -666, -1071, 1414, -364, -758, 1216, -918, -728, 2140, -614, -1743, 1517, 212, -1145, 1137, -273, -1098, 1475, 44, -1582, 891, 787, -873, 31, -52, -243, 813, -153, -787, 451, 135, -152, 163, -535, 243, 935, -874, -586, 935, -81, -223, 364, -753, 26, 1140, -710, -702, 956, -23, -458, 266, -352, 175, 834, -757, -643, 787, 78, -256, 135, -439, 272, 626, -778, -301, 866, -126, -279, 127, -478, 409, 873, -925, -459, 1012, -183, -478, 407, -251, 14, 682, -701, -639, 1024, 263, -765]
1021g65Q02J67k81L60m80k71Q23M2p78q6P53L49r07l51Q31N9l46K59m51p9J146
1042G96o71j230J476N46j587L46P23p80O02M90j600M34J517j146p46J288j07o67
1060c16L84k49j75J022j85j241L73J055m42p09M73L07l83L6O0l57O33N14j323
1079e23l58J516j18j013N86L8n05P57k31q57J043N39j504n8J172j52l72O6l50
1098c24J18O20k46o28M56N98o98n85P45N26n15j75n6k39O87L71j072l4J092n29
1118A12q51Q09M15m73N1k72l39Q48N21j144k71R70j13o91M23L34l94J84j57o55
1138f93Q41R36j272p08J232Pp30N57J9n71P17j19j151J019J067j426n48J115j76
1157A16k99O48n35n71J062K3j246P43J048j018p71P93J42j49M92n25p48J024M83
$$ y = [-765, 37, 204, -77, 283, -197, -468, 355, 397, -381, -467, 286, 635, -272, -623, 208, 267, -79, 180, -271, -350, 796, 125, -1105, 371, 917, -670, -324, 399, -381, 221, 711, -889, -455, 1062, -84, -830, 458, 351, -316, 68, -181, -356, 666, 481, -760, -387, 668, 226, -483, -10, 297, -86, -50, 10, -347, 286, 800, -523, -881, 635, 517, -496, 90, 128, -377, 380, 149, -708, 335, 874, -630, -688, 484, 332, -40, 26, -324, -206, 414, 168, -460, -4, 594, -104, -689, 56, 582, 67, -108, -164, -403, 284, 655, -417, -451, 641, 112, -739, 70, 485, 12, 63, -209, -548, 300, 821, -323, -594, 376, 263, -428, -5, 329, -65, 119, -38, -693, 148, 1084, -188, -896, 336, 343, -387, 170, 189, -382, 335, 216, -935, 84, 1151, -275, -823, 292, 116, -183, 465, -70, -641, 421, 444, -802, -59, 989, -29, -800, -7, 135, -14, 478, -47, -795, 229, 712]
1176G12j349K92J210q43o59P78j71o1Q58q38r12J312L74j123K18O20m74n8J11
1195ck79M83M07p62n66P00O77o25m35N26Pl63L66j82l00J012k87j495J007J038
1215I26j124N2M74q31N17O58j259K96J135r09n40O05J42K57k69p52O27K78l93
1234a10M30m83k48J205q93j099J974k9j548J063j69j001J894l98j990J835M84
1251I17j905J010N14j000J016l67j281J425L55r87L89k94m8R82j146j18J502j165
1269b01k72J098j493Q32J752k828K8K801k274l55K568k457j02K837k911n66L734
1286B191k158j614K797j548o85K694j960j087K705j341j047J891j050J0J296k142
1302a048L50K099j788oJ233j833R57J307k527J035J857k603M17J561j979J280
$$ y = [712, -637, -345, 865, 22, -637, 141, -30, -91, 767, -71, -983, 329, 703, -420, -202, 418, -56, -114, -3, -282, 201, 608, -154, -720, -20, 657, 32, -403, 123, 130, -233, 133, -49, -349, 663, 376, -1119, -112, 926, -198, -146, 328, -503, 14, 672, -587, -291, 844, -65, -605, 0, 142, 399, 130, -622, 5, 283, -110, 320, -163, -411, 794, -99, -1198, 776, 747, -801, 262, 93, -908, 986, 588, -1402, 433, 917, -988, 22, 536, -464, 552, 185, -1096, 329, 684, -303, 86, -208, -256, 726, -420, -538, 964, -201, -473, 625, -868, -36, 1716, -1112, -1084, 1717, -557, -912, 1656, -801, -903, 1934, -977, -1543, 2191, 33, -1581, 1216, -332, -1017, 1677, -283, -1370, 1335, -6, -1053, 838, -212, -202, 1094, -1048, -698, 1401, -387, -393, 840, -993, -36, 1271, -1256, -221, 1636, -967, -550, 1011, -968, 312]
1318C12J118k968J161J912k543Q26J398k323J287R71k846J704J809k932P93J217
1334H96k146J705Q28k897J788J241k896J487J220k477J827O00l349K327J896l522
1350a472J231J706l012J500J685l203J334K259l287L01K365j858L31J159k160
1365a121P48J581j812L56R48j274P79O8j391J855L55k286J217M34j455J932l28
1382F06k248K435J67k692K265N62k402K081j96k633L076M97l386K265O85k780
1398a698K426L60k973K771O15l645K235J341k638J733K66k625K486O07k844J989
1414D06O64k372J750L3j898K524n4k818K015N72j836J749k37j854K069r0j927
1431a304J735L00j259Q31o07l97J800r84r65J420q49j52J458j673J02K068k128
$$ y = [312, 1430, -1538, -377, 1535, -1008, -182, 1216, -1107, 180, 1151, -1695, 9, 1818, -1114, -321, 896, -1250, 455, 1283, -1614, 174, 1415, -1481, 6, 1226, -1251, 576, 1176, -2173, 154, 2050, -1472, -241, 1465, -1547, -47, 1638, -1565, -231, 2028, -1259, -958, 1407, -451, -120, 1039, -1121, -373, 1208, -604, -248, 700, -574, 205, 273, -1118, 737, 1092, -1194, 23, 457, -998, 934, 606, -1642, 793, 960, -1732, 533, 1095, -1307, 774, 578, -2055, 1021, 1518, -1868, 397, 1082, -1698, 728, 1088, -1885, 886, 1501, -2144, 91, 1432, -1206, 527, 793, -1832, 654, 1261, -1583, 406, 1070, -1302, 448, 481, -1417, 1107, 1053, -1765, 250, 822, -1014, 735, 498, -1356, 713, 623, -1304, 431, 731, -528, 303, -304, -701, 1099, 115, -850, 570, -279, -431, 1027, -646, -544, 1524, -604]
1448f04n91K399j424l57J817k103j78K754j938j043K514j251j020J954j219n84
1464h74K323j360j537K104j57j169J120l36p30J088k25r71Q47M98o75l83K30M77
1482B70K0l21k4j46J87M01o23k13J089l44r37N22L23j35K69m98l86P59J13n63
1502b37J58K47q4j26l03K44N56k22m95j29L18M73k63m67L60J84l26M5p9J94M50
1523D98o58n15Q72J84l81Q1l49O1O67n26l46P65j51m22J63k93M95O06j109k51
1543f09J084m60k37O27p20R6R71j088m32J560m31r23O98k02k92J003n52p87R95
1562C01O5p64K98K07K2J91o87j03Q53j48l79K00l28K88M66q48M6R93o39m71N39
1583A02l03K86N74j135j06J230o15m51P50m02p3O56r88l2J394o74q97Q41j44k30
$$ y = [-604, -1195, 1204, -220, -577, 1240, -863, -1041, 1713, -225, -1268, 1246, -5, -1025, 929, -290, -874, 1449, 89, -1448, 656, 499, -670, 450, 114, -616, 472, 247, -724, 123, 621, -54, -437, -207, 270, 290, -31, -55, -201, -14, 387, -236, -449, 640, 296, -641, -119, 204, 69, 338, -160, -546, 213, 326, -237, -79, 168, 84, -42, -345, -101, 455, 233, -262, -391, -73, 400, 137, -330, 30, 214, -112, -67, -146, 48, 498, -160, -675, 197, 381, 0, 81, -268, -207, 460, -66, -412, 353, 202, -220, -57, -350, 145, 751, -358, -609, 475, 15, -222, 405, -315, -219, 752, -336, -768, 792, 361, -562, 136, -66, -358, 645, 93, -694, 301, 366, -398, -100, 107, 129, 320, -367, -470, 383, 235, -144, 56, -272, 16, 482, -366, -320, 673, 34, -437, 102, -201, 85, 659, -476, -582, 648, 33, -418, 332, -70, -143, 513, -475, -507, 887, 213, -684, 157, 13, -217]
1603b17P44n84m88J031l22p31O58J67j49N1o20J36R35n61k77L88m21L27L93j013
1623e53M24J069j278l74J185n26j8P11j151p6J375p96n72R92k94l51L56m75K05
1642a47Q97p89n27O16o3J67J51p57M25N30r02O8P63m21P6M7q33P08P71j031q3
1663c34N81m46J81L09p09N11O03j166r5J025l02j26J69o05K18O87n64k79O34q6
1683B06m21KJ32L70M0m97j39J61L15J85n01j76O83k68o43O22L27m24J05l29k90
1704e40R03K20r06L8N07k92n7K83j79J31Q6n70m9P73J67n76k86K08K77jj57J8
1726bP8Qk44j79M99L63m87n13K59L45J07l3l30m5L07j54k79M09L54m07m05K0L15
1749a4L94o1n76r2N13m7l14K87J82k83j88m9J32N33O0p86k00O02J15j74J8k3m3
$$ y = [-217, 527, -57, -545, 486, 164, -567, 91, 258, 109, 160, -460, -324, 611, 50, -227, 161, -260, 67, 460, -553, -129, 940, -338, -712, 473, -53, -71, 640, -511, -587, 788, -8, -580, 412, 118, -233, 123, -352, -147, 750, -39, -566, 50, -13, 154, 305, -452, -27, 503, -399, -331, 432, 11, 87, 134, -699, 9, 780, -251, -334, 247, -199, -18, 291, -418, 93, 696, -470, -565, 460, 158, 32, 201, -404, -186, 501, -63, -342, 292, 206, -215, -213, -81, 289, 329, -168, -307, -146, 169, 354, -147, -323, 360, 92, -551, 71, 398, -26, 79, -250, -540, 363, 583, -323, -285, 222, -70, -127, 156, -23, 108, 194, -376, -425, 348, 515, -61, -347, -139, 138, 137, -20, -2, 76, 84, -160, -339, 160, 523, 36, -477, -218, 127, 234, 201, -129, -174, 133, -21, -300, 109, 463, 56, -349, -329, -14, 380, 319, -257, -349, 164, 117, -197, 90, 272, -11, -199, -248, -116, 417, 477, -309, -509, 93, 208, 34, 52, 29, -14]
1772a4n3j67J18N05L0o99k83M92M64j69k64j7j01Q9R6j16K26L43o14n56O64M78
1794D52k72q7l08k07N99J19m92K77K88n74k38L50L92J40l62n40J25M87J21j60
1814A10k12J00Q1l88R1O30q0l95j93k12M76P09n86n62M38k6k48M51Nj36K28o29
1836c48k96R87L03o72q9j57lO11j05l91L70j14n59K61L32K56K7p55k51O81J66
1857B54r3J8m26J11L23n39K44R26p58o03M90k01L18Q50j037o32J069k66m56Q46
1877D38j47m90K89n09m8J143j81p99Q6j37L60N33o65O0M84q55MQ12l19K57K09
1898E25j392L15J325p11j65N43q81J40P28q42M61R15j378l36R95m02M26N62j470
1917f42O6J147q65J72Q47q62j01L56q42P68R54j117k51K77l75Q22K40j162P18
$$ y = [-14, -67, -234, -116, 389, 419, -280, -563, -71, 393, 224, -40, -57, -158, -69, 27, -89, 137, 480, -134, -690, -26, 452, 180, 93, -215, -422, 177, 296, -196, 81, 369, -205, -443, -93, 299, 439, 77, -463, -338, 149, 270, 110, -102, -2, 79, -309, -218, 412, 332, -63, -256, -468, 8, 717, 131, -431, 7, -19, -267, 184, 189, 53, 281, -348, -644, 343, 646, -26, -115, -272, -275, 336, 231, -160, 210, 96, -463, -202, 130, 386, 413, -342, -593, 88, 254, 161, 179, -247, -136, 187, -352, -108, 818, 60, -543, -53, -254, 64, 914, -123, -755, 314, 48, -408, 438, 291, -199, 90, -419, -467, 676, 495, -304, -218, -355, 5, 538, -127, -67, 417, -438, -434, 378, 59, 316, 525, -867, -552, 773, 62, -103, 440, -441, -301, 427, -415, 46, 961, -417, -753, 242, -160, 266, 828, -642, -576, 571, -294, -122, 725, -137, -238, 118, -724, 44, 998, -119, -370, -93, -468, 354, 594, -568, 150]
1936A50K74j364Q62Q07r84O31r4j599J310J180j561L22N44j313O58P90j065P51
1954B99M43j589L56R00m40N68k24j350J013N32j007Q89K35j240O01N7q24J533
1972G52J88j777N41M46o68J141l4j322R08Q1j207J195N57j044M05l86q12J644
1990F08K70j349N35n4p41J016J5n72R38o76j083J261J83l63Q25j177p97J809l97
2009B51q61J544p92j177J409m63n90K012q85j935J609K30q84J442n45j432J364
2026B97j48j023J571L7j283N00l28j48J518m82j087O11k75r6R17n69k8O23j325
2045g18j4J398m48j8K89j566N74J489j213J14R55j484O5J144j047O75J043k001
2063g63j71J455p02L96O34j541K76R72j188O35J052j306q6L73q44J137Q42j639
$$ y = [150, 424, -940, -78, 729, -255, 376, 282, -1317, -7, 1173, -388, -66, 478, -835, -177, 613, -452, 299, 742, -847, -491, 409, -31, 537, 313, -1037, -24, 508, -499, 390, 625, -615, -14, 43, -781, 752, 940, -837, -296, 150, -518, 623, 589, -733, 175, 256, -951, 244, 801, -243, 162, -224, -1036, 608, 878, -471, 64, 10, -731, 285, 300, -272, 666, -10, -1093, 168, 351, -12, 813, -364, -1161, 648, 251, -610, 934, 142, -1035, 374, -89, -679, 1333, 448, -1487, 122, 352, -532, 910, 365, -1067, 297, 149, -874, 697, 734, -549, -49, -377, -525, 993, 511, -576, 35, -240, -336, 581, 12, -16, 607, -718, -732, 666, 218, 200, 489, -1077, -503, 986, -227, -113, 842, -642, -577, 567, -480, 195, 1238, -763, -934, 521, -181, 215, 849, -692, -416, 556, -632, 3, 1055, -251, -337, 36, -808, 329, 1171, -468]
2081d68M6O10p42P02N23r35L95P7j093P57Q11m73rn23m76J083J90n60M11m01m81
2102e56O70k84J33J014j066q32J030j90J21R57j405m10J405q63k41J572r03p60
2120f08R22r34J08J828j054j162J128m08k56J242o66n03P83p92l28J196k7l44
2138A25q9p77M57R23n91L4J35p86M82K72n56R38J09j568M97P24n81Q64p0j522
2158i80R00N59j090Q45N44j333M60J79r04J331N13j717L76N33p67R54K48j239
2176e88P63J94j303J013P44j043M02j95r81J366M37j289N92J57j057R10L16r12
2194d74J096j73j593J001P95q49O37k62j093J096K95j007Q66J76j065M93qk63
2212c32J160m67j153Q10j8k93R86o47o76J215p14p28J611k74r67Q44p30l88J822
$$ y = [-468, -422, 188, -554, 148, 671, -264, 131, 208, -885, -128, 683, 210, 201, -322, -798, 285, 475, -85, 326, -75, -556, 114, -170, -37, 977, -89, -921, 109, -81, 40, 997, -408, -818, 587, -276, -517, 1055, 152, -608, 314, -620, -512, 1316, 262, -900, 228, -180, -436, 806, 140, -363, 420, -372, -700, 496, 469, 125, 36, -741, -284, 639, 48, 82, 217, -569, -87, 185, -371, 567, 676, -892, -395, 329, -252, 612, 542, -980, -80, 479, -611, 234, 778, -555, -95, 84, -820, 511, 1024, -693, -317, 216, -551, 403, 651, -588, 175, 369, -934, 79, 823, -220, 182, -13, -994, 372, 809, -480, 112, 269, -788, 122, 438, -474, 622, 449, -1144, -143, 652, -197, 440, 178, -915, 181, 476, -531, 335, 511, -554, -61, -69, -332, 828, 361, -792, 18, 0, -293, 693, 46, -630, 585, -129, -857, 754, 480, -487, 357, -373, -761, 1061]
2231A061o71j208J260m11q31J368l55o86J202q40j017J577O4p76O91p15m72J354
2249E95m70n99J098n67p05Q38l68J14R94j173n73J219m50j16R14j030k38J122
2267F05r93j69J485q01o90P87o23J22J255r57o48R26m28k64P99l42p9L52q50J01
2287d12R49l83j11O4p20N55O12q38K87N17r24J21N58n44N90L55j393K28J047o35
2307g7P2M55q49K13N82p40K18Q26p25l93M15j43L43K88o57j52M28j57J8J96j49
2328A2J84k72m70O24M17m75k8j02l00O22J75o92L34L15p04J40M76j99J19M1p09
2349d92J76P18k25l45J83m5j3J8l3J90J17l19k16P8L55K57m21k85L02J9r4J98
2371A23m4j54J93k53l02O81K01o17j9J80j10L09J4m46J91L30m65q0M82R3l57q1
$$ y = [1061, 390, -818, 442, 31, -800, 568, 213, -473, 729, -111, -1128, 449, 513, -263, 428, -287, -759, 595, 125, -474, 624, 57, -648, 190, -178, -64, 930, -243, -816, 403, -47, -163, 751, -279, -517, 605, -388, -557, 928, 127, -563, 224, -399, -277, 978, 21, -627, 299, -129, -393, 406, 64, -15, 337, -513, -412, 537, 154, 43, 107, -613, -58, 554, -284, 3, 520, -404, -283, 275, -269, 321, 676, -717, -489, 558, -77, -5, 450, -399, -186, 396, -344, -126, 700, -25, -418, -3, -146, 197, 485, -172, -324, 104, -53, -35, 161, 12, 196, -76, -546, 78, 495, 20, -8, -110, -410, 212, 387, -305, 29, 344, -360, -220, 256, 57, 176, 217, -492, -316, 402, 177, -168, 15, -30, -43, -25, -58, 132, 249, -70, -286, -208, 147, 404, -17, -302, 0, 19, -75, 123, 79, -75, 118, -135, -437, 244, 445, -172, -191, -11, -121, 188, 202, -244, -53, 277, -188, -268, 214, 307, -50, -131]
2393a31o8R5L41l0l90M4L12j46k24K64J45k18j34J9J2L34O9n24m8M46m2k77J83
2416C2P7j38l1k0o2L10J09l76k59L75K45l14l2J21r0L6O9k37K08L29m18l64M80
2439E0K22k77J4m9r6K75k5k97J69K72k57k55J47K67l8j48r6L5J50R3k20j58M21
2462A99l8m17J58K86j31j8p3k67M08K66n35n2M26k00j31J94j72J04K65m43j44
2483c15M96L4k47j31R6K03j5k40O9J28k2K1k58J5N41k38m87L41J80k73K31p6l17
2506b64M54Q2o85K99M74l93j19J60j26K45R4m25Q4K94j18r1q7J41K21k90k41L96
2528A05l2p3J28l65O5N69m11l77O12p2l78L30k05q5N36k57n57N91J81m83J54J7
2550gj27L09j27k94L41Q6k15m0o2J61K59m21r6M19j57p1J47k84K16L14o04n4O69
$$ y = [-131, -199, -104, 237, 207, -183, -139, 173, 27, -197, 67, 212, -6, -140, -121, -109, 225, 294, -230, -278, 168, 126, -151, 32, 109, -29, -60, -80, -142, 168, 277, -99, -358, 17, 262, -52, -84, 37, -53, -17, 52, -185, 23, 352, -66, -430, 50, 272, -5, 9, -40, -136, 139, 114, -183, -14, 258, 1, -254, -107, 160, 122, -26, -122, -87, 63, 156, -64, -222, 199, 161, -256, -98, 188, 57, 39, -34, -301, 107, 373, -162, -214, 212, 12, -119, 75, -97, 7, 272, -171, -315, 181, 215, -32, -163, -67, 136, 121, -119, -50, 78, 56, 77, -181, -166, 375, 137, -350, -9, 171, -102, 129, 53, -264, 190, 272, -413, -114, 360, -33, -152, 8, -118, 127, 221, -204, -120, 174, 56, -35, -122, 19, 240, -50, -291, 105, 73, 0, 128, -237, -172, 397, -14, -391, 221, 149, -229, 101, -104, -189, 347, 90, -467, 124, 305, -178, -24, -7, -134, 175, 48, -246, 95, 181, -34, -74, -136, 25, 284, -137, -233, 186, 29, -42, 105, -179, 37, 351, -253, -307, 362]
2573C62l12k06K95l22J10M98n59k10O55k18k82K81j77QL44m26j17N23j51k30J31
2594cj39K16J93n32Q8M95l90o3K58l55K50L96p58M0Q03n57k41N50l57pM69n84
2616b28p9P07l01l86L26k8M5J12l89Q1M05l38OJ12k17L78no74M78M33o93K07K81
2639B33m55L40K32q07M52M95p51R0M11m52L16J88p40L90N16o73O5L72l45J82J30
2660A89n37L50L80n31J2J77j66K96j42m06N75K2m96L24J2k40N18l05n59Q08K7
2681C08o80M02J14l99M37j00m74N62J04n14J30J58k7J95l01j65M74j53k35K42
2701G8j14J7K61m41o5N81k06l45K48ol7J91k39r3L11m9k48J06N8J50r2l25K06
2724e3K47j71p6K4j01K32k2l24K84K24l87jJ24p6K99j20l85K52K23k71M8P7r5
$$ y = [362, 50, -156, 139, -183, -73, 425, -134, -344, 311, 93, -189, 92, -85, -77, 267, -159, -276, 247, 96, -134, -3, -142, 74, 267, -265, -177, 318, -72, -135, 123, -232, 18, 414, -344, -304, 499, -58, -299, 251, -106, -113, 356, -228, -307, 400, 99, -287, 39, 11, 56, 168, -221, -140, 265, -73, -67, 45, -172, 206, 201, -473, 5, 438, -255, -48, 233, -222, 118, 350, -457, -5, 490, -261, -171, 240, -212, 104, 292, -448, -58, 458, -215, -150, 222, -123, 59, 189, -348, 2, 382, -149, -137, 40, -126, 170, 28, -378, 197, 219, -277, 47, 59, -181, 337, 32, -527, 281, 308, -372, 30, 144, -255, 182, 82, -392, 170, 274, -240, -110, 48, 21, 216, -85, -250, 224, 71, -164, 78, -36, -19, 242, -199, -264, 317, 111, -234, 14, 8, -29, 162, -77, -170, 141, 92, -156, -50, 8, 158, 66, -259, -53, 194, 23, -53, -29, -130, 102, 80, -244, 40, 264, -123, -124, 0, -76, 223, 103, -282, -30, 193, -78, -30, 47, -48]
2747d8J14p9k33K76K38k28k52J04K30l6j62N9P8j00R4q3j68L94P4n90J37M13k64
2770c2O7R3m06K53L30m61k4M76k58k07J55r6K11K09n13l1M11j89l8J39k25J26
2792a0J74m56J45M56k40k14R3j40K66J65l94K0K95k04p6J20m3K53j51m24L11L04
2814B50k40P9r7k18L81n4l93L81J52m58J78Kj74N89k40o48N52J98n06L94Om13
2836b79N17j24o58P19L14q13K59J77m41N38Q1p18M39K76o14K84K35l29L66k14
2856A5n47O89J96n72L06q2l21N28r9m41O24p5o28M09N4k06N01l29m91O31Nl88
2878b21M09j44k46M18l58j99P74k88m47L64j78LN61n39k23O47m12k40O39l45j03
2899a28M88o27j71R32l86m10N50l84j27O71n25j85P87m59m61N75r5p4L39n31q6
$$ y = [-48, 66, -13, -246, 30, 268, 40, -212, -108, 122, 86, -76, -17, 61, -39, 55, -28, -196, 198, 272, -318, -181, 232, -32, 35, 128, -278, -25, 305, -156, -180, 296, 38, -169, -14, -110, 101, 310, -203, -234, 177, -12, -50, 89, -136, -10, 164, -292, -147, 309, 69, -145, -52, -192, 74, 239, -155, -135, 160, -44, -120, 0, -43, 210, 59, -365, -54, 250, 10, 89, -8, -226, 155, 101, -292, 89, 241, -217, -39, -37, -211, 378, 138, -510, 42, 240, -266, 128, 134, -279, 238, 114, -544, 175, 489, -324, -65, 112, -329, 209, 290, -428, 11, 287, -327, -43, 192, -137, 229, 15, -532, 157, 353, -219, 87, 5, -316, 212, 113, -328, 296, 221, -407, 2, 56, -150, 351, 22, -469, 162, 167, -221, 188, 44, -202, 216, -142, -341, 433, 145, -302, 62, -116, -113, 448, -91, -314, 333, -79, -319, 320, -25, -128, 360, -267, -438, 494, 108, -302, 248, -136, -263, 408, -117, -302, 485, 26, -435, 140, 45, -29, 310, -221, -307]
2920c07O08k95j86L70k34o8K56l79J37N12m65k18L38j62J34K42m36N8L56l73p1
2941a83L77j56mK1l71K67L57l23n0Q4j68K38L0l38L34J20m60J04K11j07K42j47
2963G8m57M27K02m08J55J43k73J55J2k86L82K22n55J2K99j13R8K6l09J72J74k59
2985a03LJ99k4n2j25r2L31P7k82K5N2k0Q2r5n7K37p9k92J38J65L0m0j76r2L04
3010A14J4j48nJ3K8J8j93J86K14k02j89O4N3J55L8l24J03K06j96l9J78q3N2nk75
3035b23J76L35k25j94Q5K5P1J6j74J16J44k06j12J78J05K6j87j61K04J52j60k
3057a1L4n2J08j59o9K73M1k57l5Q0R0J16j54j72K42j6j28Q2MP4rk34k6L54q0k02
3083a06J04p0P3J64k43p2L29j14k82K18M3l0J26k74n7L43p5j75P9M7m5O8j69P5
$$ y = [-307, 301, 6, -180, 190, -44, -112, 144, -235, -98, 414, -51, -269, 69, -93, 41, 283, -153, -95, 261, -112, -183, 194, 38, 34, 55, -316, -49, 308, -15, -65, 19, -149, 89, 119, -219, 115, 235, -225, -121, 90, -17, 225, 78, -379, 48, 250, -158, -3, 140, -133, 22, 34, -252, 130, 352, -203, -191, 108, -5, 93, 119, -190, -18, 156, -103, -100, 99, 75, 23, -102, -194, 137, 214, -68, -43, 9, -11, 71, -24, -81, 156, 77, -215, -77, 88, 118, 78, -98, -190, 114, 128, -20, -25, -12, 16, 34, -159, 27, 241, 39, -150, -86, -33, 122, 160, -164, -61, 145, -51, -90, 88, 5, 57, 52, -223, -47, 288, 63, -131, -46, -21, 50, 66, -108, 8, 152, -54, -166, 12, 117, 143, -44, -205, -1, 151, -9, -11, 23, -29, 79, -80, -149, 124, 165, -92, -127, -47, 43, 159, 5, -167, 75, 59, -69, 13, 17, 91, 82, -152, -178, 176, 96, -106, -2, -72, 1, 165, -78, -150, 179, 65, -217, 1, 44, 14, 140, -134, -191, 152, 77, -98, -19, 28, -17, 51, -118, -43]
3107d3K35j37j60K3O2J31K9l12J12K23k27J3J25j28J47kl94K39L47k91j29K25
3129H8j40Q6R5k91R3K91k62j18J81J2R2q0k50J83J70j79J1O0r3J58r5k78L69J51
3153B54l55M7R6j48K49j3l84L12J89m83J67K17j85J11rl43K96K73l76QJ61j03
3175a9L2oj22K66J8l15J09L0M9J30k71q9L82j08k83L02l8j81K85j97k28N20n8
3198B08m57K70P6j68J93j11j84L12n0l27K69N7j02J36k05r2M24j66k58K74r9j17
3220a17L34l21p3M95k68l10L28jj27K43l10n3M14k15k45L55n6j31J62k19k2L92
3242B55k46k26K97m3m5J07k31Q6K71l04p3K61j41J19O7m27K49L63n29QM52l68
3264i8K4K86l84Q1M67m46k06M38r5j23J65k08P0K03k60j3K16j35N9lk62L31J16
$$ y = [-43, 192, 55, -105, -82, -20, 111, 140, -172, -60, 163, -64, -51, 74, -54, 93, 91, -303, -64, 283, -8, -137, 88, -52, 34, 129, -162, -69, 222, -40, -158, 23, 35, 127, 47, -203, -20, 150, -29, -18, 42, -51, 107, 12, -266, 103, 254, -101, -54, 42, -106, 143, 130, -254, 58, 247, -236, -69, 148, -37, 74, 65, -278, 18, 291, -85, -77, 84, -19, 13, 7, -115, 151, 169, -146, -37, -7, 42, 172, -99, -188, 194, 86, -197, 105, 67, -114, 171, -26, -254, 266, 208, -249, 21, 97, -71, 122, 11, -173, 139, 89, -238, 31, 88, -14, 122, -83, -175, 249, 83, -175, 99, 0, -117, 217, -104, -177, 318, 50, -260, 68, 67, -60, 183, -127, -180, 234, 19, -226, 129, 73, -58, 104, -115, -137, 255, 9, -217, 80, 37, -8, 99, -132, -46, 225, -79, -152, 109, -32, 87, 154, -273, -24, 339, -190, -182, 270, -98, -74, 212, -172, -91, 376, -70, -276, 162, 67, -56, 109, -99, -29, 174, -86, -99, 117, -18, 41, 38, -224, 107, 223]
3287B23m02Q1K76k64R5R8l11K42K20m34M2L35j90j7N2k12K44J16l93J34K54k35
3309d6O0K2j56K06J21m08J15K30j31J1k4j36K69p0k70K38P6j65J50j08j75M11
3331B20n8m76L04K47l46N5J27j62J20J42l21j4L09l9k02M9P1L3j11K2N7m5O9j2
3355C9k05J57K33k35k00L07j7j51J02l0r2K27o4k60J85J83k00m2K8jJ58n0j97
3378a25J38J24j85l7J25j1J3k0j22O7J37k0k27Q3J69p0j37J13J6o2R8r5j11K55
3402A16L9k47j6J74Mp9k2MO3k7j4j7PJ52n2k43J12K72k25j55K19l0q7J36j52n4
3428a22K79q6k18J01J47l8q3n6O4J06j28%M0m6J48p2k32K74J55l74R2J79k49J80
3452F1L0l23K65J92l76M8K95k70J34Q7l89K45L05m87N1L16k70N4J44k70J70K23
$$ y = [223, -179, -98, 178, -86, 9, 107, -204, 38, 258, -176, -134, 201, 11, -6, 46, -166, 78, 194, -199, -65, 189, -46, 14, 36, -120, 86, 207, -201, -86, 144, 13, 24, 0, -136, 133, 63, -207, 31, 107, -58, 92, -16, -191, 220, 162, -314, -10, 237, -109, -54, 73, -89, 31, 173, -148, -162, 147, 108, -94, -45, 26, 59, -52, -30, 27, -18, 51, 39, -166, -9, 224, -11, -211, 96, 79, -72, 30, 0, -92, 135, 71, -189, -4, 179, -21, -63, -35, -36, 122, 72, -125, 13, 137, -48, -85, 40, 29, 42, 22, -100, -33, 104, 84, -143, -60, 109, 39, -98, 15, 31, -31, 67, -28, -139, 116, 155, -92, -108, 66, 70, -9, -31, -27, 36, 9, -5, -22, -15, 137, 85, -158, -46, 226, 1, -154, 65, 35, -52, 84, -68, -122, 157, 71, -147, -46, 101, 63, -20, -76, -12, 94, -34, -34, 6, -40, 108, 36, -196, 78, 233, -141, -49, 130, -119, 61, 91, -232, 33, 225, -151, -103, 192, -78, 56, 143, -246, -1, 304, -183, -132, 184, -86, -32, 112, -158, 12, 235]
3474B35l30j0K22q1Mj8j69K59Pk80K16J4j86K78j41k96M82L8n43L15J88l80K52
3497G6M3l45L25J07l91J17J90j72Q6o3j16K99k5l19K27K3j38K30k15j39M54j81
3519G3l96M43k3k99L66j68k39M59p7m46L77R5l14K31n0k37L59Rm10K42J66k62
3541a01J05J7j22K44q7k71K62M2j22N4q3j7K45j89j50K82q6j12K27k06j2L46k95
3564b9k30M35p5k37K52j41j01L47j91k79L73Rk36J26n2k0K08j98j34K81o9q1R6
3587E4j55M4K85l38j33M60j82j74K80j79p5L71k88k20M68j04k83K06Oq1J51j29
3609a6j60K70kj56L9lN5N4j66J5J65o1l1K8r5J63J6k96J17K21k10M7O8j66J57
3634E3R9l24Q3K98k64m7J96j55P1J60l02K9K76j47j39J67p5Q2k9j40J24Q8j30
$$ y = [235, -95, -105, 117, 36, 40, 22, -147, 112, 119, -161, 55, 69, -117, 161, 20, -276, 206, 244, -299, 16, 204, -176, 76, 119, -226, 99, 206, -185, -68, 122, -50, 36, -27, -143, 156, 131, -188, 39, 62, -76, 154, -61, -200, 254, 73, -323, 120, 97, -202, 164, -4, -243, 216, 139, -307, 70, 165, -149, 82, 32, -205, 154, 163, -247, -5, 161, -101, 4, 21, -101, 143, 56, -215, 47, 89, -33, 21, -62, -79, 166, -23, -173, 109, 23, -89, 138, -68, -80, 266, -29, -259, 176, 101, -136, 116, -25, -126, 221, 30, -249, 124, 133, -103, 23, -29, -49, 159, -39, -173, 108, 39, -42, 54, -101, -57, 228, -110, -243, 217, 35, -139, 141, -38, -113, 258, -30, -250, 218, 114, -169, 37, 43, -38, 113, -16, -176, 94, 92, -64, -25, -28, 27, 81, -85, -70, 95, 34, 3, 31, -64, 99, 115, -181, -64, 157, -53, -6, 62, -104, 53, 152, -172, -89, 209, -55, -102, 94, -61, 10, 170, -132, -103, 173, 26, -113, 54, -21, 61, 32, -108, 16, 104, -26]
3657b6j7Nl4J98q2k13K01J09k14P8M4q4J10j3j94J20J77j53r0R2M2ql5p9K6P2
3683C2Jq9NJ27Lk04Q9J07l4rm2r9J39J12k29L9J51j13j2N8p2L7J13j78r2K70l0
3710H0j59Q3K2k6M9o5m9J14P2j56j16J62Q7j01p5Q0K4nJ1j11N2J65j17j45J72
3735D8L9q3J1o6LJ43q4r4J11K5p6%l8Q9R5j40j44J99K1m9j6m5M0R4r5q3J67l1
3763D1o4mm8R0J29j84p6J48J4n5M4n7QJ11j39p6J87M8j65J1j3N9O5q6o4P5M5l2
3791A2m8K4J05m2j31L8Q7nj9j9p5J17L1k12J06J45j53j7J4l9J64J0k26O4J47p4
3817Dk3L5p8R3K2j83J09J44j22j9K9o2R8L5j45OJ56j02n1M1K0O9p3j09Q2R9o7
3844H%k4m4J06j4j48J34J11j77KM9K6L2k9j37J17Q9j02nj2MJ12j33q1J93l7r5
$$ y = [-26, -43, -38, -72, 126, 44, -169, 32, 141, -73, 5, 49, -35, 75, 62, -132, -12, 165, 12, -78, 14, 56, 48, 13, -66, -40, 32, 33, -56, -51, 76, 79, -125, -36, 71, 37, 28, -14, -113, 26, 138, -91, -52, 99, -14, -26, 32, -40, -3, 110, -68, -160, 110, 80, -79, 4, 26, 0, 49, -16, -65, 49, 121, -35, -151, 11, 98, -3, -78, 2, 26, 21, 32, -79, -27, 138, 21, -124, 48, 87, 4, 15, -51, -48, 95, 11, -83, 28, 53, -23, -23, -61, 28, 123, -17, -161, 38, 59, 10, -6, -51, -11, 83, -12, -95, 72, 41, -23, -27, -75, 15, 144, -40, -116, 32, 46, -9, 35, -22, -14, 97, -42, -118, 69, 117, -48, -37, -50, 9, 74, -12, -76, -1, 44, 12, -36, -12, 93, 51, -80, -42, 45, 40, 21, 2, -73, 44, 75, -137, -31, 114, -39, -56, -42, -81, 83, 93, -133, -69, 78, 4, -19, 16, -62, 31, 53, -130, -21, 123, 1, -18, 11, -51, 47, 82, -63, -57, 99, -3, -54, -13, 7, 76, 3, -106, -24, 75, 8, 8, -16, -60, 46, 32, -116, 18, 129, -48, -46, 3, 29, 61, 32, -105, 12, 101, -1, -6, -18, -14, 98, -35, -116, 77, 40, -55]
3871e5Q0p4J5K04j89j12K21j0k13J58j2j07J99j05j93K35Q5j91K4L4k0Q6p2q6
3895i8J67J0j34NO7K2O3j79j5J89p7n0P4o0M5Q0k09J8K49j11j64J47o2M4J00j92
3921g1m6K39r7j51J48J1j4M4j12o3K33n2j30N3j2O0L2j50R2R3j46lN2m5J44Qk41
3948a24N0K35j76j01J82o7m4J14j18k6K49j18k32J84Q0r8J5k6k6Q0j7o5mJ02K4
3973G3j01o5J60L2j50J4R3j11J18mj79R9J73k20l6K06n7n2L0j15M2K07j54j42
3997a39K17l3j22J14m5l4J38p5j87K08P9r8l3J3J8j4J5m8K3L1Lr3j6J96lk00K5
4024f0J47j10K1P4j69N6K00k04p5K58k6k36J03N3m5P5k1j32P9J13r9q0R0O0q4
4049a2q0P0P3k1Lm3p7J29O7k05K1K05r6j39J40j6l5R7r4j48K55L0k33J24O1j59
$$ y = [-55, 25, -49, -34, 170, -19, -131, 90, 80, -133, 25, 13, -94, 105, 0, -193, 42, 127, -64, -40, -6, -26, 60, -12, -98, 69, 79, -55, -50, 17, 39, 102, -77, -92, 97, 20, -30, 44, -16, 29, 109, -100, -82, 167, 56, -108, 39, -23, 21, 121, -71, -117, 122, 25, -126, 22, 33, 19, 63, -49, -112, 121, 69, -61, -8, -20, 40, 72, -78, 14, 107, -39, -42, 10, -35, 109, 117, -124, -74, 161, -15, -116, 66, -1, -45, 69, -49, -75, 174, 56, -176, 8, 88, -10, 5, -21, -47, 33, 16, -49, -53, 49, 73, -28, -93, 67, 99, -51, -37, 56, -55, 63, 59, -120, -21, 152, -68, -104, 102, 45, -7, 23, -92, -50, 157, 3, -139, 78, 45, -77, 37, -8, -42, 96, 21, -166, 42, 121, 23, -10, 3, 21, 7, 22, -26, -3, 28, 31, -62, -78, 118, 115, -85, -60, 87, -23, -2, 72, -97, -41, 159, -45, -120, 138, 112, -124, -21, 32, -13, 62, 41, -91, -12, 101, 2, -78, 12, 72, -12, -92, -22, 51, 30, 33, -10, -87, 42, 109, -96, -75, 130, 34, -105, 35, 19, -16, 81, -13, -161, 94, 124, -109, 15, 76, -83]
4075h3J22Oj52K04L3k86N5K16j09m7Q4r4RR3n2o5J09L6j07o7J29R4j20n1P6r4
4101f1L1J73j86p4L05j51k71L45O0k91J62Jk22K77O5l26J30J26j60J9J11o4P4
4124G3m4j48J16P0m3Mj00J9J89j57q5K11q7j12J57j07k9K97k17k35L33j0j97K38
4148A36j00j78K68m5k73K53R8k71O5J12j14J14oj19M7O7o4Mk7R9K8k23O7J88j33
4173gpJ02k22Q8K59k82p2L61j86j97K44p6j04K69j87j62K79K3k18J20K2j32J05
4196B0pp9J25M9j82K6J1J12J0j55J6J23r0k9J23j22K5J61k57K3L03j76j53J99
4220G6j01n2J72q5j21J98k3k10J42P1o0k1ql6R9J4o8k1L3N6p2r1J44Q3k41J02
4246b0M5j29J61J05l06P0K07k09m8K86j54q7J40j21o2K83q8k16J58L3o9N5j7n9
$$ y = [-83, 39, 45, -107, 97, 130, -156, -101, 115, 6, -41, 43, -51, -42, 51, -1, -66, 43, 79, -28, -95, 34, 128, 8, -43, 33, -61, -30, 143, -43, -117, 188, 37, -234, 111, 171, -120, 42, 43, -179, 98, 163, -163, -33, 93, -67, -48, 63, -1, 73, 29, -119, -3, 67, 24, 28, -72, -53, 136, -21, -106, 105, 18, -94, 63, -44, -73, 224, 7, -228, 105, 95, -102, 136, 36, -142, 126, 81, -192, 61, 159, -112, -47, 65, -49, 65, 59, -60, -13, 54, -10, -6, -33, 66, 94, -129, -62, 126, -7, -14, 88, -134, -46, 213, -69, -141, 220, 34, -163, 81, 5, -99, 170, -17, -179, 100, 123, -95, 25, 47, -85, 20, 13, -66, 59, 108, -74, -48, -37, 75, 85, -70, -54, 69, -21, -50, 73, -49, -24, 137, -120, -97, 206, 30, -123, 76, -25, -77, 95, 10, -111, 87, 64, -146, -4, 67, 7, -14, -22, -58, 41, 55, -13, -34, -1, 55, -17, -108, 36, 119, -122, -20, 25, -104, 57, 162, -144, -74, 133, -76, -124, 162, 8, -79, 61, -60, -122, 161, 73, -143, 15, 48, -21, 34, 17, -42]
4270d2M0K8q4L8O1N8j37n9J26L2r2j5N1o5R7rj29J53Q5k49K6J45p5L5M2j62O5
4297c6J15j10l1R4J0q5l8L9P5K3n7m8OM2R6j56K5J48j26j04J35Rn1Q6q7j09K24
4324H9K8j98L5J16j06K3O7p2N3L0j21o0J59P5j55l3J13j5p4O4m1k1J09p8j35J53
4350EJ45j79k3P9n4K8N1j08K7J15r6q6J05L0or1J8K9N3%p6J5M1K1j11L9J17n8
4378C0o9N0m1kJ05q3n8P1M5j05L3O4l7J7k9l3P1N8r9n1O6N4o6k4L6M1o6L0k7j2
4408c1J22Jj92O1J07r4kP7q4K3N5j06PJ43q0q8Q0J8k4L3l4k8N6%k1k7O6K0l9j05
4438h6J01N2p6j6M8m7N3Qj01O7Q1j08o2J44m2QQl7n4J14l6q2P7N2n5m3j0Q3ml9
4468bk9k0P8L4q8m3J45n3q3R5no6J08q7j30K01M7k10N2J43j29L4Q4j31N0J03j71
$$ y = [-42, -2, 26, -58, -20, 41, 99, -38, -97, 29, 61, -31, -46, 5, -60, 37, 28, -101, 52, 137, -112, -86, 59, -16, 19, 61, -101, -36, 79, -31, -62, 32, 42, -43, -81, -42, 33, 56, -1, -49, -43, -1, 95, -61, -36, 112, -14, -118, 17, 26, -25, 61, -26, -135, 89, 117, -81, -46, 70, -36, -13, 54, -18, 35, 65, -56, -116, 43, 118, -37, -70, 43, 28, -46, 18, -23, -44, 65, -13, -148, 5, 150, -29, -52, 27, -27, 1, 52, -56, -29, 86, -10, -96, 9, 39, 33, -58, -40, -11, 42, 42, -34, -19, 22, 43, -68, -29, 88, 30, -39, 11, -30, -32, 73, -10, -68, 3, 48, -57, -24, 40, 3, 20, -9, -42, 29, 87, -12, -63, 3, 57, -9, -33, 3, 44, -22, 8, -19, -31, 91, 92, -100, -39, 68, -26, -28, 49, -35, -12, 43, -63, -56, 87, 7, -81, -1, 17, -7, 26, -8, -36, 20, 20, -1, -28, 38, 58, 19, -86, 15, 67, -9, -25, 23, -24, 29, 37, -64, 3, 84, -24, -86, 58, 16, 24, 32, -5, -59, 55, 19, -63, 14, 66, 11, -32, -42, 41, 37, -2, -31, -51, 27, 61, -27, -70, 75, 22, -61, 34, 29, -37, 71, -16, -146, 55, 102, -108, -56, 87, -42, -8, 76, -55, -5, 98, -73]
4495g3j2J57j0n6l0JL8J2nl0j2O0k6p6K8J31o1j10Q8Mn1R6o4j07J84n5j23J34
4523C2K1p6PK2o5Q9J0q9M0K3lj2nMM2m8l0J2L8Rjr2M8J04j07n6J34m2n6Q8p6k7
4555f2J89j16j27J20N7j15Q1nn8R8l1l6lJ06q5o7K1O9Mk3m5M1l6M2oq1O9O4r8
4584c3pJ36o9m9K5o7L6J23r6n8J29m5p3O8rk3O5p8m2N8N3m6j0k8M4L5r6L7O4m9
4614el3J9j5P0K9r7j2Q0o4j8R6o0j5Q9j36j5J99n4j39J10Ml2O7n5r7J03J1p2R
4643c3M5N0o5n5L7K3J5Kk5l8R8kj18N5J12j42JQ5n9K2O7j27mJ30r7m1R5l2j5K0
4673Dm1k3J14k4q1L4K0k2K7rnN4m7m9N6K3rKo7L1P2m4m2M0k1L3k0n1M4Q7q6q1
4705h1Q9N6p0PqpM3k1n8L7P0p2j9J6M0lk5o8P7lQqm3K2P5p3j1J22r6K4j5n6P7
$$ y = [-73, -85, 72, 62, 6, -24, -23, 15, 27, 22, -8, -20, 40, 14, -62, -34, 97, 36, -74, 14, 18, -33, 63, -1, -108, 76, 21, -102, 32, 53, -23, -16, 6, -59, 30, 40, -49, -9, 14, 11, -1, -6, -2, 40, -8, -38, -26, 12, 21, 20, -72, -24, 80, -27, -83, 51, 9, -47, 41, -35, -62, 127, 11, -116, 4, 61, -54, 27, 22, -36, 62, 31, -5, -8, 98, 13, -54, -33, 36, 40, 17, -28, 13, -23, 19, 13, -68, 1, 65, -33, -40, 96, 27, -22, 3, -64, -28, 95, -1, -59, 70, 25, -48, 20, 11, -12, 53, -25, -67, -9, 44, -2, -12, -40, 4, 39, -57, -20, 44, -5, -38, -19, -34, 36, 65, -32, -44, 36, -28, -46, 50, -10, -25, 64, -72, -87, 112, 58, -81, 29, 33, 1, 68, 13, -84, 19, 30, -42, -33, 12, 62, -3, -58, -21, 2, 17, 19, -6, -44, 54, 52, -66, -11, 101, -41, -40, 45, -14, 8, 75, -52, -56, 74, -23, -64, 31, -1, -16, 4, -37, -60, 54, 30, -51, -17, 3, -19, 8, -1, -6, 48, 1, -48, 8, 31, 22, 24, -43, -12, 60, 16, -26, 14, -7, 26, 6, -45, -1, 86, 0, -81, 8, 64, -6, 1, -7, -14, 29, 8, -50, -13, 57, -15, -34, -18, 22, 19, -6, -74, 3, 0, 8, 0, -43, -21, 54, -19, -30, 92, -4, 20, 5, -51, 26]
4738B6R8q3j15J26k6p9O8Qn3O6m7o0J22K2j16QO0m8M8pp2M2O8p6J7J5J0M5q8k1
4768d2L6M2qk1rJ2J0n0j5J16l6q4K4J9J3L6m1o6O9j4l7Q8k1k8Lm7K5O3j7o4RN1
4800A6j3N0m4m4P5j0j31J47J0n8K6Jq0R1J2q6M0J7l6L4j4l9P5m4p0N6P4k7k1k4
4830a7qL0l1J4k5M4lk7j9N4P9r3n9P8k8k4J06r4l5P9l6n0J04l7k6M2n0k2J23n7
4860A2o4Q0Nn1J9j7j5O7n2l8Q1j2k1L8n7l4J08m2p4Q7k4l9M1lk9Q7p8o0Q2K6p
4891A6lj5NL8l9l2N7ml7mk5N7L7q3QM3l2L3J2m9O8k5r8J8O6j7k9N5o8N3M1p0q
4924c1R8q1j8O3lm8L9l9k7R3Qr0L5OlJ1j9j7M4jp1L7kM8L6j25M2O1m5NJ6j9J2
4957A5pm9L3M2l7l7L9KM6n2j9J4M2J1p7J3K3mrl3M7K5k3%rj1O4o8k0M7M1o2j0
$$ y = [26, 124, 41, -74, 52, 26, -53, 15, 23, -30, 36, -11, -71, 51, 73, -43, -35, 25, -23, 25, 18, -54, -12, 56, -20, -3, 12, 22, 67, -21, -42, -6, 36, 28, 7, -2, 10, 20, -30, -45, 71, 35, -49, -25, -6, 7, 43, 2, -64, 5, -9, -46, 42, 21, -7, -4, -51, -26, 37, 20, -44, -35, 16, 3, 53, 9, -35, 40, 30, -101, 46, 56, -2, 24, 25, -55, 36, 48, -38, 2, 19, -17, 17, 3, -36, 39, -5, -75, -19, 55, 28, 7, -17, -25, 5, -26, -12, -37, 7, 4, -23, -42, 12, 91, -2, -61, 17, -11, -35, 71, -23, -58, 21, -15, -65, 39, 2, -24, 18, -32, -54, 69, 12, -52, 28, 33, -18, 1, -16, -31, 36, -16, -54, 27, 15, -6, 32, -25, -59, 49, 7, -67, 20, -4, -43, -2, -5, -34, 53, -25, -85, -3, 23, 16, 13, -2, 3, 41, 2, -30, 27, 23, -14, -18, -43, 14, 51, -32, -24, 19, -13, 20, 32, -17, 51, 26, -72, -54, 12, -5, -34, 21, -47, 6, 47, -23, -31, 67, -14, -32, 31, 28, -20, 19, -20, -47, 46, 54, -36, -1, 5, 2, 13, -6, -23, 21, 20, -51, -14, -16, 32, 68, -57, -15, 46, 1, 6, 22, 3, 15, 8, -41, -8, 34, -3, -40, -1, 1, 47, -5, -24, -10, 32, 43, -34, -21, 2, -2, -11, -44, 3, 28, 5, 5, -4, -15, 49, -19, -39, 8, 49, -13, -23]
4990b3L3k7M4k6k6J8N6j6m7L2Rk1j6j7M1J9m2l2K5K8j6qK0j7nJ8m5O5l4k8J6O
5022a6L7k1J9j5k0M1j2j6j0OJ6l5j6L1L3j8l4K1J1pk8OR2m7l7rM8j3j5j2OL0L
5055A9kj2l3J9MpoJ9J8n5RMN3Mq0J7P0l8k6L9j2NL1m5l2N1Kq3O8j8J9J9m4J9M3
5090C9j5k4k9P7k2m7KnL3J4l1k3L8j6k7L3L7m1J4l6L9l3L2m4pP4j4l3LK5KK1m7
5123a1j3M6L4l5p1K9N5k9J1mk7M4m0l3N9J8l8nJ9k5O5m5k8J3L9j4k4J6j0L5n3
5154b2k9M1N4m4k3J8l7O3k5j8J4L8l2l2J7L8nKl1K5K2o7K4nL3j7l2JM6rk5k0M3
5187FJ4qm3%L5j5RPm1N0K3o8L0M7l9l5L8Ll3N0k2n6O9j0l1j4K5QJ8j0k1K2jk5
5221a8MK8l0J6J0lK3n0L4%lL0k6j2l0M3k0lL0n7K8L3l4j4P7l7p1M3K3m3N9m1j0
$$ y = [-23, 10, -17, 27, 1, -25, -7, 49, 33, -14, 18, 27, 6, -10, -27, 14, 33, -9, -41, -16, 12, -4, -12, 8, -9, -14, 4, -41, 24, -10, -38, -22, -16, 21, 0, 19, 4, -16, 25, 13, -3, -13, -7, 9, -26, -42, -11, 22, 4, -30, -9, 2, -5, -33, -27, 65, 18, -19, -28, 20, 7, -8, -20, -14, 16, 19, 17, 5, -28, -9, -5, -12, -18, 1, 19, -36, -27, -23, 30, 34, -46, -29, 41, 3, -23, 16, 4, 9, 40, -5, -37, 14, 16, -67, 1, -17, 2, 21, -23, -4, 39, 24, 0, -29, 48, 26, -21, -19, -24, 9, 23, -8, -31, 7, -9, -36, -3, 34, -7, 7, -29, 10, -23, 9, -35, -42, 32, 18, -15, -12, 13, 15, 36, -11, -24, 22, 56, 21, -50, -21, 34, 5, 16, 12, -15, 29, -11, -44, 15, 33, -5, -10, 9, -16, 49, 4, -24, -11, 28, 14, -10, 6, -4, 31, -22, -51, -10, 44, 0, -23, -5, -42, 21, -4, -22, -8, 30, -2, -34, -17, 21, 16, 18, -13, 12, 34, -33, -9, -14, 19, 2, -30, -29, 17, 8, -17, -37, 6, 20, 12, -31, -31, 4, -11, -2, 5, -36, 14, 37, -31, -1, 46, 7, -28, 10, 13, -20, 30, 8, -48, 21, 11, -20, -34, -9, -1, 17, 7, -14, 8, 7, -18, -14, 14, -16, 0, 10, 7, 30, -20, 14, 14, 11, 41, 15, 3, -27, 16, -4, -7, 23, -34, -6, 27, -7, -21, 56, 19, -52, -9, 14, -29, 30, -11, -21]
5254b1O6j4p9M6L0j8j5kML9m6k4L2Jpkl0N9K8q0nL6QjJ6l5jN7m7n3P7pl5RlJ5
5290bN1q8K2K5rj2J9k2M1pk1j2%N4k2m6J9N5k3k2j4J5nK1k7j5L4J6o7J8M2%k5
5323gM2l3J2j0k8J7M0m4J4k0k3K2k0PJ4K1%nJ1nj1Rj2L7jl7J1Rm9N4L0l5l5N2
5357B7j1k6Pj9L5lk0J6J5Pl8K1nkj0l9M8L0j9lm9N6J1n2RJ4K4l9J4k8J6L8qn3
5391c6M3K4l5j0M0j5R%k2lL1ko1K5L4Rm3L2j2LKn8O5Ok9korQ8l6q6O9Oj6j3J0
5427Bl4L2K3l9j3M8k3Lj3LL4mo1M3J4j9J5l3L2o1Q7m1lpM7n3K1OJ1l1j1QL4Om6
5462b3RM9j0k1nK6Pj6oj6Mk1J0m0Q6k9k6J5K6n6L4pj6N3J0q0K7PjK2%m6O4rmj7
5498@K1jJ8k3k1L4l6j2L5J3n7M1m7J7K5J0j9ML3l8L9n3J1L3Pl8RJR%m1ON0qm9
$$ y = [-21, 45, 31, -48, -2, 28, 10, -5, -7, -3, 36, -10, -34, -2, -1, -8, -10, -40, 19, 47, -33, -38, -2, 6, 5, 21, -14, -15, 42, -5, -58, 19, 12, -23, -14, -17, -2, 49, -39, -17, 8, -1, -13, 6, -16, 25, 18, -3, -15, -15, 39, 17, -29, -10, 45, 22, 0, -14, 1, -4, 17, -10, -25, 9, 25, -42, -24, 18, 18, -7, 35, 2, 14, 4, -24, -7, 33, -11, 3, -17, -40, -18, -38, -31, -17, 4, 4, -1, 10, 5, -6, 3, -9, 28, 27, -10, 1, 10, -39, 15, 45, 10, -25, 27, 16, -10, -3, -22, 13, 10, -10, 6, 21, 28, -10, 11, 6, 4, -6, -45, 3, 33, 14, 11, -38, 18, 29, -23, -14, 0, 24, -15, -1, -29, -13, 25, 17, -36, 7, 31, -4, -14, 26, 11, 20, 20, -2, -5, 26, 24, -37, -12, 22, 31, -12, 20, 8, 11, 13, -45, 20, 26, -3, -5, -11, -20, 68, 32, -54, 15, 21, 5, -8, 2, -32, 0, 23, -16, -29, 19, -4, -1, -14, -11, 23, 19, -42, 1, 15, -4, 11, -22, 10, -51, 36, -5, -8, -15, 32, -21, 0, 6, 17, -14, -25, -17, 17, 23, -23, -14, 35, 25, 4, -1, 25, 32, 16, 10, -6, -2, -23, -13, -53, 33, 4, -22, -7, 19, -37, -3, -10, -26, 27, 37, -43, -16, -9, -10, 12, 12, -34, 30, 21, 17, 0, 21, 20, 38, 15, -6, 28, -8, -20, 15, 28, -29, 12, -35, -18, 7, 17, -2, 2, 35, -3, 36, -17, -6, 27, 34, -4, 5, 6, 15, 15, -26, -20, 30, 22, -27]
5533b7QK4lK2n1jN6kl7L2nk1NJ8k5M0m1NkN1k6k1k7J3O6l8l7L5jJJ9k0l2L8j8
5568bj7K3Qj1Jk4M7Ln1jM3kqnk4L2Qn7QK2J9k1J7j5L7K6n0NK1m8J4Pk5K6K9n0
5604a5K5PMk8LJ4j4J5k1kM7l4j8J3j3K1jm5K0K6J1m7NK8K6rk3POmk3J7lJ5J3j7
5640Fl8J4L7n5J2K7j2K1l8QN0j1k1oJ1lkrRjj4kk7N2Rl9J9L3Kl5PKk7L6Ll5L2
5677A5j4j0QQl7M5rj8J9lj8l9K6P2j5l2l0J9K4j0jJ8j8rK7l2K3k3M7n3RlKJ0o
5712hk8K1Nj4J4K3k3rmMN4l5mj3L3k3J8m0L0J0k0j8L5k2lK6kJ1pj1j3j0PQMjR
5749DRj2m2K5K3l1MJL3j9J1j6L4l1JjJ2Kj2mQJ8j6j8K4K4jn5L4l9L8J4m8K3J6
5784A3j7K7m5kL4Jl5kK3L4k3kj0J7j0J1n6L4LRMk3L0j8J2oL2p4O8k2m0N0j0k9
$$ y = [-27, -19, 5, 2, 24, -27, -28, 28, 26, -11, 21, 16, -5, 0, 18, -7, 33, -8, -3, -5, 46, 20, -1, -28, -15, 51, 13, -24, 11, 10, 11, 30, 10, -22, 16, -2, -19, 4, 12, 1, 2, -22, 25, 28, -23, -24, 19, 17, 9, 4, -20, 12, 20, -37, -29, -7, 12, -9, 8, -7, 30, 56, 6, 11, 32, -16, -2, 5, -20, 6, 35, -15, 10, 17, 21, -7, -4, 10, -4, 11, -10, -12, 35, 1, -17, -4, -17, 4, 3, -42, -22, 4, 15, -32, -27, 1, 27, 18, -5, 2, 8, 4, -19, -2, -5, 10, 23, 6, -32, -18, 19, -36, -24, 3, -9, 12, -26, -18, 32, 21, 0, -6, 5, 2, 0, -9, 0, -1, -15, -17, -44, 8, 17, -22, -3, 30, 32, -3, 4, 6, -21, 15, 18, -17, 15, 1, -9, -1, 7, -30, 15, 6, -12, 7, 4, -14, -53, -27, 45, 30, -2, -32, -13, 11, 1, 0, 18, 0, -9, 18, -14, 9, -14, 33, -20, -11, -14, -12, -2, -8, -36, -15, -10, -24, -10, 13, -10, -19, -23, -19, 35, 0, -4, -17, 16, -7, 11, -29, 1, 11, -9, -27, 8, -14, -17, 9, 7, 18, 11, 0, -13, -23, -16, -8, -4, -5, 4, 13, 1, -41, -16, 7, -24, -20, -19, 14, -5, 6, -10, 24, -7, -6, -7, 5, 7, -5, -9, -1, 17, 1, -17, 7, 31, 30, -25, 9, -30, 8, 22, -26, -3, 13, -4, 23, -22, -24, 10, 11, -24, -26, -3, 31, 8, 6, -4, 13, 3, 14, -42, -8, -5, 4, 8, -15, 15, -3, 9, 3, 35, -39, 29, 7, -33, 17, 7, -22]
5818b2jJ6NK7k7QpJk6L0J9l8RJ6j5PLj5K8k1j1J9l2L0J7j8nj6L3J5l5J6Ok4%k7
5854c5K0J8%Om5K8J7j3RJ5j1k0j9M5Kk9J7j3J0J2k1K1J8m8K7j4j1j0N5j2k3Qm
5887@K9o0N3k6m%J6kL0qm6J0lJ5k7K4jk9M9l4oL5j0k9L1NqqmJ7Nqk6J7ML1l4l8
5925d0L2K4NqLk1kL3l8J8J4k4KKoj2N2k5j1L0o8KK0kj3M2k2K0J5j9j9K0qK8l3
5960iJ0Mj1k0J0k1N6Lk4nL0j7l0L2kJ8J2k1j5mM1m8pK4j5L2Jj9k4L7j9k8L6j1
5994dJK0j0J2l1jpL1l8K9J9m9J4M9n3JQMJ9k6QlnkK9l7K6%rJ4ljj5k8L3mPnJ2
6033Ek3K7j2l7J2M7j9L2j7j9klNK0k2rPmJ3J2%l1L1j1j6J3j7K6Rn5J5K2%j6K2
6068EKJk3JJ0L5k7KJ2k3L1l7k1K9J7ml2J4J5j6K6l3j8M9Kk0pK3j9MJ1rJ0ll1N1
$$ y = [-22, -23, -7, -2, 25, -2, 6, -1, 0, -26, 4, 23, -15, -6, 10, -5, 2, 5, -10, 18, -3, -14, 5, -27, 3, 20, 2, -3, -19, 14, 29, -6, 10, 16, -8, -8, -35, -15, 3, 3, 9, -36, -8, 9, -4, 5, 20, 9, -11, -30, 15, 17, -12, 5, -8, 2, 14, -7, 14, 32, -16, 11, -3, -14, -24, 31, 19, -4, 4, 0, 29, -31, 22, -4, -8, -8, 8, 6, 36, 28, -18, -8, -11, 4, -23, 1, 0, -29, 20, -14, -20, 15, 5, -24, 7, 12, 4, -4, -8, 9, 14, 6, -20, -3, 1, 32, -2, -40, -8, 16, 21, 13, 16, -5, -7, 26, -12, 6, 20, -4, -2, 0, -6, -18, 34, 9, -2, 28, -40, -38, -18, -20, -33, 9, -13, 7, 22, 3, -16, 4, -4, 24, -9, 1, 5, -6, -26, -16, -37, 19, 22, -2, -7, 23, 6, -24, 8, 6, 24, 36, 15, 0, -4, 37, -11, -18, 6, -9, 23, 24, 5, -19, 18, -1, -29, 7, -4, -3, 17, 7, 19, -12, -13, -20, 11, -27, 2, 21, -28, -14, 35, -18, -17, -9, -5, 14, -12, -4, -7, -12, -14, 15, -22, 4, 4, -5, 9, 6, 5, -10, -38, -5, -9, -2, -7, 5, -18, 9, -3, -40, -28, 19, 0, 32, 15, -4, -6, -9, -4, 16, -6, -15, -8, -12, 1, 13, 13, -18, 13, 2, -14, -1, -18, 8, 17, -38, -23, -1, -1, -17, 5, 7, 8, -15, -14, -4, 31, 4, 6, 18, -5, 26, -11, -32, -3, 14, 10, -22, -8, 7, -9, 17, -16, -34, 15, 17, -3, -10, 13, -6, -2, 9, 0, 10, 7, -24, 27]
6104B7l1JoPK6j0m3OK5L2k3kOj0J3n4L3Qj2j%k1M1j8K2l8M2nj6%k0JM1ll5L5J2
6141C0n0J6K6l7J9j6j2M3j1l%J7lRm2QJ5j8%MJ4j2Jl3RN3k6L0m3K0K0k8oLMPr
6178aRj6J2K0k8K4k8mpjK1RJKk3J2lNkJ9j0L5o0K6kJm5K1j3J6J7Jj2MK6l5J8j2
6216cjPljK1l2J2qQKPkpnRj5j1pL2j6J5jj8J4j7nL0Km2K7oL8o8L2L1nm4J4JL3
6256A8k3j2J8J2qJ2k0nMJ1j1k3L8j4K1ok1RrK9o4J9K2k2lJ9J5Nj9j2K0KrOKk4
6292b3J1RMJ8j0j4j1OJ8mmj6L2k4mRlK0J3k3k9L1k3K4j3LnK6n2J2J6J9j0l7M3
6327IKk1ROK5l0pJ7j2lj3Oj7M6J1k7J6p8N5Jj4J2J3J7Kl3m%JJ6j9K3L6o6K0J5
6363A4j6JmK5j7k6L1lk1OJ1j4K5Pl6K6j7nKpJ4j5J9Oj1OK9m7K4mMMj4K1j7Ml3
$$ y = [27, -4, -3, -9, -2, 24, 14, -29, -23, 2, 34, 11, 9, 15, 5, 18, -36, -3, 5, -7, -8, -8, -29, 12, -6, 16, -22, 20, 15, -1, -1, -21, -20, 21, 18, -17, 18, 30, -20, -4, 22, -15, 4, -12, -24, 19, 8, 5, 5, 22, 19, 28, -14, -6, 9, -9, -9, -5, 9, -3, -2, -35, -26, 27, 1, 31, -12, 8, 28, 0, -6, -3, 1, 8, -1, 8, -8, 4, 24, -4, 20, -8, -12, -19, -20, 1, 10, 11, 13, -10, 2, -1, 4, 2, 21, 11, 46, -14, 12, 10, 11, -34, -13, -26, -10, 7, 8, -4, 0, 26, -9, 9, -3, -4, 3, 0, -1, 20, -12, 0, -8, 0, 2, 9, 7, 0, -5, 4, -11, -22, -29, 3, -13, 2, 1, -17, -3, -20, -25, 5, 7, -35, -8, -14, 24, -44, -12, 19, 14, -30, -16, -15, 18, -5, -17, 1, 13, 5, 17, -3, -8, -4, 7, -4, -27, 11, -3, 18, 12, -9, 0, -9, 20, -44, -25, -3, -25, -28, -9, 6, 11, -8, -20, 0, 2, -7, -1, 1, -23, -12, -3, 1, 19, 9, -5, -16, -10, 8, 4, 0, -16, 16, -8, -12, -3, -6, 14, 27, 4, -25, 6, -17, 7, -6, -3, -8, 18, -34, -22, -6, 13, 3, -34, 9, 11, -10, -1, 5, 30, 0, -7, 10, -2, -5, -18, -12, -29, 17, 28, 1, 17, -61, -6, -5, -19, -7, 6, 23, 25, -8, -12, -12, -11, 5, -14, 9, 45, -21, -1, 14, -2, -1, -5, 20, 3, -23, 8, 5, -16, -10, 1, -13, 12, 19, -17, 9, -8, -13, -11, -18, -4, -19, 0, 6, -5, 1, 30, -17, 7, 3, 7, 11, -3, 18, 1, 5, -28]
6400b8J7j1qK5j5K1L%k0J1mLm9J4K4K7k2L7j2m0N0Lm6K3J2k6RRj2k1L7K1l6pL5
6435B4l4kkOJ9JLj7K1m9QJ2j5ML0k2J4j2RNk8L8roj0J0J3j7K4nk2N4n4k7O3k7
6471@mk1M2l9K1J5j6J4j4l0K4LLjj8K9LpnQJ7n2mK7KPk2J5J8J2k2Ml5J0M1m9j6
6508d0M3%J2J5n1J5j1J1j6J1qj1K2j9L5K8k7j7k3J8M6m4mJ7M5n1%M9Ko3L9n6K7
6541fJ3j8j3N5l3k0K6mPK0m2KM0l1PpK3JPk6K0j9K7k1k0J3j1K5kMj2Kqnm2N4J8
6578B4l9J3L0n0nL0jk4L2Ll5M0l5j0J1K6J6l3L7l3K2k2J4rJj9K4l6LL6j4prJ9
6612@qqK4k9L8k8jK2oMrjMk3L1m4K9Nj3J4K4j2oOmk2nL1l4N1J5j2l2j3nK9nJr
6651aj6M3l2J9ml8K7qqj4K6j5J7Jk1K6qJ2k0QK1k1jMj0lj0K7OJ0l2J1l0P0k6j1
$$ y = [-28, -11, -22, -30, -5, -20, 1, 4, 4, -16, -5, -9, -6, -55, -41, -17, 10, -12, 25, 13, -27, 23, 26, -20, 3, 15, -11, -2, 7, -5, -26, 11, 32, -4, -11, 24, -10, -12, -14, -8, 11, 12, 15, -2, 19, -30, -22, -10, -25, -21, 9, -13, 1, -11, -2, 3, -25, 13, 4, -2, -12, -2, 11, -6, 18, 13, -9, 45, -9, -36, 27, 0, -4, -25, 17, -22, -1, 14, -2, 12, -2, -32, -8, -5, -2, -3, -21, 8, 11, 4, -1, 7, 24, -28, -32, -5, -3, 4, -18, -3, 15, 27, 5, 9, -26, -16, 25, -24, -40, 3, 3, 15, 30, -21, -6, -17, -6, -22, -11, -19, -30, -8, -27, 8, 36, 9, -8, -31, -13, 33, -11, -15, 2, 47, -4, -4, 45, 47, -16, 23, -33, -6, 7, -11, -24, 31, -2, -22, 4, 0, 7, 27, -15, -13, 27, -4, 3, -4, 19, 20, 27, 1, 21, 2, 29, 8, -12, 1, -10, 15, 13, 17, 5, 7, -1, -6, -48, 6, 24, -15, -2, 28, -22, -27, 3, 2, -22, 10, 13, -22, 18, -17, -27, -16, 10, 26, -7, 30, -3, 19, -3, 11, 2, 3, -16, 8, -28, -25, 11, -3, -10, -19, 0, -8, -16, 8, -21, 17, -11, -12, 10, 4, 8, -1, -2, 2, -21, 10, -34, -5, 0, -13, 1, 25, 13, 7, 13, 9, -13, -18, 13, -21, 30, 45, 33, 1, -12, -17, 12, 7, 8, -1, -17, 26, -6, 13, 9, -29, -2, -10, -18, -32, -6, -21, -4, -3, -24, 2, -6, 6, -14, -6, 15, -6, -7, -3, -13, -16, -26, 1, 7, 17, -15, -4, -34, 36, 10, -1]
6687aJ2J5k1%jQpJk7K7j5oJ4J7k7j6J8Rj4K2MoQj4pOj3RL7n4J7J1MlJ2l3j0L1
6725GnNj4mnL8j8J3Ok1j1J9k2pK3j4LPJ1Lj6Lj2J7kJ8j7pK8k5k5jM3j3Ok0QKK1
6764B2k6L1n2M1JNj3l2J7j1PL1l7J1oJ2Qk2Mpj8J3K6l6K6J%J2qoL4k0j5j4J4J6
6800Il5M1oJ8j3j4nL1j6mj1J8PJj5kk2M1k9J0Ok4L6%j6K0kj4J9k4L3k8J1l5j%
6836a5L5k4j5N3l7j8oJK8qN%l2M4l5L8pj7j2J5J2K7l1mj5JN3k9ok5K2pK6l1J9
6871ERJ0kjj8k3K5lk3K6pj7L5k2k3K9lJ8k3K4Ll0N0l2k1K9j0qj1j0M2rKj0MJ3
6907A8K1m1K1l7L2j5lRj0j9J5J3pJ0m7K1N0m4mL8k9L3k8J5l4K5kJ0rJjk8PL8j3
6942Fk9N1kk9mQJ2l1K5J6k7K5l0J5j7j1N0Ql5MoJ2mj7J3k9N1j0m3K4L0Jl2j9M4
$$ y = [-1, 11, 26, 5, 5, 4, 12, 5, 6, -21, 6, -9, -15, -1, 16, -11, -27, -9, 0, -14, 8, 12, 6, 14, 0, -7, -1, -14, -5, 32, -22, -5, 6, 10, 7, 19, -14, -24, 7, 2, 7, -7, -11, -16, 22, 4, 17, 23, 2, -9, 10, -12, -19, 4, -10, -7, 0, 11, 14, -2, 1, -11, 6, 4, 22, 5, -2, 26, 1, -24, -25, 18, 5, 11, -9, -1, 1, 22, -4, 27, -25, 16, 17, 22, 9, -23, -6, -17, -10, 21, -16, -5, -11, 1, 9, -13, -9, -16, -34, -21, 5, -31, -5, -4, -4, 8, 0, -6, 28, 8, -7, -21, -7, 9, -26, 15, 9, 27, 14, 0, -5, 26, 10, 6, -5, 13, 20, 21, 6, 4, -18, 23, -6, 4, 10, -14, 22, 22, 6, 26, 24, 10, 29, 5, 38, 10, 21, -14, -15, -15, 20, -4, -19, 34, -3, -21, -27, -26, 2, -6, -1, -1, -33, 11, -24, 14, 7, -10, -22, -7, 5, 32, 1, -3, -18, -17, 36, 7, 1, -24, -2, -9, 17, -14, 5, 14, 24, 22, 21, 3, -20, 5, 2, -21, 5, -2, -19, 16, -6, -29, 0, -3, 15, -8, 16, 19, -11, 39, 7, -14, 15, 5, -3, -14, -24, 18, 9, 11, 1, 5, 18, 39, -2, 19, -18, 14, -1, -4, 5, -5, -24, -9, 4, -3, 7, -40, -19, 31, -13, -17, 21, -8, 25, -3, 12, -22, 3, 1, 11, 2, 3, 2, -26, -19, 19, 6, -23, 28, 26, -3, -7, 1, 13, -18, 7, 23, -4, 21, -9, 6, -11, -22, 28, 36, 1, 5, -1, 11, 7, -10, 3, -26, 25, 15, -28, -4, 26, 27, -5, -24, 20]
6977B0j2j4K0j3lK3j2j8K2nmJ7j3Jj5J1J5jj0mlm3M1KMnQKj8K3j2oL5m6J7J3j0
7014Gl9L2j2L%J2j6M6n3L0Nj5j7pL4Pk0rRK0jJ5j7ml6L1k4K5j3J1%M0m0K%l2M5
7051A9n1M5j4JJ1k4K3%rl1O3Lm1mj4J9J6J4n2K4M3m3mJ7knJ5k6pJ5j4QJ4k3j2
7086b6NK1K1j8mL7m0Rj3QKkmM6m0j4M1l5LmM0oj7J6j0j2KK9m9K1lj0J0k0J9j5
7122a2K6rO%k8K4%Jj9PM4j8l5J1PlJ4l3klJ7l9L8KJJ6j2j4J6JoqK3J6lm9QJ5J2
7161A2k9M3m3J4j1J5qK9J8l6j8K1plJ0pQk3LrK7J4l6K9Oj4NnL0m0L1k6oJ6k2k0
7197c2N0k6j2M9k6k2K0J4k1kQl%K2j8J7ol1J8J8j3K5n3J9J6Ol2mL7J5j4n0J6K7
7231A2j2JQqk4K1j8pN2k2mKJ6m1L9j8qJ0Lj0J7k7L7pkk6J8j6l6M4mNk5L4j2K7
$$ y = [20, 8, -6, 14, 1, -2, 21, 9, -9, 13, 8, 4, 21, 8, 9, -6, 5, 20, 19, 9, 5, 2, -41, 0, 2, 6, 1, 9, 11, -7, 16, 4, -2, 33, -13, 4, 17, 7, -32, 0, -12, -9, -9, 3, -13, 33, -20, 10, 15, 0, -17, -24, 10, 17, -3, -12, -3, 17, 16, 31, 14, 10, -26, 5, -19, 6, -7, 4, 4, 44, 4, 6, 6, -26, 19, -32, 13, -1, 0, 11, -13, 10, 10, 1, -30, 33, 36, -5, -9, -23, -4, 12, 26, -26, -2, 41, -2, -6, 11, 9, 4, 19, -7, -14, 1, -13, -5, 9, -14, -26, -21, 0, 21, 3, -1, 36, -4, 5, -8, 0, 2, 0, -4, 42, 2, -12, 29, -6, -3, -7, 33, 27, 10, 26, 16, 4, 6, 35, -14, 7, 4, -6, 4, -16, 3, -12, 14, 5, 11, 11, -17, 7, 7, 8, -11, -4, 40, 22, -13, -2, 5, 2, 16, -17, -19, -22, -5, -44, -6, -4, -3, 13, 1, -13, 3, 4, -2, -10, 13, 29, 26, -23, -15, 0, 12, -17, 26, -17, -3, -14, 1, -7, 22, 40, 4, -14, 7, 0, -3, 7, 0, 8, -15, -12, -21, 6, 20, -16, 13, 19, 5, 10, 5, 35, -5, 26, 0, -6, 10, -12, -32, 18, -8, -20, 29, 3, -19, 1, 15, -6, -8, 0, -3, -3, 19, 1, 18, 12, -19, -1, 17, 4, 29, -24, -5, 11, 17, -15, -19, 18, 33, 19, -31, -15, 12, 0, 1, 9, 1, -23, -2, -20, -27, 25, 3, -1, 1, 17, -24, 15, -3, -11, -1, 2, -8, 9, -18, 19, 12, 10, -16, 2, -14, -50, -6, -10, -5, -30, 4, -8, 19]
7267A9j9j1J3LJ1k6QK7j9j0j7lN9l9j2P%qj6J7M4k9kJ5K6km6Rk1k3L3Kj9K7J5
7302A3Km3K3lOJ1l7N1j4Kj0LlqK0j5nj0J7j1M3nj5j3%nj0J7NJ1k5L5m6J3J2jJ6
7339B1l0%LkRJ1rOmKK7j8Kl4l1P1m1L8k0%pk8L9J0%K3l3j3J1%j8L8l9J9jk8%N
7377b1L0l0J2nJ8j0j9J7m2N8K0k1jJ3oqLLJ7j5j5j5RLj5J1J6J0j5l4J6Rj2MJN
7413iM1l7j3ORj6J3Pj4J3j6K2j1NJ5mNl0K3l2nL3j1kJ0j2L2j5k3NmK3MqK7l0j1
7450a0K8pOl1RLK1m4N3k7j3KM4l9nJ9J4J0n8jK6K1%l3j9J4PJ7j5qNjj1N8k9mL
7487EpL6k0j9KqK2k2qL1j2j6K1kJ4J4m3J0pJ9ljj0L5j6k5J1K6j0k0j5K6k6K7j4
7522ej8J0L8j7plK3k4koK5k1J4j7QJ4j9k3L4KKoL5p3N0mrk6J6LJ4qPnQOl8K4k
$$ y = [19, 0, -11, 2, 5, 16, -10, -2, 25, 6, -4, -21, -24, 35, -4, -16, -9, -9, -17, -33, -16, 28, -1, -3, 12, 38, 36, -10, -1, -22, -45, -12, -10, -29, -2, 13, 15, -28, -5, -8, -2, 9, -28, 23, 9, 11, 1, 4, 1, -7, 13, -2, -7, -17, 0, -11, 32, 27, 12, -1, -1, -6, -16, 1, 6, 17, -8, 27, -19, -6, 6, 5, 21, -9, -9, -6, -8, 1, 12, 3, 9, 5, 7, 34, 16, 18, -16, -47, 24, -17, 21, 1, 1, -6, -34, 5, 15, 15, 38, 5, -8, 3, 3, -15, 23, -16, 3, 2, -26, -26, -21, 9, -21, -9, -14, 4, -6, -25, -8, -50, 8, 28, 7, 6, 19, 13, 5, 8, 11, 28, 13, -2, -17, -8, -5, -20, -9, 7, 17, 2, -32, -16, -7, -19, -15, -14, -9, 32, -5, -18, -12, -3, -19, -6, 1, -13, 0, -16, 6, -5, 0, 15, 11, 16, -14, 9, -23, -28, 5, -6, -8, 2, -10, 22, 7, -16, -11, -15, 8, 12, 4, 31, 1, -10, 18, 11, 17, -14, -5, -2, 19, -25, 28, 1, -12, -10, 34, -5, -10, 9, 23, 33, -25, -26, 0, 21, 21, -12, -31, -17, -10, 7, -8, -16, -11, -12, -23, 35, 6, 2, 5, -2, 34, 14, -5, -3, -11, 11, -11, -19, 12, 0, -16, 5, 3, 17, 31, -12, -2, -9, 10, 7, 6, -4, 31, 15, -10, 1, 27, 17, -3, -18, 8, -18, 9, -5, -23, -13, 25, 8, 1, -2, 21, -3, -5, -11, 14, -7, 7, -10, -2, 12, -7, -30, 4, 6, 8, 2, 37, -36, 14, 10, 1, -25, -9, -6, 8, 0, 7, 2, 10, 16, -22, 2, 0]
7561@J0j6J7k9OoJ8l4L3J0k7K9Nm8J7j4M6j4jj1k0L2Nj7OLK1jk7PJ5j8kK5J1l0
7597ANj2j6L6Lk0K8j2Mn2N4l7K9k6K5mk3J2rJ9j2%klJ5j6KMRj1J3k3qKkL3k8J9
7635clJ4j5j8J5j4NJ8k4M5j9MjkjPpqN9k6j4k3J1j6K2j2L2l9J6nK2j0l9L6Pk3
7671iK5k3j6RJ9l5J6JQK8j8jK4m1J1J4lj9L9qm3J7J1O%k6QKJ4k8OJ5lk4L5prq
7709a3nk0K4K7k1L9l9%K3m8M5J0k1K6nl7OK4m4N4m6K5j3RJ3m0L4j7Pj1jJ5k4J3
7743a1J5ok0J4J2J9l4QKPK8m3M3m0Jm2N1J5qj7lJ5K1l7J4rj0K2k8J2j2M2n8K1
7777a6J3J5k8J4qj1J9pJ1J0J%jm0N9k0n1N5rm3L0K0l5QRk0L5K6l3j6Qk0K9lk1
7812b0J5J3j3J2j7J6OoKl1J0L3J6m0J4Lj5j2J0J9Pj1k4J6j2Kj9L5k4LJ5nj7M3
$$ y = [0, 10, -6, 11, -18, -12, -18, 0, -34, -1, 9, -18, 11, 16, -32, -15, -29, 17, 3, 2, -9, -29, 3, 8, -9, -3, 0, 21, 20, -7, 0, 15, -3, -5, 20, 31, 1, 6, -6, -22, 14, 17, -3, 25, 13, 17, -35, 19, -18, 11, -15, 10, 6, -17, -5, -14, 5, -7, -7, -9, -12, 3, -13, -11, -7, 2, -9, 4, -19, -27, -25, -27, 6, -22, -3, -6, 8, -7, -25, -10, -24, -19, -1, -25, 20, 1, 5, 4, 2, 1, 8, 1, -7, 52, 26, 12, -11, 0, -16, 6, -6, 26, -13, 3, -2, 20, 10, -29, 7, 14, -9, 16, -7, -23, -14, 5, -30, -14, -13, -5, 23, 5, 4, 28, -13, -2, 12, 9, -10, 29, 21, -22, -5, 6, 12, 12, -14, -6, -4, 10, -18, -12, 3, 0, -24, 11, 4, -5, -13, -18, -38, -14, 13, -8, 31, -8, -8, 15, -33, 12, 22, 1, 27, 22, -15, -9, 15, -29, 25, -21, 4, -9, 0, 13, -27, 7, -10, -3, -14, -15, 0, -24, -11, 4, -2, -22, -8, 4, 23, -11, -3, -1, 6, 34, -9, 34, -6, -5, -47, 4, 19, 11, -6, -9, 6, 27, -10, 4, -5, -15, 7, -21, -9, -21, 21, -37, -16, -3, 12, -16, -2, -10, -21, -2, -9, 2, 12, 13, 13, 12, -28, 31, 11, -40, 15, 6, -37, -7, 13, -22, -14, -5, -25, 10, 36, 3, -13, -5, -25, 4, 1, -20, -5, 8, -5, 7, -10, 6, 12, 6, 8, -23, -13, 20, 36, -4, 10, 13, -2, -14, -4, 15, 22, 11, -13, 3, -9, -7, -26, 9, -15, -12, 3, -2, -19, 24]
7846B4k9mKNKj5jK7k9J0N7m9k5K8l3J9J3j3J9Nk4K0j5j3K3j0J8Jm4K3J7k5j1J3
7880a4J3l2K5pL5J2j9Nj1K6%l1j0J2Pk9QMK3K5o1K6j3j0J2Pk5M1j7j3rK1mpPK
7916aj2J1j7J9oRmJ6j9pLJ1j8K4j1jj2J3Qj5J7l7L4J3l2K0Qmk2%L5l5J6%j8K9
7952A5j8J3rJ3j9J1j6NJ2kpl7L5mNJ4lJkk2Nk1J8J3j5k8K8L1k7K1j6J1k1OLK1
7988A4j6qNJ0lkJOk3J7OJ2j7j7J2k0K6pj4j5L4nk6L9j0nJ8k2jRj3M0j1k3MJ3%
8025H%mPj1J2lk4MPrK7ok4J8j3oL1l6KK5J5Ol1rL1Kk3nQNj6NJ8j6K2k5j1KJ8j5
8065a4j6O5k3Rmj4j4K6Lj5mPRl6L0k1J2J3J5l4Pj8k5J3N4ok9K7Kk9Ok5K4MJ6l9
8101b4lL9nl7MJ8L8l9Njkjj6J3QJ0K6k5pQKj4m0M1Ml%K4j6m%kJ1l4L6l0MK4Pj6
$$ y = [24, -5, -9, -7, -2, 0, -15, -16, 11, -18, -8, 49, 0, -25, 3, -30, -11, 2, -11, 8, 13, -11, 9, -6, -19, 4, -6, 12, 13, -31, -8, 9, -16, -27, -14, -1, -33, -8, -15, 20, 32, 13, 18, 7, 33, 33, 2, -8, 4, 11, -18, -10, -6, 17, 42, -19, 7, -6, -16, -4, 3, -22, 19, 2, -11, -20, 1, -3, -10, -3, -1, -13, -2, -19, 0, -6, 3, -1, 15, -4, -11, -8, 3, -15, 9, -2, -3, -15, -2, 6, -9, 8, -29, 5, 18, -14, 6, 14, 10, -12, -12, 23, -12, 4, 4, -14, 15, -3, 10, 1, 14, -5, 6, -10, -5, 7, 5, -2, -39, -4, -8, -3, 11, 8, 9, 7, -15, -10, -31, -13, 0, -15, -43, -15, 16, -11, 10, -6, 5, -16, -10, -7, 14, -2, -10, -5, 5, 2, 0, 1, 7, -16, 1, 7, 19, 2, -15, -3, -23, 3, -4, -18, -33, 1, -4, -30, 9, -1, -6, 12, -10, -11, -2, -15, 25, 14, -9, -5, 8, 8, 8, 4, 11, 0, 12, 9, -15, -11, -4, -13, 14, 8, -16, 2, -11, -17, 14, -22, -20, 5, 20, 26, -5, -14, 17, 19, -4, -9, -1, 4, -12, -7, 11, -5, 17, -8, -19, -17, 1, -14, -30, 35, 12, 21, 17, 3, -11, 15, 18, 3, -1, 6, 15, -21, 9, -12, 0, 13, 28, -6, 1, -17, -42, -29, 25, 19, -10, 17, 19, -10, -4, -29, -5, -1, 15, -24, -27, 12, 7, -30, -26, -8, 30, -9, -4, -5, -7, -8, -24, -11, -3, 7, 33, 8, 1, 9, 11, -3, -43, -2, 2, -1, -1, 23, 7, 3, 3, 1, 12, -22, 14, -16, -12, 12, 19, 3]
8141CorJ6j2L5m1nLL0LqorNPRk5L1k2jK0l9K4j9J5k0J9K2k2j6L0m4nM7j2Rm9M2
8179@J6m2L0J2k4kK2k3L5l7pm
$$ y = [3, -3, -12, 4, -8, 27, -14, -19, -16, 14, 17, 9, 3, -6, -1, 6, 15, -10, 21, -1, -2, 18, -21, 3, -16, -1, -21, -2, 20, -2, -18, 12, -32, -37, 10, -2, 7, -42, 0, 16, -26, 4, 16, -8, -10, 12, -11, 24, -13, -20, -24]
8191b4
$$ Imaginary data points
##PAGE= N=2
##DATA TABLE= (X++(I..I)), XYDATA
0@%%%%%%%%JrJ6j6K1k9L2m0M8n6P2q5R7j14J34j53J77k02K27k61K99l39L81m29
32b28M84n42O05o77P56q38R28j031J142j263J399j550J718j904K111k346K615
49A379k923L281l704M210m835N626o657Q072j0152J3542k0246N3021j16919K2940
63e3365J68689j87700K9415J53220j42638l5081J42304r9316k1759J11656o6879
74a454l8500P0922n0093K840N6476n1280k271L7474n2551K0392M3102m9207P270
87f880L0167m6390J0157L5075k1436j393K363j1856J3935q892L814K6461l8391
100a3266n970M6743m2863p063O7852m9175l4637O8829l2154l0879O8683k9117
112F983l9012N4054k5097k2542N5292k9660j8189M5627m7686m859P0357n5114
$$ y = [0, 0, 0, 0, 0, 0, 0, 0, 0, 1, -8, 8, -8, 13, -16, 16, -24, 24, -32, 40, -45, 52, -62, 72, -81, 96, -106, 121, -140, 159, -180, 201, -228, 256, -286, 319, -358, 398, -440, 488, -543, 599, -664, 735, -815, 903, -1001, 1110, -1236, 1379, -1544, 1737, -1967, 2243, -2592, 3034, -3623, 4449, -5703, 7839, -12407, 40614, -76305, -53365, 115324, -72376, -42961, 110259, -32379, -67460, 74844, -24472, -46231, 65425, -1454, -39954, 30968, -19125, -16285, 40191, -11089, -13360, 24114, -28437, -8045, 35057, -14150, -6880, 23287, -23103, -12946, 22129, 693, -700, 1663, -10193, 3742, -5150, -1336, 25125, -13266, -19236, 27507, -15356, -22419, 45433, -3742, -38379, 30450, -1704, -32583, 36100, 6983, -32029, 22025, -3072, -25614, 29678, 18, -18171, 27456, -20230, -25089, 45268, -9846]
124i846j9353P4805o1453k9777R5669m5163m9916Q8130l4901o5727Q5411N84o5439
137c6976N2183M741n5994L8389K0566l4658J4165N341j9295R225J729M693J0040
150A4149k4200O67K0129k1217Q431K5559l3494m170K9512k4225q45L1706k3524
163a522j1104K0784j6298L239K2924k1887l480J6123j9991O905K1394k3072J496
176d489J7006k5255L704K5696j7764l637J2653j6643L353J4640j1766M571L398
189E467j6266J1881M154j5968K1109J197l1982K0999J3326l0076K0153J5972l8139
202a8173J1429K4817l0764O398K7938k7274q032K2968j1402l679J6799r341r482
215g798P072J056O52J93m1L237r508k923J5227m304o960J1540r880r485J9372
$$ y = [-9846, -29199, 45606, -15847, -45624, 50045, 4882, -45034, 43096, 8195, -57532, 27879, 28463, -36976, 15207, 19948, -36046, 2343, 22909, -11749, 2416, 7757, -11538, -2313, -584, 4109, 14149, -10051, -9384, 10745, -10472, -2041, 23518, -9976, -14146, 15366, -8859, -9704, 22002, -1522, -12626, 8158, -8140, -4901, 18023, -3864, -7344, 8779, -11212, -4307, 17087, -5985, -4489, 12517, -12738, -9034, 16662, -1102, -4739, 7914, -8729, -5376, 9264, -2502, 2069, 5467, -10799, 1082, 5236, -10732, 10377, 11574, -20408, 591, 13917, -16159, 3994, 19966, -18173, -6744, 18073, -12691, -6293, 21645, -5629, -13661, 9307, -2095, -5774, 11025, 1684, -7798, -726, 330, 982, 1175, 1134, 4371, -5137, -8060, 7167, 2863, -4097, 7443, -2437, -11922, 7450]
230G450k355j2237J3645m073j3526J3428J907p941J0036m641j1304J0393K200
243B982m337O463n347n330P503l321m46Q607o770l841N223o036M155R590j1422
258b327j928Q572r372K275J1923j1180j813J0469j1870j742J6239p000p253Q855
272C848o001m090J1796k022p204N123o82m904L405L862m19l195j961J775q37J538
288C2N605n857n201Q037k193n814J0194p5j0269N700J393p213Q880L629j1742
303d894K257N758o113K399N473n400j364K524k980J153M548j060l313j735J469
318a278K730p18q4R87l493l46L535j867O50M168n366l925O140O11k387L237k314
335B80m091M189J038k895L122Q21m552j01K208O14J351q72k816Q0J498R06L51
$$ y = [7450, 5095, -7142, 6503, 2430, -11096, 2332, 4239, -3702, 6334, 1693, -9611, 782, 2982, -1355, 5108, -239, -5569, 1934, -1387, -1833, 6774, 4, -3837, 1386, -4650, -495, 9095, -2327, -4255, 4317, -5055, -2780, 9143, -2037, -3850, 6619, -5251, -6993, 9246, 2246, -5007, 3848, -2153, -6243, 5553, 3531, -3673, 1450, 768, -4136, -731, 3131, 2712, -483, -2444, -669, -1506, 32, 5637, -220, -5421, 2616, 423, -5391, 4803, 4728, -5541, 159, 1552, -5661, 3219, 6848, -4894, -2637, 3121, -2992, -593, 4880, -520, -1884, 640, -2340, -1187, 3361, 2301, -1012, -2747, -1278, 1452, 734, 650, 1637, -1856, -2202, 1333, -534, 116, 4284, -1082, -5007, 1133, 1744, -643, 2594, 280, -3811, 378, 1416, -1479, 1643, 2464, -2088, -2189, 19, 633, 1984, 1112, -1704, -1624, -126, 780, 1131]
352A131j093j8L23k324N71L821q64k354O26j302l7L899q09l435K013P90l053J563
370e52K805j853q64O10j992O27L901j059l572J349J535j996M82K483j524j472
386a092J541j299j022M302O6n195J448L102l032P28L228l768p95M027l206j806
402b773O163j316n597L448J639l525K998J410n039J690L639m301l45M936k258
417G69l271K820R8j751K898Q0m177J609L390l212r95L815j418k610K548l76j834
434a617L455k34m540K502K791l488M76K339k525K27J855k464M48L070k124j855
450a684J743J33M8M60j347J74J249r93l32Q36K2K36p36j180J615J216j640m64
468f44O14j14L87p3o77O27M82o39o61Q5J628M6k386O58J775j569L45J189k324
$$ y = [1131, 38, 20, 343, -1981, -1410, 2411, 1547, -807, -181, -1483, -1520, 2379, 1570, -1865, 148, 938, -2115, -552, 2253, 400, -464, 146, -1846, -1219, 2682, 1623, -1949, -600, 935, -1061, -579, 1904, 380, -1092, 449, -850, -1872, 2430, 2496, -2699, -1251, 1851, -1181, -453, 2775, -993, -1788, 2239, -967, -2773, 3390, 2074, -3523, -75, 1564, -1961, 1037, 2447, -2592, -902, 2737, -1564, -1909, 3027, 769, -2502, 318, 416, -1335, 1563, 1643, -2534, -925, 2465, -747, -1742, 2073, 655, -1955, 593, 217, -1617, 1838, 1604, -2936, -434, 2357, -1131, -655, 1684, -841, -614, 1241, -1223, -775, 2295, 171, -1684, 59, 192, 240, 700, -647, -473, 776, -217, -549, 287, 309, 545, -191, -1371, 244, 1460, -180, -644, -30, -144, 243, 170, -507, 120, 602, -37, -698, -613, 1015, 1061, -1325, -667, 1108, -461, -116, 1073, -1251]
487a251R98K314l573k12M383k389k306L142j188j345L448j648k896L662M19l492
503a934J738J620j912K98N37j288J002J447j612j351J510J185j600n57J745n28
519C00j107J434o95j173K845n67l632K623K195l439O78J994k786Q74K632l503
535a327k26M116k376k724L471K81k423J708N3k269K132J473l214N2L001j485j787
552a544K109N7j465J510k59k159K156J567l222j3K709j376q75J506j091j58J805
569A257j454j264K355J01j778M54M13o4N72o79o62J002K75n79m68J45J076j74
587E28j483O27J055o69m9k45m19J388j14j685Q98Q11o99K48p40j23K016j233j466
606a354K233p20j053K297k091j018M402k527l284N027q25l476M348j636l579N890
$$ y = [-1251, -253, 2061, -1512, -1724, 2659, 270, -2036, 1106, -82, -1427, 2021, 373, -2523, 1139, 1558, -1934, -196, 1424, -488, -190, 347, -941, 61, 1508, -104, -1455, 55, 1240, -360, -917, 828, 300, -807, 627, -68, -1241, 1604, 1037, -2595, 28, 2223, -1216, -538, 1456, -1330, -456, 2176, -1327, -1553, 2563, 187, -2537, 934, 1215, -1208, 500, 553, -1716, 416, 1889, -1325, -1273, 1728, 243, -1544, 565, 622, -843, 667, 408, -1751, 405, 1972, -1250, -1263, 1446, 70, -805, 701, -390, -548, 1257, -197, -1461, 894, 995, -783, -329, 84, 20, 592, -87, -749, 253, 528, -51, -519, -374, 702, 528, -955, -328, 727, 58, 9, -236, -655, 733, 619, -1066, -168, 643, -56, 192, -548, -671, 1345, 112, -1354, 879, 159, -894, 1403, -688, -1706, 2696, 169, -3115, 1912, 1087, -2389, 1959, 323, -3256, 2634]
622B634j136n389N622N22n483M266N73m511M702J04n551M311J768m427K458L71
638H34k721L305o79k809L390o43k080K500k010M2L932m435r54N364l960p65N141
655C452n470j99O819o519j352Q065n763k210P230n843j057Q147o988k331Q894
670D875n739k525P715n901j375Q095o995j980Q943o030k558P702n778j213P711
685D947o728j803Q295n496k172O466n061l44O023o079m24O276n255m08M587m723
701a899J547L513o254K425M067n866K528K331o163N020K204q236N632L265q900
716d786N345L409r021O433L529j1130O091O067j0691M090N674r817M298N848r872
731d533L462O483q985J871N760o878K530M092p523K825M954o557J758L556n381
$$ y = [2634, 1498, -3891, 1731, 2253, -3230, 1036, 1609, -2902, 1800, 1904, -3647, 664, 2432, -1995, 463, 834, -1887, 1418, 739, -2070, 1320, 677, -1403, 1097, -913, -871, 3061, -1374, -2328, 3036, -924, -1689, 3452, -2018, -2217, 4602, -1917, -3269, 4796, -967, -3177, 4053, -1790, -2847, 5300, -1688, -4019, 4875, -864, -3389, 4326, -1575, -2950, 5145, -1850, -3830, 5113, -917, -3475, 4227, -1551, -2764, 4947, -1781, -3584, 4711, -785, -2957, 3509, -1552, -1896, 4127, -1952, -2376, 3900, -1355, -1763, 2824, -1899, -352, 3161, -3093, -668, 3399, -2467, 61, 2392, -3771, 1249, 3453, -4783, 849, 4114, -4786, 559, 3968, -5053, 1380, 4909, -6221, -130, 5937, -4754, -664, 5010, -4807, -509, 5339, -4533, -1071, 5412, -3573, -1702, 4058, -2820, -290, 3802, -3721, -896, 4058, -2499, -741, 2815, -2566]
746b566K724K507n749L235K832n495K230J955l676L385p7m531M725L28m769M408
762A466m27m111N645j359n507O715j96o246N653J81n306N698o43n833O407L72
778B509o188M810L52m474N262j037n097O065m64n545N573nm950N145p24n211N919
795A940P20n952L599J365l724L036K06l182K859K7k640K277J7r78J689k342m22
812a505L706k219j394K902k143m86L239k857p50L830k562j718L199j213m65J979
828A543k766N5L156k418o09K390j988J59J872k614N20K760k540p97K108j038J51
845e6R11j813O66J329j523J18O44n42J052o53j631K039M67j899R70K71r91J195
863E54l89j199J558K08j271K99q8O76O85j739K5J571j213L5J050j467P33J243
$$ y = [-2566, 158, 2665, -3084, 151, 2983, -2512, -282, 1673, -2003, 1382, 1305, -3226, 1499, 1827, -2942, 1466, 1039, -3072, 2573, 1214, -4293, 2422, 2226, -4020, 1633, 1814, -3492, 2206, 1563, -4270, 2137, 2509, -3679, 1131, 1483, -2991, 2271, 1234, -3863, 2202, 1738, -3807, 1766, 1761, -3189, 1956, 1232, -3979, 1940, 2660, -3292, 307, 1672, -2052, 984, 1190, -1992, 867, 894, -1746, 531, 548, -430, 1259, -1083, -1505, 2201, -18, -1412, 1490, -653, -1139, 2100, -757, -1507, 2323, -239, -1957, 1242, 29, -436, 1543, -1223, -1168, 1988, -430, -1039, 1351, -637, -478, 1394, -1220, -700, 2060, -480, -1277, 831, -207, -56, 855, -958, -292, 1037, -486, -368, 276, -266, 786, 133, -1498, 541, 1008, -891, 79, 350, -641, 554, 165, -1034, 524, 732, -539, -240, -328, 348, 1033, -706, -681, 890, -323, -288, 762, -705, 28, 1271]
881A271k575M58K471j717m78J081j345R62J104k175O67J356j821N71P56j529J744
898H01L35l125J762J896k509P59R51k207J597J111k819J201J817k299J23J097
914D91r89J039J79j982J119R43j169N21r5o58J423q14j281J965p0j253J038q34
932d27k83K283j646j490K738p96j658K201r21j127K811j610k213L348j24k544
948a458K029n5j814K285l15k368K183P71k261O90P32o83Q23n36r55J304Q7q48
966c89M71k66J30Q19j360k72J880p57r56R58n49O0J316j444o26J886n83j118J029
985B29j50j61P41j167l17J694n04r28O82k23R9O30j142oJ448q54p01Q70l76K74
1005A38O35j467o6J794r12q91J155l11l07P82r07l67J676m85j433Q75N99o00J82
$$ y = [1271, -1304, -846, 1625, -92, -570, 511, -834, 128, 1232, -943, -276, 1080, -741, -170, 586, -943, 801, 1136, -1989, -227, 1669, -840, -81, 870, -1337, 260, 1371, -1448, -247, 1570, -729, -606, 491, -498, 541, 720, -1262, -143, 800, -369, 152, 57, -601, 822, 8, -1273, 692, 622, -631, 407, -427, -710, 1573, -73, -1563, 1175, 379, -1279, 922, 1, -1126, 1685, 75, -2138, 1210, 1086, -1458, 571, 516, -1298, 987, 672, -1696, 487, 1258, -1003, -313, 419, -264, 559, 23, -932, 372, 459, -389, 82, -184, -54, 765, -595, -867, 1013, 256, -700, 258, -291, -231, 1085, -359, -985, 901, 318, -800, 229, 79, -82, 659, -508, -825, 869, 365, -563, 119, -104, -5, 625, -517, -523, 925, 71, -630, 240, -136, 138, 773, -694, -760, 1034, 122, -769, 386, 75, -232, 550, -357, -724, 952, 467, -966, -91, 508, -92, 90]
1024I0j50l45O60J47q02m9Q08J84q54l50Q62K35o20J79m8k98Q65k45j241J108
1044A36R34j629j01J266o30p4O91j203o0J741q98j185J370K49j034K72K24l02
1062b33O79J9j198K90J188l92r02M01N51m28j80K74k09K63M77r98n22J537J36
1081G53j318L47N42o09M14J67q73O49P56j372k95J432q4q01R2JN5N72k20o41L60
1102g3N70n91n84P31O25o39m24K69kL68K83q80k13J096k42r81P21O23o93k12J34
1123a14j93O08M20j029l93J023R3p97K90N36n13k6J23m34N06Q59j126r19J347
1142B61L92j033L48L56p09M21L10j017N84J206j331q65J376K09p62M70j46p03
1160f33Q53L45j205M15J162r68r36R93M39m76K15k02o92P96O68j209r2J351o40
$$ y = [90, -60, -405, 255, 402, -400, -449, 359, 543, -311, -661, 201, 436, -184, -5, -53, -351, 514, 269, -972, 136, 1070, -559, -660, 606, -24, -98, 593, -610, -670, 1071, 173, -1012, 358, 607, -427, -155, 69, -233, 446, 465, -733, -443, 745, 353, -549, -148, 403, -25, -205, 69, -140, 123, 600, -398, -920, 617, 753, -565, -218, 324, -285, 129, 296, -577, 72, 828, -544, -839, 593, 509, -292, -200, -199, -144, 428, 208, -433, -73, 497, -94, -678, 53, 678, 39, -385, -116, -118, 250, 533, -347, -560, 536, 294, -687, 34, 657, -36, -248, -114, -307, 301, 721, -308, -701, 322, 415, -382, -92, 444, -69, -95, 28, -406, 100, 959, -167, -1086, 261, 653, -380, -32, 324, -385, 36, 346, -671, -87, 1119, -212, -1077, 299, 508, -254, 216, 70, -633, 220, 565, -640, -225, 937, -31, -967, 26, 465, -11, 204, 2, -690, 106, 774, -435, -527, 824, 184]
1179A84j031R60K34m70N60m22r79J164P08j272o9Q70m32k66K89j25K35L61p20
1198b21n08Q08O31o72n75N56K47m64K25J30m18N83O3j356O53J431j164n36Q81
1217B94m93L8Q46j006k24J306o78r05R20L08k32j42n92M33N96n61J27K0m87R30
1237D98k43j335J547O31k018O88P70j256J192M56k212J208J333k070L91J295j225
1254c50L54L87j334J038R18j455J66L77m20Q28n21p34J521o17j050J389o34l36
1272d73J900j957j094L201j307j769K772j161j651L050j501j966L693q90k938
1287b091K829r5j967K502p55k151K695k64k090J946r7j138J457j200o09K461j238
1304A95j229J776j087k21J898j956k56K528k095p58K385j466j59J856k434l3K830
$$ y = [184, -847, 113, 347, -123, 437, 15, -964, 200, 908, -364, -433, 437, 5, -261, 28, -97, 138, 499, -221, -729, 79, 710, 38, -537, 19, 266, -198, 27, 157, -261, 322, 385, -971, -318, 1113, -51, -587, 294, -199, -161, 685, -321, -545, 761, 83, -822, 98, 406, 174, 32, -560, -127, 469, -92, 35, 55, -432, 498, 255, -1080, 467, 1098, -920, -232, 538, -718, 474, 930, -1282, -74, 1259, -811, -420, 875, -350, 4, 391, -943, 95, 1013, -442, -276, 101, -319, 509, -12, -746, 775, 158, -892, 497, -137, -473, 1427, -530, -1624, 1577, 270, -1499, 1273, 112, -1539, 1511, 10, -1956, 1737, 847, -2091, 738, 643, -1324, 1178, 423, -1728, 967, 703, -1387, 559, 462, -676, 781, -419, -1028, 1433, 195, -1034, 742, -345, -566, 1332, -624, -880, 1648, -447, -1205, 1180, -286, -445, 1411, -1023, -1056, 1774]
1321A774k154n72K273j898o2J960k393M54K589k666n09K344j719K77J786k646
1337a162M75K405k726K04K394k349L28J829k946R58K979l298l48K926k479q2K708
1354A816k663k03L059k628j017L187j343j048J793j558j81K154j496o51J583j043
1370b39o5Q81j335R44J081k357M91J568j614Q36Q05k418J427J497k891J128J869
1387A608k655Q41J325k736J823J825l669J020K273k920J037J879l142J329K067
1402A905l651R91K785k806K87J706k613J284J902l055P96J972k545P40J443k195
1418a054J384J083l020J201J877k201P36Q88k100J329J008k288J099J222j792
1433f28M51L56q46J482l09j651J424M3r86J408q05q61K117j236j501K605n40j510
$$ y = [1774, -380, -952, 1321, -577, -639, 1321, -1072, -618, 1971, -695, -1204, 1140, -579, -302, 1484, -1162, -687, 1718, -1008, -804, 1590, -759, -431, 1398, -1548, -590, 2389, -909, -1257, 1669, -810, -892, 1816, -847, -1050, 2009, -619, -1636, 1551, 208, -840, 953, -605, -786, 1368, -128, -779, 804, -239, -304, 577, -758, 186, 1267, -1090, -599, 969, -645, 191, 996, -1422, 5, 1502, -1389, -261, 1608, -1047, -206, 1119, -1617, 206, 2031, -1638, -618, 1655, -1265, -228, 1651, -1491, -162, 1905, -1746, -755, 2030, -776, -489, 1217, -1396, -112, 1790, -1265, -469, 1503, -1042, -302, 1141, -1054, 330, 1413, -1607, -406, 1471, -730, 6, 894, -1206, 123, 1131, -1157, -58, 1164, -628, -177, 179, -667, 815, 506, -1145, 279, 322, -664, 744, -61, -922, 1195, -41, -1542, 1063, 523, -987]
1451i87J834j008j178K739r61k100K530j79k029J864j12j463J991m13k175J998
1467C51P02j800P73M12j075Q53K29j095O31P25q30l91M70M17j03m39NP2N4L40
1487C01l39l89Q65p5j093N43P00m27lj96m20P23K85p10Q0L60j74j34j04J85M47
1508D25k86n41P0M37L03k62n49L53L25l86k0J08N6K63l94n49Q13M15o96n7L9q2
1530b15N85l03n39P09P6o36J97Q3J12N63q78m91J199r7p36O26k52m25J001n70
1550Iq39J472m4j365O66L60n29O97j79r88Q61M18r61K13M75j83J9l50j94Q27L
1571C88o92K22k5J6N14o15k34R71m30p58P18N0j38M77p64m24J307k78q77P63J
1592A92m79N98m71m13J342l53j287Q90L48o19N76k34p02R67J5r57N89M74n22K6
$$ y = [-987, 847, -161, -1339, 1400, 439, -1661, 869, 690, -1339, 525, 413, -1050, 941, 528, -1647, 351, 1053, -747, 26, 438, -637, 216, 445, -650, -19, 706, -124, -515, -45, 372, 269, -170, -165, -93, -39, 301, -38, -427, 438, 363, -730, -187, 513, 86, 83, -113, -533, 190, 475, -235, -155, 205, 31, -103, -207, -22, 425, 139, -402, -332, 105, 408, 146, -403, -50, 275, -111, -131, -23, 33, 296, -98, -647, 166, 581, -115, -172, -133, -215, 370, 67, -472, 237, 313, -323, -126, -43, 69, 632, -246, -737, 462, 365, -371, 255, 3, -422, 579, 9, -830, 642, 598, -767, -101, 259, -270, 427, 248, -740, 121, 539, -422, -209, 266, 83, 102, -248, -442, 385, 388, -304, -82, -107, -91, 423, -192, -426, 545, 115, -643, 75, 125, -13, 464, -300, -724, 583, 305, -572, 191, 192, -287, 311, -160, -573, 769, 416, -871, 19, 367, -252, 324, 90, -612, 355, 370, -587, 2, 476, -46, -20]
1612b0k75NQ86l86o70N00p6o6N40p36n2J111q99p76J350j11o36O98o15m90J396
1633F78l69j059J000P7p36M55q6j58Q00n77p61P78K28k38J42n11J21P30o99k84
1653d69R42k79m19L09n39L27R62r55m83Q99k76j96N01n18O9P20r00l89J225j19
1673D12o53K68l01J9P54m44n07O36N2n04N0L00J57l9m61j17L74K43L4m02k70O10
1695B11j7o70M71N05n82j01Q5k77O46L82j042p8P49k07k70L50l7j74J61l64n9
1716c18P07Q7p01j97L61K67l4j78n7Q4K4j53n9L52K89n60m48L65M62m6j80k63
1738a96j6L03j0k93L16K91m24m32K67L91J55j90n39k8N43Q0l94J47K63l54j84
1759c04J71J90K71l0p42j28P82J82l98o5M7o4L6p1J14L34m8o33j59N99M54l45
$$ y = [-20, -295, -290, 596, 210, -460, 40, -36, -102, 438, -298, -350, 761, -138, -914, 436, 325, -311, 387, -228, -718, 678, 309, -750, 250, 327, -409, 46, -40, -198, 602, 25, -736, 42, 270, 32, 174, -337, -216, 514, -185, -469, 473, 194, -225, 84, -455, -128, 834, -121, -604, 295, 19, -177, 324, -194, -125, 595, -305, -694, 531, 412, -241, 27, -274, -255, 499, 55, -452, 184, 236, -268, -218, 82, 239, 200, -261, -378, -4, 239, 273, -129, -399, 211, 194, -476, -5, 500, -82, -183, -98, -375, 271, 653, -389, -467, 282, 75, -195, 155, 118, -56, 105, -259, -318, 389, 476, -225, -422, -61, 206, 172, -6, -63, 21, 45, -108, -167, 185, 474, -86, -534, -169, 293, 247, 67, -196, -212, 91, 81, -212, 104, 395, -29, -461, -194, 197, 352, 162, -377, -405, 138, 218, -176, -29, 234, -120, -304, -133, 57, 328, 298, -444, -572, 210, 392, -6, -71, -24, -88, -52, -123, -9, 325, 277, -356, -515, 84, 538, 193]
1781A93m29P1P5N9J58o2J6K01m31m53O61N44m63l20o1n6N16K26o29P8L64m33k50
1804d25N45K33m9m19m22K79O10m4k92k16N4K01k14L7M83o6n88m2J10L51N01n36
1826I1p74N74K92l70L39J36m16J37k18k92R12L03r27j82K53J8M51Rn90K36J33
1847A15m81K13N42n0k36n21j72Q28K35m01r4k62M4M72l03o6P95n95q67P67K24
1868A87j50O11p39q80J171K28q15O51J09p78K65M3k12R29j28j070J70L34J43M31
1888E00n42l15O04m71k64R88k27l46L49r60K9J578n54q21P20n18k21J062n79k27
1908b15J018j064p20J380q8k93N83j096l03J469n21n27R74o33n76P58l48K17R48
1927I63j054o99Q65k00L72M14j189K27P98j133L78J245j143q1N60j273P52J594
$$ y = [193, -236, -165, -90, -31, 127, 65, 81, 282, -149, -602, 59, 603, 140, -180, -241, -297, 219, 445, -184, -106, 258, -175, -425, 120, 353, 304, -115, -537, -258, 352, 308, 16, -200, -146, 55, -159, -122, 361, 295, -293, -335, -225, 126, 627, 91, -683, -109, 183, -187, 152, 288, -128, 9, -209, -501, 411, 714, -213, -395, -142, -124, 327, 336, -254, -18, 115, -366, -153, 389, 339, 103, -418, -590, 238, 473, 72, -22, -284, -240, 232, -71, -137, 658, 63, -804, -37, 187, 37, 648, -91, -971, 200, 428, -387, 264, 373, -405, -140, -97, -309, 620, 492, -578, -408, -74, 69, 500, -42, -357, 247, -224, -488, 500, 273, -73, 276, -684, -655, 923, 369, -452, 268, -250, -471, 591, 12, -215, 803, -261, -981, 399, 311, 18, 601, -495, -798, 671, 150, -377, 597, -36, -612, 146, -202, 15, 963, -91, -790, 75, -125, 247, 661, -528, -301, 497, -636, -258, 987, -156, -237, 323, -950, -198, 1396]
1945A396j626m50J146r31J00J212j016j8Q72j403K8J458n27j87J96j160O78J127
1963H95j155K13P12j303K50Q09q25P78O07j860J65J317p16L81L91j424M81Q56
1981E72j184O79R56j376j9L93p20J126O87j717J64P20p94O55M92j014N40l5j178
2000a053J158P42r86L64l97r68J704K52j516J051O5j599J329M41j182J396k09
2017E92k163J411J159j355P01J90j649J070P28j308J015M89j645L02N77l83J055
2034G86j80j472N92M52m44P66k28o16O42p04l41J574k85q46M92q91P6J792r57
2053B08q21J232r71n50J565n45l31J146j506o83J967l28n64P93j156k68J515p99
2071i6k11J293j183o28J004m52M56R78j594m51J212m46J39P65j012q9N83q78M59
$$ y = [1396, -230, -680, 466, -465, -365, 847, -169, -187, 685, -718, -690, 768, 241, 54, 250, -910, -232, 895, -260, -47, 665, -638, -388, 421, -404, 374, 981, -879, -714, 603, -113, 268, 659, -765, -284, 572, -612, 67, 1023, -353, -372, 21, -699, 427, 1114, -603, -439, 281, -513, 142, 634, -380, 160, 125, -1053, 105, 847, -139, 225, -172, -1140, 564, 816, -700, 351, 416, -1183, 146, 587, -595, 801, 592, -1571, -160, 999, -356, 345, 535, -1114, -44, 684, -624, 391, 880, -765, -463, 114, -269, 786, 606, -866, -274, 178, -266, 500, 272, -344, 298, -406, -747, 827, 542, -304, 188, -703, -627, 1165, 208, -613, 619, -352, -902, 663, 118, -213, 933, -573, -1256, 711, 383, -181, 612, -544, -812, 703, -96, -307, 986, -197, -825, 179, -273, 183, 1161, -433, -884, 328, -118, 21, 786, -226, -315, 268, -610, -151]
2090a51J121q08m19L2l69R37M30r73J35O5n39O57J51l51P28p02j047J265K93n20
2110f5P01q40q77J608j82r65J358l83j320J068j04m74J580o77j671J237L21p31
2128d16J031k71j014Q04j85n94J209L4q67J01l22K87R90o08m44L71n03J79P11
2147D93o48L37M12j416K26J323o33O4L36j402N46J187j080J40R25j272r0R64q24
2166d12O95P72j780n9J268o63K78O14j267K39Q44j155N03J137j222k20N66q39
2184g01R10Q38j518N9Q19r66M74Q12j081M32M23j474O60J361j113m2L35j014P22
2203f4R02j183L08N94j094K30O36m89O53n0j388P34O66o70O67k03j017J031Pj062
2223g92J345K23j519O74J51p61J445m1j771J074L83j147J073K79j236Q58q6j228
$$ y = [-151, 970, 162, -257, -225, -594, 343, 773, -200, -65, 0, -539, 118, 269, -82, 646, -56, -1103, 162, 455, -65, 636, -204, -1081, 527, 345, -620, 738, 355, -965, 103, -1, -475, 1105, 428, -1243, -6, 315, -416, 615, 344, -670, 134, -51, -645, 564, 598, -269, -168, -490, -203, 787, 179, -265, 106, -397, -218, 493, -155, 182, 594, -822, -596, 727, 94, 158, 494, -908, -362, 825, -255, -115, 810, -462, -552, 412, -412, 283, 1055, -725, -784, 484, -179, 99, 713, -554, -315, 529, -626, -123, 1014, -208, -428, 138, -701, 209, 1047, -471, -412, 407, -559, -85, 727, -354, 78, 501, -973, -313, 1048, -65, -107, 228, -786, -64, 838, -345, -37, 557, -537, -307, 329, -160, 493, 443, -945, -211, 455, -215, 452, 249, -768, 263, 270, -792, 553, 776, -743, -69, 82, -679, 766, 725, -1046, 28, 411, -736, 337, 616, -620, 238, 152, -1076]
2241a076J434N47j332M31np53J244M2j117Q54k9j001Q56J78m62Q02o94r58J417
2260C78L5p58Q25n08p28J222l86p04J376l64j250R08O6l95J055o04j034J048Q4
2279B66o21P10j16n18M51m49j51J049l08o14L02l71K44P85p67k01P52p30j68Q78
2299D23m43J5N17j101p9J346m78n01O18n60k03Q65m78k12Q72n56p09O87J39p8
2319H4K94n79k68O15mj76J86j53k1rl68M63N53o40k02J77j65L97K89p41N5N62
2341C49n62p5O60k06j98J26m63Q0P51k06n28J67J15j01J05PL1J12k66k15K51L14
2363B48P9m08l06L80J64k12J38lk34J79o2k80N19K78o82j68M52m1N3Q6l58QM30
2386B60l28j99N08M6m15r3J35J47J89q4l69M7L42p1l09K10K20k89j47J47M2K08
$$ y = [-1076, 358, 905, -427, 4, -1, -754, 490, 532, -585, 269, 240, -761, 95, 273, -189, 613, -81, -1039, 378, 413, -345, 480, -28, -756, 466, 80, -624, 752, 388, -862, 46, 112, -283, 772, 168, -866, 182, 266, -355, 355, 239, -279, 172, -277, -428, 621, 313, -301, 1, -370, -126, 659, -108, -309, 443, -287, -455, 423, -20, -5, 512, -589, -668, 678, 200, -301, 317, -243, -446, 419, -59, -271, 601, 45, -664, 23, 162, 84, 378, -201, -469, 146, 142, -34, 152, -1, -22, -31, -399, 64, 617, -23, -225, -48, -213, 184, 473, -268, -213, 349, -213, -288, 372, 166, -32, 94, -369, -289, 462, 256, -272, -105, 10, -91, 14, 21, 52, 164, -102, -317, -66, 248, 327, -81, -387, -7, 157, -55, 83, 80, -154, 25, -37, -317, 202, 480, -202, -370, 82, 41, 94, 180, -178, -170, 260, -68, -267, 241, 287, -128, -221, -86, 61, 250, 166, -203, -156, 186, 115, -194, 16, 236, -53, -200, -53, -11, 197]
2408A97j2m30o5N14K2l79J53R5j49l9N8mJ55P6l72j81M49J98l23j36K33n2l0Q1
2432E9j11O0K63l09l69M63L10l97q4J00p8J87J8k55Q1L12k60k45K44K39j11k31
2454a14l4J10J62L0k29r3K72O7m36J51L65j91j48O2j66K33L27n30j43N20j34k54
2476a73K08l0m2J98k43j99M83P0m14n1J54J46k0j87oJ85m0n4j03OL84j28n30L39
2500d7L52l95N9J39l56K91K10n52J49N67m25k39K80o6J29R1l50K8L70j49j97K3
2522h8J15J68k29k24L85P2k65J13j68q0N37k58n38N78J85n72K59R7k80M37j30
2543A14n65M80L67n34J0J76j38J84k2l17K65K11l14j7M9P7J63k65j79M31m3k46
2565a13J98j92M7L96m59k20O79j62m82M29j02j51M38l21l85O63n0n12L25M8j71
$$ y = [197, 185, -245, -310, 204, 226, -153, 0, 95, -54, -93, -35, -39, 116, 192, -180, -361, 88, 286, -37, -173, 60, 8, -22, 59, -52, 8, 271, -38, -407, 56, 366, -31, -115, -15, -93, 94, 112, -143, -62, 250, -10, -255, -11, 228, 117, -114, -148, -38, 124, 154, -75, -168, 104, 171, -265, -114, 251, 60, -88, -26, -192, 41, 368, -162, -305, 215, 81, -173, 35, 5, -37, 161, -82, -281, 202, 272, -142, -193, -39, 107, 87, -100, -106, 79, 39, -15, -118, -112, 272, 144, -386, -47, 305, -90, -31, 108, -248, 43, 253, -299, -150, 417, -8, -247, 33, -33, 96, 187, -163, -135, 235, 86, -111, -88, 27, 195, -34, -258, 127, 199, -66, 47, -121, -201, 336, 78, -460, 118, 303, -269, -10, 87, -193, 244, 114, -451, 29, 396, -138, -128, 48, -90, 94, 72, -245, 20, 231, -83, -100, -51, 26, 189, -76, -255, 176, 133, -113, 85, -107, -60, 336, -123, -343, 336, 174, -308, 121, 19, -132, 306, -15, -400, 263, 213, -299, 26, 74, -97]
2586i7K81k21k57N21j7m34J91PJ6K22l99o2N96l42k73M06j94n9M76n74j94Q72
2608D65l68n41N98p0l05N04l09l54O99j27n67L48J57j53J21k38mM32k83k09L18
2629A14j93J30J98n48J59O38o33j42N57m16R4M20p25R0Q05o64k62O89l19q4L61
2650B69n75Q4P02n77k35N86k88r1L13m55J46N04n07j69M17j42P6M6m13L37K76
2671C04n99K38K30l37L05j5o12O25L00p85K14M07m82K48J62n30L61K98n73L8L87
2692A84j26N7j63k18M40L7l99K08N4j81K73k13k36N78q7n61L11J90j91J63j31
2713a1j86L00J1k82P5J87J1p2k68J63L33k30j76J29n0J62K8l23J30L12l60j04
2735b21K69j1O7rl64J81L20k84o4J82n7%L0k03J88K43k67k46J64K35lk19JJ39
$$ y = [-97, 184, -37, -294, 227, 210, -224, -33, -26, -10, 212, -187, -249, 347, 5, -268, 138, -56, -115, 361, -213, -407, 465, 97, -444, 154, 84, -221, 283, -26, -380, 319, 192, -375, -27, 130, -23, 98, -140, -144, 288, 5, -204, 114, -79, 51, 249, -299, -140, 498, -135, -277, 280, -136, -42, 378, -347, -257, 548, -116, -378, 311, -8, -92, 269, -306, -222, 480, -97, -332, 254, -34, -125, 188, -267, -121, 383, -124, -293, 124, -18, 58, 104, -309, 28, 304, -295, -57, 173, -164, 141, 126, -486, 139, 439, -346, -132, 275, -207, 41, 203, -327, 34, 332, -241, -203, 184, 58, 115, -48, -266, 174, 211, -188, 20, 74, -107, 166, -47, -283, 295, 208, -353, -42, 148, -43, 120, -11, -197, 103, 114, -168, -93, 94, 105, 33, -235, -72, 261, 31, -145, -16, -66, 96, 124, -199, -69, 243, -117, -221, 48, 37, 104, 95, -269, -88, 232, -52, -116, 66, 9, 9, 39, -164, 24, 267, 0, -246, -82, 153, 150, -69, -68, 71]
2759G1r7N4Lj73K78Q5n12M5N88k69j79K10k77N5M19l23k49N45j58l93L00JK7K14
2783B65m24j67M88n6k16J95j68%J94l12L7M79k36l61K13M5M7K09l45p8L35j46
2805bj21J75oO7m5l58K03M20k78j17R8k14K56J27m43K48L13n14M4K71k21L10P
2828B20p19M75M21n93J86K69n47K89K88p06M59N07q72N6M92m20K45L12p28J91
2848a75N36n95R0M24l63P6P6n22N00M18o85Q8K76l77L44J19n58M64J47o89L17
2869h9L46l62K91p1n82N52K79o09K86J30m30L71r3l40O56m3p11M07Q1j82M68l12
2891D3m81O84j05n24N95j8m69M99l30l62R34k14o74N42k5l82N88k22m82P08j87
2912A18o17O00J72m17L10k65l10O95j04m71M01m2k55L07j86q3M95l04m21M58L7
$$ y = [71, -26, 28, 31, -142, 136, 221, -291, -246, 342, 73, -106, 104, -173, -118, 301, -22, -271, 274, 116, -277, 23, 24, 51, 265, -159, -326, 162, 106, -110, 85, -83, -83, 111, -201, -164, 315, 79, -282, -69, -24, 23, 232, -113, -191, 144, -2, -123, 52, 46, 113, 68, -290, -87, 333, 55, -62, 36, -178, 78, 205, -238, 10, 323, -191, -147, 124, -97, 213, 220, -499, -24, 397, -196, -10, 259, -288, 1, 289, -417, 42, 549, -323, -267, 225, -195, 50, 362, -366, -175, 361, -234, -144, 280, -83, -7, 69, -453, 47, 465, -220, -132, 144, -233, 111, 230, -328, 136, 283, -406, -89, 257, -105, 186, 115, -467, 85, 364, -245, 41, 171, -259, 112, 19, -321, 335, 292, -419, -12, 69, -113, 355, 43, -438, 246, 141, -383, 212, 194, -275, 224, -106, -468, 466, 252, -422, 120, 95, -287, 301, 79, -403, 305, 118, -499, 101, 273, -144, 166, -99, -409, 286, 182, -289, 112, 70, -185, 122, -64, -147, 348, 44, -377, 81, 118]
2933A18j62K73l47j20M78k24k53M13k7k07J42k82J41M17k86l07K55l2M0J40l28
2954a58J40K57m25qM01j61L4l7m05L14L85m21n5L28l06L7K10k90J65L24n25j13
2976c09M86q8r5J00k59N6K89k66m6K71o8j48l1k1K53P3l29l0K19l3P0o9o5R2J6
3001F8k53J17K20l9r2j55l1K99J6j99ON1J7j8j32J00K88k79j83J62J15RK5k40
3025a28OK70j50j15K03k0j11L0j58J22L24k43k48J67P2QK1j11J7J92j98j09J99
3048D0J00p7j22j25J95J77j58j02P6j0N0o0q4K01Q1l17k9J96N6K6j24j69K19R0
3072A30k38R7P8m4Lj05p2K99%k80Q0N7k8J58j65j85L80o9l26K03J35j04L6j25
3096h5j50L55P3l62J37J08j03P7j23J4K33q4k30R1Q7N0L6k49K2K77j49j42K25
$$ y = [118, -44, 229, -118, -238, 240, 16, -237, 176, 149, -58, 84, -198, -57, 360, 74, -233, 22, -10, 30, 170, -158, -18, 239, -186, -194, 207, 46, 80, 43, -362, -48, 337, -84, -139, 189, -117, -80, 130, -160, 5, 329, -196, -309, 177, 89, -6, 94, -165, -109, 180, -86, -132, 139, 71, -77, -108, -129, 124, 197, -132, -162, 57, 24, 94, 25, -40, 52, 68, -185, -68, 152, 113, 21, -134, -165, 134, 150, -49, -43, 8, 25, 7, -125, -25, 263, -16, -199, -37, 78, 87, 112, -128, -122, 148, -2, -117, 86, 66, -45, -15, -173, -51, 273, 30, -218, -51, 21, 29, 50, -61, -44, 148, -50, -159, 40, 140, 63, -59, -184, 11, 188, 30, -72, 4, -6, 44, -16, -100, 101, 182, -135, -164, 32, 88, 114, -10, -179, 40, 130, -108, -11, 67, 23, 26, -79, -151, 148, 148, -132, -52, 5, -23, 135, -30, -215, 165, 96, -230, -27, 108, 4, 40, -85, -235, 120, 193, -169, -32, 76, -27, 50, -73, -59, 174, 90, -140, -49, 38, 88, 124, -125, -103, 174, 25, -117, 108]
3119A08m8o0R6k55N7M05k70k41K57k3n7J46j77m2K99j98j90K50L1o8l4j65J24
3142e5K68k20r2J35n9P0k6k22K57K06m41j8L08j62Q3Q8l33J77K92m03j4L74k21
3165hl7J33k76J55L30l53j49L08p0n8M5n8J20P3k95O4J94q7O4j43j58L48L2l91
3189b17K19J02k24K24p0k96M49R8n49J22L49k92J13M6k70K78J03m20K08J93k06
3210d0L6q0j00L77l8l98K70N8k29K52j12j76L85q9m43L42J56l12J83p2j78L99
3232A91n2l98L35R6l13J91n3j40L66j20l54K91O2j35J07j32k2K65k31j42L27p4
3254F5q9J57k93O0M34m16j91N29k32k68M13k48j17N01l09l29M53M1k96J57n6p5
3276a09K64j97j25K94o7j09N0j47J69K51m18j3L84k55p8K51k62Q2K78l84n1M21
$$ y = [108, 60, 0, 96, -159, -102, 303, 33, -208, 49, 26, -31, 115, -62, -104, 195, -3, -193, 57, 88, 20, -14, -179, -55, 213, -7, -99, 36, -23, 47, 21, -201, 56, 262, -179, -197, 111, -51, 32, 120, -213, -36, 256, -147, -161, 213, -8, -45, 88, -188, -33, 297, -56, -205, 103, 33, -25, 20, -38, 82, 155, -140, -76, 118, 31, 95, -48, -206, 142, 174, -217, 2, 104, -120, 104, 34, -262, 187, 285, -264, -142, 207, -85, 28, 74, -196, 82, 185, -235, -27, 166, -40, -4, -84, -184, 193, 155, -243, 27, 85, -144, 108, -4, -180, 205, 116, -327, 15, 171, -141, 42, -30, -208, 191, 139, -259, 76, 172, -141, 50, -3, -143, 223, 103, -251, 40, 102, -33, 74, -58, -80, 185, -46, -188, 139, 65, -24, 133, -160, -100, 334, -82, -273, 256, 24, -244, 169, -79, -196, 305, -4, -333, 120, 161, -135, 22, -34, -109, 155, -42, -167, 127, 60, -49, 1, -146, 23, 274, -144, -157, 227, -28, -106, 145, -117, -35, 243, -141, -192, 229]
3298B29j87j31J38j51J24J93l03l1L20j87j10J47j11Q1J85l34rL22j71p7R1o8
3320d0J20L1k88J54J68j95LL5j63L05N7m39J45L49l27q2K87j49j9K03k52p4L61
3343A90n6k86O6J67j7r6l2J25l1j9qr9M6K86j83k83K69J00k19R5J9q8J44l0k55
3368a95K08J87k48n6J29j8O7j9j81J00J66j49p4J12J5m9Mp9N0J45n1j97N7K02
3392A26q5j83J26P1n9J4kj07J45J22l14J3K45j6j62k7R6O8k7j01K2O5K5K1k02
3417a26O6K77j95k24K52L0j46J41o3j52K81n4k50R5K04r2j05l0R8R2j21l1Q8m5
3441a0N3j3k15J96K13l41m9K85j35m6J41k84J36L36l83o5L51j61r9J98k52R1L67
3464C14m39j13M24j70j26K42j81k7K78k86r6L57j19r7N0j26J67J06l07J23J71
$$ y = [229, 42, -89, 49, -102, 22, 215, -88, -119, 201, 14, -96, 51, -60, 21, 206, -128, -137, 185, 14, -63, 28, -40, 80, 111, -177, -23, 145, -50, -47, -12, -175, 130, 187, -252, -107, 242, -85, -167, 120, -29, -48, 155, -97, -171, 190, 134, -152, -86, 81, 64, -32, -64, 61, 30, 11, 3, -96, -50, 236, 53, -230, 39, 139, -80, 15, 34, -54, 90, 60, -195, 13, 200, -48, -104, 25, 7, 74, 55, -126, -26, 140, -9, -83, 29, 44, -5, -1, -80, -30, 115, 64, -133, -76, 126, 41, -142, -16, 55, -4, 10, 8, -99, 46, 168, -146, -133, 112, 96, -66, -93, 3, 71, 44, -57, -35, 30, 55, 76, -126, -60, 217, 22, -202, 50, 80, -66, 75, 12, -140, 141, 87, -163, -68, 136, 44, -61, -91, 7, 99, -22, -53, 35, -10, 43, 30, -185, 11, 224, -117, -166, 119, -16, -62, 79, -205, -69, 267, -116, -181, 170, 9, -90, 108, -144, -53, 314, -125, -238, 186, 16, -110, 132, -49, -76, 202, -84, -180, 177, 58, -39, 11, -115, 52, 158, -149, -26, 145]
3485A45k18J09O8l50L39K08n68J52M22l99%K54l40J71K65m33L6L22k02l2O7j04
3507h8J83M6l44J74J37j98J35k8k22L76k2m58L48J75m06K19P4l42L20J38m88K41
3529c0K95m16P0J93k56J95J54m35J73K90k92JJ66k08J73O9l32J73J88k38L3M6
3551A2o2J89o0k47K01R3k23J42k9j25K87j47l50M38O8l63J80K3k12K97j8l71L01
3574B4J57l34R8Q1j01J86r5j95K39L3j84J16n7n7K64k07k25M46o7l25K70l2j73
3597a38L01j18l47M16P8l86J85J43j59R7k7k06K68K9k39O8J02j0j1j06m7K23m3
3620G3j47Q0k3QR7k16M8K52k14m4J47j18M3J80l01OL52k27j70K81j09n2J86k07
3644g5j11L50j05k46J75L3k4K2j15P7J25j14m8L1J2J00j1k23J42J55k02k7J81
$$ y = [145, -73, 36, 104, -246, 93, 301, -267, -115, 307, -92, -92, 162, -178, -7, 258, -175, -139, 183, -19, -51, 16, -88, 95, 141, -203, -29, 108, -90, 45, 17, -205, 171, 149, -309, 39, 214, -192, 27, 101, -241, 79, 217, -271, -30, 265, -151, -81, 112, -144, 51, 205, -230, -57, 233, -59, -58, 108, -100, 73, 142, -190, -17, 171, -67, -34, 12, -50, 139, 79, -168, 33, 126, -97, 45, 16, -109, 178, 31, -319, 119, 187, -176, 4, 27, -185, 112, 94, -277, 24, 181, -153, -55, 26, -75, 111, 16, -179, 60, 93, -91, 25, -32, -89, 175, -32, -257, 189, 122, -203, 67, 35, -138, 163, 45, -302, 114, 192, -194, -9, 134, -25, 72, 45, -161, 107, 136, -103, -35, 67, 57, 46, -60, -107, 116, 73, -74, 6, -17, -9, 88, -128, -80, 172, -42, -86, 61, -57, -14, 166, -135, -129, 223, -4, -174, 107, -2, -54, 132, -75, -186, 164, 59, -187, -12, 21, -3, 19, -96, -19, 106, -8, -56, -25, -13, 87, 76, -147, -5, 150, -52, -79, 102]
3667A02j12J8Q6k27P8K24j47j54J49N6m0m8m1N6N6l4q2MJ19Nj60J1J82l7p8Jn5
3694f8P5J21j87n5K25q9j29J15j6j4J23j50j05K62k5j98J02L7nJ4l4n8J15M8j43
3719c9n4J35O1j00q4Q9L0l4L3o3KJ36r8j50J95N8j01rn7kJ19k8j22P4J01j20k0
3746d8L0L1R2j26j33J51Q6r6k7j7%J08m0j29J47K5r4m9O6N7O8j15j50J99J2o2
3772a4Kk1M0Q5j09j08J73N1j56jO8N1mm2j02J07N1q6n6Q1O1j7j35J4J31l0m5J8
3800Gq9R9P9j91K2J92j17p1L8J2P5L8k02K7J62n2r4P6j3OK1r7JK05j13j31Q4O
3828b0J9L2j15J2J46p0p6O5K7K8l1j18J01J26j09l0K9q2J36nj47P9J19j40n7J30
3854D9l2L8j1j72R0J27o9q3M8K3M7q6p5J75K8j68Q2Or6J92r3j97K48M7k47J04
$$ y = [102, -10, 8, 94, -133, -55, 169, 22, -132, 17, 73, 33, -15, -56, 0, 56, 22, -60, -56, 63, 68, -92, -81, 101, 64, -14, -13, -68, 7, 128, -59, -114, 111, 22, -107, 8, -8, -22, 101, -49, -154, 108, 83, -115, -13, 24, 19, 33, -1, -59, 56, 104, -39, -93, 42, 103, 3, -81, 8, 38, 4, 37, -26, -24, 112, 14, -136, 59, 117, 16, 7, -50, -52, 67, 39, -83, -9, 92, -28, -48, -18, 13, 105, -21, -154, -3, 83, -13, -40, -57, -57, 51, 11, -118, 29, 54, -40, -89, -23, 34, 102, -13, -163, 36, 48, -14, -12, -33, 7, 92, -17, -125, 48, 99, -57, -58, 10, 61, 57, 15, -87, 20, 71, -15, -71, 10, 71, 54, -81, -67, 64, 34, -11, 7, -82, 17, 96, -95, -73, 119, 2, -69, -31, -19, 56, 94, -108, -81, 81, 29, -65, 11, -2, 4, 25, -72, -71, 134, 21, -110, -26, -20, -1, 31, -84, -72, 74, 4, -72, -7, 20, 48, 17, -101, 0, 126, 17, -13, 16, -66, 70, 65, -82, -3, 116, -24, -81, 49, 17, 55, 44, -128, -38, 89, 20, -63, -15, 8, 55, -31, -106, 69, 97, -71, 11, 17, -79, 113, 20, -177, 71, 118, -129, -25]
3880b5R3j41R6kk10K23J39k44qJ14p1O8oj19J20O0j91M3P4l0Q4j11n1J83j3j28
3906e3O3k0K2P7j20n2K02n1k12J67L6o7Q2q3j35K33nk23J51M0o9K9k8n9J56k6
3932E5j57N1P5j8J7j09K1J48j12m5Q7k5M2L5j90L4K44j49j70K35l3j44J68p8p9
3957i7J92j6k28J19J53j25pJ2k4M8lq3J2J05j4p2n3J68L7j51l7J27n0nM7j59O1
3984d3J69j46j13K42l0j72R2m6n2K33j05j83J77N7j78P7P2r0Q8oj77J24J00j17
4008b7p7Q4L5jOo6M7L3ro1k9J36N0k22lK10j13k9J11j07j6J53j15j38K53L2k85
4035a48J06R3m2J4K1j43Q6R2n8j18J08J00j20j00Q6O8l5m7K1l6O3L8o0j04K09
4060I4o4j46R5N2o3L5j0j25J96M3k14K2J97j58J9J08j33N6J37k89M4K37m2j60
$$ y = [-25, 68, -73, 23, 21, -189, 34, 173, -71, -79, 35, -36, 32, 26, -93, 27, 87, -104, -61, 13, -17, 67, -44, -95, 88, 75, -53, 10, -10, 12, 89, -31, -83, 119, 68, -144, 23, 59, -8, 74, -9, -144, 89, 84, -139, 12, 52, -17, 12, -16, -75, 81, 55, -102, -51, 24, 6, 23, -86, -65, 83, -29, -74, 13, -12, 30, 65, -125, -91, 153, 4, -166, 69, 36, -108, 60, -18, -97, 95, 79, -149, -30, 123, -2, -9, 3, -21, 27, 24, -59, -47, 58, 44, -28, -81, 87, 124, -27, -64, 63, 13, 8, 55, -104, -43, 126, -20, -133, 109, 79, -93, -1, -47, -99, 134, 29, -154, 23, 80, -98, -21, 51, -39, 49, 43, -134, -10, 90, -27, -104, -20, 15, 14, 20, -46, 1, 34, 25, -36, -65, 71, 121, -101, -104, 106, -7, -36, 75, -32, -48, 105, -10, -148, 105, 137, -148, -42, 51, 9, 23, 44, -99, -13, 79, 21, -97, 11, 111, -9, -109, -23, 45, 10, -37, -16, -52, 11, 49, -11, -115, 94, 30, -116, -21, 31, -32, 3, -7, -132, 64, 107, -107, -85, 112, -46, -27, 81, -52, 4, 141, -148, -104, 133, 91, -69]
4084f9J01m6k2J14n8p6R1O3j24o9J24R2j33r9J46Nn9J30j06j42K64l0l16K85J22
4109A88l05Q2J18k06J77J35l10kK88j87n8J56r0J4np5L1J54j08j6n1rJ92j01j36
4134a24J92k2j57J66j5j33K63j26k87L01J47k98J35O9k71K36N3k83J74K09l39
4155a10J6J75n8l0P5j33K1J05o0l7J7N0K9j33k4K17j00j09J67j63m2L01j66k10
4179b02L20n0k87K35Q8k25J86rk80K28J53k69L9J05q8M0P5j20P8O0j57M3O9RL4
4204G5j48j1K02j03r3J32k7n4Q0j30m1K93p0k46J83L0j40J53k6j98J80L5k66J53
4228c7J62j25m1N1q8J05M9r4l1L6M6j3j30J52L9j79JJ44j06M5J34k45K3K57j50
4253Ej46K74q7j70J69m5j07K31k9k45J46R4j13L2J3n3L0lm4L4R1l2q6n0J19Q6
$$ y = [-69, 32, -14, -36, 78, 20, -56, 35, 98, -26, -95, 29, 121, -12, -111, 35, 40, -19, 111, 5, -137, 127, 97, -219, 66, 188, -117, -35, 83, -123, 54, 189, -121, -123, 165, -22, -80, 76, -14, 0, -5, -80, -49, 105, -3, -19, -70, -79, 113, 12, -124, 68, 46, -111, 55, 40, -93, 170, 44, -243, 58, 205, -93, 42, 111, -160, 76, 129, -154, 20, 229, -110, -94, 81, 23, -7, 68, -65, -44, 61, 1, -36, -19, 31, 60, -73, -97, 120, 20, -89, 78, -85, -127, 174, 8, -202, 118, 68, -219, 16, 104, -121, 65, 56, -224, 4, 157, -112, -73, 32, -56, -16, 59, -61, 17, 77, -80, -37, 32, 41, 75, -73, -84, 118, 15, -78, 54, 27, -27, 53, -77, -118, 175, 105, -141, 42, 72, -68, 85, 59, -139, 41, 76, -190, -37, 125, 0, -41, 10, -78, 27, 76, -18, -49, -13, 33, 20, -110, 42, 81, -98, -97, 47, -59, -14, 120, -125, -102, 155, 5, -141, 133, 46, -124, 45, 0, -107, 124, 95, -150, -4, 90, -23, 9, 22, -31, -1, -4, -48, -14, 77, 45, -41, -91, 28, 114]
4279A14j47oP5m5M0K5j28J14R2k06k4K12q7o0P5r5j0J42j20j9R9lr7kO0M1j5o8
4307d3j5mP8L7j06k4J32n6r3J33K8j36J06l7j05J43J13k14K3J41j30l4J12j9j8
4332A2J7l4p6J44O4j63l1J30l1p7M3K8o7N9pj28J10J14j54n4J31j4k6L7p8lJ03
4359D9n0j01R6N9q9qKK3M7l3lj0lN1p9mJ13k0j03M2K6oO5n9j21J45Q2j58K3R3
4389F9j04J1J4K2J4M8m1q4O1N5l3p9M4P3q1K7j8j5N5K1j39M2J74j20p6O9pk7N2
4418B7n6m0J34k8j60R7J04q2m5K7j9M9j0n3lQ0No6m0O7J20j07n6M2K3J1L7r2J3
4447b1J19j18p7J43j6p5P8n9qJ04j4j18N4P2p4k0L0L2ko0j7N4N0K0q8o1J07M2
4475G7j53N4O5p1N5k5j14J14J13j84l1J78q2m0O7q0J7J37j13p6J44Nj01mM1J0
$$ y = [114, -33, -39, 36, -9, 31, 56, -72, 42, 134, -72, -96, 116, 29, -31, 44, -51, -61, 81, -39, -58, 41, 38, -59, -61, -1, 40, 25, -43, -58, -62, 16, 53, -53, -77, 55, -1, -94, 39, 67, -69, 37, 0, -105, 38, 151, -63, -40, 101, -29, -63, 49, 30, 12, 29, -5, -81, 63, 127, -36, -67, 63, 32, -45, -2, 26, -41, 18, 11, -117, -7, 107, -47, -101, 30, 16, -10, 27, -51, -54, 49, -1, -102, -6, 53, -36, -44, -42, -19, 28, -5, -8, -18, -21, 30, -49, -53, 60, 40, -63, -21, 5, -1, 64, 5, -116, 29, 111, -47, -24, 69, -35, -24, -10, 12, 26, 74, 33, -51, 10, 65, 32, -47, -3, 70, -11, 16, -2, -17, 38, 59, -80, -38, 136, 16, -60, 9, 2, -25, 27, -29, -69, 65, 37, -123, -26, 78, -4, -49, -22, -41, 8, -2, -55, -58, 22, 27, -39, -79, -12, 108, 1, -55, -13, 10, 21, 58, -34, -21, 98, -20, -97, 46, 30, -45, 33, -26, -34, 70, 56, -62, -8, 64, -10, -30, 0, 32, 30, -30, -47, 7, 57, 77, -11, -72, 35, 77, -76, -22, 43, -28, 27, 2, -112, 2, 115, -69, -100, 78, -4, -44, 23, -57, -40, 97, -16, -92, 52, 57, -44, -48, -7, 3]
4501CL0q0L1J7J4J7n5j5J09j1j63J24L7p8P1m0q2J24J8j42N6J28j26l7P7l5M6
4528C8K2p6l1P5qn4J8N1Jm5j9J2M4Jk1p2K1J36o7j06J23m5q3J03l9l2P6J7j45
4557a05R4J00j12L5rp9Q8L7j02K8J09o7p9O3M8l7j8k4L9RK7j2q0M9P9r8n7J37
4585F3j8o7K3Qo4J37n8r6Q0R1j35RM3m2O2m8o0Q7L2o7k0L4QNj9n5P0Lo1L5%O8
4617D8J5j14k2J15m1n4Q9j1m2J01o3j40K23j8j52O8L6n4P4Kj05O6O9r6k2O2mm6
4645a6qK2K1J7l9j7mM1oo7N6N4n5r4J46n7k6O1p3l6J36m7q5Q4Qo8O0Qk9P1l9j06
4677h7N5M9j4K1n3PL7j3m6Q1J3n0k5NJ1P0nq5M0Kk9L4j1k2P4l4j02R7O8j07Jo
$$ y = [3, 33, -47, -16, 1, 15, 32, -23, -38, 71, 60, -103, 21, 58, -20, 51, 11, -71, 53, 71, -71, -15, 113, -13, -50, 27, -8, 38, 60, -16, -47, 28, 20, -34, -16, 35, 36, -9, -28, -16, 28, 29, 8, -64, -43, 93, 26, -80, 43, -2, -85, 18, -21, -53, 23, 40, -105, -11, 89, -23, 12, 3, -76, 12, 49, -53, -25, 84, 17, -62, 1, 49, 12, -6, -30, 9, 18, 45, 33, -47, 2, 81, -17, -74, 63, 45, -22, 1, 9, -55, 82, 24, -72, 8, 99, -36, -27, 16, -26, 36, -12, -72, 15, 47, -20, -40, -6, 2, 7, -12, -67, 3, 6, -55, -20, -20, 48, 63, -51, -73, 42, 1, -53, 36, 25, -17, 84, 21, -119, 104, 86, -66, 2, 38, -16, 58, 60, -45, 21, 90, -6, -28, 34, 30, -16, -24, -2, 19, 36, -3, -20, -24, 17, 11, -56, 0, 54, -1, -95, 51, -6, -32, 29, -44, -80, 56, 9, -76, 8, 16, -52, 8, 16, -13, 58, 19, -87, -32, 17, 3, 24, -29, -22, 15, 2, -44, 37, 50, 0, -25, -20, -9, 61, 56, -29, 11, 13, -16, 18, 7, -15, 59, 25, -77, 20, 88, -19, -18, -24]
$$ [...]
8191A0
##END NTUPLES=NMR FID
##END=
