##TITLE=1H_LY-857.1
 CCl4, 8 sc, 
 26.7.2019
##JCAMPDX= 6.0         $$ Bruker NMR JCAMP-DX V2.0
##DATA TYPE= NMR FID
##DATA CLASS= NTUPLES
##ORIGIN= UXNMR, Bruker Analytische Messtechnik GmbH
##OWNER= root
$$ XWIN-NMR		Version 3.5
$$ Fri Jul 26 14:27:59 2019 Russian Standard Time (UT+4h)  she@DPX200
##.OBSERVE FREQUENCY= 200.13155
##.OBSERVE NUCLEUS= ^1H
##.DELAY= (6, 6)
##.ACQUISITION MODE= SIMULTANEOUS
##.ACQUISITION SCHEME= undefined
##.AVERAGES= 8
##.DIGITISER RES= 18
##SPECTROMETER/DATA SYSTEM= spect
##.PULSE SEQUENCE= zg30
##.SOLVENT NAME= CDCl3
##.SHIFT REFERENCE= (INTERNAL, CDCl3, 0, 15.7039)
##AUDIT TRAIL= $$ (NUMBER, WHEN, WHO, WHERE, WHAT)
$$ ##TITLE= Audit trail, XWIN-NMR		Version 3.5
$$ ##JCAMPDX= 5.01
$$ ##ORIGIN= Bruker BioSpin GmbH
$$ ##OWNER= she
$$ F:/spectra/data/she/nmr/H-F/1/audita.txt
$$ ##AUDIT TRAIL=  $$ (NUMBER, WHEN, WHO, WHERE, WHAT)
(   1,<2019-07-26 14:26:56.81 +0400>,<she>,<DPX200>,
      <created by zg, POWCHK disabled, PULCHK disabled
       configuration hash MD5:
       00 E9 B6 7A A2 85 ED C7 34 08 36 98 17 FE 4E 26
       data hash MD5: 16K
       D5 50 10 58 32 9A 68 80 44 9A 12 EF 28 9C EB 3E>)
$$ ##END=
$$ 
$$ hash MD5
$$ F4 DD DE 6B 6F 6A A0 F9 91 15 B4 BA 72 35 EC 9E
##$RELAX= 
##$RELAX= 
##$RELAX= 
##$RELAX= 
##$RELAX= 
##$RELAX= 
$$ Bruker specific parameters
$$ --------------------------
##$DU= <F:/spectra>
##$EXPNO= 1
##$NAME= <H-F>
##$PROCNO= 1
##$TYPE= <nmr>
##$USER= <she>
##$AMP= (0..31)
100 100 100 100 100 100 100 100 100 100 100 100 100 100 100 100 100 100 
100 100 100 100 100 100 100 100 100 100 100 100 100 100 
##$AQSEQ= 0
##$AQ_mod= 1
##$AUNM= <au_zg>
##$AUTOPOS= <>
##$BF1= 200.13
##$BF2= 200.13
##$BF3= 200.13
##$BF4= 200.13
##$BF5= 200.13
##$BF6= 200.13
##$BF7= 200.13
##$BF8= 200.13
##$BYTORDA= 1
##$CFDGTYP= 0
##$CFRGTYP= 5
##$CHEMSTR= <none>
##$CNST= (0..31)
1 1 145 1 1 1 1 1 1 1 1 1 1 1 1 1 1 1 1 1 1 1 1 1 1 1 1 1 1 1 1 1 
##$CPDPRG= <>
##$CPDPRG1= <>
##$CPDPRG2= <>
##$CPDPRG3= <>
##$CPDPRG4= <mlev>
##$CPDPRG5= <mlev>
##$CPDPRG6= <mlev>
##$CPDPRG7= <mlev>
##$CPDPRG8= <mlev>
##$CPDPRGB= <>
##$CPDPRGT= <>
##$D= (0..31)
0 1.2 0 0 0 0 0 0 0 0 0 0.03 0 0 0 0 0 0 0 0 0 0 0 0 0 0 0 0 0 0 0 0 
##$DATE= 1564136816
##$DBL= (0..7)
120 120 120 120 120 120 120 120 
##$DBP= (0..7)
150 150 150 150 150 150 150 150 
##$DBP07= 0
##$DBPNAM0= <>
##$DBPNAM1= <>
##$DBPNAM2= <>
##$DBPNAM3= <>
##$DBPNAM4= <>
##$DBPNAM5= <>
##$DBPNAM6= <>
##$DBPNAM7= <>
##$DBPOAL= (0..7)
0.5 0.5 0.5 0.5 0.5 0.5 0.5 0.5 
##$DBPOFFS= (0..7)
0 0 0 0 0 0 0 0 
##$DE= 6
##$DECBNUC= <off>
##$DECIM= 24
##$DECNUC= <off>
##$DECSTAT= 4
##$DIGMOD= 1
##$DIGTYP= 9
##$DL= (0..7)
0 120 120 120 120 120 120 120 
##$DP= (0..7)
150 150 150 150 150 150 150 150 
##$DP07= 0
##$DPNAME0= <>
##$DPNAME1= <>
##$DPNAME2= <>
##$DPNAME3= <>
##$DPNAME4= <>
##$DPNAME5= <>
##$DPNAME6= <>
##$DPNAME7= <>
##$DPOAL= (0..7)
0.5 0.5 0.5 0.5 0.5 0.5 0.5 0.5 
##$DPOFFS= (0..7)
0 0 0 0 0 0 0 0 
##$DQDMODE= 0
##$DR= 18
##$DS= 0
##$DSLIST= <SSSSSSSSSSSSSSS>
##$DSPFIRM= 0
$$ [...]
##$SUBNAM2= <"">
##$SUBNAM3= <"">
##$SUBNAM4= <"">
##$SUBNAM5= <"">
##$SUBNAM6= <"">
##$SUBNAM7= <"">
##$SUBNAM8= <"">
##$SUBNAM9= <"">
##$SW= 24.9336996594482
##$SWIBOX= (0..15)
0 0 2 0 0 0 0 0 0 0 0 0 0 0 0 0 
##$SW_h= 4990.01996007984
##$TD= 16384
##$TD0= 1
##$TE= 0
##$TE2= 300
##$TE3= 300
##$TEG= 300
##$TL= (0..7)
0 120 120 120 120 120 120 120 
##$TP= (0..7)
150 150 150 150 150 150 150 150 
##$TP07= 0
##$TPNAME0= <>
##$TPNAME1= <>
##$TPNAME2= <>
##$TPNAME3= <>
##$TPNAME4= <>
##$TPNAME5= <>
##$TPNAME6= <>
##$TPNAME7= <>
##$TPOAL= (0..7)
0.5 0.5 0.5 0.5 0.5 0.5 0.5 0.5 
##$TPOFFS= (0..7)
0 0 0 0 0 0 0 0 
##$TUNHIN= 0
##$TUNHOUT= 0
##$TUNXOUT= 0
##$USERA1= <user>
##$USERA2= <user>
##$USERA3= <user>
##$USERA4= <user>
##$USERA5= <user>
##$V9= 5
##$VALIST= <valist>
##$VCLIST= <CCCCCCCCCCCCCCC>
##$VD= 0
##$VDLIST= <DDDDDDDDDDDDDDD>
##$VPLIST= <PPPPPPPPPPPPPPP>
##$VTLIST= <TTTTTTTTTTTTTTT>
##$WBST= 1024
##$WBSW= 4
##$XGAIN= (0..3)
0 0 0 0 
##$XL= 0
##$YL= 0
##$YMAX_a= 187346
##$YMIN_a= -184179
##$ZGOPTNS= <>
##$ZL1= 120
##$ZL2= 120
##$ZL3= 120
##$ZL4= 120
##$ABSF1= 10
##$ABSF2= 0
##$ABSG= 5
##$ABSL= 3
##$ALPHA= 0
##$AQORDER= 0
##$ASSFAC= 0
##$ASSFACI= 0
##$ASSFACX= 0
##$ASSWID= 0
##$AUNMP= <proc_1d>
##$AZFE= 0.1
##$AZFW= 0.1
##$BCFW= 1
##$BC_mod= 2
##$BYTORDP= 1
##$COROFFS= 0
##$CY= 11.3945322036743
##$DATMOD= 1
##$DC= 2
##$DFILT= <>
##$DTYPP= 0
##$F1P= 20.1537800932815
##$F2P= 0.134698688090026
##$FCOR= 0.5
##$FTSIZE= 0
##$FT_mod= 4
##$GAMMA= 1
##$GB= 0.15
##$INTBC= 1
##$INTSCL= 1
##$ISEN= 128
##$LB= 0.24
##$LEV0= 0
##$LPBIN= 0
##$MAXI= 10000
##$MC2= 0
##$MEAN= 0
##$ME_mod= 0
##$MI= 1.114404
##$NCOEF= 0
##$NC_proc= 0
##$NLEV= 6
##$NOISF1= 3.799351
##$NOISF2= 2.8
##$NSP= 1
##$NTH_PI= 0
##$NZP= 0
##$OFFSET= 15.70392
##$PC= 1
##$PHC0= -9129.227
##$PHC1= 11.80097
##$PH_mod= 1
##$PKNL= yes
##$PPARMOD= 0
##$PSCAL= 0
##$PSIGN= 0
##$REVERSE= no
##$SF= 200.130013532006
##$SI= 16384
##$SIGF1= 3
##$SIGF2= 2
##$SINO= 400
##$SIOLD= 16384
##$SREGLST= <1H.CDCl3>
##$SSB= 0
##$STSI= 0
##$STSR= 0
##$SW_p= 3612.71676300578
##$SYMM= 0
##$S_DEV= 0
##$TDeff= 0
##$TDoff= 0
##$TI= <>
##$TILT= no
##$TM1= 0
##$TM2= 0
##$TOPLEV= 0
##$USERP1= <user>
##$USERP2= <user>
##$USERP3= <user>
##$USERP4= <user>
##$USERP5= <user>
##$WDW= 1
##$XDIM= 8192
##$YMAX_p= 0
##$YMIN_p= 0
$$ End of Bruker specific parameters
$$ ---------------------------------
##NTUPLES= NMR FID
##VAR_NAME=  TIME,          FID/REAL,        FID/IMAG
##SYMBOL=    X,             R,               I
##VAR_TYPE=  INDEPENDENT,   DEPENDENT,       DEPENDENT
##VAR_FORM=  AFFN,          ASDF,            ASDF
##VAR_DIM=   8192,          8192,            8192
##UNITS=     SECONDS,       ARBITRARY UNITS, ARBITRARY UNITS
##FACTOR=    0.0002004,     1,               1
##FIRST=     0,             0,               0
##LAST=      1.6414764,     0,               0
##MIN=       0,             -184179,         0
##MAX=       1.6414764,     187346,          0
$$ Real data points
##PAGE= N=1
##DATA TABLE= (X++(R..R)), XYDATA
0@%%%%%%%%Qj6J6j6J7k5L2m0M8n6O9p7Q8j04J20j41J64j86K11k38K68l05L44l86
$$ 0 0 0 0 0 0 0 0 0 8 -8 8 -8 9 -16 16 -24 24 -32 37 -40 48 -56 64 -77 87 -99 112 -126 142 -163 181 -205
32b05M34m82N35n96O60p32Q13r00R97j106J224j352J498j663J852k067K312k601
$$ -205 229 -253 282 -314 346 -386 427 -473 524 -582 642 -710 788 -875 977 -1090 1222 -1379
50a379K944l358L871m527N389o580Q340j1172J6410k8974J04331P3905l43379
$$ -1379 1565 -1793 2078 -2449 2940 -3640 4700 -6472 9938 -19036 85295 159200 -184179
63a84179K07491J14805l04122J48300J87921k61238M8815J47380j84188L2017
$$ -184179 23312 138117 -166005 -17705 170216 -91022 -42207 105173 -79015 -46998
73d6998J44333j20285M824N8963r4106M2436N7845p4467M6634J1082r2359O1951
$$ -46998 97335 -22950 -18126 40837 -53269 -10833 47012 -27455 19179 30261 -62098 -147
85a47L9300p1101N0076J6940p8109K9205L0797k2279K3465j5135j5065K0690l8618
$$ -147 39153 -31948 18128 35068 -43041 -13836 16961 -5318 18147 3012 -12053 8637 -29981
98b9981K6154N8603p9762K595P3752r5106K634J20925q7943m0990J05249p4435
$$ -29981 -3827 54776 -24986 -22391 51361 -43745 -41111 79814 -8129 -49119 56130 -18305
110a8305l9014J14641m8189m3763P4855n9152k0150Q2587n5752N77O9090j02701
$$ -18305 -57319 57322 9133 -34630 40225 -18927 -39077 43510 -12242 -11665 57425 -45276
122d5276M318J11345j01554m985J28414j23681m8206J58452q0487p0197J53611
$$ -45276 -40958 70387 -31167 -36152 92262 -31419 -79625 78827 -1660 -71857 81754
133H1754o1426j14334J29247J752r5462Q8807J2214r3831M2359L2757l8538K2435
$$ 81754 20328 -94006 35241 36993 -58469 30338 42552 -51279 -8920 23837 -14701 7734
145G734R039k3893r1r703K0148K3864l7719O477K2687m9211J8434N2499m9035
$$ 7734 16773 -7120 -7211 -16914 3234 27098 -10621 -4144 18543 -30668 -12234 40265 -8770
158h770m725M0483m9535j236N6324l2460r603L1157m1822Q19M5580l1388L01L1435
$$ -8770 -13495 26988 -22547 -23783 32541 81 -9522 21635 -20187 -19368 26212 -5176 -4875 26560
172B6560m6810j188M6459l1705j524L8296m1359j4706M2020j5581o871K5087k2304
$$ 26560 -20250 -21438 25021 -6684 -8208 30088 -11271 -25977 16043 462 -6409 18678 -3626
185c626r208J5670j0181J3767Q416k7085J4748L462l2802L6788J9422n3125K1436
$$ -3626 -12834 2836 -7345 6422 14838 -12247 2501 5963 -26839 9949 29371 -23754 -2318
198b318K6462n5163K2291M8435n3244l081M4772m3784r740N4562k1307k5836K8986
$$ -2318 24144 -31019 -8728 39707 -13537 -16618 28154 -15630 -25370 29192 7885 -17951 11035
211A1035j1445j8045K5309N526j3333j064r34M36j997M698J5500j4558j6724J9778
$$ 11035 -410 -18455 6854 12380 -953 -2017 -2951 -2515 -4512 186 15686 1128 -15596 4182
225D182l506j2164K7536n589k9237K0647L922k1198K4895O963k9646J0398P274
$$ 4182 676 -11488 16048 10459 -18778 1869 5791 -15407 9488 16451 -13195 -2797 4477
238D477j7164J8292R504k2502M214N045j1346J2212O915j1092K617l953o420J2697
$$ 4477 -12687 5605 15109 -7393 -3179 1866 -9480 2732 9647 -1445 1172 -2781 -9201 3496
252C496J178l656N616j3196l773J7989p264l497J6251j6739j1330K2912o631r111
$$ 3496 4674 1018 6634 -6562 -10335 7654 390 -3107 13144 -3595 -14925 7987 1356 -7755
266g755K2674j1544k1634K1344L348j4713J6289R07k0980Q147R240q892N513O618
$$ -7755 14919 3375 -18259 3085 6433 -8280 8009 8916 -12064 -3917 5323 -3569 1944 8562
280H562j0445o021N480N764q43j587L180o630p494J3162L748j1721R073K199j9574
$$ 8562 -1883 -7904 -2424 3340 2497 910 4090 -2540 -10034 3128 6876 -4845 4228 6427 -13147
295a3147R054J5473j4298K068J0605j8408r21J9418q603n572J2659r303r762J2790
$$ -13147 -4093 11380 -2918 -850 9755 -8653 -9574 9844 1241 -4331 8328 -975 -10737 2053
309B053K308n287M940k629q042L224O340Q09k612j499J95l852M45R116j397o798
$$ 2053 4361 -926 4014 1385 -6657 -3433 2907 3716 1104 -395 -200 -4052 -3607 5509 4112 -2686
325b686M015k943o096J1689M033j1729K703L541r293N251R538q069k144M927p126
$$ -2686 1329 -1614 -7710 3979 8012 -3717 -1014 2527 -6766 -1515 8023 -46 -2190 2737 -4389
340d389n32J0553j488o089J594j249j821M754K507k761k052l69m98J93L395K804
$$ -4389 -4921 5632 4144 -1945 -351 -1600 -3421 1333 3840 1079 -973 -1342 -1840 -1647 1748 4552
356D552m323m146K926R48o56M175q72o094J880K670l252K963M323n793l404M127
$$ 4552 229 -3917 -991 -43 -699 3476 2604 -3490 -1610 1060 -2192 771 5094 -699 -4103 24
372B4p0m87M096j848n370K109K953k309J095L495l549m163L291K230j901K238
$$ 24 -46 -533 3563 1715 -3655 -1546 1407 -902 193 3688 139 -4024 -733 1497 -404 1834
388A834Q45o212K85O428k617k632N714k621o574N910K878n744M075K597r381J853
$$ 1834 2679 -3533 -3248 3180 563 -2069 3645 1024 -5550 360 3238 -2506 1569 4166 -5215 -3362
404c362Q762n770k503P373m704n405P996J82o044N766J181q781L206O963n447
$$ -3362 5400 -370 -2873 4500 -204 -5609 2387 2569 -3475 2291 3472 -5309 -2103 4860 -587
419e87j595N577m069l664O760J6n805M689K244p966K018P173n265k050O135m518
$$ -587 -2182 3395 -674 -4338 2422 2438 -3367 1322 3566 -4400 -2382 4791 -474 -2524 3611 -907
435i07l548P936j545o112O427O31p679M377M152n614J697L037n655P80N245l130
$$ -907 -4455 3481 1936 -4176 2251 2882 -4797 -420 3732 -1882 -185 2852 -2803 -2023 3222 92
451I2j747L222j296k095J743R64n15j51p6q93n26K157J030k988P0K394k151l91
$$ 92 -1655 1567 271 -1824 -81 883 368 217 141 -752 -1278 879 1909 -1079 -1009 1385 -766 -1157
469a157K866j599r78J997k036o16L210r28j584J073r23N41J265k127R34J764l067
$$ -1157 1709 110 -868 1129 -907 -1523 1687 759 -825 248 -675 -134 1131 -996 -62 1702 -1365
486a365O09K232k849J670K318n045Q81M627m145n18M425l723j119M386l171j217
$$ -1365 -756 1476 -1373 297 2615 -2430 -1549 3078 -1067 -1585 2840 -883 -2002 2384 -787 -2004
502b004M970k470l217L568j64j668K176r54j611J814J8r59N78L20K28j246q01
$$ -2004 2966 496 -2721 847 683 -985 1191 237 -1374 440 458 -501 77 397 625 -621 -1422
519a422K535j49k133J983o68k395L865M2m583L645J842n540K368L691m798R08
$$ -1422 1113 964 -1169 814 146 -2249 1616 1658 -2925 720 2562 -2978 -610 3081 -1717 -809
535h09L644m960N3N708l510l099M728o92l534L169J061l446J544K092l484n3M182
$$ -809 2835 -2125 -2072 3636 126 -2973 1755 1063 -2471 698 1759 -1687 -143 1949 -1535 -1588 2594
552B594j906l242L246O47l219K424J387l998J620K894m131J35M391k866k104L338
$$ 2594 688 -2554 692 1339 -1880 544 1931 -2067 -447 2447 -1684 -1549 2842 -24 -2128 1210
568A210j084j464K992j150k609K663P21k442R54J327j355l84Q05k61q2R88m81
$$ 1210 126 -1338 1654 504 -2105 558 1279 -1163 -209 1118 -237 -621 184 -77 -159 829 348
585C48j728J085J753j774n54J869j304m45J910j809k48K990k537j547L713j711
$$ 348 -1380 -295 1458 -316 -870 999 -305 -750 1160 -649 -897 2093 -444 -1991 1722 11
601A1j486L624k768j645N295l181l241O359k132m146O059k357m481P605j902o514
$$ 11 -1475 2149 -619 -2264 3031 -150 -3391 2968 836 -3310 2749 392 -4089 3516 1614 -4900
617d900P587l70p054O838L94o890O683L01p795O617K216p424M520J723o069M720
$$ -4900 2687 2317 -4737 2101 2495 -4395 2288 2589 -5206 1411 3627 -3797 723 2446 -3623 1097
633A097J377n611M091R64m518L380j51k142M076l253k209O064l810j717O657o138
$$ 1097 2474 -3137 954 1918 -2600 780 629 -1513 2563 -690 -2899 3165 -645 -2362 4295 -1843
649a843j733R211p428l017J1620p517n237J2001o866n057J3195p517p037J3730
$$ -1843 -3576 5635 -1793 -4810 6810 -707 -5944 6057 -809 -5866 7329 -188 -7225 6505
663F505o085p191J3271o126o985J3278o967p077J4699o409q270J3748o167p404
$$ 6505 420 -6771 6500 374 -6611 6667 -300 -7377 7322 913 -7357 6391 224 -7180
677g180J4399o578q390J4553n648q760J3525m762p625J2378n535p030J2510n051
$$ -7180 7219 641 -7749 6804 1156 -7604 5921 1159 -6466 5912 377 -6653 5857 806
691H06o587J0861n265m606J0346o642l705J0670o894l222R456p263r69Q945r321
$$ 806 -5781 5080 -185 -4791 5555 -1087 -4792 5878 -1016 -4238 5218 -2045 -3014 5931 -3390
706c390N70R649j1056J396J0143j2460K916J1213j5693K720J4697j6394O39J6035
$$ -3390 -2820 6829 -4227 -2831 7312 -5148 -2232 8981 -6712 -3992 10705 -5689 -5050 10985
720A0985j6481r47J7830j5549l196J8636j3816o138J7759r792o122J4820r140
$$ 10985 -5496 -6443 11387 -4162 -7358 11278 -2538 -8676 9083 -709 -6831 7989 -1151
733a151n725J3649p108m766J0947o985l160R507p236j200R437q364j733Q818p057
$$ -1151 -6876 6773 -335 -5101 5846 -1139 -4299 5208 -2028 -3228 6209 -2155 -3888 4930 -2127
748b127m5P529q386N48P621q256J339O900q522K223O075r663L890P343j1176K846
$$ -2127 -2172 5357 -3029 -2481 5140 -3116 -1777 5123 -3399 -1176 4899 -4764 -874 6469 -4707 -1861
764a861P979j0748K960Q305j1220K199R146j0468O77Q738q327O28O619p851J983
$$ -1861 6118 -4630 -1670 6635 -4585 -2386 6760 -3708 -3031 5707 -2620 -1992 4627 -3224 -1241
779a241N802q132K757N234q344L866M643r899N040O677j1358L082Q063j0332J768
$$ -1241 4561 -3571 -814 4420 -3924 -58 4585 -5314 -274 6403 -4955 -1873 6190 -4142 -2374
794b374Q606r230P0Q362p604j366P806m441j989M233l338K44L222l127P88J438
$$ -2374 6232 -2998 -2928 5434 -2170 -3536 4270 -171 -2160 2073 -1265 -1021 2201 -926 -138 1300
810A300l331K499R81l781L829O83n655L537K268m368K972Q39m791L493J480m269
$$ 1300 -2031 468 1449 -2332 1497 2180 -3475 62 2330 -2038 934 1773 -3018 475 1955 -2314
826b314L232Q98m241L050L51l555M473J89n302L515J546m016K916J128l951K233
$$ -2314 918 1816 -2425 625 976 -2579 1894 2083 -3219 296 1842 -2174 742 1870 -2081 152
842A52J206k971J642J243j560M04q26R0K096j826m49K347k461k50L190k835o33
$$ 152 1358 -1613 29 1272 -288 116 -710 -620 1476 -350 -799 1548 -913 -1163 2027 -808 -1441
859a441M020k736k296L783p05j682K035q89j001J351n28k4M23n99J094q97j874
$$ -1441 2579 -157 -2453 1330 625 -1057 978 89 -912 439 -89 -113 310 -289 805 -92 -1966
876a966L158K30l157K426K06l159L238N36l751L238P19m345K767J452l192K812
$$ -1966 1192 1422 -1735 691 897 -2262 976 1512 -2239 999 1718 -2627 140 1592 -1600 1212
892A212n1m026L642R98m029L148P60m168L109Q09l831L517J081m562K083J601
$$ 1212 1161 -2865 777 1775 -2254 894 1654 -2514 595 1404 -2427 1090 2171 -2391 -308 1293
908A293k531K073J33k673K248l3j922K459n12j570K311j953j170M130j913k217
$$ 1293 -1238 835 968 -1705 543 510 -1412 1047 535 -1035 1276 -677 -1847 2283 370 -1847
924a847L465k021j499M242k449j916M531k588k615M705j718j978M152l019k196
$$ -1847 1618 -403 -1902 2340 -109 -2025 2506 -82 -2697 2008 290 -1688 2464 -555 -2751
939b751N374k305k906M974j980l069M706j774k887N056j374l977M006o6k828L056
$$ -2751 2623 318 -2588 2386 406 -2663 2043 269 -2618 2438 1064 -2913 1093 1027 -1801 1255
955A255o18k380K806n89k034K337k75j092J381j535r5K461j961o71K353j986k15
$$ 1255 637 -1743 1063 474 -1560 777 502 -590 791 -744 -839 1622 -339 -1010 1343 -643 -858
972h58K500k530m7L137k885j089L452j788r19K746k345r11L328j847j513K990
$$ -858 1642 -888 -935 2202 -683 -1772 1680 -108 -1027 1719 -626 -1537 1791 -56 -1569 1421
988A421j148j469K057j157n56K393j569j285K084p46n70J514j321k30J738j741
$$ 1421 273 -1196 861 -296 -852 1541 -28 -1313 771 25 -545 969 -352 -582 1156 -585
1004e85m45K265j137p13J451j575j03K389j600j162K219q07j323J695k79r12J441
$$ -585 -1030 1235 98 -615 836 -739 -842 1547 -53 -1215 1004 197 -1126 569 290 -622 819
1021H19o49j423J470O52j117Q3K89k59R4K9JR8k0J35n44l63J438N3j666O61Q94
$$ 819 170 -1253 217 869 -248 -165 124 -135 -41 -12 -11 87 67 202 -342 -705 733 786 -880 -219 675
1042F75j305N65J031j590K90J497j925l95K642r40j736J604j65j318J844J39k139
$$ 675 -630 -65 966 -624 -334 1163 -762 -1157 1485 545 -1191 413 248 -1070 774 913 -1226
1059a226J185J152k003J77J958r56j044R20k85n40J417J36j800L97J350j122n52
$$ -1226 -41 1111 -892 -715 1243 287 -757 163 -122 -662 755 891 -909 -512 838 -284 -836
1076h36J750k84j565R16L16j191J447Q53k470O8K131j281o51J898q82j293J468
$$ -836 914 630 -935 -19 297 -894 553 1406 -1064 -996 1135 -146 -797 1101 219 -1074 394
1093C94k61j142J903L23k401L71J585q13j94R97q19p81J108or23J111O76j939
$$ 394 133 -1009 894 1217 -1184 -813 772 -41 -235 762 -57 -838 270 264 -659 452 1128 -811
1111h11l02J724k76n53R97q78j091J625J63j415J261O28j998M1J449l59r5N19
$$ -811 -1113 611 335 -218 779 -99 -1190 435 598 -817 444 1072 -926 -885 564 205 110 629
1129F29j048o04J288M83j019J25Q31r34r10J462N69j137N40N8j834J355J927k177
$$ 629 -419 -1023 265 748 -271 -146 685 -249 -1159 303 872 -265 275 333 -1501 -146 1781 -396
1147c96n40K128j529j110K449l27j491J540m69k012J928J472k015k91J196q30
$$ -396 -936 1192 -337 -1447 1002 675 -816 724 255 -1757 171 1643 -372 -663 533 -297
1163b97m41J351L4j077M82L51j457M99K187j194j749J615Nj411J824L52k248J308
$$ -297 -738 613 647 -430 52 403 -1054 -555 1632 438 -1311 304 309 -1102 722 1074 -1174 134
1181A34P86k435J225K214k239n46J520j345J41J977j328j108J580m04j145J154
$$ 134 920 -1515 -290 1924 -315 -861 659 -686 -545 1432 104 -1004 576 172 -973 181
1197A81P27q94l66J84j12J18Q92n5j640N03J439j517k53K295j319j541K107p83
$$ 181 908 14 -352 -168 -280 -162 730 675 -965 -462 977 -540 -793 1502 183 -1358 749 -34
1215c4j307K894n25k989K126R37k306J369J015j966O35O93j505R87J043j122k24
$$ -34 -1341 1553 1028 -1961 165 1102 -1204 165 1180 -786 -151 542 -963 24 1067 -55 -279
1232b79j42J04J072p98l76J338j301n45J883j258l08K369k236j400L230r74j526
$$ -279 -421 -317 755 -43 -419 919 -382 -927 956 -302 -610 1759 -477 -1877 1353 379 -1147
1249a147K525j411j586K876j179j528K989r93k030J994o53n59K222j674r50J989
$$ -1147 1378 -33 -1619 1257 78 -1450 1539 546 -1484 510 -143 -702 1520 -154 -1104 885
1265H85j437L2J923k263O84J859l672J191L446l944O20L174m866J155M789n364
$$ 885 -552 -520 1403 -860 -176 1683 -1989 -798 2648 -1296 -676 2498 -2368 -1213 3576 -1788
1281a788N1N459n308j009N891m127j089N371m534j814N719k859j802M175k911
$$ -1788 -1737 3722 -1586 -2595 3296 -831 -1920 3451 -1083 -2897 2822 -37 -1839 2336 -575
1296e75j143L608k759j08L358l211k71K444k863J649K234m341J587K436m346K369
$$ -575 -1718 1890 -869 -977 2381 -830 -1101 1343 -1520 129 2363 -1978 -391 2045 -2301 68
1312F8K452m860K739J953n827L654L213o150K923K547o389L899L293o850L481
$$ 68 2520 -2340 399 2352 -3475 179 3392 -2758 165 2712 -3677 222 3515 -3335 146
1327A46L441p212L086L858o215L335K885p116L426L795o447L318K922o727L611
$$ 146 3587 -3625 -539 3319 -2896 439 3324 -3792 -366 3429 -3018 300 3222 -3505 106
1342A06K927o739M288L403p570L092L628o551L665L713p278K523M189o193K048
$$ 106 3033 -3706 582 3985 -3585 -493 3135 -3416 249 3962 -3316 -793 3396 -2797 -749
1357g49M095n144J197K615m364K149K684l829J309R54k884K799K97l030L470o67
$$ -749 3346 -1798 -601 2014 -2350 -201 2483 -1346 -37 917 -1967 832 1129 -1901 1569 902
1373I02l840M249k86l403M848j578m810N889k87n077N647n01n794N863l9n899
$$ 902 -2938 1311 1025 -2378 2470 892 -3918 1971 1684 -3393 2254 1753 -4041 1822 1783 -4116
1389d116O453N61p377N360J725o499N387J758p330M463K743o775L848L292o190
$$ -4116 2337 2898 -4479 881 2606 -3893 1494 3252 -4078 385 3128 -3647 201 3493 -2697
1404b697K455K584n270L034K971n145J626K265l839K124J763l533K164Q95l721
$$ -2697 -242 2342 -2928 106 3077 -2068 -442 1823 -2016 108 1871 -1662 502 1397 -2324
1419b324K492J405k831K106p4l023K973M79k772K601k39k618K680o06j833L588
$$ -2324 168 1573 -1258 848 774 -2249 724 1203 -1569 1032 793 -1825 855 249 -1584 2004
1435B004j433k917L614j110j978M227k162k899M834j946l245N513j390m016M884
$$ 2004 571 -2346 1268 158 -1820 2407 245 -2654 2180 234 -3011 2502 1112 -2904 1980
1450A980j464l948N906o91n156M784R4m672M449O42m586L716O85m654L228J843
$$ 1980 516 -3432 2474 1783 -3373 1411 1505 -3167 1282 1924 -2662 1054 1739 -2915 313 2156
1466B156l688J615J074k734J665J150k054Q56O13j154L83l1K35Q48j388p3J062
$$ 2156 -1532 83 1157 -1577 88 1238 -816 40 653 -501 -118 -149 86 934 -454 -527 535
1483E35j249Q46J215k496P77J872k777N81K560k505RJ966k634M96K864k521o01
$$ 535 -714 132 1347 -1149 -372 1500 -1277 -696 1864 -641 -632 1334 -1300 -804 2060 -461 -1062
1500a062K371j884l83K167j491j88J643j764m59J804n71k19N10j091L20P92q40
$$ -1062 1309 -575 -958 1209 -282 -470 1173 -591 -1050 754 183 -36 474 -617 -297 495 -345
1517c45M45M34q59L08m8n76J281O5j427N86K47m87Q24j95p01P51k98n29P40q8
$$ -345 100 534 -325 -17 -65 -641 640 705 -722 -136 111 -376 448 253 -448 303 5 -524 216 128
1537A28OL15j290M02J400j193k3J080j544K41J600j741P0K069j971q02K187r61
$$ 128 134 449 -841 -439 961 -232 -255 825 -719 -478 1122 -619 -549 1520 -451 -1253 934 -27
1555b7n13J685j422q37J928p08p62J313n07n49N92o48K57J116r88l26N90o69N80
$$ -27 -540 1145 -277 -1114 814 106 -656 657 150 -399 193 -455 -198 918 -70 -396 194 -475 105
1574A05N55j230O25O07j472N12R93j022O14K97j739J017J205j699N12R75j624
$$ 105 660 -570 55 662 -810 -298 695 -327 287 584 -1155 -138 1067 -632 -120 855 -769
1591g69N28J089j643O87J474k024k76J728q88j88J050j044k96J057n82k32P13
$$ -769 -241 848 -795 -108 1366 -658 -934 794 -94 -282 768 -276 -572 485 -97 -329 384
1608C84k25j92j70l49R65J60j041N53M9q96J173K20j533J166O29k089P66J577
$$ 384 159 -33 -203 -552 413 573 -468 85 134 -762 411 631 -902 264 893 -1196 -430 1147
1626A147j443J11R15j570L16J588j225l20J126q25l88Q30l28K03M85j042j39Q00
$$ 1147 -296 -185 730 -840 -524 1064 -161 -481 645 -180 -568 262 -66 137 622 -420 -559 241
1644B41k02J81J21q09L95M10q58N68O99r14l3J87n70R16N04j309J99O06q20M55
$$ 241 39 220 341 -468 -73 337 -521 47 746 -168 -201 -14 -584 332 836 -473 -274 332 -488 -33
1664c3O84r75L26N16j330K99J497p84n90N85n59k8R23l23n18N36j08o11K46O37
$$ -33 651 -324 2 518 -812 -513 984 200 -390 195 -364 -392 531 208 -310 226 118 -493 -247 390
1684C90J01n93k75K91p8K43N78p56m52Q76l20p37J251K76j298K23L88o79Q71O56
$$ 390 491 -102 -377 -86 -164 79 657 -99 -551 325 5 -732 519 795 -503 -280 108 -571 300 956
1704I56j410j27J004n73k54R89k24p02K15j00j31Q82J77j014k46N54N0k6L44j64
$$ 956 -454 -581 423 -150 -404 585 361 -341 -126 -226 -357 525 702 -312 -558 -4 46 20 364 200
1724B00m39N1j1j6O62K01r36m03N84K74J1J69l22l90J65J85o2M30K52q40n26O19
$$ 200 -239 -188 -199 -215 447 648 -288 -691 -107 167 178 347 25 -365 -200 -15 -77 353 605 -235 -761 -142
1746a42M53m8J42m85o20N77M42m85L77M44j037l97Q70J23M6L30r13n45R51L13
$$ -142 311 263 405 -80 -700 -123 319 -166 211 655 -382 -779 91 214 260 590 -323 -868 83 396
1766C96m48L38K0p79lM53K26K58q7p46m11O54P42k76m59J71k60m36P64M57m95
$$ 396 -52 286 306 -473 -476 -23 203 461 374 -372 -783 -129 613 337 -122 49 -211 -647 117 574 79
1787G9J74l10j057R31J269r02m14L98p73J26J122l63l60M98p93n84J093N88l45
$$ 79 253 -57 -1114 -183 1086 184 -230 168 -605 -479 643 280 -80 418 -375 -959 134 722 377
1806C77l47n23o0O06K52J13j94n25Om1J3J064J16j378k0M07k29R66K54j359J32
$$ 377 30 -493 -553 53 305 418 224 -301 -295 -336 -323 741 857 -521 -541 -134 -363 603 857 -502 -370
1827c70M86q05O87J091r57m16P0o49R23J128j014n40L00n35M04Q29l70m4j61r09
$$ -370 116 -689 -2 1089 132 -284 -214 -863 60 1188 174 -366 -66 -601 -197 632 262 218 57 -852
1847h52L56R39R7N2q06p83R22L55k96P65m75j238Q82J5m40J727l32k244R32P40
$$ -852 -496 443 540 592 -214 -997 -75 280 -16 749 274 -964 -82 -67 -507 1220 888 -1356 -424 316
1867C16r11J414K31k051O32O82j140J128J001j516k48J11m04J405L32j203J68
$$ 316 -595 819 1050 -1001 -369 313 -827 301 1302 -214 -462 -351 -755 650 982 -221 -53
1884e3l90m20J508j74p33J178j257j396K314K80j191J313j131j728K460K02j483
$$ -53 -443 -863 645 471 -262 916 -341 -1737 577 857 -334 979 -152 -1880 580 782 -701
1901g01J778o47k102J787K19r00K083r53k420J897K74r42K026q43k010J782l58
$$ -701 1077 430 -1672 115 334 -566 1517 564 -1856 41 315 -627 1399 556 -1454 328 -30
1918c0j112K538m07k049J189p01m71K730j020j720J711j324p03L000j252j227
$$ -30 -1142 1396 989 -1060 129 -572 -1043 1687 667 -1053 658 -666 -1369 1631 379 -848
1934h48K316k309j395L942q64j848K456j979j764L722p00j792K620j554k100K753
$$ -848 1468 -841 -2236 1706 842 -1006 1450 -529 -2293 1429 729 -1063 1557 3 -2097 656
1950F56l80o46K280k226j653K751r40k72K537k619j086K786k035j51L634k623
$$ 656 276 -370 1910 -316 -1969 782 -158 -430 2107 -512 -1598 1188 -847 -998 2636 13
1966A3j698K684k053j5L816k698j691K874k225m22L682k114j068K344k844l23
$$ 13 -1685 999 -1054 -1069 2747 49 -1642 1232 -993 -1415 2267 153 -915 1429 -1415 -1738
1982a738L992j936j021K095k884m1L534k146l22K372l211l89L128j852N06K165
$$ -1738 2254 318 -703 1392 -1492 -1533 2001 -145 -467 1905 -1306 -1695 1433 -419 87 2252
1998B252l893r4L361k386O48K676l985j89L273k963P43L699l881j203L214k382
$$ 2252 -1641 -1735 1626 -760 -112 2564 -1421 -1610 1663 -1300 -557 3142 -739 -1942 1272 -1110
2014a110M60L593l354j303K841k109J1L262k192q90J588k367P27L008k093m15
$$ -1110 -650 2943 -411 -1714 1127 -982 -971 2291 99 -791 797 -1570 -843 2165 72 -343
2030c43J033k491J269K380k311P12J053l355J193K408k185J426Q94m158J563K677
$$ -343 690 -1801 -532 1848 -463 249 1302 -2053 -860 1548 -637 789 1683 -2475 -912 1765
2046A765k755J574J511m217J177K401k921J968K184m420M33K391k461J924J984
$$ 1765 -990 584 2095 -2122 -945 1456 -1465 503 2687 -1733 -1300 1091 -1370 554 2538
2061B538m013N14J962k634J832K166l277N40R99k810K378K277l236M86R30k700
$$ 2538 -1475 -961 1001 -1633 199 2365 -912 -372 627 -2183 195 2472 -764 -278 652 -2048
2077b048K076J999k726R29O84k983J574K002j697Q76j12k611J756J336j362J310
$$ -2048 28 2027 -699 230 914 -2069 -495 1507 -190 686 574 -2037 -281 1055 -307 1003
2093A003n28k123J647J41q73K532j041k585J942l15p45L124j478k632K610q61
$$ 1003 475 -1648 -1 140 -733 1799 758 -1827 115 -200 -945 2179 701 -1931 679 -182
2109a82j542L713q77k731K462j228j848M160m07l072K203p70j980L448p3k349
$$ -182 -1724 1989 1112 -1619 843 -385 -2233 1927 1520 -1552 651 -119 -2099 1349 1276 -1073
2125a073J937q92k042K672M49j210J100j509j073K218k10k84J114j883m03J643
$$ -1073 864 -28 -2070 602 1051 -159 941 -568 -1641 577 367 83 1197 -686 -1089 554
2141E54j232Q35J805k686m58J729j548J194J957l004j38J903k171R76K335k513
$$ 554 -678 157 1962 -724 -1182 547 -1001 193 2150 -854 -992 911 -1260 -284 2051 -462
2157d62qJ214k494J399K511k581R0J118k585J521K139k584Q34J211l251J153K444
$$ -462 -470 744 -1750 -351 2160 -421 -331 787 -1798 -277 1862 -722 112 1323 -1928 -775 1669
2174A669k201R36R67l382J171K463k207Q51J175k924O96J708j734J346J128k888
$$ 1669 -532 404 1371 -2011 -840 1623 -584 267 1442 -1482 -786 922 -812 534 1662 -1226
2190a226L80J338j210J475N83k487Q05O89j455J782N80j994R67l50j496K617L49
$$ -1226 -846 492 -718 757 1340 -1147 -342 347 -1108 674 1254 -740 227 -123 -1619 998 1347
2207A347k259J392n10j758K794J15k275K124n12k710K735Q00k187J937n09k811
$$ 1347 -912 480 -30 -1788 1006 1121 -1154 970 458 -2252 483 1283 -904 1033 524 -2287
2223b287K625R39k225J768n8k517J865M73j511K178l41k677J763M08j274K238
$$ -2287 338 1277 -948 820 762 -1755 110 583 -928 1250 909 -1768 -5 403 -871 1367
2239A367n80k460K025j8j734K570j4k446J556k04j610K741J46k526J351j3j498
$$ 1367 787 -1673 352 334 -1400 1170 1156 -1290 266 62 -1548 1193 1339 -1187 164 151 -1347
2256a347K172J44j796J419n48j624K116L79j332J126r40j278K221j12j142J492
$$ -1347 825 969 -827 592 44 -1580 536 915 -417 709 -231 -1509 712 600 -542 950
2272I50j010j275J902n03n77K017j467j608K094m62o31K085j504j468K204q24
$$ 950 -60 -1335 567 64 -513 1504 37 -1571 523 61 -570 1515 11 -1457 747 -77
2288g7r41K463r33j696J624p82o05K400r14j636J511p14o13K013p73r87J439j286
$$ -77 -1018 1445 512 -1184 440 -342 -947 1453 539 -1097 414 -300 -913 1100 327 -660 779 -507
2306e07o84K192n15q84J145j375n24K180p38q48J434j067r05J578l58l18J228
$$ -507 -1191 1001 486 -398 747 -628 -1152 1028 290 -558 876 -191 -1096 482 124 -194 1034
2323A034j240r34J434j28k19Q26j021m55J005n55Q6J083r20m60M77n65N88J025
$$ 1034 -206 -1140 294 166 -53 773 -248 -703 302 -253 -167 916 -4 -464 13 -552 36 1061
2341A061j238k76P24p98L95R33r84J03N40j239L74J275p73j98M01j056M10J119
$$ 1061 -177 -453 271 -527 -132 801 -183 -80 460 -779 -405 870 97 -101 300 -756 -346 773
2359G73q14j27O51q77j06P77l33L09K48j070O6P95k76J80J81q49K66M89o50M76
$$ 773 -41 -168 483 -394 -500 277 -56 253 501 -569 -503 292 16 196 377 -472 -206 283 -367 109
2379A09N66q84j45L64l61N24N63r57j77N29k65O0M16k55j09j3l22L02M37k05j43
$$ 109 675 -209 -354 10 -351 173 736 -221 -398 131 -134 -74 342 87 -22 -35 -357 -55 382 177 34
2400C4k70r2N13M5l41K47m2m13K95J05j35M23k11o78M11L76k54J22p3l34L02P8
$$ 34 -236 -328 185 230 -111 136 94 -319 -24 81 -54 369 158 -520 -109 267 13 135 62 -272 30 108
2422A08l27L75J49m75k6Q3O9L80j70m51K21J12j25K02o2j30J94k42k50N94O2l45
$$ 108 -219 156 305 -170 -196 -113 -44 336 166 -285 -64 48 -77 125 63 -67 127 -115 -365 229 291 -54
2444e4O7j99l1N34j84l37L34m3l48K45J01o7J72k04l25L23K53j55j23o9J03R7
$$ -54 13 -186 -217 317 133 -204 130 87 -261 -16 85 18 190 -14 -339 -16 237 82 -41 -110 -7 90
2466I0k26J34K20k79L7K5k91M61K76p40J3N63l61o5M15l65p0M12l82j40N55j06
$$ 90 -136 -2 218 -61 -24 1 -290 171 447 -293 -280 283 -78 -143 272 -93 -163 249 -133 -273 282 176
2488A76l26L9K4J68J02k70N6Q2j85J96p2j87N03j25o83N12L04n23K96P2n52M92
$$ 176 -150 -111 -87 81 183 -87 -31 51 -134 62 -10 -197 306 181 -502 10 314 -209 87 159 -393 99
2510I9K72p14K98M45n52NK47k26K70R4n33J82K56j73J49j68p3M05l44k67O31k19
$$ 99 371 -343 -45 400 -152 -147 100 -126 144 238 -295 -113 143 -30 119 -49 -122 283 -61 -328 303 84
2532H4l03M69m47j45R37n43o01R24k52o07Q70l10n55R91l62q75J037J04q37N71
$$ 84 -219 250 -197 -342 595 52 -549 375 123 -484 386 76 -479 512 150 -725 312 416 -421 150
2552A50n9m67O66j14n33N45q4l17L46k90Q1N40p41l5P86o76M1P14r89J30J158
$$ 150 91 -376 290 176 -357 188 104 -213 133 -157 -76 464 -277 -312 474 -202 -161 553 -436 -306 852
2573H52j246j86J487j030m70J280q58l35J347r20o86J350m29p28R55l75l36P59
$$ 852 -394 -580 907 -123 -593 687 -171 -506 841 -79 -765 585 156 -572 383 8 -328 431
2591D31n58k47Q11m69j20M33o78L98O15j133L16R05j151K17R19j214L41J070j505
$$ 431 -127 -374 437 -32 -152 281 -397 1 616 -517 -201 704 -447 -230 689 -525 -184 886 -619
2610f19J27J405j177k12J171j058PJ136j165m9J169r37j94Q80p88K12P46j155
$$ -619 -492 913 -264 -476 695 -363 -356 780 -385 -434 735 -202 -396 484 -304 -92 654 -501
2628e01J72J049j057J02Q12j047L92P93j316L38J149j363J65J065j286L22J123
$$ -501 -329 720 -337 -235 577 -470 -78 715 -601 -263 886 -477 -312 753 -533 -211 912
2645I12j551K02J500j465j84J438j122j72J301j180k95J415q55n34J053m46k73
$$ 912 -639 -437 1063 -402 -586 852 -270 -442 859 -321 -616 799 -56 -590 463 17 -256
2662b56N82n79J25N37o43K02K39o90P89J37j313J077N60j664Q93Q70j719Q48J021
$$ -256 326 -253 -128 409 -234 -32 207 -483 306 443 -870 207 767 -897 -4 866 -853 -5 1016
2681A016k011O63J610j922O8J605j448p2J348j273k1J327j160k64J095p06KO28
$$ 1016 -995 -332 1278 -644 -576 1029 -419 -491 857 -416 -437 890 -270 -534 561 -145 -143 485
2699D85q80K11P15q86K08O22p68K94L01q74O92M93j093M50L92q60O59K95j078
$$ 485 -395 -184 531 -355 -147 475 -293 1 302 -572 120 613 -480 -30 362 -498 161 456 -622
2718f22Q28L56j305P26O31j069N69L37j198P06P59j172L17N98p91J98L94n35M43
$$ -622 206 562 -743 -17 614 -455 114 451 -747 -41 718 -454 -137 461 -330 -132 262 -273 170
2737A70J53p44L54K36l59N41k20p00Q04M9q63P72L01r09M05K95q04O23N78r66
$$ 170 323 -421 -67 169 -190 351 131 -569 235 284 -579 193 494 -415 -10 285 -519 104 682 -284
2757b84q5O75l16k22M07J0l23K5J41j84P7N23l07o41M82K94m82L41J90o12K32
$$ -284 -369 306 -10 -232 175 185 -138 -113 28 -156 -79 444 137 -504 -22 272 -210 131 321 -291 -59
2778e9K39n00L67M63o40j85L01p2J87J62l79l0J57q0lJ85J07j49l90J48L11j55
$$ -59 180 -320 47 510 -130 -315 -14 -86 101 263 -116 -146 11 -69 -72 113 220 71 -319 -171 140 -15
2800a5K36m6o79L98N62p65K59O89r58j17Q22o55J53R05j048l78J033l48k81O80
$$ -15 221 175 -504 -106 456 -309 -50 639 -319 -436 386 -269 -116 789 -259 -637 396 48 -233 447
2820D47m44k96M84m21Q1O69n29j57K49n62N08O48r83J28O69r74J90R72q60M9P41
$$ 447 3 -293 191 -230 -149 520 -9 -166 83 -479 29 677 -306 -178 491 -483 -293 679 -181 -132 609
2841F09j150jJ277o55l56P14p45r6Q49n47q3P12p36k33O55l45K54L83r60J27O79
$$ 609 -541 -542 735 80 -276 438 -307 -403 446 -101 -184 528 -208 -441 214 -131 123 506 -454 -327 352
2862C52o22L01M74q48K48L86q91O64P29j132J47N29r42O72P73j359L28Q44j300
$$ 352 -270 31 505 -343 -95 291 -600 64 793 -339 -192 337 -605 67 840 -519 -191 653 -647
2881f47L16J154j094J33P18j269K62J287r79j57P63q95J05Q14p76K45O58j181
$$ -647 -331 823 -271 -138 580 -689 -427 860 -119 -276 487 -408 -303 511 -265 -20 638 -543
2899e43J71Q44p95M82M62j323M39R29j117L64Q80j268J67Q24j085M73J016j275
$$ -543 -372 472 -323 159 621 -702 -263 666 -451 -87 793 -475 -308 516 -569 -96 920 -355
2917c55j38Q87p32K52P27r75J56O03q86L17O85o86J92J32q37P40N19r62M34K34
$$ -355 -493 394 -338 -86 641 -334 -178 425 -461 -144 541 -145 47 179 -658 82 601 -361 73 307
2937C07r76P85L31r70Q52K52j426P43O63r95P08K43j333Q10O44j211O59N85j218
$$ 307 -669 116 447 -523 329 581 -845 -102 561 -434 274 517 -816 -6 638 -573 86 671 -547
2956e47M55M65r18P38M98j186K91N27p36N37K92q60N43J92q47N89M36p36L60M
$$ -547 -92 373 -545 193 691 -495 -204 323 -413 124 416 -444 99 291 -556 33 469 -267 93 97
2976I7o57P76K22q00M68J07o78N46J45n53O37p0q30O06K28m11M57k66n19P03o4
$$ 97 -560 216 438 -362 106 213 -465 81 226 -327 310 240 -590 16 244 -167 290 24 -495 208 144
2997A44m61O16j31m99M64k39j65P97l70o55O76j52l37P47l60m84P46l10n25Q14
$$ 144 -317 299 168 -331 133 -106 -271 526 156 -499 177 25 -312 435 75 -409 337 27 -498 316
3017C16k9n51M29k34l12P53j95n16N07j05l81M77j29j79M98l66m13N80j8k47L17
$$ 316 287 -264 165 -69 -381 372 177 -339 168 63 -318 159 30 -149 349 -17 -430 150 132 -115 202
3038B02k25k10M22j63k33L84n8k58R5p1J20K71l15j17J99j21J13J24l05J99J63
$$ 202 -23 -233 189 26 -207 177 119 -139 -44 -115 5 276 -39 -156 43 -78 35 159 -146 53 216
3059B16n11J75M29l56K2K02m78K27M98n71j0M08l90J4L14l08J31L04n29j5M41
$$ 216 -295 -120 309 -47 -25 177 -301 -74 424 -147 -157 251 -139 -125 189 -119 12 316 -213 -228 213
3080B13j97j1J23k84J33K00l46J24K70k87J7M7k12L34J29m66J59K07k89J60J29
$$ 213 16 5 128 -156 -23 177 -169 -45 225 -62 -45 2 -210 124 253 -213 -54 153 -136 24 153
3101A53l47K47J63n18K07L70k81l9P3j58J80R2k26P8O6p4O0j47N2L43l09k43L71
$$ 153 -194 53 216 -302 -95 275 -6 -45 28 -130 50 142 -84 -6 60 -14 46 -101 -49 294 -15 -258 113
3124A13j03j25L31k61k07N53k90l66N39K9l98K61p7k40M48n0m30L39Q1k92J74
$$ 113 10 -115 216 -45 -252 301 11 -355 184 213 -185 76 -1 -241 207 157 -273 66 147 -145 29
3145B9%q0K26j80k03K67j5l9R6k75J02L48m42K3M53m01m3L52m37Q9N86n64k33
$$ 29 29 -51 175 -5 -208 59 44 5 101 -174 -72 276 -166 -143 310 -91 -134 218 -219 -130 456 -108 -341
3168c41O12k77k30M29j84j59L73k65j85L36Nj12l4j43K53Q8l92L28P7m60L77O5
$$ -341 271 -6 -236 193 9 -150 223 -42 -227 109 114 2 -32 -175 78 166 -226 102 179 -281 96 161
3190A61n58N76L01r43L22N62p31K47M74p64K44N20p43J12O60n06j25L62m01K32
$$ 161 -397 179 480 -463 -141 421 -310 -63 411 -353 -109 411 -332 -220 440 -66 -191 171 -230 2
3210BL43n36M6L63l44O5J96k72K96qn06L27J92l13L70j45n09P12p2p45Q17J11
$$ 2 345 -191 -145 218 -126 -61 135 -137 159 151 -355 -28 164 -149 221 76 -433 279 207 -538 279 390
3232C90r15O30K04q82Q07L42j213N04O75q63J87N81o89J31L79n14J65L58l29O7
$$ 390 -525 105 309 -573 234 576 -637 -133 542 -321 -134 447 -242 -111 268 -246 -81 277 -52 15
3252A5q4j54N45k28m93P28j89o69Q25q8p37R67p4j145R29M18j110O19L59r17N24
$$ 15 -69 -223 322 94 -399 329 140 -529 296 208 -529 438 364 -781 148 566 -544 75 434 -483 41
3273D1L56q99N43M59q85K98L49n68M57J68p40M50K36n99L75J58l92L96j87m51
$$ 41 397 -502 41 500 -385 -87 262 -306 151 319 -421 29 265 -334 41 199 -193 203 16 -435
3293d35O78o9m66N97l61m21R80m43p19J227k82j114J176K4j097J193M8j399R70
$$ -435 243 174 -292 305 -56 -477 503 60 -659 568 286 -828 348 372 -725 468 516 -883 87
3312H7O00j282N07O74r60K48M20n65K96K56m33J21rr0M84l90l13P47m13m82R17
$$ 87 687 -595 -88 586 -374 -126 294 -271 25 281 -152 -31 -40 -130 354 -36 -349 398 -15 -497 420
3333D20k80n72Q81m19o87J038l3q37P01j5o54O79n7n55P23j19p13O13O9m52N78
$$ 420 140 -432 449 30 -657 381 348 -489 212 197 -457 222 165 -390 333 214 -499 114 183 -269 309
3354C09j98n71O40J1m71M28J5l72L00j76j15N33k76l03M34l22m2O18m95l41Q43
$$ 309 111 -460 180 191 -280 148 163 -209 91 -85 -200 333 57 -246 188 -134 -176 442 -53 -394 449
3375D49m02o11R14m9p22N85N6p02N72L54o86L5M70k59k11K69J06j69r9J74j23
$$ 449 47 -564 350 301 -421 164 220 -482 90 444 -242 -207 263 4 -207 62 168 -1 -100 74 -49
3396d9j45M23j0n84L13L80n40O5N13m43j65M57k95j52N54j76m52L23J57k86J50
$$ -49 -194 229 219 -365 -52 328 -212 -147 366 -77 -242 215 -80 -232 322 146 -306 17 174 -112 38
3417C8Q2k28J30R1k87J14L45k96j71K67p2j35L26j51l28M17O2n17L05L45m51l9
$$ 38 120 -108 22 113 -174 -60 285 -11 -182 85 13 -122 204 53 -275 142 204 -313 -8 337 -114 -153
3439a53L32k92J5L71k85k31L52L9k53QJ96L9k13m6K30j31o9K98k21l07N58j6o37
$$ -153 179 -113 -98 273 -12 -243 109 148 -105 -97 99 138 -75 -121 109 -22 -91 207 -14 -321 237 221 -416
3462d16M75L18o83J96M13n01J14M47n42r6N72k44k38K74l6q4J5o9J07P0j39J28
$$ -416 59 377 -306 -110 303 -198 -84 363 -179 -275 297 53 -185 89 53 -31 -16 -85 22 92 -47 81
3484H1j35j30M30j40m28N12ln22M74K5m62N46j2p52O37K50p61M36K52p36N54K88
$$ 81 -54 -184 246 106 -322 190 187 -335 139 164 -298 248 236 -516 121 371 -390 46 298 -438 116 404
3506D04r23N60N36r96K48O12p58K34N46q12J56O33o31KM91m07P5J49m04L69J82
$$ 404 -519 41 577 -419 -171 441 -317 -83 463 -349 -193 440 -191 -189 302 -105 -30 119 -285 84 266
3527B66n21L17O8m93O07k0p34O72K59r88N81M27q36M27L68q76M06N51p45J50M00
$$ 266 -255 62 130 -363 244 224 -510 162 421 -567 14 441 -395 32 400 -476 -70 481 -264 -114 286
3548B86m81J86J48l75M11J9n39M26Ml77O75k85o75R19q0q46R18Qr11Q46k0r17
$$ 286 -195 -9 139 -236 175 194 -345 81 85 -292 383 98 -577 342 262 -584 334 342 -569 277 257 -660
3570f60R73K14j152O86L28q94O63K40r27O42L28r94N45M90q00L33K51o76M54L36
$$ -660 313 527 -625 61 389 -505 158 398 -529 113 441 -553 -8 482 -318 15 266 -410 44 380
3590C80o54K11K71m02K15Q3k88L78j22l81M46o8k39M84l51l75P95k54n60P09m9
$$ 380 -274 -63 208 -194 21 104 -184 194 72 -309 137 69 -170 314 -37 -412 383 129 -431 278 229
3611B29o78O26Qo00O68N5p66M62K69m76K87K1l31L66p5l20M04n3k83L53k42k09
$$ 229 -449 177 185 -415 253 308 -458 4 273 -203 84 105 -226 140 65 -255 149 96 -187 166 -76 -285
3633b85O49k59n45O63r7m81N73o5m97N77n1o39N77J75n76L35Q0m05L89J28n51
$$ -285 364 105 -440 223 126 -355 218 153 -344 233 182 -457 120 295 -281 54 134 -271 118 246 -305
3654c05K99K59m49J32K64l12J47R7l45J65K46k09n6O9k2R6j00o6J56o4o5J47j82
$$ -305 -6 253 -196 -64 200 -112 35 132 -213 -48 198 -11 -67 2 -20 76 -24 -90 66 2 -63 84 -98
3677i8N2L10l21j87M49j31k36L09r7k37L70j34l00L79M4l57J74N0j34K33j01k21
$$ -98 -46 264 -57 -244 205 74 -162 147 50 -187 183 49 -251 128 172 -185 -11 39 -95 138 37 -184
3699a84K79Jk24J86k2j30K14j24k05L69j3l14J45J09j92J93l0k31K29O0k24Q6
$$ -184 95 96 -128 58 36 -94 120 -4 -209 160 147 -167 -22 87 -105 88 58 -173 56 116 -108 -22
3721b2R7j20O2Pj21J80K4j78M0P3j0L0o6n5O5M9r2m5J00P5q2r4R4P2r3K1mr1J41
$$ -22 75 -45 17 24 -97 83 107 -71 -31 42 32 62 -4 -59 6 55 -37 -82 18 93 11 -83 11 83 -10 11 7 -84 57
3750E7J4j91R8J39j59n7J26j9K7M6j70j0J76lj30L8O9l8n4k2N1J08n4j62O6J10
$$ 57 71 -120 -22 117 -42 -99 27 8 35 81 -89 -99 77 74 -56 -18 51 13 -41 -63 -12 96 42 -120 -54 56
3776E6pl2op9O1J03j67j5K65j43k16J94K7r0J70r8k19K34J17l13J57J25k09Q0
$$ 56 49 17 11 -68 -7 96 -71 -86 179 36 -180 14 41 -49 121 23 -196 38 155 -158 -1 124 -85 -5
3800eJ4r8K02ok46J08P1q1J46j19j30K71p5k47K70N4k21J27k9j97K82Q5l01O6
$$ -5 9 -89 113 107 -139 -31 40 -41 105 -14 -144 127 52 -195 75 129 -92 35 6 -191 91 176 -125 -59
3824e9J41j37M3k5L3J05j51o8J55n1N3J00k74J6L19k50r0L20k18o7K40k51k4M61
$$ -59 82 -55 -12 -37 -4 101 -50 -118 37 -14 39 139 -135 -119 200 -50 -140 180 -38 -105 135 -116 -140 321
3848C21l38k35M13j48j46L61k49j95M68k77k70M86n5l06K91j12k17L75o1k90K36
$$ 321 -17 -252 161 13 -133 228 -21 -216 252 -25 -295 191 136 -170 121 9 -208 167 106 -184 52
3869E2M7j96J28j4k7J35j99n3K37j29K3J62l46O7L70l75n0M63l06k15M29k52j28
$$ 52 99 -97 31 17 -10 125 -74 -127 110 -19 4 166 -180 -113 257 -118 -168 295 -11 -226 203 -49 -177
3892a77M85k50l90M79l9l23L17k3j99K31r9j93K90k8j30Q2j51R3K35k97l2L56
$$ -177 308 58 -332 147 108 -215 102 79 -120 111 12 -181 109 81 -49 33 -118 -25 210 -87 -119 237
3914B37l16q4L91l46lM69m79j78O63l32k85N28k46l22O01k39m14O38r5n06M08
$$ 237 -79 -163 228 -118 -121 348 -131 -309 354 22 -263 265 19 -303 298 59 -355 283 188 -318 90
3935I0K9l09L53o2l13K97M8k75J87J2r3J42k38l8L86j74j70K53k65L5L71l61p9
$$ 90 119 -190 163 101 -212 85 133 -142 45 57 -36 106 -132 -170 216 42 -128 125 -140 -105 266 -95 -174
3958a74M87l99j89N38k79j46M59l92k65O95k32l91N25j97l35M98j35k89M53j19
$$ -174 313 -86 -275 263 -16 -162 297 -95 -360 335 103 -288 237 40 -295 203 68 -221 232 113
3978A13l91L29N7j60J70j63q7L12k28n1L19l16j2L24l89m3O23m01l66O01k23l23
$$ 113 -278 51 108 -52 118 -45 -132 180 -48 -99 220 -96 -108 216 -173 -216 407 6 -360 241 18 -305
4000c05N93j94m32N14m1m54L64K08l44R4oq4J67J3j11N7j43P7J50k49J18K95m14
$$ -305 288 94 -338 176 135 -319 45 253 -91 3 -3 -87 80 93 -18 39 -104 -27 123 -126 -8 287 -127
4023a27j20M56j97r5L32l26j73M88j92k26M21j66l16L30n0j89M14j52m47L86J54
$$ -127 -247 209 12 -83 249 -77 -250 238 46 -180 241 75 -241 89 39 -150 264 112 -335 51 205
4044B05l99K48J49l87J36K17l47J25L47k87k29K49M3r1L9L2q7p8J49P6j80P5K45
$$ 205 -194 54 203 -184 -48 169 -178 -53 294 7 -222 27 70 -21 18 50 -37 -115 34 110 -70 5 250
4067B50l98j41N25j01l75L83k0m93M77J79n75K78L45n80j0N21j92j79K56k05j15
$$ 250 -148 -289 236 135 -240 143 123 -370 107 286 -289 -11 334 -246 -256 265 73 -106 150 -55 -170
4088a70K98l9j10O7l3j5m4k1K28n8k56J40M8j71K86J5m11K79J49m41K67K98m20
$$ -170 128 89 -21 46 13 -2 -46 -67 161 103 -153 -13 35 -136 150 165 -246 33 182 -259 8 306 -114
4111a14O3K27m50K29M62n70k4M51m25o3N31l29j85M28k80k61N23J7l73J17Q3j79
$$ -114 -51 176 -274 -45 417 -153 -177 274 -151 -214 317 -12 -197 231 -49 -310 213 230 -143 -26 57 -122
4133a22J44Q9q7j05N0J31j79l1L80j39m89M04J84m93L17K89o84K14N36o79J4P65
$$ -122 22 111 24 -81 -31 100 -79 -110 270 131 -358 46 230 -263 54 343 -341 -127 409 -270 -256 509
4155E09n52l21O27k77k42N91k66l84M53k8l12L18J3j93J20j43K2K51j74oO4k63
$$ 509 -43 -364 263 -14 -256 335 69 -315 138 110 -202 116 129 -64 56 -87 -65 186 12 6 70 -193
4177a93J95K46m18J02L76n23K5M88m37N6M79o74o4P51m28k94O82l83l60O56k15
$$ -193 2 248 -170 -68 308 -215 -190 298 -139 -83 396 -278 -342 409 -19 -313 369 -14 -374 282 67
4198F7l75N81r3n28L46J63k40J30K5j43M8J3R9k8j60K54r4m57N08K63o44K78L03
$$ 67 -308 273 180 -348 -2 161 -79 51 76 -67 -19 -6 93 65 -95 159 65 -392 116 379 -265 13 316
4221C16p11L28N83q09R1P29p67j76Q75m31l18O67m16l83P35j57m39M63o9l37K58
$$ 316 -395 -67 516 -293 -202 527 -240 -416 459 28 -290 377 -39 -422 313 156 -283 180 111 -226 32
4242C2L0j10J73j42j11J07l3J73j5k85J90J46l90K49K63m63J51K64n67K76N06
$$ 32 62 -48 125 -17 -128 -21 -54 119 104 -181 9 155 -235 14 277 -186 -35 229 -338 -62 444
4263D44n86r9N27l97j09N08k63k28M15k30k31L84N8k42qL4QJ1QJ17j53j00K76
$$ 444 -142 -241 286 -111 -220 288 25 -203 212 -18 -249 135 193 -49 -57 -23 -15 -4 4 121 -32 -132 144
4286A44j62k50N29p9n25L81J70m69L48K29o38K23M43n80P5N52m27k33M36j87j52
$$ 144 -18 -268 261 182 -343 38 208 -261 87 316 -322 -99 344 -236 -161 391 -36 -269 167 -20 -172
4307a72L99j51l18K64J03k09M0J60r7j31Q8L8l3O9O1k39l8L51j36k14L04o7k75
$$ -172 227 76 -242 22 125 -84 -44 116 19 -112 -24 14 -19 50 111 -128 -166 185 49 -165 139 72 -203
4330b03K12J14k55K28R8l98P7L06j67q1K27j70j17J87l3j41J93M7k20l4K46m2
$$ -203 9 123 -132 96 194 -204 -127 179 12 -69 158 -12 -129 58 25 -116 77 124 -96 -130 116 74
4352G4j70R5P5k26J38J89k63L6K88l14j64L71%k63J92K0k57K09J74l32O4K44k28
$$ 74 -96 -1 74 -152 -14 175 -88 -52 236 -78 -242 129 129 -134 58 78 -179 30 204 -128 -64 180 -48
4375d8j36K75nj59P1O2j85J31J86k34p2K48j24j76K50jj77J38K8k33J56J88k63
$$ -48 -184 91 86 -73 -2 60 -125 6 192 -42 -114 134 10 -166 84 83 -94 44 72 -161 -5 183 -80
4398h0j4K31j49j04J85l5q7R6k5j41J08J31r3j14O8R2j13j1J45j28lJ64j56j30
$$ -80 -94 137 -12 -116 69 34 -53 43 18 -123 -15 116 23 -91 -23 69 -44 -55 90 -38 -41 123 -33 -163
4422a63K96j9l01K10Q0k17J16J27k27O8J61k57J8K74j02j83R7N8p4L6R3j10o6
$$ -163 133 114 -187 23 103 -114 2 129 -98 -30 131 -126 -108 166 64 -119 -22 36 -38 -2 91 -19 -85
4445h5J51m2j70K16J53l44K8K44k28lK98k90j08M03k32k34M39m2l46K27K2k37
$$ -85 66 24 -146 70 223 -121 -93 151 -77 -80 218 -72 -180 223 -9 -243 196 154 -192 35 57 -180
4467a80K72Q4l17O6J79j31k6J24j0p4k4J2K9k6R8m6j83J54J52k62P2J89k59LK56
$$ -180 92 176 -141 -75 104 -27 -53 71 61 -13 -37 -25 4 -22 76 30 -153 1 153 -109 -37 152 -107 -104 152
4492A52k74K6L43k69k18L68p6j90K44o5j57J80l0j39J45Q7j30o7L5R6Kj09N2N
$$ 152 -122 -96 247 -22 -240 128 52 -138 106 41 -116 64 34 -105 40 127 -3 -70 -35 61 63 -46 6 11
4516A1j11J46M9k48K23Q0l91J74L28l35L5K37l36pM25l21j58L75j31k84L05L5
$$ 11 -100 46 95 -153 70 150 -241 -67 261 -74 -39 198 -138 -145 280 -41 -199 176 45 -239 66 101
4538A01j99J76m1j62J31P0p9k0K0M2l3p7J04N9j67P0M6k06K14J39l43R0K73l37
$$ 101 -98 78 37 -125 6 76 -3 -23 -3 39 6 -71 33 92 -75 -5 41 -165 49 188 -155 -65 208 -129
4562a29K5K88k74JK87l06n1L84k13j69K72j07j05K08p4j26J88p1j09P1J1N8j5
$$ -129 -104 184 -90 -89 198 -108 -159 225 12 -157 115 8 -97 111 37 -89 99 28 -81 -10 1 59 44
4585D4j52J69Kj57J52L6k59K32J02m15K53K74m80P5L73l97M1L99l91j01M68k60
$$ 44 -108 61 63 -94 58 94 -165 67 169 -246 7 281 -199 -124 249 -148 -107 292 -99 -200 268 8
4607Hk54M15j03j95J75n1r6J85j2j32O5k9N7kj59J96J2k25J50J02k04J49R7l39
$$ 8 -246 169 66 -129 46 -5 -101 84 72 -60 5 -24 33 31 -128 68 80 -145 5 107 -97 52 149 -190
4631a90J61K71l71P0K54l00J3K68l24J06L03l78m5L31k05oK36k83%K63k28n7K51
$$ -190 -29 242 -129 -59 195 -105 -92 176 -148 -42 261 -117 -162 169 -36 -42 194 -89 -89 174 -54 -111 140
4654A40j52n8J14j45J33R9k11O2J04k05J33J40k98J44K23m14J00L34l30NK95l42
$$ 140 -12 -70 44 -101 32 131 -80 -18 86 -119 14 154 -144 0 223 -191 -91 243 -87 -82 213 -129
4676a29l1L99k21j71K76o4k06J98K1q4O7n1p3L9O4M8r7r4J96l5k04K45P5k73R8
$$ -129 -160 239 18 -153 123 59 -147 51 72 -12 55 4 -69 -30 34 82 -15 -109 87 52 -152 93 168 -105 -7
4701gJ31l15K57J85m13O3K74k62J2K91l08OK63k95m2L89k13j83K65j35p8K83j47
$$ -7 124 -191 66 251 -162 -99 175 -87 -75 216 -92 -86 177 -118 -160 229 16 -167 98 -37 -115 168 21
4724B1j33K02m0k01K07M7j16K9l9o6J27K8o0ml5M6J4o0N8P7j65MP9o4R3O5k02
$$ 21 -112 90 50 -151 56 103 -13 16 -23 -89 38 66 6 2 -33 13 27 -33 25 102 -63 -59 20 -44 49 114 -88
4751h8j7J92j06l2J33r7k1P4r4M1J59j44o6L3j7Q4P6j52j6J49j68kJ92o2r1J22
$$ -88 -105 87 -19 -51 82 -15 -36 38 -56 -15 144 0 -66 -33 -50 34 110 -42 -58 91 -77 -79 113 51 -40 82
4777H2j50o4K80n7k35J89kj85K04M1k00J51Ok09R9K07j41o0M6r2P4J03j06kQ8
$$ 82 -68 -132 148 91 -144 45 43 -142 62 103 -97 54 60 -149 -50 157 16 -44 2 -90 -16 87 -19 -21 67
4802F7q7m0N4K4M9l3j23O4M7nNj8m7N7k0n6J42j4j06K0j1j7J42k8j78J43L8j72
$$ 67 -20 -60 -6 18 67 34 -89 -25 22 17 22 4 -43 14 -6 -62 80 66 -40 -20 -31 -48 94 66 -112 31 69 -103
4830a03J68L6j50Q8jj88K01P9j75N4M0j51J25M5j33J08L8k27J02J42j67J27K5
$$ -103 65 101 -49 39 38 -150 51 130 -45 9 49 -102 23 68 -65 43 81 -146 -44 98 -69 58 83
4853H3k49J59J44k14O8J25k05M4J51j67O2J61k16p1J88l1k3M4j07L8L7l9L4K4
$$ 83 -166 -7 137 -77 -9 116 -89 -45 106 -61 1 162 -54 -125 63 32 9 53 -54 -16 21 -18 16 40
4877D0l9K2p1n1J86jj66J11j1j24J75K8j90J57J8k33J41J10j50O2M0j78J41J08
$$ 40 1 23 -48 -99 87 86 -80 31 20 -104 71 99 -91 66 84 -149 -8 102 -48 14 54 -124 17 125
4901A25j68K0R7j33L5P6j11J06L6j79N7J01j11R3J2j87J40M9j54J24Q9k18Q0M1
$$ 125 -43 -23 74 -59 -24 52 -59 47 83 -96 -39 62 -49 44 56 -131 9 58 -96 28 117 -101 -21 20
4925B0j24J42J23k30j6J85j23k1J38p7p3Q9n3m6J42J5j20j1O0k9K9L5j2p1J4J8
$$ 20 -104 38 161 -69 -85 100 -23 -44 94 17 -56 33 -20 -66 76 91 -29 -40 20 -9 20 55 43 -28 -14 4
4951Do0O5J30j34j32J75j7o9J26n9j16J19K8j94K03O8k23J7J12r6J12Q5k20K8
$$ 4 -56 9 139 5 -127 48 31 -38 88 29 -87 32 60 -134 69 137 -86 -69 43 -53 59 144 -76 -48
4975d8J24j17KJ21o1l8Ol2J3R9k8r5QK2M6Om5K5Pm5MM6kJ5Nj09M5R4l3n6N4l9
$$ -48 76 -41 -39 82 21 -17 -11 -43 -30 69 41 -54 -46 -24 22 28 -17 8 15 -30 -26 20 18 33 38 -71 -26 68 35 -21 33 -6
5007fm3N7L4j7L8Qj59K7J57m0r2P7l9o6J12J3r9O0K8j42L4J86p8r0O8q5K1J17
$$ -6 -49 8 42 25 63 71 -88 -61 96 56 -36 41 2 -64 48 61 -38 22 50 -92 -58 128 50 -40 28 -57 -36 81
5035H1n2q2J08k0j33P0J31r3k6M9j16M5J51r2j20J68n2j14R8N7j08J02J3j94J20
$$ 81 29 -53 55 35 -98 -28 103 10 -16 33 -83 -38 113 21 -99 69 17 -97 1 58 -50 52 65 -129 -9
5060iJ51j72k0J30j03j9J33r5j1J23j20p2J47J9p5K9q0l0J26l1p1O9J5o3nM4K0
$$ -9 142 -30 -50 80 -23 -42 91 -4 -15 108 -12 -84 63 82 7 36 -44 -74 52 21 -50 19 34 -29 -34 10 30
5087C0kk7n5L6M8L1o0l3L0Mk4K9K4j3J2r4jJ11mn0J3j4l1O6ko7R7Qj60R6M5n3
$$ 30 28 1 -54 -18 30 61 1 -32 -2 2 -22 7 31 18 30 -64 -65 46 42 -8 5 -9 -40 26 24 -43 54 62 -98 -2 43 -10
5119a0N3mj46J37O0j52N5Q5j11K0N1r0P5P2j72J4J20l3k2N1m2n7J24p6l4Q5lo4
$$ -10 43 39 -107 30 90 -62 -7 78 -33 -13 38 -52 23 95 -77 -63 57 24 2 53 11 -46 78 2 -32 53 50 -14
5147a4mK4K3j8J6p5K0O5l1n1K7Q2r6m9J06kj8N4j26j8J29j5j14J45Nj46O2L5q9
$$ -14 -18 6 29 11 27 -48 -28 37 6 -45 -18 64 -32 -81 25 23 5 59 -67 -85 44 29 -85 60 65 -81 -19 16 -73
5176g3J39Mj81R5J11j03ON9j10K4Q8j00K2J14p4n1N1qK1L2j05K3L7k2M6j9k9L8
$$ -73 66 70 -111 -16 95 -8 -2 57 -53 -29 59 -41 -19 95 21 -30 21 13 34 66 -39 -16 21 -1 45 26 -3 35
5204C5k7p1R6K6j11O3L5j09J03N5j74J10O1j73M9J18r6RN5r3K0J08q0n2N9J4m9
$$ 35 8 -63 33 59 -52 11 46 -63 40 95 -79 31 92 -81 -32 86 -10 -1 54 -39 -19 89 9 -43 16 30 -19
5231a9J2rL8Rn8K0j6J2R0o8j00J45j5j13J25J6j47J52l6j68J67Q5k25J08P2j92
$$ -19 -7 -16 22 31 -27 -7 -23 -11 79 11 -89 56 41 -72 53 69 -78 74 38 -130 37 122 -103 5 77 -115
5257a15J17J01j70Q3R6j89K0J36o8l2M2p2M3P3q4lN6o3J7nn0J24m2q1Q6j0p0J48
$$ -115 2 103 -67 16 112 -77 -57 79 11 -21 21 -51 -8 65 -19 -22 34 -29 -12 -17 -67 57 15 -66 20 10 -60 88
5285H8p3j24J82k7j61J45J3j25J01Qj27J07R9j66K6Q4o0NkJ1O5n8l6P3k5l1J05
$$ 88 15 -109 73 46 -115 30 43 -82 19 27 -100 7 106 -60 -34 50 -10 -5 -7 4 69 11 -25 48 23 -8 97
5312I7j19l4J61o9j30J28j1j02J49m9j19K14l8k05J29J01j54N0N7j41O4J11j60
$$ 97 -22 -56 105 36 -94 34 23 -79 70 21 -98 116 78 -127 2 103 -51 -1 56 -85 -21 90 -70
5335g0N5J13j08m8O8k1J0M1n0l9K8O3m7l4N7M8j14K2P1n6%Q4j25j3J90j21j31
$$ -70 -15 98 -10 -58 10 -11 -1 40 -10 -49 -21 42 -5 -39 18 66 -48 -26 45 -11 -11 73 -52 -65 125 4 -127
5362a27J88rj54J52j9j06J51j6j53P8J30j57KQ0o7J6O6p3J0Q2p3j0RJ6J4k4l6
$$ -127 61 52 -102 50 31 -75 76 60 -93 -15 115 -42 -40 40 -27 -11 55 -18 -8 74 1 -9 0 16 30 6 -30
5389c0L1M7n3J9j1j5L3n8pO4Lm9K7J9m2L1K2n1K3O5p3m5N0K8k9j3K3k1K5mm1k3
$$ -30 1 48 -5 14 3 -12 21 -37 -44 20 23 -26 1 20 -22 9 31 -20 3 68 -5 -50 0 28 -1 -14 9 -12 13 9 -32 -55
5421e5R3j3o0M5N9p7qM0l3j3R0m9o9Q7L4j19L7O6o3OM3o6KJ32j21o3J34k3r5P3
$$ -55 38 25 -35 10 69 -8 -16 24 -9 -22 68 19 -50 37 71 -48 -11 55 -8 -2 41 -25 -23 109 -12 -75 59 36 -59 14
5451A4J5o9R3k7q9Q2N7j38M5N5n3kO8j20L8J12q3l6M4rJ1K1o4M3Nj2j5j5K4P3
$$ 14 29 -40 53 26 -63 19 76 -62 -17 38 -15 -17 51 -69 -31 81 -2 -38 6 -3 8 29 -35 8 13 1 -14 -29 -5 68
5481F8r2k5J30m3j00Q3Ml9N0j9p4R9J4r8M1K9l2L7j6o4P8J5j11R1K7m5J5k8n6
$$ 68 -24 -49 81 38 -62 21 25 -14 36 17 -57 42 56 -42 -1 28 -4 33 17 -47 31 46 -65 26 53 8 23 -5 -61
5510f1J19k7q9Q4K0p8J05q4l9J03nj17P2K6p3M0Po5R8J4j27Q4L1p2M5J3p8P9J1
$$ -61 58 31 -58 26 46 -32 73 -11 -50 53 48 -69 3 29 -44 -4 3 -62 36 50 -77 7 38 -34 11 24 -54 25 36
5539C6r6N3O9o6K3k2JL4Po6L6lpL3o1PJ02r2o5J02j2n6R0n6m8J22m9p5Q3Jp4Q0
$$ 36 -60 -7 62 -4 19 -3 -2 32 39 -27 9 6 -1 32 -29 -22 80 -12 -77 25 13 -43 47 -9 -57 65 16 -59 24 25 -49 31
5571C1np6R9j1j23J05M6j06N8J2n0N2k7q2J04%n3M6l3oL8j9o8J07m3l4M1j8mM3
$$ 31 26 -50 49 38 -85 20 66 -40 18 30 -20 32 5 -77 27 27 -26 20 -13 -19 19 0 -68 39 -4 -38 3 -15 -19 24
5601B4j9n4Q1J4o8K1K1l6P5m9l4N5j1j0j5K3qJ8mo0J8L9n0J7jJN4m6rM8j5o8O4
$$ 24 5 -49 32 46 -22 -1 20 -16 59 10 -24 31 20 10 -5 18 10 28 24 -36 -18 21 -29 -12 -13 -12 42 -4 -13 35 20 -48 16
5634A6nJ0L5o9m6Q6rm7O1l1j2O8n9j7M6J7q9L0L4k4K9j6l2K3L1p1K6K7kRl1j7
$$ 16 11 21 56 -13 -59 27 18 -29 32 1 -11 57 -2 -19 27 44 -45 -15 19 -5 24 8 -24 -1 30 -41 -15 12 10 19 -12 -29
5666b9N8Qk9j1L1Mk6k9K1PJ5l4KL%L3l6J2L3jm3J3J2Jkm2KM3qj0j7L1j3Nk4J4
$$ -29 29 37 8 -3 28 32 6 -23 -2 5 20 -14 -12 -9 -9 24 -12 0 33 32 -11 2 14 15 13 -29 -27 16 8 -2 -19 12 -1 4 -20 -6
5702fL6j0l5J5J9l3M2m2pN2k0n3L7K3j0qjk3N5k0m8L4K3l2L2Jl0J6J6o0K4O1l7
$$ -6 30 20 -15 0 19 -14 28 -14 -21 31 11 -42 -5 18 8 0 -1 -24 31 11 -37 -3 20 -12 20 21 -9 7 23 -37 -13 48 11
5735A1l7K3J9j8Lj6ONK8k0j2M3%n0k4O1mk1K0k7KK2l4nN9m6MNJ3MJ7l5k5J2N5
$$ 11 -26 -3 16 -2 1 -15 -9 -4 24 4 -8 35 35 -15 -39 22 18 -3 17 -10 -8 14 -20 -25 34 -12 -8 -3 10 14 31 -4 -29 -17 38
5770C8l7j4lQM1n2pM1L1n0j6K0L1Nk6k3M5l4Rj6mJ1J5l3J1J4OK7m7j7L9J1l7M3
$$ 38 1 -13 -16 -8 33 -19 -26 15 46 -4 -20 0 31 36 10 -13 32 -2 7 -9 -13 -2 13 -20 -9 5 11 38 -9 -26 13 24 -13 30
5804C0knK0n5RM7l4k1K3kj3J2j3l2O7Oo7M0K2j2j1On0N4Nm0LK8lk5k1M4L3q1J
$$ 30 28 23 43 -12 -3 44 10 -11 12 10 -3 9 -4 -36 31 37 -30 10 32 20 9 15 -35 19 24 -16 -13 15 12 -13 -34 10 43 -38 -37
5839c7N9k8J5K6n4J9O5r5j9J00n6j2K6j0k0P8m5n9N7PJ2k8j8J0K6k6K4k4K3L5
$$ -37 22 -6 9 35 -19 0 65 -30 -49 51 -5 -17 9 -1 -21 57 12 -47 10 17 29 1 -17 -7 19 -7 17 -7 16 51
5869E1n6j4N1K4o2PK3l3J8J3n0O0L1r5oP5m7L1J4o1J7L2l5k9M3J4j1l4J2K7J7
$$ 51 -5 -19 32 56 -6 1 24 -9 9 22 -28 32 63 -32 -38 37 -10 21 35 -26 -9 23 -12 -41 2 16 5 -29 -17 10 27
5900B7l9P%LK7k3j7N8k3o4M4K7n8L4J4o5O2L9q6RR0q6k7K1J1K5J2n9LM6J4Oo5
$$ 27 -12 -5 -5 -2 25 2 -15 43 20 -44 0 27 -31 3 17 -48 14 53 -33 -24 66 -20 -47 -26 -15 10 22 -37 -34 12 26 32 -33
5933c3L2K9m2j1K8QnL1q9L5R2m1q1R2j2r7P9J6q2Q2Kj40J02P7j04L2J4m5L0K6
$$ -33 -1 28 -14 -25 3 11 6 37 -52 -17 75 34 -47 45 33 -64 15 31 -51 31 33 -107 -5 72 -32 0 14 -31 -1 25
5963B5l3nP2o0l7N8pJ0j9l4K0m0P4qm7PO0p0oQ9n4l4M2l3pJ06n3q4R6lq2N9K6
$$ 25 -8 -13 59 -1 -38 20 13 23 4 -30 -10 -50 24 16 -31 -24 36 -34 -40 49 -5 -39 3 -30 -37 69 16 -68 28 25 -57 2 28
5996B8m1M1J0j02P4M4n2n0M3Nj1L2j1kj2k8OJ9L6kl4l5N0kk2L3pm8M7qk0N0j0
$$ 28 -13 28 38 -64 10 54 2 -48 -5 0 -11 21 10 8 -4 -32 -26 -7 29 27 -7 -42 8 6 -16 17 10 -38 9 1 -19 31 21
6029B1n9QL4J0J2mm0OJ7k4qM7J1l8k5J0P0l1oj6l9L6K7m9M0K7l3l0M7nj8N3o0
$$ 21 -38 -30 4 14 26 22 -18 -12 5 -19 -27 20 31 -7 -32 -22 48 17 11 -5 -44 -8 19 -30 10 37 4 -26 21 16 -2 51 -9
6062io5Q4M9j04L1L3l1pN0m0J6M0n0p6R1J5o1J4L6o5M5K9o3K6O5p0k4M7K7k9j9
$$ -9 -74 10 59 -45 -14 19 -12 -19 31 -9 7 47 -3 -79 12 27 -34 -20 16 -49 -4 25 -38 -12 53 -17 -41 6 33 4 -15
6093a5J4rK1K1m5k7Q7n2n1O4M7m4OK7q2L5M7m2j7O1l4m5N7mk1M1n3o0Q0M5o8K5
$$ -15 -1 -10 11 32 -13 -40 47 -5 -56 8 55 11 17 44 -38 -3 44 2 -15 46 12 -33 24 20 -1 40 -13 -73 7 52 -16 9
6125IJ9l8J2k4L5Rm2j3J3lL9Jk7NK0j6k0M8lk5J1l8K1O1m3l0K1l2J8M1k0m8P9
$$ 9 28 -10 2 -22 13 22 -20 -33 -20 -23 16 17 -10 -5 15 -1 -21 27 24 -1 10 -28 -7 54 11 -19 2 -30 -12 29 9 -39 40
6158D0m7m1P8Rl8j2j1K5K1j8j2K7kM2n9k4N4J9r0K9M8o0J5P0j10L8P1r9JJ14q2
$$ 40 -7 -48 30 39 1 -11 -22 3 24 6 -6 21 19 61 2 -22 32 51 -39 -10 38 -22 -7 63 -47 -9 62 -37 -36 78 -4
6189dm6Q3n9k1Q0mj02P2L6l6Rpj0J3ok4N5Ml8%j4L7Oj3j0L0j6j9j3KM1Qn3nM6
$$ -4 -50 33 -26 -47 33 29 -73 -1 35 -1 8 1 -9 4 -2 -26 29 33 -5 -5 -19 18 24 11 1 31 15 -4 -17 -15 26 34 -19 -24 22
6224B2l1M1l1k5qO1m6PO6j9m1K0Qm3P4m5m7K6K5j5pJ9Nj8l8K9L1Joj2l8M3K9o9
$$ 22 -9 32 1 -24 -32 29 -17 -10 56 37 -4 16 24 -19 55 10 -37 -11 14 -1 -8 11 16 -2 -40 -11 20 21 15 3 -35 8 37 -32
6258c2L9K3l8j5M5l7L2J7p8J6P0Mn8K0joNJ8m3O8j5p1K4J0L7rm2OJ0M0n4MK2L
$$ -32 7 30 -8 -23 22 -15 17 34 -44 -28 42 46 -12 8 7 1 6 24 -19 49 34 -37 -13 -3 34 25 -17 -11 -1 39 -15 -11 11 14
6292A4l9K7K2m0M6jn3M0K2k2k9L6Ml0oK3JkLo5K4P0k7k8Kjj3K6J7l0N5m7j5j7
$$ 14 -25 2 24 -16 30 29 -24 16 38 16 -13 23 27 -3 -9 14 15 13 16 -49 -25 45 18 -10 -8 -9 -22 4 21 -9 46 -1 -16 -33
6326c3O5j2opk2K1K2m2K4K2l1l7K9L0jLm6j8P5k2k3R%MJ5J2l8M4l0m2L1%J7jM
$$ -33 32 20 14 7 -15 6 28 -14 10 32 1 -36 -7 23 22 25 -21 -39 36 14 -9 0 0 4 19 31 -7 37 7 -35 -4 -4 13 12 16
6361A6j3J2nj3nL0k0pkJ5QL3o2j5L6jk7K5jPj0Mk9KO8k2m7N8K0q3K0L0l9K8K0
$$ 16 3 15 10 -3 -8 22 2 -5 -7 8 16 49 -13 -28 8 7 -20 5 4 11 1 5 -24 -22 46 24 -23 35 55 -28 -8 22 -17 11 31
6396C1n4J4P2m2p2R5k3m4N9k3l8N7j1m4N1K4r3L0M6l5qM3m6qM9k3l3M8qk4J7j3
$$ 31 -23 -9 63 21 -51 44 21 -23 36 13 -25 32 21 -23 28 52 -41 -11 35 0 -8 35 -11 -19 30 7 -26 22 14 -10 7 -6
6428fj2K6J8l8OJ0M8o8RL8l6KK4k7jM4l0m9Q6j7r6Q4Mm3K7nn5O1L6o6rN8l8K3
$$ -6 -18 8 26 -12 -6 4 52 -16 -7 31 -5 -3 21 -6 -7 37 7 -42 44 27 -69 15 19 -24 3 -2 -57 4 40 -26 -35 23 -15 8
6462HpoK7K7o2J3PJ3ok1j1P4l3n1O1j4j7K9mn8Q3l1p2P3No2O6l4m3P3mo7L7M1
$$ 8 1 -5 22 49 -13 0 7 20 14 -7 -18 56 23 -28 33 19 2 31 27 -31 52 21 -51 22 27 -35 31 -3 -46 27 23 -44 -7 34
6496C4n1K2Ql9O0rm7O1k2k8O2p7PR3q2l2P1l5k8J02o6q8J16mp6P9j4p2R2l7l7
$$ 34 -17 5 13 -26 34 25 -22 39 17 -11 51 -26 -19 74 -8 -40 31 -4 -32 70 4 -84 32 28 -48 31 17 -55 37 0 -37
6527c7O9k1l1M2Kk5L0k8l4R4n7qL8n7L0M6p3lO6q8NQ1m0LO4r2k9J39r3n2J06o1
$$ -37 32 11 -20 22 24 -1 29 1 -33 61 4 -4 34 -23 7 53 -20 -23 43 -45 -40 41 1 4 68 -24 -53 86 -7 -59 47 -14
6559a4n3J21q8lQ2m2o2J15n0j9L1k6k7O7m3l1O4m1J5L7p3L8O2p2J2M6p0J0O0q8
$$ -14 -67 54 -34 -37 45 3 -59 56 6 -13 18 -8 -35 32 -11 -42 22 -19 -4 33 -40 -2 60 -12 0 46 -24 -14 46 -42
6589d2L3P8p1m6P8l3JN5n9qO8p6MQ4p7MN0n3J3K1m2J4K3l8K6K6p0M2K3p0L3Q0
$$ -42 -9 69 -2 -48 30 -3 -2 53 -6 -14 54 -22 -18 66 -11 -7 43 -10 3 24 -18 -4 19 -19 7 33 -37 5 28 -42 -9 71
6621G1r0%L4o2L9L8p5L4O3p6J8M1n1J6K8m9j0R3o2oK2l5L5ln4O6J1n0J1Nl4N9
$$ 71 -19 -19 15 -47 -8 30 -45 -11 52 -24 -6 35 -16 0 28 -21 -31 62 0 -6 16 -19 16 13 -41 25 36 -14 -3 2 -32 27
6653B7Nr0O4K9o4L4Om2M1L1o2K2K0j4l8K1QkM4l8j7%Oj1MNJ3oj9L4kJ1Jn1K2L3
$$ 27 32 -58 6 35 -29 5 11 -31 10 41 -21 1 21 7 -31 -10 -2 -4 40 2 -15 -15 -9 -20 -16 -11 2 -4 -23 11 9 20 21 -30 -8 25
6689B5k1k1J6Jm1O4j9m3R3o1okJ9j1L6k7j0lPj3M2k0J3kl2K0Oj2oJ5j3OJ7j3J5
$$ 25 4 -17 -1 0 -41 23 4 -39 54 -7 -13 -15 4 -7 29 2 -8 -11 -4 -17 25 5 18 16 -16 4 10 -2 -8 7 -6 0 17 4 19
6724A9on3L5RRpk5RL3qm6M2Ql4L2k6PM2j6n4O4l9k8M1l4QK9%l9N8Lk2l2MoM6J
$$ 19 13 -40 -5 4 13 6 -19 -10 23 15 -31 11 19 -15 17 -9 -2 40 24 -30 34 -5 -33 8 -26 -18 11 11 -28 30 33 11 -21 -17 -23 23 24
6761B4l3K2l2K2J6n9M9M5n7kJ3j7K8J5p9M4N4m8pM4p5QN4n5J7N7m1n6O6j4j1M0
$$ 24 -9 13 -19 3 19 -40 9 54 -3 -5 8 -9 19 34 -45 -1 53 5 -2 42 -33 -25 29 -26 -9 48 7 -49 17 3 -8 32
6793C2l6KL3l1qJ8OpJ3n5L2K7m1K4j0kJ1nn1O6Ro2j0O7k5JL5m5K0L6n7kP0o4r
$$ 32 -4 -2 31 0 -8 10 16 9 22 -33 -1 26 -15 9 -1 -3 8 3 -48 18 27 -35 -45 22 -3 -2 33 -12 8 44 -13 -15 55 -9 -18
6828a8K3k4O2J5o9%L4j2Olj8oM0m7K3J4ml1RjK9On1KK0k0%N7n3M0Jo0K3M9m1J4
$$ -18 5 -19 43 58 -11 -11 23 11 17 14 -4 -10 30 -17 6 20 16 -15 -6 -7 22 28 -23 -21 -1 -21 -21 36 -17 23 24 -36 -13 36 -5 9
6864Iko7N8J9l4J7N1p3K4mK0LJ6p1LN9l1RJ0l9J9%OK2J9j1n3M2k9J6jkl8O1k3
$$ 9 7 -60 -2 17 -17 0 51 -22 2 -2 18 21 37 -34 -31 28 -3 6 16 -23 -4 -4 2 24 43 32 -21 21 -8 8 7 5 -33 28 5
6899EoRJ4j8j3n%L2Pk7kRj5J6%K1j1l5oK8PQPp4L4K4JMJ2k9j0J3pJ4J2l9l7M6
$$ 5 -1 8 22 4 -9 -14 -14 18 25 -2 -4 5 -10 6 6 27 16 -19 -25 3 10 18 25 -49 -15 9 10 14 26 -3 -13 0 -7 7 19 -20 -57 -11
6937a1J2pL0k2nK8m4rN3J0l4jkJ1L0j4j9njJ5olJ2jk8J6%LJ1k1mMM2l9KK5l6m
$$ -11 1 -6 24 2 -3 25 -19 -28 25 35 1 0 -2 9 39 25 6 1 0 15 9 6 18 17 -11 5 5 8 19 -2 -6 -2 40 1 3 28 -8 -12
6975a2K5oj4K0kl7PL8Jk0JKjQk9L1J3l5mJ9J1j1Qk3J0oJ7j8K2j1J9k9j3M4K8p2
$$ -12 13 7 -7 13 11 -26 -19 19 20 0 1 3 2 10 -19 12 25 -10 -14 5 16 5 13 -10 0 -6 11 -7 15 4 23 -6 -19 25 53 -19
7011a9J3l5K4L7l6J0J8Jl7L0J8l3J7K7o1M5J0k7j2L1k2j9K2K2mKj1l6K4L3k0k7
$$ -19 -6 -41 -17 20 -16 -6 12 13 -24 6 24 -9 8 35 -26 19 29 2 -10 21 -1 -20 2 24 20 22 11 -25 -1 32 12 -15
7043a5J1KNJ8j3j5J1mk4jM6qm5J5Pj1L5lj5K2k7j5L0K4nj5pk9L5J5pm6L0rJ4m
$$ -15 -4 -2 3 21 8 -7 4 0 -24 -25 21 13 -32 -17 -10 -21 14 11 -4 18 -9 -24 6 30 25 10 3 -26 9 24 17 -29 1 -8 6 2
7079BK6k1j0p%PK1L3o3RqL6k8ML0m2K7Rl0K9L6r7lP0l1k5M3nm6N4k2l2N0Op8M9
$$ 2 28 7 -3 -10 -10 -3 18 51 -12 -3 -11 25 -3 1 31 -11 16 25 -5 24 60 -37 -40 30 -1 -26 17 12 -34 20 -2 -34 16 22 -56 -7
7115gJ9n3K9L4m2J9Q%j3M8k2k4m6P3Pl4K2Km9M1M5r2M3K0m8NL7j4oL0k5n9R2l5
$$ -7 12 -41 -12 22 -20 -1 7 7 -6 42 20 -4 -50 23 30 -4 18 20 -29 12 57 -35 8 28 -20 -15 22 8 2 32 7 -52 40 5
7149Ek1N3j0n9M0j9QN0m7j1qJ9J8kk8ROm4M2L0n5M0J1p0L3O0o4OK1qpN0n1kL6
$$ 5 -16 37 27 -32 8 -11 -3 47 0 -11 -19 0 18 16 -12 -3 3 -41 1 31 -24 16 27 -43 -10 50 -14 -8 13 5 -2 48 -3 -5 31
7184C1n1k7N3M1n8K4l8K1K1l6K4Pj0%Jl4O1J9j01O8Qm9P2J4q2NP8q9nR4o7k2N2
$$ 31 -20 -47 6 47 -11 13 -25 -4 17 -19 5 12 2 2 3 -31 30 49 -52 16 24 -25 47 61 -21 -16 62 -27 -32 62 -5 -27 25
7217B5l8oQ9o6j5J1RmJ5qrJ1k6pJ3J5J3k4k1K6kk4N7k5n1O1Kq5P3K8r5L1N0m0
$$ 25 -13 -19 70 4 -11 0 9 5 20 12 3 14 -12 -19 -6 9 22 -2 -23 3 1 -23 34 9 -42 19 21 -64 9 37 -58 -27 23 -17
7251a7K0M7o3lN5n5j2P1j5m9M2rj6K8j3J1l0K1jj2OK6m3k2N2k9OL3jo7M7qk6K5
$$ -17 3 50 -13 -16 39 -16 -28 43 28 -21 21 12 -4 24 11 22 -8 13 12 0 6 32 -11 -33 19 -10 -4 29 28 -39 8 0 -26 -1
7285aQl5L7rk5L3J6m9J7OK2n1L5J0pmLj0J5j4Mj4K6L3o4J3L8m5pL0nJ5j0j3Qk
$$ -1 7 -28 9 0 -25 8 24 -25 -8 -2 20 -31 4 14 7 3 6 -4 11 -3 1 -13 13 46 -18 -5 33 -12 -19 11 6 21 11 -2 6 4
7321DN3n4j4L6ll2lK2m3O2Mn4QM5m3PK2l6lK8K4n1L9Qo7M2J6k4j3RJ1mjJ6m7J9
$$ 4 57 3 -11 25 22 -10 -13 9 -34 28 32 -22 -14 31 -12 -5 17 -19 -22 6 30 -21 18 26 -41 1 17 -7 -20 -11 0 -4 -5 11 -36 -17
7357a7L1j9pM3k4k7L4jo3N7K7p0M1N9r5J1P9o7j3N0l2j6O6k0m6K6Pk3K2MqmKk2
$$ -17 14 -5 -12 31 7 -20 14 13 -50 7 34 -36 5 64 -31 -20 59 -8 -21 29 -3 -19 47 27 -19 7 14 -9 13 17 9 5 7 -15
7391a5J5oK1j7k1O6l4k6L0mm6N3J8q0O6M3q6pN8m8j3N7l1JL4n0rM6J0mj9J9k4
$$ -15 0 -6 15 -2 -23 43 9 -17 13 9 -37 16 34 -46 20 63 -23 -30 28 -20 -33 24 -7 -6 28 -22 -31 15 25 21 2 21 -3
7424cj1j8M3Nn3Q3l4k2P5m5p9P8j4k9N7j1o3M4M8r0K3O3o4K7K0m1jO0o8lK2J5
$$ -3 -14 -32 11 16 -37 46 12 -10 65 20 -59 19 5 -24 33 22 -41 3 51 -39 -16 47 -17 10 30 -11 -12 48 -20 -23 -1 14
7456A4j4k1QM3k0lNk3NM5m7j7N4k0m2N7j2n7O8k4l8O1J0q5J7O5m0JM1n1LM7l4
$$ 14 0 -21 -13 30 10 7 12 -11 -6 39 -8 -25 29 9 -33 24 12 -45 23 -1 -39 22 32 -53 -36 29 -11 -10 31 -20 -17 30 -4
7489dKJ7rkm1M1J6k7rN0l5PK1l4j5N6m8j8O1l0j1M7m5k5Q0k6m6K4L0m2J7L6l0
$$ -4 -2 15 6 4 -37 4 20 -7 -16 34 -1 6 27 -7 -22 34 -14 -32 29 -1 -12 35 -10 -35 45 19 -27 -3 27 -15 2 38 8
7522HJ3Pl5kJ5Lj2MM3j5k4QK2l6mRk7K0M1m1k3P6l4n3P2k2j9L3j0m1L1L0n4OM3
$$ 8 21 28 -7 -9 6 9 -3 1 44 29 5 13 35 -1 -5 4 -23 -3 38 -3 -26 50 16 -37 35 13 -6 27 17 -24 7 37 -17 -11 32
7557C2j8j7K4k8j1K5J4n8L8N2l6j0J1K1k6k1KoK2J7m0J7K2nl1K4pk2K6k2oK3J9
$$ 32 14 -3 21 -7 -18 7 21 -37 1 53 17 7 18 39 13 -8 -6 -12 10 27 -13 4 26 21 -10 14 7 -15 11 -11 -17 6 25
7590B5m8LK2%J2Ll7kN5k1k5QJpkJ6j1j3M0j6%RQl1rM0j2%RJ2k9J6jl8L2L1k1o1
$$ 25 -23 -20 2 2 14 17 -20 -22 33 12 -13 -5 -4 -11 -13 3 -8 -21 19 3 3 12 20 -11 -20 20 8 8 17 29 0 16 15 -23 9 40 19 -42
7628d2Q6k0m0L1J2m9L3K1p0O3K4k9l6L8j4nrL5l4LL0o1J1L7kl7L1%J3k2K2l7J3
$$ -42 44 24 -16 15 27 -22 11 32 -38 25 49 20 -16 22 8 3 -6 29 -5 -2 28 -33 -22 15 13 -24 7 7 20 -2 20 -17 -4
7661dK2l0J9Ppj6K9lrJ2rm3J5M2j9MK0j1k1NKJ4LJ2n2K5Mk8k5M1K5Jj5k3K6Mk6
$$ -4 18 -12 7 14 7 -9 20 17 8 20 11 -32 -17 25 6 10 30 19 -2 3 5 19 22 34 -18 7 11 -17 -42 -1 24 25 10 -13 13 17 -9
7698iJ0j5L0Lk5RK4m7qM9k0mJ8k3j8N8k4n1M4L2m7J9Qj9RJ5k0J0KoJ0l1j2M6J9
$$ -9 1 -14 16 19 -6 3 27 -20 -28 21 1 -3 15 -8 -26 32 8 -43 1 33 -14 5 13 -6 3 18 -2 8 10 4 14 -17 -29 17 36
7733C6j1ql1L6%k0J5M2p5kL1k0K5J0n3lN9n0K0L4l1nL4n0QN1l3l7Q0l7j8L9k2
$$ 36 25 17 -14 22 22 2 17 59 -16 -18 13 -7 18 28 -25 -28 31 -19 1 35 4 -1 33 -17 -9 42 9 -28 52 15 -3 36 14
7766A4oJ2k0pK2k1K8Kl9K5K6n2jN9l1k1M7n7J0N9o8lM4j7QJ1l9QNj3OM1l8L3l
$$ 14 8 20 0 -7 15 -6 22 24 -15 10 36 -16 -17 42 11 -10 37 -20 -10 49 -19 -22 22 5 13 24 -15 -7 -2 -15 -9 32 -6 27 24
7801B4k6K4J8m2RL0n2M2k3l4J9N9r5K5O9r6L6N1o4J8N0p5K3O4q3M3mm4M6M0p2
$$ 24 -2 22 40 -2 7 37 -15 27 4 -30 -11 48 -47 -22 47 -49 -13 38 -26 -8 42 -33 -10 54 -29 14 10 -34 12 52 -20
7832b0pQ1o0MK0m8K9J9m5N5J9n9K6k1j9M6K2q8K3N1r3O5K1m5N3K1j10O7L6n3J8
$$ -20 -27 54 -6 -2 18 -30 -1 18 -27 28 47 -12 14 -7 -26 20 42 -46 -23 28 -65 0 21 -24 29 50 -60 7 43 -10 8
7863HJ2l0M4Nm7K1J4m1J1K5o4O1K2n9K7J9o0N0Ro5N0K3o4M6K3n2L4k2o6R5Rn4
$$ 8 20 -10 34 39 -8 13 27 -14 -3 22 -42 19 41 -18 9 28 -32 18 27 -38 12 35 -29 17 40 -12 22 0 -66 29 38 -16
7895a6L0Ll7L1Rk7N7l0m3M1K5n4J0J6l0O3j6n2N6l2m2L8Jk0M9j9k7M3J0o8N4k7
$$ -16 14 17 -20 11 20 -7 50 20 -23 18 43 -11 -1 15 -15 48 32 -20 36 4 -38 0 1 -19 30 11 -16 27 37 -31 23 -4
7927dj5L6jl2N8k2m1M1Qk8L7jo8N9j0j6K3j9j5M5m1nK6J4n8L7nlOLl9N6l3PJj5
$$ -4 -19 17 16 -16 42 20 -21 20 28 0 37 36 -32 27 17 1 24 5 -10 35 -6 -11 15 29 -29 8 3 0 6 9 -30 26 -7 0 1 -14
7963a4J4J9k6KM6l0qJ4k4K0j2j8J1K8j1k0PJ6k6K3k5K9kj7K2nMJ1qn3O8k3K0k1
$$ -14 0 19 -7 -5 41 11 3 17 -7 13 1 -17 -6 22 11 -9 -2 14 -12 11 -14 15 13 -4 18 13 17 28 20 -33 35 12 32 11
7997A1J4pqJ9k8J5K2n1QL0qj3J9l4%RL4m8M1l1onK2mJ6J8l5j7JM3j1k8L5o0M8
$$ 11 25 18 10 29 1 16 38 -13 -5 25 17 4 23 -11 -11 -2 32 -16 25 -6 -12 -17 5 1 17 35 0 -17 -16 27 16 -12 23 -37 11
8032A1K1n3M2J2k9j8L7Nl2J3k0kJ5j9LK7pJ2k2J0L7l6ok3K2OpL2k1J6j7j5K2J1
$$ 11 32 -21 21 33 4 -14 23 28 -4 9 -11 -13 2 -17 -14 13 6 18 -4 6 43 7 1 -22 0 6 -1 31 10 26 9 -6 16 27
8066B7k2moj2QJ9rQj2J6JqNJ1l1pJ9jK3ok9KM3n7qM3k9j2K9Ql3M8jo9L8K6m5J7
$$ 27 5 1 -5 -17 -9 10 1 9 -3 13 14 6 11 22 -9 -16 3 2 25 19 -10 -8 35 -22 -30 13 -16 -28 1 9 -24 24 23 -46 -8 18 -27 -10
8104a0L7m1KK3%lL2l4j8J7l3L3k7M3j5qK1j3Mk1M5n6KL6j1k7K9j3JL5k0k9KM4
$$ -10 27 -14 -12 11 11 8 40 6 -12 5 -28 5 -22 21 6 -2 19 6 10 -11 34 -22 -20 16 5 -22 7 -6 -5 30 10 -19 -17 27
8138B7l3K6j3k4L7om3K2M4l8j4OL8k6j3rM0lj7J0l9M4Lk6RJ7k7j4P2n6j0K6k7
$$ 27 -6 20 7 -17 20 14 -29 -7 37 -1 -15 -9 29 3 -10 -19 21 18 1 11 -28 16 19 -7 2 19 -8 -22 50 -6 -16 10 -17
8171a7lN2jk1k1J1j2J5K0k5jL3k6j2J6J2Rm6J5K3
$$ -17 -20 32 31 10 -11 0 -12 3 23 -2 -3 30 4 -8 8 20 29 -17 -2 21
8191B1
$$ Imaginary data points
##PAGE= N=2
##DATA TABLE= (X++(I..I)), XYDATA
0@%%%%%pJ5j6J6j6K4l2L3m1N6o6P6r2J13j35J56j81K11k48K87l29L76m27M86n52
$$ 0 0 0 0 0 0 -7 8 -8 8 -8 16 -16 17 -24 32 -34 42 -50 63 -72 84 -97 114 -134 153 -176 200 -227 259 -293
30b93O23p00P86q82R88j102J225j363J514j678J859k059K281k526K795l095L435
$$ -293 330 -370 416 -466 522 -580 645 -718 796 -882 977 -1082 1199 -1327 1468 -1627 1808
47A808l819M255m756N337o024O851p867R152j0833J3140j6526K2039l2958Q5885
$$ 1808 -2011 2244 -2512 2825 -3199 3652 -4215 4937 -5896 7244 -9282 12757 -20201 65684
61F5684j90327L4203K77786l03521M0256K59453k24243p8252K32729j44037m9155
$$ 65684 -124643 -90440 187346 -116175 -75919 183534 -40709 -118961 113768 -30269 -79424
72g9424J80912r0995p6485J07227o7553k261Q8460o9505p843N2555q3882L1743
$$ -79424 101488 10493 -65992 41235 -26318 -28579 59881 -9624 -17467 35088 -48794 -17051
84a7051P4975p5532O710M9049p6049J2192O0198l2021O26L915k8743K5206j0874
$$ -17051 57924 -17608 -10898 38151 -37898 -25706 34492 2471 3097 7012 -21731 3475 -7399
97g399k037N7539n6560l7499Q6961n1305m1718J21259m9572r2169J08181j9770
$$ -7399 -9436 48103 -8457 -45956 41005 -10300 -52018 69241 19669 -72500 35681 15911
109A5911q0059J09025p596r0455P2515j1453n5458Q5465k0881n0957P3917n7246
$$ 15911 -64148 44877 37281 -53174 19341 7888 -47570 37895 17014 -33943 39974 -17272
121a7272m1066J23105n6200o8783J28274o4788j00068J57514j6597j26703J29622
$$ -17272 -58338 64767 8567 -60216 68058 3270 -96798 60716 44119 -82584 47038
132D7038K455j47835J08080O1574j23454N1976N4675j02761K2231O7414m6798
$$ 47038 49493 -98342 9738 71312 -52142 -166 54509 -48252 -26021 41393 -5405
143e405o1K3636l0214k70Q159P910K2126l1766j3403L4881k9895l413N8014l7516
$$ -5405 -5466 18170 -12044 -12314 -4155 3755 25881 -5885 -19288 15593 -14302 -17715 40299 2783
157B783l3197N0066k5531k2755O0803j8793l7432L6806j9516j7354N1328j8550
$$ 2783 -30414 19652 -5879 -28634 32169 13376 -24056 12750 -6766 -24120 27208 8658
169H658k6509L5987k7225j8783N3756j7092k7195L9290k3490k9250M7811j602
$$ 8658 -17851 18136 -9089 -27872 25884 8792 -18403 20887 -2603 -31853 15958 14356
181A4356k6644K3954j1197j9411K3698j933j451J2751k4651J726J9541k6468J7128
$$ 14356 -12288 11666 469 -18942 4756 2823 1372 14123 -10528 -8802 10739 -15729 1399
194A399L0689n0055o79M4668m1782k313N7774m2150k8809N3877k3001k8722N4916
$$ 1399 32088 -17967 -18646 26022 -15760 -18073 39701 -2449 -31258 22619 -382 -29104 25812
207B5812q023m3705K8262N814k4787K2285J1085k1417k251M731Q73J834J303Q808
$$ 25812 17789 -25916 2346 8160 -16627 5658 16743 -4674 -6925 -2194 -1321 513 1816 10624
221A0624r492j8833J8455Q705j7676J6825L919l2253J4378J9001k3080J2048J5413
$$ 10624 1132 -17701 754 9459 -8217 8608 12527 -19726 -5348 13653 -9427 2621 18034
234A8034l1275K325K0766j5684P034J4865k3816k585J5404r177N170J0376j4241
$$ 18034 -13241 -10916 9850 -5834 1200 16065 -7751 -10336 5068 -4109 1061 11437 -2804
247b804k064M113n680J0321M652j0286K761n073o157J8065j089j2680J2897p276
$$ -2804 -4868 -755 -6435 3886 8538 -1748 1013 -4060 -10217 7848 6759 -5921 6976 -300
261c00j5881K2482L218j8007J6071j604k4744J8572J3866j9736P533P827k1011
$$ -300 -16181 6301 9519 -8488 7583 5979 -18765 -193 13673 -6063 1470 9297 -11714
274a1714M698J6532r346j244P738r561o054Q649O145k467m352J238k269n762J0545
$$ -11714 -7016 9516 170 -1074 6664 -2897 -8951 -302 5843 3376 -976 262 -2007 -7769 2776
289B776P030j3655K034P685j5528L697J9742j2776p686J3529j1501o192K1250
$$ 2776 9806 -3849 -1815 5870 -9658 -5961 13781 1005 -6681 6848 -4653 -10845 10405
302A0405m267j3649J1520k762j2022J2816O327r858J643P22p199L921P683j285
$$ 10405 6138 -7511 4009 1247 -10775 2041 8368 -1490 153 875 -6324 -2403 5280 3995
316C995m466k012J158o76K37P098p22r104K507K412n328Q027N772j2953j097Q273
$$ 3995 -471 -2483 -1325 -2001 -1764 5334 4612 -4492 -1985 427 -4901 3126 8898 -4055 -5152 3121
332C121o428J303J0451p583o527O943k781k555R896q54r123J644K262j589L771
$$ 3121 -3307 -2004 8447 864 -5663 1280 -1501 -4056 5840 4986 -4137 -2493 -231 -1820 1951
347A951K147m224k509R60J007Q02K022J235m201l970L842L104j781J706k32n804
$$ 1951 4098 -126 -2635 -1675 -668 134 2156 3391 -810 -4780 -938 2166 385 2091 1859 -3945
363c945J385M969k539K02L944m959m172N390J935k284K216r64n189K124M550k122
$$ -3945 -2560 2409 -130 72 4016 -943 -5115 275 2210 -74 2142 1178 -4011 -1887 2663 541
379E41r12K830k692m036L706L622k638j40J307m549l72O854j213m978M269o1o623
$$ 541 -371 2459 -233 -4269 -563 3059 421 281 1588 -2961 -3333 3521 2308 -2670 1599 1538 -5085
396e085M648N325o273M50M471p273m19R900l969o135P000j349o912P059L103p631
$$ -5085 -437 4888 -1385 -935 3536 -3737 -4156 5744 1775 -4360 2640 1291 -5621 1438 4541 -3090
412c090K977L727p823J242Q511m655m609N837j454m897N912K056o728K328M247
$$ -3090 -113 3614 -4209 -2967 5544 889 -3720 2117 663 -4234 1678 3734 -2994 -666 3581
427C581o697n7Q163l874n039O093j340n246O792J191p668M230L620p658K194O408
$$ 3581 -3116 -3173 4990 1116 -3923 2170 830 -4416 2376 3567 -4101 129 3749 -3909 -1715 4693
443D693n540j271M685m150j054N963k225l661L422j0k755J864J493j196n68P5
$$ 4693 -847 -2118 2567 -1583 -2637 3326 1101 -2560 862 852 -1903 -39 1454 258 -310 -235
459b35l38j09J508R18k692o96K902j134j489K811p45k210K069n88j472K980k25
$$ -235 -573 -682 826 1744 -948 -1644 1258 124 -1365 1446 701 -1509 560 -28 -1500 1480 1255
476A255k700J239K51m10J448j442l96K253k256p12L108j928m78L001l681r76N437
$$ 1255 -1445 -206 45 -365 1083 -359 -755 1498 -758 -1470 1638 -290 -768 2233 -1448 -2424 3013
493C013k720k847M784j888l138M639j130l145M537p89m494L456J507k856J493
$$ 3013 293 -2554 2230 342 -2796 1843 713 -2432 2105 1316 -3178 278 1785 -1071 422
508D22K14k117J624P88j472M83M80k54o23o42J956N28k635J110R53k535K451J532
$$ 422 636 -1481 143 931 -541 -58 422 168 -455 -1097 859 1387 -1248 -138 815 -1720 731 2263
526B263m687J827L573m972K91N051l977j503M663l232j956N838k006m712M451
$$ 2263 -2424 -597 2976 -1996 -1705 3346 -631 -2134 2529 -703 -2659 3179 1173 -3539 912
541I12J199m396K185K389l592K78K917k628j098M027r81l936K680K083l425R62
$$ 912 2111 -2285 -100 2289 -1303 -1025 1892 -736 -1834 2193 1212 -2724 -44 2039 -1386 -424
557d24K516l486P9L724l055j488M591j680l541L479M98k651K330J24l088K120
$$ -424 2092 -1394 -1315 2409 -646 -2134 2457 777 -2764 715 1213 -1438 892 1016 -2072 48
573D8J723k713K28J919j338p92J164L1m05N78j74j416P42J908j453j303J989m26
$$ 48 1771 -942 -714 1205 -133 -925 239 270 -135 443 269 -1147 -405 1503 50 -1253 736 310
591C10j371J859o54j351K670j156k602L509o7l008L082o39l169M523o42m857N297
$$ 310 -1061 798 144 -1207 1463 307 -2295 1214 1147 -1861 1221 582 -2587 1936 1294 -3563 1734
608A734O97n995M588J165o052N520J627p967N236L474q248M125M249p848L554
$$ 1734 2431 -3564 1024 2189 -3863 1657 3284 -4683 553 4027 -4221 -96 4153 -3695 -141
623a41M102q201L614N588q017J511N129o197J897M266o062J687L724n121J674
$$ -141 3961 -4240 -626 4962 -3055 -1544 3585 -2612 -715 3551 -2511 -824 2900 -2221 -547
638e47K524l530K655m11l985N422o83m738O085k274n193Q770k843p177J0701k382
$$ -547 1977 -1553 1102 691 -3294 2128 1445 -3293 2792 518 -4675 4095 1252 -5925 4776 2394
654B394r654J1061p70r878J1448j284j1615J2063N82j1966J1163O10j1765J1185
$$ 2394 -7260 3801 3031 -6847 4601 3317 -8298 3765 4347 -7619 3544 4154 -7611 3574
668C574J51j1768J2367M52j3210J1595J202j2264J1905N53j3148J2117J490j3294
$$ 3574 3725 -8043 4324 4776 -8434 3161 4363 -7901 4004 4557 -8591 3526 5016 -8278
682h278J1129K120j2218J0061J141j1226J0493J016j1022R388O21r129R321j209
$$ -8278 2851 4971 -7247 2814 3955 -7271 3222 4238 -6784 2604 3225 -5904 3417 2208
696B208q291J0160j893q140R687k471o212R708m857n141J1144o572n050J2394
$$ 2208 -6083 4077 2184 -5956 3731 1260 -4952 4756 -101 -5242 5902 -670 -5720 6674
710F674p843m552J3778j0353n255J7388j0627q211J8434r628r745J9480q185j1881
$$ 6674 -1169 -5721 8057 -2296 -7551 9837 -790 -9001 9433 -195 -9940 9540 1355 -10526
724a0526J9273o151j3814J7961k424j3358J4229k128j1612J3267j106j0458J0642
$$ -10526 8747 2596 -11218 6743 4319 -9039 5190 3062 -8550 4717 3611 -6847 3795
737C795j648q149R850k506o301R753m229o412J0037l266n097Q617m919m103R352
$$ 3795 2147 -6002 3848 1342 -4959 4794 565 -5847 4190 924 -4173 4444 -475 -4578 4774
752D774n163l672Q926n817k837Q643o823j475R870q571k646J0974p773k921J0945
$$ 4774 -389 -4061 4865 -952 -3789 4854 -1969 -3444 6426 -2145 -4791 6183 -1590 -4511 6434
767F434q079l494J1586p292m663J0957n401m450Q727n155k623Q036n950j787P835
$$ 6434 -1645 -5139 6447 -845 -5508 5449 48 -4402 4325 -830 -3453 4583 -1367 -3154 4681
782D681o468r37P706p839m9R536r193k121J0965p618l465J0728o380m672R883
$$ 4681 -1787 -2724 4982 -2857 -2906 6630 -2563 -4684 6281 -1337 -4802 5926 -454 -5126 4757
797D757m504n185Q718k118n308N130j157k206M048k209j360K811k573N50K770
$$ 4757 253 -4932 3786 1668 -3640 1490 333 -1873 2175 -34 -1394 1417 -1156 -606 2164
812B164l724J420K693n355J606M505m536M61L025m575J525L665m493J104K921
$$ 2164 -1560 -140 2553 -2802 -1196 3309 -1227 -766 2259 -2316 -791 2874 -1619 -515 2406
827B406m420J319K728l877K313K196n517J839L831m245R02K843l996P54K870l028
$$ 2406 -2014 -695 2033 -1844 469 2665 -2852 -1013 2818 -1427 -525 2318 -1678 -924 1946 -1082
843a082M44K315k027k46M88m59J800r64j648K420j036j578L208j343k256L828
$$ -1082 -638 1677 -350 -596 -108 -567 1233 269 -1379 1041 5 -1573 1635 292 -1964 1864
859A864j206l459L681P58k964J675J98j705J449J39p93P50n34K56R1j708K110
$$ 1864 658 -2801 880 1638 -1326 349 547 -1158 291 430 -363 387 -147 109 200 -1508 602
876F02J337l506J095J968l210J715K186m009J490K569m344J238L316l530Q04J934
$$ 602 1939 -1567 -472 1496 -1714 1 2187 -1822 -332 2237 -2107 -869 2447 -1083 -279 1655
892A655l987K065K936m371J230K702m241J387K881l951J531K738m600O98L421
$$ 1655 -2332 -267 2669 -1702 -472 2230 -2011 -624 2257 -1694 -163 2575 -2025 -1327 2094
907B094k729M39J513k855J313J514k482J543Q42k488J701q6k118L456l41l683
$$ 2094 -635 -196 1317 -1538 -225 1289 -1193 350 1192 -1296 405 319 -1799 1657 1316 -2367
923b367L032J76k910L603m25l628L937l20m048M164M75l860L430n38l746M754
$$ -2367 665 841 -2069 1534 1109 -2519 1418 1098 -2950 1214 1689 -2171 1259 721 -3025 1729
939A729M5m695M111M75m584L861P53m336L879P89n041L096K090l870J926J181
$$ 1729 1774 -2921 1190 1665 -2919 942 1695 -2641 1238 2027 -3014 82 2172 -1698 228 1409
955A409l188K034J004k758J759Q95k028J099k29j020K366j027j823K473p40j517
$$ 1409 -1779 255 1259 -1499 260 1155 -873 226 -3 -1023 1343 316 -1507 966 226 -1291
971a291K617j263j556L180j521k396L585m29k496K622q04k116L215n05k715K748
$$ -1291 1326 63 -1493 1687 166 -2230 1355 926 -1570 1052 248 -1868 1347 842 -1873 875
987H75Q1k502J950J32j558K068n82k103K138K18j531J386m43j086J788q04j267
$$ 875 956 -1546 404 536 -1022 1046 464 -1639 499 717 -814 572 129 -957 831 27 -1240
1004a240K279m03j683J465m53r45K234p92j997K121J60j953J488N23j507R71J76
$$ -1240 1039 636 -1047 418 -35 -980 1254 462 -1535 586 746 -1207 281 804 -703 268 444
1021D44j574J204J105j453k53P18k56L0J54r4N7m7k8j92k83R81L12j649K68J397
$$ 444 -1130 74 1179 -274 -527 191 -65 -35 119 25 82 35 7 -185 -468 513 825 -824 -556 841
1041H41j038k06J301j186m63J671j132j033K474l17k355J372Q11j550J134P69
$$ 841 -197 -403 898 -288 -751 920 -212 -1245 1229 912 -1443 -71 740 -810 324 1093
1057A093k171N33J754j674m56K102o80j543R79L65p42R49L16j687P2J650p59r25
$$ 1093 -1078 -545 1209 -465 -921 1181 501 -1042 -63 302 -440 509 825 -862 -790 860 101 -824
1075h24J470J14j757O31J021j109N93J072k075m53K462o52j493J704j78j775J338
$$ -824 646 760 -997 -366 655 -454 139 1211 -864 -1317 1145 493 -1000 704 526 -1249 89
1092H9O26j448J148P63k334N6K140o19q98R48l98r76J023M90j012N16P96j604
$$ 89 715 -733 415 1178 -1156 -1100 1040 421 -477 471 73 -903 120 610 -402 114 910 -694
1110f94n26J972M4j218O82k10j161J405P11j616N30J069j767k82J889k45p66M15
$$ -694 -1220 752 796 -422 260 50 -1111 294 1005 -611 -81 988 -779 -1061 828 583 -183 232
1128B32n79n66J283N78j167k44Q59m70q69J265Q04j391q8O73j285O59K092j851
$$ 232 -347 -913 370 948 -219 -463 396 -74 -943 322 1126 -265 -353 320 -965 -306 1786 -65
1146f5j376K283n77j712K214M44k194R62N65j903J363J846k141r15J634l15p74
$$ -65 -1441 842 265 -1447 767 1211 -983 -21 544 -1359 4 1850 -291 -1206 428 113 -661
1163f61J202K26j286J72P17r67J23J910q89k136J479R81j628J020R66k276M51
$$ -661 541 767 -519 -347 370 -597 -474 1436 547 -1589 -110 871 -757 263 1229 -1047 -596
1180e96J725j978K34K535j959j488K052m51p22J876q75j703J594L16j391R22R22
$$ -596 1129 -849 -615 1920 -39 -1527 525 74 -648 1228 353 -1350 244 560 -831 91 1013
1197A013j151n31N01K36k6M95n9j334J86J669r62r39K020o15k108J893M84j906
$$ 1013 -138 -669 -168 68 42 537 478 -856 -670 999 37 -902 1118 503 -1605 288 772 -1134
1215a134K012M37l259J468K163k452L25J795j964j53J515j237K35J403j264o09
$$ -1134 878 1315 -1944 -476 1687 -765 -440 1355 -609 -762 753 -484 -249 1154 -110 -719
1231g19N55L3P78m17r28J182m83j074J852l29j380K032r78k187L066K79k677K006
$$ -719 -164 -131 647 230 -698 484 1 -1073 779 450 -930 1102 124 -2063 1003 1282 -1395 611
1249F11J1k394K485K76k512K367K72k899J828P38j548J754o12j956K192k88j218
$$ 611 622 -1772 713 989 -1523 844 1116 -1783 45 783 -765 989 377 -1579 613 325 -893
1266h93K112j330r14K484k372n59M109k828j769M118l048j294N551l592k797O083
$$ -893 1219 -111 -1025 1459 -913 -1472 2637 -191 -1960 2158 -890 -2184 3367 -225 -3022 3061
1282C061l015l616O384j836l959N437k042m030N874p18m192M131q17l088L908
$$ 3061 46 -3570 2814 978 -2981 2456 414 -3616 2258 1540 -2652 1479 662 -2426 1482
1297A482r80k170L599j917k099L408j571n30L132l509n15M012l460n9M047m225
$$ 1482 502 -1668 1931 14 -2085 1323 -248 -778 2354 -1155 -1670 2342 -1118 -1177 2870 -1355
1313a355M2M014m869Q85N222n587k15N019n352P18N634o153L2N888o088j67O387
$$ -1355 -1313 2701 -2168 -1283 3939 -1648 -1863 3156 -2196 -1478 4156 -1997 -1965 3923 -2165 -2332 4055
1330D055n410l13N295o084L15O306n695k45N426n884L75N663n945P28N792o817
$$ 4055 -1355 -1668 3627 -2457 -2142 4164 -1531 -1776 3650 -2234 -1859 3804 -2141 -1413 4379 -2438
1346b438j43O448n545M6N849o282o02O449n026j033N838m280j511M449l306j68
$$ -2438 -2581 3867 -1678 -1632 4217 -2065 -2667 3782 -1244 -2277 3561 -719 -2230 2219 -1087 -1255
1362a255M117l622o63K802k650J152K068l557J776J496m273K787K173m464K867
$$ -1255 2862 -760 -1423 1379 -1271 -119 1949 -1608 168 1664 -2609 178 2351 -2113 754
1377G54J172n550M126K707o211L336K633o620L618L423o716L611L704p863K732
$$ 754 1926 -3624 502 3209 -3002 334 2967 -3653 -35 3388 -3328 283 3987 -3876 -1144
1392a144N173o729K073M691p244J564N671o346P31N606n783l43M964m460L43M678
$$ -1144 4029 -2700 -627 4064 -3180 -1616 4055 -2291 -1560 4046 -1737 -2080 2884 -1576 -1233 3445
1408C445m762o59M229l256N5L267l392L02K524l454J010K990l173M58J641l088
$$ 3445 -1317 -1976 2253 -1003 -948 2319 -1073 -771 1753 -1701 -691 2299 -874 -416 1225 -1863
1424a863J807K080l360J261J443l104J750J265k731K426L28l816K882J086l238
$$ -1863 -56 2024 -1336 -75 1368 -1736 14 1279 -1452 974 1302 -2514 368 1454 -1784
1439a784L025K0m172L907O98m610M197J083n461L576J498n035M165J839o221L074
$$ -1784 1241 1261 -2911 996 1694 -2916 1281 2364 -3097 479 1977 -3058 1107 2946 -3275 -201
1455b01K922n364K588K970n192J798K915m710J532L606l948lK581k558N21K175
$$ -201 2721 -2643 -55 2915 -2277 -479 2436 -2274 -742 2864 -1084 -1087 1494 -1064 -543 1632
1471A632k181l0J391j254O9O43k50N92q81o19J470o75j90J469j836l92K483j917
$$ 1632 -549 -579 812 -442 -373 270 20 612 -269 -888 582 -93 -283 1186 -650 -1042 1441 -476
1489d76p56L008j701j528K580j511q53L156j735j936K783q47j504K400o89j355
$$ -476 -1232 1776 75 -1453 1127 -384 -1237 1919 184 -1752 1031 184 -1320 1080 391 -964
1505i64J787r48j116K074j85j098O96o06j34J185p15j74P11q23l7N64n82P40M09
$$ -964 823 -125 -1241 833 648 -450 246 -360 -494 691 -24 -198 513 -310 -347 217 -365 375 784
1524G84j593L51R18o44L85K16r50N12K84p46O79K02n08K76o79j7J515q52q32J294
$$ 784 -809 -458 460 -184 201 417 -533 -21 263 -483 196 398 -110 166 -513 -530 985 133 -699 595
1544E95q40n49J839j089r37K136j121j582K342j34j472J485n55j371J885M0j484
$$ 595 -245 -794 1045 -44 -981 1155 34 -1548 794 660 -812 673 118 -1253 632 672 -812
1561h12J183P4j126P55j04k37J071p49p92Q92k37J1P49j012m9J039j160l4J445
$$ -812 371 445 -681 74 -30 -267 804 55 -737 155 -82 -71 678 -334 -383 656 -504 -538 907
1580I07r29k70Q30j350L60J666j453m18J537j306k68J661j263k56J758j499r91
$$ 907 -22 -292 538 -812 -452 1214 -239 -657 880 -426 -694 967 -296 -552 1206 -293 -1284
1597a284K113l91j037J122n92p10J236k10p29Q05q9n44J77j64N83L65j098J50
$$ -1284 829 438 -599 523 -69 -779 457 247 -482 323 234 -310 -133 -297 286 651 -447 -297
1615b97O56q26N39P58j527M78J192j781R5K031j276p95J316r56l07J753q66j016
$$ -297 359 -467 72 830 -697 -219 973 -808 -713 1318 42 -753 563 -393 -700 1053 187 -829
1633h29J318l64q47J021ql65M81p26l74J073o6l21K08n84R8P14o59J00Q40q48
$$ -829 489 125 -722 299 291 -74 407 -319 -693 380 314 -7 201 -383 -285 429 -230 -130 710 -138
1653a38m11O24k86L92O41j253k38J073n77n9R32q39k49Q23q85j15J556o29j074
$$ -138 -549 75 -211 181 822 -431 -669 404 -173 -232 700 -139 -388 435 -450 -565 991 362 -712
1672g12P17l4l34R04k02q09M80J36n48K77O31j26o56k15M73J54j7L26n13o37Q71
$$ -712 5 -29 -363 541 339 -470 10 146 -402 -125 506 380 -276 -491 -18 136 119 445 -68 -705 166
1693A66J52q76Q63N56j447k6R63m90K65P14j246m40J304k51n90Q21m7r35K54L44
$$ 166 318 -558 305 861 -586 -612 351 -139 126 840 -406 -846 458 207 -383 438 391 -544 -290 54
1713E4j63N56R7j031k09Q47J60k63J39j13m25J03K62K1L40P9q44l63Q52L89l02
$$ 54 -109 447 544 -487 -696 151 311 48 187 74 -351 -248 14 35 375 454 -390 -753 99 488 186
1734A86q5k05l03K53L47r3J47R2o75m20Q05N39l42j98k25m28N55O09n58k6M36
$$ 186 101 -104 -407 -154 193 100 247 339 -336 -756 49 588 246 48 -177 -605 -50 559 1 -25 411
1755D11p75m20J066K90m30O8n64m97J049N19p40J5J67o38N2P24J01j19j97n90
$$ 411 -364 -784 282 572 142 210 -354 -851 198 717 -23 -8 159 -479 -427 297 398 279 82 -508
1775e08j16P38O24m32o87J64J03l03O30N16p30k45J23o23O83J271r98r15O73k15
$$ -508 -624 114 738 306 -381 -217 -114 -417 213 729 -1 -246 -123 -746 -63 1208 210 -705 -32 -247
1795b47j30J095k37q62M28k73n29J085O21q18m89j64J62O95J79k69k74m28J17
$$ -247 -377 718 481 -381 47 -226 -755 330 951 133 -356 -520 -358 337 516 247 -27 -455 -338
1814c38L52K1N82K1j376q0J025j00L34K72j336j34J067m58J38J037r93q29N80
$$ -338 14 35 617 638 -738 -818 207 107 441 713 -623 -757 310 -148 -10 1027 34 -795 -215
1833b15j10M60J054j127r63P43j2J27Q12m84n38Q5m81L54J069k06n13m43n62R94
$$ -215 -325 135 1189 62 -901 -158 -170 -43 769 285 -253 -168 -649 -295 774 568 55 -388 -950 44
1853D4P31p29K14r7j191P99P79p64R38L6k235P22J697j023L75O52k004K05J587
$$ 44 775 46 260 163 -1028 -229 550 -214 724 760 -1475 -753 944 -79 296 948 -1056 -851 736
1872G36r69K96J177j605o62R74j43P72M76j555j29M83l76J165K03j355O81k11
$$ 736 -233 63 1240 -365 -1027 -53 -196 576 1052 -503 -632 -149 -525 640 843 -512 169 -42
1890d2j461K000R93k045O29Oj733K047J138k218Q39M48k230J450J336j550J055
$$ -42 -1503 497 1490 -555 74 80 -1653 394 1532 -686 153 601 -1629 -179 1157 -393 662
1907F62j8k609J658J540j613R99Q5k412J503J027j625J668L50k699J013P78j006
$$ 662 644 -1965 -307 1233 -380 619 704 -1708 -205 822 -803 865 1215 -1484 -471 307 -699
1924f99K021k82k623J519K59j373K518k42k518J980n30k139L535L83l319J855
$$ -699 1322 1040 -1583 -64 195 -1178 1340 1098 -1420 560 30 -2109 1426 1809 -1510 345
1940C45q4k430L297O25l154J886N4k681K563J000k080J609q92k339K937M16j739
$$ 345 261 -2169 1128 1753 -1401 485 539 -2142 421 1421 -659 950 58 -2281 656 1072 -667
1957f67K008j340k214L113m21j710L261j456l114L069j33j631L458j528l202L172
$$ -667 1341 1 -2213 900 479 -1231 2030 574 -2540 529 396 -1235 2223 695 -2507 665
1973F65l27j849L439j018k821K617j010j506L974r96k898K343j088j262L782j184
$$ 665 338 -1511 1928 910 -1911 706 -304 -1810 2164 1168 -1730 613 -475 -1737 2045 861
1989H61k289K566j670j572L723q28j595K344k556j310M224j285j630K933k668
$$ 861 -1428 1138 -532 -2104 1619 791 -804 1540 -1016 -2326 1898 613 -1017 1916 -752
2004g52j700M202j515j445L724k675k777M108p06j561L456k219k825L539m94j543
$$ -752 -2452 1750 235 -1210 2514 -161 -2938 1170 464 -1097 2359 140 -2685 854 360 -1183
2020a183L157j388k436K239q58m60L134j683j996J835j260J43K908k071j049J975
$$ -1183 1974 586 -1850 389 -469 -929 2205 522 -1474 361 -899 -756 2152 81 -968 1007
2036A007k379Q3L427j994o12J795l215L41M004k427o88K475l379k34L870k325
$$ 1007 -1372 -1289 2138 144 -468 1327 -1888 -1547 2457 30 -658 1817 -1562 -1796 2074 -251
2052b51k44K880l726r64L926j673k23K550l447q98L467j796j2K740k996r46K492
$$ -251 -495 2385 -1341 -2305 1621 -52 -275 2275 -1172 -2070 1397 -399 -411 2329 -667 -1613 879
2069H79j890P92K950l312j040K435j863P05K727k784o40J898k225N99K868j979
$$ 879 -1011 -219 2731 -581 -1621 814 -1049 -344 2383 -401 -1041 857 -1368 -769 2099 120
2085A20n90R44k109J125K333j835J8M91k115J283J441j513J351j05k960J732J360
$$ 120 -470 474 -1635 -510 1823 -12 6 497 -1618 -335 1106 -407 944 839 -2121 -389 971
2102I71j603J992l50l388K286J081k353K682L19l745J926R34k491L108Q08m169
$$ 971 -632 1360 1010 -2378 -92 989 -1364 1318 1637 -2108 -182 752 -1739 1369 2177 -1992
2118a992J506J243k349K497J062l334J130P70k255K158J359k259M47k02j335K243
$$ -1992 -486 757 -1592 905 1967 -1367 -237 533 -1722 436 1795 -464 -17 -219 -1554 689
2134F89N03j500Q71j004r74K154m34n46J759k043j335K595o28l53K092k410j272
$$ 689 1192 -308 563 -441 -1415 739 305 -241 1518 -525 -1860 735 107 -246 1846 -564 -1836
2151a836K815j147n03K649k092j397K153j379J10K911k334j412K164j543K15K786
$$ -1836 979 -168 -671 1978 -114 -1511 642 -737 -627 2284 -50 -1462 702 -841 -626 2160
2167B160k372q38K196k328kL279j921r09J813k461Q8L382j892r30J923k233k52
$$ 2160 -212 -1050 1146 -1182 -1184 2095 174 -735 1078 -1383 -1295 2087 195 -735 1188 -1045 -1297
2184a297K714j401k36J642k500l72K475r55J10J061k361J34J825j291O97J146
$$ -1297 1417 16 -220 1422 -1078 -1450 1025 70 180 1241 -1120 -986 839 -452 245 1391
2200A391k238K07J024j428J686J083k825N72J055j852J899J177k936J047J060
$$ 1391 -847 -640 384 -1044 642 1725 -1100 -528 527 -1325 574 1751 -1185 -138 922
2215I22k769J878K013k860O68R60k746J823K119k697M86J146k487J169J780k004
$$ 922 -1847 31 2044 -816 -148 812 -1934 -111 2008 -689 -203 943 -1544 -375 1405 -599
2231e99R86O67k851J307J760j779J126L60k738J455J434k090J501R25k910Q94
$$ -599 387 1054 -1797 -490 1270 -509 617 977 -1761 -306 1128 -962 539 1464 -1446 -552
2247e52J341j811J701R56k995P17J391j629J326R13k336P61P12j770J593J120
$$ -552 789 -1022 679 1635 -1360 -643 748 -881 445 1358 -978 -217 495 -1275 318 1438
2263A438k026M77K11j438J860P16j946R15O9j636J721M95j497J450m96k079K037
$$ 1438 -588 -111 100 -1338 522 1238 -708 207 276 -1360 361 856 -641 809 313 -1766 271
2280B71O94j564J456n02k081K107M03j768J901p0k382J511N30j316J852j69k323
$$ 271 965 -599 857 355 -1726 381 784 -984 917 847 -1535 -24 506 -810 1042 873 -1450
2297a450J382N29j223J605j22j747J280j81j199K013Q3j817J012k74r97K065j06
$$ -1450 -68 461 -762 843 721 -1026 254 73 -1126 887 970 -847 165 -109 -1106 959 853
2314H53j761J256j97j317J628K79j169R49n16j250J558M16r36O02n40p50J217
$$ 853 -908 348 151 -1166 462 741 -428 521 5 -1245 313 729 -207 395 -145 -895 322
2331C22p1n32R81n85r56Q73p0PR89j040p81J103k85j41R90q13n25Q68p40q2J445
$$ 322 251 -281 700 115 -841 32 -38 -31 958 -82 -863 240 -45 -186 804 -9 -534 334 -406 -488 957
2352I57o43q73O97n14j1J264o86o88P83m47l81R69j64k93L70p94j43J060j86k87
$$ 957 314 -559 138 -376 -387 877 191 -497 286 -161 -542 427 263 -30 340 -454 -597 463 277 -10
2372a0K59o56N7P82n05K1O32p65l94P17j28Q1N31q54l94Q19q9j90L92k45k69J38
$$ -10 249 -407 -350 432 -73 -52 580 -185 -579 138 10 91 622 -232 -626 193 104 -86 306 61 -208 -70
2394g0j22J77M64l10l24ol0M63J14m87R4J29l92K66K91k83J84m4o38L81O00l79
$$ -70 -192 -15 449 139 -185 -191 -221 242 356 -131 -37 92 -300 -34 257 -26 158 114 -524 -143 457 78
2416G8j17O8k91K46K40l37J72K10m60m6K91oK28j25n00K01L47k09R4L7k55J88
$$ 78 -39 29 -262 -16 224 -113 59 269 -191 -237 54 48 276 151 -349 -148 199 -10 84 121 -134 54
2438E4q1k48N18J29n21mR7o8L85o1n06L15J54m17K15K68k24O6j09k85L60K80k68
$$ 54 -27 -275 243 372 -149 -153 -56 -124 261 200 -306 9 163 -254 -39 229 5 71 -38 -323 37 317 49
2461D9j59j3J21J21j68K1K28k31j32J98j42J96L11o32j60O95k14l22M79k01k99
$$ 49 -110 -123 -2 119 -49 -28 200 -31 -163 35 -107 89 400 -232 -392 303 89 -233 246 45 -254
2482b54M76k01l24N61jn30J51J60N8O2k43j3K08j96J02N6k20K87J04o62L28N88
$$ -254 222 21 -303 258 257 -273 -122 38 96 158 -85 -98 110 -86 16 72 -148 139 243 -419 -91 497
2504D97n82k3L17m91K50M58o29j2O16m92k21M74j61J3J93m65O6M62k62l6K4j48
$$ 497 -85 -108 209 -282 -32 426 -203 -215 401 -91 -312 162 1 14 207 -258 -192 270 8 -28 -4 -152
2526a52L10r3l89N08M6n37M19p4l87P89j82q95Q37J90r01O92J54q46P67J31j054
$$ -152 158 65 -324 184 230 -307 112 38 -349 440 258 -637 200 390 -511 181 335 -511 256 387 -667
2547f67P54N33j037L09M44o62M63J80p07M18K62n35K82Nj75M99m94l28R14l98
$$ -667 87 620 -417 -108 336 -326 137 317 -390 28 290 -245 37 42 -133 366 -128 -456 458 60
2567F0m34P92n68l39J183p31p58J496m99j047J320k37r37J274l25j150J286R3
$$ 60 -374 418 -150 -489 694 -37 -795 701 202 -845 475 238 -699 575 250 -900 386 479
2585D79j134Q32J52p59O67j02o08Q02j16n68N69l33o2P36q26j98J166q54l77J183
$$ 479 -655 177 329 -430 237 135 -473 329 213 -355 214 -119 -181 555 -271 -469 697 -157 -534 649
2605F49q08l30J298j024n51J628p42r00J368n37o67J287o48p25J344n15p73J075
$$ 649 -159 -489 809 -215 -766 862 120 -780 588 51 -616 671 23 -702 642 127 -646 429
2623D29l73m26R37p57l66J241p14n15J120p00k94J083r34k98J411r73n76J407
$$ 429 56 -370 567 -190 -556 685 -29 -544 576 -124 -418 665 -269 -567 844 -129 -705 702
2641G02q19m58J386j052n63J732q99r55J644n74r01J408n77r00J460k97j111J105
$$ 702 -117 -575 811 -241 -804 928 29 -926 718 144 -757 651 74 -826 634 337 -774 331
2659C31l2p40O84k27k81O69m64j90N60n58K45N95j199M00J102j477J28J457j457
$$ 331 299 -441 243 16 -265 404 -60 -250 310 -248 -3 592 -607 -207 895 -582 -454 1003 -454
2678d54p8J578j591k28K039j454q40J969r18r04J615o83q29J537o80q72J282k90
$$ -454 -532 1046 -545 -773 1266 -188 -1028 941 23 -881 734 51 -778 759 79 -793 489 199
2696A99o25Q26n63k63R60o60k85R00n79j94O72p24J99Q12j017m2Q77p30J26O80
$$ 199 -426 400 -163 -426 534 -126 -411 489 -90 -284 388 -336 -137 675 -342 -384 493 -237 -111 569
2716E69j013K66Q09j152K07J075j021j8Q13j025K24J082j012k44R54o62j67P04
$$ 569 -444 -178 631 -521 -314 761 -260 -278 535 -490 -266 816 -196 -440 514 -148 -315 389
2734C89m81K8M29p07R5N77m11J73J25p48N62M40r50M53O27r98R6P09o75J71P41
$$ 389 -92 -64 365 -342 -247 330 -81 92 217 -531 31 471 -479 -26 601 -397 -301 408 -267 -96 645
2755F45q47l63Q48j08m58M09Q8l63j3K26r7j6L59k20o17M50M96n24N0L53n72K8
$$ 645 -202 -565 283 175 -283 126 214 -149 -162 64 -33 -49 310 90 -527 -77 419 -105 -55 298 -274 -246
2777b46N14l89O5N22n96k93N14K5m7J37l40j03L11m3o1J61j3j48k83J43M66j72
$$ -246 268 -121 -56 466 -130 -423 91 116 69 206 -134 -237 74 31 -30 131 118 -30 -313 -170 296 124
2799A24q8O9n11K02P02n91j63P85o78m67J006k67m12Q46o40p19J129J8o93O09
$$ 124 36 105 -406 -204 498 -93 -256 529 -149 -616 390 123 -289 557 -83 -802 327 345 -348 261
2819B61j50n77N59p3k33O47l33n05M72k50J02P41q56l01R19o10k67J114n83n53
$$ 261 111 -466 93 20 -213 434 101 -404 68 -182 -80 661 -195 -496 423 -187 -454 660 77 -476
2839d76R09o49m29J386l91r31Q14k49m61R07k74m89O84m13m83Q32j33k04M58p13
$$ -476 433 -216 -645 741 350 -581 233 -16 -477 430 156 -333 351 -62 -545 287 154 -50 408 -305
2859c05j96R67m13k48O41o51j62P24o43J06R81j010l67R68o33O9J017j141k99
$$ -305 -501 466 53 -195 446 -205 -367 357 -286 -180 801 -209 -576 392 -241 -172 845 -296 -595
2878e95J252r48k42J389q26n86J036p86k84J475p31q06R71m59l54J063n39l63
$$ -595 657 -291 -533 856 30 -556 480 -306 -590 885 154 -652 319 -140 -494 569 30 -333
2896c33Q57q31k86J150n09k37P21j019n0J290q17l76J156r31m18J200p14j97J226
$$ -333 524 -307 -593 557 48 -189 532 -487 -537 753 -64 -440 716 -215 -633 567 -147 -344 882
2915H82j029o23J205l63l39Q52p28l48Q92n65j47R07o00l13N44o42L45Q10r71
$$ 882 -147 -770 435 72 -267 585 -143 -491 401 -164 -311 596 -4 -317 227 -415 -70 740 -231
2934b31n2O67q46L51P86j017K39P19j261K73J147r80L6P18j207L33J156j154K7
$$ -231 -283 384 -462 -111 675 -342 -103 616 -645 -372 775 -205 -169 549 -658 -325 831 -323 -296
2953b96J004j082n6R45p73J45Q30j131q0R85o08K0N97q29J35O03p65K25P71q11
$$ -296 708 -374 -430 515 -258 -113 717 -414 -494 491 -117 -97 500 -329 -194 409 -356 -131 640 -171
2973a71n3M27n86M58N18r39J50N26o87K79M93o48K58L03q36M02N77n95J32J02
$$ -171 -224 203 -383 75 593 -346 -196 330 -357 -78 415 -233 25 328 -508 -106 471 -124 8 110
2993A10n43N17K56o18L69J82o85L97J69l94N97j10q33N82K83n78N37k7p05O24
$$ 110 -433 84 340 -278 91 273 -412 -15 154 -240 357 247 -586 -4 279 -299 238 211 -494 130
3013A30R3p25O99K36p73K96J59m20N53Q1p20M05K01n18L93J13l95L53m4n34N04
$$ 130 223 -502 197 433 -340 -44 115 -305 248 329 -391 14 215 -303 90 203 -192 161 117 -417 87
3034H7K15m60K31l3l19M23L1m08L45M2l46J22Q4j9K61k88k37L37l3n1J76k68o
$$ 87 302 -158 73 40 -279 144 175 -233 112 154 -192 -70 14 -5 256 -32 -269 68 35 -16 160 -108 -114
3057a14L31m12k0N68l21k16L05k96N8N16m27k81N17k28k03M13j80j21L43l65j78
$$ -114 217 -195 -215 353 32 -184 121 -175 -117 399 -28 -309 208 -20 -223 190 10 -111 232 -133 -311
3078c11N58j29k56J85j47j0L11k69p4L60k47j44K08j29J76J67m55K1L93k57j2
$$ -311 247 118 -138 47 -100 -110 201 -68 -142 218 -29 -173 35 -94 82 249 -206 -185 208 -49 -61
3099f1K55k89N6K51m35N9M80k87k04K10r5O5J52k43QJ73j35j1L8k6K59j95l31
$$ -61 194 -95 -39 212 -223 -164 316 29 -175 35 -60 5 157 -86 -78 95 -40 -51 -13 -39 220 25 -306
3122c06L49P7k54K64r3l18M56k3m89M37K02n39J68J88l11L19J03n03K20K65l60
$$ -306 43 120 -134 130 37 -281 175 152 -337 100 302 -237 -69 119 -192 127 230 -273 -53 212 -148
3143a48J28J34j67J40n6k61L06N5j87J11j63j4L55k85j86N08k33k67M03k29j42
$$ -148 -20 114 -53 87 31 -230 76 131 -56 55 -108 -122 233 -52 -238 270 37 -230 173 -56 -198
3164a98N82l49m81O70n8m49M17j1l43L32p4l42L93R8k64J4j04K00J60l61J26K62
$$ -198 384 35 -446 224 166 -283 134 123 -220 112 38 -304 89 187 -77 -63 -167 33 193 -168 -42 220
3186B20m42J34L32m70K12N01q66N3Q14n68j68O52n81j54P36n12k56P95l75m03
$$ 220 -222 -88 244 -226 -14 487 -379 -326 488 -80 -248 404 -177 -331 405 -107 -363 432 57 -346
3206c46N21k11r4M59m07k03N14k59j34L45k31L1J72m39J90M04m11J01J59n20M47
$$ -346 175 -36 -130 329 -78 -281 233 -26 -160 185 -46 -15 157 -282 -92 312 -99 2 161 -359 88
3227H8K90q07M53M96r91K99O47q54L00P19j121O6J067p58k70Q36n26k76O22l81
$$ 88 378 -429 24 520 -471 -172 475 -379 -79 640 -481 -415 652 -106 -376 460 -66 -342 280 -101
3247a01r8N03l30j23J51j70L60L1o50N38J85q18O06L49r20O17M03j205N54Q46
$$ -101 -199 304 -26 -149 2 -168 192 223 -427 111 296 -522 84 433 -487 130 533 -672 -118 728
3267G28j127J37Q00q84J09P75q39J01P67q24o8O76n02J05M19p12J68N51n78N6
$$ 728 -399 -262 538 -346 -237 538 -301 -200 567 -257 -325 351 -151 -46 373 -339 -171 380 -198 -142
3287a42M72m91J58J55n13M65K66p11M10J07o32P50L7r74R03K65j330Q36O43j270
$$ -142 330 -161 -3 152 -361 104 370 -341 69 176 -456 294 331 -643 260 525 -805 31 674 -596
3307e96O23O75j460N13J126j254l1J032q40j91P79m97k9N07n18oK47j47L03j73
$$ -596 27 702 -758 -245 881 -373 -404 628 -212 -403 376 -121 -150 357 -161 -167 80 -67 236 63
3327F3m70O40m5p06P71J27q59O43J04r28Q59L71j052M22M46p81M12L45p27M72
$$ 63 -407 233 188 -518 253 380 -479 164 268 -660 199 570 -482 -60 386 -395 17 362 -365 107
3347A07K33q12M20M66o41K92J61o40M51L33o38K35L20n04J70J33k50L83r2m54
$$ 107 340 -472 -52 414 -227 65 226 -414 37 370 -268 -33 287 -217 -47 86 -164 219 127 -327
3367c27M01Nl19N66k41n43P22j9q09P23L29r01L07M40o91K83N78p10j43O27k00
$$ -327 74 79 -240 326 85 -458 264 245 -564 159 488 -413 -106 334 -357 -74 504 -206 -349 278 78
3388G8l37K89J75k66p1J75j1j29K28Q9n54J60N70m81j74N86k57l64M33n1l13M40
$$ 78 -259 30 205 -61 -132 43 32 -97 131 220 -334 -174 396 -85 -259 327 70 -294 139 88 -225 215
3410B15l4n51K96L19l21J9J97k20J6J67k23K3L21k32k69L23O5k16K16k4l61K87
$$ 215 181 -370 -74 245 -76 -57 140 -80 -64 103 -120 -97 224 -8 -277 46 111 -105 111 87 -274 13
3432A3K29m86J38M48m15j97M13j10j92L59j82l07L45J66l46NK29k1k03oK22l8
$$ 13 242 -244 -106 342 -73 -270 143 33 -159 200 18 -289 56 222 -124 -119 110 89 -114 -120 102 64
3454F4j79K20o4l32M50J57o59K44N40o30p3N91l72j52N23l90k85O17r1m29L01
$$ 64 -115 105 41 -291 159 316 -343 -99 441 -189 -262 329 -43 -195 328 -62 -347 270 179 -250 51
3475E1O3k22J20m1L5J13j67J4O2j66K62L5m77L50K47n90K29L81n53K82K92p22
$$ 51 114 -108 12 -29 6 119 -48 -34 28 -138 124 159 -318 32 279 -311 -82 299 -254 28 320 -402
3497d02L10N52p35R3N71p01J85N72p65J10Q05q89j13R27o19j92P54o45j77Q16
$$ -402 -92 460 -275 -182 389 -312 -127 445 -320 -210 595 -294 -407 520 -99 -291 463 -182 -359 457
3517D57m36l63O22k58k15L52l00Q6L83n34P1L72m84K73L40p81L36N89r26J91Q04
$$ 457 21 -342 280 22 -193 159 -141 -55 328 -206 -135 237 -247 26 366 -415 -79 510 -416 -225 579
3538E79q11LO33p14O2P86o56k17O48l97o6L69l83J66K84o15K58L68n31L75J30
$$ 579 -232 -229 404 -310 -248 538 -118 -335 313 -84 -150 219 -164 2 286 -329 -71 297 -234 141 271
3559B71p97O32L67j000N83M87j050M37N52j000N21O62j207L08P98q93J87O75r33
$$ 271 -526 106 473 -527 56 543 -507 -70 482 -518 3 665 -542 -234 564 -329 -142 533 -400
3578d00K41P14r20J33Q17p75o1N82n40O5N88o63j6N20l95NL23l67J67J44m56L47
$$ -400 -159 555 -365 -232 585 -190 -251 331 -209 -144 444 -219 -235 285 -110 -105 218 -149 18 162 -294 53
3600E3J88m36K93j2n02O08J47p74N17K94p97M03L74o98L82L59p81K19N52n28N7
$$ 53 241 -195 98 86 -416 192 339 -435 82 376 -421 -18 356 -342 40 399 -382 -163 389 -139 -82
$$ [...]
8191B5
##END NTUPLES=NMR FID
##END=
