##TITLE=1H_LY-856.60
 CCl4, 8 sc, 
 24.7.2019
##JCAMPDX= 6.0         $$ Bruker NMR JCAMP-DX V2.0
##DATA TYPE= NMR FID
##DATA CLASS= NTUPLES
##ORIGIN= UXNMR, Bruker Analytische Messtechnik GmbH
##OWNER= root
$$ XWIN-NMR		Version 3.5
$$ Wed Jul 24 16:08:15 2019 Russian Standard Time (UT+4h)  she@DPX200
##.OBSERVE FREQUENCY= 200.13155
##.OBSERVE NUCLEUS= ^1H
##.DELAY= (6, 6)
##.ACQUISITION MODE= SIMULTANEOUS
##.ACQUISITION SCHEME= undefined
##.AVERAGES= 8
##.DIGITISER RES= 18
##SPECTROMETER/DATA SYSTEM= spect
##.PULSE SEQUENCE= zg30
##.SOLVENT NAME= CDCl3
##.SHIFT REFERENCE= (INTERNAL, CDCl3, 0, 15.7039)
##AUDIT TRAIL= $$ (NUMBER, WHEN, WHO, WHERE, WHAT)
$$ ##TITLE= Audit trail, XWIN-NMR		Version 3.5
$$ ##JCAMPDX= 5.01
$$ ##ORIGIN= Bruker BioSpin GmbH
$$ ##OWNER= she
$$ F:/spectra/data/she/nmr/H-F/1/audita.txt
$$ ##AUDIT TRAIL=  $$ (NUMBER, WHEN, WHO, WHERE, WHAT)
(   1,<2019-07-24 16:06:39.26 +0400>,<she>,<DPX200>,
      <created by zg, POWCHK disabled, PULCHK disabled
       configuration hash MD5:
       00 E9 B6 7A A2 85 ED C7 34 08 36 98 17 FE 4E 26
       data hash MD5: 16K
       07 5D DF 8E 16 0E BA 85 C1 BA 81 C8 FD E2 FB CA>)
$$ ##END=
$$ 
$$ hash MD5
$$ 36 3E DA 12 1A 62 BF 9F BE ED CB 2F 7A A4 F0 2D
##$RELAX= 
##$RELAX= 
##$RELAX= 
##$RELAX= 
##$RELAX= 
##$RELAX= 
$$ Bruker specific parameters
$$ --------------------------
##$DU= <F:/spectra>
##$EXPNO= 1
##$NAME= <H-F>
##$PROCNO= 1
##$TYPE= <nmr>
##$USER= <she>
##$AMP= (0..31)
100 100 100 100 100 100 100 100 100 100 100 100 100 100 100 100 100 100 
100 100 100 100 100 100 100 100 100 100 100 100 100 100 
##$AQSEQ= 0
##$AQ_mod= 1
##$AUNM= <au_zg>
##$AUTOPOS= <>
##$BF1= 200.13
##$BF2= 200.13
##$BF3= 200.13
##$BF4= 200.13
##$BF5= 200.13
##$BF6= 200.13
##$BF7= 200.13
##$BF8= 200.13
##$BYTORDA= 1
##$CFDGTYP= 0
##$CFRGTYP= 5
##$CHEMSTR= <none>
##$CNST= (0..31)
1 1 145 1 1 1 1 1 1 1 1 1 1 1 1 1 1 1 1 1 1 1 1 1 1 1 1 1 1 1 1 1 
##$CPDPRG= <>
##$CPDPRG1= <>
##$CPDPRG2= <>
##$CPDPRG3= <>
##$CPDPRG4= <mlev>
##$CPDPRG5= <mlev>
##$CPDPRG6= <mlev>
##$CPDPRG7= <mlev>
##$CPDPRG8= <mlev>
##$CPDPRGB= <>
##$CPDPRGT= <>
##$D= (0..31)
0 1.2 0 0 0 0 0 0 0 0 0 0.03 0 0 0 0 0 0 0 0 0 0 0 0 0 0 0 0 0 0 0 0 
##$DATE= 1563969998
##$DBL= (0..7)
120 120 120 120 120 120 120 120 
##$DBP= (0..7)
150 150 150 150 150 150 150 150 
##$DBP07= 0
##$DBPNAM0= <>
##$DBPNAM1= <>
##$DBPNAM2= <>
##$DBPNAM3= <>
##$DBPNAM4= <>
##$DBPNAM5= <>
##$DBPNAM6= <>
##$DBPNAM7= <>
##$DBPOAL= (0..7)
0.5 0.5 0.5 0.5 0.5 0.5 0.5 0.5 
##$DBPOFFS= (0..7)
0 0 0 0 0 0 0 0 
##$DE= 6
##$DECBNUC= <off>
##$DECIM= 24
##$DECNUC= <off>
##$DECSTAT= 4
##$DIGMOD= 1
##$DIGTYP= 9
##$DL= (0..7)
0 120 120 120 120 120 120 120 
##$DP= (0..7)
150 150 150 150 150 150 150 150 
##$DP07= 0
##$DPNAME0= <>
##$DPNAME1= <>
##$DPNAME2= <>
##$DPNAME3= <>
##$DPNAME4= <>
##$DPNAME5= <>
##$DPNAME6= <>
##$DPNAME7= <>
##$DPOAL= (0..7)
0.5 0.5 0.5 0.5 0.5 0.5 0.5 0.5 
##$DPOFFS= (0..7)
0 0 0 0 0 0 0 0 
##$DQDMODE= 0
##$DR= 18
##$DS= 0
##$DSLIST= <SSSSSSSSSSSSSSS>
##$DSPFIRM= 0
$$ [...]
##$SUBNAM2= <"">
##$SUBNAM3= <"">
##$SUBNAM4= <"">
##$SUBNAM5= <"">
##$SUBNAM6= <"">
##$SUBNAM7= <"">
##$SUBNAM8= <"">
##$SUBNAM9= <"">
##$SW= 24.9336996594482
##$SWIBOX= (0..15)
0 0 2 0 0 0 0 0 0 0 0 0 0 0 0 0 
##$SW_h= 4990.01996007984
##$TD= 16384
##$TD0= 1
##$TE= 0
##$TE2= 300
##$TE3= 300
##$TEG= 300
##$TL= (0..7)
0 120 120 120 120 120 120 120 
##$TP= (0..7)
150 150 150 150 150 150 150 150 
##$TP07= 0
##$TPNAME0= <>
##$TPNAME1= <>
##$TPNAME2= <>
##$TPNAME3= <>
##$TPNAME4= <>
##$TPNAME5= <>
##$TPNAME6= <>
##$TPNAME7= <>
##$TPOAL= (0..7)
0.5 0.5 0.5 0.5 0.5 0.5 0.5 0.5 
##$TPOFFS= (0..7)
0 0 0 0 0 0 0 0 
##$TUNHIN= 0
##$TUNHOUT= 0
##$TUNXOUT= 0
##$USERA1= <user>
##$USERA2= <user>
##$USERA3= <user>
##$USERA4= <user>
##$USERA5= <user>
##$V9= 5
##$VALIST= <valist>
##$VCLIST= <CCCCCCCCCCCCCCC>
##$VD= 0
##$VDLIST= <DDDDDDDDDDDDDDD>
##$VPLIST= <PPPPPPPPPPPPPPP>
##$VTLIST= <TTTTTTTTTTTTTTT>
##$WBST= 1024
##$WBSW= 4
##$XGAIN= (0..3)
0 0 0 0 
##$XL= 0
##$YL= 0
##$YMAX_a= 18547
##$YMIN_a= -24011
##$ZGOPTNS= <>
##$ZL1= 120
##$ZL2= 120
##$ZL3= 120
##$ZL4= 120
##$ABSF1= 10
##$ABSF2= 0
##$ABSG= 5
##$ABSL= 3
##$ALPHA= 0
##$AQORDER= 0
##$ASSFAC= 0
##$ASSFACI= 0
##$ASSFACX= 0
##$ASSWID= 0
##$AUNMP= <proc_1d>
##$AZFE= 0.1
##$AZFW= 0.1
##$BCFW= 1
##$BC_mod= 2
##$BYTORDP= 1
##$COROFFS= 0
##$CY= 11.3945322036743
##$DATMOD= 1
##$DC= 2
##$DFILT= <>
##$DTYPP= 0
##$F1P= 18.9103706918063
##$F2P= -1.10871071338519
##$FCOR= 0.5
##$FTSIZE= 0
##$FT_mod= 4
##$GAMMA= 1
##$GB= 0.15
##$INTBC= 1
##$INTSCL= 1
##$ISEN= 128
##$LB= 0.24
##$LEV0= 0
##$LPBIN= 0
##$MAXI= 10000
##$MC2= 0
##$MEAN= 0
##$ME_mod= 0
##$MI= 1.114404
##$NCOEF= 0
##$NC_proc= 0
##$NLEV= 6
##$NOISF1= 3.799351
##$NOISF2= 2.8
##$NSP= 1
##$NTH_PI= 0
##$NZP= 0
##$OFFSET= 15.70392
##$PC= 1
##$PHC0= -8941.01
##$PHC1= 16.80096
##$PH_mod= 1
##$PKNL= yes
##$PPARMOD= 0
##$PSCAL= 0
##$PSIGN= 0
##$REVERSE= no
##$SF= 200.130013532006
##$SI= 16384
##$SIGF1= 3
##$SIGF2= 2
##$SINO= 400
##$SIOLD= 16384
##$SREGLST= <1H.CDCl3>
##$SSB= 0
##$STSI= 0
##$STSR= 0
##$SW_p= 3612.71676300578
##$SYMM= 0
##$S_DEV= 0
##$TDeff= 0
##$TDoff= 0
##$TI= <>
##$TILT= no
##$TM1= 0
##$TM2= 0
##$TOPLEV= 0
##$USERP1= <user>
##$USERP2= <user>
##$USERP3= <user>
##$USERP4= <user>
##$USERP5= <user>
##$WDW= 1
##$XDIM= 8192
##$YMAX_p= 0
##$YMIN_p= 0
$$ End of Bruker specific parameters
$$ ---------------------------------
##NTUPLES= NMR FID
##VAR_NAME=  TIME,          FID/REAL,        FID/IMAG
##SYMBOL=    X,             R,               I
##VAR_TYPE=  INDEPENDENT,   DEPENDENT,       DEPENDENT
##VAR_FORM=  AFFN,          ASDF,            ASDF
##VAR_DIM=   8192,          8192,            8192
##UNITS=     SECONDS,       ARBITRARY UNITS, ARBITRARY UNITS
##FACTOR=    0.0002004,     1,               1
##FIRST=     0,             0,               0
##LAST=      1.6414764,     0,               0
##MIN=       0,             -24011,          0
##MAX=       1.6414764,     18547,           0
$$ Real data points
##PAGE= N=1
##DATA TABLE= (X++(R..R)), XYDATA
0@%%%%%%%%%%%%%%%%%%%%%Pj5J6j6J6j6J6j6J8k6L2l2L2l7M5m8N0n8O4p1P9q7
43d7R7j05J18j33J48j66J86k11K43k83L34m03N02o48Q93j368K571j0224j5515
62b4011M1085j2185k3932L4342l781l2998K3204J0029k3652J3868J0546k1303
74h788M766R939j0720N653N629j1781M243N507r022M507N340r224K288O222o206
89a647p30M375j506j086n55J890K092o336J317Q596q344l332J2471q120q404J7195
105G876k408j5026J2203J914j3810J1733N888j4164N597L829j1468Q898O282j1876
119d532O386K398j5255J1115J0792j7471N058J1940j9352J511J9719j4049n970
132g710J7906j0186j1215J6686p15j1240R220J118r091N083K884m553K125P52
$$ plain form
0 0 0 0 0 0 0 0 0 0 0 0 0 0 0 0 0 0 0 0 0 0 0 7 -8 8 -8 8 -8 8 -8 10 -16 16 -16 16 -21 24 -24 26 -32 32 -39 40 -47
43 -47 50 -55 63 -70 78 -88 98 -113 130 -153 181 -222 280 -368 525 -843 1728 -8496 -24011
62 -24011 17074 4889 -19043 15299 11518 -21480 1724 11753 -11899 1969 12515 -8788
74 -8788 -4022 5917 -4803 850 6479 -5302 -1059 4448 -4574 -67 5273 -3951 -1663 4559 -1647
89 -1647 -2377 1998 492 -594 -1149 741 2833 -3503 -2186 6410 -1934 -5266 7205 -915 -9319 7876
105 7876 5468 -9558 2645 4559 -9251 2482 8370 -5794 -197 3632 -7836 1062 7344 -4532
119 -4532 1854 4252 -11003 112 10904 -6567 -1509 10431 -8921 -7410 12309 -1740 -7710
132 -7710 10196 10 -11205 5481 4766 -6474 2746 3864 -5227 -144 2740 -1813 312 1064
146A064j348J170k803P66M213m046k07M546n476o77O619m743j236O841o129l043
162d489Q373m060k867Q666o123o306J0883j843p496R549j089j0356Q070L325q772
177d535N779L879r473K055N446m699J682K833n021J066K227l111K769J156m298
192b245L151P15n493M401L098o325K518L394o346J854M748n320R04M645n340q44
208b485M562k831K29L610m235j102L742k242J83L213l211q04K450k765J031L805
224C150l588r15K717l333Q83M682m215j510M623l439j802N647k185l215M568j542
240E26l773M546O37l828K236Q13k617J589O06j712J401L70j293O23p01j96K232
257A459j148j312J986j362j303L062o36j840K508j409k754L664Q71k814J898l34
$$ plain form
146 1064 -284 886 -1917 -1151 3062 -984 -1191 3355 -2121 -2798 3821 -922 -2158 4683 -1446 -4489
162 -4489 3884 -176 -3043 5623 -500 -6806 4077 2234 -5262 4287 3198 -7158 912 4237 -4535
177 -4535 1244 5123 -4350 -2295 3151 -1548 134 2967 -2054 -988 1239 -1872 897 2053 -2245
192 -2245 906 1621 -3872 529 3627 -2698 -180 3214 -3132 -1278 3470 -1850 -946 3699 -1641 -2485
208 -2485 2077 -754 -525 3085 -1150 -2252 1490 -752 -569 2644 -567 -1371 1079 -1686 -655 3150
224 3150 -438 -1353 1364 -1969 -1086 3596 -619 -2129 2494 -945 -2747 2900 715 -2500 2068 526
240 526 -3247 1299 1936 -1892 344 1157 -1460 129 735 -977 424 794 -499 124 -577 -773 1459
257 1459 311 -1001 985 -377 -1680 1382 746 -1094 1414 5 -2749 915 1786 -1028 870 536
273E36l277L038J893l290J280J382l567Q71K895j917P0J499k611l98K624m35o33
290d0N81j171j1J110o73K69P39j245L6Q32j066N63J279j652l75J612p90o70J085
309D13l96l03R82o08q87O58L30J05J59o79p2L58n27M89R30q70m11K95q59O98J703
330A508j135j194P96m04q3J602n09j227Q18l43q72J587N70j331Mk6o66J263Q31
349A189j352l42N19l92L15O40n14j38J60n80J93P98j98l26p6l36L85O07n19m02
369c69M12M8j02J18k27q1L55J1j98J2P0r2k33J35O39q9p35l8J70J01P61o0j257
392f49J16Q06m02K16P39r28n92P44k00l2J176n50j509N94Q14k80L76j0j142J38
412e75R75k43k06M51l85o62M09N72p5j17j20n04N7R16P6q92m8M91j75Q9L80n71
$$ plain form
273 536 -2741 297 2190 -1100 180 1562 -2005 -1134 1761 -156 -86 1413 -1198 -1596 1028 593 -40
290 -40 541 -630 -641 469 -204 65 804 -441 -405 427 -639 -76 1203 -449 -824 788 -2 -672 413
309 413 17 -286 696 88 -799 -141 189 294 453 -226 -298 60 -467 22 952 82 -329 -34 -893 -195 1508
330 1508 373 -821 -25 -429 -512 1090 581 -646 172 -171 -1043 544 1114 -217 -213 -239 -905 358 1189
349 1189 -163 -505 14 -378 -63 577 63 -75 85 -495 -302 496 298 -28 -104 -440 -55 552 33 -369
369 -369 43 91 -11 107 -120 -201 154 165 -33 -21 49 -43 -276 -141 498 409 -326 -364 -194 -93 668 608 -649
392 -649 -533 273 -129 87 826 -102 -694 50 -150 -182 994 444 -1065 -471 343 63 439 429 -713 -575
412 -575 400 157 -49 402 17 -645 -236 336 261 144 24 -480 -423 493 569 -323 -371 120 -55 34 414 -157
434a57k49O64k17l18O98j43q37L50M77j38J97k82p39M52P62j90k53k43k71M06
454c1L36k21J27r0o00K02M85J2J85k76q68L32R41j83l23l8l96J26O37j20l38J47
476D6j12k27K06L64N5m09l34K73K67M1J04m46m00P70K88p46J80L31n98K63N72
497D88o54k2O02o85k05J045k27p19L53o6j36P47j72q70K95M41k16J21L2k87N3
518h2L6l5K88Rk66o8j99K58O37m15o33M18R9j84N06k17o40N92J94p33M31M93p02
541b13J9M05m34K15M44p14j28P76k04l16K00k55O4N59k70m25K74L3j13J85n7M
563D9J02l41l0M40p8j35J7l17K31O11n02m84M46L5r0M04k53m90L75N1k39M24J26
586C52m20j23j05J58O40k13o22K68M8j99N20j22o39N61L29q00K02N37n90n0N80
$$ plain form
434 -157 -406 258 41 -277 421 278 -559 -209 268 130 327 45 -694 -242 520 330 77 -166 -437 -31
454 -31 305 84 211 121 -479 -277 208 220 405 129 -739 -407 534 351 28 -10 -406 -280 357 237 -101 46
476 46 -66 -293 -87 277 332 -77 -411 -138 129 170 274 -172 -572 198 486 -260 -80 251 -347 -84 488
497 488 -166 -188 414 -271 -476 569 342 -377 -24 -90 -226 521 349 -521 -226 215 -1 120 152 -135 -82
518 -82 -46 -81 207 216 -50 -118 -317 -59 578 163 -470 -52 47 -137 369 152 -488 104 298 -435 -4 489 -213
541 -213 -194 211 -223 -8 436 -278 -406 370 166 -150 50 -205 -141 418 148 -277 -3 30 -83 102 45 49
563 49 151 -190 -220 220 142 7 24 -293 -62 549 47 -437 9 44 -46 358 105 -385 -10 41 -198 226 352
586 352 -68 -191 -296 -138 502 289 -333 -65 -17 -216 304 182 -457 104 433 -367 -165 372 -218 -268 312
607C12k48j02K91n20k38O82K51k29k05m10J45N59j56j41K51l26k57M43J3j85L03
628B33j62m80M17M22l44l34LJ97L70j2l26j74j36J77N04q5l08J72k79m99O17O60
650F33m19l54J9j75J92M24j57k94J0J65J41k97j74M83l6n10N33L08q94O3O09n49
672b79K08J010r11r77R63L34n43M77Q6p53J49M05k33R8K14k50j11n0J44M05l52
693C4n01N07K74l10J18j18m50M23L77k86nn1k20J39n1Q6O12m25q05O37K67n93
715c41O08J96j086M33Q93r30k67R40l16m80M79K9k85O7RP3J9m0L32l46o94Q32
737A25N88j035J09P52q72r5J055n95m99R29k97p53O96K63m37M0p8rL96k44j89
758a50L14k80l6N39m32l19O87k00n12M68R9k20J39k65j0M89l65j11N07n75o8R45
$$ plain form
607 312 64 -38 253 -267 -505 177 428 199 -6 -416 -271 288 132 -9 242 -84 -341 102 115 -70 233
628 233 71 -409 8 430 86 -248 -245 -48 322 310 -16 -190 -326 -149 355 270 -38 134 -145 -644 -27 633
650 633 214 -140 -121 -296 -104 320 163 -131 -121 44 185 -112 -286 197 161 -349 184 492 -402 -339 270 -279
672 -279 -71 939 28 -949 14 348 -195 282 368 -385 -236 169 -64 34 248 -2 -113 -163 -19 386 34
693 34 -467 40 314 4 122 4 -446 -23 354 68 63 12 -208 -69 -120 -34 578 153 -652 -15 252 -341
715 -341 267 463 -623 -190 703 -227 -494 446 130 -350 129 158 -127 -60 -51 22 41 1 333 -13 -707 125
737 125 713 -322 -213 539 -333 -428 627 32 -467 462 165 -588 108 371 -66 -26 -104 -113 283 39 -150
758 -150 164 -116 -152 387 -45 -364 323 123 -389 79 178 -42 97 -168 -178 311 -54 -165 342 -233 -301 644
780F44p56o56J396k34j232J041L85j216O33O02j091K20Q70o81l20N54k6j10p6
799e3j15L68j26l47N03j31n04P50j3r74O79N70r51J86N40o20J56M60o33J57M79
820C81n63R2L25n05L83L38r53K74Q39p75j11P01o18j07P64n42k41O87l91k55M62
841A85l25J58M56q51RR20p00j91R39p61l87J220o10q46J256n2j009P45J92p70
861d22N17J49n91M74K05m69J22j13j07O53k57n04O01j98n25P17o3n30P66j99r10
882f84P76K70p46O02P5p89P12J64j040O72N68r47L81M66j030L73P76r39Q5R04
902F49p59k80O02l94N1O01n24k11M89l33k3L44m02J79M53o86k2O17n16l8O21n21
924a03q7O93o62l70Q45j75k78N16m29l59O63k32l56O98r5n09L31k08k65O99n9
$$ plain form
780 644 -112 -768 628 394 -838 203 588 -628 5 607 -484 -264 606 -75 -395 159 133 23 -53
799 -53 -168 200 74 -273 230 99 -405 345 332 -642 37 607 -344 -158 382 -238 -82 378 -255 -98 381
820 381 -182 -90 235 -270 113 451 -502 -228 611 -164 -275 426 -192 -299 465 -77 -318 369 -22 -277 185
841 185 -140 18 474 -377 -368 552 -148 -339 600 -161 -548 672 62 -784 472 420 -589 156 348 -422
861 -422 95 244 -347 127 332 -137 -15 -128 -235 418 161 -343 258 60 -465 252 189 -341 425 226 -684
882 -684 92 362 -384 218 293 -496 216 380 -660 12 580 -367 14 480 -550 -177 599 -340 -255 649
902 649 -110 -390 212 -182 -131 470 -54 -265 224 -109 -132 212 -190 -11 442 -244 -266 351 -165 -203 418 -103
924 -103 -190 503 -159 -529 316 141 -137 379 -50 -409 254 22 -334 364 269 -240 91 -117 -382 317 258
945B58m80L88r2m26L98j5k02N77j75o66L74J02k75N29m4n59M20N0o52M61M58n25
967i6R8J69n30K39M90m58n5L95k54j33K04j57M6K53k06j27J58kQn6j43K42J07
990A92k80P5J11k44J82J23l73K39L69n07j58M00j93k4M34l24l15M26j14l64M66
1011A21K24l92j8Mk00K92K81k78j49J16n5o0J02J03N2j19j32lL2J56J22k39j40
1034a80K68l5k04J91R3j74J11k2k79K33K69l04j11K54j18q8K08p9j08J91o7k39
1056a90J49K24o7j51m7QQ4N8K6r5p8R8k3j57K15K11l27j38K14n2K8K61k49k85
1080b83L35Q4l13J73K08k62o0J50j20M5K70j67k70J90J55j61l9J49l5j09R1k2
1102Ij36J97J84l35j07L25j03j52K54l6k35K17j5l10K61L06l50j35K12r6jK10
$$ plain form
945 258 -222 166 74 -352 46 31 -171 406 231 -435 -61 41 -234 295 251 -308 112 162 -490 -29 429 -96
967 -96 2 171 -359 -120 370 -88 -143 252 -2 -135 69 -88 -42 211 5 -122 36 34 42 -14 -157 85 192
990 192 -88 -13 98 -146 36 159 -214 25 394 -113 -271 129 -64 -88 346 22 -293 133 19 -345 121
1011 121 345 -47 -65 -61 -261 31 312 34 -115 1 -54 -114 -12 91 143 24 -108 -111 -79 77 199 -40 -180
1034 -180 88 53 -151 40 133 -41 70 48 -231 2 271 -33 -144 110 -8 -96 112 33 -75 116 49 -190
1056 -190 -41 183 116 -35 -82 -74 10 68 94 -1 -79 19 -4 -161 54 265 -62 -200 14 -38 -10 251 2 -283
1080 -283 52 136 -177 -4 204 -58 -118 32 -88 -43 227 60 -210 -20 135 -26 -65 84 49 -60 31 9
1102 9 -127 70 254 -81 -188 137 34 -118 136 100 -135 82 67 -243 18 324 -26 -161 51 -45 -46 164
1124A64j25j79J74L9k13R0K29r3k05N1O0k6J30K7k57j7L08j28j98K54M6k66J12
1147b3O7j70J88J60l50l3K85p0j42J35j1o1N6k7o5P1J00k5j76l2K32j4k13J76
1171E8O4k30J29Q0k78K08K85m15j35M05j56j23K82j61k01K85qk87K32J51k21n7
1193i3N6L4O9Kp2o5j5J59j9k02J90J53l54L8K78k42K3L16l96j40N75k38l44M85
1217A98o6l93M07l4m27M51J67n43J62K86l11J07J80l01J08J74k73N6J72j24Q8
1238H4n1k50K87J11l10J83O6l15K42J09l79K65K41m75O8K85k70J30J98m04Q4K91
1260A90k93N5K05k58J34J00l92K34L11m45J08K58m69K39M03o53J12N88o16r6O70
1281C85m77j42O76n26l60Q24k63m98O42j17m84N62p1m92N26Q2n15K39J31k56K64
$$ plain form
1124 164 39 -140 34 73 -140 -50 179 86 -119 -68 -8 -34 96 123 -134 -151 157 29 -169 85 131 -135 -23
1147 -23 44 -126 62 222 -128 -161 124 54 -88 47 36 -25 31 4 -61 10 110 85 -91 -123 109 95 -118 58
1171 58 122 -108 21 101 -177 31 316 -99 -234 171 15 -108 174 13 -188 97 89 -198 34 185 -36 -93
1193 -93 -37 -3 66 68 -4 -69 -84 75 56 -146 44 197 -157 -119 159 -83 -60 256 -140 -280 295 57 -287 198
1217 198 132 -261 146 112 -315 136 303 -240 -78 208 -103 4 184 -117 -9 165 -108 -52 120 -4 84
1238 84 33 -217 70 181 -129 54 120 -195 47 156 -223 42 283 -192 -124 161 -109 21 219 -185 -101 190
1260 190 -103 -48 157 -101 33 133 -259 -25 286 -159 -51 207 -262 -23 380 -273 -161 427 -189 -285 385
1281 385 -92 -234 442 -84 -444 380 117 -381 261 144 -340 222 151 -341 185 267 -248 -9 122 -134 130
1302A30l5k78K62k2j96K52j32r8L65l09k46N45j56l30M91k23l97O75j53n84O64
1323B25M6o96N18J26n91N57J65q22M70L86o97L26L44o88L18M24p80K63O03p17
1343b20M9N40o30J10O44o65j04P02m88k28O07l38j91N59l85k89N82j59k83L68
1363A81j83j70L64k09j55L60j69j30K26k55N2M08m37q8M93m22o5N81n21j85Q17
1384D93n56m54R37k82o40Q42j71p58R09N7r52O83L43r11M76M11q03L61M65p84
1404c34J82N79n74RM37m94Q6M44m45l3M11l35n1K58k43J04K50l66L1J95k69J88
1426C0J68l75K24K08n55J80M20m43J50L15o10R7N56n62JN96n08j36N35m94q2P42
1448D57m68l33O90l61l70P01k59m55P57j32p08N99J39n99M31K10n67K85K54n44
$$ plain form
1302 130 95 -183 79 57 -139 113 -19 -117 248 -61 -307 238 82 -248 243 20 -377 298 145 -439 225
1323 225 271 -425 93 219 -372 185 350 -472 -2 384 -313 13 357 -331 -13 411 -369 -106 497 -220
1343 -220 -171 369 -261 -151 493 -172 -276 426 -62 -290 317 -21 -212 347 -38 -327 255 96 -187 181
1363 181 -2 -172 192 -17 -172 188 19 -111 115 -140 -88 320 -117 -205 288 -134 -199 382 -139 -324 493
1384 493 -63 -517 420 138 -502 340 169 -589 320 377 -575 108 451 -460 16 427 -376 -15 450 -334
1404 -334 -152 427 -147 -138 299 -195 -109 335 -110 -143 268 -67 -118 140 -103 1 251 -115 -84 111 -158 30
1426 30 198 -177 47 255 -300 -120 300 -143 7 322 -288 -191 365 -197 -196 400 -108 -244 291 -203 -285 457
1448 457 -11 -344 346 -15 -385 316 57 -398 359 227 -481 118 257 -342 89 299 -268 17 271 -273
1468b73J42L87k67NJ36k21M2J12j04O3P8o1M3j69j24L24pj82K64j32k92L11n3
1491B2k87N18N2n79K48J49m62L87L24n74J48L71n94j1N90l04j08M19l84k60N01
1512A66j19k67M22pl21J41m8j61K98O6k03Q4qj56J07%j9K00n2k04M9j4k1J70m5
1537E8p1J46r8j97J26K6J1J91j33j92J55m3j43K67O5j84J22j24k74K93J88k38
1559d9J32M9l24J04J79k56J76K85l39j17K24j54%K97j73j13K21j56k00K42P0q4
1581A4Q2m5j92J10Q1p3L9R0n3o7o8N5Q3j5J4jq3L4O4j69N0K05j12r0J23j25q1
1608a30K51o8j62K13Nk78J12J22j31J36N7k41M1J48j27pJ48m8m2J8q7RJ27k8m4
1633fK8m3K7Qp1O5J02r9o5N3l1L4R0j04k5J09o2o3R7mk8K7o6m2J32Nq7J7mQN8
$$ plain form
1468 -273 -131 256 -11 -6 130 -91 -49 63 -41 22 100 39 82 -87 -211 113 106 -76 188 56 -236 75 22
1491 22 -265 253 305 -274 -26 123 -339 48 372 -202 -54 317 -277 -288 302 -2 -110 309 -75 -335 166
1512 166 47 -220 202 195 -126 15 -33 -194 104 170 -33 51 43 -113 -6 -6 -25 175 123 -81 -32 -46 -67 103 58
1537 58 -13 133 35 -162 -36 -10 1 192 59 -133 22 -21 -164 103 168 -16 106 -18 -292 1 189 -49
1559 -49 83 132 -192 -88 91 -165 11 296 -43 -160 64 -90 -90 207 34 -79 142 -14 -214 28 98 14
1581 14 96 51 -141 -31 50 -23 16 106 53 -14 -82 -27 56 41 55 54 -29 5 69 -100 -50 155 43 -47 76 -49 -130
1608 -130 121 53 -109 104 109 -169 -57 65 -66 70 127 -114 -73 75 -52 -59 89 41 -1 17 -70 -61 66 38 -6
1633 -6 22 -21 6 14 -57 8 110 11 -54 -1 -32 2 92 -12 -37 72 10 -53 44 40 12 39 -27 -69 63 68 -19 -2 -6 2 60
1664F0o2m2R0k1o3N5m0L6Q0j28o3J52k9r8J14k5q9J31k3j56J33R2j53PJ15j30
1690e7N3Q6j28k6J53o0p6P7K1m4J5m1OP9j8l6k5j9P8J5q4M3O4j12nO8n0P2P3j70
1720d8m9J60m8m7J00m0o1R5p6p2J56K0j18Qlk8J07j7p0N9rp8L8RkR2q3j07J20
1749HL0q4Q1oj01J01Rj31J06J05j57j0Q1p6O7Q3j39j8J06m8k0N6j4k8L2q2K4P9
1777E4j0j5n1m1R1K9r2O5L8j21L6N4j00J01J02k16j9J71r1lJ24j23o8J51q8p3
1803i5J80kj47L5oj3J15j1q9K9pk9O8j5J0P1j21o7J11J4rP7j19p5J53k1r1J35
1831H1Oj28M1j6m1J62Lj60L2L5p2J13J1r7N6Pj40J02R0p2K2m4r7J13O8r6L8L1
1859D8j29O9N3j21J21Q3k31K1J47r3M7J06j86oJ33r8j7J40o4o0O0r6M8J38q3m5
$$ plain form
1664 60 -2 -44 46 25 -38 17 -23 13 93 -35 -98 54 25 -73 41 16 -73 58 35 -121 12 104 -49 -42 73 -57
1690 -57 -4 82 -46 -72 81 21 -55 22 43 -1 14 -27 -21 58 40 4 -21 -40 38 53 -31 12 76 -36 -41 27 -23 49 122 -48
1720 -48 -97 63 15 -32 68 28 -33 62 -14 -86 70 90 -28 -20 -23 -51 56 39 -31 28 19 -59 -21 -12 -14 78 -5 -112 8
1749 8 38 -46 35 29 -72 29 38 -93 13 118 -39 -49 32 -44 23 106 -33 -51 55 7 -13 43 29 1 33 -49 -25 54
1777 54 44 29 -22 -63 28 57 -35 30 68 -53 -17 37 -63 38 140 -76 -95 76 -15 -18 106 -17 -85 66 -22 -95
1803 -95 85 83 -64 -29 -35 -48 67 56 -33 -4 -11 -40 28 13 23 94 -27 -94 17 31 22 99 -20 -95 58 37 -54 81
1831 81 87 -41 0 -16 -57 105 108 -52 -20 15 -57 56 67 -30 26 33 -107 -5 85 13 35 -9 -106 7 75 -21 17 48
1859 48 -81 -12 41 -80 41 124 -107 -86 61 -32 15 121 -65 -71 62 -36 -53 87 23 -37 23 -73 -25 113 30 -15
1885a5M7j16O6J14j35L9J40j85o3K05r1k5J79j80j30K46m8j24J77n0j47J28m3
1908a1q8K15k3j97Q7J6o7J57j4j64J22k0j25J33N3r6P6o8j36J86L4j31J23l8j61
1933a37J90J1j88K28N2l21J37J18k06J87J00l17O8K09k38P4K13k19NJ19j98N9
1955e4K44j93m0J10j66O0K05k01j2J99k34m0K41j46J2J81k27q3K44q9o5J85j67
1978c6p6K01j61k9K64j50j30J73j38j3K67j59j42K27j25j38K99r7j09K45k06j91
2000b24L55m5j95K60j19k77L49J4k83K94K6l69K23J22k79K42R1l69J33J95k46
2021a02J19J41k47O6J29k34J25J70k19K9O1j87J70J47k68J08R2k48J14J62k30
2042a02J45J23l74J12K50k51J22J67l55M5K86l12Q1L45l31r1K82k80K7M07k85
$$ plain form
1885 -15 32 -84 -18 96 -39 0 140 -45 -108 97 6 -19 160 -20 -150 96 48 -76 101 51 -96 32 -11
1908 -11 -99 116 93 -104 -17 -1 -68 89 75 -89 33 13 -112 21 74 -22 54 -14 -150 36 70 -61 62 24 -137
1933 -137 53 64 -124 104 156 -165 -28 90 -116 71 171 -146 -78 131 -107 -33 180 -39 -34 85 -113 -54
1955 -54 190 -3 -43 67 -99 -39 166 -35 -47 152 -82 -122 119 -27 -15 166 -61 -144 100 11 -54 131 -36
1978 -36 -112 89 -72 -101 163 13 -117 56 -82 -95 172 13 -129 98 -27 -165 134 37 -72 173 -33 -224
2000 -224 131 86 -109 151 32 -245 104 118 -165 129 155 -214 9 131 -148 94 185 -184 -51 144 -102
2021 -102 17 158 -89 -23 106 -128 -3 167 -52 -23 38 -149 21 168 -100 8 100 -148 -34 128 -102
2042 -102 43 166 -208 -96 154 -97 25 192 -163 -118 168 -144 -63 282 -49 -140 142 -138 -111 296 11
2063A1j79L28k19j06L84j74j63K97j89k13L79n1k22K55j25k11L23k3k49K50l4
2084F9k22K21kj66K10m5k32K02J9j23J95r6k03K46n3j71K81m6k42K46p6k39L67
2107A40L6l53K52ml36L24J39l75K73J15m99J92L11l24J55K18m70P1L29l04O2L27
2129B79l21r1K54k13J6L11k22j27K08j45k0K19j80k5J90k05j4K13j65J0J60k47
2151a15K1K76k28m9K40k27k8L03k44p7L39k59j53L48j53j35L59k27k40L78r5k30
2173a96L73o8l08K89n8k78L80O0l57J87M7k80K62J24k94J53Q3k94J44J71k01J24
2195F3N5k94J46J69k18J02Q7k09R2Q7j99J47J18k47P3J11k02J50J30k87J03J52
2217A29k53R1J88k58P0J91l18O7K98k68j1K28k58k6L10k17q0L05k06j45K74j07
$$ plain form
2063 11 -168 160 -59 -165 219 45 -118 179 -10 -223 156 105 -117 138 13 -198 125 102 -147 103 69
2084 69 -153 68 66 -100 110 65 -167 35 54 -69 126 30 -173 73 20 -151 130 84 -158 88 12 -227 140
2107 140 176 -177 75 71 -265 59 198 -177 96 211 -288 -96 215 -109 46 264 -206 -135 194 -110 -48 279
2129 279 -42 -133 121 -92 -76 235 13 -114 94 -51 -71 148 -32 -57 133 -72 -86 127 -38 -28 132 -115
2151 -115 -94 182 -46 -95 145 -82 -110 193 -51 -128 211 -48 -201 147 -6 -141 218 -9 -249 129 34 -196
2173 -196 177 109 -199 90 32 -246 134 194 -163 24 71 -209 53 177 -117 36 119 -175 -31 140 -61 63
2195 63 118 -176 -30 139 -79 23 110 -99 -7 80 -119 28 146 -101 -28 83 -119 31 161 -126 -23 129
2217 129 -124 -33 155 -103 -33 158 -160 -93 205 -63 -74 154 -104 -130 180 -37 -117 188 -18 -163 111 4
2239Dj11K77j41k12K73l5j56K11n0j74J87l1j59K22J3j92J04j6j16J84j0j54J36
2262E4j1j55J51J2j34J67l4k11J79O8j72J46kk08J52Q2k05J46R8k44O2J14j55
2285a00J26J14k42M0J46j62O8J26j64LJ21j56J6J79j28m2J13j30RJ80j32n0J56
2308I1j10o2J39o5l4J55j10r8J59n0o9J26l7r4J07o7p4J44%p2N2o9n4J64k9r0
2334d7J12n8r6J18%j14J41k1j60J37O2j38O8J3j31J25Q3j44K4P2j18M5Q4o1K8
2359B4M6j47NJ22m2J6L7j07J6P1o4J2Q7p1JK9p7J9R5r2K7O2q2l1N7m6K9J24r9
2388B1r3P0j4pJ00m7o1M5m7m7J14Kn7L9l6l7R4j7q6O3Ol6O7k9r4P4M3o4O5K8q6
2419b7qJ1j3Q8L3r2k8K7j3M4K7n4K5Oo3J8M2j8J7Nm5L0J8q0L0O6k7J3or7L3P0
$$ plain form
2239 4 -107 170 29 -183 90 55 -101 110 60 -114 73 42 -117 105 118 -74 30 14 -102 82 72 -82 54
2262 54 43 -112 39 51 -83 84 50 -161 18 86 -86 60 58 -150 2 84 -121 25 123 -121 -59 55 -100
2285 -100 26 140 -102 -62 84 -78 -10 116 -48 -45 76 -80 -64 115 -13 -55 58 -72 -63 117 -15 -65 91
2308 91 -19 -81 58 -7 -41 114 4 -94 65 15 -54 72 35 -59 48 -19 -93 51 51 -21 31 -38 -92 72 43 -47
2334 -47 65 7 -89 29 29 -85 56 35 -125 12 74 -64 4 17 -114 11 94 -50 -26 46 -72 -27 57 -4 24
2359 24 70 -77 -72 50 8 24 61 -46 -30 41 -23 -11 76 5 6 35 -42 -23 72 -20 7 69 -13 -44 13 -33 -4 120 21
2388 21 -72 -2 -16 -23 77 30 -31 14 -33 -80 34 36 -21 18 -18 -55 39 22 -64 -1 5 -31 36 7 -87 -13 30 -34 31 59 -27
2419 -27 -35 -24 -37 51 84 -8 -36 -9 -22 22 49 -5 20 26 -37 -19 23 5 22 27 -18 12 30 -50 -20 46 19 32 26 -71 -38 32
2451C2lj5L6o2l8O2k8K2N5n0p5L9L1j2K0k4j8M9j8j3moPL2k0lK7k4m2L8K8pL1
2484D7n3n4P2K7k6K5k5j7J4%lL8j8k6nRkK3k5k3N0Nm4QQj6N0Lo7J8J9l6J3J6k1
2519a6J1Om5L4L3k1k3LJ2J8j2qNOOPm3J6M3m0k8M9Kl0L5j3m1N0K4o7K2N5m9oK2
2554A7k0lN6l8l6N3ll4J4Oj5J6j2j7L7Mk1k9JL7J8k9j8nJ6J3Ok5J8ll5J0K9pj4
2589a3J1l5K8M2l9j1J3JJ3Pm2J4L0l1jN0m2j9M6m5LR1k9r5N1L8m2L6Op8K2N6l4
2622BjL8l8m0L9L1j1J2m3j9J8M2J9n4k1J9o%M8m2l5M8j6k0N3J8p9NM9k4K4J7q1
2655d8OQ8m4j5N1n1k6P9l4j2L8l4m1N8L6k4j2l6LM2K9l5j4j9J0L7j0j3Pl6k8N5
2687GK7lkn4k1N9L4l3j6k3nL7Oj9Lpj8K9J1j5K9m0m0P1K9o2MJ1l0L0O2q3j2O8
$$ plain form
2451 32 29 14 50 -12 -50 12 -16 6 61 11 -64 -25 6 -6 14 -10 -28 21 3 -10 -14 -20 -13 19 -1 -4 23 -1 -43 -5 23 16 47
2484 47 -6 -60 12 39 13 38 13 -4 10 10 7 45 27 1 -4 5 3 26 1 -22 28 33 -11 -3 5 -11 39 42 -25 -7 12 -24 -11 5 -16
2519 -16 -5 1 -44 -10 23 2 -21 -18 -6 12 0 -8 -3 3 9 16 -27 -11 32 -8 -36 13 15 -15 20 7 -34 16 40 -27 -5 50 1 -5 17
2554 17 -3 -6 50 12 -24 29 26 -8 6 12 -3 13 1 -16 21 25 4 -25 -24 13 31 2 -16 -21 -5 8 14 -11 7 4 -31 -21 8 1 -13
2589 -13 -2 -37 -9 33 -6 -17 -4 -3 10 17 -25 -11 19 -12 -13 37 -5 -24 22 -23 -20 71 42 -53 -2 36 -6 30 36 -42 -20 36 2
2622 2 1 39 1 -39 0 31 20 32 -11 -30 -12 30 49 -5 -26 -7 -13 -13 35 -7 -42 6 -10 -30 23 41 -38 -33 16 -8 16 33 -48
2655 -48 -42 46 2 -13 38 -13 -39 40 6 -6 32 -2 -43 15 51 27 15 -21 -18 24 53 18 4 -15 -5 32 22 9 16 -20 -48 7
2687 7 34 31 29 -25 -46 13 47 14 -2 -25 -30 7 13 -6 -3 -10 -28 1 12 -3 26 -14 -54 17 46 -16 -12 -1 -31 -1 61 -22 -34 34
2721C4n2JO4k1l7K2qj6P4j8q3J6M1MK2ro2K2J6mJ6Ml2orJ7M8j8m0mlK2M4k4l3
2756a2J9%k8L8Nm5L3j4l9N9L6p9JM5l5J5L4o6PO2k8l4M3j7lL7m0rM6k9l2N8Lk5
2790FK6l6m0R4Mn9L0j3l4M8J0l5K6Jn1J6L1kMk7l0L0L3l2L3qm6J8Qk9M4Qn6L1
2824Crj2N6op7M2K8o0M6L5o9L1K9r0K4J00q0j6O0n7j8Q7l9j4M9k3n4M6%oN1n2
2856Ek6O5k7l6N7j7l9L6k7k4P4Qn7PJ1m3N6j1k7N5l7l4M5k5lN6m8p9J00%m6O7
2888C6j2p8O2No5R2Nr1L8K2o5R0K6j30M7O2o8K6P0r2j2O5n1J9P3n1m5L6j9RL9
2919D3l4j0L4m9OL5m5K9N9p4nM2m8%M5k4j0M5q7pR4k8qM3r6qQ5l8j4Q0o2n3P8
2952A8qm4Q7l0p8P7K0n7J4Jn6R9Lo6L8jp6P8M5n3L6rj09M4Q0k5kJ0p7K2L1l3L4
$$ plain form
2721 34 -18 -17 47 26 -11 11 3 -13 61 43 -40 -24 17 21 43 34 -28 -6 10 6 22 26 -6 -12 -21 -4 44 26 -14 -18 -21 1 45 21 -12
2756 -12 7 7 -21 17 22 -23 10 -4 -43 16 52 -27 -26 19 -16 -1 33 -33 -26 36 8 -26 17 0 -3 34 -6 -15 31 2 -30 28 31 6
2790 6 32 -4 -44 50 54 -5 25 12 -22 26 36 1 27 28 -23 -7 24 22 26 -1 -31 -1 32 0 33 25 -21 -3 5 -24 20 28 -28 3
2824 3 -6 -18 38 32 -45 -3 25 -35 11 46 -23 8 37 -53 -29 71 -9 -25 35 -22 -40 47 8 -6 43 20 -34 12 12 6 57 5
2856 5 -21 44 17 -19 38 21 -18 18 -9 -33 41 49 -8 -1 10 -33 23 12 -15 40 3 -31 14 -11 -14 42 -6 -85 15 15 -31 36
2888 36 24 -54 8 13 -52 40 45 -46 -8 14 -51 39 65 -65 -18 44 -24 2 72 -20 -32 33 -18 1 74 23 -22 14 -5 4 43
2919 43 9 -1 33 -16 -10 25 -20 9 68 -6 -11 31 -17 -17 28 4 -6 39 -48 -55 39 11 3 46 -50 -58 27 -11 -25 55 -7 -60 18
2952 18 10 -34 53 23 -55 22 42 -15 -1 0 -56 43 46 -20 18 17 -59 19 64 11 47 38 -71 -27 53 28 26 36 -41 -19 12 -21 13
2985A3J9m2L0jo1M7L0p6O4L9r7PL3n5N8O8q7j6K5o6M7P8m6rK4q7L4Q4n0j4N7r2
3017d2LR9n1o6Q7j7j1N0l1n3N0k2j2Q6k7o3K9l7J0R9l1n5Pj7k6R1j6m6M7k7m9
3048d1O2j2k1M4k4l8P1k1p0O1J1m1N2j2r3N4N2n2M3J1p5PL6k3M7J9r1PN6m2N1
3079B8J3p6QO6n3J7L5n9J6N0m2lO4p3qM5pmK3m8jM5j4j0L2m7%L6l9rN2l4j8N0
3113C5l3j6M6l9j7P5m3m1M6j6k8O1j2o5N0Pm5M9On1L8J7n4L4L6m9oRqJ2J3k4K6
3146A3Nl4L0jk5M6no2M8L4p4M4K0m7K9K4q2M3M2m0j3L0n7K7L3m6QL8m8JM3m2J4
3179dM0n5j0O0l4j5J7k0MM6n1j2N2l2jM7k4m6N5l0k2N6Ln4L2mj6M9j6l8L0J2o
3212A3J4k0j9L8k0j9M6Jn3K5mk5P8k7o4M1L0l9L6%o8L6L2n7K9L0o6J8L3l1OL1
$$ plain form
2985 13 32 -10 20 19 -42 5 35 -41 23 62 -35 -28 5 -50 8 76 -11 -27 -2 -68 -21 57 11 2 26 -61 -27 57 7 -7 50 -42
3017 -42 -39 60 9 -57 30 13 2 52 21 -32 18 -4 -16 70 43 -20 9 -28 -18 81 50 -5 2 -15 -41 50 34 -12 35 8 -41
3048 -41 21 9 -12 32 8 -30 41 20 -50 11 22 -19 33 21 -72 -18 34 -18 25 36 -39 -32 4 -19 28 47 -44 -37 19 -23 28
3079 28 41 -35 -27 39 -14 3 38 -21 -5 45 3 0 64 -9 -17 28 21 17 40 -8 -9 36 22 12 44 -3 -3 33 -6 -15 37 3 -15 35
3113 35 2 -14 32 -7 -24 51 8 -33 13 -3 -31 30 18 -47 3 10 -35 14 20 -31 7 24 -30 4 40 -9 -15 -6 -14 -2 11 -13 13
3146 13 18 -16 14 13 -12 34 29 -33 15 49 -25 19 39 -8 21 45 -37 6 48 8 -5 25 -32 -5 28 -18 -10 28 -20 -19 24 -18 -4
3179 -4 36 -19 -29 31 -3 -18 -1 -21 -17 29 -22 -34 18 -14 -15 32 8 -38 17 -13 -35 21 24 -30 2 -2 -18 31 15 -23 7 19 13
3212 13 27 7 -12 26 6 -13 33 34 -19 6 2 -23 55 28 -36 5 35 -4 32 32 -36 0 32 -25 4 34 -32 -14 19 -12 -6 25
3244B5n3oM5j4jJ2m0K4J9k3J1J9m2K2K9n2L4J9o5J6N4m8J9L7o2jN8k7l2O6m2j6
3276a5M0j6j1L1l0j3M1j7j6L4l1k8P3l3k3M3j6k6M4k6k6M4k9k4M9Jm2L6pm8O0
3307A9Mn0L1Pl2K7jk5L4mk6J1J0j5J7J5m2L3Om6L2Ok5L4K4n9J4M3n3J6K3l2KL6
3341C4l2jM0l0j8K6nOjj9jJ2j3J1J1k0mRk9J1M4m4rL1k8PM4m6nM4l4k5M0rj4M3
3377B6l0k5L7J3l5K5Mk7L0j4k0L5kj7J1lj6K7lk6K8Ml2K6mj8K8km4L5J0l4J9K
3411Hj8K5qk1K8rk1PokK4Jl3K1J0l1K5K2m4J8K1m0QM1l0j6K9k6J5L2l5lOj2QK7
3447B1k0MJ4k1KK2j9KK2k7LK7l5j2K6mj1L3l1OK1l8QK5j1k9K2Ok3K8rk8K0J0j1
3482gJ3j8j9L9j9PJ7k1k2L1Kk6M0j8l9L9J9k8J4J5l7L0J0m7L5J6l6PJ4j7J9J3
$$ plain form
3244 25 -28 -34 11 -3 -4 8 -32 -8 11 -12 -1 18 -24 -2 27 -25 9 28 -37 -21 33 -15 4 41 -21 -22 36 9 -23 43 1 -15
3276 -15 25 9 -2 29 -1 -14 27 10 -6 28 -3 -31 42 9 -14 29 13 -13 31 5 -21 23 -6 -30 19 20 -22 14 7 -41 19
3307 19 23 -27 4 11 -21 6 5 -20 14 10 -16 -5 5 -10 7 22 -20 13 19 -27 5 11 -14 20 44 -15 -1 42 -11 5 28 -4 -2 34
3341 34 2 1 41 11 -7 19 14 20 19 0 -1 11 -2 9 20 0 -4 5 -24 -13 31 -13 -22 9 -19 -12 32 -14 -19 25 -9 -34 6 -3 -17 26
3377 26 -4 -29 8 21 -14 11 15 -12 18 4 -16 19 17 0 11 8 -8 19 16 -10 18 22 -10 16 12 -6 22 20 -24 11 21 -13 6 8
3411 8 -10 15 7 -14 14 5 -16 -9 -15 -17 7 8 -25 -4 6 -25 0 22 -22 -4 17 -23 -15 26 -4 -20 9 -17 -2 30 -5 -8 -2 -14 -6 21
3447 21 1 5 19 -2 0 22 3 5 27 0 3 30 -5 -17 9 5 -6 27 -4 2 23 -15 -7 18 7 -22 0 6 -17 11 2 -26 -6 4 -7
3482 -7 6 -12 -31 8 -11 -4 13 -8 -30 1 3 -23 17 -1 -40 -1 18 -10 4 19 -18 12 22 -25 10 26 -10 -3 11 -6 13 26
3514B6m2K9Nj5J1Mk3K6mk6K2Mj7J4J3l8K1J1k4KL2m3OJ7k0j0M4l3j5J3j4kL5m
3548Ej3J5j8j4K4%LNok6L3%k8J8j0mK8nk0L0lj4J7nj5K8k2k3L8K4l7kJ9l3K3M
3584A6j9J8j0lQlj8L0jl5K9J3o1M2J3l2K4Pn0jM3l6J0L5k7k7K5onL0j4k7J9J2
3618aj2L8j6j8J5krOJ3k4K7Lj4Pkk2J8JKQk2PJ3roL5k1k6L3qj9K4ok7J7J6k1%
3656bMj3J5Rk1Prk4L8J2l6K7Om3J8L1l1jK7l2mK4lj2J6jk0J9NqJ0jNM%j2PJ3j6
3695HjJ3j5RnJ2qj0oMJRRl0J5J8l3QJ6pk7K4nk4L3Pl8LL1l1J1J8k1KLj1J1J5j
3734Gj0Rk9J2K1j9PJ6k2j3QJ3J0oLj6J6QJKj4kJ8qONqMoj9LK7j2j0J2j7jJ0mk
3774@J1j4pJ8j6qJ3lj8J8rlL4k3qjK1pjJ4j4mJ1j4rL1j3qJ1j4J6PLk2J0k%J4P
$$ plain form
3514 26 -16 13 18 3 14 18 -5 21 17 -9 13 17 0 14 27 -11 10 21 -3 -1 31 -12 -6 11 -9 -19 25 -8 -23 -10 -24 -26 9 5
3548 5 -8 7 -11 -25 -1 -1 2 7 1 -25 8 8 -20 -2 -12 -16 12 7 -13 17 14 0 17 12 -3 25 3 -20 18 42 5 3 22 -11 12 16
3584 16 -3 15 5 2 10 7 -11 19 18 -17 12 25 -36 6 19 -13 11 18 -32 -33 10 -26 -16 19 -8 -35 -10 -16 -21 9 -5 -32 -13 -1
3618 -1 -13 25 9 -9 6 4 -5 1 14 -10 17 20 6 13 11 -11 7 8 10 18 -4 3 16 7 1 36 15 -11 22 14 -5 19 13 -14 3 19 -2 -2
3656 -2 2 -11 4 13 -8 -1 -10 -34 4 16 -20 7 13 -30 -12 19 -12 -13 14 -18 -22 2 -1 -13 3 2 -18 1 6 -2 8 7 12 16 16 4 11 24 8
3695 8 7 20 5 14 9 21 13 3 -3 1 2 11 20 -10 5 23 -10 -2 14 7 -20 4 -1 -25 8 15 -23 -20 11 -20 -9 9 -12 -10 -7 -18 -7 8 7
3734 7 -3 6 -23 -11 10 -9 -2 14 -8 -21 -13 0 10 4 7 -9 7 15 16 18 4 2 20 12 18 23 15 19 13 -6 -3 24 12 2 14 -3 -4 6 2 0
3774 0 11 -3 -10 8 -8 -16 -3 -6 -24 -6 -15 -18 16 -7 -15 -16 5 -2 -3 11 -3 -7 4 -10 -19 12 -1 -9 2 -12 4 11 14 -8 2 0 0 14 21
3813B1j4Pj3j6J4L2jk0K%Qk8J9J0j9J2Mj6rL1j9j3J4Mj9ROk2K1j3kRNj0lLJ0m
3851@OrjNj3Q%llJ3k4OK1qK6k2j4%J2MJ2KRj7k0J3J1J2j1k0NqJ2K2j7J2jj7j5
3890a2J7NqJ7k5jLOj5J6ooK4l3nK2j2jJ3Lk2J4j2OJ4Lj3nJ3j4J0MKNj4NRlmKO
3931HP%%j3PPj3J7Kk9NJ2PpJ2k4lNNJ1Lj0mLqJ6j2j3mJ2j7J3Pk3JK6j7lJ3j3j0
3972b4RJ1j0OjnPOj0J8lqRJ0j1Mj4J1NrJ1Nk8J0J5n%MmnK3qj3J4j9j5J8J0jLj2
4013Dk2K2J4qj0j5nQJ8pRj4lkpJ5KqqJ5LmJj2pK4Ol0J7mKOJ3k0%J9jkL%plMJ7
4057B3%j2oQjmJ8l9J9K0k6j5L5j6k0L4k1jK6k5k1J5Pj2PkpRJkORj0jQqqNO%rJ3
4099Cnj1mK8j5mK5k1j1M1j7j3L1j2k6J2K3k9J6Oj5OK2j4j9J5Rk4J2mJKoJ2J0k3
$$ plain form
3813 21 7 14 1 -15 -1 31 30 10 12 12 20 -8 11 21 2 14 18 2 -7 24 5 -8 6 10 -9 0 6 -16 5 -8 -10 -1 4 -6 -9 -6 4 0
3851 0 6 -3 -4 1 -12 -4 -4 -7 -10 3 -21 -15 6 -2 24 2 -12 -12 0 4 16 18 27 10 -10 3 14 26 15 -5 0 -8 4 26 9 21 20 3 -12
3890 -12 5 10 2 19 -6 -7 -4 2 -13 3 -3 -9 15 -18 -23 -1 -13 -14 -1 2 -20 -6 -18 -12 2 5 -8 -13 0 -14 -4 0 2 7 -7 -2 7 4 0 2 8
3931 8 15 15 15 2 9 16 3 20 22 -7 -2 10 17 10 22 -2 -5 0 5 16 19 9 5 8 0 16 4 -9 -13 -1 -18 -5 2 -21 -20 6 -11 -14 -1 -14 -24
3972 -24 -15 -4 -14 -8 -9 -14 -7 -1 -11 7 4 -4 5 15 4 8 -6 5 10 1 12 17 -11 -1 14 9 9 13 9 4 27 19 6 20 1 -14 4 14 13 16 4
4013 4 -18 4 18 10 0 -15 -20 -12 6 -1 8 -6 -9 -11 -18 -3 -1 -9 -17 -2 1 -3 -2 -14 -21 3 9 -21 -4 -8 -6 0 13 -7 -7 12 11 9 12 12 5 2 6 23
4057 23 23 11 5 13 12 8 26 -13 6 26 0 -15 20 4 -16 18 -3 -4 22 -3 -24 -9 -2 -14 -7 -9 -16 -7 -6 -8 -2 7 -3 -4 4 -4 -12 -7 -1 -1 -10 3
4099 3 -2 -13 -17 11 -4 -8 17 -4 -15 26 9 -4 27 15 -11 1 24 -5 11 17 2 8 30 16 -3 12 21 -3 9 5 6 8 2 14 24 1
4135AOQj4Rok7K3Oj2mJ0k4RK0oj1J4%j8K5j6LRk0j2K0RJj0j0NK6j2JJ9l7K4J0
4173A9k6KL4k6j7M2j5k4L5pk5L1J0m3J0K0k4J3J2l4jL1rqNnj6J8j1Ojk3J7jnK7
4209A1j0k6J9Ql3K8%j8LK6k6J2J1pj6K3kj6K9j2j0J3omO%MjpKJ2j9NJ3j5%K4l1
4247a0J2K1nk2Pjj6J5Nk3J6J4l6NK5j2j1Qj4kK0Oj2%npONJ0j2rJ8nj3L0jk5J8
4285@QlqJ7j6POk3MM9k8j9J5lkJ7j0k1J5Kj2J0PJolOKpKnk0J4J1k3LK6qqRj9n
4327a8K5k1nK0Kj3LNjj2Oj7J6J1rQjj0J5Jj1PRk0RLKK2ml9K2PnKlk7J4J9pKLj0
4369@kKrJ7lprQkKjj4K6qj1%LqJ0MkJJ0l2nL8j3j3J4j4JK0j6j2J1PRPj2PnnMJ2
4413A0J0j2%qPK0j0j6JJ0rJ4j2jJ3nj4MMj0K1mj4Qkk3OMRJmj6K1j1rJ8orJ0or
$$ plain form
4135 1 7 15 1 10 4 -23 0 6 -6 -10 0 -24 -15 5 -1 -12 2 2 -16 9 -7 -4 5 -15 -27 -7 2 3 -7 -17 -12 14 2 3 22 -15 9 19
4173 19 -7 -5 29 3 -14 28 13 -11 24 17 -8 23 33 -10 0 20 -4 9 21 -13 -14 17 8 0 5 0 -16 2 -9 -3 -4 -27 -10 -11 -16 11
4209 11 1 -25 -6 2 -31 -3 -3 -21 -18 8 -18 -6 5 -2 -18 5 3 -13 16 4 -6 7 1 -3 3 3 7 6 -1 1 13 -6 -1 12 -3 -3 21 -10
4247 -10 2 23 18 -4 3 2 -14 1 6 -17 -1 13 -23 -18 7 -5 -16 -8 -22 -24 -4 2 -10 -10 -15 -22 -16 -11 -1 -13 -22 -4 -9 -22 8 7 -18 0
4285 0 8 5 -3 14 -2 5 11 -12 -8 41 13 -6 9 6 4 21 11 -10 5 7 -5 5 12 13 7 4 10 12 5 7 2 -18 -4 7 -16 -13 13 5 -3 6 -13 -18
4327 -18 7 -14 -19 1 3 -10 -7 -2 -3 -15 -9 -26 -10 1 -8 0 -1 -11 4 5 -6 1 10 -10 -1 2 4 26 22 -17 5 12 7 9 6 -21 -7 12 5 7 10 0
4369 0 -2 0 -9 8 5 -2 -11 -3 -5 -3 -4 -18 8 0 -11 -11 -8 -16 -6 -2 -4 -3 7 -25 -30 8 -5 -18 -4 -18 -17 3 -13 -25 -14 -7 2 9 -3 4 -1 -6 -2 10
4413 10 20 8 8 0 7 27 17 1 2 12 3 17 5 4 17 12 -2 2 6 -4 17 13 -1 7 5 -18 -12 -8 1 2 -2 -18 3 -8 -17 1 -5 -14 -4 -10 -19
4454a9J7J3j6oJ0kqNqnL9j8qPmJ0j2J4mNMj4MJ3%oj8LRMmPqNMrj2J3Jj7J7nj2
4497a1jnJ1J0jj4qjJJ4J2k7J9j2mJ3oRJj4NNmMQMrRlk9K1RjqQ%rQL%MlrJ0kRj0
4544Fj0J3jjjj0lJ3Ok8J8jlmMrJ8Ol1lPK6k9NrJ1Rj4j4J6RpKj6QQj4kK1MmjJR
4588EKmj3PNJ1orMJkmQJ3j6J0j6lJ5Mj1NjNJoolPj2kJ3mnqQRkj3j5K4nRnj5PJ7
4635Dk3nJ8J3k1ojK6Nk0jNJ4lj8PJ4Qoj3J2k%NKj0J1qj0LK6j2mj4OnJ8j7NnMJ
4677Cj7pJ8nj3KJ5NJj1oMRj3oJ5oorNJ3KmpOpJ2qROJ1k0lJ0J8lj4nOPjnJ3nkm
4723CqOJ3j3mLK0j1r%oPlj9J8nOQk7oJ3J4j1Oj0J4j5pQJ3Jj8PRJ3k1lJMrRJLP
4767BMk3J3J4o%lpPQqLLRj0j5J5%Pjj5kK6mj5joRjj7J7kLj6RJ%ojKKmJ0rLLqj1
$$ plain form
4454 -19 -2 11 -5 -11 -1 -3 -11 -6 -14 -19 20 2 -6 1 -3 7 -5 9 5 10 14 0 4 17 17 11 -7 -4 5 9 5 12 4 9 13 4 -8 5 6 -11 6 1 -11
4497 -11 -12 -17 -6 4 3 -11 -19 -20 -19 -5 7 -20 -1 -13 -17 -4 -10 -1 0 -14 -9 -4 -8 -4 4 8 -1 8 5 -24 -3 6 5 -3 5 5 -4 4 7 7 11 8 -1 9 7 16 6
4544 6 -4 9 8 7 6 -4 -7 6 12 -16 2 1 -2 -6 -2 -11 7 13 -18 -21 -14 12 -17 -12 -21 -10 -1 -15 -29 -13 -4 -11 -9 -25 -17 -9 -23 -25 -4 0 -4 -5 -4 5
4588 5 7 3 -10 -3 2 13 7 -2 2 3 1 -3 5 18 2 12 -4 -7 8 12 1 6 5 10 11 5 -1 -4 3 -9 -11 2 -2 -7 -15 -7 2 0 -13 -28 -4 -9 0 -5 -20 -13 4
4635 4 -19 -24 -6 7 -14 -20 -21 5 10 -10 -11 -6 8 5 -13 -6 8 16 10 -3 9 7 7 12 14 4 15 7 -3 0 26 14 10 -4 2 -3 15 -2 3 -2 2 3
4677 3 -14 -21 -3 -8 -21 -19 -4 1 2 -9 -15 -11 -2 -15 -21 -6 -12 -18 -27 -22 -9 -7 -11 -18 -12 -19 -7 -15 -6 0 11 -9 -12 -2 16 13 -1 -6 0 7 6 1 14 9 7 3
4723 3 -5 1 14 1 -3 0 20 9 0 0 -6 1 -2 -21 -3 -8 -2 6 -21 -27 -14 0 -11 -5 -15 -1 -16 -23 -15 -2 -1 -19 -12 -3 10 -11 -14 -13 -9 -18 -9 -8 -5 2
4767 2 6 -17 -4 10 4 4 1 -6 1 9 1 4 7 16 6 -9 6 6 13 12 -3 -5 21 17 2 1 -5 4 3 -14 3 1 4 -12 -3 -2 -2 -8 -9 -7 -5 -9 1 -8 -5 -2 -10 -21
4815b1%J1J0lrPJNq%J6rRk2OJ5Pk0RLllqJ0J6j8Oj3J8mL%j0LJ0j9NPNJ0l0mK5
4858A3mj3j5J0J6j6MopJ9jj8KRJj1oRRmj1JPMJ9k4JJ8kj0nQRJmQj3J1qQlkKlj
4903BMJ7rj9MQJ7j3oQjj2j0QQKj4JOJojj4J1RKk1LJ2Kk0ROJkkrJ0Kj0KRJ9k0j
4948gJ0lJ3j2KJLMnMpoJ7pK%kQj5OJ8j0j9J2mNj4OkJ0ooqJJ1mj6J1J0roj0J3J2
4992Aj5mLJ1OorPkMj1jK5Jj8pJ6QNj5j4RJ1Lj2nJ1J3mj2MJ6j9lPJ7j1jk3K3Nr
5034Ej1MPpRk5J0J2k%j6NJ1nrjPoKmNQppqJ7JLK%mMj3KJ8oorJ1MKmj3OJ5JmjO
5083IJ3rj0J0j1J6j4MmJ3l0LOLpmJ0J%j0J%kJ1rnJ4pnj1J4nJ0oj6J2J9lj1mMJ9
5125Ij3oJ4pJ4rk0K1klLLjMj2kJ5LlklRLk1NJQj5OLMrjjJlJ8j8qJ2KrmNNnoqP
$$ plain form
4815 -21 -21 -10 0 -3 -12 -5 -4 1 -7 -7 9 0 9 -13 -7 8 15 -5 4 7 4 1 -7 3 19 1 7 -6 12 8 11 11 1 4 14 -5 0 7 12 22 -8 -12 13
4858 13 9 -4 -19 -9 7 -9 -5 -11 -18 1 0 -18 -16 -7 -6 -17 -23 -14 -5 -9 -20 -19 -12 -8 11 -13 -12 6 4 -6 -11 -3 6 7 3 11 -2 9 1 9 6 4 6 3 2
4903 2 6 23 14 -5 -1 7 24 11 5 13 12 0 -10 -2 6 8 -6 -5 1 2 -4 -5 -19 -8 1 3 -18 -15 -3 -1 -21 -12 -6 -5 -7 -9 -18 -8 -6 -16 -14 -5 14 -6 -7
4948 -7 3 0 13 1 3 4 7 11 6 10 3 -3 14 7 9 9 7 15 0 6 24 14 -5 7 3 8 -6 0 -2 8 2 -4 -12 -11 0 -4 -20 -9 1 -8 -14 -24 -11 1
4992 1 -14 -18 -15 -4 2 -4 -13 -6 -8 -4 -15 -16 9 10 -8 -15 1 9 14 -1 -15 -6 5 8 -4 -9 2 15 11 -1 3 19 0 -3 4 21 10 9 -14 9 14 5
5034 5 -6 -2 5 -2 7 -18 -8 4 2 2 -14 -9 2 -3 -12 -13 -6 -12 -10 -14 -9 -1 -8 -15 -23 -6 -5 -2 0 0 -4 0 -13 -11 7 1 -5 -14 -3 1 3 -1 -14 -8 7 8 4 3 9
5083 9 22 13 3 13 2 18 4 8 4 17 -13 -10 -4 -1 -8 -12 -2 -1 -1 -11 -10 -10 -12 -1 -10 -15 -1 -8 -13 -24 -10 -15 -5 -11 -27 -15 4 1 -10 -14 -10 9
5125 9 -4 -10 4 -3 11 2 -18 3 1 -2 1 4 3 7 -5 -7 8 11 8 6 3 12 15 -6 -1 0 8 -7 -1 2 6 -3 -4 -5 -4 -7 11 -7 -15 -3 -1 -10 -14 -9 -4 -9 -15 -23 -16
5174a6J3j2mj5K5J0j4j3J2QkJnJ5%mrMK4k5LLPNpj7K1%qMj5J7Q%j0%jJmj5K3K
5216A0j6Kj5J9N%j6MkjkLJ1KrrQnJLqNmmOkKoJ1krK8j3J3j7J5Opj0MOjKlmNLj0
5264aPQjj7MmJ3joj3OK0nk1J6mJqpJ0J0lj1j0K0kKj8LJ7npj0LOOj3LJ0%Lj7K2
5307FOj3jJ0lOj0kJ3%pj0J2QQkj9K3j6qPLKJ0mj6KlkRrJ0jMj1mNRj2pQnRjpkM
5354aj4jQNJoOkJ4Kk0J2jMmqJ1J0k0KLJ0oQj4P%J2j7PPjKJljNj2kj6K0Lj5NMn
5400@KqQO%k3OJ5jj3j6J6MMj1lJ3mNj2kJ2Qj5j1MK3oj1PLJ2j7J3rJ8j4LOkRLj3
5443IJNo%j5J2NjqkMOj1JnRorKR%oqNQmmrKQk2J9lK%oPQJKmkjNmoJ7JlkkmK0j8
5497cOLRqljQJ2j2onJ7pqkoK4ppj0J5Lk0POmPj6jJ1J2k7JKJ2Kj9%JK4j2j5KPJ7
$$ plain form
5174 -16 -3 -15 -19 -34 -9 1 -13 -26 -14 -6 -8 -7 -12 3 3 -1 -10 -6 18 -7 -4 -1 6 11 4 -13 8 8 0 4 -11 6 14 14 4 4 3 4 0 -15 8 10
5216 10 -6 -4 -19 0 5 5 -11 -7 -9 -10 -12 -9 2 4 -5 -14 -6 -11 -10 -7 -15 -10 -14 -18 -12 -14 -12 -18 -7 -9 -18 10 -3 10 -7 8 14 7 -3 1 7 6 8 5 1 6 9 -1
5264 -1 6 14 13 -4 0 -4 9 8 2 -11 -5 15 10 -11 5 1 2 -6 -13 -3 7 4 -7 -17 3 1 3 -15 -12 5 0 -7 -17 -14 -8 -2 -15 -12 -2 -2 1 -16 6
5307 6 12 -1 -2 8 5 11 1 -1 12 12 5 -5 7 15 23 21 2 25 9 1 8 11 13 23 19 3 5 2 0 9 0 10 9 13 2 -2 3 12 0 -7 1 -4 5 4 -3 -5 -1
5354 -1 -15 -16 -8 -3 -2 -8 -2 -4 10 12 -8 4 3 7 3 -5 6 16 -4 -2 1 11 5 13 -1 6 6 18 1 8 15 14 16 17 14 13 18 6 4 -12 8 11 -4 1 5 0
5400 0 2 -6 2 8 8 -15 -9 6 5 -8 -24 -8 -4 0 -11 -14 -1 -5 0 -12 -14 -2 6 -9 -20 -16 7 1 -10 -3 0 12 -5 8 -1 17 3 6 12 10 19 22 9
5443 9 10 15 9 9 -6 6 11 10 2 0 4 10 -1 0 -5 4 -2 -11 -9 0 0 -6 -14 -9 -1 -5 -9 -18 -16 -8 -30 -11 -14 -12 -12 -18 -11 -3 -2 0 -4 -6 -7 -2 -6 -12 5 6 3 1 -1 -5 15 -3
5497 -3 3 6 15 7 4 3 11 23 11 5 0 17 10 2 0 -6 18 11 4 -6 9 12 -8 -1 5 1 8 -8 -9 2 14 -13 -12 -10 2 4 -15 -15 -14 10 -2 -17 -15 -8 9
5542Ik0lJ8j3OPj4J4J0j8OJ3kJj3jLJ6kj7J2jLrKlJ3j3lJJ1Pk5ljK3j5mj1L0j2
5583B%nnJ4j0nMmJOpmNQrj4J3J2mrlPK0j9j0J5Mj2J2nJ2Lmj3OJ5mJpNjL%j0NJ3
5629B2j6nnK1j4nJ%Qlj6KJ9kqrnJ7Kjj3jQopNJJ0j5KNjQnLRJj9oJ5J1rmKJ0j0
5675cLmOQrOjNMj2%KMlOj2Rj0%N%J1%k0kJ0rKkrJ0Jj5J0OqKj0J6%jj5J6j4J7k
5721bj4OJOkJ0j3PJ4j2j9K3JkqpJ3J0j0Pj%QLj2Oojj1OJ7nj1LoJ1nmoJ2pnpRj
5766dMrj1PPlrJ1MKj1lJ3qmJ4j2K6rrnQQlqKJ3Kj1j0J7rJ3j4kJ5oPpjJ8j2Lj3
5810AQ%J0j6RNpKj4RJkj7J2j4J0J5j7NRj3kJmNoj3J4NKj9J2J0qJ4rJ0j1J1Oj9
5851eJ7j7J4mJplNOMMJ1j5pJ5kqrMLJ2j6kkJ7j3nMJj1PokJ5nopK0qj7PpJ8lrl
$$ plain form
5542 9 -11 -14 4 -9 -3 4 -10 4 14 -4 2 15 13 14 1 0 3 19 17 0 12 11 14 5 7 4 17 4 1 2 13 20 -5 -8 -9 14 -1 -5 -16 14 2
5583 2 2 -3 -8 6 -4 -9 -5 -9 -8 -2 -9 -13 -8 0 -9 -23 -10 2 -2 -11 -14 -7 13 -6 -16 -1 3 -9 3 -2 10 13 9 -4 2 17 13 14 7 12 11 14 14 4 9 22
5629 22 6 1 -4 17 3 -2 -1 -1 7 4 -12 -10 9 7 -1 -10 -15 2 4 3 -10 -11 -3 -9 -16 -11 -10 0 -15 -13 -8 -9 -1 -6 -3 6 7 -12 -18 -3 8 -1 -5 -3 7 -3
5675 -3 0 -4 2 10 1 7 6 11 15 3 3 5 9 6 12 0 9 -1 -1 4 4 15 15 -5 -7 3 -6 -4 -6 -15 -5 -4 -19 -9 -3 -11 -9 -19 -3 -3 -4 -19 -3 -17 0 -2
5721 -2 -16 -10 -9 -3 -5 5 -8 -1 13 1 -18 5 6 4 -4 -11 2 12 2 9 8 8 16 19 7 13 7 6 -5 1 18 13 2 5 -1 10 5 1 -5 7 0 -5 -12 -3 -4
5766 -4 0 -9 -20 -13 -6 -9 -18 -7 -3 -1 -12 -15 -2 -10 -14 0 -12 14 5 -4 -9 -1 7 4 -4 -2 11 13 2 -8 9 0 13 -1 -3 12 6 13 6 5 23 11 14 1
5810 1 9 9 19 3 12 17 10 12 -2 7 8 6 -11 1 -13 -3 12 -5 0 9 -4 -6 -5 -9 -4 -10 -23 -9 -4 -2 -21 -9 1 -7 7 -2 8 -3 8 14 -5
5851 -5 12 -5 9 5 6 -1 -4 1 7 11 15 26 11 4 19 17 9 0 4 7 19 3 1 -1 16 3 -2 2 3 -8 -1 -7 -9 6 1 -5 -12 8 0 -17 -10 -17 1 -2 -11 -14
5897a4NMoj1LJ7kJljJ5qrj1RK6k0nQJ6mLmRKj6%jJ0J1qmMJrRk8LJ4j2jMJ4j8o
5942a3J3M%Qk5MJ7j9J1LqJ0pj2oPPMmmkJ0j8QJ4Lj1j1J4%J1j2LJ0jmJMMLlj2J3
5985A4Ok2J0J9j8JJnMKjj3lRorJPKOop%NPk5K0Oqnj1J1Ooj1J0J4j5MlPqJ1Oj5
6030hJ3kj1JQLoRoNQ%j5OJ3rMljQoKj3KJ3j6PLNj2rLmLKj0NJ2Jj5pMJPrrJ2J1
6078@j2LkPOj1MLQj7KMKJ0j6oK7qoOmKJ1qpOJ1rnRNpKj1J3Lj0nOlJ7j1rOrM%j2
6126a1J3jj0lJ4j2kMnj5J0J1j4RN%jRqML%j1J7Kj0%RLjnj9K2KNoj0J7Kj0pJ7j7
6169@ONrkQoj2J9qQlonPOk3RJ4j9J0j0J0pj4Pj0J1NlpjRkrORkkj0J0K3qqjKPL
6216GrKJJ2qmKMJ2j3Mj0J3rkKnK%j1J7qjLPrj1R%jRj9NkNKNj9nJ9lj8QOO%mrQ
$$ plain form
5897 -14 -9 -5 -11 -22 -19 -2 -4 -3 -6 -7 8 0 -9 -20 -11 15 -5 -10 -2 14 10 13 9 18 20 4 4 3 13 24 16 12 16 17 8 17 -11 -8 6 -6 -7 -3 11 -7 -13
5942 -13 0 4 4 12 -13 -9 8 -11 0 3 -5 5 -2 -14 -20 -13 -6 -2 -6 -10 -12 -2 -20 -12 2 5 -6 -17 -3 -3 8 -4 -1 9 8 4 5 9 13 16 13 1 14
5985 14 20 -2 8 27 9 10 11 6 10 12 11 -2 -5 4 -2 -11 -10 -3 -1 5 -1 -8 -8 -3 4 -21 -1 5 -3 -8 -19 -8 -2 -8 -19 -9 5 -10 -6 -9 -2 -10 1 7 -8
6030 -8 5 3 -8 -7 1 4 -2 7 1 6 14 14 -1 5 18 9 13 10 9 17 11 13 0 2 15 -1 6 9 14 2 -7 -4 -8 -5 -3 -13 -8 4 5 -10 -17 -13 -12 -5 -14 -23 -11 0
6078 0 -12 -9 -11 -4 2 -9 -5 -2 6 -11 -9 -5 -3 7 -9 -15 12 4 -2 4 0 2 13 5 -2 4 15 6 1 10 15 8 10 -1 12 15 5 0 6 3 20 9 0 6 -3 1 1 -11
6126 -11 2 1 -9 -12 2 -10 -12 -8 -13 -28 -18 -7 -21 -12 -7 -7 -8 1 -7 -3 0 0 -11 6 8 -2 -2 7 10 9 4 -15 7 9 14 8 -2 15 17 7 0 17 0
6169 0 6 11 2 0 8 2 -10 9 1 9 6 0 -5 2 8 -15 -6 8 -11 -1 -11 -1 -8 -22 -15 -25 -14 -9 -12 -19 -20 -11 -13 -22 -16 -7 -9 -11 -21 -11 12 4 -4 -5 -3 4 7
6216 7 -2 0 1 13 5 1 3 7 19 6 10 0 13 4 2 4 -1 1 1 -10 7 -1 -2 1 8 -1 -12 -3 -3 -4 5 -14 -9 -11 -6 -4 1 -18 -23 -4 -7 -25 -17 -11 -5 -5 -9 -18 -10
6265a0JJ1o%J3oj1MQlJ0j0QjQjqJ1Kj8jJNQpj6J7KpmLJlmmPQlnnJ1rkJLKj6J4
6313ampJOj7J1J4qpJ3j6J6Rk4J6J3qj2QN%j7J2Lj0RoJ2oPJj4J0jNj1J5j2RLoq
6355CRj4qJ9Lj5J2kj9J1Mj1Rj6KJ0ljkpm%J4J2j1olJJ8lmKk6K9NmnJ0k1J5lmM
6398@J2j0%J2j2%%kJ5nMmNj7PnMNj4J5%oQonqJ2J5j7j6J5Kk4J5jKKMj5LJ8mj4
6441a0J2qjMpLJ4qOoKNkj2LRqJ6pO%jloRj1J2jj7MJ2jj6J1L%j3j0J7JLmpJ1%o
6487bmjOmrqLJ7jj4qJ9qqJ2LJ1krnQMjNmjQj3NK0nj1J2LKjj6J0JKJJj6J1KJj8
6534bJ6Pk6J0MoPj7j0L2jj9nLJKOjlRj2nnlJ5kj6J3Q%nqRKjr%J2moJ4Pj5J0jr
6580dJ5j2jJ4okK4j2nrLo%mQ%JqOKj3J8nnMm%ojj0kJ1%lOkrQ%nLpJ5Kk1K7pjj3
$$ plain form
6265 -10 -9 2 -4 -4 9 3 -8 -4 4 1 11 1 9 8 16 15 7 18 20 2 1 2 7 15 8 -8 9 11 4 0 3 4 1 -3 -7 0 8 5 0 -5 6 -3 -5 -4 -1 1 -15 -1
6313 -1 -5 -12 -11 -5 -22 -11 3 -5 -12 1 -15 1 10 -14 2 15 7 -5 3 8 8 -9 3 6 -4 5 -1 11 5 12 13 -1 9 8 13 2 17 5 14 17 11 3
6355 3 12 -2 -10 9 12 -3 9 7 -12 -1 3 -8 1 -15 -13 -3 -6 -7 -9 -16 -20 -20 -6 6 -5 -11 -14 -13 5 2 -2 0 -26 3 8 4 -1 9 -12 3 0 -4 0
6398 0 12 2 2 14 2 2 2 0 15 10 14 10 15 -2 5 0 4 9 -5 10 10 4 12 6 1 -7 5 20 3 -13 2 4 -20 -5 -6 -4 -2 2 -13 -10 8 4 -10
6441 -10 2 -6 -7 -3 -10 -7 7 -1 5 -1 1 6 4 -8 -5 4 -4 12 5 11 11 10 7 1 10 -1 11 10 -7 -3 9 8 -8 3 6 6 -7 -17 0 1 4 0 -7 4 4 -2
6487 -2 -6 -7 -1 -5 -14 -22 -19 -2 -3 -17 -25 -6 -14 -22 -10 -7 4 2 -7 -12 -4 0 -1 4 0 -1 7 -6 -1 19 14 3 15 18 20 19 3 13 14 16 17 18 2 13 15 16 -2
6534 -2 14 21 -5 5 9 3 10 -7 -17 15 14 -5 -10 -7 -6 -4 2 1 -2 7 -5 -10 -15 -18 -3 -5 -21 -8 0 0 -5 -13 -4 -2 -3 -12 -12 0 -4 -10 4 11 -4 6 5 -4
6580 -4 11 -1 -2 12 6 4 28 16 11 2 5 -1 -1 -5 3 3 4 -4 2 4 -9 9 4 -1 3 -1 -1 -7 -8 -18 -20 -9 -9 -12 -6 -8 -17 -9 -9 -14 -11 -18 -3 -1 -22 5 -2 -3 -16
6629a6J3j2K2nk0J2Nk%J5k1K5noPPqj3J8j1pK6j4qjjKpO%Qj2KJmmJ8j9mJ0k3O
6671b0J9oj1JKJ0%moQkjjJ1qJ0j8KJ3%K%j7OJ3rMjJ6nNj1J1oJ0j7OJJ2j4Qj0%
6714CLLqNkMLlj2Rj3LJ3rnj1LNQj3KMnOpK%Oj2RJ4rjJoJ7Lk1%nJ0JOkMMJKrJ1
6764A2olPNKrrJ1LJMj9MNO%onQMj8%NJ0j6j0J1jPrj2J4j1pQ%NOoMlkj4K2ljLk
6812ekRjNKooOQlkmJ2j4QqK3j2rKpJ2kpNNj1l%J6ppLj0J7lj7JJ4j0j3J3mKJ7j5
6858hmJ1q%nNnM%KNOj0lJ0j0NkRJpNJ2lj2NMKnMj6LJ3oOj0JKLLj3QrJ9nnjNpm
6908eJ4j0lnkpkJ4mjJ%Rk2%K5o%qMmJ3lLj3J1J1j6J5nKjjJLJ7j7kJ1jj2QKnnk
6954BnJ1Kql%J8k2K2k1QpJ3j4ojkOoMj1J0lrRJ2JnqJ3Mj4oJ7qNj0JOKj0QjJ4K
$$ plain form
6629 -16 -3 -15 7 2 -18 -6 -1 -3 -3 12 -9 16 11 5 12 19 11 -2 16 5 -2 24 10 2 1 0 2 -5 1 1 9 -3 -1 0 -4 -8 10 -9 -13 -3 -26 -20
6671 -20 -1 -7 -18 -17 -15 -5 -5 -9 -15 -7 -9 -10 -11 0 -8 2 -16 -14 -1 -1 1 1 -16 -10 3 -6 -2 -3 13 8 13 2 13 7 17 0 6 7 19 5 13 3 3
6714 3 6 9 1 6 4 8 11 8 -4 5 -8 -5 8 -1 -6 -17 -14 -9 -1 -14 -12 -8 -13 -7 -14 -12 -12 -6 -18 -9 5 -4 -5 -4 -10 7 10 -11 -11 -16 -6 -5 1 -1 3 7 8 10 1 12
6764 12 6 3 10 15 17 8 -1 10 13 14 18 -1 3 8 14 14 8 3 11 15 -3 -3 2 12 -4 -14 -3 -4 3 -6 -18 -4 -15 -22 -14 -14 -9 -3 -9 -5 -8 -10 -24 -2 -5 -6 -3 -5
6812 -5 -7 2 1 6 8 2 -4 2 10 7 5 1 13 -1 7 -1 22 10 1 3 -4 8 6 -1 4 9 -2 -5 -5 11 4 -3 0 -10 7 4 -13 -12 2 -8 -21 -8 -12 -10 7 -8
6858 -8 -12 -1 -9 -9 -14 -9 -14 -10 -10 -8 -3 3 -7 -10 0 -10 -5 -7 2 3 -4 1 13 10 -2 3 7 9 4 8 -8 -5 8 2 8 -2 -1 1 4 7 -6 2 -7 12 7 2 1 6 -1 -5
6908 -5 9 -1 -4 -9 -11 -18 -20 -6 -10 -11 -10 -10 -1 -23 -23 2 -4 -4 -12 -8 -12 1 -2 1 -12 -1 10 -6 9 4 6 5 4 5 8 25 8 6 17 16 4 12 14 9 4 2
6954 2 -3 8 10 2 -1 -1 17 -5 17 -4 4 -3 10 -4 -10 -11 -13 -7 -13 -9 -20 -10 -13 -22 -13 -1 0 -5 -13 0 4 -10 -16 1 -7 -2 -12 -11 -5 -3 -13 -5 -6 8 10
6999A0j0jrJ4OmjJJ%JnJ1rmJ1nJ0nrOOrkj1J8j4J3j6nKQk4K1oL%KnJJ4k2RmJ3
7044Aj8J5Rj5J7j3kJ0mkNj5J0OmlOL%jLqJ3j2OOkjOk5J4Kj6J0RJ2j2Qj7%NJj1
7087dqJ6oj2LJoKRkj1J3nkR%%Lk%rPRp%J0j4J0JlRqPMJqjMkPjj3J6j1JKjQNj5
7137FJ%oJ2nj1QjMkj7RMj2JKKoKrJQNj1PMkoKOj1J7j2OoJ3j2QkQJOqoK1j1qKJ8
7186B0j5QKj3ROk6K5k1J0LoQ%q%JOJj4%lPLllJ1j5rJ2rQmOnJ3jk3K5j2N%j0oM
7231a3RJMlO%j1qK9rJ4k1J6oJ4j4jJ5mpNnnnkPrK2j2Mj7J5%pNrnJ2j7JKljj1J8
7276fj3KKJ4j6QJ0j0jJ3%j2pLmJ3jNLqjmL%J3Nj3QJoRj0RNok1K6qOnOnPmj2J2
7322A0Jj0lKmjNjj8J8pM%nnJ0j8J1JOnQj1J1pQqOJj2J6qmOmQR%Jnj2J1PLj4QJ
$$ plain form
6999 10 0 -1 -10 4 10 6 5 6 7 7 8 3 14 5 1 12 7 17 12 3 9 15 6 4 -7 11 -3 10 -6 -11 -9 -1 -25 -4 -10 -7 -7 -5 -10 -9 5 -17 -8 -12 1
7044 1 -17 -2 7 -8 9 -4 -6 4 0 -2 3 -12 -2 4 0 -3 3 6 6 5 8 0 13 1 7 13 11 10 16 -9 5 7 -9 1 10 22 10 18 1 1 6 7 -4
7087 -4 -12 4 -2 -14 -11 -10 -16 -14 -5 -7 -18 -5 -10 -12 -3 -3 -3 0 -2 -2 -11 -4 5 -2 -2 8 -6 4 5 2 11 3 10 14 15 7 6 10 8 15 14 1 17 6 7 9 8 16 21 6
7137 6 7 7 1 13 8 -3 5 4 8 6 -11 -2 2 -10 -9 -7 -5 -11 -9 -18 -17 -9 -4 -15 -8 -4 -6 -12 -10 -4 -15 2 -10 -4 -10 3 -9 -1 -3 5 6 12 4 -2 19 8 0 2 20
7186 20 5 13 15 2 11 17 -9 16 -5 5 8 2 10 10 2 2 3 9 10 -4 -4 -7 0 3 0 -3 8 -7 -16 -4 -13 -5 -9 -3 -8 5 4 -19 6 -6 -1 -1 -11 -17 -13
7231 -13 -4 -3 1 -2 4 4 -7 -15 14 5 19 -2 14 8 22 8 7 22 18 11 16 11 6 1 -1 6 -3 19 7 11 -6 9 9 2 7 -2 -7 5 -12 -11 -9 -12 -13 -24 -6
7276 -6 -19 -17 -15 -1 -17 -9 1 -9 -10 3 3 -9 -16 -13 -17 -4 -5 0 3 -5 -6 -10 -7 -7 6 11 -2 6 7 1 10 0 9 14 8 -13 13 5 11 6 12 7 14 10 -2 10
7322 10 11 1 -2 0 -4 -5 0 -1 -19 -1 -8 -4 -4 -9 -14 -4 -22 -11 -10 -4 -9 -1 -12 -1 -8 0 -8 -2 -1 -13 3 -5 -9 -3 -7 1 10 10 11 6 -6 5 12 15 1 9 10
7369A0OLk4K0rJJmkLQj6J9oj0kpJ1knMknlLRj8oKMNL%j4J0LNoMj0RJ0JJ1k6QJ3
7416ImJJ1qj4RRkJknoJ1nNjj2PQpR%j3kPNqj3J2jkkOprQmrJJ7j3mOnlMLkNnkM
7468a2MkMp%%Qj7J9LlMqJ3Qmlj1J5qJ1j0mJ5jj6JJ5j0rMOkPnk0K4Oj0j5KJ1lJ
7512Aj0j0lJ9jj0%Rj0RkqN%pQJ1j0j5J2J4j1j3K6pNmRrQjMj0LjP%j1J0JKrj5J9
7556Elj3J7nJLojRljj8RQkj2jJ8k8RoqJ5J3jk0J1opRpJ3Oj3J0j4R%J0j8J3mqJ6
7600aoJ8jJnlLMnLKpJL%JJj0LLLjlKnJj3J4nnOj2jnJ3pm%NJ9k0KkJ3j8MQJ3oj5
7650a4PkjQLj2J0j0K9j3jNj8J6lOnkQpQkOqqJRlKMLj0MomOljQj6PJnkmJ2k4J0
7698a1nNjRoKkLqJ4j0jRj6J3%%%J1rOPK%jlqJ7lkOjnj1L%NqLJ2qKPj8MLNJnkj0
$$ plain form
7369 10 16 19 -5 15 6 7 8 4 2 5 13 -3 16 10 0 -2 -9 2 0 -5 -1 -3 -8 -11 -8 1 -17 -23 -21 -17 -12 -9 -9 -23 -13 -10 -5 -11 -7 -17 -8 2 3 14 -12 -4 9
7416 9 5 6 17 9 -5 4 13 11 12 10 5 -1 10 5 10 9 -3 4 12 5 14 14 1 -1 6 11 3 -10 2 1 -1 -3 3 -4 -13 -5 -9 -18 -17 0 -13 -17 -11 -16 -19 -15 -12 -14 -9 -14 -16 -12
7468 -12 -8 -10 -6 -13 -13 -13 -5 -22 -3 0 -3 1 -7 6 14 10 7 -4 11 3 14 4 0 15 14 -2 -1 14 4 -5 -1 5 3 10 5 -15 9 15 5 -10 -8 3 0 1
7512 1 -9 -19 -22 -3 -4 -14 -14 -5 -15 -6 -8 -16 -11 -11 -18 -10 1 -9 -24 -12 2 -9 -22 4 -3 2 -2 7 -2 6 5 9 -1 2 1 8 8 -3 7 8 10 1 -14 5
7556 5 2 -11 6 1 2 5 -1 -2 7 4 3 -15 -6 2 0 -12 -13 5 -23 -14 -20 -28 -13 0 -1 -21 -10 -16 -23 -14 -21 -8 -2 -15 -5 -19 -10 -10 0 -18 -5 -9 -17 -1
7600 -1 -7 11 10 11 6 3 6 10 5 8 10 3 4 7 7 8 9 -1 2 5 8 7 4 6 1 2 -11 3 -2 -7 -1 -13 -14 -19 -6 -13 -17 -17 -12 7 -13 -11 -13 0 -18 -14 -6 7 1 -14
7650 -14 -7 -9 -10 -2 1 -11 -1 -11 18 5 4 9 -9 7 4 10 5 3 11 4 12 10 16 8 0 1 10 7 9 13 16 6 10 4 0 6 3 2 10 -6 1 2 -3 -5 -9 3 -21 -11
7698 -11 -16 -11 -12 -3 -9 -7 -9 -6 -14 0 -10 -11 -2 -18 -5 -5 -5 -5 6 -3 3 10 12 12 11 8 0 17 14 12 18 17 12 1 4 4 9 1 4 16 8 10 17 -1 3 6 11 12 7 5 -5
7749eJlKMjrjj3J0LQnkljj3J7KLMj6NJ5qlkqJ3jPjJ3rlJ2Pj4LmJPj9RjJ0kqok
7798gK8k0NJ1j8LJ0j6OrOmj1J2nPrmJ0j0OKonPpMK%KMj1MPoj2J9Rk2J5Rj2MJ5
7842A3k6K1KrOOj8MJ4j1LlRj2J0pPjn%Rj2j6K8j7L%%QrJqJj2J1Mjj1PK%Kll%R
7888dj4P%NoJ6j8QpOJ1k2J1J8j2MNnmLLPJj3JJ2LkJkj1KJ0j3Mjj3J6kj9K%OlQ
7933aj0%L%pJ1mJKj2OjMJkKKOj5PMj2J9r%OJ1j4OmJ0JopjJ3j5MJ5Mj5J1j8jJ5
7978A0pN%mkJ2j2mRrj0PlNj0Nj0J0JqjJ1j8K3nklPrNRj2OjllJ2j2J7rRlLJkJ0
8024A5mkOj0J3pj2J4Jk4K5pMJ0rJ%Ok0KLqMRj4J1j2Pj5nJ3oJ0kj3J3J4k8KQ%N
8066bj4MLNJ5j9NJKJ%JJLnkROnKkRrLoNMj3KO%%j3MKKR%qj0Mkj2J4Oj1rOlJ1o
$$ plain form
7749 -5 -4 -7 -5 -1 -2 -11 -12 -25 -15 -12 -4 -9 -11 -14 -15 -28 -11 -9 -6 -2 -18 -13 2 -6 -9 -11 -19 -6 -7 0 -1 12 3 0 12 19 5 8 4 5 12 -7 2 1 11 9 1 -5 -7
7798 -7 21 1 6 17 -1 2 12 -4 2 -7 -1 -5 -16 -4 -9 -2 -11 -15 -5 -15 -9 -7 -13 -18 -11 -18 -14 -12 -12 -10 -6 -17 -13 -6 -12 -24 -5 4 -18 -3 6 -6 -2 13
7842 13 -13 8 10 1 7 13 -5 -1 13 2 5 2 11 -1 9 2 9 8 3 3 12 0 -16 12 -5 -2 -2 -2 6 -3 -2 -10 -9 -21 -10 -6 -7 -18 -11 -9 -9 -7 -10 -13 -13 -4
7888 -4 -18 -11 -11 -6 -12 4 -14 -6 -13 -7 4 -18 -7 11 -1 3 8 3 -1 2 5 12 13 0 1 13 16 14 15 13 2 4 14 1 5 4 -9 7 5 -14 -12 -12 -6 -9 -1
7933 -1 -11 -11 -8 -8 -15 -4 -8 -7 -5 -17 -11 -12 -8 -7 -9 -7 -5 1 -14 -7 -3 -15 4 -5 -5 1 12 -2 4 0 10 11 5 -2 -3 10 -5 -1 14 18 3 14 -4 -5 10
7978 10 3 8 8 4 2 14 2 -2 7 -2 -12 -5 -8 -3 -13 -8 -18 -8 -7 -15 -16 -5 -23 0 -5 -7 -10 -3 -12 -7 2 -10 -4 -5 -8 -11 1 -11 6 -3 6 3 6 7 5 15
8024 15 11 9 15 5 18 11 -1 13 14 -10 15 8 12 22 13 14 14 20 0 2 5 -3 1 10 -4 7 -5 2 -13 -18 -5 -11 -1 -3 -16 -3 11 -17 -15 -7 -7 -2
8066 -2 -16 -12 -9 -4 11 -8 -3 -2 0 1 1 2 3 6 1 -1 8 14 9 11 9 18 9 12 6 11 15 2 4 10 10 10 -3 1 3 5 14 14 6 -4 0 -2 -14 0 6 -5 -14 -8 -11 0 -6
8117foMj2J3jj7K4lj1%mMNkmNQj4lJ4nJ1J0qqJ6rJMLnLkNj1PNj3J4Oj5lJKoNo
8164dKKMk2J2lOKlj8J4JLlqK2j8JjJMj1QlkJk
$$ plain form
8117 -6 -12 -8 -20 -7 -8 -25 -1 -4 -15 -15 -19 -15 -10 -12 -16 -11 -3 -17 -20 -6 -11 0 10 2 -6 10 1 2 6 9 4 7 5 10 -1 6 11 -2 12 18 3 0 1 3 -3 2 -4
8164 -4 -2 0 4 -18 -6 -9 -3 -1 -4 -22 -8 -7 -4 -7 -15 7 -11 -10 -11 -10 -6 -17 -9 -12 -14 -13 -15
8191a5
$$ Imaginary data points
##PAGE= N=2
##DATA TABLE= (X++(I..I)), XYDATA
0@%%%%%%%%%%%%%%lJ1j6J6j6J6j7K5l2L2l9M7m9N7o5P3q5R4j05J20j34J48j65
37h7J84k02K23k48K75l05L38l75M15m60N13n72O38p16Q09r22J062j240J475j801
57i96K286l100M796j3685J9779Q853l8684K8090Q179l5467J4261K4235k6688L978
71d163J7426j9614k881J7788r713j226Q969j0081r47J0096p967m5P915p708j665
86c816Q633n164l255N748r24k589Q85P78J804m008j058Q168m692p067J1256k066
102B633j1535J3616L454j7790P973R340j4270N698J0820j4791k1J0155r741L113
116a346J0280j2083k67Q351j2065M609J4906j5697l661J6124j3351n683K1630
129A1747q467j4062J7370k697j5740J5085N370j5157N896O136j0243K838O291
$$ plain form
0 0 0 0 0 0 0 0 0 0 0 0 0 0 0 0 -3 8 -8 8 -8 8 -9 16 -16 16 -23 24 -25 32 -33 40 -45 49 -56 64 -70 78 -87
37 -87 97 -105 118 -130 145 -160 178 -197 218 -242 271 -301 337 -379 430 -492 570 -670 805 -996
57 -996 1290 -1810 2986 -10699 9080 17933 -20751 7339 15518 -19949 -5688 18547 -8141 -4163
71 -4163 13263 -6351 -9232 8556 -1157 -2383 6586 -3495 -4442 5654 -2313 -2358 5557 -2151 -3816
86 -3816 4817 -347 -3602 2146 1222 -1367 -482 296 2100 -1908 -2966 5202 510 -6557 4699 2633
102 2633 -8902 4714 8168 -9622 -1649 7691 -6579 -881 9939 -4852 -4873 5282 -4459 -1346
116 -1346 8934 -3149 -3416 4935 -7130 -2521 12385 -3312 -6973 9151 -4200 -9883 11747
129 11747 3280 -10782 6588 3891 -11849 3236 8606 -6551 -655 5481 -4762 -1924 4367
142D367n526J91K710k482O88o72o21M179k540k781M857k863l059O902k161m594
158c405O481k674n622Q214m14o484P040j670q433R425K640j0179O239L462j1070
173f450N170P610r296J484O779q618p04Q254l951j797M228m135q68M253k554M01
189a94K633m219R51L019m833J993M910n982m09N385m973p88O263m054k117N529
205C114l617k979N661j208k440L691k645k656M584o76j967L162k067k357L325
220I25j069q43L787k674k769L624j315j082M575k784l590M867j035l544N126k21
236A978m974L741Q63m570L458K362m635J024K413k794O33J776j921N52J118j668
252f44K81M05n82J693m59k090J714L6j842K515M01k832J695K94k918K877K042
$$ plain form
142 4367 -1159 -968 1742 -740 -52 -724 -1345 2834 294 -2487 2370 -493 -3552 3350 1189 -3405
158 -3405 3076 402 -5220 2994 2580 -3904 3136 1466 -6967 2458 5098 -5081 1158 4620 -6450
173 -6450 -1280 6330 -2966 -1482 5297 -3321 -4025 4229 278 -1519 2709 -1426 -2294 1959 -595 -194
189 -194 2439 -1780 -829 2190 -2643 -650 4260 -1722 -2131 3254 -1719 -2507 3756 -298 -2415 3114
205 3114 -503 -3482 2179 971 -1469 2222 -423 -3079 1505 829 -1138 2024 -43 -2400 925
220 925 -144 -987 2800 126 -2643 981 -334 -1416 3159 375 -3215 1652 617 -2927 2199 1978
236 1978 -2996 745 1608 -2962 496 2858 -1777 -753 1660 -1134 -501 1275 -646 -94 1024 -644
252 -644 -363 42 -540 1153 694 -1396 318 354 -1488 1027 1428 -1404 291 585 -2333 544 2586
269B586l666N56J369k902J912K926l505l86K532k719j69L609j586j548J830j559
285g20r74K960q6j746O12m46l41J391l87m87Q44r04m47J227n97j75J323j216r52
304a121J785k51j215J092J35q10P69k22j015P86O27l33l5m86k06O55j97O0Q05
323H23p86q14O77j78K05J411j015j635J048M45m45J159k45j636P01N00q73J116
341D58P58j666k95P14l65P46Q37j470o49R79m4j6N97m98m58L64k51O2P69k35o17
362b80R0k7K42N24m64n56N02K09k81P3p1j17L29M5l06j2J13l4j00J12M36j40p69
385d82N3N36P1K73o5j121O1J142k26l01N91o64p34R32K65m17P30l15j492O43J279
406G59m45k22J01q66J04J164j88o18L48j56n72M60O70k40l90n4k05J22P51L5r71
$$ plain form
269 2586 -1080 -524 845 -2057 -145 2781 -724 -1110 1422 -1297 -1466 2143 557 -991 839 -720
285 -720 -1694 1266 1180 -566 46 -400 -741 650 263 -224 620 -284 -731 496 -101 -276 1047 -169 -1121
304 -1121 664 413 -802 290 425 -385 384 162 -853 -67 560 227 192 -294 -500 155 -42 18 823
323 823 37 -777 -100 -278 -73 1338 323 -1312 -264 181 -264 895 650 -986 -285 215 -658 458
341 458 1216 -450 -745 -31 -396 350 1187 -283 -932 47 3 -13 584 86 -372 -8 -259 -197 572 337 -280
362 -280 -190 -217 25 549 85 -471 31 240 -41 32 -39 -156 173 218 -88 -100 13 -21 -121 -9 427 287 -482
385 -482 -429 107 178 451 386 -735 -674 468 242 -59 532 -132 -866 66 331 -86 644 329 -1163 -520 759
406 759 314 92 193 -673 -569 595 407 -211 137 -19 -591 -131 539 299 -91 -145 -350 -228 523 558 -413
427d13j11P53o0k07L19l68l65O73N3n32M64Q5q44L12P28l03j60p4n21M19Q45l89
449C04n33l5m7L55L94l57j47N6m00J93O20j20k12j32n82L31J020k83o91O2n7Q0
471a81N94j01n29R7R1j59K13K97r7m05k39L74L55j25j13k52k78O42L94p91r6N76
493B67m28k4O58n05l48O84l46m31R49l6r72L27L64k64M43j5r05K53P20k80j37
514b6J09k57K8J85n8J65J5l43j1O5J48M47l38p18M47M16l25K25Qo76M33N01p28
537b88J39O58o30k43O14k58j05M80n02l03Q02o8n87K36M2r2M55j78n49L05K24
558A52k13J34K5j34J06j84p7M24l2l30P1r0Q1N02l72o11N17L06l12K15r4n22L54
581h4L18l27K13J77n21j16K19J49M19j97p18K51L67k66K80Q8o38L26N26p11q4
$$ plain form
427 -413 -524 229 169 -38 281 -87 -452 221 274 -258 206 291 -553 -241 487 184 24 -50 -571 -152 693 304
449 304 -229 -264 -311 44 438 81 -66 -10 -410 -217 403 283 71 -61 -643 -312 708 425 -266 -204 -261 -181
471 -181 413 312 -217 -120 -29 -188 25 322 225 -180 -419 -45 310 185 72 -180 -458 184 578 -213 -309 267
493 267 -161 -185 473 -32 -380 304 -42 -473 476 440 -532 -205 159 -105 338 323 -582 -329 391 111 -26
514 -26 83 -174 -146 39 -19 146 161 -182 -193 -128 20 467 129 -589 -142 274 -51 174 182 -494 -61 440 -288
537 -288 -149 509 -121 -364 250 -8 -113 367 -135 -438 364 296 -291 -55 -13 -105 350 172 -377 -72 152
558 152 -61 73 98 -36 70 -114 -191 233 201 -129 -58 -148 -67 435 63 -548 -31 275 -37 178 84 -438 -84
581 -84 234 -93 120 297 -224 -340 -121 28 447 250 -468 -217 150 -116 164 252 -386 -60 466 -245 -329
602c29P32m26k98O57j37l95K83k26k67O99K44n31k30j10J67N53j20l95K01j31
622e9k94M52J81l57J58pm15L15M56m37l53J99K73K16j24m10j01J40J97L56j22
643B64m85R5K3l18M99O16n60n57K18O2J51L48k03l84R1K06O5j87j98M06J29n22
665b41K54M42p77j63Q46k82k36Q16o22j069J019P20p88R5L04p22O2O45k14j33
685d4K35k49j49J25J05K54k49m82M51M28m55p6R2l17L10M75l89k17J14j74J47
706f5J54n3L27k63p88N63O13o60J85M22r29J20J071p16o02R89m3p35M45K22m22
727a65P5J29PN1j03J25j20n49O14P34j001k86R50n39m38J058k90q27Q20P2q84
748e67N58N05o20n3J66o6K91j12l56L09k4k17M51j87n00O12P7o64L87L16m03O7
$$ plain form
602 -329 403 -23 -321 336 199 -196 87 -139 -406 293 537 6 -224 -334 -167 386 266 -129 72 -59
622 -59 -353 99 280 -77 81 74 -341 -26 430 -7 -360 -161 112 328 204 -206 -307 -167 30 386 264
643 264 -221 -126 -103 -421 78 694 134 -423 -205 -143 8 356 153 -231 -140 66 131 -56 -254 152 281 -241
665 -241 13 455 -322 -485 361 79 -157 659 37 -1032 -13 707 -81 14 318 -404 -342 303 89 -44
685 -44 191 -58 -207 -82 23 277 28 -454 -3 425 -30 -106 -14 -331 -21 454 65 -152 -38 -212 -65
706 -65 89 36 363 100 -688 -125 488 -172 13 435 -494 -374 697 -19 -621 368 325 -410 35 257 -165
727 -165 -90 39 46 97 -6 119 -1 -550 64 798 -203 -489 461 -78 -516 542 252 -575 245 317 -567
748 -567 -9 496 -124 -177 -11 -77 214 102 -254 55 31 -186 265 78 -422 190 267 -397 -10 306 -97 -30
770c0l1j28M44j66l83N06k20l66Q33l07r08J133K61j436P03Q57j223J54R86r58
790b79j75J068n33o03O89J02l33J0o6K43K4l99L28J51n69M57K93r33L56Q58q96
811b07k14Q26m79j92O21m74j59O22m17j99N29l63J3N02p34p9J002n83n18Q37k90
832D4m58P87k59n53P00j30n04N29o1k12M67n37k89R81l56o33R21l15p49J079j16
853C36j118J027M20j240M71O28q75K32N03o22J89M44n88RK12j64M49o1o70M54
873C6J80o46N35K93p22M50J94r39N40O48q35J98M61q11L46N53r73K90Q97r11j03
894c19P77p89n5J025p09l70R86n02o19P74p9k91N78l43m75N70q9k78M27k30j15
915a26M72m73k70P28k65l63O45k75m13O71l17n83Q49R4o24L90r6n11O23Q0n49
$$ plain form
770 -30 -61 -189 255 89 -294 212 -8 -374 459 152 -756 377 638 -798 -95 762 -461 -307 679 -279
790 -279 -454 614 81 -522 167 269 -64 -54 -120 123 147 -252 76 227 -342 115 408 -525 -169 689 -207
811 -207 -421 405 -74 -266 355 -119 -278 344 -73 -272 257 -106 -93 409 -325 -404 598 15 -503 334 44
832 44 -414 373 114 -439 261 131 -373 156 95 -117 350 -187 -476 505 149 -484 437 122 -627 452 336
853 336 -782 245 665 -575 -104 524 -351 -119 384 -238 -49 395 -193 -184 28 -136 313 252 -418 36
873 36 216 -430 105 398 -324 126 320 -619 -79 569 -266 -68 393 -418 -72 481 -492 -202 695 -216 -319
894 -319 458 -331 -386 639 -70 -440 546 44 -575 199 120 -171 407 64 -411 159 70 -208 219 -11 -126
915 -126 346 -127 -397 331 66 -297 348 73 -340 331 14 -569 280 374 -250 140 44 -467 156 236 -313
936c13N28J17o99K60J67l34N36J25o93K47J95m58L02K50l33L19kp05K97M47l50
957i7K65J27o36K39L47n73K62N92n56j93L72l73O6N67l73l01M68j29l04K81mr7
979e0K22j34k03J87M4p5Kj00J46J56k83l5K14j74L0K31k89K6M21m18k98N11j6
1002A15k21L34j69m19M03J18m01L15K97m87j05K00j15J90K79l25k34K06K4p5J14
1023D4R1n1j09j12N8J09P1O0k09j45K54O7k35J17J63k11%J07k16J18L17l02k08
1046b22K95jj73J75qj65J49Pk32J37K54j52j86NJ00O8L0m0p3o1Q0N3j29J27J93
1071B31k90k08K94O6j07J67j33l08K99K03l30P0K65k74j19K30m3m7K10j21k85
1092b30J87K24j74r0J38K0j46M9P5j20J15J67k96j49L43Rk48J75O7k76J40J34
$$ plain form
936 -313 215 332 -367 -107 60 -274 262 387 -306 -59 136 -322 -20 230 -103 216 214 -491 -194 253 -97
957 -97 168 295 -341 -102 245 -328 -66 526 -30 -223 149 -224 -158 409 36 -265 203 74 -230 51 47 -50
979 -50 172 38 -165 22 66 -9 -7 -107 39 195 -88 -123 91 -83 -53 178 -111 -85 336 -82 -380 131 115
1002 115 -106 228 59 -360 43 161 -240 75 372 -115 -220 -20 -135 55 334 9 -225 -19 5 -70 44
1023 44 135 84 -25 -137 -79 30 101 161 -48 -193 61 128 -107 10 173 -38 -38 69 -147 -29 288 -14 -222
1046 -222 73 72 -101 74 66 -99 50 57 -175 -38 216 64 -122 -117 -17 51 81 41 -32 -93 -13 40 -89 38 231
1071 231 -59 -267 27 93 -14 153 20 -288 11 214 -116 -46 219 -55 -174 56 13 -34 176 55 -230
1092 -230 -43 181 7 -83 55 75 -71 -22 53 -67 48 215 -81 -230 113 122 -126 49 116 -160 -20 114
1114A14k95J41L46l47k35L10K8j27J70n4k35J61J24j96L8K07r7k10O0J60m5M1
1136E9K6k04l7L11m5k68K11J18k84K6J91j45L9J95k91r3L32k6k14J22M1j01M6
1159Inn3O6R1p7j16j9K05J8k30R5J43k29L8J83k12M7L09l31k33M41j1k70K23k4
1184E8k69K56Q1k78J25K19k47j03J49M6J5j2q2j8K7R4L3k16J06K11k91p9L53j54
1208B4j38L15k46k48N26m2m97L73J66m89K59K14m55K57L19n58LM69k76p1K63k43
1230g5m7K73k19m4K47j19n1M8j84J81K14l33L2K01k71R2K49l50Q4L41m09j10M34
1253A84j84q4K64l12n0L93k19j24K89j89n8K43l05N3M08l75j26M03l13k4M94m86
1275a18j87P00m00l67O99k10m62O51k12n94P61M8p20N03J77o22L94K32n86L36
$$ plain form
1114 114 -181 -40 306 -41 -276 34 62 -65 105 51 -184 -23 101 -95 -57 150 53 -157 -97 63 18 59
1136 59 85 -119 -156 155 110 -158 53 171 -113 -87 104 -41 -2 193 -98 -191 141 115 -99 23 64 -37 9
1159 9 4 -49 17 108 31 -85 -104 101 119 -111 -16 127 -102 -64 119 -93 -46 263 -68 -301 140 129 -141 82 58
1184 58 -211 45 126 -152 -27 192 -55 -158 -9 37 52 40 -42 -60 -33 61 94 -122 -16 195 -96 -175 178 24
1208 24 -114 201 -45 -293 233 191 -306 67 233 -256 3 217 -238 19 338 -220 -217 252 -24 -95 168 -75
1230 -75 -122 151 -68 -112 135 16 -35 13 -171 10 224 -109 -77 124 -147 -55 194 -156 -72 269 -140 -250 184
1253 184 0 -84 180 -132 -182 211 -8 -132 157 -32 -90 153 -152 -99 309 -66 -192 211 -102 -126 368 -118
1275 -118 -305 395 -5 -372 327 117 -345 306 94 -500 261 309 -411 92 269 -353 41 273 -313 23
1295B3L13n76J01L38k91J08J28l30J75J56k81J68M5k13K67r0l54M80M5m79L53
1316H6P5n13N00J63p07M33L43p38K65M79o44K45M25p82J67O79o40k5O04o08k8
1337b21O41o06p3P53n52l06P09l97k36P23m35m35P71k33m97O25p2m70N23j21m73
1358c82N39P3m73K96M6l06L14j1l01L20j8k76K32p2j17L97k73l00N49j94l25N84
1380C02k40m64P41j88p03Q19J24r06O29K67q94O01M59j017L27P06q75Q6P23p11
1400b14k1P14o57j38P66m51k98N66l09j88N33l10k58M82j95k52L55j22q8K94k84
1421g5j32L29j86%K78l43J6L54m47j4N62l44j69M29m29j27O62l44l05O28l10m04
1443c71N96j96l34O75k16n93O21kn88O09N8o37N67J51q08M24M43o55K00M34n83
$$ plain form
1295 23 336 -240 -139 199 -92 16 144 -186 -11 145 -136 32 77 -136 131 41 -313 167 212 -267 86
1316 86 161 -352 148 311 -396 37 380 -358 -93 386 -258 -13 412 -370 -203 476 -164 -189 415 -193 -221
1337 -221 420 -186 -259 494 -58 -364 345 -52 -288 435 0 -435 336 103 -394 231 159 -311 212 91 -382
1358 -382 157 230 -243 53 99 -207 107 96 -205 115 97 -179 53 -19 -136 261 -12 -312 237 43 -282 302
1380 302 62 -402 339 151 -552 267 391 -515 114 381 -513 88 547 -470 -143 563 -312 -226 497 -214
1400 -214 -235 479 -178 -316 450 -1 -299 267 -42 -230 303 -7 -265 217 22 -230 125 3 -85 209 -75
1421 -75 -207 122 -64 -64 214 -129 -113 241 -206 -220 342 -2 -171 258 -171 -298 364 20 -285 343 33 -371
1443 -371 225 29 -305 370 154 -439 182 180 -408 201 259 -378 189 340 -468 -44 399 -256 -56 378 -205
1464b05M9M43m57l4N25k54k11K33j56m6K07q9j0J11j23k1k9j09K82Q7k99J38L6
1487F8l29K48J59l23K96K01o24Q0M37l74J33M45n27j43N29m13k06O92j77l82L83
1508A73j62l85N19O9m12L04J28m26Q5J55j57K01J32k86JQ8j29O8J05n9R6k0k39
1531a51N2J11l2J10Mj57R3j5j90J33J52q5Q3p4k41J56J03j48J87J05k65J4L3j94
1555b16K23K76k97k6J41k67L3K94j83PK85l12k21L32l6j08K65r2k56K20j5k49
1577b02K37J65j94oK9j66R5J47q6k4O7m7q6mM7Q9j2l1j2o1K0R0j14j1K07p1j95
1604a29J33oj27K14J5k26J56O9k64O1K12j16QR0k07PK03r5p2J46k6r2M2m8J6J31
1630I5k8r9L7k4J3L5l8J0J04r4j11J00RJO9r3o0J15mj00Q1K2m8J4k3l3Q9K4j05
$$ plain form
1464 -205 -156 287 -170 -204 321 67 -144 89 -67 -113 94 5 -5 106 -17 -38 -67 -176 106 193 -106 32 68
1487 68 -261 -13 146 -177 119 320 -304 -224 213 -161 -28 417 -110 -253 276 -137 -343 349 172 -210 173
1508 173 11 -374 145 214 -198 106 234 -192 -107 48 -109 92 224 -62 -61 27 -102 -34 71 12 108 88 -151
1531 -151 -99 12 -20 90 94 -63 30 15 -175 -42 110 25 108 34 -207 -51 52 -96 91 196 -69 -55 -22 -216
1555 -216 7 283 -14 -40 101 -166 -133 161 -22 -15 270 -42 -263 69 33 -75 190 98 -158 62 47 -202
1577 -202 35 200 6 0 29 -137 -42 105 19 -5 62 15 -71 -75 -28 61 49 18 6 -55 -35 55 -59 -70 137 66 -129
1604 -129 4 -2 -129 85 100 -126 30 99 -165 -104 108 -8 0 90 -117 -110 93 -2 -74 72 46 -46 -4 -52 -36 95
1630 95 67 -32 5 -19 -6 29 -9 1 105 11 -100 0 9 10 79 -14 -74 41 37 -63 18 40 -8 6 -17 -50 39 63 -42
1659d2J1J8NL1j7o0Q3j4p2N4J4j6N8n9q9J41K2j44Q7L1j08R2M6j62O3J76j88l3
1687g2J49q0l3J23j09n4J51k4j29R0M5o5Qj0RO1j2p2mMN1K7q3QO3q3k6R7l7KR4
1718H9j57o6J77kj07Q8jj02Q1Kq9J38M3j60mP2m2O9K2r6K9M2p3L0M5l4O0n0j19
1747a15J04R7j17L3L7j10P8O9j27L8J35j52n6J34m4QQ3j25n7J27j0o8N5mk6J3
1773@l5J0Q3qo8j4k1O2O4j10RO2r3qJ01o3K4J02j60q2K00j1j00J13o6j04J56q
1801C5j12J27N1j86K8P5m2Q2Jj27L9L8j7L2J1m5M9m9r1J34M6o6L1o0r2J40M2j38
1829f4Q1N7j56L6O4o0J10K0j76J3J01m4M0N8j36J5N9j02N9J13p9m8K4r3J04J11
1855A07j30j1Q1j15K5J19r2K2J07k02k5K04n0m4R2j28o7J82m3q3J42l4j20N5q
$$ plain form
1659 -42 -31 -13 -8 23 6 -54 29 15 -57 -3 11 -5 53 -6 -95 46 68 -76 11 42 -66 26 72 -90 -27 149 -39 -72
1687 -72 77 -3 -36 87 -22 -76 75 51 -78 12 57 -8 0 -10 -1 60 48 -24 -28 -24 27 54 -29 -21 42 -41 -67 30 -7 -5 89
1718 89 -68 -134 43 41 -66 22 21 -81 0 2 -87 51 94 -66 -70 2 -40 29 51 -45 -16 26 -47 -17 28 -6 54 4 -115
1747 -115 -11 86 -31 2 39 -71 7 76 -51 -13 122 -30 -86 48 4 12 95 -30 -87 40 30 -38 17 13 -13 0
1773 0 -35 -25 58 50 -18 -32 -53 9 73 -37 -28 34 -59 -67 34 -29 -5 97 -63 -145 55 44 -56 57 -9 -113 43 35
1801 35 -77 50 101 -85 -57 18 -24 58 59 -68 -29 9 -8 24 35 -10 39 -10 -101 33 79 13 44 -16 -108 32 74 -64
1829 -64 17 74 -82 -46 18 -42 68 88 -88 -75 26 -18 22 80 -56 -41 18 -84 -25 88 9 -39 -15 -108 -4 107
1855 107 -23 -34 47 -68 -43 76 -16 6 113 -89 -114 90 40 -4 88 -40 -107 75 32 -51 91 57 -63 -8 -16
1880a6lJ40q8j06P4l1kJ33j05n1J46j24j05K17mj36J34r5j51K27M9k03J33K9k00
1905a38J19P0j33J38M5k39N8J32j01Q9K9j86R2Q5j49R3J09j43J7K3j31J49J01
1928A29j76M5O2j82J50J02k15J12J44l23O7K42k00M7J80k87l3K99j77p3K48j71
1950a0j19J90j15j8K46j55j52J76q5l6K30j59j08K17j37j27K56k9j45J70j35j38
1972a83K82j5j70J72p2j50J99l2j21K18n5k43J90Jj15K56r6k32K03Qj96K64Pk37
1996a17J84l1k48L16R3l18J69L8k97K76J51l66J57J76l84J26K80k79O4J95l45
2017a60J3L25k19l0K16k17m2K22j75J4K12j90q4J73j35O7J86k38l5J90j92J6K43
2040A60j86k6K10l01j7L56j89q2K41k78p3L72j94j18L49k12k56L46q7j44L74j63
$$ plain form
1880 -16 -19 121 33 -73 1 -30 -32 101 -4 -55 91 -33 -138 79 75 -61 73 -22 -173 54 103 -100 33 62 -138
1905 -138 -19 51 -82 56 101 -138 -80 52 -49 40 69 -117 -25 60 -89 4 113 -30 -13 10 -121 28 129
1928 129 -47 -2 60 -122 28 130 -85 27 171 -152 -85 157 -43 4 184 -103 -136 163 -14 -87 161 -10
1950 -10 -129 61 -54 -72 174 19 -133 43 -42 -78 152 -7 -115 102 -35 -162 94 65 -80 90 -45 -183
1972 -183 99 84 -86 86 14 -136 63 31 -90 128 73 -170 20 21 -94 162 66 -166 37 45 -151 113 120 -117
1996 -117 67 36 -212 104 197 -121 48 86 -211 65 216 -150 7 183 -201 -75 205 -74 -10 185 -160
2017 -160 -147 178 -41 -71 145 -72 -114 108 -67 -53 159 -31 -115 58 -77 -10 176 -62 -97 93 -99 -83 160
2040 160 -26 -52 158 -143 -160 196 7 -75 166 -112 -185 187 -7 -125 224 12 -244 102 15 -129 245 82
2062H2l40L47l0k39L32k5l09K68l4k98L53P9l33J73L9k64K54J12l25J59J07k65
2084a57J48J20k21J28N7k54J56J47k00J10K6k25J96Q8k35J71Q3l10J59J11k59
2105a61K43J51m19J18K13l38J82K78l85O4K63m15M1M47l00p1L04l58p8M52k16
2126A5j44L42k31k11L30r1j30L25j61k43K57l5j22K18j05j51K14q2j21K29r7j21
2148a15J89j12r1K79j52j72K71r5j54L10j26k21L34j11k53L40nk74K86n7l42L48
2170G7R4l49K63R4m00K06J51l21K47J87m06O9K16k63J23K28l14L1K01k69L9K78
2192A82k12j4J46k36L8K43j77k8J51j70nJ87j69K4J78k27l3K13j58L6J79k45k1
2215a18K53j96l8K66k11o9K61k06r1L55j75k06L01j32j64L46j18k23K90o4k54
$$ plain form
2062 82 -258 89 59 -180 152 127 -182 86 52 -246 107 186 -147 26 65 -199 55 167 -158 1 108 -157
2084 -157 -9 111 -110 18 75 -179 -23 124 -76 34 60 -165 31 119 -116 55 138 -172 -13 98 -161
2105 -161 82 233 -186 -68 145 -193 -11 267 -118 -54 209 -206 -165 282 -18 -89 215 -143 -221 231 15
2126 15 -129 213 -18 -229 101 10 -120 205 44 -199 58 23 -99 119 14 -137 77 -5 -126 103 6 -115
2148 -115 74 -38 -129 150 -2 -174 97 2 -152 158 32 -189 145 34 -219 121 116 -158 128 71 -271 77
2170 77 171 -178 85 179 -221 -15 136 -185 62 249 -157 -88 128 -135 -12 216 -98 -67 134 -135 -96 182
2192 182 -30 -44 102 -134 -96 147 -30 -58 93 -77 -82 105 -64 -40 138 -89 -122 91 -67 -31 148 -97 -118
2215 -118 135 -61 -99 167 -44 -113 148 -58 -149 206 31 -175 126 -6 -170 176 58 -165 125 61 -193
2236a93K74L1k18K09l3k59K36Q2k38J59N1k28J23Q7j90J46Q4k10M0R8j26J16O7
2259A08j87O3O9j53J03R8j77Q0N2k03J35J42k00M0J06j98Q5J74k00L6J60k17j2
2282i6J84j25J8J50k06m6K22j03n6J75j37p7J86r4o8K04r6j38J55o2n8J72p7j07
2306h0J46m4j14J46j7j04J28m0j34J42L5j23R2jj08P4J1r5J23K9j27M0J2p3J40
2331E8Qj37P4L7j24R1P1j45Q7L9j53Q6J20j59J4Q1j11L8J49j54l5J23p9j1J33
2356A01p9m3P1r5oJ32k5o4K7n3rR9m2k3P0n8m4N4l9j2J04n9o4R2n2o5R1kk0R3
2386H0p0j28R0L5j8N7rj04M2K1n2Q3L6r3K7mm9Q5Rr2M4N8o3L2%q0N8P6p6J2N1
2417E8r7j1O8pM0L1r9o3P6J8LL4n4mJ7m0J4N1k7kJ3n5K2L2n4KQ9l5l2Qo0J3J02
$$ plain form
2236 -193 81 112 -106 103 70 -189 47 129 -109 50 101 -127 -4 83 -107 39 123 -87 -47 51 -75 41 108
2259 108 -79 -16 53 -100 3 101 -76 4 56 -147 -12 130 -70 -30 76 -122 -37 137 -63 -27 133 -84 -96
2282 -96 88 -37 -19 131 -75 -121 101 -2 -58 117 -20 -97 89 -5 -73 131 35 -103 52 -10 -68 104 27 -80
2306 -80 66 22 -92 54 37 -67 61 21 -113 29 64 -59 33 32 -76 -2 9 -86 37 66 -61 -21 -9 -82 58
2331 58 66 -71 3 40 -84 7 78 -67 20 59 -94 -8 112 -47 -33 48 -63 -25 124 -30 -65 58 -21 -32 101
2356 101 22 -21 50 -45 -51 81 56 -8 19 -34 -43 56 14 -9 61 3 -41 13 -26 -38 66 7 -57 35 -17 -82 9 7 -13 80
2386 80 10 -118 -28 7 -11 46 37 -67 -25 -4 -56 27 63 -30 -3 -7 -56 29 38 -54 -10 48 -15 17 17 -63 -5 71 -5 7 58
2417 58 -39 -50 18 11 51 82 -17 -80 -4 14 17 51 -3 -7 10 -30 -16 35 8 6 19 -36 -14 18 -36 -34 55 20 -12 -4 -64 -51 51
2450E1k7m5K2k9l5P8J0k1L9l9p1N4O0k5kk7qL6J4m9K5mmK6j2j3J7k0k9N0K5k8
2482A9jm2k0N9L8n9oJ9l7L0Qj5J9Nl4jK8j5K3k5k0K9J6n1oK8j0K8On8J7N0n0J0
2516a8K8j1k1J0rlN4j2m7RK8Pj5nKR%Pj9pN0k3m4M1J9m6L1J1m2K5K5o0JO4m3l2
2552c6M7j7KM1m0m5M1L1m4QK0k8J4j0jJ9Ll2rK4J5J8l0k0J3J3J9j9omK2k9JL7
2586A8j9k2LlJ7N2l0m0J9J8RLk1k0M2j3l2M6k0m1M3Nl1O5j5r2K4P6l5%J3n2JP2
2620D0l5m1M6j7m4L8L6j7j9j5%K1L9ko3pM8J5k2K6k4n1M8J0k4L8J1q8QQ9k6pK0
2653C1o2LQ7k3n8L9j7l1O1jn1M4j5l5M0L6m8j8mON4J0n0k3OQL6ol4Oj2k0N6K1
2687C6l5j9j1j8O1L3n5k7J2PL7Ml1Nqj0J8L1l3%kk3M1N9q0k8M9l2L3M5p5j6O0
$$ plain form
2450 51 24 -21 1 -28 -63 15 25 4 43 4 -67 -13 47 22 20 -7 -15 21 35 -14 11 7 3 29 17 4 21 1 -28 22 47 19
2482 19 18 -24 -44 15 53 -6 -12 7 -30 0 8 -7 12 17 -17 -18 10 -5 18 -7 -27 2 18 -33 -39 -11 -21 7 13 -45 -28 22 -28 -18
2516 -18 10 -1 -22 -12 -21 -24 30 18 -29 -20 8 15 0 -5 -3 6 6 13 -6 -13 37 14 -30 11 30 -16 15 26 -16 9 34 -26 -25 39 -4 -36
2552 -36 11 -6 -4 37 -3 -48 -7 24 -20 -12 8 -20 -6 -16 -17 2 5 -27 -36 -12 3 21 -9 -29 -16 -3 16 -3 -9 -13 9 -20 -19 18
2586 18 -1 -23 -20 -23 -6 46 16 -24 -5 13 22 25 4 -16 26 13 -19 27 7 -34 9 14 -17 48 33 -59 -35 41 6 6 19 -33 -32 40
2620 40 5 -36 10 -7 -51 -13 23 6 -13 -28 -28 -7 32 30 -33 -40 8 23 1 27 3 -48 0 10 -14 24 35 -53 -45 44 18 11 31
2653 31 -31 -28 59 36 -22 17 0 -31 30 29 -22 22 7 -28 12 48 0 -18 -22 -16 38 48 -2 -25 -19 -11 25 19 -15 -9 -21 -41 15 36
2687 36 1 -18 -29 -47 14 47 -8 -35 -23 -16 21 25 -6 -1 -9 -19 -1 30 -3 -3 -5 -28 13 72 -8 -36 13 -19 14 59 -16 -32 28
2720B8j2l9N9np4M6K3l0K9Np5K4M9j1Klm7OM3p%Pl6KNJ2K5rm2rK6J9K0j8n5L5
2756gK6k6L0J3m6KK3l5K5M3n9k0P3l8LL5m5mN5k4m1L6lj5L1nm4O1l0m2N9Mm6K1
2790A0j3m5Q0K2p4J2K3m6L9L7n9KK9n4J4M0pjk3l3L5L7k7jKk6K2K0l4K9J3m9q
2823c4O2l7K7K0p3J9O2o3J1Q5q7qN4n7%J01n9o0P8k0n1Q1k2m8M2jo0L6K8l2L9
2854C3k9n0P0Qn2L2K1o3L7Pn9O3K3o3jJ8k7N1j0k4K0on1M8J2l1O0l4o2P2K6o1
2886b2K8K9q8M9M1p3N8M5j09K4O9n4L2M4j18kJ26o4l3P9p1m5R4k2k9P7l8q3N2
2915dJ8qM2m9k4K5j8j0M6k4rO1n9m2O6k6j3O9l0k6L6n2k0Q6Nn1L5m4m3J12j2o1
2947b4N6j7p4O8L5p7O1jp7P1M1p8K2J0m6O2N0r9J7L4p9O8O1p3k6K6p9M3R3l4m2
$$ plain form
2720 28 16 -23 36 31 -43 3 26 -4 25 30 -45 -21 28 17 19 16 -31 -25 18 11 11 18 -18 -16 -11 1 26 17 -25 -34 -8 11 31 13 -42 -7
2756 -7 19 -7 23 36 -10 -8 15 -20 5 48 -11 -31 42 4 7 42 -3 -7 48 24 -17 19 16 1 32 27 -17 44 14 -28 31 35 -11 10
2790 10 -3 -48 32 54 -20 -8 15 -31 8 45 -14 -12 17 -37 -23 17 10 9 -14 -47 -12 25 -2 -3 -1 -27 -5 15 -19 10 23 -26 -34
2823 -34 28 -9 18 38 -35 -16 46 -17 -6 79 -8 -16 38 -19 -19 82 23 -37 41 21 -30 51 29 -19 23 22 -38 -2 26 -6 33
2854 33 4 -46 24 32 -20 12 33 -30 7 14 -45 18 41 -22 -23 -5 -32 19 9 -15 5 -1 -52 -4 8 -23 37 3 -59 13 39 -22
2886 -22 6 35 -53 -4 37 -36 22 67 -42 -18 51 -3 29 73 -45 -47 79 15 -18 61 -10 -55 39 17 -12 65 27 -56 -4
2915 -4 14 6 48 -1 -25 0 -18 -28 18 -6 -15 46 -13 -55 11 -15 -28 41 11 -15 21 -31 -51 35 40 -11 24 -20 -63 49 37 -24
2947 -24 32 15 -59 9 44 -33 28 27 -50 21 62 -16 6 16 -30 32 82 -17 0 34 -45 23 84 11 -15 11 -68 -25 68 34 -8
2978hJ0m1J1M5j0j4L0m2jL2o7M5M4o1J6N8q4j4P3m6L7O1r5m4N2lJ0Q7p1n1N8o1
3010d4lJ18l0p3N3l1l0J00j2r8P1K1n7M3oo4N1Mk0N1j5p7M0OrP0j9q4J8L0k8L4
3042A0K7p5L7Pm4L1L5m6K2Ln5M9Lo4N0N4o8K9J7r4N3P5m6j2L4p5mP4l0J6L9q1
3074b9j4P3k6J5L3o9j3P2l6l0N3m5j6P5l6k7N4l3l4N2kk0K6m5oN3k6k5M5k5l0
3105c6N7l0m2P1j6n8M6J2l9M6j5l2N4Jn9M4Ol9N1Jp5N2M2p2L1M6q1K6M2o0K6M9
3137D9n2j3L5j9J6J7m1K3J7n0J7Lj3J9J8n3L1K6n6K0N0n7%M4n0LN2l3k6L5l0j1
3169b9P1o1qN7l8j7L6mk1K9k1k7N7k0l8N4j3j2L8l5l5N1Kl6O1k3n1N2km0M9K1
3201D7p4L5K8l6J5Pn0K9K3k7J1jl1M1Ll5L6Kn5L1K8m4L4J3q8L9N5n7J2L3n8K0
$$ plain form
2978 -8 2 -39 -28 17 7 -7 23 -19 -20 12 -55 -10 34 -27 -11 47 -37 -51 22 -24 13 74 -21 -65 -13 -16 -6 81 10 -41 17 -44
3010 -44 -47 71 41 -32 21 -10 -40 60 48 -50 21 42 -15 28 22 -42 9 13 -7 44 29 -48 -8 -2 -11 59 40 -44 -26 4 -24 10
3042 10 37 -38 -1 6 -38 -7 28 -18 4 7 -48 1 4 -60 -10 44 -24 5 22 -72 -19 56 10 -2 32 -43 -47 27 -3 13 52 -29
3074 -29 -43 30 4 19 52 -17 -30 42 6 -24 29 -16 -32 43 7 -20 34 1 -33 19 17 -3 23 -22 -28 25 -1 -26 19 -6 -36
3105 -36 21 -9 -51 20 4 -54 -8 4 -35 11 -4 -36 18 19 -40 4 10 -29 22 23 -52 0 42 -30 1 47 -34 -8 34 -26 0 49
3137 49 -3 -16 19 0 16 33 -8 15 32 -18 -1 2 -11 8 26 -27 4 30 -26 -6 44 -13 -13 31 -19 -16 36 3 -23 12 -18 -29
3169 -29 42 -19 -27 30 -8 -25 11 7 -14 15 -6 -33 24 4 -34 20 7 -5 33 -2 -37 14 16 -20 41 18 -33 19 17 -23 26 47
3201 47 -27 8 36 0 15 22 -28 1 24 -3 8 7 -24 17 20 -15 21 23 -32 -1 27 -17 17 30 -58 -19 36 -21 -9 24 -34 -14
3233a4M1n7QO1n8pN3m0oN5n0k1O3j3l0K5l2J4M0k1lK9n0J3M3l4pL9n3oO5l6k6
3266a5M3k0l7Q3k6n3M1Qm6L6J5m6K9j2l7M3J4o4M7j4j9N8j0o6M0Kk3L9mm6M2O
3298Hm5M1L3n1PJ0l7L8K8o5J3L5l1K4K0l2NK5k7J5Qk0J2J0m3K9J5m2K9J5l8J0
3330aL0m4PM6m2j0M4l5j6L6j1k7K6Mm6M1j3JJ0k1KJ8j0MO%k8L4j0qM0l3k4M9j1
3365Hk2M2k5k6M4pm1M2Rl6M1j9k9L8J4n1K3J5l2L0J3k1pJ6k7J5Rj7J5Pl4K9Ol6
3399a4K6Qm1K2Mk6J5J8l3J1J2j7Rjk0J2J0nljk3K6J7l0J3K2k2JK6k3kL0k2j6N3
3434C6l3nK0qMJ4j8j8L6j0k2K7j4j9L3k9lK5Ll1MQ%J5oj8K7pj8J9j3j7L1k3j6
3469b6M3k5k3L1Lk2K8rk7K1J4k2J4ok6L8J4l9K7Ml1K6Kj8K4J0n7M3K2l2JK0l5
$$ plain form
3233 -14 27 -30 -22 39 -19 -26 27 -13 -19 36 -14 -35 28 15 -15 10 -22 -8 32 11 8 37 -13 0 43 9 2 41 -12 -18 47 11 -15
3266 -15 28 8 -29 54 28 -25 16 24 -22 14 29 -17 12 0 -37 6 20 -44 3 -11 -30 28 18 -48 -8 -6 -29 10 6 -40 2 8
3298 8 -37 4 37 -14 -7 3 -34 4 32 -33 -20 15 -16 8 28 -4 1 26 -1 14 22 2 14 24 -19 10 25 -17 12 27 -11 -1
3330 -1 29 -15 -8 38 -4 -14 30 -5 -21 15 4 -23 3 7 -39 2 -11 -10 0 -21 -19 -1 -11 -7 -1 -1 -29 5 -5 -13 27 -6 -30 19 8
3365 8 -14 28 3 -23 21 14 -27 15 24 -12 29 10 -19 19 33 -18 5 20 -12 18 31 10 3 19 -8 7 16 -1 14 21 -13 16 22 -14
3399 -14 12 20 -21 1 5 -21 -6 12 -21 -10 2 -15 -6 -7 -27 -15 -5 -10 -13 -14 -37 -11 6 -24 -11 11 -11 -10 16 -7 -9 21 -1 -17 36
3434 36 3 -2 18 10 14 28 10 -8 28 18 -4 23 9 -10 23 -6 -9 16 19 -12 -8 0 0 15 9 -9 18 11 -7 12 -1 -18 13 -10 -26
3469 -26 17 -8 -31 0 3 -19 9 0 -27 -6 8 -14 0 -6 -32 6 20 -19 8 12 -19 7 9 -9 15 25 -32 11 33 1 2 22 -13
3502a3J9K6l9K2J0l2J4qnPJ4k4oK9k6OK3m1K3J0k8QK1k1%K3m0J7K9m4QM2l0k2
3536b8L8j9j4M8j9l4K4MnJ9lk3K3ml6N4lk4J5lk3K9J2k8QJ6j5J1Jk6KJ5qJ1Pl7
3572a5K5Jk6L5J1l5OJ0j6RMk2%J8k8K0Pk4J6Rj7KK2m6K0M1m0oM6m6j0N8k6k3M7
3607B7k4l4M4nj7L2j0k4QJ5oJ0nj8RRj3J2LpPPj9J3Kj7K8k2%Lqj3K9oj4OOk6J6
3646bK0l6NK2k8J4K5j2k0J0j8J7Rk1J2oLJ7kj3%K5l2KL5k6qK6pj4K1Nk7RklMJ0
3684A4j7J4Lp%k0%K1J4k0JjoMlJ2nj4mJ6oj2J6j4oJ1jj3K0pj9K9J1l0J3Pk0rL7
3723Ik2LK4k2JkPNK6j8lJ2k5PK5mk4J1j2j6L0K5l6NNj5J5J0j2poNKqJ2Oj7M%j7
3763a7kL4j2l0J8LrJ1oJMqpK5mj4J6jk5K2Jj2J4Ok7NJ7JJJ3j5j3K7Nk3J6lrMm
$$ plain form
3502 -13 6 32 -7 15 25 -7 7 -1 -6 1 15 -9 -15 14 -12 -6 17 -24 -1 9 -19 -11 10 -11 -11 12 -28 -11 18 -26 -18 24 -6 -28
3536 -28 10 -9 -23 25 6 -28 -4 0 -5 14 11 -12 11 7 -29 25 22 -2 13 10 -13 16 28 0 8 24 9 20 21 -5 -3 12 4 15 22 -15
3572 -15 10 11 -15 20 31 -4 2 12 -4 5 9 -13 -13 5 -23 -3 4 -20 -4 5 -12 -10 12 -34 -14 27 -13 -19 27 -19 -29 29 3 -20 27
3607 27 3 -31 13 8 -9 23 13 -11 -3 12 6 16 11 -7 2 11 -2 10 13 6 13 20 1 14 16 -1 27 5 5 8 0 -13 16 10 -4 2 8 -18 -2
3646 -2 18 -18 -13 9 -19 -5 20 8 -12 -2 -20 -3 6 -15 -3 -9 -6 11 9 -4 -4 21 -11 -9 26 0 -8 18 11 -3 18 23 -4 5 3 0 4 14
3684 14 -3 11 14 7 7 -13 -13 8 22 2 3 2 -4 0 -3 9 4 -10 -14 2 -4 -16 0 -14 -20 -9 -10 -23 -3 -10 -29 0 11 -19 -6 1 -19 -28 9
3723 9 -13 -10 14 -8 -7 -9 -2 3 29 11 8 20 -5 2 27 23 -1 10 -2 -18 12 37 1 6 11 -4 11 21 9 2 -4 1 3 -5 7 13 -4 0 0 -17
3763 -17 -19 15 3 -27 -9 -6 -15 -4 -10 -9 -5 -13 -20 5 1 -13 3 2 -23 -1 0 -12 2 8 -19 -14 3 4 5 18 3 -10 17 22 -1 15 12 3 7 3
3803CjK7j3k4RqK0koj1Oqj2L4mqPj6nJ5j1lK3k7JK8j3j0K4qj9Qkj2K7Ml5L3Jl0
3843a8J5Qj3MJ5j7mK0nj2J5NjJ4j8%Kj2J4LRJj6mjJ3pPRk5Oj2J1Pomlj4RQPj0
3885@Mj1j1lK5Jj0Rk4NJ6Jk7M0k5ONj4MJ3qmJ8j4pMQj8L2Mj3j2PqK0lj7RoJ5j7
3926fQOKkJ1j1qj1J5PQnj5rrJ2J4mNj7n%oJ3Rk9J6LJJ0kj5nJ9j4KJ6%j2J6%rJ0
3969IMk2K5lqJJj5J4J3j0rlJJ2koNokJ6jLkj5pK7Jj2lj1JK9j7j7J3%k3J9JnrL
4012a0rJ2J5pj6mPQJ0Mj7jRj3J3kknkL3k0j0K4rpJ7Kk9J3J5rj0J8j1nKoQJ9j7
4052HolkJ5J0k6MMnRjk0pK6j8KK4j1j5J1%j3K9j7j7J0K0k3J2kooQQj3K7prPkM
4093InrJ9rLkpMK9k5j3J7J1l9L4J3m1J4J5m0K4K4l7j0L7j8j2L0nl9K8Nk3J5pJ
$$ plain form
3803 3 2 29 16 -8 1 -7 13 11 5 -6 0 -8 -20 14 10 2 9 -7 -12 3 -8 -11 12 -15 -14 14 1 -9 15 7 -12 -4 -6 -18 9 13 -22 11 12 -18
3843 -18 -3 5 -8 -4 11 -6 -10 10 5 -7 8 13 12 26 8 8 10 -2 12 15 24 25 9 5 4 17 10 17 26 1 7 -5 6 13 7 3 0 -14 -5 3 10 0
3885 0 4 -7 -18 -21 4 5 -5 4 -20 -15 1 2 -25 15 -10 -4 1 -13 -9 4 -4 -8 10 -4 -11 -7 1 -17 15 19 6 -6 1 -7 13 10 -7 2 -4 11 -6
3926 -6 2 8 10 8 19 8 0 -11 4 11 19 14 -1 -10 -19 -7 7 3 8 -9 -14 -14 -20 -7 2 -27 -11 -8 -7 3 1 -14 -19 0 -14 -12 4 4 -8 8 8 -1 9
3969 9 13 -9 16 13 5 6 7 -8 6 19 9 0 -3 -2 10 8 2 7 1 -1 15 14 17 15 0 -7 20 21 9 6 -5 -4 25 8 -9 4 4 -19 0 1 -4 -13 -10
4012 -10 -19 -7 8 1 -15 -19 -12 -4 6 10 -7 -8 1 -12 1 -1 -3 -8 -10 23 3 -7 17 8 1 18 20 -9 4 19 10 0 18 7 2 4 -2 6 25 8
4052 8 2 -1 -3 12 22 -4 0 4 -1 8 7 -13 -20 6 -12 -10 14 3 -12 -1 -1 -14 15 -2 -19 -9 11 -12 0 -2 -8 -14 -6 2 -11 16 9 0 7 5 9
4093 9 4 -5 14 5 8 6 -1 3 32 7 -6 11 22 -17 17 30 -11 3 18 -22 2 26 -11 -21 16 -2 -14 16 11 -28 0 5 -18 -3 -10 -9
4129iJ4j5pJ9j0LNk0J4J7l7LJ6KnOj0j0L7lk2J4Mj5K1MqL%kJ3lqooLK1j1rJ2j8
4170cMK9k8rL2j3l2K3K0m2J6K6m0J7J7m3J3K2j9kJ9j7j3M1j6pLMk2J0LNK0l4J2
4205dNNOPk7LK3m6L8Rk5lK3j1oK6k8j4K7Ok4J9oJMJ3j1%klJ6j0j5J8%j6Qj5kJ9
4245Hk2j4M3k2j4K3Pk2LK6l2JK6k1mL1j4qRj8J0RrJ%RLmjJ4j1KpRj2J0Rl0K4O
4285A8rj1L0k7MJ9j5qK8j0l1K1LqK0k9j2QkqNK1j1nrqJ7lmkKMJ1prJ4Ql3K1Oj6
4326a7K1Jk7L4Lk3NOJJ2pk0J7PljlnL0k1mJPk1J4J0rOppj1L2j1Jj5lRJ9l4lPk
4368a1K%N%ojJ0OrpOj1J3J6l1oK5j9kL2j4kJ9k9qM2j2j2J9j0rJ8Lk7J1J3Mlj0
4407EmM%kJ3pj3%NJ1J1k0mrJ4Rj0pKMNkmQj5JPrJ2Kk2J2Rj3Qj9%J1J5lKpkjlJ1
$$ plain form
4129 -9 5 -10 -17 2 -8 -5 0 -20 -6 11 -26 -23 -7 -5 -10 -4 -14 -24 13 10 -12 2 6 -9 12 16 8 11 11 9 22 19 11 5 -1 2 23 12 3 15 -3
4170 -3 1 30 2 -7 25 12 -20 3 23 -19 -3 23 -17 0 17 -26 -13 9 -10 -12 7 -10 -23 18 2 -5 -2 2 -20 -10 -7 -2 18 -16 -4
4205 -4 1 6 12 19 -8 -5 18 -28 10 19 -6 -9 14 3 -3 23 -5 -19 8 14 -10 9 3 4 8 21 10 10 8 5 21 11 -4 14 14 -2 6 -9 -11 8
4245 8 -14 -28 15 -7 -21 2 9 -13 -10 16 -16 -15 11 -10 -14 17 3 -5 4 -14 -4 5 -4 -3 -3 6 9 5 4 18 7 9 2 11 -1 9 18 -12 12 18
4285 18 9 -2 28 1 5 24 9 1 29 19 -12 9 12 4 24 -5 -17 -9 -11 -19 -14 7 -4 -9 -18 -26 -9 -12 -16 -18 -16 -12 -1 -8 -17 -3 5 -28 -7 -1 -17
4326 -17 4 5 -22 12 15 -8 -3 3 4 16 9 -11 6 13 10 9 6 1 31 10 6 7 14 -7 7 17 8 14 7 0 -11 21 10 11 -4 -7 2 21 -13 -16 -9 -11
4368 -11 -9 -9 -4 -4 -10 -11 -1 5 -4 -11 -5 -16 -3 13 -18 -24 1 -18 -20 12 -2 -4 15 -14 -22 20 8 -4 15 5 -4 14 17 -10 1 14 18 15 5
4407 5 1 5 5 3 16 9 -4 -4 1 12 23 3 -1 -10 4 13 3 -4 -2 2 7 5 1 9 -6 -5 2 -7 5 7 -15 -3 6 -7 1 -18 -18 -7 8 5 7 0 -2 -3 -6 5
4453EJJ6k8LL5j8oqJ2kJ4olj1J4joNj6J9j4NO%qrj0J2J0j3pkKRmj0NRkj3QLrJ1
4497bj0J0J4j7j5NJ6MlmJkPj1NJ4oLj3lJ2%nqK4kO%j8PK0qj3jMjMnmJ0j5m%Pm
4542apmKJ3rNJk0J8J1k4K2Kj3kJ0rQLk4jK3J4k5mRkJ8jorRj1J6%lNmLJlopRPJ2
4588B6pj5J0QnmJJ2qj2Njm%j8LJ2Qj1j7kK3jqMjJ3j5%OLj1Rj2JJ3jk0PJ4%OJr
4632CpK4kk0QJ2qJjJ6qrJLMopPNOj6p%J6j1J0j6kJ0qJJ3J1k1oj1J1NJ3j7jJ5j7
4675fj1J6jKNk0NPOorJ5%koRJ1kppJ8KNrqlJ2lqKLJ4k4J0LJOrj2%J6jmrJ4j1K
4722Fj1NJ5Kl1%J7mnnQJ0jJj8RRkpj0J9%k9J8pJ1jQnMK0j9j3LJ4moRrRJqJ0Lr
4767Gj1J4QQj4ooQKj0PMLrqRMpoj1RM%j0JMQpKjKPj7nK4jj1j8J2J0ljrQMJlJ0
$$ plain form
4453 5 6 22 -6 -3 32 14 8 0 12 10 24 18 15 4 18 17 11 16 0 19 5 10 16 16 8 -1 -11 1 11 -2 -9 -11 -9 0 -4 -14 -9 0 -2 -15 -7 -4 -13 -2
4497 -2 -12 -2 12 -5 -20 -15 1 5 2 -2 -1 -3 4 -7 -2 12 6 9 -4 -7 5 5 0 -8 16 14 20 20 2 9 29 21 8 7 11 10 14 9 5 15 0 -4 -4 3 -1
4542 -1 -8 -12 -10 3 -6 -1 0 -20 -2 9 -15 7 9 -4 -6 4 -5 3 6 -18 -19 4 18 -7 -11 -2 -4 14 13 7 -2 7 -4 12 12 9 14 10 13 14 11 5 -2 7 14 26
4588 26 19 4 14 22 17 13 14 26 18 6 11 10 6 6 -12 -9 3 11 0 -17 -19 4 3 -5 -1 -2 11 -4 -4 2 5 -6 3 -9 -8 5 4 -16 -9 5 5 11 12 3
4632 3 -4 20 18 -2 6 18 10 11 10 26 18 9 10 13 17 11 4 11 16 22 6 -1 -1 15 4 14 -2 -4 6 -2 -1 12 23 2 -4 -15 -4 1 14 -3 -4 11 -6
4675 -6 -17 -1 -2 0 5 -15 -10 -3 3 -3 -12 3 3 1 -5 4 15 13 6 -1 17 19 24 15 7 4 16 13 5 7 10 24 0 10 13 14 20 11 -1 -1 15 14 10 1 15 4 6
4722 6 -5 0 15 17 -14 -14 3 -1 -6 -11 -3 7 6 7 -11 -2 7 5 -2 -12 7 7 -22 -4 -11 0 -1 7 2 6 26 7 -6 -3 11 7 1 10 1 10 11 3 13 16 7
4767 7 -4 10 18 26 12 6 0 8 10 0 7 11 14 5 -3 6 10 3 -3 -14 -5 -1 -1 -11 -10 -6 2 -5 -3 -4 -2 5 -12 -17 7 6 -5 -23 -11 -1 -4 -5 -14 -6 -2 -1 -4 6
4815F%lJj0J3JJMJmNrMOmJ2qn%Rj3rK0j2nqKJ6njj7J2QNk0MoK0j5k%J0Pj5j8K4
4861BmLpjJ3%lj2J2J5r%j0nJ9%j0NOj1Pj0QnKKj4J3K9k5OmkQj2rJ0%kLj7J8j2
4904comkJ5JokKojRooJ5j0lLKNk5J1J2RnKLlNk1K1J4qOl0J6NmlkJ8ojj5PJ3Oj3
4951IJMJ2j1jrRJj5oJ6Mj0j6OPkJ2k5JK1opKj1Rkj2J3%KMj3PRloNMNNj1N%Jjl
4998DjK2k6J2%pJ1j1K%J4j2j4oJ5LLoM%oj4QPRKj9OJ1lj9J7j2J0jlLMKj2oLJ0
5041DJk0MPNpjKK8l2KjJ6JlkjRJ5j6MmJ6j6rJQJ4k3JPoNnpJ3KqpOMJj3JKLJ0k9
5089a8jJ9JqpJ0JolmK1pj2OqK1j2jpK0jj0pJ4NJoj2J5J8nk7JJ3J6j4MLJ5j9Nj3
5131AJ6Kj2%PMnmj5qK2lk4K0J7mj9KLR%j5oJ9kokJJ5j9%lJ3KrnKJ3OrqjPRk1M
$$ plain form
4815 6 6 3 4 -6 7 8 9 13 14 10 15 6 10 16 12 24 16 11 11 20 7 -2 18 6 1 -7 -5 11 6 5 -12 0 8 13 -7 -3 -9 11 -4 -6 -6 4 11 -4 -22 2
4861 2 -2 1 -6 -7 6 6 3 -9 3 18 9 9 -1 -6 13 13 3 8 14 3 10 0 8 3 5 7 -7 6 35 10 16 12 10 18 6 -3 7 7 5 8 -9 9 -3
4904 -3 -9 -13 -15 0 1 -5 -7 -5 -11 -12 -3 -9 -15 0 -10 -13 -10 -8 -3 -28 -17 -5 4 -1 1 4 1 6 -15 6 20 12 18 -12 4 9 5 2 0 18 12 11 -4 3 16 22 9
4951 9 10 14 26 15 14 5 14 15 0 -6 10 14 4 -12 -6 1 -1 11 -14 -13 8 2 -5 -3 -14 -5 -7 -19 -6 -6 -4 0 -13 -6 3 0 -6 -1 3 8 13 2 7 7 8 7 4
4998 4 3 25 -1 11 11 4 15 4 6 6 20 8 -6 -12 3 6 9 3 7 7 1 -13 -5 2 11 13 -6 0 11 8 -11 6 -6 4 3 0 3 7 9 -3 -9 -6 4
5041 4 5 -15 -11 -4 1 -6 -7 -5 23 -9 -7 -8 8 9 6 4 3 12 27 11 15 11 27 11 2 3 11 25 2 3 10 4 9 4 -3 10 12 4 -3 3 7 8 -5 -4 -2 1 11 -18
5089 -18 -19 0 1 -7 -14 -4 -3 -9 -12 -16 5 -2 -14 -8 -16 5 -7 -8 -15 5 4 -6 -13 1 6 7 1 -11 4 22 17 -10 -9 4 20 6 10 13 28 9 14 1
5131 1 17 19 7 7 14 18 13 9 -6 -14 8 5 -19 1 18 14 -5 -3 0 9 9 -6 -12 7 5 -1 -3 -2 13 -6 -6 -9 4 6 -3 -8 -6 7 13 4 -4 -5 2 11 -10 -6
5177fK3Kqj8J8J1j6mPJ0mjmkJ4lj8KJ4Pj2j7PJ7kk7%NJ1j0Lj1J8lrj7J4J2rrM
5218a1mJ7kmlJ9qj5PN%J1j5LLJ2lj7J1J8j5lnjNkj1JK8pMk0J7Rj1j6OK7k6koJ1
5260GJ4k8%OJ3mj4qJ2MPk0ROMk0pNJ6j1nj0J7Nmk0K2J0j0pPMJ4j1mKQjpQpJ2m
5303A0pOLJ3nrNj0JJ%qJ3Kj1JJKlj1J2J9j3j0kJ0Jk1J1nJ1Llk0J6l%j2kJ9Lk0
5345a2KQKqJJQpRpJ2lQpJLRj2jNjJ5k0KJ2OrJj2PNj5Mj1K8j5j8J4rJ0oNj3K3j2
5390Cj4MMJ2rkj0J3krnJLQlmQRj8RqJ0J1k1J3JRrKLJ0%nqQLkj1kJ9mJj4ORj0L
5437A2k3K0Lqj0RkPj3MJJ5j1q%J4qqJ1jJ0j7%j0J0J2j7NqJ3qjKOlPkj1K1pLj6
5479gJ1ljNnJ0J0j0j1J2mNljRKqoJ0Lj3qJJPj6KJ0J3j4llkJ4mrkRPj6lJ1j1J2
$$ plain form
5177 -6 17 19 11 -7 11 22 6 2 9 19 15 14 10 8 22 19 1 3 17 24 12 -5 2 19 17 -10 -10 -5 6 -4 -1 -12 6 3 -6 -23 -9 3 -6 -15 -11
5218 -11 -15 2 0 -4 -7 12 4 -11 -4 1 1 12 -3 0 3 15 12 -5 6 24 9 6 1 0 5 3 -8 -7 21 14 18 -2 15 24 13 -3 3 30 4 2 -4 7
5260 7 21 -7 -7 -1 12 8 -6 -14 -2 2 9 -11 -2 4 8 -12 -19 -14 2 -9 -14 -24 -7 -2 -6 -26 -4 6 -4 -11 -4 0 14 3 -1 1 9 8 1 9 2 14 10
5303 10 3 9 12 25 20 11 16 6 7 8 8 0 13 15 4 5 6 8 5 -6 6 25 12 2 0 10 11 -10 1 -4 7 10 7 -13 3 0 0 -12 -14 5 8 -12
5345 -12 -10 -2 0 -8 -7 -6 2 -5 4 -3 9 6 14 7 8 11 20 8 7 12 11 26 6 8 20 26 17 18 6 13 18 3 7 -4 24 9 -9 5 -4 6 0 5 -8 15 3
5390 3 -11 -7 -3 9 0 -2 -12 1 -1 -10 -15 -14 -11 -3 -6 -10 -2 7 -11 -2 -10 0 11 -10 3 4 13 4 6 9 19 19 14 6 14 17 15 4 2 21 17 18 4 10 19 9 12
5437 12 -11 9 12 4 -6 3 1 8 -5 -1 0 15 4 -4 -4 10 2 -6 5 4 14 -3 -3 -13 -3 9 -8 -3 -11 2 -6 -7 -5 1 -2 5 3 -8 13 6 9 -7
5479 -7 4 1 0 5 0 10 20 10 -1 11 7 12 9 8 17 19 11 5 15 18 5 -3 -2 -1 6 -10 -8 2 15 1 -2 -5 -7 7 3 -6 -8 1 8 -8 -11 0 -11 1
5523Aj7rK0N%rNkK4j7j1K2Mj3PqL%kj7L0kJ4k0OqRp%%MnLMlK%oJLnj4NQKj2K%
5571cPJ6j4j4J3nkk0OJ5j4KmRJMJpJ5QKk4J6J5k1kj6J5J2mllPOnj3NJ0j0knJ8
5613A2jj5LkK3mj9MpJ3lq%NJ%j7LJ4LJk1J7Jpp%RMoj9L0mpj4OJ4Mnj3J2JNpNP
5659A1Pj0j6J8KJ2j6oJ7mj0J5qNLj9mJ6JloJKJj1rJ1J0j4%J1mKLj9OLl%nlJ5j0
5702hnj1J7Nj7J7Jql%J5QojpPMmj2MJ2NqjjJ3Ok0%J5Rj0j3%N%nrJ4J2k4%LpKJ3
5748Goj1K3j3ojLOlj1OJ6j1pmQlJ0k1OJ7j4JMJ1j3K1k9J1J7j5OmMjJJOQj1J6j8
5790GoK3nnj4J4KnkpLPj2j0QkN%mKJ2mj3J0jj2Rj8MJ7Jk4J2%J5k0mJ3J5lj2JJ0
5833G%kj6J2PJ3k2OJ2j2JJkjJ7j9MRNpoMQOk5L%%J6k3jJ1Ojj8J5k0MNj0NPkj7
$$ plain form
5523 1 -16 -25 -5 0 0 -9 -4 -6 18 1 -10 12 16 3 10 2 5 5 3 -14 16 14 28 8 14 6 15 8 8 8 12 7 10 14 11 13 13 7 8 11 6 -8 -3 5 7 -5 -3 -3
5571 -3 4 20 6 -8 5 0 -2 -22 -16 -1 -15 -13 -17 -8 -7 -3 -2 -9 6 14 16 -8 8 23 2 0 -16 -1 11 7 4 1 8 14 9 -4 1 11 1 -1 -6 12
5613 12 11 -4 -1 -3 20 16 -3 1 -6 7 4 -4 -4 1 2 2 -15 -12 2 5 6 -15 2 3 -4 -11 -11 -2 2 -4 -23 7 3 -4 -18 -12 2 6 1 -12 0 1 6 -1 4 11
5659 11 18 8 -8 10 12 24 8 2 19 15 5 20 12 17 20 1 -3 13 14 11 5 6 8 9 -2 -11 0 10 -4 -4 7 3 5 8 -11 -5 -2 -5 -5 -10 -13 2 -8
5702 -8 -13 -24 -7 -2 -19 -2 -1 -9 -12 -12 3 11 5 4 -3 4 8 4 -8 -4 8 13 5 4 3 16 22 2 2 17 26 16 3 3 8 8 3 -6 8 20 -4 -4 -1 -8 -6 7
5748 7 1 -10 13 0 -6 -7 -4 2 -1 -12 -6 10 -1 -8 -12 -4 -7 3 -18 -12 5 -9 -8 -4 7 -6 15 -14 -3 14 -1 5 1 5 4 5 6 12 20 9 25 7
5790 7 1 24 19 14 0 14 16 11 9 2 5 12 0 -10 -2 -4 1 1 -3 -1 11 7 -6 4 3 -9 0 -18 -14 3 4 -20 -8 -8 7 -13 -17 -4 11 8 -4 -3 7
5833 7 7 5 -11 1 8 21 -1 5 17 5 6 7 5 4 21 2 6 15 20 13 7 11 19 25 0 3 3 3 19 -4 -5 6 12 11 -7 8 -12 -8 -3 -13 -8 -1 -3 -20
5877b0QJ1jj2OLoQoKOkj2J0j0J2J0j4MOOpmJ6Pj7kj1J2MMlj1J9Orj0LM%qkO%l
5922CmlJ7nj0Oj0K1j9Jj0OKKj6J1Pj0qkJ3Qj0j7J8J0kooJ4lJ0j2QlK0l6J4RMj5
5963cnJ8Okj3%NJ6jj6MNppoKJ8rqj0OJ4opJjMloKJ2j7NjJ1lj0JnK0prnnK3rqR
6011gmKpJ5kK0j8j0MK6pj2J0KnJ0j2j2K4JJj2J1j4Rj0MJKj4J1olOj1oJ3lqJ3q
6052frJ4pkJ0p%M%j2K0jj2pJ8pj3PPKlj0J6lLrLj0J7Oj4RkNMlkjJ4j6MJ5k0oJ2
6097HklPplQKookQlKk0J6k%j3LJ2rpLJJ1Lkj3%MJ4oPkjJ5oomqKKJ4Nj5J6j9OP
6146A1k4OK4qmj1J0J2pjpLPj4nQPojjOOpqoOJ1j9ljJ2KrmJJ4Jk0j0L1j0%nMJ0
6191Ak5J7LM%k%J3j2Rj8J2NJjqjPKj0%K2j2m%JlJ8j3j1JQJ0k0LJ1lpKjOj2Pj7
$$ plain form
5877 -20 -12 -1 -2 -14 -8 -5 -11 -3 -9 -7 -1 -3 -15 -5 -15 -3 7 -7 -3 3 9 2 -2 14 21 4 2 -9 3 7 11 8 -3 16 22 13 3 6 10 10 2 0 6 6 3
5922 3 -1 -4 13 8 -2 4 -6 15 -4 -3 -13 -7 -5 -3 -19 -8 -1 -11 -19 -21 -8 0 -10 -27 -9 1 -1 -7 -13 1 -2 8 -4 4 1 21 -15 -1 8 12 -3
5963 -3 -8 10 16 14 1 1 6 22 21 5 9 14 7 0 -6 -4 14 5 -3 -13 -7 7 1 -6 -5 -6 -2 -5 -11 -9 3 -14 -9 -10 1 -2 -12 -11 -16 4 -3 -12 -17 -22 1 -8 -16 -7
6011 -7 -11 -9 -16 -1 -3 17 -1 -11 -7 19 12 0 10 12 7 17 5 -7 17 18 19 7 18 4 13 3 7 8 10 -4 7 1 -2 4 -7 -13 0 -3 -11 2 -6
6052 -6 -15 -1 -8 -10 0 -7 -7 -3 -3 -15 5 4 -8 -15 3 -4 -17 -10 -3 -1 -4 -14 2 -1 2 -7 -4 -14 3 9 -5 4 2 7 11 8 6 5 19 3 7 22 2 -4 8
6097 8 6 3 10 3 0 8 10 4 -2 -4 4 1 3 -17 -1 -3 -3 -16 -13 -1 -10 -17 -14 -13 -2 1 -1 -14 -14 -10 4 -2 5 3 2 17 11 5 1 -7 -5 -3 11 16 1 17 -2 4 11
6146 11 -13 -7 17 9 5 -6 4 16 9 8 1 4 11 -3 -8 0 7 1 0 -1 5 11 4 -4 -10 -4 7 -12 -15 -16 -4 -2 -11 -15 -14 0 1 -19 -29 2 -8 -8 -13 -9 1
6191 1 -24 -7 -4 0 0 -2 -2 11 -1 8 -10 2 7 8 7 -1 -2 5 7 -3 -3 19 7 3 3 4 1 19 6 -5 -4 4 14 -6 -3 8 5 -2 0 -1 5 -7 0 -17
6235a7J4Oj4jLj2QJ5rKLlj0J5n%Pj4KK1rj2K2lrOjKj%NqJ5nJqj0J2KJrJ3j3Po
6280CrJ7j0OLj3J1pj7J1J1jkj2JOPk3J4Mj3NJ1j2lO%j4J3jJ1mKpJ8ok9K5JLJQ
6322A5qM%mNpJ9j5OnoJ%KNlj1KjJ1Jj7%OqJ6j3%oRrlJ2Jj0RLj6J7j2Mj1J6JrN
6368dJQ%k2J2J8oj5QjPLj3QMNpjj5L1Qj4Mj5QnJ3qJKonRJ6j6lq%K%JkqkK%%J0
6416EplLJppJ0OJ5k3pJ6Jk0PJ7j1K%oJ5Lj6J4nLNKj9NMJ3lJ1k2J6Lj6J2j3pJ2
6458IJJJ2j2j0LNLKkrpRj0MKj5KJ1Kj1J8j4qJ1Mmj0OKJ1j2jNjjJ4j7J2Oj6lJ1
6501CLLJj5J4RppP%LjkqJ8q%j0OjLolJ1Ok1j0K7k4J0Oj8PMj0kRj0J5j8oOJ9j7
6545a4pJ9Lj3PqRMOj0qK3nj2jJ8KrmMQrJ0KqJ0j5%J2jj0lJ3j1J7rj3RNj7J0Mj0
$$ plain form
6235 -17 -3 3 -11 -12 -9 -21 -13 2 -7 -5 -2 -5 -15 0 -5 -5 2 -12 -10 11 2 -10 12 9 0 6 5 7 6 6 11 3 18 13 14 6 -4 8 10 11 2 15 2 9 3
6280 3 -6 11 1 7 10 -3 8 1 -16 -5 6 5 3 -9 -8 -2 5 -18 -4 0 -13 -8 3 -9 -12 -6 -6 -20 -7 -8 3 -1 1 -6 12 6 -23 2 3 6 7 15
6322 15 7 11 11 7 12 5 24 9 15 10 4 5 5 7 12 9 -2 0 -1 10 11 -6 -6 0 -8 8 -5 -5 -11 -2 -11 -14 -2 -1 -11 -2 1 -15 2 -10 -6 -17 -1 0 -9 -4
6368 -4 -3 5 5 -17 -5 13 7 -8 0 -1 6 9 -4 4 8 13 6 5 -10 21 29 15 19 4 12 7 20 12 13 15 9 4 13 29 13 10 2 2 4 4 5 3 -5 -7 -5 -5 -5 5
6416 5 -2 -5 -2 -1 -8 -15 -5 1 16 -7 -14 2 3 -17 -10 7 -4 -2 -2 -8 7 10 -6 8 3 6 11 13 -6 -1 3 16 13 24 2 18 21 5 17 4 -3 9
6458 9 10 11 23 11 1 4 9 12 14 12 3 -4 5 -5 -1 1 -14 -12 -1 1 -10 8 -6 -14 -3 1 -3 -13 -7 -5 6 -6 -7 -2 -3 -4 10 -7 5 11 -5 -8 3
6501 3 6 9 10 -5 9 18 11 4 11 11 14 13 11 3 21 13 13 3 9 8 11 5 2 13 19 -2 -12 15 -9 1 7 -11 -4 0 -10 -12 -3 -13 2 -16 -22 -16 3 -14
6545 -14 -21 -2 1 -12 -5 -13 -4 0 6 -4 -12 11 6 -6 -7 11 13 4 0 4 12 3 13 15 7 17 2 2 14 13 3 0 13 2 19 10 -3 6 11 -6 4 8 -2
6588bJ5j7LJNrMKj2L%KmJnJ3qj1J4kMLmj1J7qJ1oJ1j5mJ0j1J6%oLJ6j7J9lkjk
6632A3nnK3j1nnoJ5kpn%mjJ1QqoqMONj2qRKJ7k5%Oj1NoJ5qJ5mj4NmmPmOK2j8J
6679aMnPRmnQOj2JJ5j7J1j2PlQj5QMpk%MrLmQlLqJl%J1j0mkN%JjJqmOOoMmrJ9
6731Br%lK1rj2J4LpKnOnJ5oKklJ8j0qLMQjkj6K2lj2Oj1J3j1Rj6J7qj4J0On%j1
6775h%rJ7j2Qmj7J8k%NPmppJ6jJnJ0JOpoqJ7Kj3J9j7%%RJj2J1nJ4j1J6j4MnNk
6820A1pQqNjj5J5kLj1NJ0j2lpMlJ2j0Qmj4PJ4m%lqj1K3nJ5j8J0JpJ6moJ1mmRj
6864A5on%NQjj6J4kLqoJ0nnnRQrJ0k6RJ2mnlRlolMnPLKoOj5LjNm%nlJ8ppj1K5
6914CnoJ2JnmRjJ1lj3J1Rj1LkoQLjoQPj5J5j7mRMkr%J2oMj1Mn%KLnj0rK3mq%%
$$ plain form
6588 -2 13 -4 -1 0 5 -4 0 2 -10 -7 -7 -5 -9 -8 -13 0 -8 -19 -5 -7 -3 0 -4 -15 2 -6 5 -1 10 -5 -9 1 -10 6 6 0 3 19 2 21 18 16 15 13
6632 13 8 3 26 15 10 5 -1 14 12 5 0 0 -4 -5 6 14 6 0 -8 -4 2 7 -5 -13 -4 -2 15 -10 -10 -4 -15 -10 -16 -1 -9 6 2 -12 -7 -11 -15 -8 -12 -6 16 -2 -1
6679 -1 3 -2 5 14 10 5 13 19 7 8 23 6 17 5 12 9 17 2 10 14 7 5 5 9 0 3 -1 7 4 7 -1 0 -3 -3 8 -2 -6 -8 -3 -3 -2 -3 -2 -10 -14 -8 -2 -8 -4 -8 -17 2
6731 2 -7 -7 -10 11 2 -10 4 7 0 2 -3 3 -2 13 7 9 7 4 22 12 4 7 11 19 18 16 0 22 19 7 13 2 15 4 13 -3 14 6 -8 2 8 3 3 -8
6775 -8 -8 -17 0 -12 -4 -8 -25 -7 -9 -9 -4 3 -1 -8 -15 1 0 1 -4 6 7 13 6 0 -8 9 11 -2 17 0 0 0 9 10 -2 9 4 18 7 23 9 13 8 13 11
6820 11 4 12 4 9 8 -7 8 6 9 -2 3 13 1 -2 -9 -5 -8 4 -6 2 -2 -16 -9 5 1 1 -2 -10 -21 2 -3 12 -6 4 5 -2 14 10 4 15 11 7 16 15
6864 15 9 4 4 9 17 16 0 14 12 15 7 1 11 6 1 -4 5 13 4 14 -12 -3 9 5 0 -3 6 3 -3 -6 -2 -7 0 3 5 -1 5 -10 -7 -8 -3 -7 -7 -12 -15 3 -4 -11 -22 3
6914 3 -2 -8 4 5 0 -4 5 4 15 12 -1 10 19 8 11 9 3 11 14 13 7 15 22 7 22 5 1 10 14 12 3 3 15 9 13 2 6 1 1 3 6 1 -9 -18 5 1 -7 -7 -7
6963gMPJjrLQj2J8j9J1k2J8jNkqOoRLJ0j1%KNkJKMj3lJ8Oj9mQ%Lqjj3J3okkL%
7011cQoj1PMkljOPonjpMpJ3J1j1kJ1lk3L4j2j1RRqqK0j1jjJ0j3J5Rj2nRRoKP%
7057B5j9J0jNlj3nJ1MoMLj3JJ1onQj5oRJj0J4oKJ%lj1QjnRL%NpOlpJ0j1%JK2j5
7104BNlRj4RJ1j2K0j7JjJ9j7Kq%J9j4lPmll%jNmOpkMjj2QjpoJ3j1J2Rj8J2Jnl
7150cLPojjMpJ1qKJJ0kj2LQPjj3J7jj1j0J0oMj1J4Oj1J8prmOjj1J6kJ1j5KllL
7195Drj1JJ7j5%nJ5Mj6NjJ5lj2PKkpJ2OoJ6j6%qK0j1P%JJ%rRJ0j8OKOj1OJmnR
7241A3jrRjmmj6K5loJ2j5LJ0ojj5jRjj2J2Kj3QOj0Oj0JJ8j0lkJ0jPOllJ1j7J0
7284A1Qj1mQJoJ3j0oJ6Kj2lj3J7ol%MoQrn%PPoJ2pj9%J0pRj3L%J1r%Kj1KJ5jj5
$$ plain form
6963 -7 -3 4 5 4 -5 -2 6 -6 12 -7 4 -18 0 -1 4 2 -6 0 -6 3 6 16 5 5 7 12 10 11 13 17 4 1 19 25 6 2 10 10 13 5 4 -9 4 -2 -4 -6 -3 -3
7011 -3 5 -1 -12 -5 -1 -3 -6 -7 -1 6 0 -5 -6 -13 -9 -16 -3 8 -3 -5 6 3 -20 14 2 -9 0 9 1 -7 13 2 1 0 10 -3 12 21 9 4 13 22 16 18 25 25
7057 25 6 16 15 20 17 4 -1 10 14 8 12 15 2 3 14 8 3 11 -4 -10 -1 0 -10 4 -2 0 1 1 -2 -13 -5 -6 -11 -2 1 1 6 -1 5 2 -5 5 -6 -6 -5 17 2
7104 2 7 4 13 -1 8 19 7 27 10 11 10 29 12 14 6 6 25 11 8 15 11 8 5 5 4 9 5 11 4 2 6 5 -7 1 0 -7 -13 0 -11 1 10 -8 4 5 0 -3
7150 -3 0 7 1 0 -1 3 -4 7 -1 1 2 12 10 -2 1 9 16 15 2 19 18 7 -3 7 1 5 -6 8 14 3 21 14 5 1 7 6 -5 11 9 20 5 7 4 1 4
7195 4 -5 -16 -15 2 -13 -13 -18 -3 1 -15 -10 -11 4 1 -11 -4 -2 -4 -11 1 7 1 17 1 1 -7 13 2 9 9 10 11 11 2 11 21 3 9 11 17 6 12 13 9 4 13
7241 13 12 3 12 11 7 3 -13 12 9 3 15 0 3 13 7 6 -9 -10 -1 -2 -14 -2 0 -13 -5 1 -9 -3 -13 -12 6 -4 -7 -9 1 0 7 13 10 7 18 1 11
7284 11 19 8 4 12 13 7 20 10 4 20 22 10 7 -6 11 5 2 2 6 0 8 -1 -6 -6 1 8 2 14 7 -12 -12 -2 -9 0 -13 -10 -10 1 -8 -8 -6 -17 -15 0 -1 -16
7330a6J1J%JlJKpJ4ln%Rj%OoOKrLONj0lLOJ5j3nNoRnkLj4OJk%qQnOoj0qJ4rQQ
7382Cqj9K5JqKMj7J4LmRkj2RnnOJ0qJ1jj1lRrOOKnlPmJ1j6J5LrpLP%kpMKJ0ql
7431FpKj0J6j2o%MNoJ1j6mQJ0nmpJ2J0jnj1NJ5j1NjJlMj4K0j0kMLJ7kk3JJ8j1
7474FOQk3MNqJ3jKnoNM%qoJ1Pj3j0lJ1j4R%kLJ1j5PmqQrJ2j4QMkNPnj6J2jmK4
7521A5lj6oJ9%oPOmkj%KKj2J7kj2QrkJjrRKm%PPMk1oRMno%jRQ%pk%mOkl%KpJ3
7574DmJ3k3J3rjJ3j1LjJJ5%j5J6j4J0j0J4Nj1Nj9J2nPkPOk4MLj2J0%JkRj9lJ0
7615dNj0NlLJojQOj0JOj1kPRj0Oj8OJ5j3J1j2J0KJ3k2NJ3plQlj1K3j2%Or%mPk
7660CLKj1RJ4j6J0j7jJ0mqKNnMnj2J6pnNLJklKKJ0%j5LMNKj5pJ4Lj0J8mj4J2k
$$ plain form
7330 -16 -5 -4 -4 -3 -6 -5 -3 -10 4 1 -4 -4 5 4 4 10 4 10 12 3 6 12 17 7 4 7 13 28 15 10 15 9 18 13 11 14 0 6 7 5 5 -3 5 0 6 0 -10 -18 -4 -13 -5 3
7382 3 -5 -24 1 2 -6 -4 0 -17 -3 0 -4 5 3 -9 0 -5 -10 -4 6 -2 9 8 -3 -6 3 -6 0 6 8 3 0 7 3 14 -2 13 16 7 0 3 10 10 8 1 5 7 17 9 6
7431 6 -1 1 -9 7 -5 -11 -11 -7 -2 -8 3 -13 -17 -9 1 -4 -8 -15 -3 7 6 1 -10 -5 10 -1 4 3 4 1 5 -9 11 1 -1 3 6 23 21 -2 -1 17 6
7474 6 12 20 -3 1 6 -2 11 10 12 7 1 6 10 10 2 -4 7 14 1 -9 -12 -1 -15 -6 -6 -8 -5 6 -9 -2 -6 -14 -6 -15 -3 -17 -9 -5 -7 -2 5 0 -16 -4 -5 -9 15
7521 15 12 -4 -10 9 9 3 10 16 12 10 9 9 11 13 1 18 16 4 12 3 1 2 1 -8 1 3 -1 -1 6 13 17 -4 -10 -1 3 -2 -8 -8 -9 0 8 8 1 -1 -1 -5 1 -1 -4 -4 -2 -9 4
7574 4 0 13 -10 3 -6 -7 6 -5 -2 -3 -2 13 13 -2 14 0 10 0 14 19 8 13 -6 6 1 8 6 13 19 -5 -1 2 -10 0 0 1 -1 8 -11 -14 -4
7615 -4 1 -9 -4 -7 -4 -3 -9 -10 -2 4 -6 -5 1 -10 -12 -5 4 -6 0 -18 -12 3 -10 1 -11 -1 1 14 -8 -3 10 3 0 8 5 -6 17 5 5 11 2 2 -2 5 3
7660 3 6 8 -3 6 20 4 14 -3 -4 6 2 -6 -4 1 -4 0 -5 -17 -1 -8 -13 -8 -5 -4 -6 -9 -7 -5 5 5 -10 -7 -3 2 4 -11 -18 -4 -1 -11 7 3 -11 1 -1
7705amJ4J0qJ0Lj1qMJj3JJ3mmJ3j8RjJ4j3qJ3rLJKk2MPqJJ0mJLj9j1L6j4nJ7j3
7748hj1K1pJ0o%J2j8Rkmj1J9jPnOj7QNkPnjNnoQoJ3j8J4qoJ5nJ0j5%KQmnojNj2
7795a1MqJ7jj0J2j1pNKoNJ1j6%pJ1MKj2MJ2pQoJ1oRjjkJpK1j4MmmJKqJ0rKlOj1
7842hK0knoJ2qJJj0KJQj2J2qj3J3mqJ3kkJ%Rj7QpJ4j4MNpkqJ2rQJ2qoJ2lNkKJ5
7889A9mr%OoMqJ4%j0nJ3qj0J3j1J0JNj8PolJ6lj7kRQj1QpPr%OpjLJJNkj7J3oj
7936a2NNmj3K1pJJ0pOpQlJ0mj6K4%rPnkj2J1LL%q%J0j8K5j1oNmmknpJ3Kmj4Qn
7982a2J1jnQQk4J1Mj2Q%j3J1LK%jJ4ljp%Qj3PKQj0NrJ7j6PlMKNmNjJ1j6MrLJL
8029A2ql%j7J9%Jjrj0J2Rj3mmKJ3%klJ4njlRj0jKj0JJ5pLk%RpJ0Kj1J3j1OqQj
$$ plain form
7705 -1 -5 9 19 11 21 24 13 5 9 10 -3 -2 11 7 3 16 -2 7 6 20 7 -1 12 3 6 7 9 -13 -9 -2 -10 -9 1 -3 -2 1 -18 -29 7 -7 -12 5 -8
7748 -8 -19 2 -5 5 -1 -1 11 -7 2 0 -4 -15 4 3 10 5 11 -6 2 7 5 12 7 6 11 6 0 8 2 15 -3 11 3 -3 12 7 17 2 2 4 12 8 3 -3 -4 1 -11
7795 -11 -7 -15 2 1 -9 3 -8 -15 -10 -8 -14 -9 2 -14 -14 -21 -10 -6 -4 -16 -12 0 -7 1 -5 6 0 9 8 7 5 6 -1 20 6 10 6 2 3 5 -3 7 -2 0 -3 3 -8
7842 -8 12 10 5 -1 11 3 4 5 -5 -3 -2 6 -6 6 -2 -15 -2 -6 -14 -1 -3 -5 -4 -4 5 -12 -4 -11 3 -11 -7 -2 -9 -11 -19 -7 -16 -8 4 -4 -10 2 -1 4 2 4 19
7889 19 15 6 6 12 6 10 2 16 16 6 1 14 6 -4 9 -2 8 9 14 -4 3 -3 -6 10 7 -10 -12 -3 5 -6 2 -5 2 -7 -7 -1 -8 -9 -6 -5 -4 1 -1 -18 -5 -11 -12
7936 -12 -7 -2 -6 -19 2 -5 -4 6 -1 5 -2 6 3 13 9 -7 17 17 8 15 10 8 -4 7 10 13 13 5 5 15 -3 22 11 5 10 6 2 0 -5 -12 1 3 -1 -15 -7 -12
7982 -12 -1 -2 -7 1 9 -15 -4 0 -12 -4 -4 -17 -6 -3 -1 -1 -2 12 9 8 1 1 9 -4 3 5 13 3 8 -1 16 0 7 4 8 10 15 11 16 15 26 10 14 5 8 9 12
8029 12 4 1 1 -16 3 3 4 3 -6 -16 -4 5 -8 -12 -16 -14 -1 -1 -3 -6 8 3 2 -1 8 -2 -3 -1 -11 -10 5 -2 1 -1 -1 8 1 11 13 2 15 4 10 2 10 9
8075ImLj3J6pONKqNl%JmlqPkjKmLj1J1mkMj6QOj1jKNMkj1PNJj0OmP%KRMpJ1j0
8126EPKOknRj2nkJ0rRmqPkQJ6k6J5Mpj0RoKj8J5Mj1j2RJ6j3mlJ7j2oJ2lj0jQk
8171cnjLj1J1JOqJLQj0mJ4%kMJ1nj6
$$ plain form
8075 9 5 8 -5 11 4 10 15 17 9 14 11 11 12 8 5 -3 4 2 1 3 -1 2 -9 2 -2 -4 0 -16 -8 -2 -13 -14 -12 -7 -3 -5 -16 -9 -4 -3 -13 -7 -11 -4 -4 -2 7 11 4 15 5
8126 5 12 14 20 18 13 22 10 5 3 13 4 13 9 1 8 6 14 30 4 19 23 16 6 15 9 11 -7 8 12 1 -11 -2 14 1 -3 -6 11 -1 -7 5 2 -8 -9 -1 -3
8171 -3 -8 -9 -6 -17 -6 -5 1 -7 -6 -3 5 -5 -9 5 5 3 7 18 13 -3
8191c
##END NTUPLES=NMR FID
##END=
