##TITLE=1H_LY-856.40
 CCl4, 8 sc, 
 24.7.2019
##JCAMPDX= 6.0         $$ Bruker NMR JCAMP-DX V2.0
##DATA TYPE= NMR FID
##DATA CLASS= NTUPLES
##ORIGIN= UXNMR, Bruker Analytische Messtechnik GmbH
##OWNER= root
$$ XWIN-NMR		Version 3.5
$$ Wed Jul 24 16:12:30 2019 Russian Standard Time (UT+4h)  she@DPX200
##.OBSERVE FREQUENCY= 200.13155
##.OBSERVE NUCLEUS= ^1H
##.DELAY= (6, 6)
##.ACQUISITION MODE= SIMULTANEOUS
##.ACQUISITION SCHEME= undefined
##.AVERAGES= 8
##.DIGITISER RES= 18
##SPECTROMETER/DATA SYSTEM= spect
##.PULSE SEQUENCE= zg30
##.SOLVENT NAME= CDCl3
##.SHIFT REFERENCE= (INTERNAL, CDCl3, 0, 15.7039)
##AUDIT TRAIL= $$ (NUMBER, WHEN, WHO, WHERE, WHAT)
$$ ##TITLE= Audit trail, XWIN-NMR		Version 3.5
$$ ##JCAMPDX= 5.01
$$ ##ORIGIN= Bruker BioSpin GmbH
$$ ##OWNER= she
$$ F:/spectra/data/she/nmr/H-F/1/audita.txt
$$ ##AUDIT TRAIL=  $$ (NUMBER, WHEN, WHO, WHERE, WHAT)
(   1,<2019-07-24 16:11:38.60 +0400>,<she>,<DPX200>,
      <created by zg, POWCHK disabled, PULCHK disabled
       configuration hash MD5:
       00 E9 B6 7A A2 85 ED C7 34 08 36 98 17 FE 4E 26
       data hash MD5: 16K
       08 D2 92 3F 42 83 CB 23 E4 CF 0B DD 4F 7E A7 F9>)
$$ ##END=
$$ 
$$ hash MD5
$$ BC 76 5B 52 CA 98 8B C2 53 E5 AF D0 E9 03 7F ED
##$RELAX= 
##$RELAX= 
##$RELAX= 
##$RELAX= 
##$RELAX= 
##$RELAX= 
$$ Bruker specific parameters
$$ --------------------------
##$DU= <F:/spectra>
##$EXPNO= 1
##$NAME= <H-F>
##$PROCNO= 1
##$TYPE= <nmr>
##$USER= <she>
##$AMP= (0..31)
100 100 100 100 100 100 100 100 100 100 100 100 100 100 100 100 100 100 
100 100 100 100 100 100 100 100 100 100 100 100 100 100 
##$AQSEQ= 0
##$AQ_mod= 1
##$AUNM= <au_zg>
##$AUTOPOS= <>
##$BF1= 200.13
##$BF2= 200.13
##$BF3= 200.13
##$BF4= 200.13
##$BF5= 200.13
##$BF6= 200.13
##$BF7= 200.13
##$BF8= 200.13
##$BYTORDA= 1
##$CFDGTYP= 0
##$CFRGTYP= 5
##$CHEMSTR= <none>
##$CNST= (0..31)
1 1 145 1 1 1 1 1 1 1 1 1 1 1 1 1 1 1 1 1 1 1 1 1 1 1 1 1 1 1 1 1 
##$CPDPRG= <>
##$CPDPRG1= <>
##$CPDPRG2= <>
##$CPDPRG3= <>
##$CPDPRG4= <mlev>
##$CPDPRG5= <mlev>
##$CPDPRG6= <mlev>
##$CPDPRG7= <mlev>
##$CPDPRG8= <mlev>
##$CPDPRGB= <>
##$CPDPRGT= <>
##$D= (0..31)
0 1.2 0 0 0 0 0 0 0 0 0 0.03 0 0 0 0 0 0 0 0 0 0 0 0 0 0 0 0 0 0 0 0 
##$DATE= 1563970298
##$DBL= (0..7)
120 120 120 120 120 120 120 120 
##$DBP= (0..7)
150 150 150 150 150 150 150 150 
##$DBP07= 0
##$DBPNAM0= <>
##$DBPNAM1= <>
##$DBPNAM2= <>
##$DBPNAM3= <>
##$DBPNAM4= <>
##$DBPNAM5= <>
##$DBPNAM6= <>
##$DBPNAM7= <>
##$DBPOAL= (0..7)
0.5 0.5 0.5 0.5 0.5 0.5 0.5 0.5 
##$DBPOFFS= (0..7)
0 0 0 0 0 0 0 0 
##$DE= 6
##$DECBNUC= <off>
##$DECIM= 24
##$DECNUC= <off>
##$DECSTAT= 4
##$DIGMOD= 1
##$DIGTYP= 9
##$DL= (0..7)
0 120 120 120 120 120 120 120 
##$DP= (0..7)
150 150 150 150 150 150 150 150 
##$DP07= 0
##$DPNAME0= <>
##$DPNAME1= <>
##$DPNAME2= <>
##$DPNAME3= <>
##$DPNAME4= <>
##$DPNAME5= <>
##$DPNAME6= <>
##$DPNAME7= <>
##$DPOAL= (0..7)
0.5 0.5 0.5 0.5 0.5 0.5 0.5 0.5 
##$DPOFFS= (0..7)
0 0 0 0 0 0 0 0 
##$DQDMODE= 0
##$DR= 18
##$DS= 0
##$DSLIST= <SSSSSSSSSSSSSSS>
##$DSPFIRM= 0
$$ [...]
##$SUBNAM2= <"">
##$SUBNAM3= <"">
##$SUBNAM4= <"">
##$SUBNAM5= <"">
##$SUBNAM6= <"">
##$SUBNAM7= <"">
##$SUBNAM8= <"">
##$SUBNAM9= <"">
##$SW= 24.9336996594482
##$SWIBOX= (0..15)
0 0 2 0 0 0 0 0 0 0 0 0 0 0 0 0 
##$SW_h= 4990.01996007984
##$TD= 16384
##$TD0= 1
##$TE= 0
##$TE2= 300
##$TE3= 300
##$TEG= 300
##$TL= (0..7)
0 120 120 120 120 120 120 120 
##$TP= (0..7)
150 150 150 150 150 150 150 150 
##$TP07= 0
##$TPNAME0= <>
##$TPNAME1= <>
##$TPNAME2= <>
##$TPNAME3= <>
##$TPNAME4= <>
##$TPNAME5= <>
##$TPNAME6= <>
##$TPNAME7= <>
##$TPOAL= (0..7)
0.5 0.5 0.5 0.5 0.5 0.5 0.5 0.5 
##$TPOFFS= (0..7)
0 0 0 0 0 0 0 0 
##$TUNHIN= 0
##$TUNHOUT= 0
##$TUNXOUT= 0
##$USERA1= <user>
##$USERA2= <user>
##$USERA3= <user>
##$USERA4= <user>
##$USERA5= <user>
##$V9= 5
##$VALIST= <valist>
##$VCLIST= <CCCCCCCCCCCCCCC>
##$VD= 0
##$VDLIST= <DDDDDDDDDDDDDDD>
##$VPLIST= <PPPPPPPPPPPPPPP>
##$VTLIST= <TTTTTTTTTTTTTTT>
##$WBST= 1024
##$WBSW= 4
##$XGAIN= (0..3)
0 0 0 0 
##$XL= 0
##$YL= 0
##$YMAX_a= 22150
##$YMIN_a= -29241
##$ZGOPTNS= <>
##$ZL1= 120
##$ZL2= 120
##$ZL3= 120
##$ZL4= 120
##$ABSF1= 10
##$ABSF2= 0
##$ABSG= 5
##$ABSL= 3
##$ALPHA= 0
##$AQORDER= 0
##$ASSFAC= 0
##$ASSFACI= 0
##$ASSFACX= 0
##$ASSWID= 0
##$AUNMP= <proc_1d>
##$AZFE= 0.1
##$AZFW= 0.1
##$BCFW= 1
##$BC_mod= 2
##$BYTORDP= 1
##$COROFFS= 0
##$CY= 11.3945322036743
##$DATMOD= 1
##$DC= 2
##$DFILT= <>
##$DTYPP= 0
##$F1P= 18.9103706918063
##$F2P= -1.10871071338519
##$FCOR= 0.5
##$FTSIZE= 0
##$FT_mod= 4
##$GAMMA= 1
##$GB= 0.15
##$INTBC= 1
##$INTSCL= 1
##$ISEN= 128
##$LB= 0.24
##$LEV0= 0
##$LPBIN= 0
##$MAXI= 10000
##$MC2= 0
##$MEAN= 0
##$ME_mod= 0
##$MI= 1.114404
##$NCOEF= 0
##$NC_proc= 0
##$NLEV= 6
##$NOISF1= 3.799351
##$NOISF2= 2.8
##$NSP= 1
##$NTH_PI= 0
##$NZP= 0
##$OFFSET= 15.70392
##$PC= 1
##$PHC0= -8942.766
##$PHC1= 19.40096
##$PH_mod= 1
##$PKNL= yes
##$PPARMOD= 0
##$PSCAL= 0
##$PSIGN= 0
##$REVERSE= no
##$SF= 200.130013532006
##$SI= 16384
##$SIGF1= 3
##$SIGF2= 2
##$SINO= 400
##$SIOLD= 16384
##$SREGLST= <1H.CDCl3>
##$SSB= 0
##$STSI= 0
##$STSR= 0
##$SW_p= 3612.71676300578
##$SYMM= 0
##$S_DEV= 0
##$TDeff= 0
##$TDoff= 0
##$TI= <>
##$TILT= no
##$TM1= 0
##$TM2= 0
##$TOPLEV= 0
##$USERP1= <user>
##$USERP2= <user>
##$USERP3= <user>
##$USERP4= <user>
##$USERP5= <user>
##$WDW= 1
##$XDIM= 8192
##$YMAX_p= 0
##$YMIN_p= 0
$$ End of Bruker specific parameters
$$ ---------------------------------
##NTUPLES= NMR FID
##VAR_NAME=  TIME,          FID/REAL,        FID/IMAG
##SYMBOL=    X,             R,               I
##VAR_TYPE=  INDEPENDENT,   DEPENDENT,       DEPENDENT
##VAR_FORM=  AFFN,          ASDF,            ASDF
##VAR_DIM=   8192,          8192,            8192
##UNITS=     SECONDS,       ARBITRARY UNITS, ARBITRARY UNITS
##FACTOR=    0.0002004,     1,               1
##FIRST=     0,             0,               0
##LAST=      1.6414764,     0,               0
##MIN=       0,             -29241,          0
##MAX=       1.6414764,     22150,           0
$$ Real data points
##PAGE= N=1
##DATA TABLE= (X++(R..R)), XYDATA
0@%%%%%%%%%%%%%%%%%%%%qJ6j6J6j6J6j6J6k3L1l2L2l3M0m7M8n5O3o6P4q2R0j03
43e5J13j24J39j54J71j94K18k46K85l32L92m72N85p59J048j604L017j2090j9179
62b9241M7755j1762k8381L8817j725m0274K3502J5664k6312J2344J4650k3269
74h232J767J2862j0500M048P247j2590L202P989r710K585P188r923L36R112m567
89H14l419L229m29o25j520K514N213q835l451J3751n872j0259J6270k646j8588
104a3853J7186R036k1734P041J1800j8739M681J7117j4355k565J0623j3200J302
117e660J5717j0865j365J0927j7315j434K2829j2037r455K0546j1539j6903K3760
130G206J604k0055J5109O066k1123P376J3423j2840l40R560p141k497N961k128
$$ y = [0, 0, 0, 0, 0, 0, 0, 0, 0, 0, 0, 0, 0, 0, 0, 0, 0, 0, 0, 0, 0, -8, 8, -8, 8, -8, 8, -8, 8, -15, 16, -16, 16, -17, 23, -24, 24, -31, 32, -34, 40, -42, 48, -55, 58, -66, 73, -81, 90, -104, 114, -132, 153, -179, 213, -259, 326, -433, 615, -989, 2028, -10062, -29241, 18514, 6752, -21629, 17188, 15463, -24811, -1309, 14355, -11957, 387, 15037, -8232, -6465, 6397, -4103, -55, 7192, -5398, -2196, 5793, -3917, -1332, 5856, -4067, -3731, 5381, 814, -2605, 624, 195, -430, -1950, 564, 5777, -3058, -6509, 7242, 1370, -8889, 7381, 4735, -13853, 3333, 12369, -9365, -2324, 9476, -9263, -4582, 12535, -1820, -4385, 6238, -6962, -5660, 10057, -808, -2173, 8754, -8561, -9995, 12834, 797, -8658, 11888, 349, -16554, 7206, 8810, -11245, 3864, 9930, -11193, -3817, 9606, -3234, -3574, 5986, -1155, -3652, 2309, 181]
144A81j334J259k53K377k446l088N320j315m060O765j362o938O602R1o705Q486
160C580O80j0732P144L339j0412Q678N804j5580M121J1238j2655J232J3638j2188
174b113n839J3828n549o509J2393k807j0030P300J363n308N680P1n411L528l72
189B25k811M908j325l507N040k043m718O196J18n321M910N78n627L809J158m509
205b919M193J590n212K265Q21l757M586J677n693K308J579m798L664L208n044
220a532J539J614n253L131M184m915J183K289n973K585N539o089P3N671o106j448
236c508P502l799l519O586k371n032N714P14m910K829J566l166J437R40k174R04
252b87R34m56N18j393n55K149r40n53K429j982k044K890n49j165L465j698l826
$$ y = [181, -1153, 106, -147, 2230, -216, -3304, 2016, 701, -3359, 3406, 2044, -4894, 1708, 1799, -4906, 3580, 4260, -6472, 672, 4011, -6401, 2277, 8081, -7499, -3378, 7860, -4795, -3563, 10075, -2113, -7952, 5876, 327, -6182, 6211, 3404, -6626, 674, 2037, -3271, 2409, 2480, -2931, 597, 225, -2586, 2322, 997, -2510, 2530, 487, -4231, 1965, 2083, -3238, 1672, 2250, -3377, 432, 1590, -2919, 1274, 2864, -2348, -83, 738, -3019, 1567, 3244, -2449, -141, 1438, -3360, 304, 3512, -1532, 7, 1621, -3632, -501, 3683, -1232, -49, 2240, -3733, -1148, 4391, -1698, -1625, 4046, -2060, -3508, 3994, 195, -3324, 3262, 891, -4141, 1573, 2287, -2623, 206, 1772, -1394, 43, 983, -1191, -287, 647, 191, 709, -684, -1239, 910, -30, -583, 1846, -136, -2180, 710, 161, -1004, 2461, 763, -3063]
269c063L136P86k126L391m33m908K731K175l474K520K381n040m2L435k362N26
285c67L305l263k079K947l52n86J880j416j269J592o11l27J722j081r31J454r08
302b90n88K094q75j712J771L99j379O67K4r59J052O86q54l30k13J30P64k01O8
321B54M46j429n55J699Q1l03R18j628j509K319Q40j262Q73m44k093J426J426j270
339b11P76N42k512R4K205n20r9P39j912o42K211R1r01O54n88r49J009M54l52M38
359E27m15r71N43O62l6Q6n83n69P94M89n01j00l5k11M22K27l43p4m2j53K47L20
381B84J58k59r29MJ142K23l26j19r40k55J562K87r31L34l04j141J039J215p89
400B55q6L3j456M18K102l62j209J96m58k34J492L41j246j11K41n13M83J040l81
$$ y = [-3063, 73, 859, -1267, 2124, 1691, -3217, -486, 1689, -1785, 735, 3116, -1924, -1966, 1469, -893, -367, 2938, -325, -2404, 543, 191, -395, 1485, 69, -1200, 392, -219, -546, 1176, 95, -836, 618, -290, -878, 1216, 341, -1371, 400, 799, -580, 87, 111, -848, 204, 890, 36, -294, -507, -377, 387, 186, 254, 700, -729, -1284, 415, 496, 193, 1111, -517, -2026, 293, 1133, -129, 744, 300, -1793, -367, 1059, -211, 565, 1107, -1405, -1311, 894, 374, 275, 1014, -898, -1540, 671, 762, -139, 515, -73, -1022, -13, 441, 89, 527, 112, -859, -316, 346, 310, 396, -187, -756, 38, 527, 26, -74, -109, -320, 102, 329, -14, -88, -130, -283, -36, 284, 442, 183, -746, -742, 400, 623, 297, 178, -762, -1017, 545, 832, -99, 235, -69, -1210, -171, 1044, 255, 169, 202, -1254, -836, 1266, 904, -305, -109, -567, -801, 691, 1032, -214, -325, -84, -597, -114, 926, 545]
419E45r56j12K24L01O00R0j099n65R90N51m77J2p1o96M14Q54m46k53L07p04k09
440g00J270J94q79j84k06M4J086K36j056l86J76K49O36O9n60k04k60rQ81L81o50
461A28l45l99m8J214N08j122m72K53o2N74N58p27m94K85p2J51N98j09o11l30J62
482c60O61K88m69l59k10J44Q11L5r36J34M05m89L89O22q42k59O24m80P6J081o95
503A71j070P69L11k24O00m18j029P13O95n05O8J22n94J17M14n1K22j09o22Q4L71
524C5J72L56n32q06O62N17m48K79Lq49M77O35p84K04P07r19k29R29l53k28N60
545C88o63k35J103k54q12M27k2j94P87k05q61M36K47m35M52K11n06L5l9k01O14
566B73J53o61L9Q7l4O11j87r68M56O07m16K39J84q71O7O27k31K14M28p78m35L61
$$ y = [545, -411, -523, -299, 2, 602, 692, -407, -972, 18, 569, 92, 104, 33, -663, -249, 605, 159, -94, 213, -491, -700, 570, 764, -115, -299, -505, -461, 625, 861, -195, -581, -405, -156, 480, 549, -11, -215, -475, -484, 397, 778, 128, -217, -616, -664, 550, 1058, -64, -536, -283, -345, 229, 787, 60, -434, -149, -221, -70, 528, 419, -192, -522, -360, 301, 589, 120, -239, -449, -305, 506, 541, -395, -261, 144, -345, 44, 666, -176, -435, 189, -291, -215, 866, 171, -899, -130, 181, -43, 557, 139, -890, -177, 518, 13, 81, 203, -391, -274, 140, 89, 311, 202, -420, -336, 35, 207, 563, 31, -775, -113, 404, -44, 235, 238, -611, -134, 501, -283, -79, 628, -291, -520, 409, 56, -172, 388, -275, -510, 593, 339, -473, -46, -68, -262, 525, 320, -541, -105, 142, -293, 159, 370, -136, -101, -140, -341, 273, 426, -235, -196, -109, -143, 468, 281, -687, -231, 376, -40, 199, 383, -488, -421, 206, -25, 189, 617, -161, -596, -235]
588b35J90N70J08j056m1O53l83K14N79r06j49J101o53n91J054l32q91J019L71
607F22p81K42k12p42Q69Q19n22k65l92m46R02M66o32L19J8j055M43Q92n54l6M22
628C77q11n0J080k45p70P7J57L68M38m68m52l5k09O02P72n59l96J76p69lJ477
649G57J20r81r3j27j04O96J52m13l2j61J37M43o33k11R36n28n79J445k05j710
669a091P73P34r98R86R83k029o14J574j97l27R48m76r25M37J47J1M82k90l34J64
689d2l02L50P00r51n41J102N4n01M16l75o24P01L62j92J96m44l77M01k07K77J080
710A083r98j165J248J37r35J181J66j680P77J078j304n5J066o20l68N90q6m1j27
729e3m27N62K10n42O88j07j527R92J367j548j07J431j264o66J678m01r43J128
$$ y = [-235, -45, 525, 633, -423, -464, 189, -194, 20, 599, -307, -456, 645, -8, -599, 455, 123, -768, 251, 622, -159, 83, -129, -871, -2, 817, 295, 30, -362, -808, 94, 560, -72, 247, 265, -790, -347, 545, -9, -45, 377, -434, -484, 596, 351, -419, -342, -185, 183, 621, 153, -299, -334, -543, 59, 831, 272, -124, 52, -717, -720, 757, 877, -104, -197, -324, -428, 268, 420, 7, -25, -186, -49, 394, -239, -450, 486, -42, -621, 824, 619, -1091, -318, 416, -582, 404, 1387, -642, -1256, 318, 121, -206, 742, 266, -659, -222, -75, -64, 418, 128, -206, -42, -344, 6, 706, -245, -786, 316, 370, -131, 285, -90, -714, -13, 349, 157, 353, -91, -468, -67, -274, 3, 1083, 85, -1080, 168, 305, -630, 551, 717, -963, -186, 892, -412, -467, 599, -21, -389, 201, 115, 74, -53, -480, 82, 292, -250, 438, 331, -1196, -204, 1163, -385, -492, 939, -325, -991, 687, 286, -657, 471]
747D71j88j056P57M18m26J04l29m4P63m71l69P76m71m65J056l15q30R81qr67O26
768A3L23m59L67l53l97J001l54p56J161l46j133J545M8j927J432J080k208M28
786e35J709j552l15J564r64o82J321k79p79N27P9l0O4n66M66M74r75K61Q31j071
806d52J33J191j217m39J527o02q17J096k93o07Q72m09m85J037m31o56R67m39n69
825e93J363n65j265J474K19j403R51M00j287P23N06j031N78M84r99L77K56o84
843d96R59J17j493R23P30j537P00J068j665K94J464j557l21J719q84p61J264l61
861A63o06P60m40l87Q98k10k80L93p38oJ047o75k88J086p73o83J091m08m14J268
881G98n87j016J159j74q60J148k09r43J315j81j493J159M91j340R71O06j550N35
$$ y = [471, 283, -773, -16, 402, -24, 80, -249, -293, 470, -1, -370, 406, -65, -530, 526, 211, -619, 362, 354, -613, 13, 336, -123, 244, -109, -506, 495, 141, -615, 546, 200, -933, 612, 660, -1267, 165, 1245, -963, -535, 1174, -378, -693, 871, -93, -775, 546, 267, -512, 15, 94, 64, 128, -438, 28, 502, -473, -212, 619, -452, -319, 872, -345, -784, 743, 141, -676, 420, 127, -480, 392, -17, -502, 535, 104, -552, 415, -24, -593, 770, 205, -1060, 414, 633, -770, 181, 581, -706, 17, 523, -508, 70, 554, -445, -68, 188, -496, 463, 580, -913, 10, 740, -797, -97, 971, -694, -400, 1064, -493, -814, 905, 21, -740, 524, 163, -443, 317, -123, -510, 388, 178, -102, 291, -447, -453, 594, -81, -369, 717, -56, -739, 352, -56, -470, 798, 211, -805, 354, 180, -680, 468, 259, -684, 631, 450, -1043, 116, 607, -733, 238, 844, -706, -171]
899a71Q43j400L68J287r30k81N93p51J22Q41o30k2N83o86kN06p15L09Q56r22j47
920c49Q95p82k88R26n53j56J085p22p81Q73j85l43R22l13o38P48l72p40R61K28
940D16n65N27k57p89O89J92n64O29K11p13K39j14n41Q75L82p99L00J02q46N18
960a08N07p09M86N26j151q2Q36m56L0O87o60l05P06l68l95O50J1k87K50k37k36
981c05M00m9k03K49l0n1Q9l57K5M77k33j51L56k71j30M43m26k87Q28m5o08M15
1003A36m0n78N30K86n63L72L51q40j20O32p8J8K67m65k68L74K4r9K29K1j94j17
1025a22j14J82K51r4r3k7j73J83J89l54N2M05k87k37K98j07r2L87j95l90L99J18
1047A79m14J91K38k60K9R2k42J24L57k01k85N9J42O7j0o9K1o5p2J38K0l0K07j74
$$ y = [-171, 672, -728, -360, 927, -3, -284, 309, -442, -320, 521, -109, -131, 452, -234, -236, 270, -445, -136, 720, -202, -349, 546, -236, -524, 402, -151, -307, 778, 56, -725, 148, -37, -380, 542, 229, -409, 339, -33, -773, 188, 416, -149, 378, 121, -668, 21, 213, -351, 278, 489, -224, 15, -99, -640, 235, 617, -182, 118, 220, -626, -108, 399, -310, 176, 702, -449, -531, 305, -151, -121, 566, -94, -399, 307, -61, -456, 194, 205, -82, 168, -69, -305, 95, 46, -157, 92, 62, 11, 100, -257, -232, 245, 12, -139, 217, -54, -184, 259, -167, -454, 374, 329, -279, 136, 96, -482, 48, 334, -229, 143, 494, -346, -466, 166, 88, 106, 373, -92, -360, 14, 38, -61, 168, 189, -5, -122, -236, -54, 197, 103, 10, -17, -190, -7, 182, -172, -120, 285, -2, -239, 59, -48, -140, 247, 52, -338, 61, 179, -235, -44, 194, -66, -37, 55, -187, -63, 294, 93, -192, -133, 9, 76, 66, -3, 18, -47, -119, 19, 39, 9, 216, 42]
1071D2m42L14M16l12n3J95l78K0M94k49k80M59o6n01K52K92k33O3Q2l14K3L62
1093A86p8k88J33K03j90j32J81Qq7J83l7l80J85L77l43j31M58j82l31L11k6k48
1115b28M66P8o66J38M58k74n6K94k42j74L00q2j80L11J11l76j12K43J05p5L0n2
1137A7j69J05K49k25j58L55l9l99K09K17k26J05J02l64Q8L74k43j92K86k8j55
1158i1R1p4mJ78n3j12j3k3J73K9k97J68K64l81n5L57k06j2L85m24l07O32j4m80
1182b69L67R5m37K34J95l77J86L27l95j88L06P0p4Oo9k6J5P2M3j93J13K64l87
1205a22j92N58j13l91M70j52m84O47J12q24M81M86q03J17N78o25P3O89o67k95
1225d57Q15k93m26N66j16l32L96j42l16M48L6l00J31r7m0L50k03k01L64j66k13
$$ y = [42, -400, -86, 330, 18, -35, 160, -218, -198, 296, 47, -233, 226, 160, -341, -89, 203, -30, 33, 115, -199, -176, 186, 108, -180, -47, 156, -34, -166, 15, 23, -64, 119, 82, -298, -113, 264, -79, -210, 248, 66, -265, 46, 20, -228, 238, 316, -350, -212, 246, -28, -84, 210, -32, -206, 94, 12, -168, 143, 254, -122, -234, 9, 114, 39, 69, 17, -152, -47, 202, -23, -181, 174, 135, -264, -55, 162, -64, 41, 143, -221, -133, 241, -2, -194, 92, 64, -91, 0, -74, -78, 100, 47, -65, -78, -101, 72, 101, -196, -28, 236, -145, -200, 157, -49, -61, 324, -100, -407, 225, 211, -269, 98, 193, -244, -10, 185, -192, -6, 321, -74, -262, 44, 114, 40, 46, -23, -49, -34, 38, 81, -112, 1, 265, -122, -314, 244, 131, -260, 210, 58, -426, 221, 333, -491, -10, 476, -327, -210, 368, -257, -184, 505, -162, -457, 358, 65, -361, 205, 89, -243, 153, 11, -305, 143, 179, -121, 10, -87, -127, 223, 20, -181, 183, 17, -196]
1246a96L38j59j44N03k88m39N15L8l35L60j38l38M87r0m12M72Lm14L99j54l91
1267c83P03p6p05O02J03o93O37J39q84O90M16j151M21P96r80J84P78j021M1J062
1287F79q40l69J061m93n38Q32k96m67Q02j59o64N17J07l55K98p2k06L11j69j40
1307a61L16j79j2L24n48k5P77n33l03P90n17m08J010m74o91J167k19j077R98J58
1327C93j002R03J87j239P99N83j211N11P17j113L35P15j114K70J029j056j40R86
1345E53p87j52R72p31l42J031n24n83Q75j94m50O77l14m59O84r7m68M66q7k68
1365a98L88k50j96N49k31k86M38l49p6P12n68l56R24m82n68J028l61p48J214k89
1385B95j229J290K89j449R11N82j475P39R05j520L07J235j228j71J231q95l02
$$ y = [-196, 142, -17, -161, 342, 54, -385, 130, 168, -167, 193, 55, -283, 204, 114, -298, 174, 177, -237, 162, 8, -383, 320, 244, -461, 141, 244, -449, 188, 327, -557, 133, 549, -602, -181, 615, -365, -181, 597, -424, -383, 679, -161, -530, 531, 38, -500, 332, 36, -431, 371, 212, -452, 65, 172, -183, 115, 43, -163, 148, -21, -161, 155, -24, -36, 288, -260, -285, 492, -41, -344, 446, -71, -479, 531, 57, -634, 533, 314, -763, 235, 393, -609, 294, 481, -758, 41, 624, -587, -76, 641, -472, -137, 578, -536, -266, 763, -293, -433, 553, -234, -386, 586, -145, -487, 544, 20, -563, 312, 118, -332, 345, 31, -428, 256, 159, -309, 157, 70, -198, 190, -60, -256, 293, 62, -224, 214, -135, -211, 501, -67, -423, 501, 19, -549, 479, 118, -630, 584, 295, -934, 356, 645, -804, 107, 689, -786, -47, 858, -662, -355, 880, -348, -519, 712, -183, -485]
1402d85J103p37m98J140l73o32P54k09m47O59j92m43N97o9m46L09n7q8M01k98
1422a1j84M26l44j17N18m13l5P11o63m70R47k86m80R21l55p80R68j39r12J007
1442C09K34j053O41K06j043P88N55j167M84P37j159J62Q43r65J56J082r60m05
1460e55J057n66n30R61j85n13O81k20o93N49K35l57K54K2k66J27j08j19L23mK0
1481A13J25m76m0M76l18l3O43m05l60N05m88k81J078j67p61O95j41q86Q16L44
1501D39q59O79M24j273J85Q30p10J39Q19p44k86P04n40l34Q56m5l95L39k67m01
1521d40M47P6k25L68%l72L1r3k2M29%k08O0j28j39J98o5K6M12j92l50J41r7r7
1545b40M88q3k66L67k09n35M04K48k45M06j9p31K78L14m71L22M66n44l8K81n86
$$ y = [-485, 618, -119, -617, 523, 150, -482, 272, 63, -384, 275, 83, -360, 237, 168, -278, 31, -26, -114, 287, -11, -195, 231, -113, -230, 288, -125, -160, 551, -112, -582, 365, 79, -401, 520, 165, -615, 353, 214, -698, 309, 543, -510, 131, 337, -706, 82, 637, -530, -46, 691, -468, -306, 537, -428, -272, 810, -150, -555, 502, -64, -594, 367, 182, -331, 350, 130, -563, -14, 221, -136, 118, 140, -126, 1, -107, -226, 97, 93, 113, 238, -238, -278, 198, -120, -153, 490, 85, -275, 230, -258, -539, 539, 372, -389, 306, 165, -721, 95, 439, -420, 259, 683, -590, -405, 425, -285, -146, 673, -71, -357, 347, -193, -527, 329, 284, -111, 228, -39, -440, 7, 83, -142, 226, 226, -146, -115, -208, -230, 199, 199, -9, 51, -77, -216, -18, -83, -57, 355, 163, -187, -46, -143, -240, 248, 165, -101, 266, 57, -478, -74, 174, -71, 335, 316, -415, -137, 177, -294, 28, 494, -50, -88, 193, -393]
1566c93R5P55l68k67M76l42l42M79o8k22N38o2n78J69J44j97K58J34k46M4L4k55
1588b14K9K27R4Kj67r9J14n8l6J96o0k3K03k62k76M15K8k66L09K7l96K20J14m28
1612c07L09M05m53j01K77k95K2M01k58j37L74k15k80K70L2q7K26j57k03K29j7
1633C5j78J68L7p6J18j54j79K70P8j88R9oj57J74j6j82K18J07k74L0Q4o4J36J8
1657I8k30Q8J47j60M4P5j31J19M7k38J02J96j95J4R2j91J45J53k85QL16k21j08
1680a15K34j69n3L26j87k60L46mk78K03K9j94K03L3k98J66J75k10k5R6n1P7J7
1703F1j82N6J07p4N5qr5J28j9k08J63J70j79M0K0k19J68J96k59J5K27j93r0J79
1727E9j11M4K15k25j65K33j6r8J69r4n9J63j38j27K24J7j09Q0j31o7K71n5k26
$$ y = [-393, -298, 457, 89, -178, 298, -44, -386, 93, 25, -197, 341, 279, -299, -130, 14, -183, 75, 209, -37, 7, 41, -214, -185, 42, 136, 138, -29, -128, -14, -72, -108, 88, 28, 5, 208, -54, -330, 85, 113, -153, 156, 183, -213, 7, 121, -307, 2, 407, -46, -147, 130, -165, -143, 258, 0, -137, 237, 22, -258, 12, 44, -43, 183, 26, -177, 52, 35, -143, 25, 62, -14, 104, -50, -229, 41, 119, -69, 30, 24, -133, 41, 25, -157, 61, 168, -106, -76, 8, -56, 80, 98, -132, -44, 103, -57, -13, 62, -69, 50, 97, -141, -39, 157, -38, -24, 68, -123, 22, 175, -110, -102, 214, -7, -115, 119, -50, -103, 223, 36, -224, 122, 118, -160, 43, 72, -122, 81, 114, -184, -18, 157, -53, -78, 18, -33, 44, 61, -121, -65, 42, -32, 23, 15, -80, 48, 29, -179, -16, 154, -25, 15, 35, -184, -16, 180, -79, -64, 163, -30, -120, 59, -52, -8, 207, -18, -183, 50, 34, -64, 105, 11, -48, 115, -23, -150, 74, 91, -18, 62, -69, -136, 135, 80, -146]
1750a46K05L9k20J61Oj80K34M5l33R9K19j67K3O8j69O4J60j73k4J70o9o7K3n5
1774h7J17Q9j57k0N4n3Q8Pj30J25R2k66L9K14j23K4J34k99PL37j74j34K60j17
1798B7j63K22q0j35K97l4l21J24J27r6J14l1j49J04K9j38J03Q7q4O2j15j42K49
1821E7O6j87Q8j0j56J53L7j78J77J09k91%J62r3J38O8k85O1J95j89K6J82j45j4
1845b9J09k22M1K97j44j30J27j37M7K20k04m8K28j63j40K40q2l5K18k20k02L23
1867I4J0k06K04m9k09J90J4k12K43Q8k55L4K1p3K25l2k10J53kj94J91L8j78K32
1891A17k1l83K34K46k89J13J37l69J26K88l33M2L37k89j24K41j62M4K99k74j63
1912a83K80r3q5K31j47o3J96k02q9K90n2j05J26k27k4L22j79j27L15j97j81L26
$$ y = [-146, 59, 98, -122, 39, 45, -135, 99, 144, -189, -90, 129, -38, -15, 53, -116, -52, 108, -65, -89, 81, 12, -55, -32, -87, 30, 119, -38, -58, -4, -57, 31, 38, -92, 33, 125, -141, -102, 112, -11, 13, 147, -152, -145, 192, 18, -116, 144, 27, -136, 86, 6, -129, 168, 134, -187, -63, 64, -32, 82, 51, -98, 6, 35, -103, 0, 87, 3, 65, -50, -192, 57, 123, -64, 24, 14, -142, 11, 48, -130, 47, 156, -135, -135, 27, -66, 72, 140, -145, -84, 111, -78, -52, 130, -15, -29, 80, -142, -101, 196, 52, -78, 49, -88, -41, 179, -25, -73, 155, -8, -148, 92, 10, -25, 193, -27, -229, 94, 104, -102, 102, 53, -156, 34, 48, -164, 79, 167, -88, -54, -33, -106, 119, 87, -123, 30, 28, -166, 25, 63, -115, 117, 96, -287, -53, 193, -96, 17, 154, -215, -89, 199, -134, -92, 245, -44, -168, 73, -89, -45, 254, -20, -183, 97, 4, -81, 150, 3, -60, 136, -66, -155, 135, 83, -22, 104, -123, -147, 175, -4, -131, 184, -13, -194, 132]
1934A32j67j43M62j94m37M04N5l21L59K7m75L25J42m58K79K79m00Q9J48l70K48
1955a6L08m20N4K18l21J04K72l27R7K93m56k0M05k23J2K51l79l4L75k42n8L41
1977B34k42j04K60k91qM71k89k07L21k42r0M67k92j88M62k73l34N17p5k77M42
1998B62k56m44N90K5m68M48J5n56M29J39n54M69K73o89J66L88m72K13L66n65N7
2019a64M25m02j4M05l13l4K64l50N7L88k89p9K44k93O5L39l59K7L79m08j06M11
2041A93k94L0M50m88k04N62k92j89N91l23l25N48l21l66P67q4n62M59j17m81O34
2062A88Q5o12M70R3o51L88K81m95L61J81o73K63M11m87J50L05m85J38L61m71P3
2083a26M06l97oL01k89Q6K90m25NL67l13P2K59l93R4L40m82N3N00l98n4M13n34
$$ y = [132, -35, -178, 284, 90, -347, 57, 112, -209, 150, 177, -298, 27, 169, -289, -10, 269, -131, -42, 106, -264, -16, 292, -128, -74, 144, -177, -73, 199, -128, -31, 262, -194, -214, 191, -32, -20, 231, -148, -182, 193, -49, -107, 234, -8, -112, 148, -143, -151, 320, 31, -176, 145, -97, -187, 280, -12, -200, 262, -11, -345, 172, 97, -180, 262, 6, -438, 152, 177, -291, 157, 172, -384, 45, 184, -370, 99, 372, -317, -151, 237, -235, -22, 344, -221, -164, 261, -141, -155, 250, -63, -97, 167, -183, -126, 262, -27, -106, 138, -155, -90, 249, -110, -83, 296, -112, -218, 193, -101, -71, 379, -109, -313, 249, -43, -232, 359, 36, -289, 259, -62, -428, 339, 255, -307, 152, 35, -446, 188, 273, -339, 131, 224, -427, -39, 242, -253, 108, 289, -384, -121, 290, -197, -47, 258, -227, -89, 272, -199, -126, 280, -117, -123, 178, -111, -25, 265, -160, -155, 212, -101, -29, 230, -163, -69, 271, -211, -158, 342, -56, -110, 303, -231]
2106b31n6O87m26k24O56m17m26O66k21l40P79k29p26N84O4n35O28J01p08M09J56
2127A91o50M37M19n56J27J99n05K45L88m40Q7K79l88R3K38l44J75K47m37J26K66
2148A97l39J48J75m30K21L74n27R5L86m93Q9M27n22O0N73n36k03O03l89j54O49
2169D04l93l53O73l15m73P08n9m58N27j55n93N85J69n48M17J25n88K69K19m27
2189b66L34K68n61Q7K42k94K17J98m06J13K40l73J38K55l08J30J38m08J96L14
2209B54m00R4K58m04J47L25m80J04M26m67l8M47l71m5N02m56k02O01k85k92N47
2230B65k08l34M91j57m11N50Qm78L42M9m07M09R1m67K82J77m38J85K10k96J70
2251C3J29l91J43K45k49P0J35k63J14J49k84J55K10k94K1J67k65J67K66l89J5
$$ y = [-231, -287, 400, -26, -250, 406, -11, -437, 229, 8, -332, 447, 218, -508, 76, 140, -395, 233, 334, -374, 35, 191, -459, -22, 397, -159, -32, 167, -338, -93, 295, -145, -58, 221, -167, -74, 164, -180, -5, 242, -195, -69, 197, -142, 6, 181, -249, -28, 346, -181, -86, 300, -193, -104, 323, -199, -139, 434, -102, -305, 298, -91, -245, 404, 11, -342, 331, 16, -457, 251, 192, -266, 261, 106, -487, 98, 267, -281, 136, 261, -327, -58, 161, -266, 68, 336, -225, -138, 104, -190, 27, 225, -181, -68, 172, -201, -63, 192, -116, 14, 152, -256, -60, 254, -146, -52, 206, -198, -51, 274, -206, -102, 324, -143, -181, 266, -105, -150, 352, -104, -306, 295, 10, -282, 265, 57, -277, 214, 57, -354, 196, 204, -274, 68, 117, -290, 119, 210, -257, 25, 202, -236, -51, 159, -137, 33, 162, -229, -86, 159, -90, -20, 115, -148, -34, 115, -169, -14, 196, -98, -77, 90, -175, -8, 258, -131, -116]
2272a16L17l29K0L30k90j8L22l51j17M70j80k02L28k41j76M43j38k83L73o7l26
2293b31L06Nk48L06j7l82K48J49k57J56O7k80K01J05l22J67J98k60O3J11k48J25
2315c8J87k49M7K16k33k9J44j44R8J98k58p9K03j43N1J86k08j2K03k21n8L12j35
2338C8j26K16j82p6L42j42k49K43Mj73K34m5k58K01O2k36K04J15k52L6N0j66K15
2361E5J43k63j9J25j36M2J32j44O8J14k13OJ33r6L8J05j49N5J08k34j6K15m7L1
2385E3Q0k52n2K29m5l4J78j28j40J12p1J2K40q1k03J06mm9J35p2j37K02L0j83
2409g4P7J6j29J23R1j38R6L3k40RJ86j6N2k1j96J4J25m0L7Q5j07j4K2r2P1J17
2435H7r7k9N9n7J4M4j26L9K13j13p7M6j08J9J89n5o2R5r3j45J39P3j8P9j15j34
$$ y = [-116, 201, -128, -108, 222, -68, -86, 236, -115, -232, 238, 58, -144, 184, -57, -233, 210, 72, -211, 162, 95, -231, 75, 80, -168, 138, 121, -261, -13, 136, -121, 35, 102, -178, 23, 128, -194, -27, 171, -89, -26, 85, -163, -38, 149, -100, -53, 163, -70, -99, 45, -99, -1, 197, -61, -140, 63, -80, -29, 157, -51, -63, 140, -81, -139, 173, 38, -88, 128, -54, -130, 212, 70, -179, 64, 68, -105, 129, 84, -174, 27, 89, -147, 57, 172, -80, -44, 6, -160, 55, 198, -65, -84, 41, -95, -53, 79, -65, 3, 117, -96, -90, 43, -53, -15, 90, -59, -4, 104, -130, -146, 69, 22, 53, 133, -119, -171, 58, 13, -21, 157, 29, -111, 1, -70, -58, 182, 101, -102, 4, 0, -49, 86, 14, -123, 79, 109, -74, 3, 19, -110, 13, 104, -34, 62, 95, -145, -136, 50, 34, 86, 65, -131, -117, 8, -32, 5, 90, -17, -31, -9, -101, -30, 87, -10, -39, 20, -37, -23, 21, -105, -66, 147, 34, -43, 3, -105, -86, 103, 48, -14, 81, -12, -157, -18, 55, 37, 116, 1, -133]
2461a33J24Q6p9J3K2p2P2np3M5M1o5K9M4o0K9m2r7J28J05q6j9l3q0Q9R3j14L7
2489aM6r6k0P9l4M4M0j28J1R6m7k5M1n1M7Q3j17m9R8mk5N7m4l7Q0m3o7J08L4r7
2519b1J4Kj7P4Oj02K1O7l1k6J2mK7k0k3K2LK3np3J6R6m7q5P6J1m6N6l4p4J17L1
2551F6j37J8R6r1K9P0j05J6J05q9m3R3om6OlQR0l8q1nO3K2nk7k1J9rRL6j3Ql0
2584Eo5O3P7m7m9Jj9N1O0r9k8P2k2k1N0m4k2N3o0rJ39m7j12L3Oj2J56n6j91R6
2614d1R3r5N6M7j17JR5p5J1J25j02j20R1P2kNn4o3N3P1K6p7l1K9j3j5Q5K1r4j1
2644b9lj6J28L7j86k4J36m2K0P6j42n9J72m2q0J22m8j35Q0P4o3P9k3j71O3J54
2670G8m7l1j6o4M5R0m3j3J4o7kO5K6J2k3j29L1J14J8j3m9p7L4J01lm9J9m6rM4
$$ y = [-133, -9, 77, -2, 11, 33, -39, 33, 28, -45, 0, 41, -24, 5, 49, -11, 18, -24, -121, 7, 112, 26, 7, -26, -106, -17, 76, -38, -1, 45, -51, -71, 8, -26, 18, 58, -70, -59, 37, -10, -35, 6, -45, 2, 85, -32, -81, 17, 13, -12, 45, 1, -36, 44, 1, -66, 42, 76, -21, -7, -5, -22, 52, 58, -44, -23, 44, 13, -13, -1, -5, 22, 2, -21, 1, 4, 27, 22, -51, -35, 61, 14, -71, 5, 16, -30, 26, -8, -82, 35, 66, -71, -53, 43, -48, -19, 51, -54, -38, 67, -22, -65, 28, 22, -24, -18, -21, -13, 77, 39, -42, -47, 16, 38, 33, 6, -15, 4, -5, 4, 40, 27, 35, 5, -60, 3, 80, 33, -16, -15, -34, 17, 77, -22, -50, 22, 0, -21, 29, -15, -37, 16, -44, -53, 86, 39, -73, -40, -34, -46, 110, 54, -137, -41, 52, -43, 13, 60, -57, -56, 39, -36, -25, 100, -2, -122, -31, 41, 39, 44, -10, -73, -20, 51, 77, 0, -31, -2, -15, -30, 55, 76, -18, -29, -32, -48, 80, 117, -69, -93, 43, 1, 21, 97, -45, -104, 68, 26, -54, 68, 20, -115, -35, 39, -24, 55, 32, -139, -76, 78, 31, 0, -16, -80, -35, 55, 12, -1, 13, -54, -56, 9, 35, 47, 24, -105, -74, 40, 58, 45, -4, -81, -47, 54, 51, 2, 21, -25, -34, 10]
2700A0PL2Qj13pJ04MJ5k4j19J1J72m4q7P9o4n9J37j4r9Q4oj67J22J25j24k7L3
2728a1j04R9J39j40p7R4l9%R2l6o4M2l7j8J00K4p1l4l2N2J05m6n4j7nM3N5o8k
2757a0O8q7l1J21l8l3N6q2m4J71oj57O6L8q1R8Jj24P3O4j17M2Q6j04J2L8j00Q2
2785BJ23j85l3J20n1QJ05j34o8J67m1r4J28j6r4M6Km0J17oj27K4M9qN6k8p3P8
2813B7j8n5P6J3n1M8o8m5J18J7j11N8Rp7J15nj36J30N2j88P1R6j42P1J14k07K8
2840f0J80j59n5J60o6o3J09r7l9J64m3j08R9m1m4J14m9q6J45k3j40R4M1o4O4j4
2866A9j20J04L4p8N5J3l7M7m9o7J28K8j07N7j1j05J35L5j50R0N5j64N9J05j19
2891d3O8N1j77O5J54j28j7P5j43L5J79j36n8J64j21j14J91Mq3J01r3j28J65N7
$$ y = [10, 17, 49, 57, -56, -63, 41, 45, 60, 36, -83, -72, 100, 56, -31, 48, -16, -75, 62, 48, -51, 33, 27, -140, -18, 107, -17, -44, -11, -115, -16, 123, -17, -94, 0, -39, -39, 53, 17, -47, -5, -42, -60, 40, 64, -7, -41, -73, -21, 84, 38, -16, -33, -38, 5, 60, -8, -10, 58, -29, -60, 61, 23, -10, 46, -36, -80, 91, 85, -72, -6, 32, -49, 49, 50, -74, -1, 63, -54, -12, 74, -30, -18, 20, -80, 2, 125, -60, -93, 27, -24, -16, 89, -45, -113, 54, 13, -81, 47, 31, -63, -17, -15, -55, 62, 56, -71, -47, 2, -6, 50, 22, -51, 27, 9, -46, 30, 43, -8, 40, -28, -73, 45, 62, -49, 9, 18, -59, 56, 51, -85, 45, 97, -91, -20, 76, -66, 5, 119, -88, -60, 120, -39, -94, 66, 0, -63, 46, -51, -90, 74, 31, -77, 22, -19, -63, 51, 2, -84, 61, 38, -102, -8, 33, -31, 33, 19, -101, 3, 37, -41, 14, 27, -10, 37, -12, -79, 49, 77, -30, 27, 16, -89, 46, 81, -69, 21, 76, -88, -29, 76, -43, 25, 76, -101, -36, 118, -10, -27, 48, -95, -60, 119, -17, -75, 89, -32, -146, 45, 49, -34, 67, -26, -154, 11, 68]
2915F8p8K4l6l5P6l7m7J01j8p3O7k7o8J13k3r4J52J0j17K5k7l7J73L4j85N4J0
2942Ej17J48P3j49R8J8k22R9J88j51oQ4j48M3J61j56o4J39o0oJ27j41o1J19q7
2967f6j0K15n4j77N5m8k3K24%j82L2Qo1R9K9n4P2q2p3J09oo1R5k9p6J61l8k02
2995a43J16Q0n6J06j0k08N3Q6q0J19Q5j88rL1r3J53J38k03m0J04r7J3J53j55m7
3020i2J71o9p4J07o5r6J19jRQ8j29j15J11K1M3R6j37j28J26J7o4J36j9j18N4j3
3046b2n6J23J4j28Q2J5n9Q6o2j13J57P3j31N3mj51J16J07j16M0P0j74oJ28k6L3
3072D9M7j63j4J40m4j6N5q9LJ02r8k8J28q1p7J39l9n8Q6p5o7J40Pp2K2m1k5J07
3100C8l5o0J01m2p8R4j2n6J11m1j19J18L7j18O8J2p7J14Pj33P4O1j08N6N7j18
$$ y = [68, -10, 14, -22, -57, 19, -18, -65, 36, 18, -55, 12, -15, -83, 30, 7, -87, 65, 75, -42, -17, -44, -81, 92, 126, -59, -5, 5, -112, 36, 109, -40, 58, 76, -146, -47, 141, -10, -16, 68, -80, -37, 124, -32, -96, 43, -17, -23, 104, -37, -98, 21, -66, -76, 139, 85, -92, -37, -85, -108, 116, 116, -66, -34, -26, -87, 12, 41, -13, 59, -23, -96, 13, 7, -54, 41, 12, -64, 97, 59, -143, -27, 53, -3, 103, 93, -115, -62, 24, -56, 63, 148, -40, -49, -18, -111, 42, 180, -23, -63, 41, -56, -43, 110, -45, -92, 79, 10, -64, 43, -22, -118, 1, 0, 9, 97, -32, -147, -36, -15, 28, 124, -13, -141, -15, 2, -62, 74, 55, -63, -9, -22, -78, 45, 59, -69, 13, 28, -31, 55, -7, -120, 37, 110, -21, 32, 28, -123, -7, 100, -16, 24, 94, -80, -86, 42, 16, 49, 96, -67, -81, 59, 15, -1, 54, -35, -32, 70, -28, -56, 72, -9, -86, 53, 14, -44, 42, -33, -100, 40, 47, -25, -3, -44, -69, 38, 3, -57, 44, 2, -76, 18, 6, -50, 61, 20, -99, 19, 56, -62, 6, 18, -59, 55, 62, -71, 3, 64, -44, 12, 69, -49]
3126d9N4Q5j56K3J58j25m9R8o1nJ05o4p1Q8j8m7N4m2RN2p3j9Q1l1j8O9q6j4J12
3155F0q3n5J23k3o7O3n5n6J51k7j07Q1K1r6R4jq7J00J7j27N3Q5r2K7K6o6O5N0
3183G4j17NO9m7L3M2j02K9P2j04L1R9q2m2P3p9J0J24q6q3Q6lk0L4k9l6O0j0l3
3212c2N3l4k5N4o5J2J06p2q2Q2k2qJ05p7j01J18Rr4J05J0r6P4L0j15R9M7j35J5
3240c9Q4n6K3M5j13J9J10n5k6L9o0K8L1n7L9N3r8LN3m4L6N0j32QJ16o4k4Q0p5
3269b6m6J22n6m0R5m0q3P1J5l0N8n5o8J04J0p5N3k4m1Q6jp8O6Jp3N4L2n6O1rj11
3300h4P0Q1q1K7K5q7O5M6r0J2P9o9j1O4n6J3N0q6QN6l8kJ6o2L1Q7j03j7R6n4k4
3331c8Q3p4j6R9n8p8J11Jq1N1%n4P2%p7M4M2m5J8lj2K4Rm9L9K6l7J5j6l9Q1jp6
$$ y = [-49, 5, 90, -66, -43, 115, -10, -59, 39, -22, -27, 78, 14, -57, 31, 13, -34, 20, -22, -13, 39, -34, -53, 28, -3, -21, 48, -38, -52, 60, -23, -78, 45, 22, -45, 18, -37, -93, 58, 31, -76, 5, 26, -70, 24, 23, -64, 36, 53, -74, -21, 64, -28, -1, 25, -41, 24, 74, -43, -38, 31, -16, 17, 59, -43, -14, 58, -46, -15, 84, 2, -40, 33, -46, -36, 88, 2, -81, 5, 2, -18, 16, -13, -49, 11, 1, -32, 21, -13, -38, 16, -49, -37, 69, -3, -85, -3, -25, -33, 72, -5, -106, 12, 21, -73, 32, 42, -54, 20, 50, -65, 34, 81, -54, -39, 45, -11, 12, 57, -56, -37, 73, 18, -8, 31, -29, -1, 30, -27, 12, 65, -33, -30, 23, -21, 15, 65, -67, -59, 57, -7, -31, 49, -26, -72, 50, -6, -46, 49, 9, -74, -3, 12, -18, 40, -15, -83, 21, 31, -44, 9, -15, -56, 30, 29, -49, 17, 18, -55, -1, 31, -25, 36, 27, -84, -14, 67, -14, 13, 38, -49, 16, 62, -28, -16, 63, -6, -17, 47, -9, 4, 54, -32, -24, 32, -6, -8, 8, -54, -23, 64, -39, -56, 40, -14, -38, 45, -29, -45, 54, -4, -82, 29, 30, -51, 0, 0, -54, 18, 18, -59, -15, 27, -18, 0, -3, -15, 9, 18, -31, 8, 34, -3, 12, -4, -43, 38, 37, -39]
3364c9L5K5m1M6J0o5N6M1j00MP3n7J4M0o6j0Q9o5k6N8k2j2K8l7LO6n0m5N6j9%
3395a0K9o2pQ1k5n7N8j3j4L5k4m0O7Mo2L7K3k4J9k1l2P0nl7J9Nl0M0%n1N9J3p4
3428b9K5L0m8N9Nj06N3O7o5JL2m0J4L9o8OQ5p7k7M6j6PL9o2k1P8j7l8L1j6jL7
3460B3n1k0O9l8j6L8j6j2M0l9m0J08j2n9K6j0j5N9pn9L3K0l8L5ok5M1j7o1O7L5
3491E3o0K1lo0P8L0r9K1N1m8LM3m9PM2o1JO6l0l0J4rJ1M4m0l5L9jj8Pj1j4N5l8
3525b0j4M1j2j8K7l3%O9m9m7N0K4l7M9k0n4O0J1n6M9L1o5J8Jk5O9J1p9LM5k9Q
3557HJ7n6K4O2n5k3N2m2%K6m4K5M5o0k5M6Kj3L3n6j5P9k2m1L2J1k5K3j7j0K8j
3589Hl6L6lqL9o9j0R5j5o3M5j8n7Q8K3q0L8K1p8J9P0l6kL7o6RP0n1j8L9k5j1L2
$$ y = [-39, -4, 21, -20, 26, 36, -29, 27, 68, -32, -28, 45, -12, 2, 42, -24, -34, 55, -10, -36, 22, 0, -12, 16, -21, -18, 48, -2, -47, 9, -10, -10, 19, -43, -50, 31, 6, -51, 7, -6, -20, 15, -9, -49, 18, 22, -40, -3, 20, -4, 15, -6, -38, 32, 27, -10, 9, 14, -16, 24, 24, -27, 32, 45, -29, -4, 26, -22, 37, 42, -64, -11, 56, -9, -8, 24, -16, -2, 37, -31, -25, 60, -17, -44, 2, -14, -7, 32, -30, -51, 27, 10, -28, 3, -13, -14, 23, -28, -48, 21, -17, -33, 5, -11, -23, 17, -22, -62, 46, 34, -25, 1, -9, -24, 35, 28, -31, 2, 22, -16, 19, 13, -12, 29, 12, -49, 18, 53, -7, 14, 11, -49, 29, 59, -40, -19, 32, -16, -13, 30, -19, -12, 30, -31, -30, 36, 6, -24, -10, -19, -8, 36, -4, -39, 0, -1, -19, -12, -23, -37, 18, -20, -34, 7, -5, -23, 4, -29, -29, 40, -9, -56, -6, 18, -19, 30, 10, -44, 16, 27, -29, 20, 51, -14, 4, 5, -20, 49, 60, -19, -16, 29, 0, 8, 25, -31, -7, 55, 0, -23, 29, -13, -13, 13, -31, -6, 39, -21, -46, 0, 2, -11, 22, -34, -49, 30, 8, -33, -1, 10, -15, 8, -9, -19, 9, 8, -28, 8, 5, -3, 36, -33, -43, 52, 37, -26, 19, 1, -56, 32, 55, -25, 13, 34, -44, -25, 45, 9, 7, 44, -22, -13, 57, 6, -12, 27, 2, -9, 23]
3622B3m3pO0j6n2M8kl5K0j3JL1nk5Kj3J8L9n8JN3l1l8M3J4m7L7Jo6O8L3p3J1L3
3656A2j2K8j7l1K4K2l9M3jl7L5Ro2K2Q6p5k7N7l3j6N8l6m3Q0l3m0K6MmK9k7l2
3688c0L3Kl4J2L2m1L4k7k6K5K8j3j3j0J4L2l2j7L1j4mJ9j0j4O0Kr2M6M7n8K2K6
3720C0n3K5L4m6j8Q5l6l4J9j9K3L5m3j3L3j9k4L6nj3L8l2m5N4Pk8nQj0K6j4j3
3752a7J5Mplj4pN1k8m5L3K6l8K8ok6L1Rn0L0L3k1mMm3N2K7o6K1M9m7JK7m5J1O5
3787E0m3n5O0lj9M8l8oJ7j3j5K4J2k0rk4J7M1jm9J9Qk6K5Nj7L8j8n1J6K8kMj1
3821hl5L3Pk8J3K4j2mJl6M2L0l8qL9k8MJ9m1K8M3k5l2K8oqJ9j8j2M6qm4K8Mj6
3856AQnk0L6mm1kK2J8J0k7k2J2K7k4J4J4j8%l1j8M7K8l3qJk1K6nrK4J5l4j1K3
$$ y = [23, -20, -27, 33, 17, -35, 13, 11, -24, -4, -17, -16, 15, 10, -15, -13, -26, -8, 31, -27, -26, 27, -4, -42, 1, 15, -32, 5, 6, -60, 8, 41, -32, -21, 12, 0, 28, 11, -20, 4, 26, -13, 30, 29, -8, 27, 36, -26, -4, 82, 7, -20, 37, 4, -12, 46, 10, -33, 47, 14, -26, 0, 4, 0, 29, 2, -30, 3, 5, -29, -17, 15, -26, 8, -19, -45, -20, 8, -5, -18, -28, -14, 18, -14, -31, 0, -14, -18, 1, -9, -23, 37, 39, -53, -7, 40, -18, 4, 30, -23, 2, 36, -10, -28, 57, 21, -13, 6, -13, 10, 45, 2, -11, 22, 3, -21, 15, 10, -3, 35, 3, -42, 12, 19, -9, -14, -6, -16, 10, -4, -17, -2, 2, -5, -8, -22, -29, 22, -6, -51, -18, 8, -30, -2, -8, -34, -3, 6, -44, -14, 19, -2, -6, -2, -45, 7, 34, -32, -11, 38, -9, -8, 19, -26, -15, 50, 7, -48, 12, 9, -10, 38, 0, -6, 11, -2, -17, 7, 19, -1, -10, -34, -17, 24, 23, -26, -7, 1, -25, 0, 5, -12, 26, 8, -43, -27, 1, -1, 3, -8, -43, -10, -3, -31, -18, 6, -6, -10, -9, -45, -3, 27, -11, -19, 20, -8, -4, 15, -26, 2, 45, 20, -12, 16, 10, 2, 21, 3, -9, 37, 29, -15, 13, 17, 1, 9, 4, -16, 20, 16, -25, -27, -5, 13, 23, -4, -26, -14, 13, -11, 3, 17, -1, -1, -32, -50, -3, 25, -8, -16, -15, -36, -10, -15, -24, 0, 15, -19, -30, -7]
3891goK9Lm2KM2j9k4K7rK0K1l2l1L8j1k4M0Qoqk3j9O0Kk4loPpQj5nL5j8j0Lj3
3929a7J8qnK9nk6j2mJ0M2%o4J4K5j9K5Qj9mJ4l4J8M0j0k9Lj6L0L6m8j6M2j0oJ3
3964A5k9KL0nj7L4Nm2jK6j4L0k5l3RL8jlj8rQJ5k6J2Jmj3j0K9K7k9l6K0JJ7L0
4000C4m7k7L4J8l6K6Ql4%L2l4L0J8l0k8M9J6k5Pl2j1M4lk5J5J8j5MJOPj6mJ9o
4035A3KKn3K6O1j0o4J7j4PL7mk9K1j4j8J2J5pJ2k7k6M6J0l4PrmM9j2m8M1Nl1K1
4070@K6l5PJ0l6K6M8l2k9L0j9OK4l0pK8J5m5K6Mj8J0mJ%Nqj3PJ9J6n5rO2k5j7
4106a2L3l8j5N8k4m1O4J3o6J2J2l9M4K9q2J2O6k6l7K4jLJ8k0JK5j4j1J0j3K3J3
4138B1l9J1L8l2kQj5QM7k7m5O5pk9J7nk4L4om1M5J5l7lpOJ5kl1K4j1RL3m7j9N3
$$ y = [-7, -13, 16, 19, -23, -21, 21, 2, -22, 5, -4, 16, 37, 5, -26, 12, 1, -23, 17, 25, 19, 11, -12, -31, 29, 31, 7, 4, -2, 5, -2, 6, -9, -14, 21, 3, -7, -4, -17, 1, -7, -12, 17, 12, -14, -26, -30, -20, 22, 22, -42, -28, -3, -22, 3, 11, -8, -12, 2, -32, -14, 26, 16, -13, -10, -26, 4, 40, -8, -24, 18, 8, 2, 15, -14, -12, 18, 13, -4, 30, 35, -7, -8, 18, 4, 34, 9, -24, -15, 23, 22, 19, 1, -8, 0, 15, -11, 1, 2, -2, -15, -25, 4, 31, 2, -34, -14, -13, 4, 34, -13, -40, -6, 12, -24, 2, 10, -24, -24, 8, -26, 4, 22, -8, -36, 13, 29, 4, 11, -21, -32, 12, 9, -16, -1, 17, 2, 6, 7, 13, 20, 4, 0, 19, 13, 15, 17, -36, -10, 51, 41, -23, -6, -20, -13, 24, 20, -9, 12, -2, -20, -8, 7, 0, 12, -15, -41, 5, 15, -19, -12, -21, -25, 24, 12, -36, 5, 10, -21, 0, 26, -9, -2, 8, -28, -2, 46, 14, -15, 15, -4, 2, 26, -4, -11, 17, 32, -13, 13, 17, -1, 9, 5, 6, 6, 11, 3, -10, -3, 16, 32, -23, -32, 30, 5, -12, 21, -17, -32, 26, 2, -39, 25, 38, -28, -16, -4, -43, 1, 30, -52, -40, 26, 0, -37, -13, -14, -11, 7, -13, -12, 13, -1, -12, -2, -15, 8, 21, -18, -7, 31, -1, -3, 5, -10, -2, 45, 18, -27, 38, 31, 2, 19, 14, -10, 24, 18, -23, 22, 37, 0, -3, -10, -4, 11, 9, -22, 2, -9, 0, 33, -14, -33, 20]
4174B0j2n1N3J2n9K1L6n8L0L5n8kP2l8k6L5k0j9N4j6k5K2%j1NJJ2Jj8MJ2%J0Q
4208C0m1J4M7m3j3M8m5j8N4k6j8O3l9n3N3J8m8L5ll6K4J6l2NK2oppj1K7%k6J5
4241aNk2K6j3l1L7K6n8KM6l4J5L1m5lO0m1k7M0J2m1L0lk9L9Kl7OJ0K0Nk2qL6j8
4276A5j7J5j3NM4n8l0N6Om8L7Om6K8J3n2L1L8n2%L0j3mJ9l0nK6kj4QNjjj2K1N
4312A0j1kNj5K4Nm3NM2qk1K9l2nM9k3j9L5ml2K0QpJ5ol6K8K0j4nj8mM2k3j1J9
4348A7rk7L5oj5K0qm6J7M7k6qQl1K0L0k5j3K2j1jRlMkk1J4M0k8pqj2L5K7l8KP
4385Ik5J3M2m4LK0k6j7O1j4k6J7j3j4L0J3m4j3L5%J7j0k9J0JRLJ9l8j3lMM5ql9
4420b5NJPMMj7oM4k8j0K2j6J3J5j7J6Mm2%L2lK3j0l5qM9rQMj8pK3l4J8K7j0l6
$$ y = [20, 8, -43, 10, 22, -37, -16, 20, -38, -8, 27, -31, -33, 39, 1, -25, 10, -10, -29, 25, 9, -16, 6, 6, -5, 0, 1, 13, 14, -4, 0, 12, 12, 22, 30, -11, 3, 50, 7, -6, 42, -3, -21, 33, 7, -11, 52, 13, -40, 13, 31, -17, 18, 15, -21, 3, 19, -13, -8, 14, 8, 1, -6, -17, 10, 10, -16, -1, 4, -18, 8, -5, -36, 1, 27, -31, -29, 17, -17, -2, 29, -16, -19, 41, 0, -27, 13, 25, -16, 14, 11, -18, 21, 23, -14, -8, 2, 22, 27, 5, -3, 33, 15, -2, 13, 0, 5, 49, -9, -39, 17, 23, -25, 12, 18, -28, 0, 13, -39, -8, 30, -22, -22, 8, -5, -9, 10, -20, -25, 1, -1, -15, -7, -2, -3, -4, -16, 5, 10, -1, -3, 2, -13, 11, 16, -27, -22, 20, 12, -9, 20, -12, -17, 32, 9, -10, 25, 21, -11, 9, 17, 10, 25, 19, -17, 11, 31, 17, 12, -6, -10, 32, 9, -2, 17, 8, -19, 16, 10, -5, 15, 7, -39, -22, 25, -1, -9, -1, -32, -12, 18, -7, -20, 2, -9, -10, -1, -4, 0, -2, -23, -9, 31, 3, -4, -12, -24, 11, 38, 0, 2, 9, -16, -3, 39, -5, -2, 18, -8, -25, 36, 22, -4, 13, 0, -14, 16, 29, -15, -28, 7, 7, 24, 14, -15, -5, -4, 5, 8, 27, -11, -24, -27, -23, 22, 14, -25, -20, -19, -12, -8, -4, -21, -27, 17, -11, -21, 1, -15, -2, 13, -4, 12, 16, -26, -26, 6, 3, 26, 16, -19, -27, 22, 13, 21, 25, 7, 0, 23, -11, 7, 34, 24, -12]
4457a2K3jmJ7k5l6M5K8k8k3J0nJ0L4k1j2j7rK0MJ3Ol7k0L7J4l1J6j1rL8ll2oL9
4492A2k1PJ5rj4Pj3RM4k7j2j3OJ7L3k7qJ1nqJ0oRJ0l3kL1j9j4J9Mj2J4j5l8L0
4528hK9j3J3rl0JK3j1qJ5qk8RJ5K3l1j1J1J4%Mqj6L3lj5RPk9JK6pJ2J3n0LK7J3
4566A6pJ5j7j8L8mk9RJ3qj0J5j2Qn%J7j3Lj2rML4Nl5oJjJ4nj6JJ1k0RK4j3omj1
4606b4NL8k0j1%kQKpNJ3mj4PLMjj4PM3l3k9N0j2JJ9k2l2L7Kk8J3K3j9oPj3K2J1
4645B9m2RJ2NJ7l1k0J6RlNj7pJ5jk1J3J4k8LJ5nJ4J3l0NK6j4kMKj2J0j9MM0j5
4682A3j8J0J3k7J2Nj0J4J1j1rkLJ7j0j8J4J0k2K1j0MkloJ2Pj1j1LNN%j4mJ0j2
4719a1NkoJ8j0j8LL1k2jJ1rlK8k1mK2oj7MRNOrj5J2J6j8J7okJ8j0k0K2Rpj6Kq
$$ y = [-12, 11, 10, 6, 23, -2, -38, 7, 35, 7, -16, -6, -11, -1, 33, 12, 0, -17, -26, -6, -2, 11, 17, -20, -40, -3, 11, -20, -4, -15, -24, 14, 11, -21, -27, 12, -9, -2, 13, 4, -10, -3, -16, -7, 37, 10, -2, -15, -9, 8, 41, 14, 6, 17, 12, 4, 14, 8, 17, 27, -6, -8, 23, 4, -10, 9, 13, 1, 15, 0, -38, -8, 21, 8, 21, 12, -18, -17, 6, -5, -13, 2, -6, -34, -25, -10, 13, -18, -29, -18, -4, -4, 0, -8, -24, 9, 6, -9, 0, 7, -22, -21, 5, -2, 10, 23, -27, -24, 3, 16, 9, 24, 7, -11, 27, 23, -6, 3, 16, 8, -2, 13, 1, 9, 4, 4, 21, 8, 11, -1, -10, -6, 28, 33, -2, -8, -7, -8, 6, 1, -15, -14, -3, -23, -14, 10, -3, -9, -13, -24, -19, 19, -1, -12, -12, -14, -6, -4, -11, -6, 7, 3, -11, -4, -1, 3, 2, -12, -5, 38, 5, -24, 26, 14, 15, 34, 12, -20, 17, 19, -9, 4, 27, 8, 2, 9, -4, 18, 29, -13, -4, 8, 13, 30, -1, -21, -5, 4, 1, 6, -11, -18, -3, -4, -25, -12, 2, -26, -23, -8, -13, 1, 14, -16, -11, 15, 1, -1, 3, 5, -7, 3, -16, -12, 28, 13, -5, 5, 18, -9, 3, 8, -2, 12, 23, 12, 3, 1, 4, 21, 11, -7, 7, 17, -5, 16, 6, 10, 8, 5, -1, 11, 18, 7, -4, -1, 4, 9, 9, -5, -9, 1, -11, -6, -8, -14, 4, -6, -24, -21, 10, -12, -13, -2, -11, -14, 14, -7, -11, 11, 5, -12, -8, 1, 6, 12, 3, -12, 0, 16, -2, 15, 9, 7, 25, 15, -5, 17, 26, 19, 3, 5, -3]
4759cPJ3%j2Mj2LjJJ5pj0oJ4Kj4J8k0PRl6J4J2Nj7Rj9K0J7k2oJ4poRj4K0Kjj5
4799a3JK1r%rJ9nKqNNJ2k2KJJ0j1nK4j9NMrlK2ok7J8KkpMj5KK3j9nP%j2N%NJ2
4843Enk1MJ8Jj6MnQLMLj2Pj0OPJ4Jk7J1jNJ1j4kK6rroPLlNoLjj4jJ3J1kj2j4J1
4888AK6k5%pqJ9Nj6j3K0k6RJ9j2lLk2J5K7ok6JOqJ8Lj5MRMj5J7j0PJrJ4n%j2R
4929aJ5J4k4j0J0J0rJ1qj4J5J0j9RK3l5kJ0OJ1j6j0j8J9QpNk0J5j0KJ2%j2NqJ
4966a2QJ8l2JJ5%jJj8J5J0Nk1J4Kj7PJ2Mj9J9j4jK0Ok1qKK1loOj2OJ3j2kJ2k0
5005bqK5Mk8J2jj9J7J9m2RJ8j6oJ1mmJ5orJ0mmJ5j3MJNj5QmJ6Kj9nL4j0j1J7o
5045F%J1mj3K1rk1KK2j7J6lj5%K4mj6J5jm%oJ9pj5nPpK3k0k6J4K2j9QOj7NJ5j9
$$ y = [-3, 4, 17, 17, 5, 9, -3, 0, -1, 0, 15, 8, -2, -8, 6, 8, -6, 12, -8, -1, 8, -28, -14, -2, 3, -14, -5, -24, -4, 13, -9, -15, -1, -8, -14, -5, -19, 1, 3, 2, -13, -12, 9, 0, 0, -9, 10, 5, 7, -1, 4, 9, 21, -1, 1, 2, 12, 1, -4, 20, 1, 6, 10, 1, -2, 20, 14, -13, 5, 7, 5, -2, 2, -13, -11, 12, -7, -12, -5, -5, -17, -12, -12, -7, 5, 0, -21, -17, 1, 2, -14, -10, -15, -7, -4, 0, 3, -9, -2, -12, -6, 1, 15, 16, -11, 0, -1, 4, 15, 1, -1, 25, 16, 7, 1, 8, 11, 8, 13, 7, 10, 9, -5, -6, 7, 18, 16, 4, -10, 1, 27, 2, 2, -5, -13, 6, 11, -5, -18, 2, -24, -15, 4, -8, -11, -8, -30, -15, 12, 6, -20, -19, -13, -21, -3, 0, -15, -11, -2, 2, -13, 4, -6, 1, 2, -7, 7, 2, 2, -10, -1, 14, 28, 4, -6, 4, 14, 5, 16, 8, -6, 9, 19, 0, 9, 32, -3, -5, 5, 11, 22, 6, -4, -22, -3, 5, -2, 3, -17, -2, -12, -10, 2, 2, -10, -5, -13, -12, -4, 14, -18, -17, -2, -2, -3, -2, -20, -5, 5, 10, -11, 3, 5, -12, -5, 7, 11, -8, 11, -3, -4, 16, 22, 1, -7, -5, 16, 13, 7, 13, 1, 7, 20, 8, 6, 18, -2, -10, 15, 19, -9, 3, 2, -17, 0, 19, -23, -14, 4, -12, -18, -7, -11, -15, 0, -6, -15, -5, -9, -13, 2, -11, -7, -6, -1, -16, -8, -12, 4, 6, -13, -18, 16, 6, -5, 12, 6, 6, 17, 13, 0, 21, 12, -9, -7, 15, -2, 14, 11, -4, -4, 20, 16, 0, 15, 14, 10, 10, 4, 23, 16, 1, -4, 3, -4, 19, -1, -27, -13, 9, -10, -2, 4, -13, -8, 7, -12]
5085a2LRkk6J7J1j3Nnj5K2LplR%%mlJ6njJ7qJ6nk3kK6lk2J8llJ8j1j9kJ9k0OO
5127DJJJ5j5j0L6l0Ppj4LJ2o%jJ0j4NqJ8pj2nRjLMl%J0j2oQPj2J1Jj9K5Qj9J6
5169A3jKrL%J2%pj0RLrqOJ3kj4NQj4KLj4J4J1k1j6J4J8l1K2j0rJ0jl2K8J3noJ4
5210Dj2%%oOqJ1ooORJ1k5J3qPJ3pk0L3nj5J5K0j2n%pnK2k2j1L0ooJnqK7pj9J1
5252HmMj6JLLnJnRj3jpMK2Jk2K0orJ7j9NlJ3j3jK2j5OJ4k7J2Qj3jNOnMllJ2jm
5297D%oJ3Mj3KJ2j9J1J5j6qJ8pk4K1Ql1K1j3mJ0opNJ7j5j%pJ6j3J0%%lj%oJ5n
5338cj6K5noRJk4L1rrJ1J6j3mJ0l%j0Pj4K0mJj2LLKkjNpmJoJ2J0k2MKnN%llJ0
5383Ck4JK6j3q%P%poj2J3J0Jj4lJ3OkqQ%JJ0JqK1Mj9NJ5k3KQj1RQMk4J3PnKqn
$$ y = [-12, -9, 0, -2, -28, -11, 0, -13, -8, -13, -28, -6, -3, -10, -13, -4, -4, -4, -8, -11, 5, 0, -1, 16, 8, 24, 19, -4, -6, 20, 17, -5, 13, 10, 7, 25, 14, -5, -7, 12, -8, -2, 4, 5, 6, 21, 6, -4, 32, 2, 9, 2, -12, -9, 3, -3, -3, -4, 6, -8, -3, -11, 7, 0, -12, -17, -8, -9, -6, -2, -5, -5, 5, -7, -13, -5, 2, -10, 1, 2, -17, 8, 16, -3, 13, 12, 14, 5, 8, 8, 20, 20, 13, 3, 12, 15, 6, -2, 4, 17, 15, 1, 6, 14, 0, 2, 5, -9, 5, 16, -5, -21, -7, 11, -20, 2, -8, -17, -7, -8, -40, -12, 1, -4, -10, 4, -8, -8, -8, -14, -8, -16, -5, -11, -17, -11, -2, 9, -16, -3, -11, -4, 9, 2, -18, 15, 10, -5, 10, 30, 18, 13, 13, 6, 1, 23, 1, -10, 20, 14, 8, 9, 4, -4, 23, 16, -3, 8, 4, 8, -8, -7, -4, -1, -6, -5, -10, -1, -14, -15, -22, -18, 4, 5, -17, 3, -3, -12, 5, -14, -9, -12, 1, -12, -13, 9, -6, 0, 14, -13, -1, 7, -6, -7, -2, 4, -1, 3, 0, -3, 9, 8, 4, 4, -2, 11, 15, 2, 4, 16, -3, 8, 23, 7, -1, 17, 10, -14, 7, 15, -16, 5, -8, -12, -2, -8, -15, -10, 7, -8, -9, -9, -16, 0, -13, -3, -3, -3, -6, -7, -7, -13, 2, -3, -19, 6, 1, -5, 4, 5, -19, 12, 3, -6, 5, 21, 8, 4, 14, 11, 11, 1, 8, -6, 14, 10, 11, -1, 2, 5, 7, 5, 4, 9, 2, -2, -1, -7, 5, 15, -7, -3, -1, -6, -1, -1, -4, -7, 3, -21, -20, 6, -7, -15, -15, -8, -8, -15, -21, -33, -20, -10, -9, -23, -26, -13, -7, -9, -17, -9, -9, -8, 2, 3, -5, 16, 20, 1, 6, 21, -2, 0, 8, -3, 6, 14, 18, -6, 7, 14, 9, 11, 3, -2]
5428bPmPJ0rj2Mlj2J5oJlkJ3rmjK2k6lJ8rqK3j8j1K5Jk0J4mk0K4Rj6MJ6j4J5M
5469A6j2Pl%nJ7k1MJKKKJqMoJ4j0kpJ0j2RRj6KoJJ1nj8QJ6jj5J0rMJ4nj0J6j2
5512ck%loK2j4rJ6Jj4J8%qJ5nk4J4K0k4MROOjrQrnJ4okRjj3J0pNjRk6J9nj1KR
5557Hj8J4jk8QK0k3J2J1lj0J0j5JJ4ml0K9J0k2J9j1J1Ppj4LJ2%j6J3oJ2KkJ0j2
5594DLkNqJ3orLPmRj9RJ5J2k5kJ2k3%J1nKKqpJ1LoNj8%J7qklPKj4J1lJ7Kk2J0
5639b%mMQj2PJ4Mj5K1k6LPnRj2KpQLNoKNkMPpj1K8j6k0J0LoPMj7J7k1nJ2Nnj2
5684a2J7j2nJ9j5j4K9prPjkLJ1j8MJ3k0RlLnJ4pJ3MJpLpOPk7J5pJ0qJ2j0J7rk1
5726iK0rOrJ2oRMk3NK5k1KKlj0J2j0pJ3kmnj0QJ4j1pNOnNmKJ1j5kMJ0kk%JQkk
$$ y = [-2, 5, 1, 8, 18, 9, -3, 1, -2, -14, 1, -5, -4, -7, -9, 4, -5, -9, -10, 12, -14, -17, 1, -8, -16, 7, -11, -22, 3, 4, -16, -2, -6, -26, -2, 7, -9, -5, 11, -3, 12, 16, 4, 11, 8, 8, 3, 20, -1, 3, 4, 6, 8, 10, 11, 3, 7, 1, 15, 5, 3, -4, 6, -6, 3, 12, -4, -2, -8, -7, 4, -1, -19, -11, 5, 4, -11, -1, -10, -6, 8, 3, -7, 9, -3, -5, -5, -8, -14, 8, -6, -15, 1, 2, -12, 6, 6, -2, 13, 8, -16, -2, 18, -6, -2, 7, 13, 19, 18, 9, 17, 8, 3, 17, 11, 9, 18, 17, 4, 14, 7, 12, 11, 20, -6, 13, 8, -3, -1, 8, -10, 4, 3, -25, -17, 3, -20, -8, 3, 0, -10, 0, -15, -14, 0, -4, -34, -5, 5, -17, 2, -9, 2, 9, 2, -12, -9, 3, 3, -13, 0, -6, 6, 8, 6, 16, 4, 7, 5, 10, 2, 15, 9, 0, 3, 10, 6, 15, -4, 5, 20, 32, 7, 5, 17, -6, -6, 5, 0, 2, 4, -4, -11, 0, 3, -3, 2, -16, -16, 1, -7, -9, -12, -5, -3, -17, -6, -9, 8, 10, -12, -2, -2, -6, -2, 6, -6, 1, 15, 19, 4, 25, -1, 2, 9, 4, 13, 1, 3, -4, 4, 7, 12, 6, 8, 13, 11, 15, 22, 15, 4, 32, 16, -4, 6, 9, 3, 10, 14, -3, 14, -7, -12, 0, 5, 0, -12, 5, -7, -12, 7, -8, -22, 7, 0, -9, -2, -3, -5, -2, 9, -9, -5, 8, -12, -3, -6, -3, -8, 6, -1, 12, 16, 17, 10, 13, 6, 12, 19, -8, 7, 0, 10, 2, 14, 4, 21, 12, -9, 11, 2, 8, -1, 11, 5, 14, 18, -5, 0, 25, 4, 6, 8, 5, -5, 7, -3, -10, 3, 1, -3, -8, -18, -10, 4, -7, -14, -9, -3, -8, -3, -7, -5, 6, -9, -11, -7, 3, 1, -1, -1, 0, 8, 6, 4]
5772DJKpJ1Lj5OJ1poQoJ9pj0MJ0j6LkrRmpNJ4j8JMnrJ8j2j6J4Nj8J7Kj4RoMKP
5817aj3nJ6Qj1rJ0KlJ2rNjRmjMJj3J2lqJ4omJ1%mj3L2j4KpnQ%q%Kj2lJ9j7LOp
5863eJJj0J6nMrK1j8j1O%OPj1oLJnJ0kjlLjNJ2j2lJ3pjJP%KNj1Lj1J8Qj5J0om
5909FLLrJ0Nk1rL0j5k0P%qJ1JqJ4jnnjnK1j2pOMRrrjJ4j2J0kJ4k0J0NmJ1pOrR
5954A0pMrJ4Jj2J1oJ1mJp%Nlj%L%Jj9j0QJ4lpLj1RPpk4K9j6j1J7J8j1j3%KPlp
5998a6OLklMMMmJNrNoJ0qJ4jj2kJ1kJ8k1mJ3J4j9jJ5j6OLp%Nnj0J6jlnoKQkkl
6045c%Jkj9J6Rr%J3k9J1QKk1J4Jj5LOJJ5oJJ2ooMOmJRrLNj3J7r%pJ7pkPlj8J5
6091Ijj0%J1qKKj7J0q%K0rkmJ2qj4Rj%Pj6Q%j1J3j1J5Nj9NNN%pjJJ9j1kj0K1n
$$ y = [4, 5, 7, 0, 11, 14, -1, 5, 16, 9, 3, 11, 5, 24, 17, 7, 11, 21, 5, 8, 6, -3, 6, 2, -5, 0, 14, -4, -3, 1, -4, -13, 5, -7, -23, -9, -4, -22, -5, -3, -17, -8, -14, -10, -8, -1, -14, -19, -3, 5, -6, -15, -5, -3, -6, 6, -3, 2, 1, 10, 6, 5, 9, 10, -3, 9, 6, -2, 12, 6, 2, 13, 13, 9, -4, 28, 14, 16, 9, 4, 12, 12, 4, 4, 6, -6, -9, 10, -7, -4, 2, -5, -4, -3, -13, 3, -2, 2, -7, 14, -4, -15, -9, -9, -3, 4, -7, -13, -10, -9, -14, -4, -6, -7, -10, -7, -8, -3, 9, -3, -6, 7, 0, -1, 0, 7, 7, 9, 14, 3, 6, -5, 13, 21, 6, 16, 10, 6, 9, 12, 3, 13, 18, -3, -12, 18, 3, -17, -10, -10, -18, -7, -6, -14, 0, -1, -6, -11, -12, -17, 4, -8, -15, -9, -5, 4, -5, -14, -15, -1, -13, -3, -5, 9, -11, -1, 4, 0, 11, 4, 10, 1, 10, 3, 7, -2, 12, 13, 1, 12, 6, 17, 13, 14, 7, 7, 12, 9, 8, 8, 11, 11, 12, -7, -17, -9, 5, 2, -5, -2, -13, -4, 3, -4, -28, 1, -15, -26, -9, 9, -2, -15, -15, -13, -6, -9, -16, -10, -7, -9, -12, -8, -4, 0, -4, -3, 2, -7, -2, -8, 2, -6, 8, 7, -5, -7, 4, 2, 20, -1, -5, 8, 22, 3, 2, 17, 1, 7, 10, 3, 3, 8, 3, -7, 9, 8, 5, 0, -6, -4, 4, 2, 0, -3, -3, -2, -4, -23, -7, 2, -7, -7, 6, -23, -12, -4, -2, -23, -9, -8, -23, -20, -14, -13, 2, -4, -3, 9, 3, -3, 1, 7, 3, 4, 13, 4, 7, 12, -1, 16, 7, 7, 0, 17, 10, 8, 15, 12, -6, 9, 8, -2, -2, 9, 1, 3, 5, -12, -2, -10, -10, 10, 1, -1, -5, 7, -1, -15, -6, -7, -7, 0, -16, -8, -8, -19, -6, -17, -2, 3, -16, -11, -6, -1, -1, -8, -9, -8, 11, 0, -2, -12, 9, 4]
6135DP%j4QMJOJ1j3j1nJ0L%Rk7LJ4j1MOjlLoMj1MooJ7Jkj9kMROQk6MJqJ9lnqO
6183a1OlOmLKJPqJ2j1MKk%MoMJ2j2K0qkqjPkrJ1qm%lJ0qMjnLjj5nJ6kjkpR%J0
6233Dj0Mj1K3j6oJ6j9RmLR%Pk1PK4k2JJ4j1qJ8lnJ6qj9L3k1NJ4pj6MJ5lojQJj0
6275HjMj1kJ0j3JL%pNLj0JPj2J4j0j2QNnj5J8J8j1Lj3J0J3lj0j%J5mpRkJj0Qo
6318aJJ9j4pJ7j7J2JklJ1j6kK0kj1%mlJ1npJRj0Qj0Llk1J8rlJ8nj3nJ7j0qJ3O
6360fj0QLqPlrJ2JkMJ4j5J1Lk6J8jm%RNj5RQ%j0Qj5RmJ6prk%MrK0k0j2J4lJJ%
6406eKkoj1K0pj0J7Mmj2J2qj3J6rPKkJ1Jjj3J0nqJ0JKL%jPkJkKoJ3Qk0J1j0pO
6451BOKkj0QOkmQk7POOj2J1j8j9K9lJ2pppJQQk2QLjOnNnqJ8j0J4j3LnOJ2Kj3L
$$ y = [4, 11, 11, -3, 5, 9, 10, 16, 27, 14, 3, -2, 8, 11, 11, 20, -7, -4, 10, -1, 3, 9, 8, 5, 8, 2, 6, -5, -1, -7, -13, 4, 5, 3, -16, -18, -14, -5, 1, 9, -17, -13, -12, -20, -1, -4, -9, -17, -11, -5, -8, -2, -6, -3, -1, 0, 7, -1, 11, 0, 4, 6, 4, 4, 8, 2, 6, 18, 6, 26, 18, 16, 8, 7, 14, 12, 3, 14, 6, 2, 2, -1, 9, 1, 5, 4, -1, 2, 1, -14, -19, -3, -5, -6, -8, -15, -6, -6, 4, -6, -2, -13, 10, -6, -12, 4, -15, -6, -10, -7, 2, 2, 9, -12, -5, 19, -3, -2, 12, 1, -7, 11, 8, 3, 19, 11, -8, 25, 4, 9, 23, 16, 0, 4, 19, 16, 10, 9, 17, 18, 8, 7, 11, 0, -2, 8, -5, -4, -1, -1, -8, -3, 0, -10, -9, -2, -14, 0, -10, -22, -14, -9, -14, -29, -11, 7, -4, -1, -14, -4, 9, 6, -4, -5, -5, 10, 6, -1, 8, 6, 7, -3, 5, -1, 0, 19, 5, -2, 15, -2, 10, 11, 9, 6, 17, 1, -1, 19, 17, 6, 6, 2, -1, 10, 5, -2, -1, 8, -2, 6, -4, -1, -4, -25, -7, -16, -19, -1, -6, -19, -24, -7, -17, -25, -12, -6, -16, -8, -5, -13, -6, -9, -18, -6, -5, -7, -3, 11, -4, 7, 10, -16, 2, 1, -3, -3, 6, 11, -4, 5, 13, 13, 3, 11, -4, 5, 1, 17, 10, 1, -1, -1, 3, -6, 14, -6, -18, -4, -7, -6, -5, -5, -3, -5, -11, -22, -2, -9, -19, -2, 2, -2, -14, -2, -10, -23, -7, -16, -9, -7, -9, 2, 3, 2, -11, -1, -6, -14, -4, -3, -1, 2, 2, 1, 8, 6, 7, 5, 7, 1, 14, 22, 2, 13, 3, -4, 2, 8, 10, 8, -2, 6, 12, 10, 6, 14, -13, -6, 0, 6, -6, 5, -13, -32, -3, -6, 6, -1, -8, -15, -14, -6, 2, -20, -12, -9, -10, -4, -9, -4, -9, -17, 1, -9, 5, -8, -5, -10, -4, 8, 10, -3, 0]
6497@nLK4j9LOrJNJ2j3Pj6J9lLk1KRpJ3pjmpqJ4j5N%L%JjloJoJ2Kj3OJlPMOj0
6545hLJ%MlPpmLJ0moJ1j3J2LOk4J4j2PJ6kpPj2KJ3kj3NLj9QPj8KJ2j5J6Mj3On
6589erjJ0lnJ4j2LkmNJ2k1LJ5mk0J9qJ7J0k5%K0j1qK1k2MJ8j1nJ7Jm%Rj2J2nj6
6630cK4j7J1pMjMpk0K8Lk3NMnJ4jj5Lnj1J1llkPpPMk0J3nrJ1J2MpMlmkJ0kJj4
6675a2nK4jLKooQj0PJ2mj3J3oNQojrmmQlJMMj7LJ0k3PNlj3J2J3j5Oj4J1lj5J5
6719a2Qmmkj1K0KnlJQL%JKnj4K4nkjjlNK3j1oJJ%MLj6kMkK1j4omJNJ7j4oqrJ6
6767@kjnlJmJ9j2onNlJ6%j1qJ2KOkj4RqNjJ5k0rK9j1OK0k8%J3nJ9%j3pJ8j4NK
6811A0lmMKmoJ5k7J0J9j3jm%lnJ2lnJQj1RpKojJ1j3J1%qJ1olRNj7QJ2k0LkJ1j6
$$ y = [0, -5, -2, 22, 3, 6, 12, 3, 4, 9, 21, 8, 15, -1, 18, 15, 18, -3, -1, 8, 1, 14, 7, 6, 2, -5, -13, 1, -14, -9, -9, -6, -6, -5, -6, -9, -15, -14, -20, -8, -6, -19, -13, -12, -15, -8, -4, 2, -8, -5, -4, -4, 0, -3, 4, -3, -7, -4, 6, 2, -4, 7, -6, 6, 9, 15, -9, 5, -7, 0, 16, 14, 7, 14, 2, 4, 17, 15, 2, 7, 10, -9, -1, 6, -12, -10, 2, -13, 3, 7, -6, 0, -5, -14, -15, -5, -8, -13, 1, -11, -8, -10, -14, -9, 3, -18, -15, 0, -4, -24, -5, -13, 4, 14, -11, -11, 9, -2, -10, 11, -11, -7, 11, 0, -5, 12, 13, 9, 9, 18, 6, 18, 13, -3, 21, 4, 15, 8, 12, 11, 15, 8, -12, 16, 19, -4, 1, 5, 0, 14, 13, -2, 1, -4, -15, -4, -7, -10, -12, -5, -12, -5, -1, -21, -8, -13, -22, -11, 1, 5, -2, 2, -1, -5, -7, 3, 1, 2, -12, -17, 7, 6, 9, 11, 5, -1, 7, -3, 4, 16, 12, -1, 12, 6, 11, 19, 13, 12, 3, -1, -5, 3, 0, 1, 5, 9, -8, -5, 5, -18, -11, -6, -9, -22, -10, 3, -12, -6, -20, -9, -12, -27, -12, -4, -8, -12, -14, -25, -5, -3, -8, -11, -10, -2, 1, 1, 2, 4, -1, -15, 9, 4, 2, 1, 0, -3, 2, 25, 14, 8, 9, 10, 10, 14, 17, 1, -1, 3, 1, 22, 8, 2, -2, -1, 4, 21, 7, 1, -7, -16, 0, -2, -3, -8, -11, -10, -14, 5, -7, -13, -18, -13, -16, 0, 0, -11, -19, -7, -5, 1, -1, -15, -6, -14, -9, -10, 5, -15, -24, 5, -6, 0, 20, -8, -8, 5, 0, 19, 19, 6, -1, 17, 3, 8, 10, 7, 3, 7, 9, 5, -1, 14, -13, -3, 16, 3, 2, -2, -2, -5, -10, 2, -1, -6, -5, 3, -8, 1, -6, -4, -10, -11, 0, -13, -2, -2, -10, 1, -5, -8, 1, 6, -11, -3, 9, -11, -8, -10, 1, -15]
6856a5J9j5K2j2kMNPLj4J8j3OmKNJj2NKj4J2rjNpPNj5J6j2mpOMopNoJ3j5jOMn
6901a4PNPlnKmNj4J0Lj0kNpJ4LoJ3mllOLLKpoJ6rnQJ1j1j1J3j1klJ1kqQpmKPj2
6949irJ2%j2Nj2J0Nj3oJ8nQKr%JJ4j2KQjj0J7j2LqRj1J4QKj1J0kqQJ1j2opJ6N
6992A3%j2LoOkJqKJ2j5LmK6k1qRJpJoMlLrJ9j3MoJJ1JLj4PoLOMj5J0KLrJ4rkR
7040FJOKj3kJ1MrLlKkQormNPpQqnj0J5mMKpj5K4j6J%KnRJ0k1LJ2j3OPqqJ5j3R
7088fkJJloJ%K0Oj8LOjQMpnNLqnK0oJjpj1K0j9jRJLljnjNMLk6J0lLJ0lrKKrJ0
7139eMknMRj4mJ2j3KJ6qj3OnLRLk0J7lMJ0jlqJ8lj0K%RnJ6j4r%RpqJ4j8JPJqJ7
7186Gj0JjPkj1jnJNj2J0LOolJJ6mj0KJ2j4MmlLJpJ2KMnmOpQoJJ5mj4LJ1Oj0Rq
$$ y = [-15, 4, -11, 11, -1, -3, 1, 6, 13, 16, 2, 20, 7, 13, 9, 11, 16, 17, 5, 10, 12, -2, 10, 1, 0, 5, -2, 5, 10, -5, 11, -1, -5, -12, -6, -2, -8, -15, -10, -16, -3, -18, -19, -13, -9, -14, -7, -2, 5, 2, -3, -1, -5, 0, -14, -4, -1, -11, -13, -8, -15, -1, 2, -4, 9, 5, 2, -1, 5, 8, 11, 13, 6, 0, 16, 7, 2, 10, 21, 10, -1, 12, 1, -1, -4, 7, 5, -3, 5, -2, -6, -4, 3, -9, -18, -6, -6, -18, -13, -25, -15, -10, -23, -29, -11, -16, -8, -6, -15, -15, -14, 0, -12, -10, -2, -3, -13, 4, -8, -5, -13, -4, -15, -1, 7, 9, -2, 8, 6, -2, 6, 17, 5, -1, -8, 8, 13, 13, 1, 4, -2, 4, 2, 3, -5, -3, 9, -6, -3, -7, 19, -2, -10, -1, 0, -7, -6, -12, -8, -11, -8, -17, 2, -11, -7, -13, -12, -1, 0, 3, -11, -4, -10, -7, -1, 3, -12, -2, 0, 3, -6, 8, -1, -3, 6, 7, 13, 15, 2, 0, 11, 15, 6, 9, 6, 8, 6, 14, 8, -1, -5, 0, 7, 0, 8, 0, -5, -15, 0, -4, 0, 2, -5, -20, 4, -12, -11, -11, -9, -14, -5, 5, -16, -13, -1, -14, -8, -1, -9, -17, -2, -15, -6, -8, -7, -6, -9, -15, -14, -14, 6, 12, -6, -3, 3, 2, 10, 14, 7, 2, 7, 10, 2, -3, 17, 11, 12, 11, 4, -7, 13, -6, -7, 2, 3, 6, 3, 2, -3, -4, 1, 5, 8, -18, -8, -11, -8, 2, -1, -10, -8, -6, -15, -5, -1, -3, -8, -4, 5, -9, -13, -1, -14, -12, 4, -4, -17, -11, -16, -13, -4, -1, -21, -4, -7, -3, 7, 6, 3, -5, 13, 10, 0, 2, 2, 11, 6, 22, 8, -1, -1, 8, 1, -7, 7, -11, -10, -3, -2, -10, 7, -3, -2, -3, 4, 2, -9, -10, -15, -14, -9, -21, -11, -8, -2, -8, -11, -10, 6, 2, -8, -6, 6, -8, -4, -8, -11, -8, -7, -14, -2, 0, 4, -1, -5, 1, -6, 2, -4, -3, 12, 8, -6, -3, 8, 14, 4, 13, 5]
7234EOj0pJ5pqNMkMj5J0%njjRj4MQrlQj0JlK0j3nLMnpRMj7J9jOqKmKJPj1mK2j1
7283cLRlkjj0J2oJ4j3lNMMj2lORpJ0qmmpJ4nj3J0Qmj2NjJNkj4MlmJ8kk3K3lj2
7329b0J4onJ9Lj6MJ2pLJ1lolQLkkmmJ2Pj2oKjkJ2qqnJ5j8J6Kj2NKKJKj0LknJJ2
7376Dk1mJ2K%jjrJ3njJ6oj9JJ7kJ1j0j0O%nMjOPJ4j1RpLj0RJJj0j1J4MpJ1j1n
7420bJNrlJ7k1J1Nj0mQj4oR%KNnJmJNpKLJj2J6Pj5lJ1kMoJ0j0NQj1J9j4JPJKK
7467A1rLQl%%Lj1J2jqjr%K1koJjq%Jnj2RkQj3mlRpMkNQj0JJ2rMqJRj4J8k4J3P
7516dOJKmoJ3KrRpqJ0Pk0J8%KnLLj4OJoJ8j1jlJ4j3qJ2j1lM%j0Pj4MJ2qrJ4rJ
7562a4ROnmqPK%J2krJMlJ6j6PjmJJ0Kj1MOj0J5Mj9QRpomJ4Nj5QLj3J3qMNnpJj4
$$ y = [5, 11, 1, -6, 9, 2, -6, -1, 3, 1, 5, -10, 0, 0, -5, -6, -7, 2, -12, -8, 0, -9, -12, -4, -14, -13, -16, 4, -9, -14, -11, -7, -12, -19, -10, -6, -23, -4, -5, 1, -7, -5, -9, -7, -6, 1, -10, -14, 8, -3, 0, 9, 6, 4, 3, -7, 5, -1, 13, 0, -3, 2, 6, 10, -2, -5, 1, 10, 3, 13, 5, 1, -3, -10, 4, -1, -14, -4, 4, 0, -12, -7, -8, -7, -2, -4, -18, -14, -17, -21, -3, -5, -28, -5, -8, -20, -6, -12, -17, 2, 5, -11, -7, 5, -2, 1, 12, 9, 3, 0, 8, 11, 9, 7, 3, -1, 11, 18, 6, 0, 2, 1, -1, 11, 3, -5, -10, 5, -13, 3, 5, -7, -2, 0, 2, 3, 5, -5, -2, -4, -9, -8, 4, -17, -21, -9, -7, -7, -8, -9, -18, -5, -10, -11, 5, -1, -20, -19, -2, -4, 7, -3, -13, -7, -7, -12, -8, -9, -3, 4, 18, 7, 16, 9, 12, 2, 11, 12, 13, 3, -8, 6, 10, 3, 14, 3, -2, -1, 4, -5, -8, 9, -12, -1, 4, -6, -10, -2, -16, -22, -13, -13, -11, -6, -11, -10, -14, -13, -8, -15, -13, -10, -9, -21, -5, 2, -13, -16, -5, -7, -3, -9, 1, -9, -4, 4, -7, 12, -2, -1, 6, 7, 9, 11, 2, 5, 13, 10, 10, 10, 13, 2, 14, 13, 5, 4, -5, -5, 16, 14, 8, 9, 8, 0, 0, 1, -4, -16, -7, -9, -1, -14, -18, -21, -12, -19, -15, -17, -12, -4, -14, -13, -1, -10, -6, -14, -13, -4, -18, 0, -24, -11, -4, 2, 3, 5, 1, -5, 8, 10, 1, 10, 3, -5, 5, 12, -8, 10, 10, 12, 7, 10, 13, -1, 5, 6, 0, 18, 7, 6, 3, 17, 4, -4, 8, -3, -6, -2, -2, -12, -5, -19, -15, -3, -11, -20, -6, -15, -14, -5, 1, -4, -8, -16, -9, -7, -7, 5, 3, -6, -5, -1, -4, 12, -4, 3, 2, -2, -1, 9, 11, 0, 4, 10, 0, 15, 19, 0, 8, 17, 10, 4, 0, 14, 19, 4, 12, 15, 2, 15, 7, 11, 16, 11, 4, 5, -9]
7610iPNKj7LqJ0nJ9k8KJ0K%MJj2ONOj3KPj1ONqONkOMPmLj2oJ9qJ5oj5Rj0oMQJ3
7658B1k0M%PokOlQj2Lj2RKj3jPj0jJ2j6PkjNKJnJ2j1J2j2qNNo%J5j8J1RnMNkn
7704AKQLpLK%Qj1%kKLJ3jk0llQJ2j2%Rj0KqjLJj6J6lMoMq%Mj2J1l%mjMLomjQL
7755eoJ5oj1K5j2pJ0J4j1J0j3KPpjLj2kRJ4k3J2NlPj0Rj4PKkMj7Onj1J8j2J0j1
7796a2J1k2J9j0Rk%o%J1j3OLj5J3pJlMKJ1jNj7PQoNkmRlRMmj8K3opJ2j1Mj1J5
7840A1rlJ1pMLnmJ7k8%J2lk0J4JpRmqMnLJ0%mjjmJ3Lj1ONk1J6j1mRK%L%j0QMm
7887fJ0OOj0OrjoJ1pOj1MJ1pJ1k3J2K%j2NKpqK0k5NJ4pNrj1OJpOQqjJ0JnOJj4
7933a9kJ3p%J2j2J2LjlRkjMKkQj3Mj1J0KjrjRjJ3j2Oj1J6j9J1Pj4j3K5j9rJ7j9
$$ y = [-9, -2, 3, 5, -12, -9, -17, -7, -12, 7, -21, -19, -9, -7, -7, -3, -2, -14, -8, -3, 3, -10, -8, -1, -12, -6, -1, -9, -3, 2, 0, 6, 10, 17, 13, 16, 4, -2, 17, 9, 24, 18, 3, 12, 2, -4, 0, 8, 21, 1, 5, 5, 12, 6, 4, 10, 7, 15, 3, 6, -6, 3, 5, -8, -9, -2, -12, -13, -1, -17, -10, -12, -13, -8, -6, -5, -10, 2, -9, 3, -9, -17, -12, -7, -13, -13, 2, -16, -5, 4, -1, 3, 8, 6, 1, 3, 11, 14, 7, 10, 12, 12, 20, 9, 9, 7, 9, 12, 25, 24, 4, 1, -2, 6, 18, 6, 6, 15, 5, 7, -1, -2, 1, 2, -14, 2, -1, 3, -3, 1, -7, -7, -3, -15, -4, -7, -7, -11, -12, -8, -5, -11, -15, -16, -8, -5, -11, 4, -2, -13, 12, 0, -7, 3, 17, 6, 16, 3, 5, 12, 5, 4, 7, -5, -7, 2, 16, -7, 5, 10, 7, 14, 4, 13, -1, 6, 8, 6, 10, -7, -1, -6, -17, 1, -11, -1, -12, -1, -23, -4, -14, -5, -7, -7, -13, -13, -2, -15, -9, -6, -21, -8, -15, -14, -17, -13, -11, 0, -1, 4, -13, -6, 2, -4, 1, -1, -5, 4, 1, 10, 14, 10, -8, 15, 9, 2, 14, 3, 7, -4, 11, 2, -1, 10, 3, 7, 10, 5, 1, 18, -10, -10, 2, -1, -21, -7, -6, -13, -4, -8, -16, -12, -17, -14, -4, -4, -8, -9, -10, -14, -1, 2, -9, -3, 2, -19, -3, -14, -18, -9, -7, -7, -4, -4, -14, -6, -2, -6, 4, 10, 16, 6, 12, 3, 2, -4, 7, 0, 6, -5, -1, 10, 3, 14, -9, 3, 5, 5, -7, -2, 0, -7, -15, 5, -20, -15, -1, -8, -3, -12, -23, -17, -16, -23, -17, -9, -17, -18, -8, -7, -12, -6, -5, -19, -21, -8, -15, -15, -3, -15, -3, 0, -1, -4, 5, 3, 2, 6, 8, 6, 14, 1, 5, -6, 4, 6, 5, -4, -5, 4, 3, 16, 4, 10, -1, 15, -4, 7, 14, 0, -13, 12, -7, -16, 1, -18]
7975a8J3j4QnQkllJ0LrQj7J3Kj5OrJ6OlKlmKPn%Lj2K0qjlJ2Nk%j0PjlnJ1%j8J1
8022@JKKJ3k3K%OJKj2KjrJ8orMNkjMPj7JnOJqjmlQLkJ1j1K2j4PJ0j3RrNJQKrN
8072Ij0PNj%j6J3Jj2NlJ2JrJNjJmm%Mj7Rnj0J5qPMj0J0lojJ0ploR%%JjloJ3kj
8121gj%MLJ7k8QJ9j5Rj4K2j5LmJ8j7J1Nj8J0J%MoKj4M%j0POqLoLmLj2K0ppqOj
8166a4M%okJ0OoOnjqRJ2kJLp%J%Pj5RLk
$$ y = [-18, -5, -19, -11, -16, -8, -10, -13, -16, -6, -3, -12, -4, -21, -8, -6, -21, -15, -24, -8, -2, -5, -3, -6, -10, -8, -1, -6, -6, -3, -15, 5, -3, -4, -7, 5, 10, 8, 8, -2, 5, 4, 1, -4, 7, 7, -11, 0, 1, 3, 5, 18, -5, -3, -3, 3, 4, 6, -6, -4, -5, -14, 4, -2, -11, -7, -2, -4, -5, -1, 6, -11, -10, -15, -9, -8, -16, -17, -21, -24, -16, -13, -15, -4, -15, 7, -7, 0, 10, -3, 6, -3, 2, 3, 11, 13, 4, 9, -1, 6, 11, 10, 10, -6, 7, 8, -4, 1, -2, 10, 11, 2, 3, 8, 7, 8, 4, 0, 0, 4, -13, -4, -9, -19, -4, -12, -5, -1, -11, -1, -4, -10, -11, -1, -8, -11, -17, -8, -8, -8, -7, -8, -11, -17, -4, -6, -7, -8, -8, -4, -1, 16, -12, -4, 15, 0, 9, -5, 17, 2, 5, 1, 19, 2, 13, 18, 0, 10, 11, 11, 15, 9, 11, -3, 1, 1, -9, -2, 4, -4, -1, -7, -4, -8, -5, -17, 3, -4, -11, -19, -13, -14, -10, -10, -16, -18, -8, -2, -8, -2, -7, -8, -16, -7, 5, 3, 4, 7, 0, 0, 1, 1, 8, -7, 2, 5, 3]
8191C
$$ Imaginary data points
##PAGE= N=2
##DATA TABLE= (X++(I..I)), XYDATA
0@%%%%%%%%%%%%%JrJ6j6J6j6J7k5L2l2M0m8N0n8O9p7Q8j01J10j22J38j54J72j94
37a03K16k39K64k91L24l61L99m41M88n43O06o75P55q47R57j092J257j466J744
56I52k132K711l681N707j6433K2607J2419m5038L0610J1060m1587J3139L1399
69B1733k8354M41K0922j9979o856K0668q158l617R868r577k596J1982p802k563
83c888R307o938l688J0683l373o313M309R68j752J83P63L689n434n306J1926m60
99D676j3377J1591M654j8847J0451J5184k1301j175J8346j4121l550J9891j1086
112A336j0926J4078o183n037J6751o987j0186J2243q607p140K2501n337j8127
125a1621J7476j196k0451J9536J0235k3776P430J3658j9945J329J8691j1334o767
$$ y = [0, 0, 0, 0, 0, 0, 0, 0, 0, 0, 0, 0, 0, 0, 1, -8, 8, -8, 8, -8, 9, -16, 16, -16, 24, -24, 26, -32, 37, -40, 48, -53, 57, -65, 73, -81, 91, -103, 113, -126, 138, -153, 171, -190, 209, -232, 256, -287, 319, -356, 399, -448, 509, -583, 674, -792, 952, -1180, 1531, -2150, 3557, -12876, 9731, 22150, -22888, 7722, 18782, -22805, -9666, 21733, -6621, -6180, 14742, -5237, -12093, 8575, 417, -3200, 6668, -2909, -5505, 6477, -1325, -3888, 5419, -1519, -5207, 5476, 2103, -4210, 99, 1067, -685, -502, 261, 3950, -1484, -6790, 5136, 4676, -8701, 2890, 7544, -11303, -852, 14332, -6969, -8144, 10202, -3919, -7469, 12422, 1336, -9590, 4488, -1695, -6732, 10019, 3032, -7154, 5089, -3518, -10658, 11843, 6506, -11621, 5855, 4659, -15792, 3744, 13979, -9797, -2367, 11291, -8654, -7325, 11366, 32, -6735]
138f735J2066m534o094P462m45l604K349r5N81p38l392M179J428n344M348J663
154C095p800M362M210p485M512M304j0813L428Q103r677K696R069j3345j135J4853
169H377r002n502J4332p549j0645J4369O4j0927R999J594j2387N890O039o962
183b310K845K765o519K191K817l759L224J003n028L511R43n513M622K790o429
198b847K683L182n978J928L870m709J783L362n449M55L516l453K129L146n874
213b256K56M139l976J262M540n005j028L804l822Q87N411m550j833M110m015P8
229a998O548m710l156O434l417l890P539j285o040N689N01o323M541L011n787
244b343J375L377l438J50K184k110K21J711r95j12m42p63K031o0j601J808p63
$$ y = [-6735, 5331, 797, -5297, 2165, 1720, -1884, 465, 370, 951, 213, -3179, 1000, 2428, -2916, 1432, 3095, -4705, -343, 3867, -3618, 894, 5198, -5615, -2187, 5916, -3761, -1065, 8004, -5341, -6476, 8377, -625, -6127, 8205, 656, -9989, 4380, 4444, -6483, 3516, 5110, -7277, -1387, 4652, -2310, 535, 3300, -3219, -1028, 1789, -1970, 1254, 2257, -2771, 740, 1683, -3830, 792, 3582, -2847, -164, 3018, -2960, -1032, 2838, -1871, -88, 3274, -2175, -1720, 1796, -1657, 472, 3618, -2256, -2000, 2139, -1837, -575, 3965, -1040, -2068, 1736, -2086, -1199, 4212, -338, -2171, 1939, -2076, -1998, 4550, -160, -3316, 3118, -299, -4189, 3350, 2065, -3975, 1714, 2215, -4108, 433, 3444, -2343, -968, 2409, -1029, -879, 1305, -805, -584, 1127, 132, 20, -422, -1185, 846, 786, -815, 993, 230]
261B30k544K773R50k317K170l05m080K689K673k918J409R26m670J705M019l335
277f25J92L152m268j325M731j250j539L124k250k944L481R02j875J351o02j828
293a573J741L67j060J374m64j549J441L1j167J690j50k078J451J091j728K00P57
310C74q94O34Q66j141n00L53K04O33j30m98L07p69n51J778L98j164L87p20j331
329a764K204J367j982m0L85j651J096K021j479l97R14j836j92K653l44j257O42
346C40j035p55K318M07j662K87O7q83R59Q01p66mq7p89N70R18l48k94l10l79P48
367A03N98p03k99K29q8K70K49m29j63J41j9K02K48j20l13n49J42J145J47q50k16
388b75l29p6J421L41j392n8L18p70P84J349j041p71M20p43K77J961m28j828K46
$$ y = [230, -2314, 459, 1409, -908, 1262, 957, -3123, -434, 2239, -679, 730, 1656, -3014, -1309, 2710, -625, -433, 2719, -1549, -2874, 1857, 607, -932, 2192, -58, -3002, 479, 1381, -494, 857, 255, -1573, 168, 535, -525, 849, 385, -1164, 277, 308, -859, 831, 681, -1397, 54, 1145, -583, -383, 374, -520, 114, 980, -161, -661, -308, -104, 529, 399, -99, 208, -561, -1112, 666, 1064, -100, 287, -433, -1764, 440, 1807, -175, -215, 170, -1481, -385, 1636, 157, -240, 674, -1162, -1354, 1299, 955, -302, 340, -695, -1450, 868, 1275, -387, -100, -33, -916, 43, 844, 78, 74, -13, -802, -232, 686, 338, 44, -266, -645, 103, 701, -2, -301, -72, -160, 110, 359, -70, -233, -92, -111, 91, 339, 219, -94, -643, -501, 644, 791, -59, -275, -604, -680, 741, 1082, -310, -368, -50, -820, -36, 1313, 272, -499, -79, -822, -545, 1416, 988, -840, -594]
407e94L88j80J126K96j516k84P63j71K15Q21n23j098J32O66K87K04j63r32l40
426i03J106O51p67l36J93l79K74Q77m65o46L89k26k51J089J86j203j85L77J33
445h6P42P3j192l48O60L65L10r9p22j75K07J27O65K00q96m16J63J88Q88L14j297
466c29n59P37K44K22L40p46n98N45K50l6L75j90o70r5M19N50R0o39l74J72K45
487d7N39Or71RP35l04j2O19o93n08Q39j18k95Q39m27j188Q15P68n38J37j14q89
509g98O03R73o60l12K86m09N0N90j19j18j7m90J16N75K5j1l68o49O30P66n93j60
531i0K54o35K41Q49o73k46P90o29m91J027q8o42N17k35m53R91pj076L84M48l59
552a23M61j5r33L60O05m55J44L35n70q3K73j53L75K31p31o5M38p5K71m9q68L37
$$ y = [-594, -206, -386, 740, 1036, -480, -764, -1, -172, 43, 864, 341, -757, -625, 41, 328, 532, 369, -563, -903, 203, 854, 87, -249, -56, -435, -161, 716, 251, -395, -6, -232, -483, 606, 792, -411, -596, -219, -86, 656, 729, -463, -811, -151, 214, 524, 425, -297, -472, -265, -138, 527, 727, -169, -585, -422, -234, 654, 968, -329, -888, -151, 93, 315, 655, -91, -689, -144, 106, 70, 445, 255, -415, -510, -91, 459, 549, -90, -464, -292, -47, 492, 498, -473, -464, 271, -33, -45, 574, -119, -627, 212, 94, -201, 638, 211, -977, -162, 606, 68, 205, 91, -798, -195, 778, 118, -194, 92, -317, -267, 323, 204, 86, 69, -421, -305, 270, 295, 284, -84, -733, -103, 663, 70, -90, 164, -471, -230, 619, -54, -300, 490, -139, -630, 397, 309, -333, 184, -51, -504, 487, 480, -596, -212, 236, -123, 338, 323, -610, -250, 355, -100, 44, 379, -191, -274, -1, -154, 221, 452, -279, -344, 94, 19, 290, 241, -627, -290]
574b90Q71m61k10L22o34o0Q68j51k30L27n98m63O85L68R8m2r01j42R57j62k29
595g7N56o28m34J082k60r15R23J48j040P58O65j033n6L07n15O26Q73q30o05P7
615c78j19P37N67q50j44L36p50K46J107n32n17N36m49k65J042j44r89K21M89J32
635B76J92m99n28K60J90L47N74o50p39L84j61l4J251M3j368j43M30lN27J52o23
656a22r0J13M1L48l65l90Q57j04q56J014K02j717N40J375r32J25J031j679q56
675a465J970K56r71O25j96j050N52N88k09K24j94m89K77J3O1N66o58o74J093L22
695F41q82K01K8n71O71N37n23q0j78l73N25J86j12O71p00j235J188P61j175N74
715A54O05j570L03J474j099n79J291l73p40P07O6l47L7k29L51M23o30J85K80j191
$$ y = [-290, 581, 120, -90, 232, -402, -462, 406, 255, 25, 352, -246, -709, -24, 344, 442, 400, -501, -643, 314, 152, -77, 479, -149, -583, 499, 239, -676, 247, 395, -645, 113, 778, -255, -311, -4, -519, 107, 980, 150, -455, -378, -497, 240, 807, -43, -187, 149, -601, -355, 752, 220, -297, 239, -210, -475, 567, 423, -566, -345, 144, 276, 468, -31, -559, -299, -109, 238, 812, 162, -577, -193, -354, -388, 863, 906, -462, -605, -175, -178, 349, 501, -122, -212, -99, -58, 290, -75, -465, 392, 288, -568, 446, 648, -1069, -529, 846, -86, 39, 1070, -609, -1465, 505, 761, -210, 415, 219, -831, -279, 309, 100, 324, 130, -359, -82, -69, -8, 558, -100, -774, 319, 641, -241, -40, -12, -583, 88, 625, 102, 22, -156, -529, -4, 182, 70, 741, 41, -1194, -6, 755, -420, 154, 759, -811, -508, 966, -133, -712, 579, 206, -534, 173, 239, -108, -71, -300, 51, 474, -156, 29, 309, -882]
735h82N63J595j327q32J583o47j114J643J09j423Q58L65j196N75P74o82j26Q0
753h4j50O16j83o63O64k1o98Q43J07j049O94M50j071L94O88o48P8P0m83P56P2
774C82j000Q05K96j293J003P01j901P27J627j951l36K091j105j067J730l97j206
791h94J279J54j126N02L99l39Q5l02J38O31p72j69J019p19m15J251p30q95J502
810E99q8j283R51K54r64O88J29p93Q13L7r68Q08J42r03R95N0j478J130Q06j588
830f63M35R72j253J99J004r91M6Q52r38l0P63o35L63N01j375L96J272j339n3J475
850A001j316m42J710j022r57J810l36j342J213J44j044O87P8o55Q00P6p24L80
868F1k38k62J035l37p73R53k75j012J068J70q31R44j07j309R75M57j095P69L65
$$ y = [-882, -319, 1276, -51, -883, 700, 53, -1061, 582, 691, -732, 126, 491, -705, -130, 644, -38, -164, -84, -234, 382, 199, -464, 200, 179, -519, 324, 431, -618, 76, 526, -545, -151, 537, -111, -33, 37, -446, 310, 382, -618, 187, 483, -810, 193, 894, -1007, -280, 1347, -604, -940, 1151, 46, -1021, 709, 312, -894, 385, 539, -587, -85, 314, -25, 60, -242, -104, 527, -245, -414, 605, -114, -529, 722, -8, -903, 599, 511, -772, 179, 433, -531, 157, 286, -507, 306, 343, -625, 183, 325, -578, 417, 467, -1011, 119, 925, -663, -228, 744, -509, -310, 694, -297, -251, 601, -337, -367, 396, -239, 124, 625, -750, -354, 918, -421, -474, 1001, -315, -757, 953, -69, -1026, 784, 448, -894, 319, 463, -581, 106, 184, -471, 329, 405, -319, 61, -177, -439, 596, 259, -514, 439, 164, -848, 220, 390, -441, 503, 396, -913, 62, 519, -576, 193, 558]
887E58j188Q10M42j565P52J123j388K71J075j427m7J328j046k30J485p73q53Q56
905A83l13k44R41m12n10O73m02l52P13l71j25Q85o99n77J008l58o41R86j49o08
925c72R11l55j054R08L44o72O55Mr13N78J54q27P95N41q77J62J62p77N40O06o89
946a76K48M16q00J5L62m37N79N40r62o8M87o63K59P93o73k1O67r30l41J123k05
967B13m28O42l97n70P32m4n71O04J86n19J45lk69L80R0l24J88P2j98Q6j53n6M79
990B85j25l56L29p9l13M22j35m06O76J38p86K32L14n58L41N00o03J5M74o62k22
1011e19Q12K1l14J83l13l06M90J61k44J41J9k53m6K6J65K45j60k13N6q0J12K23
1033B06k81p8M09k02l58L21Q3j88K53n2m35L21K63m32N2L50k44j23K08j57K3L24
$$ y = [558, -630, 180, 622, -943, -191, 932, -456, -185, 890, -537, -584, 744, -302, -532, 953, 180, -673, 183, -130, -374, 567, 155, -355, 318, -84, -436, 277, -94, -219, 666, -33, -610, 398, 40, -601, 385, 236, -372, 539, 184, -870, 38, 382, -290, 365, 369, -544, 34, 188, -639, 156, 697, -180, -18, 144, -633, -93, 513, -176, 72, 488, -312, -297, 65, -372, 207, 747, -215, -283, 204, -459, -200, 593, -80, -101, 566, -364, -705, 418, 213, -215, 427, 30, -540, 192, 148, -423, 181, 367, -152, -7, -10, -279, 101, 191, -133, 55, 127, -71, 15, -138, -194, 285, 160, -196, 133, 54, -259, 163, 28, -378, 298, 436, -350, -118, 196, -362, -21, 479, -124, -109, 365, -297, -519, 293, 314, 0, 183, -130, -436, 54, 215, -29, 112, 131, -122, -168, -142, 23, 268, 108, -105, -49, -129, -17, 206, -75, -153, 256, 54, -304, 17, 100, -88, 165, 113, -322, -1, 262, -170, -118, 232, -12, -135, 73, -84, -61, 263]
1055B63j80l32J33K18J8n9j05%K9n7J10Q2j16Q9p4l61K61M85l34k59K59j71r6
1078a97M69j18m24L55J08n08J91M13k49j16J64k22k2L78p1l44J29K35j77j67J98
1099B5R2j69Q9M4k76P4M13k70k62M06l7m25K75J84l09K57J71o02L1O00k08k56
1121a53L03j26k72L09O1k50K04J32l65j08L20J35j56n3Lj10P1K26j41k17K80O6
1143A59m03J35L47k30p8J85k61lM04j81l14K90R0k45P4L8m1J36k3j73K7N0R4L8
1167A15k37L8L15k82j93M11p8k22L20j89l96N67J67o13K17L12m47P6L67l51K1
1188h2L72l32k64L76J26j87l4j7%L4M9K5j28NK47k37k61N06M3n19L13J33n22M32
1212G8L48p96J80P00o95k03P73m10k88P35m05n44Q05Po66M67J55n01K99J07l91
$$ y = [263, 83, -249, -116, 102, 120, 61, -44, -44, -15, -72, 38, 120, 4, 93, 19, -342, -81, 404, 70, -189, 70, -101, -197, 272, 154, -270, 85, 193, -315, -124, 289, 40, -76, 88, -134, -156, 222, 151, -193, -64, 171, -6, -173, 25, 117, -52, 37, 81, -195, -121, 292, 22, -240, 166, 129, -296, -21, 163, -146, 111, 282, -320, -289, 311, 103, -153, 150, 24, -248, 61, 122, -128, 76, 208, -157, -265, 55, 190, 34, -19, -16, -126, -55, 171, 30, -187, 93, 159, -244, -109, 238, 8, -70, 115, -146, -149, 255, 74, -240, 50, 140, -105, -31, 7, -34, 102, 79, -94, -67, -17, 77, 115, -122, -84, 231, -51, -244, 167, 89, -133, 187, -2, -398, 169, 336, -277, -60, 252, -195, -119, 248, -103, -82, 290, -42, -306, 70, 196, 9, -25, -42, -42, -8, 41, 66, -62, -57, 190, -47, -308, 198, 241, -278, 35, 168, -354, 78, 426, -370, -190, 510, -185, -388, 385, -25, -313, 422, 17, -527, 278, 285, -381, 86, 241, -260, 39, 146, -245]
1233b45L29J79m26P8J18j22K63p8l31L11K6l28L13L7k95L54n9n22M50K41m60J93
1255B6R9m02L46J54m98L17K22m91K05J68m51M75J94p89L52M67p41L11M83q55K83
1276a25P41j020LJ081q00l16R73o65m17J155m92p80J073j09q82P51J09p01O27
1295B06J42q20M06M14m99J39J58l17K33K8k73L06k1k32L12k89k28P38k40o37P34
1316B60j03o77Q37Jr66Q92K85j239O60O97j104M00O70j212L55J025j146l8J090
1335F87r24k10J035q17k42J194p42o34J112l59o31R86l10p41R82j22q87P92K06
1354C75p51N19N5o61N93J99o41L42J81m28K85L3l74M82j9n08L99k2l25O03k21
1375A16o34Q01k4q39Q29J35j000Q49K78j340Q49Q41j481L31J107j311Q4J306j231
$$ y = [-245, 84, 263, -163, -85, 33, -89, 174, 96, -235, 76, 102, -226, 87, 124, -171, 183, 124, -398, 52, 293, -167, 26, 125, -277, 69, 223, -275, 42, 264, -227, -22, 146, -305, 170, 364, -425, -73, 394, -347, -36, 447, -408, -125, 616, -404, -401, 680, -120, -436, 537, -128, -545, 610, 118, -662, 411, 302, -580, 171, 280, -421, 206, 348, -472, -66, 348, -151, -12, 146, -171, 62, 90, -183, 123, 102, -130, 182, -107, -335, 403, 163, -474, 260, 157, -520, 317, 318, -648, 244, 529, -710, -50, 647, -457, -57, 613, -599, -244, 781, -365, -403, 687, -237, -447, 588, -229, -471, 723, -19, -653, 459, 100, -531, 455, 145, -596, 386, 264, -623, 169, 375, -376, 143, 198, -463, 130, 329, -312, 30, 211, -217, 68, 101, -273, 209, 190, -318, 81, 59, -266, 337, 116, -518, 283, 259, -580, 249, 384, -616, 233, 511, -829, 20, 861, -620, -289, 818, -493, -409, 897, -334]
1394c34l18J507q83p32J367m30q28J100k62q65J047L8r82O55K19o83N04J54o25
1413c51M40J97n99K63J90k35K79j11l49L98q0l02N15j55l65O22l29o71R05J08
1433C70p82O63O2r74P28L81j018O38O49j181K18O99r26L26Q95j087l8J041r24
1452b60l07J129o23l60J114o27q20J094j04q31Q69J58q23M76J45p64M68N03n13
1471g6O1J57l10Q4Q3j28K65O7k02P6k70j37N57j12k86N34k19n93M92l9m19Q77
1493D62P1j041M51L32q71N51P20r45J79O78j080j26J159m60l68Q46n35o05P85
1512B03j37n59Q10J53p10K02M2m02M35K75l71J76P8m30L7J65n0L23L7l86J6L4
1534e9j37K15R3j14K58j33m62J92J58j21L53L3m57J97M7m93L66M61l66R3R3o55
$$ y = [-334, -652, 855, -28, -760, 607, 177, -651, 449, 187, -678, 369, 407, -575, 80, 299, -384, 120, 274, -351, 89, 286, -313, -50, 140, -95, 184, 73, -276, 122, 42, -260, 255, 100, -265, 357, 28, -643, 262, 370, -412, 251, 313, -661, 67, 448, -570, 68, 717, -464, -246, 453, -473, -147, 748, -339, -377, 664, -260, -567, 562, -61, -421, 693, 66, -754, 340, 236, -595, 274, 432, -391, 85, 230, -534, -66, 437, -76, -15, 142, -168, -84, -1, -129, 136, 203, 1, 77, -193, -330, 227, 115, -171, 363, 144, -449, 43, 4, -415, 462, 533, -508, -57, 275, -596, -45, 675, -270, -91, 587, -493, -619, 540, 80, -288, 558, 23, -582, 203, 66, -493, 317, 470, -240, -38, 4, -398, 37, 312, -59, 117, 195, -235, -198, -33, -83, 240, 277, -109, -93, -59, -196, 19, 112, -2, 256, 123, -339, -147, 11, -110, 243, 276, -181, 16, 63, -430, -64, 397, 31, 124, 217, -438]
1556d38J62N91l79NN24n02l04M51k89o9P29k30n79M34o7m54M83J61l65L31O4o30
1578c71J26M09j94Q9J80k94p3J56j80M5K67J0j05j34r2J44M6p2J47k6j29J53j34
1601c2k72L73J98l72J38J63m24J13K96l54J19M69m35k94M02j07j32L82j48k79
1621a96L32p2l53K82J75k00J22m0k70K20J03k16J28J14j63O1m6j80K52J41k35
1642d1LQ1j57J09J10k02J08J57k74k7K11q7M3P3k29L8K19j34o6J33j00K3J04j95
1666a00K6K46j58j15J66j14PK05k28r5L41j26k48K70l1j66K64p7l04L06J13l42
1688a60J22J78k46J16J29k85O7K67k15r4J78k5k0M1j49L7J59q6k4M6r5N7O0j78
1712a20R9K11j98p9J12j38Q6K45k50j00K53j18j53K05j8o7J74j43k11K50Q0j88
$$ y = [-438, -276, 315, -64, -59, 465, -37, -341, 110, -179, -248, 481, 251, -328, 106, 39, -415, 68, 229, -136, 195, 259, -371, -245, 164, -30, 59, 239, -55, -128, 28, -152, -107, 160, 170, 65, -69, -161, -17, 29, -43, 104, 78, -51, 102, -32, -304, 69, 267, -105, 33, 196, -228, -115, 181, -173, -54, 415, -20, -314, 88, -19, -151, 231, 83, -196, 136, 64, -289, -7, 168, -32, 90, 50, -220, 0, 103, -113, 15, 129, -34, 27, -19, -199, 53, 194, -41, -38, 43, -114, -5, 105, -97, 11, 168, -106, -133, 78, -9, 34, 107, -122, -84, 135, 1, -65, 68, -32, -9, 95, -100, -74, 172, 14, -101, 65, -49, -42, 163, -65, -160, 181, 55, -193, 77, 46, -120, 144, 67, -237, 69, 182, -160, -38, 140, -106, 10, 139, -146, -79, 188, -27, -121, 57, 32, 12, 53, -96, -59, 100, 14, -10, 36, -59, -2, 58, -120, -21, 190, -8, -87, 25, -113, -27, 218, -32, -132, 121, 3, -150, 55, 37, -30, 144, 1, -210, 40, 120, -68]
1734f8J13%j38J32k3j65K02Q2j85L6j9q5K22Ok55J42J20k20O7J22j61J04J08k88
1758a51K9K98j45j15J51j33kJ81j10q6J65l3j21N1QN5P7j49q2J20KJ6N0j35L3
1783b6J48k13j8K49r4r7J37j75q1L53r7k65K55%k33J95N0k01K05N6l52R1K57j29
1807A5nM6j63P3J14j40L1J38j16k1%j20K04J18k29j5J11j33P4J36j97Q1J66k82
1831a14l9K35n0QP6k22k8K66j25r3K20j16j06J49j22m1K94j16k32J57j5m7J94
1854A33j07j55K26p4j94K29L6j57J61j05k19K84J41l08J00R4k34J27J35k12J23
1875B4J63k80l7J48n0J16L1k43P6J32j86J04J53k22R6J00l39J35L58k90q2K29
1897A36k59j3L71k53j13L42j99k41K97j9j03K48j80k59L18L1k05K02l9j88J87
$$ y = [-68, 45, 45, -93, 39, 16, -149, 53, 135, -50, -14, -33, -118, 104, 110, -145, -3, 117, -103, -36, 86, -75, 29, 137, -151, -122, 176, 31, -84, 67, -66, -68, 113, 3, -83, 82, 49, -72, -21, -13, 42, 119, -30, -112, 8, 10, 26, 76, -59, -26, 122, -91, -109, 140, 46, -51, 86, -89, -170, 183, 86, -179, 76, 76, -157, 38, 88, -113, 92, 148, -204, -113, 144, 15, 10, 56, -107, -34, 80, -60, -29, 109, -7, -28, -28, -148, 56, 174, -55, -70, 41, -92, -18, 118, -79, 2, 168, -114, -153, 82, 32, 40, 116, -106, -134, 132, 7, -86, 134, 18, -88, 61, -61, -102, 192, 76, -156, 1, -14, -61, 133, 26, -129, 97, 23, -171, 58, 94, -63, 98, -7, -226, 58, 199, -109, -9, 85, -149, -22, 113, -99, 24, 187, -93, -130, 18, -32, 84, 115, -128, -52, 80, -106, -2, 151, -71, 25, 125, -214, -79, 279, -11, -93, 136, -123, -136, 235, -18, -131, 211, 12, -229, 68, 49, -54, 194, 14, -245, 73, 104, -101, 101, 62, -126, 61]
1918F1o1j60K80J9k29R5n4r0L01o2k55K47l5k88L09J0k58L43k4n05L26K74m05
1941a61J98J85m78J60L47m20P8M10l91j05L14k58N8L67l61j49L58k14o8L45k41
1962b6r1L40l07j81M75j13k13K72k00j99M33j17k47L45j12k66K89r2j59M34j59
1983A06l90L43rk36L96j03l67L92l8m30M45J35m34K86Rm95M60K74n88K51K52n74
2005c15K42L96n53J82M52o48m4O09l67r5M60m42j58N58k72k28M60j82k65L47j98
2026f1r4M11j90k80L04j27j12L80k47j79M12k31k75M73j22k19M21k77l78N85m6
2047A48m16N08r5n21M84K0n03O01J59p56L18K23n18M45L32p17K08L78o19J82N26
2068C87n02M1L73n81M9O11m23j39M62l92r2M80l34j60M93k60k36L88j69j27L52
$$ y = [61, 0, -160, 120, 139, -90, 5, -49, -139, 162, 100, -155, 92, 57, -231, 78, 88, -170, 173, 149, -356, -30, 244, -161, 37, 222, -256, -96, 251, -169, -91, 319, -72, -177, 137, -121, -63, 304, -57, -206, 152, -62, -130, 215, -26, -117, 223, -84, -265, 210, 97, -116, 156, -44, -243, 190, 73, -174, 171, 59, -207, 82, -10, -169, 265, 106, -284, 59, 50, -186, 210, 107, -260, 132, 94, -336, 109, 244, -190, 96, 105, -390, 70, 344, -244, 7, 259, -315, -73, 323, -230, -48, 404, -244, -288, 321, -46, -141, 319, -123, -281, 277, 5, -223, 237, 55, -210, 137, -61, -155, 256, 66, -214, 90, -37, -149, 231, -16, -195, 217, -14, -289, 184, 62, -157, 264, -13, -391, 194, 148, -268, 240, 145, -376, 108, 128, -375, 226, 385, -371, -53, 170, -348, 97, 429, -288, -80, 298, -321, -139, 387, -115, -74, 299, -282, -233, 378, -45, -184, 278, -114, -206, 274, -60, -220, 273, 13, -223, 165, -4, -131, 221]
2089B21k76j73M30j67j71L37k73j07M14l02j69N60k54l44M67k53k78O91j85n25
2109c57N95j16o05O14J14n58N57M7q32M60M40o16L30L45p59J71M66n87J85N91
2129D85n67j57M20l61L5N04l87j58L98k88r3L55k52j3L26l44p7M01k82n8L18l42
2151a37J0M59m09j67N07l09j73N17l26k33O14l30m30O57j24m16N80j45n61N86
2171A70L3o36N86K10o47L15J81o37M34M28o32J26L71n69R7M62l91O7L78n15j01
2192b70M65k22j7L06l63o1L60k75m6L56k46r6K63k92J7L99l16j30L62k75o2L95
2214B52l33j28M84k91k74N28j88k76M88k29l98N86m3m91M50M6m87L89R9n03M17
2235I8K01n85K05K95m14K08K71m80J17L44m17J7L89l06k2K57l39J8L71k28j05
$$ y = [221, -55, -228, 202, 35, -136, 201, -72, -179, 235, -67, -236, 324, 70, -274, 193, -60, -338, 353, 168, -357, 238, 122, -483, 131, 245, -313, 244, 291, -541, -81, 359, -257, 73, 418, -341, -170, 296, -291, -106, 485, -82, -239, 181, -180, -145, 359, -28, -186, 212, -76, -169, 186, -66, -79, 247, -97, -174, 227, -55, -113, 205, -137, -127, 332, -77, -244, 263, -46, -219, 298, -28, -261, 353, 23, -407, 250, 126, -290, 290, 145, -416, 170, 203, -433, 153, 363, -284, 31, 212, -425, 9, 437, -195, -69, 302, -267, -170, 292, -99, -32, 346, -169, -270, 195, -27, -44, 262, -101, -162, 198, -77, -123, 233, -13, -109, 154, -138, -121, 278, -38, -168, 194, -81, -143, 252, -81, -209, 275, -16, -290, 238, 50, -226, 262, 33, -365, 221, 178, -313, 137, 183, -304, 85, 184, -319, 98, 299, -286, -81, 214, -200, 8, 279, -201, -84, 260, -157, -140, 249, -57, -79, 178, -161, -143, 228, 0, -105]
2256a05K36k03l5K53k19J9K69k66j01K67j72oL15l24j44L97j89j62L76j66k18
2277a78L52j97k41M65l3l76K77j7k84L80L8m03K85J04l98K26J95l31J69J24l87
2298b30J60K91k94K2J95k60O7K10k67K3K90k27q6K04j84NK64k25o6K62j74j16
2320a36K05p3j0J93k05j59K56l3q5J96j51j33K28j13j30L08m6k58J89j9j67K88
2342A45k4l40K15J45k27J28P1k90J39J90k51J06J91k70n6J69j08J14J59k51j05
2363a50K05p8k0J66j26k5J11j50m6J89n0k7J04j17m0J47j62p0K54mj05O7j66r0
2387a83K89K3j51J36p4j95J28O1n5J62m1k52J08R2r3J00nj55J44R3k20L0J17j20
2411f1O2J33j44LP1j93OK46j3p4lj73J9K08k8m7N7p9o0P6l9K4J18q4q2P7k1l1
$$ y = [-105, 131, -72, -107, 146, -73, -54, 215, -51, -152, 115, -57, -63, 252, -72, -216, 181, -8, -170, 206, 40, -178, 174, -23, -264, 201, 168, -208, 69, 52, -232, 148, 186, -217, 68, 172, -226, 0, 195, -136, 33, 157, -230, -70, 221, -73, -51, 144, -116, -49, 161, -106, -83, 207, -20, -106, 98, -86, -81, 183, -42, -108, 154, -20, -136, 69, -4, -14, 179, -26, -185, 71, 38, -47, 149, -2, -135, 93, -20, -150, 158, 112, -146, 43, 24, -143, 145, 121, -219, -4, 141, -86, 42, 113, -177, -38, 152, -99, 7, 198, -72, -128, 41, -67, 47, 206, -45, -150, 55, -23, -43, 123, -3, -28, 83, -67, -113, 76, 26, -1, 103, -14, -54, 93, -69, -139, 115, 111, 6, 73, -93, -183, 106, 129, -22, 114, 40, -155, -27, 34, -21, 141, 100, -152, -44, 48, -45, 55, 50, -105, 39, 132, -88, -58, 59, -61, 1, 134, -10, -7, 64, -129, -123, 123, 110, 36, 33, -140, -121, 87, 59, 12, 69, -10, -70, 6, -33, -9, 109, 25, -57, 20, -1, -32]
2439c2O2p2PJ70o1j60N7j0j9J75l2j52Q1k3j22J47J01q9Qm7j33J35J33j16k5O1
2465D4p2M2K9j02M3P3o3JN4o7%J0p9J09J09j04q2K7k8O3J01j11l2P2n9m3J03j2
2493B6j5L5q8l5J45k7p6N7j6rO4p1p3J17K4q2N3j7n5P1rp5Q8N2j18mM2j3L0K8
2523D9j02QR8k4n4K2J5Qj5j9KK0J5jm9rJ01m3r6Q1M2q1M2Lr7J00P3j45j6J32n6
2554Dl5Q7o5l5R7m6p2R3K1p6MK0NN6l9q0K0P0J3k1k6k5L7n%K1oj3rm4M4R1o5p7
2588e6L8K3L0M0q7o5R5J5n1M6k3m4N7j9k3R8l6j26M2O9k6Q0l2j70O0J63r6j8P4
2617E8j05k6J31n1l5R9n4j47J18J02n7m5l7k0P1O5rr0k4M1J6j1N7Jq7k2O4j8O9
2646E4M0j85l5J86Jq3O9q4o8J66Kj32J05J3j57Q2J16p5k1L3j46O0J90o7j09J8
$$ y = [-32, 30, -42, -35, 135, 74, -86, -29, -39, -58, 117, 85, -67, 14, -9, -131, 16, 117, 28, 36, -11, -144, -9, 124, 8, -17, 44, -28, 14, 43, -59, -16, 57, -6, -5, 49, -18, -18, -8, -87, 22, 131, 27, -55, -28, -56, 7, 108, -3, -35, 37, -22, -65, 38, 26, 11, 46, -42, -77, 68, 41, -35, 22, 6, -3, 61, -10, -83, 34, 58, -24, 29, 12, -43, 28, 19, -56, 32, 84, -34, -38, 4, -9, 21, 49, -53, -45, 53, 29, -25, -3, 12, 20, 5, -14, -12, 8, 23, 22, -27, -36, 65, 22, -74, 7, 49, -32, 10, 13, -84, 16, 89, -56, -72, 60, 4, -31, 56, -9, -44, 53, 7, -65, 28, 49, -27, -23, -3, 2, 58, 19, -61, -41, 29, 42, 21, -5, -30, 7, 2, 2, 23, 17, 4, -5, -49, -5, 86, 21, -56, -18, 5, 35, 75, -12, -77, 18, 33, -18, 28, 5, -39, 18, -1, -24, 74, 38, -88, -46, 23, -3, 77, 45, -125, -65, 98, 2, -16, 58, -47, -73, 58, 7, -28, 71, 17, -130, -12, 90, 33, -12, -49, -69, 2, 67, 58, -32, -56, -15, 1, -10, 47, 48, -39, -61, 3, -15, 54, 94, -91, -126, 60, 61, -22, 47, -37, -105, 61, 63, -69, 36, 49, -108, -26, 90, 15, -6, 27, -119, -59, 131, 64, -45, -27]
2672b7k2L6R2n2n3J2k6MP8Oj8l7o3J3J41Mr1k5m3N0J03l6p1J4nj1N7Lk1Np1j6
2704g0J10K6n7j5m7qJ53l6j36P5J1p4J05K9j22O0L0j33Q0J60j34q7P4k7K9J38
2730A34j31j23J25L2m9N7j0r2L8J2k5R1J0r3m1M1K5P1l6r3J5K4K9L4m1k8O9o4
2758a9m3J24lr7N4k2o9J37K6j86O1R3q1L1N2j26L7J16j15j2J13q3l9Q4o3K1J17
2785A08j47p6J76k3o3Q7q4q9J55J3j22Q9L3j27M3O5o1Q1Lj43K3Q8k5K2j9o7N4
2812fL0p7N8N5q7K2pn8J10K3j19K7N4p9O5M5j36P1R9j70JJ72j22j7J47j54n1K25
2840A21r6j29J59j3j27J09j1q8J31Mj47P3M3o3P9Jj15R9L7j60P5Q9p6J6M1j32
2866h0O7Q6r1nO6n3JJ5p9J18N1j42K3N0q3O7Q2j63L2J31j42kJ45r6l1R2j39lK05
$$ y = [-27, -49, -13, 79, 27, -26, -14, -40, -36, 42, 48, 30, -7, -70, -57, 84, 88, -3, -28, -71, -21, 82, 46, -25, -11, -16, -27, 30, 33, 12, 17, -54, -70, 40, 66, 9, -6, -53, -61, 92, 56, -80, -5, 6, -68, 37, 66, -56, 4, 34, -99, -19, 141, 7, -80, -6, -33, -4, 134, 3, -120, 5, 37, -12, 45, 35, -57, -19, -7, -32, 59, 69, -24, -65, -24, 1, 72, 36, -57, -42, -18, 11, 45, 4, -24, 45, -19, -62, 62, 59, -38, 16, -6, -75, 62, 88, -98, -37, 56, -25, 6, 58, -68, -31, 85, -30, -42, 71, -12, -51, 33, -30, -9, 108, -39, -115, 61, 38, -25, 62, -22, -111, 44, 57, -65, 24, 57, -70, -27, 38, -23, 58, 61, -82, -59, 29, 4, 26, 7, -60, -6, 24, -53, 5, 60, -27, -5, -12, -70, 40, 63, -56, -29, 25, -54, 11, 56, -80, -9, 90, -80, -79, 93, -29, -46, 101, -53, -104, 121, 25, -104, 55, 42, -85, 24, 13, -75, 56, 60, -87, -14, 29, -34, 45, 46, -69, 30, 67, -93, -18, 71, -5, 11, 52, -80, -13, 73, -18, -23, 43, -10, -9, 6, -73, 45, 96, -46, -23, 27, -56, 11, 93, -70, -38, 93, -49, -51, 94, -2, -33, 59, -80, -83, 122]
2895A22j10j07J36p6l7K04j02j45J70k1j61J75N8j64N3Oj40J35J24j32rK2n0N8
2919IJ7o5O7L2j16O1K4j00J06J2j04P8O9j56j5Q7l8J15K6j93PR8q3Q0J04j49k2
2946d9R8j67M9K35j44j09J37r7j7J73j14j13J76k0p2J05p9j03J44j9p0J76n0k00
2970a30P0N6l4J54J5k36J4R8n3Q8L7q2K3l0o7R3M8j01O2J3j03J10J0j87Q7J78
2996A33r4KJ7j91M2J78o5J4R1j88o2J24m3P4J38j92j12J65l6m4J47r4j10J67j1
3021E0j38J13qj01J18L6p7O4q1j16J28J06p0O3j05j36J37P7p9P9J1j51M7M0n2
3046d5R7K2j33L3O4p5M1J9j16J26J09j75j8P4j10O3J55j28n3J05j21m9J90lp0
3071BK5j07k9J77k5q2P9o2l4J10n2p0J30l9j05J23L7j18N2k6p1J49K3j27K1K6
$$ y = [122, 12, -95, 41, -35, -72, 132, 30, -115, 55, 34, -127, 48, 106, -58, -5, 1, -139, -4, 120, -12, -21, 1, -49, 9, 26, -39, 28, 60, -56, 5, 29, -71, 35, 47, -57, 21, 90, -66, -81, 6, -32, 83, 109, -84, -77, 21, -62, 18, 122, -27, -49, 49, -118, -69, 166, 22, -87, 50, -47, -64, 109, -5, -118, 58, 38, -34, 71, -8, -111, 33, 14, -56, 120, 70, -130, -60, -4, -38, 116, 131, -105, -91, 7, -46, 42, 79, -3, 20, -10, -77, 16, 64, -37, 25, 38, -65, 45, 55, -132, -45, 133, 39, 41, 58, -133, -91, 87, 22, 36, 127, -61, -123, 1, -42, 32, 170, -22, -134, 31, -5, -49, 98, 4, -106, 61, 50, -88, 25, 17, -84, 34, 70, -7, 57, -24, -140, -12, 94, 24, 87, -18, -154, -17, 60, -19, 60, 71, -80, -33, 7, -45, 52, 74, -59, -26, 38, -37, 4, 23, -93, 33, 142, -33, -51, 23, -87, -24, 131, 3, -50, 55, -66, -115, 75, 72, 2, 27, -80, -109, 68, 43, -39, 40, -22, -56, 54, 2, -68, 62, 23, -82, 41, 78, -40, 12, -14, -85, 64, 87, -40, -19, 7]
3097Gm4Q5nr7P9K0j18Q4L3q4O5J7j30P0J12j38J1Q2q4N0N5j47K9J37j00pR3j15
3125d0nJ21j05k9J48p6j07J07Qo0R4m4q7Q0L9p3K7%k1O3n2m2R3j4o0N8k7n0J03
3154D9l5q4J08M0j33N2J7o8J06K1j39M4Q0j18O4N9j01M6N4j33L7J10r7j4P4p6
3180c7L0P8j09k0J04l4j3M6p8k2J00p1k7J37p4p5Q7k4l7J19l7j42Q7N8o4K9jn1
3208d1N6Nm5M5k3l4M7Mm1R6n2j11R6L8n4O4k9j26J11O6j30O3N4j05K6Q0r5K9Q1
3237G5j27j6J35n3k6N3p1j9J07l8p0N6k5pO3m5J3M1p5j0P2l1J1M6r8l0J46l8j01
3266f2R4j9p8R7mq3P4Qr6O4M7n5K5%p2Q9M5r2RJ5l9O4K9j04L9N3q6L4O5p8K3L2
3298C8j11N3J08r5l7N5m9J9Q0q0k7R0m3o3P3j1j7M5n3j8R1k8m7K7k6J0O9n2n6
$$ y = [7, -37, 48, 43, -54, 25, 45, -73, 11, 44, -40, 25, 42, -88, -18, 94, -44, -33, 49, -35, 15, 70, -77, -48, 89, -11, -18, 75, -40, -45, 76, -29, -58, 90, 14, -93, 14, 22, -38, 56, 12, -75, 5, 44, -29, -2, -2, -23, 40, -12, -54, 39, 25, -35, 23, -4, -54, 49, 14, -70, 38, 78, -55, -3, 14, -54, 52, 73, -66, -22, 58, -60, 4, 63, -38, 8, 62, -71, -34, 76, -21, -35, 39, -37, -7, 71, -38, -58, 46, 12, -1, 45, -33, -55, 45, -26, -53, 84, 10, -65, 22, -2, -39, 80, 43, -99, -12, 46, -18, 11, 10, -41, 15, 20, -25, 20, -3, -37, 10, 14, -27, 69, 17, -94, 2, 40, -14, 50, 21, -105, 6, 72, -58, 5, 59, -46, -20, 60, -35, -6, 75, -52, -68, 67, 14, -12, 41, -30, -49, 58, 20, -50, 6, -19, -26, 37, -8, 5, 46, -29, -39, 33, 2, 13, 59, -39, -69, 77, 39, -62, 32, 13, -65, 32, 28, -55, 19, 27, -69, -5, 42, -13, 12, 12, -60, 29, 74, -18, -9, 6, -33, 31, 60, -44, -5, 48, -38, -4, 61, -17, 6, 38, -73, -20, 88, -7, -44, 11, -38, -19, 61, -19, -46, 44, 1, -62, 11, 0, -17, 28, -25, -43, 48, 20, -27, 0, -26, -16, 53, 1, -55]
3327e5J02l7n3O9j9n9R1j8r3Q7L7r8K9N0o4N3K7r1J5N8m0QK4m8K6J3n9L7M7l9
3357@oJ0l5N2L7r3J6M0l4nM7o4J7Q0r9j5Q8j8m2M4m5j0Q2m6m9P1kn2M2j1k6O3
3389C7l0n5M1L6m0L2k8k6P3j1p5M8L3n8K1J5n5N7L1p2J2N0l7Kqk3M6K3n6pL9k1
3421fPK7o2K8M7q7J7N8m5NL4p2L2Q1n6m9M7j5rM5m5j3O0k8m8P2jl2K3k9l3Q3j3
3454B3m6J3J9j8K5qm1N1Kn3L5J1l3L8j6m2O1L0p2NJ3qL5Rq0L4L9l8J6J3k9K8j2
3487Do0N0O2o5j2K5l2L8M2q5k1R6m2k7M6k8k3N9n1j3O9k1n4K9%kM4k8m1M0J9k6
3519h%J8k8L8k2m3O6rk7K4j1k5N3j8p4O1M6o3K3Oo0M9K9m6KO0o8JL8k2J6L8q2
3552c8j3P3k4j1L3m0qO1l6l7N0qk5L1qj9N3m7l0N5J5n4M0k3l4O3Lm8L1K2m0QJ3
$$ y = [-55, 47, 10, -43, 26, 7, -52, 39, 21, -72, 15, 52, -46, -17, 33, -31, 22, 49, -42, -27, 31, -9, -1, 23, -25, 1, 14, -45, -8, 39, 0, -6, 4, -31, 21, 58, -35, -19, 21, -13, -18, 29, -35, -18, 62, -37, -52, 36, 18, -24, 20, -25, -35, 47, 1, -48, 23, 21, -31, 11, 0, -26, 37, 7, -48, -7, 29, -11, 21, -7, -33, 40, 29, -46, 2, 35, -23, -2, 13, -42, 15, 46, -26, -14, 36, -1, 1, -7, -30, 16, 39, -17, -24, 15, -6, 1, 28, -34, -6, 41, -46, -29, 29, -16, -11, 23, -49, -17, 64, 8, -41, 6, -9, -18, 27, -18, -31, 29, 1, -47, 25, 24, -8, 15, -14, -47, 36, 23, -23, -10, 9, -9, 16, 8, -33, 18, 20, -33, 2, 13, -20, 18, 2, -40, 21, 51, -21, -16, -3, -11, 24, 33, -47, -13, 26, -12, 4, 17, -12, 16, 4, -56, -6, 56, -9, -21, 4, -28, 10, 52, -33, -54, 42, 0, -27, 19, -9, -32, 27, -24, -37, 32, 11, -43, -14, -14, -16, 28, 0, -41, -1, 18, -8, -8, 10, -18, 20, -2, -45, 21, 12, -15, 9, -2, -27, 26, 8, -66, -5, 41, -22, 1, 7, -53, -4, 25, -21, -19, 41, -27, -26, 12, -10, 6, 44, -38, -51, 22, -2, -13, 20, -20, -28, 33, -3, -40, 10, 2, -23, 8, 0, -19, 34, -13, -43, 12, 27, -27, 13, -10, -44, 19, 22, -26, 5, 27, -13, -5, 8]
3585Hl2M8nl6K2J0j6J3l0l1J03j7r3L7L9n4M2L7p1J3N6p9qR1k1m9M0n2qQ1l0l9
3617c1M9k3j0L2k5k1O7j9n8M3J8l5nJ5j9M2km6J0LJ0L0l7k6M8Km9L6J8n1N8rn5
3650d0N5K8o6rN5j6Rnl6J6M1k8j1K7n1J2M5p1L0P4m6n8O1ql3M9j2o0N8J7p0K3
3682b0L3rpRl3L4J1l8J4K6k6J3j0k3L7K6m6j9J1K3Nj7j5L5Nl4K8qk7M6Jq1N3N7
3716E4o2pM5m7mN3l5l9Q4k6m9K5J0pL4k7k6M3pn0M0J3k6K5j6l6M3L9m8jjlJ5M
3750A0k7J3J5j2j0OlM3k9n5L7M0k9lJ2k7J7J8m0RL7j8j0J1j7J9K7m7nM4j0m1M5
3783B0k8nN4k1p9P9Rm0K1kl5L3Lk5L5K1m9kKjN0j0n1KL6k3J2Nk2J3Rl7rN2Rk3
3819Cpk0J4K5l1QM0k8nJ9n2K7N2m6j2K8kk3RpJM4j7m3K2J5l0K1jk1L3nl7LM5k3
$$ y = [8, -24, 24, 19, -17, 5, 15, -1, 12, -18, -49, 54, 37, -56, -19, 20, -34, 8, 45, -26, -13, 43, -36, -44, 47, 26, -23, 17, -35, -43, 38, 8, -31, 18, -5, -15, 17, -8, -29, 38, 19, -39, 4, 22, -13, -18, -3, -22, 20, 18, -28, -18, -15, -5, 25, -12, -38, 10, 12, -37, -1, 17, -34, 24, 15, -40, 15, 43, -23, -32, 23, 7, 16, 11, -25, -9, 32, 4, -7, 20, -31, -19, 26, -45, -15, 59, 13, -45, 16, 8, -25, 24, 12, -48, 10, 27, -43, -20, 13, 4, -3, 6, -27, 7, 18, -20, -6, 20, -6, 7, -3, -26, 11, 37, -9, -28, -17, 6, 11, -6, -21, 14, 19, -15, 13, 5, -22, 24, 25, -56, -3, 54, -8, -15, 30, -17, -21, 32, -3, -42, 42, 16, -33, -8, 2, -5, 29, 2, -24, 19, 12, -38, 2, 15, -11, 14, -2, -38, 5, 44, -4, -5, -6, -9, 6, 10, -17, -4, 11, -1, -11, -5, -8, 35, 6, -49, -12, 28, -1, -4, 8, -19, -2, 16, -24, -15, 22, 4, -6, 5, -12, 7, 34, -13, -18, 26, 16, -25, 20, -8, -13, 41, 20, -59, 20, 29, -11, 10, 8, -27, 6, 9, -16, 19, 40, -9, -11, -9, -10, 40, 30, -21, -19, 17, -6, 6, 11, -11, 2, 11, -26, -35, 17, 26, 3, -4, -24, -10, 15, -16, -8, 32, 4, -1, 18, -34, -7, 45, -1, -13, 15, 13, -10, -1, -8, -7, 37, 20, -23, -1, 14, -16, 5, 4, -17, 16, 11, -26, -23, 22, -1]
3855aJ6Jk5PKl0K3K4Rmk8k1J8L0k4PK1j9k3J5j7K9M1m1k9K5j1J1J6j9RK3m1qJ8
3890DJ1L%l1JL8j5l3M7j5MJl5nL6Pl1L2pk1Jj5oM2J5m3%J7j7J6Qk5J6J9k7lkO
3928gJ2Jk2K3J3m9JJ8PL1oo1J3M0j8ML3l2oJ0l1K1L7k5k2J2nQL0l6j0K9K0l9J3
3963Gok2M9j1m6L7%l0MJ8J1Mql8J5N2j4j8mj0K5L%k0MoLJOJ7k9k9L2K9j3J1k2
4000Bm5M6K8m2QK1l4QK8k1j0L5m2k1O1J5m0Pj9PL3ok9jK1j5lMLK3l9%K7pnJl0
4037c1ON2j1n2J9JjL2pk8QJ2k5J4K6j7%oj4K9K1l7NKjJ0J4n4K1N0n0ML5l5qL0
4073A4k5pN9l6m1L9J7k9K8nl3K9K1m0NJ0j3J1Kj2J9j0j3OmMK1m1j3P5k2l5K0Q
4107In7N2J6o5M9L0o4jO2m2rM0m6j0P3j6o1M4J1j3J8l0oL0j9nJ7j3%Mk1J3L0k3
$$ y = [-1, 15, 16, -9, -2, 0, -30, -7, 17, 26, 22, -6, -27, -9, 21, -3, 4, 25, 6, -17, -2, -19, 10, 51, 10, -19, 6, -5, 6, 22, 3, 12, 35, -6, -14, 4, 15, 18, 18, -13, -12, 26, 11, -22, 25, 10, 14, 15, -20, -25, 11, 18, -13, 19, 12, -9, -8, -23, -29, 13, 28, -15, -15, 2, -15, 1, 9, -16, 0, 19, -8, -11, -13, -7, 5, 6, -16, 7, 20, -29, -28, -10, -3, 28, 22, -39, -26, 14, -4, 0, 33, 1, -5, 5, -26, -5, 32, 7, -15, -3, -8, 0, 30, -6, -16, 13, 33, -6, 7, 1, -21, 28, 17, -29, 8, 8, -22, -18, 0, 11, 15, 7, -31, -16, 36, 22, 4, 0, -10, 15, 18, 18, -2, 2, -4, -1, 0, 6, 23, -6, -35, -3, 26, 13, 24, 2, -43, 3, 31, -11, -3, 18, -16, -8, 20, -1, -11, 24, -18, -39, 22, 37, -3, 4, -15, -8, 25, 19, -10, -11, 10, -5, -8, -4, -1, 22, -17, -17, 10, 3, -2, -1, -31, -25, 27, 16, -36, -17, -16, -17, 15, 8, -20, -12, 0, -25, -11, 15, -2, -2, -8, -22, 7, 28, -9, -4, -2, -3, 7, 21, -33, -12, 38, -12, -8, 27, -8, -16, 14, -11, -18, 41, 5, -36, 3, 20, -9, 19, 14, -19, 10, 31, -9, -4, 6, -7, 4, 6, -6, 13, 3, -10, -4, -8, -4, 17, -24, -37, 38, 16, -19, 1, 9, -48, 4, 20, -45, 4, 34, -30, -31, 31, -11, -20, 20, -26, -36, 37, 21, -40, 4, 15, 2, 20, -10, -16, 14, -5, -10, 7, -6, -6, -2, -23, -10, 20, -3]
4141cl3M0lj6L8j8n3O2J2m4K0Rl1J5J2m0K0L5l0k1J4K0J5rm4K7Rj8K8j0m3L8K8
4174B6o4L7L8p6K8L6m4J7N0o7k0P9j6n0L7j3l1P1j9n2K4L3l4OJ9qJ0k1qJ9nKq
4207dj5PM4k6l1K0qk0M3On2N2mo1M0N0o0%J8l2K5M4n4j8L7kqJ4k4J7J3k5MQnR
4243BJ1m1J9M2n4k0O8j8j9L1k7j9M4ll9K2L5m1OJ4l3K4Rj8MjNPk7mL6k2j5K2K
4278Bj4K7k1l3M7J9n4K6J6m1J0L6n7L2K8l1j7M8j7k1K4k1j3L7jk6J2PkJrlK0p
4312Dj2J3oMJ3m2%M9ol2K9k5oL7pl3L4Om1J3L7k4Jj5j6K8J3j8j0LJJ6Ol7J7J2
4348Fk5K8J1k8J1jl3J6N1k7k7J3j3K5J9l8kK0Jk3K4loMroK0%prpL4J2m5jK1j3
4385gJ3J9k2k3K8j5j8M4J4m8OJ1k1K5J9n5jM9j5rLj2j2L0oJ8jl6RQrK4J5l7j1
$$ y = [-3, -36, 4, 1, -15, 23, 5, -48, 14, 26, -18, 2, 11, -20, -5, 7, -33, -13, 22, -8, -29, -15, 5, 20, 11, -33, -6, 3, -15, 13, 3, -40, -2, 26, -38, -1, 37, -39, -11, 25, -19, -2, 48, -19, -39, 40, 24, -26, 11, -2, -33, 38, 19, -33, -9, 24, -10, -4, 15, 7, 17, -4, -12, 7, 2, 4, -4, -19, -12, 32, 6, -25, -5, -13, -33, 10, 16, -36, 16, 12, -49, -9, 41, -19, -19, -1, -33, -8, 36, -18, -36, 1, -1, -9, 5, -19, -2, 11, -14, -10, -2, -7, 2, 13, -28, -9, 33, -21, -41, 27, 9, -10, 21, -6, -25, 19, 16, -23, -1, 34, -7, -1, 13, -20, 4, 13, -5, -1, -2, 3, 10, -17, -21, 15, -7, -22, 0, 2, -12, 15, -6, -39, 8, 27, -27, -1, 15, -26, -16, 20, -37, -5, 23, -8, -25, 23, 6, -15, 9, -12, -25, 12, 11, -15, -3, 4, 2, 3, -6, -9, 11, 4, -8, 5, -1, 3, 16, -26, -26, 23, 17, -15, 14, -11, -17, 20, 13, -20, 14, 20, -21, -8, 29, 5, 6, -9, -25, 3, 16, -2, -12, -9, -8, 8, 14, -23, -6, 6, -19, 9, 20, -8, 3, 2, -31, -15, 36, 9, -18, -5, -18, 7, 26, -12, -14, 6, 7, -16, 8, 5, -1, 3, -6, -12, 8, 8, 1, -8, -15, 19, 31, -14, -15, 6, -7, 6, 25, 3, -20, 8, -7, -25, 19, 33, -15, -9, 2, -19, 6, 25, -30, -31, 18, 3, -6, -3, -15, -27, 3, -3, 15, 14, -22, -13, -5, -14, 10, 25, -12, -23]
4420b3K7mjLj4J5Pj4j2J9rrJ9Oj3J9k6j6L2K6j6k4k2NN4j2k4K5k7j6M1rj2L0j2
4455A3m2K1L2k7J0Nk7K5J9m3k0K5QJ5kqj3Pj4K0PPj1k1oK8J6k3J0mrK5ll3JK5
4491A3lnK6l1k0J9lJ3K2k1l9J2K2J3J5k4l7K5j0J0ONj6J6lk6M7j8k6K5J3j8Rr
4525Bl4J9M0j8j2Jj3NJ3OoJj2j4K4PRj8k7J8K1ooj2qL2J2k6KK7m3%L1rpK2k4l0
4563c3N7J3l7mlkJ6K2m0pK8MrPj2QmrK2Kk9J4j8PK8pk1MJ4Mlj1k0J2J5j2lK0j4
4602aj5LJ4MK1k3k5J6OjQqj7L7j3kQmpJ2j9nM7m0k6L4Oj9QKk5K0K2k9qK3noJ3
4641Fk0OJ2k0QQRj5poJ1L1k7JKk5K6jjQPl4PL2knKk6LK9nj6K0j7j4K9j0j2K5J
4681B0k9OPnmJ4j8J4J7m1NJ3MMjk1J5J9l2J5J2rlj2j1J9Qk0rJ7KkJ5j6JJ7k4J4
$$ y = [-23, 4, 0, -1, 2, -12, 3, 10, -4, -16, 3, -6, -15, 4, 10, -3, 16, -10, -26, 6, 32, 16, -8, -30, -25, 29, 17, -7, 18, -9, -25, 16, 7, -5, 25, 13, -29, -8, 24, -3, 7, 12, -15, 10, 29, -14, -34, -9, -1, 14, 12, 4, -9, -2, -16, 4, 11, 18, 7, -14, -20, 8, 24, 1, 11, 7, -2, 23, 20, -13, -12, 13, 10, 5, 31, 0, -20, -1, -4, 9, 31, 10, -29, -17, 5, 18, 33, 9, -28, -3, -13, -3, 3, 8, -8, 8, 5, -21, 26, 8, -18, 7, 20, 2, 11, 2, -32, -13, 27, 9, -3, -2, -15, -10, 3, 9, 3, 4, -8, -22, 2, 9, 18, 0, -27, -9, 12, 6, 0, -12, -20, 12, 24, -2, 0, 27, -16, -16, 15, 6, -1, 21, -3, -33, 24, 37, 0, -4, -7, -9, 7, 29, -11, -18, 10, 14, 5, 12, 0, 8, 4, -5, 17, 19, -10, 4, -14, -7, 21, 14, -7, -3, 11, 15, 12, 1, -19, -7, 8, -4, -7, 13, -1, -16, -13, 1, 5, 26, 3, -22, -6, 0, -1, 7, -1, -18, 19, 6, 4, 12, 8, 1, 13, -6, -11, 36, -4, -30, 4, 10, -9, -1, 1, -24, -4, 18, -11, -19, 4, -1, -7, 6, -14, -8, 4, -16, -8, 0, 9, -6, -13, -19, -8, 23, -4, -3, -1, -26, 0, -1, -2, 6, 13, -21, -14, 18, 16, 11, 13, -13, -10, 19, 14, -2, 18, 1, -13, 16, 6, -6, 19, 20, -9, -3, 4, -1, -5, 9, -9, 5, 22, -19, -14, -1, 3, 7, 6, -15, 0, 19, -13, 2, 14, 5, 2, -10, -21, -2, 6, -14, -23, -6, -4, -6, 9, -7, -6, 11, -13, 1]
4719AnMnJ8k1j0L1j6j3QKKOJj8K0Pl2OK3pRj2k7K1K0j5QjJpOj5OJ3ppMj4J6J0
4760A1j0j0MMj6J9%ljpnRPj5J0oRJ3k3%K7nk6kQOJ4j6j5K2%j8K0Or%jj5J5K2j3
4801A0k1J4OjKj5mMJ7rj5QJ1k0J0Rj6kJ0nrK4Kk6RJ0Kjj3k3K5J4j2j7QJ3j7J2
4839fnjJ1%k8K6RJ0nk9MK5kpln%RoQK0k1j9NJ4QJj4rK6Kj5pJ1Pj0rKlJ3mj1J8
4882A0l%j5RJ3oooPj1J5%lj7J6j4lK5j5KNj2j1L3Qk8%KPPrj3OJ9j5j1K3krpLK3
4924A7oj3J2j9K0Lj9k3K2Rj1J4roLK5l2J2jojPJkQk0jJ3K1k3Lj2J1LRmoKj5QK
4965dQQk1j5L6mklLj5K4Lk9J1J8j0lPjkjrKQJqj4J4Qj1nNopJ6Nj1J1ok5J6K0k5
5008a3mRlPK6l3j2J8J0j8J8Lk5J9%j4RJ5k2MJNKOj5pJ0RLrrRPj6J0nmJ3lq%J6
$$ y = [1, -4, 0, -5, 13, -8, -18, 13, -3, -16, -8, -6, -4, 2, 3, -15, 5, 12, -20, -14, 9, 2, 11, -1, -28, -7, 13, -2, 6, 5, 6, -1, 5, -10, -4, 9, 2, -5, -1, -15, 1, 11, 1, -9, -5, -1, -17, 2, 2, -1, -2, -9, -14, -5, 2, -13, -3, -9, 0, 13, -10, -10, 17, 12, -14, -16, -8, -2, 12, -4, -19, 3, 3, -15, 5, 11, 2, 2, 1, -14, 1, 23, 10, -11, 3, 9, 8, 10, -5, -9, -5, 12, 3, -12, -4, 7, -13, -3, 6, -10, -12, -2, -7, -16, 8, 10, -16, -7, 3, 5, 4, -9, -32, -7, 7, -5, -22, -14, -1, -18, -6, -11, -12, -1, -1, -29, -3, 6, 16, 11, -18, -14, 11, 9, 2, -1, -6, -6, 3, -3, 5, 25, 4, -15, -10, 4, 12, 13, -1, -10, 16, 18, 3, -4, 7, 14, 4, -5, -3, -6, 7, 3, -8, 10, 7, 7, -8, 1, 14, 8, 2, -4, 3, -8, 7, 7, 4, -13, 3, -11, -14, 11, -4, -2, 3, -9, -20, 13, 21, -7, -7, -5, 2, 9, 0, -13, -7, 12, -3, -14, 9, 7, -2, -9, -6, 17, 11, -2, 10, -9, 11, 14, -5, -28, -6, 3, -8, 6, -3, -9, -6, 19, -13, -1, -2, -8, -9, -2, -1, -3, 5, -15, -16, -3, 18, -5, -2, -14, -3, 0, 9, 5, -1, 1, -14, -6, -4, 4, 12, -9, -24, 12, 8, 6, 3, 6, -9, 15, 18, -11, 0, 18, 8, 5, 12, 11, 9, 8, -1, 1, 9, 10, 2, -12, 2, 10, -1, -6, -1, -7, -14, 2, 7, -4, 7, 1, -24, -8, 12, -13, -17, -8, -11, -4, 22, -11, -23, -5, 5, -13, 5, 8, -17, 2, 2, -12, -3, 12, -10, -6, -5, 0, 2, 8, -7, -14, -4, 5, 8, -1, -10, -1, 6, -10, 0, -5, -9, 4, 1, -7, -7, 9]
5050Ij5%K7k0lJj1mK4nkpj5J1NONJj3oMJ2Jjj3JJ8pj6J2JjRJj3K3j5k2J5J2nj
5092CPk6K5Mj6oOPqjRjplJ2mqQk1QK6%k0OKrJ1Rl9PJ7lrJ7r%Mok3L6rj8jJ6Qj4
5138a3MjMJ6j5qJ%J4lMLj1lJ9j6J4jj6OkK1j9Pj0QOrjJJ2j8j0J7Rn%j3oJ9Nrp
5181fLQKj0%RMj5J2j7RJ1j9mJ6%l2K4Rj9K8km0L0J5k0lJ2kj9J9pmK0j0mLrNPj0
5222fMJ1rOj2KNPj9jJ8j1LJ4k1OMJj6K0j0mQPj4POj2mOJnpOJ1kj6K2j2J1j4oJ
5265a4J6rpJ2J0rnJ1j4RJ8j7kNllRjj4K5ql0K2NlqrK2j3joRjJ0kj9JJ5j1qL1j6
5307cj1Qj2kK7Kj7rK5j7jQ%JJ2j2j4J4knmLQlKj1JJ5Oj1j4J5J4j4KLj4LJ2k5J6
5348dJ4pnJ1Oj1Lj3NJ3%j1oLKM%j5QKqqlJ8Pk1OPMj0Pj0K4mPk4LJ5j9J0lknJ1
$$ y = [9, -6, -6, 21, 1, -2, -1, -12, -16, 8, 3, 1, -6, -21, -10, -5, 1, 6, 7, -6, -12, -8, 4, 5, 4, -9, -8, 10, 3, -13, -1, 0, -1, 8, 9, -4, 19, 4, -18, -3, 9, 4, 3, 10, -16, 9, 13, -3, -9, -3, 4, -4, -5, 4, 3, -4, -7, 5, 1, -7, 1, -20, -12, 14, 14, -6, 0, 2, -7, 4, 13, -26, -19, -2, -5, -14, 3, -6, -6, -2, -8, -31, 5, -4, -22, -23, -7, 1, -13, -9, -10, -6, 10, -5, -13, -12, -12, 2, -1, 3, 6, -5, -8, 11, -5, 9, 8, -8, -2, -4, 17, -2, 5, -5, 3, 9, 0, -1, 0, 12, -6, -16, 1, 10, 5, 5, -8, -14, 5, 10, 1, -6, -3, 5, 7, -3, -3, 6, 10, -5, 7, -10, -1, 10, -9, -13, 3, 3, -29, -5, 4, -15, 13, 11, -29, 1, 16, -4, -7, 5, 3, -16, 3, -4, -8, 12, 2, -2, 1, -8, -3, 4, -6, -2, 9, 0, 6, -6, -4, 1, 8, -11, -12, 6, -5, -2, 12, -9, -3, 1, 2, -14, 6, -4, -8, 0, 7, -7, 0, 6, -6, -10, -4, -3, -8, -15, -9, 2, 0, -16, 6, -6, 5, -9, -15, -14, 2, -7, -14, -2, 8, -1, -6, 5, -9, 0, 18, 1, -1, 4, 1, -2, 7, 6, -8, 17, 9, -21, 1, 6, 3, -5, -14, 8, -5, -6, -12, -3, -4, 6, 4, -15, -14, 1, -10, -18, 13, -3, -14, -6, -18, -20, 7, 9, -8, -17, 8, -9, -10, -2, -2, -1, 11, -1, -15, -1, -3, -8, -12, -9, -1, -4, -2, -13, -12, 3, 9, -2, -16, -1, 13, -1, 1, 4, -10, -7, 5, -20, -4, 10, 3, -2, 9, 15, 4, 7, -6, -1, 12, 12, 1, -5, -2, 0, 4, 4, -11, -3, -1, -9, -17, -20, -2, 5, -16, -10, -3, 1, -9, -2, -12, 12, 8, 15, -9, -6, 9, -10, 0, -3, -5, -10, 1]
5392AnKJ4j4j0MOJ3rqJ1o%kqjK1Jj5kJ2mmMKmLLj2KlJ5k2J2j1KPk0RK5j2pjOj
5437fjJjpJ2mj0kK2%qK5k3kONk2J7Jj4J8%rmJ0j5J3Rj4j0J5KOj3rJ3Oj2j7K6%
5478DnJ5j5j0K3j9j4J8Ql%rLJ0j4mJ3kkKpJ1KJj1J5nJJNj7J2NqNj0LmJ9k4J5J0
5520A8j9ORoPj3kLJ2k5J3%oRpj3OK5k0kKLkJJLP%j3Qj2RmnlK0k1JJ2nJnJ1j5J3
5565BpMLjnQokkJ0j7J5J4j7Kjj2J0K6j5mj0OjMOlPj1NlJmkqkJ9j5J1rk6L7rj5
5609a7MNQRj8J1oMRk1K2j1mJ3k0QJ2mk1J7lj0K4j6mRRk2J3%nlLJnK3jj8%JJ9j4
5651Aj1OPj5J4J4j3Oj5PnJ1j4mJ5j8K0pJMNj4%QpJ5j6Oj2K2oj1J2k%Qj7PjJNj0
5693cJ9jnmqjOKj3K0j0mjJ6rOKj8JQ%mqJ4Mj0Qj3kRpOjMj0pJ2MrMqKRMj8RjML
$$ y = [1, -4, -2, 12, -2, -12, -8, -2, 11, 2, -6, 5, -1, -1, -3, -11, -12, 9, 10, -5, -7, 5, 1, -3, 1, 3, -1, 2, 5, -7, -5, -8, 7, -15, -3, -14, -12, -5, -25, -16, 9, -3, -10, -11, -5, -6, -7, -6, -7, -14, -2, -6, -16, -18, 4, 4, -4, 21, -2, -4, 2, 7, -15, 2, 3, -11, 7, 7, -2, -6, 4, -11, 2, 11, -3, -13, 2, 4, 10, -3, -12, 1, 7, -5, -22, 4, 4, -1, 14, -1, -11, 12, -7, -21, -3, 5, 2, 2, -7, -4, 6, -8, -12, 1, -1, -3, -1, -8, 3, 5, 6, -5, 10, 5, 6, 7, 12, -5, 7, 12, 4, 9, -1, 2, -2, 17, -7, 8, 18, -1, 5, 14, 8, 15, 2, 0, 3, 15, -10, 3, 3, -3, 6, -1, -14, -8, 17, -3, -5, -3, 0, -2, -1, 0, 3, 10, 10, -3, 5, -7, 2, -2, -7, -10, 10, -11, -10, 2, -3, -2, -7, 4, -11, 2, -5, -1, 2, 1, -4, 4, -2, -4, -6, 4, -13, 2, 16, -1, 1, 0, -12, -2, 24, 9, 5, -5, 1, 0, 4, 10, 7, 14, 3, 8, 5, 6, 2, 0, -8, -10, 9, -6, 5, -4, -30, 7, -2, -17, -13, -8, 0, 9, -9, 2, -4, 0, 9, -12, 10, -1, -5, 8, -12, -4, 8, 4, -17, 0, -3, -13, 11, -5, -9, 0, 9, -13, 0, 0, -5, -8, -5, -4, -9, 14, 13, -5, -5, -4, 15, 1, -10, -4, 3, -12, 2, 16, 3, 9, -6, 1, -4, 7, -7, -11, 4, -14, 6, -1, 0, 4, 9, -5, -5, 3, -4, 11, -5, 1, -11, 11, 5, -6, 6, 4, 4, 12, -5, 2, 1, 2, 7, -3, 16, 15, 10, 6, -2, -3, 3, 5, -8, 12, 2, -2, -3, 13, 4, 10, 12, -6, -5, 3, 3, -1, -9, 5, 9, -1, 7, -6, -8, 1, -6, 0, -1, 3, -7, -14, -2, 2, -7, -3, -11, -9, 0, 4, -14, -5, -6, -2, 1]
5742AJkljLKNj%QnnlLKNj0Pkj1J0j0MkJLKJ0j7J9oj6OrJ4%Lj5RQjjrpPJ1rrJ5
5791EmLoj0J1Lj2%K2kk3J5j2jK2Lj9L%KJMlKq%lJ7Mj0joKJ0j0KKj3MJ2k3J9KM
5835Hj1MpRqKqJ7j9J2%j5OJJ1rJ2o%mOmM%j1k%JQRqKmJ6qjj3%K6rlrMPN%j4Qn
5884@J0kkLkLOk1J9oj1oJ3Nj3pJ4jJ%qkPpkLJj3L4k0nQnNJLqjj1J5j2J0j2KJ2
5929bLj8kJ2J3njj0MNJ0mJkJmoQJRj3J%KllKQj3J8j7kK0jj4JjQj0JMQnmm%rK8
5977A5kk3J1Ml%NJqJ7k5J2J1k5RJ0Lj7J4mNknj2%NQoJ2j0NKLnoNqoJ5MqrJoJ0
6022cJ2j1j3J9rnJ0pjJ0qj5J5J1j6KJ6j3NmPrQ%Jj0OLkoJ5j0mJ2loMJ5j9j0K9
6063A6j6kJ6knJ%j0RjnOjmJ1j8ONLlj0rJ2QlrPqLPnj2J6Nj7nQJjRj3J0nKj1K3
$$ y = [1, 2, 0, -3, -4, -1, 1, 6, 5, 5, 13, 8, 3, 0, 3, 5, 10, 0, 7, 5, -6, 4, -6, -2, -4, -3, 0, 2, 12, -5, 14, 8, -8, -2, -11, 3, 3, 6, -9, 0, 8, 7, 6, -3, -10, -3, 8, -1, -10, 5, 1, 4, -2, -12, -1, 2, -10, -10, 12, 10, -13, 2, -10, -11, 11, 14, -5, -2, -2, 0, 1, 5, 2, 4, -4, -4, -7, 10, 14, 4, 3, -3, -1, 9, -1, 1, 3, -10, -6, 6, -17, 2, 4, 8, -3, 1, -6, 3, -5, -3, -11, 6, -13, -1, -1, -16, -10, -9, 2, -7, 5, -1, -1, -5, 1, -3, 1, 1, -10, -12, -12, -11, -3, 6, -2, 0, -4, 12, 4, 3, -10, -10, 16, 7, 4, -5, -1, 6, 11, 11, -3, 5, 0, 10, 8, 6, 9, 7, 10, 16, -5, 14, 8, -3, -9, 4, 9, -4, -11, 3, 2, 3, 3, -5, -7, 0, -7, -9, -6, -5, -18, 16, -4, -9, -1, -6, -1, 0, 3, -5, -6, -17, -2, -14, -4, -16, -14, -2, 1, -17, -19, -7, 6, 1, 0, -10, -6, -1, 9, 5, 6, 4, 5, 1, -5, 3, 4, 13, 0, 1, 1, 3, 0, -3, -1, 7, -6, 12, -5, -7, 13, 12, -2, -1, -2, 6, -4, -3, 1, 9, 4, 0, -4, -4, -13, 15, 13, -10, 1, 5, 2, 2, 7, 8, 0, 17, -8, 4, 15, -10, -1, 9, 12, -5, 9, 5, 10, 8, 3, -9, -9, -4, 4, -2, 10, 0, 5, 7, 10, 5, -1, 4, -4, -10, 5, 9, 1, -8, -7, -13, -3, 9, -2, -15, 4, -5, -10, 0, -7, -8, 2, -6, -21, -6, 5, -11, -9, 7, -6, -1, -5, 2, -7, 1, 1, 2, -8, -2, 1, -1, -7, 8, -2, -6, 6, 3, -3, 1, 16, -3, -13, 16, 0, -2, 14, 12, 7, 8, 8, -2, 7, 6, 1, 7, 6, 2, 13, -5, 1, 6, 9, 6, -4, -13, -1, 7, 4, -5, 2, -6, -3, 4, -1, -13, 3, 8, -9, -14, -6, -5, -6, 3, -10, 0, -5, -3, -14, 9]
6109IqolJ0j2JJ6Oj7%Qjj3J4J6j3nPoNKj3%J5j1j6K4j3j0R%QoPq%Rkj2QJmOj0
6153hM%J2qQj5NLkQnnJ2qJj0J4j3OJ0j5l%NMJ1j4QLqQjpMJjPj6J7j2PorJ5oMk
6200CpJ6Jk0nJ1KoK%qJ2nMkoLpNNj8J3nMlJ7j1pNR%nrJ0j7J9OlOPl3jM0k9%J9
6246A2j9RRj1MlNjJnkMKnoJ1nkJJKnnLmNKnOMj6J6lkjJ2j7pK1pjJj3J3PLrJPk2
6296a4J2PnnKpQJ0j1oJ1mkJ2rpKmJ7j2KPplKLjj2OPqQPk6OOQonJ0j3mJ1Pj1Jk
6343a2J5j%qKJ0Jk1J2%oJ2klJJ5nqmJ0oJ2j1j2QqlJ1nJ4Joj1J3mJ0j7RRroMl%
6387bkjJ%%%jk%oNlmJ2KpMjmPJj6LJ5klKLj2J6njMnJJ5k0J1Kj7PJ1j2j3J3Pj4
6434a1J3ppJ2Mj5J2j2J8j3J2j1nJ3j3J3%%j9OMJ1nrnJ1j2J4nJLllJ0J0j8jlRN
$$ y = [9, 1, -5, -8, 2, -10, -9, 7, 13, -4, -4, 4, 3, -10, 4, 20, 7, 2, 9, 3, 8, 10, -3, -3, 12, 1, -15, 9, -4, -14, -5, -5, 3, -3, 4, -4, -4, 5, 3, -9, -1, 0, -4, 2, -8, -4, -4, 8, 0, 8, -7, -2, 1, -1, 7, 2, -3, 9, 1, 2, -8, 6, -7, -1, 9, -6, -9, -9, -4, 0, 11, -3, 5, 8, 0, 8, 7, 0, 4, 5, 4, 11, -5, 12, 0, 7, 1, -8, 7, 1, 5, 3, -4, 12, 13, -7, -12, -1, 1, -5, -3, -3, -11, 1, -4, 0, -2, -8, -5, -12, -7, -2, -20, -7, -12, -8, -11, 6, -5, -12, -7, 2, 2, -3, -12, -2, -19, 0, 6, 3, 9, 16, -17, -18, 22, -7, -7, 12, -7, 2, 11, 0, 4, 1, 6, 5, 6, 1, -1, 3, 5, 0, -6, 5, 0, -2, -1, 0, 2, -3, -8, -5, -9, -4, -2, -7, -1, 3, -13, 3, 0, -2, -3, 9, -8, -15, 6, -1, -2, -1, -14, -1, 6, 9, 0, 1, 8, -14, -2, 5, 0, -5, -3, -10, -2, 8, -3, -9, 2, -2, -4, 8, -1, -8, -6, -10, 7, -5, -3, 4, -3, -6, -4, -1, -2, -14, -8, -1, -9, -1, 6, -20, -14, -8, 0, -6, -11, -1, -14, -18, -7, 0, -11, -10, -12, 3, 2, 2, -6, -4, 6, 7, -14, -2, -2, -8, 4, 2, -1, 0, 15, 10, 2, -2, 8, 2, 14, 3, -9, -1, -9, -12, -1, -6, 8, 9, 3, -8, 5, 1, 11, -6, 3, 12, 3, -3, 1, -2, -2, -4, -5, -4, -4, -4, -4, -5, -7, -7, -13, -8, -11, -15, -3, -1, -8, -4, -5, -9, -2, -1, -17, -14, 1, -1, -4, -2, 1, -11, 5, 0, -1, 3, -2, -1, 14, -6, 5, 7, -10, -3, 8, -4, -17, -4, 3, -11, 2, -5, -12, 0, 4, -11, 1, -11, 7, -6, 6, -5, -10, 3, -10, 3, 3, 3, -16, -10, -6, 5, 0, -9, -14, -3, -15, -1, -6, -5, -2, -5, -8, 2, 12, -6, -7, -10, -1, 4]
6474DNLnJjoPnQmpKJ8nj4O%pJ0nrPj2NRrj1K6k3J0Qlk2K0j1LJ0Oj0j1J0mJ7ro
6519dKKKkKj8J3oJJJ3j5pK1j9RLQj4J8k0J5kLj8MJ2NJj2pJ6oPn%qJJ4ppJ5j3K
6563@oJMLk0J8J0j6PMj2MJ2j5J2Pk4QOk%kkMJj2%J9JlqMpMlmJ4kj3K6k3J1RJj0
6608FkLj9K2jmJmQkqlOnrJ9rjj2J4qJJ2j9K0j7RrRlJRj0mJ1j2oJ6joNJNpjJ2l
6655EmQj9J1j1MLLJ0j1kRklJ1j6Oo%lNLlLrLJ1%k0J2%PlLk1J7njMKooqJ3J1j2
6701g%rJ5jjKj4mJ6mjJ1rPkkJ3joj5ORRr%KqLnL3k2Jj0nJ0J4j3j5JJ1j1J4lj1
6745a1J2nj5K1rrOPNNkk5MJ8lLk1J3kkK4p%k5P%NLKrQLKJ0j8lMMJ0j0Mj3JJ1n
6790boJ7j9MKQPj5oMRj3QmjoJ7qKMjj3MmMMnkoJ7qmPnRjl%J%qJ7j1j0J0lOmPm
$$ y = [4, 9, 12, 7, 8, 7, 1, 8, 3, 11, 7, 0, 2, 20, 15, 1, 7, 7, 0, 10, 5, -4, 3, -9, -4, 5, -4, -15, 11, -12, -2, 6, 3, -19, 1, -10, -7, 3, 9, -1, -12, -2, -6, 11, 2, -4, -2, 0, 2, 0, 2, -16, -3, -9, -8, -7, 6, -9, -16, 5, -14, -5, -2, 6, -8, 10, -10, 5, 3, 6, -12, -8, 4, 9, 10, -2, -9, 7, 1, 8, 3, 3, -5, -4, 10, 3, -4, 11, -2, 0, -6, -5, -1, 2, -18, 0, 10, -6, 1, 5, -7, -3, 9, -6, 6, 13, -11, -3, 3, 1, 1, -1, -3, 1, 2, -10, -10, 9, 10, 7, -1, 3, -4, 0, -3, -7, 7, 5, -8, 18, -5, 6, 15, 16, 6, 4, 7, -12, 10, 9, 5, 6, 2, 10, 8, 0, -3, 3, -2, -11, 8, -1, -2, -14, 0, -8, -7, 5, -14, 6, -11, -2, -11, -2, -5, -4, 5, -5, -9, 2, -10, -16, 0, -1, -7, -2, -1, 4, -3, -4, 8, 5, 1, 9, -10, 1, -10, -6, -3, 0, 10, -1, -3, 6, 4, 1, 12, -4, 2, -4, -4, -7, -2, 1, -2, 1, -8, -5, 6, 6, -14, -2, -2, 5, 2, 5, -16, 1, -4, -5, -1, 1, -5, -11, -19, -6, 5, -7, -7, -16, -1, -2, -3, -1, -15, -19, -3, -7, -8, 3, -6, 1, -1, -3, 10, 9, 3, -12, -6, 3, 12, 3, 3, 5, -3, 0, -5, 28, 6, 7, -3, -8, 2, 16, 3, -12, -11, 0, -11, 3, 0, -11, 1, -4, -19, 2, -7, -16, -10, -3, 2, 7, 5, -20, -16, 2, -1, 2, -19, -6, -8, -10, 14, 7, 7, -18, -11, -11, -6, -3, -1, -10, -2, 1, 3, 13, -5, -8, -4, 0, 10, 0, 4, -9, -8, 3, -2, -8, 9, -10, -6, -4, 4, 11, -4, -10, -6, 3, -10, -2, -6, -7, -13, 4, -4, -2, 2, 1, -12, -8, -12, -8, -4, -9, -11, -17, 0, -8, -12, -5, -10, -1, -2, -5, -5, -4, -4, -12, 5, -6, -16, -6, -9, -3, -7, 0, -4]
6840dj2J1JJ4j2rK0j9J6j3PLMj1JK0j1o%mjJ3Lj9RrmJJ2mLnkKJ3j8J6pj5J8j1
6881ilMjrP%mJ2LqjMLj3OOLkN%ol%PkknJ3nmkJ8qj3JkJ0mQkrR%%Kj0l%J4Oj5o
6933a0j0J3NrPnkpJ5oJ5j1J0j0J0j1J2j5J3nMoJ3j4J%PnKLj4Pj1J1JMJJKM%j1
6975aMj8J5R%mj2J3rJ8j1%pjJ0JOk6PkLJ0jlmqjJ0rLrMJJ3Kn%qQjjPnJjQj1LO
7024DpjlPoJ0kLJOj1mOrMJj4J1jlmJ4kmOj1KOMj1mJ0%NpQj3OklJ0j2KJ0J2nrO
7072FNk1JK0moJ0j1jNl%J0pMlJ6k0PRorKjj1KQPoMJj1JqMOj4QqPJKokJ0mJOlk
7122dlqLkk%JMJj4J6NpkK4k0JPqLPjQmpj0J8kkkPnJjJmKkNJlj1J6lj2LJOj0Pk
7173c%klPrPJ0j2PJrJ5j1kNlmQMrpPJnJ3mj1NJQpm%LO%%kJ0mJj2RQj3N%nmJJm
$$ y = [-4, -16, -5, -4, 10, -2, -11, 9, -10, 6, -7, 0, 3, 7, -4, -3, 17, 6, 0, 0, -4, -5, 8, 11, -8, 1, -8, -12, -11, 1, -3, 0, -5, -7, -5, 8, -10, 6, -1, -16, 2, -9, -12, -8, -9, -18, -11, -11, -15, -3, 0, -8, -9, -5, -2, -15, -9, -3, 0, -2, 3, 3, -3, -6, -6, 1, -1, -3, -8, 5, 0, -4, -6, 12, 4, -9, -8, -10, 0, -4, 4, 2, -7, 2, 2, 2, 4, -6, -9, -9, 5, 11, -4, -10, -20, -7, -2, -11, -4, -9, -11, -18, -3, -9, 6, -5, 5, -5, 5, -6, 6, -9, 4, -1, 3, -3, 10, -4, -3, -3, 4, -1, 1, 4, -10, -3, -14, -3, -2, 2, 3, 4, 6, 10, 10, -1, 3, -15, 0, 9, 9, 5, -7, 6, -3, 15, 4, 4, -3, -4, 6, 7, 13, -13, -6, -8, -5, 5, 4, 1, -3, -11, -12, -2, -11, -8, -17, -13, -12, 1, 3, -2, -2, -10, -2, -3, -4, 3, -2, -1, -2, 6, -5, -2, 4, -3, -4, -7, 0, -6, 4, 2, 5, 6, 12, 1, -3, 3, -6, -2, -1, -15, -4, -5, -8, -12, 2, 0, -4, 2, -9, -7, -1, 3, -8, -12, -2, -2, 3, -4, 4, -9, -3, -5, -8, 2, -10, -8, 2, 14, 9, 0, 6, 11, -10, -9, 11, 7, 1, 11, 0, -1, 4, 1, 1, 11, 4, 8, 5, 21, 1, 8, 17, 11, 2, 4, 3, -8, -6, 2, 9, 3, 7, 8, -3, -2, -10, -6, 0, -14, -6, -14, -7, -6, -4, -10, -12, -2, -6, -5, 1, -2, -4, -7, -15, -12, -14, -16, -16, -15, -11, -10, -24, -8, -3, -10, -12, 12, -8, -7, 0, -8, -5, 2, 1, 9, 5, -2, -12, 6, 4, 2, 0, 7, 2, 3, 2, 3, -1, 1, -1, 4, 5, 2, -9, 7, 4, -8, -5, -4, 2, -8, -1, -3, -3, -5, -8, -1, -10, -3, 7, -5, 2, 3, -6, 9, -2, -4, 1, -2, -6, 2, 6, -3, -10, -3, -2, -7, 6, 2, -9, -4, -3, 5, -2, -6, -6, -3, 3, 3, 3, 1, 11, 7, 8, -4, 5, 13, 0, 5, 5, 0, -4, -3, -2, -6]
7225fJ2j6J2mj2RK%kJ%j2J0qJ0pkPjJnLNqJ0Mj0N%LMj0j4K4j2oLMpJ1Rj4JOj0
7270a0J4j5J9j5OkMOLorJ1j6J5kml%J4lj0Lj6LRPqnLLLn%j%KQoOj1J0qJ4pJj7
7316a5J7rMMqnQJ1j0J4lj1NKj1RkkoJ4nPj3LqLoOJ1j1LOj0J0mkKMmjJ4j4pPKj
7362bnoMj4RLKMKnoJ3LnlJ1j2J2jk1lK5mQmkrJ1JMlNk9J2K6j7LljrNoJ4kj4Pj
7409cpJ0mj4K0KrmLo%J1jKplj0K3%k4QNnJ4oj0K1qo%jJ1Jj1OOl%Lj5J6%Pnj2K1
7455A6j4NJj6J7%qM%jj1J3pmJ2j6J3okLpJ0lnRoQj7RjJMoMj3J6l%oL%j0J5k2J6
7500emMNn%QqJ2j0LrJ4%qJ0j2RkLnKqNj1nMJ6nqmOnPMplk%jONj6QPjj2LJ4pJ0
7550BM%po%j%J5j4qRRq%PjMj3NJ0plJ8k1OJQppK3j7NqKN%oKjmJ0k1J1J9k0nPq
$$ y = [-6, 6, -10, 2, -2, -14, -5, -3, -3, -5, -4, -4, -16, -6, -14, -4, -11, -13, -6, -7, -6, -11, -8, -3, -11, -1, 3, -7, -2, -2, 1, 5, -5, -19, 5, -7, -13, -10, -6, -13, -2, 7, -7, -6, 0, -10, 4, -11, 8, -7, -1, -3, 1, 7, 10, 4, -5, 6, -10, 5, 3, -1, -4, -4, 10, 7, -3, 0, -16, -13, -4, 3, -5, -10, -7, -4, -1, -6, -6, -7, -7, -5, 3, -3, 3, -8, 2, -6, 8, 1, 2, -15, 2, -7, -3, 1, -7, -12, -4, 7, -3, 11, 8, -3, 2, 4, -7, 2, 0, -2, -8, 6, 1, 8, -5, -2, -10, -7, -13, -7, 4, -7, -4, 2, -8, 2, -2, -4, -2, 2, -2, -3, 11, -3, -10, -3, -1, -2, -7, -13, -9, -23, -14, -11, -9, -5, -3, -8, -14, -1, 2, -3, -6, 5, -7, 5, 4, -17, -20, 5, 1, 9, 5, 3, -6, 5, 6, 10, 7, 12, -17, -5, 21, 4, 7, 4, 3, -6, -1, -7, 7, 5, -9, -2, -3, -10, 0, -4, -18, 2, 4, -5, -9, -6, -12, -12, -1, -2, 0, -7, -10, -20, 3, 3, -21, -13, -8, -13, 1, -5, -15, 6, -2, -8, -8, -9, 2, 3, -8, -2, 4, 1, 1, 4, -11, 5, 5, 12, 7, -5, 16, 2, 7, 8, -8, 9, 9, 1, 5, 5, 4, -7, 6, -1, -5, 7, -9, 4, -2, -4, -1, -8, 2, -1, -6, 3, -3, 5, -12, -3, -4, -3, 1, -5, -1, -14, 2, -1, -1, -7, -4, -4, -14, 1, -21, -5, -9, -5, 0, -5, -5, 3, -5, 7, -3, 0, -9, 5, 5, -3, 7, -5, 4, 2, 5, 0, 2, -6, -1, -12, -17, -13, 3, -2, -10, -14, -8, -13, -6, -2, -9, -12, -14, -14, -15, -9, -4, -20, -12, -5, -6, -18, -15, -1, -8, 2, 6, 6, -1, -7, -7, -8, -8, 7, -7, -15, -6, 3, -5, -5, 2, 1, 5, -8, -3, 7, 0, -3, 15, -6, 0, 1, 9, 2, -5, 18, 1, 6, -2, 0, 5, 5, -1, 1, 0, -4, 6, -15, -4, 15, -5, -10, -3, -11]
7598a1%KklPkLoMJ2oj6J4nKoRNnlJ2qJ%JJqMJ0jj0lQmJ3jj2Nm%kJ6j4L%LmJmJ
7648cQk0OML%%KrJ3mqQLj6J0%omRlQoJKlnNLJpJ3lJ8k3KlJ1j0PPknoMnRnkrJ0
$$ y = [-11, -11, -9, -11, -14, -7, -9, -6, -12, -8, 4, -2, -18, -4, -9, -7, -13, -4, 1, -4, -7, 5, -3, -2, -2, -1, 0, -8, -4, 6, 5, -5, -8, 0, -4, 9, 8, -4, 1, -3, -3, -5, 11, -3, 0, 0, 3, -1, 0, -4, -3, 5, -15, -9, -5, -2, -2, -2, 0, -9, 4, 0, -8, 0, 3, -13, -3, -3, -9, -13, -4, -7, 1, -5, -4, -2, -5, -10, -5, -2, -1, -8, 5, 2, 20, -3, -1, -4, 7, -3, 4, 11, 9, 4, -2, 2, -3, 6, 1, -1, -10, 0]
$$ [...]
8191a4
##END NTUPLES=NMR FID
##END=
