##TITLE=1H_LY-856.24
 CCl4, 8 sc, 
 24.7.2019
##JCAMPDX= 6.0         $$ Bruker NMR JCAMP-DX V2.0
##DATA TYPE= NMR FID
##DATA CLASS= NTUPLES
##ORIGIN= UXNMR, Bruker Analytische Messtechnik GmbH
##OWNER= root
$$ XWIN-NMR		Version 3.5
$$ Wed Jul 24 16:03:48 2019 Russian Standard Time (UT+4h)  she@DPX200
##.OBSERVE FREQUENCY= 200.13155
##.OBSERVE NUCLEUS= ^1H
##.DELAY= (6, 6)
##.ACQUISITION MODE= SIMULTANEOUS
##.ACQUISITION SCHEME= undefined
##.AVERAGES= 8
##.DIGITISER RES= 18
##SPECTROMETER/DATA SYSTEM= spect
##.PULSE SEQUENCE= zg30
##.SOLVENT NAME= CDCl3
##.SHIFT REFERENCE= (INTERNAL, CDCl3, 0, 15.7039)
##AUDIT TRAIL= $$ (NUMBER, WHEN, WHO, WHERE, WHAT)
$$ ##TITLE= Audit trail, XWIN-NMR		Version 3.5
$$ ##JCAMPDX= 5.01
$$ ##ORIGIN= Bruker BioSpin GmbH
$$ ##OWNER= she
$$ F:/spectra/data/she/nmr/H-F/1/audita.txt
$$ ##AUDIT TRAIL=  $$ (NUMBER, WHEN, WHO, WHERE, WHAT)
(   1,<2019-07-24 16:02:32.03 +0400>,<she>,<DPX200>,
      <created by zg, POWCHK disabled, PULCHK disabled
       configuration hash MD5:
       00 E9 B6 7A A2 85 ED C7 34 08 36 98 17 FE 4E 26
       data hash MD5: 16K
       64 74 F6 DB E2 75 E0 30 FC AB 0D 74 37 98 6D 01>)
$$ ##END=
$$ 
$$ hash MD5
$$ 5F 78 CD F0 0F 74 77 5F AE 9F 2B 8E 07 4F 26 19
##$RELAX= 
##$RELAX= 
##$RELAX= 
##$RELAX= 
##$RELAX= 
##$RELAX= 
$$ Bruker specific parameters
$$ --------------------------
##$DU= <F:/spectra>
##$EXPNO= 1
##$NAME= <H-F>
##$PROCNO= 1
##$TYPE= <nmr>
##$USER= <she>
##$AMP= (0..31)
100 100 100 100 100 100 100 100 100 100 100 100 100 100 100 100 100 100 
100 100 100 100 100 100 100 100 100 100 100 100 100 100 
##$AQSEQ= 0
##$AQ_mod= 1
##$AUNM= <au_zg>
##$AUTOPOS= <>
##$BF1= 200.13
##$BF2= 200.13
##$BF3= 200.13
##$BF4= 200.13
##$BF5= 200.13
##$BF6= 200.13
##$BF7= 200.13
##$BF8= 200.13
##$BYTORDA= 1
##$CFDGTYP= 0
##$CFRGTYP= 5
##$CHEMSTR= <none>
##$CNST= (0..31)
1 1 145 1 1 1 1 1 1 1 1 1 1 1 1 1 1 1 1 1 1 1 1 1 1 1 1 1 1 1 1 1 
##$CPDPRG= <>
##$CPDPRG1= <>
##$CPDPRG2= <>
##$CPDPRG3= <>
##$CPDPRG4= <mlev>
##$CPDPRG5= <mlev>
##$CPDPRG6= <mlev>
##$CPDPRG7= <mlev>
##$CPDPRG8= <mlev>
##$CPDPRGB= <>
##$CPDPRGT= <>
##$D= (0..31)
0 1.2 0 0 0 0 0 0 0 0 0 0.03 0 0 0 0 0 0 0 0 0 0 0 0 0 0 0 0 0 0 0 0 
##$DATE= 1563969751
##$DBL= (0..7)
120 120 120 120 120 120 120 120 
##$DBP= (0..7)
150 150 150 150 150 150 150 150 
##$DBP07= 0
##$DBPNAM0= <>
##$DBPNAM1= <>
##$DBPNAM2= <>
##$DBPNAM3= <>
##$DBPNAM4= <>
##$DBPNAM5= <>
##$DBPNAM6= <>
##$DBPNAM7= <>
##$DBPOAL= (0..7)
0.5 0.5 0.5 0.5 0.5 0.5 0.5 0.5 
##$DBPOFFS= (0..7)
0 0 0 0 0 0 0 0 
##$DE= 6
##$DECBNUC= <off>
##$DECIM= 24
##$DECNUC= <off>
##$DECSTAT= 4
##$DIGMOD= 1
##$DIGTYP= 9
##$DL= (0..7)
0 120 120 120 120 120 120 120 
##$DP= (0..7)
150 150 150 150 150 150 150 150 
##$DP07= 0
##$DPNAME0= <>
##$DPNAME1= <>
##$DPNAME2= <>
##$DPNAME3= <>
##$DPNAME4= <>
##$DPNAME5= <>
##$DPNAME6= <>
##$DPNAME7= <>
##$DPOAL= (0..7)
0.5 0.5 0.5 0.5 0.5 0.5 0.5 0.5 
##$DPOFFS= (0..7)
0 0 0 0 0 0 0 0 
##$DQDMODE= 0
##$DR= 18
##$DS= 0
##$DSLIST= <SSSSSSSSSSSSSSS>
##$DSPFIRM= 0
$$ [...]
##$SUBNAM2= <"">
##$SUBNAM3= <"">
##$SUBNAM4= <"">
##$SUBNAM5= <"">
##$SUBNAM6= <"">
##$SUBNAM7= <"">
##$SUBNAM8= <"">
##$SUBNAM9= <"">
##$SW= 24.9336996594482
##$SWIBOX= (0..15)
0 0 2 0 0 0 0 0 0 0 0 0 0 0 0 0 
##$SW_h= 4990.01996007984
##$TD= 16384
##$TD0= 1
##$TE= 0
##$TE2= 300
##$TE3= 300
##$TEG= 300
##$TL= (0..7)
0 120 120 120 120 120 120 120 
##$TP= (0..7)
150 150 150 150 150 150 150 150 
##$TP07= 0
##$TPNAME0= <>
##$TPNAME1= <>
##$TPNAME2= <>
##$TPNAME3= <>
##$TPNAME4= <>
##$TPNAME5= <>
##$TPNAME6= <>
##$TPNAME7= <>
##$TPOAL= (0..7)
0.5 0.5 0.5 0.5 0.5 0.5 0.5 0.5 
##$TPOFFS= (0..7)
0 0 0 0 0 0 0 0 
##$TUNHIN= 0
##$TUNHOUT= 0
##$TUNXOUT= 0
##$USERA1= <user>
##$USERA2= <user>
##$USERA3= <user>
##$USERA4= <user>
##$USERA5= <user>
##$V9= 5
##$VALIST= <valist>
##$VCLIST= <CCCCCCCCCCCCCCC>
##$VD= 0
##$VDLIST= <DDDDDDDDDDDDDDD>
##$VPLIST= <PPPPPPPPPPPPPPP>
##$VTLIST= <TTTTTTTTTTTTTTT>
##$WBST= 1024
##$WBSW= 4
##$XGAIN= (0..3)
0 0 0 0 
##$XL= 0
##$YL= 0
##$YMAX_a= 21961
##$YMIN_a= -29231
##$ZGOPTNS= <>
##$ZL1= 120
##$ZL2= 120
##$ZL3= 120
##$ZL4= 120
##$ABSF1= 10
##$ABSF2= 0
##$ABSG= 5
##$ABSL= 3
##$ALPHA= 0
##$AQORDER= 0
##$ASSFAC= 0
##$ASSFACI= 0
##$ASSFACX= 0
##$ASSWID= 0
##$AUNMP= <proc_1d>
##$AZFE= 0.1
##$AZFW= 0.1
##$BCFW= 1
##$BC_mod= 2
##$BYTORDP= 1
##$COROFFS= 0
##$CY= 11.3945322036743
##$DATMOD= 1
##$DC= 2
##$DFILT= <>
##$DTYPP= 0
##$F1P= 18.9103706918063
##$F2P= -1.10871071338519
##$FCOR= 0.5
##$FTSIZE= 0
##$FT_mod= 4
##$GAMMA= 1
##$GB= 0.15
##$INTBC= 1
##$INTSCL= 1
##$ISEN= 128
##$LB= 0.24
##$LEV0= 0
##$LPBIN= 0
##$MAXI= 10000
##$MC2= 0
##$MEAN= 0
##$ME_mod= 0
##$MI= 1.114404
##$NCOEF= 0
##$NC_proc= 0
##$NLEV= 6
##$NOISF1= 3.799351
##$NOISF2= 2.8
##$NSP= 1
##$NTH_PI= 0
##$NZP= 0
##$OFFSET= 15.70392
##$PC= 1
##$PHC0= -8940.094
##$PHC1= 14.80096
##$PH_mod= 1
##$PKNL= yes
##$PPARMOD= 0
##$PSCAL= 0
##$PSIGN= 0
##$REVERSE= no
##$SF= 200.130013532006
##$SI= 16384
##$SIGF1= 3
##$SIGF2= 2
##$SINO= 400
##$SIOLD= 16384
##$SREGLST= <1H.CDCl3>
##$SSB= 0
##$STSI= 0
##$STSR= 0
##$SW_p= 3612.71676300578
##$SYMM= 0
##$S_DEV= 0
##$TDeff= 0
##$TDoff= 0
##$TI= <>
##$TILT= no
##$TM1= 0
##$TM2= 0
##$TOPLEV= 0
##$USERP1= <user>
##$USERP2= <user>
##$USERP3= <user>
##$USERP4= <user>
##$USERP5= <user>
##$WDW= 1
##$XDIM= 8192
##$YMAX_p= 0
##$YMIN_p= 0
$$ End of Bruker specific parameters
$$ ---------------------------------
##NTUPLES= NMR FID
##VAR_NAME=  TIME,          FID/REAL,        FID/IMAG
##SYMBOL=    X,             R,               I
##VAR_TYPE=  INDEPENDENT,   DEPENDENT,       DEPENDENT
##VAR_FORM=  AFFN,          ASDF,            ASDF
##VAR_DIM=   8192,          8192,            8192
##UNITS=     SECONDS,       ARBITRARY UNITS, ARBITRARY UNITS
##FACTOR=    0.0002004,     1,               1
##FIRST=     0,             0,               0
##LAST=      1.6414764,     0,               0
##MIN=       0,             -29231,          0
##MAX=       1.6414764,     21961,           0
$$ Real data points
##PAGE= N=1
##DATA TABLE= (X++(R..R)), XYDATA
0 0 0 0 0 0 0 0 0 0 0 0 0 0 0 0 0 0 0 0 0 1 -8 8 -8 8 -8 8 -8 8 -15 16 -16 16 -18 24 -24 26 -32 32 -38 40 -46 49 -55
43 -55 62 -68 75 -84 95 -105 121 -137 158 -184 220 -267 335 -443 629 -1007 2060 -10153 -29231
62 -29231 18234 6325 -20734 17806 14586 -25023 -893 13847 -11623 1316 14294 -8798
74 -8798 -5854 6221 -3978 663 6394 -6121 -1404 5951 -3930 -708 5224 -5032 -3284 5885
88 5885 1109 -2334 71 -199 -590 -2188 1755 6370 -4631 -6343 8224 -226 -8554 9400 2848
103 2848 -14689 6061 11386 -11209 -285 8976 -11077 -2121 13267 -3817 -3653 5791 -8654
116 -8654 -3423 11242 -2221 -1251 7666 -11293 -7177 14800 -1630 -7310 12651 -3739 -15525
129 -15525 10877 6665 -11602 6320 7297 -12744 -660 9577 -4668 -2402 5590 -2172 -2647 2504
143 2504 -163 -1016 -372 378 2728 -1356 -2787 2739 -819 -2633 4718 171 -4564 3127 -301 -4248
159 -4248 5958 1467 -7072 3616 1847 -6959 6171 5401 -10487 864 7489 -7799 420 10269
173 10269 -6975 -5719 8072 -2716 -4377 8494 -354 -7209 3068 1037 -2880 3874 701 -3495
187 -3495 1516 -487 -1835 3267 -304 -2208 2983 -1105 -3326 3340 610 -2885 2610 608 -3017
202 -3017 1494 117 -2050 2788 801 -2488 1131 -941 -2094 3881 962 -3362 1668 -156 -3497
217 -3497 3123 2347 -2924 1234 127 -3987 2436 2972 -2644 1182 583 -4462 2221 3628 -3846 720
233 720 3249 -4661 -484 4984 -2747 -1789 4354 -2071 -3123 3942 260 -3198 1870 980 -1776 968
249 968 403 -1495 372 785 277 165 -1271 -317 1060 -578 463 1502 -1820 -1248 1429 -526 416
266 416 2372 -1964 -2390 1730 -29 -77 2824 -1504 -3179 2006 480 -1524 2958 588 -3881 505
282 505 1567 -1508 1750 1877 -3094 -1069 1813 -405 433 1301 -1510 -734 974 -522 308 1128 -1096
299 -1096 -447 867 -740 117 1337 -1090 -926 1382 152 -710 344 -380 -490 973 546 -506 -524
316 -524 -406 253 550 99 431 -227 -1536 -43 1267 166 399 161 -2016 -616 1917 383 -267 582
334 582 -1337 -1292 1487 686 -374 942 -689 -2011 831 1430 -229 446 -223 -1864 304 1707 -137
351 -137 -214 234 -997 -357 1011 307 -12 147 -771 -526 711 560 68 -213 -718 -111 790 257 -300 -189
371 -189 -261 62 484 96 -230 -196 -273 50 457 346 8 -688 -794 483 994 135 -240 -622 -933 496 1302
392 1302 -66 -414 -73 -934 -280 1372 539 -497 -160 -867 -744 1413 1256 -737 -702 -298 -456 766
410 766 1216 -385 -840 -101 -190 109 972 413 -784 -730 -1 412 636 369 -624 -995 172 957 221 -263
430 -263 -164 -518 -182 810 369 -416 -120 -333 -475 726 897 -433 -734 -302 -47 767 797 -527 -923 -195
450 -195 255 606 473 -313 -572 -356 -92 672 782 -264 -706 -491 -166 841 992 -501 -958 -129 130
469 130 450 738 -231 -772 -98 141 167 571 133 -604 -485 56 593 564 -222 -615 -264 126 603 416 -578
490 -578 -468 272 1 79 572 -304 -676 225 100 -43 687 -90 -1098 47 678 38 210 -97 -899 71
510 71 847 -20 -199 60 -421 -177 454 209 43 -66 -502 -149 449 337 163 -317 -725 205 723 -60 -75
531 -75 35 -564 31 679 -213 -148 480 -416 -441 661 127 -352 248 -223 -301 759 135 -766 57 231 -89
552 -89 513 57 -797 35 390 -201 251 331 -465 -247 93 -90 388 289 -551 -247 220 58 304 -52 -735
573 -735 108 677 -94 -48 72 -649 -157 667 146 66 183 -646 -530 423 491 410 14 -864 -288 593 24 82
595 82 419 -570 -299 775 -220 -569 640 -52 -626 726 476 -700 -156 -107 -386 822 823 -533 -567 -370
615 -370 -250 853 648 -499 -87 -94 -809 338 937 -342 -273 226 -526 -41 861 -229 -764 120 356 351
635 351 252 -561 -588 14 153 679 629 -621 -697 -54 -310 397 1329 -52 -1084 -262 19 164 744 126 -477
656 -477 -70 -81 84 346 -407 -185 698 -233 -342 911 -377 -1363 681 840 -445 622 263 -1752 -309
675 -309 1432 125 -146 427 -695 -739 438 321 208 258 -472 -317 169 -103 309 343 -820 -203 968
694 968 -41 -500 125 -373 -245 785 317 -273 -135 -527 -195 530 143 350 381 -1137 -633 1140 122
713 122 -454 801 -271 -1082 817 568 -944 230 625 -563 -66 433 -169 -93 -153 -153 611 100 -473 296
733 296 -351 -786 1130 689 -1261 98 712 -1036 -6 1201 -511 -509 657 -396 -459 728 136 -377
751 -377 -25 -197 245 430 -539 -74 490 -499 -51 729 -513 -369 727 -298 -461 685 46 -374 194
770 194 -286 40 664 -500 -273 771 -528 -367 1116 -515 -885 1359 7 -1427 958 696 -1276
787 -1276 306 818 -923 30 796 -571 -281 481 -71 -31 -80 -255 476 -14 -672 499 282 -769 444
806 444 399 -988 294 853 -810 -185 710 -474 -136 499 -453 59 524 -632 -47 636 -530 44 671
825 671 -882 -175 1190 -536 -636 907 -266 -591 810 -44 -532 583 -153 -546 570 39 -186 549
843 549 -579 -555 1052 -123 -765 919 -23 -1033 812 280 -1118 646 722 -1026 106 674 -658
860 -658 -66 398 -383 254 415 -551 -112 62 -339 587 366 -740 196 261 -849 241 742 -447 137
879 137 347 -913 19 793 -485 31 647 -619 -53 620 -840 -131 1144 -414 -422 836 -545 -707
897 -707 900 -60 -508 943 21 -1001 218 191 -234 613 108 -552 241 -69 -454 428 122 -242 517
916 517 -154 -740 438 157 -566 476 349 -508 253 -9 -849 327 661 -313 178 139 -726 33 338 -403
936 -403 374 652 -558 -291 154 -423 220 673 -269 -69 313 -530 -266 387 -25 329 502 -618 -418 341
956 341 -239 70 739 -210 -309 336 -504 -424 833 238 -387 282 -161 -538 371 192 -338 350 286 -420 -83
977 -83 41 -183 244 209 -209 65 72 -246 -36 -6 7 324 1 -331 99 23 -237 203 68 -225 354 140 -599
1000 -599 18 308 -240 187 409 -374 -152 265 -382 -111 708 133 -342 -27 -217 -164 428 233 -154 46
1020 46 -37 -238 -2 135 187 178 -152 -222 54 39 63 140 -135 -64 227 -131 -260 215 137 -126 118 -63 -261 183
1044 183 155 -251 55 232 -191 -123 120 -52 66 173 -201 -202 157 163 -7 -78 -112 6 48 5 120 74 -110 -39
1068 -39 -49 -119 286 304 -296 -220 185 -36 25 302 -139 -265 232 36 -263 220 265 -233 -113 103 -65 77
1090 77 204 -117 -202 121 133 -143 -99 154 46 -124 -9 -1 -140 134 231 -216 -127 268 -109 -254 244 128 -187
1113 -187 131 -40 -376 209 396 -233 -161 186 -146 -112 255 7 -115 150 -49 -260 119 297 -2 -150 -70
1134 -70 10 31 108 88 -120 -54 175 -50 -188 205 166 -217 -55 101 -103 104 181 -244 -114 231 -42 -163 92
1157 92 32 -15 55 -120 -102 93 37 -8 -22 -128 68 102 -213 -5 293 -107 -164 136 -153 -54 404 -78 -371 246
1181 246 119 -270 176 186 -227 59 130 -263 47 351 -40 -192 12 48 47 42 24 -18 -61 67 58 -175 78 330
1205 330 -202 -228 300 -44 -189 356 -78 -423 393 172 -553 195 376 -434 27 304 -459 21 514 -361
1225 -361 -258 437 -146 -273 296 -69 -170 277 -107 -295 216 98 -63 80 -148 -82 206 -91 -82 227 -52
1246 -52 -83 125 -196 -16 396 -116 -247 189 -61 -68 288 -147 -158 328 -138 -241 307 -55 -121 331 -253 -302
1268 -302 516 -61 -384 414 -39 -418 485 -12 -599 548 247 -749 266 385 -592 252 433 -702 59
1287 59 597 -539 -163 610 -296 -210 422 -307 -229 500 -65 -328 205 -6 -126 152 -97 -19 162 -163 -20
1308 -20 97 -152 242 192 -474 82 417 -404 48 481 -491 -39 630 -522 -232 825 -301 -498 648
1327 648 -208 -445 773 -114 -709 631 92 -721 498 215 -637 457 185 -791 367 475 -648 159
1345 159 415 -595 125 462 -572 22 557 -419 -182 368 -249 -25 360 -302 -124 317 -186 -76 210
1364 210 -152 73 142 -345 64 290 -226 107 154 -439 218 383 -533 109 520 -560 -27 596 -584 -53
1384 -53 866 -631 -478 944 -304 -607 850 -180 -748 836 70 -915 607 357 -826 327 414 -681
1402 -681 246 424 -701 60 554 -413 -60 346 -342 -33 318 -283 -41 340 -137 -91 39 -199 158 155 -216
1423 -216 170 79 -342 169 93 -370 460 330 -663 51 342 -520 215 599 -550 -41 557 -642 -236 793
1443 793 -247 -209 608 -457 -459 718 -191 -466 765 -4 -633 449 -84 -655 626 357 -667 259 314
1462 314 -689 32 399 -307 175 405 -452 -277 218 -95 16 234 -27 4 -50 -298 -19 108 82 324 -43
1483 -43 -367 124 -54 -350 404 336 -267 195 -49 -732 251 592 -336 169 464 -688 -263 511 -366 -2
1503 -2 898 -291 -634 395 -160 -402 655 212 -432 324 -1 -699 139 400 -110 217 138 -462 -127 106
1523 106 -178 186 354 -59 -122 -181 -309 90 261 43 104 8 -234 -73 -109 -122 359 258 -164 -24 -124 -343
1545 -343 187 255 -101 288 192 -516 -183 188 -120 305 448 -363 -225 214 -331 -111 565 35 -119 234 -347
1566 -347 -416 440 150 -189 357 62 -445 43 26 -249 334 365 -301 -142 30 -236 38 255 -5 24 62 -231
1588 -231 -189 59 129 162 22 -135 -17 -79 -134 95 66 -12 227 -44 -362 72 141 -184 175 227 -224 18 127
1611 127 -354 15 466 -71 -138 170 -186 -158 292 -17 -125 297 -9 -305 68 51 -75 196 34 -207 87
1632 87 21 -190 56 101 -38 116 -55 -251 85 130 -95 64 38 -142 34 13 -163 83 152 -152 -62 26 -75
1655 -75 102 79 -175 -11 118 -92 -21 68 -84 54 82 -179 0 183 -77 -19 81 -117 46 178 -170 -60
1677 -60 245 -65 -111 143 -68 -71 246 -41 -193 203 65 -204 86 50 -123 113 44 -208 61 125 -113 -41 48
1700 48 -30 82 11 -148 1 53 -46 40 -6 -81 72 -29 -178 82 146 -82 11 -10 -190 77 156 -146 17 163
1724 163 -128 -89 74 -73 68 187 -138 -126 126 -31 -43 136 -49 -30 117 -125 -118 158 55 -22 74 -103 -79
1747 -79 176 -32 -124 148 26 -140 65 -12 -101 164 27 -230 46 116 -82 11 14 -130 37 71 -122 9 99
1770 99 -51 -42 -39 -62 103 69 -106 -14 2 -32 73 17 -78 108 42 -194 33 142 -63 82 77 -217 31 214 -126
1795 -126 -41 189 -97 -83 137 -79 -32 240 -48 -198 82 48 -28 113 -23 -95 80 -26 -89 98 50 -17 26
1818 26 -130 -100 158 36 -91 52 -45 -96 72 -29 -77 178 23 -196 12 25 -29 132 0 -185 61 50 -145
1841 -145 65 102 -77 49 -3 -174 123 195 -114 -16 44 -107 84 117 -127 40 127 -146 -45 126 -41 66
1863 66 112 -208 -43 206 -41 -46 134 -87 -76 96 -90 -42 203 -33 -145 12 -55 17 166 -100 -95 107 -99
1886 -99 -96 147 -46 -32 173 -171 -206 216 43 -151 143 -44 -215 170 60 -187 174 111 -228 15 75 -93
1908 -93 168 104 -232 15 129 -105 63 119 -88 49 33 -181 89 167 -65 17 1 -166 110 135 -163 90 118
1931 118 -221 28 116 -198 125 229 -324 -118 261 -154 -39 252 -197 -153 250 -161 -157 306 -35 -206 122
1952 122 -112 -143 298 -27 -236 152 -34 -188 185 16 -129 209 -43 -273 166 121 -118 162 -27 -218 161
1973 161 78 -176 168 87 -184 76 6 -165 250 124 -270 75 59 -201 190 110 -251 147 104 -353 97 251
1995 251 -212 88 128 -386 63 329 -279 0 280 -313 -100 311 -235 -46 389 -246 -278 309 -77 -141 303
2016 303 -127 -251 262 -35 -226 242 27 -189 126 -73 -134 260 14 -184 117 -53 -106 242 -29 -154 252
2037 252 -68 -270 216 42 -118 293 -84 -344 271 85 -256 300 105 -378 161 57 -361 324 306 -410
2057 -410 15 149 -377 161 359 -348 7 265 -403 -73 374 -184 -23 257 -350 -150 369 -159 -136 273
2077 273 -166 -137 269 -149 -144 282 -84 -157 197 -58 -74 198 -155 -135 263 -44 -111 209 -152 -108 269 -157 -139
2100 -139 387 -73 -233 257 -157 -221 428 -6 -301 347 -33 -455 299 153 -269 364 87 -595 120 288
2120 288 -308 219 297 -446 -29 209 -359 87 420 -254 -142 160 -260 7 324 -168 -90 200 -180 -90 173
2141 173 -130 30 202 -192 -35 208 -157 -22 180 -187 50 298 -251 -93 285 -197 -56 326 -197 -87
2161 -87 381 -231 -248 384 -85 -206 380 -109 -325 346 -63 -366 391 154 -355 190 9 -410 290 265 -344
2182 -344 121 160 -402 30 247 -197 130 205 -363 -85 220 -123 65 152 -227 -10 144 -192 38 201 -138
2203 -138 0 106 -218 93 228 -218 1 193 -187 40 226 -241 22 292 -254 -99 309 -169 -69 303
2223 303 -221 -163 372 -130 -229 320 -65 -246 254 -50 -248 317 32 -330 166 75 -246 208 81 -289 142
2244 142 107 -303 91 179 -182 45 50 -228 74 171 -158 -12 72 -163 33 96 -132 100 122 -211 2 112 -105
2267 -105 125 132 -244 23 196 -168 24 228 -169 -20 176 -204 -5 320 -142 -142 189 -117 -82 285 -85 -166
2289 -166 245 -72 -201 208 28 -160 151 -56 -230 182 80 -189 80 25 -154 108 30 -183 113 88 -189
2310 -189 19 46 -136 93 80 -146 58 81 -171 3 102 -37 89 42 -205 -3 127 -75 55 92 -142 -2
2332 -2 87 -131 53 201 -130 -71 117 -84 21 184 -140 -103 201 -14 -83 132 -96 -129 155 6 -89 160 -40
2355 -40 -224 52 44 -16 158 -17 -224 23 54 -72 74 49 -92 14 -22 -131 61 66 -60 42 20 -96 23
2378 23 -17 -116 100 162 -53 -38 -59 -172 80 173 -34 16 37 -172 -61 116 11 90 89 -166 -92 129 -1 1 85
2403 85 -62 -23 131 -77 -102 99 -24 -42 125 -2 -100 8 -98 -105 154 109 -63 -56 -108 -106 102 88 -53 10 -33
2428 -33 -130 -15 22 -6 87 -8 -108 4 12 -60 8 16 -15 107 41 -141 -47 37 -5 108 94 -100 -45 11 -93 56 178
2455 178 -1 -67 -25 -92 28 159 -19 -44 37 -17 -26 32 -25 -13 68 -26 -35 37 -13 -51 -3 -26 45 114 -41 -125 -14 0
2483 0 30 82 -42 -82 16 -17 -63 54 33 -31 -20 -45 -61 55 24 -68 12 13 -28 23 -17 -69 55 78 -34 0 28 -51 24
2512 24 43 -37 47 68 -76 -50 56 17 31 25 -46 -9 65 9 -37 19 13 4 -4 -18 14 20 -2 -15 -21 -5 46 -13 -83 28 55 -61
2544 -61 -13 16 -36 26 47 -97 -46 90 -22 -54 34 -18 -57 58 -14 -61 44 32 -84 -7 45 1 25 -14 -57 22 73
2571 73 14 -22 -16 -9 23 18 25 29 -6 -22 -4 2 43 64 -41 -78 20 28 13 8 -38 -54 41 18 -47 -1 -16 -48 9 13 -21 35 -37 -117
2605 -117 12 80 -13 4 -38 -111 28 102 -37 -47 29 -63 -35 89 13 -28 20 -49 -85 86 104 -50 -70 -24 -3 60 66
2632 66 -35 -61 -12 29 27 15 34 -24 -82 4 74 34 23 -2 -109 -13 144 14 -62 10 -48 -31 95 9 -90 18 -24 -101
2660 -101 79 100 -82 -54 -13 -65 66 120 -94 -119 17 -2 29 67 -54 -81 6 -7 23 64 -8 -65 -39 -24 66 105 -32
2687 -32 -105 -28 10 59 74 -38 -66 8 13 27 56 -10 -37 -26 -32 55 113 -28 -67 -6 8 52 82 -56 -104 39 3 -38 56
2716 56 2 -112 13 19 -63 67 46 -163 -52 67 -7 19 25 -142 -71 86 1 -32 34 -71 -79 46 9 -1 49 -42 -98
2743 -98 27 82 41 14 -58 -36 50 40 18 15 -39 -12 35 -15 20 85 -47 -64 44 1 7 83 -54 -94 79 52 -56 35
2771 35 -7 -70 60 35 -81 24 49 -83 5 63 -47 1 2 -110 12 109 -51 -56 28 -85 -28 99 -46 -69 55
2796 55 -41 -74 57 28 -47 0 -49 -54 70 43 -25 -2 -20 -5 60 -6 -19 45 -10 -45 33 3 5 60 -36 -61 56 28 -33 54
2826 54 -30 -47 79 -27 -106 87 52 -114 28 24 -106 47 80 -115 -1 103 -89 -48 60 -34 -18 62 -82 -61
2850 -61 66 -23 -48 38 -54 -32 43 -53 -42 88 -4 -67 24 -9 -36 69 1 -43 29 2 -27 22 5 27 76 -51 -47 69
2878 69 12 -3 83 -25 -80 86 2 -73 98 29 -91 38 17 -47 84 7 -144 39 71 -66 47 38 -140 8 92
2903 92 -87 14 113 -113 -103 65 -22 10 98 -67 -107 32 0 -2 31 -46 -4 33 -65 -28 58 -32 -9 53 -47 -20 59
2930 59 -65 -55 118 42 -15 15 -101 -54 130 44 -7 83 -62 -96 78 28 -7 154 -8 -170 41 64 -52 53
2954 53 1 -112 49 59 -104 -29 7 -76 53 88 -61 -14 -16 -157 1 149 3 -13 -26 -159 -46 127 30 -13 25
2979 25 -67 -57 33 -10 44 76 -63 -19 40 -35 -13 38 -61 18 149 -47 -114 5 -32 18 174 20 -87 6 -71 -53 159
3006 159 81 -26 19 -97 -100 140 86 -72 49 -14 -103 54 47 -95 10 56 -59 33 45 -90 -49 -15 -25 85 73
3031 73 -105 -73 -43 -49 96 100 -84 -42 -2 -86 14 105 -9 -5 8 -83 7 78 -38 -5 58 -16 24 50 -106 -63 106 8
3059 8 7 101 -80 -95 74 -9 2 124 -8 -131 -7 10 -1 96 -14 -96 17 6 -33 44 -9 -76 35 -2 -76 43
3085 43 20 -96 -4 33 -32 19 -12 -106 -6 54 -12 16 -14 -72 16 24 -53 42 42 -74 4 42 -45 32 57 -76 -8 77 -33
3114 -33 -19 38 -57 11 86 -56 -37 65 -26 -22 76 -30 -39 67 -36 -59 91 26 -57 17 -2 -50 48 12 -60 14 14 -26 8
3143 8 -17 -20 31 -26 -58 20 -7 -37 29 -14 -53 37 -5 -86 24 46 -41 26 -2 -84 41 51 -55 30 45 -58 10 33 -55
3172 -55 31 65 -65 -11 76 -12 -3 39 -31 14 76 -23 -37 44 -15 6 71 -21 -30 37 -56 -46 75 18 -30 14 -52 -35 62 14
3202 14 -70 8 12 -27 13 -9 -40 9 -4 -29 27 -6 -50 8 -41 -26 87 15 -72 8 -6 -21 81 13 -87 14 29 -58 46
3231 46 53 -50 12 31 -49 38 73 -56 -22 62 -3 25 46 -54 -38 53 20 -9 24 -24 -19 6 -25 20 33 -63 -34 10 -9 21
3261 21 49 -74 -53 62 -10 -37 46 -43 -65 35 -32 -52 55 -9 -78 11 12 -3 40 -24 -67 39 28 -31 22 -14 -43 42
3289 42 24 -38 27 17 -62 12 25 -5 44 15 -75 19 64 -13 20 16 -54 21 46 -31 9 40 -37 -27 25 -8 8 17 -48 -24 39
3320 39 -15 -13 6 -53 13 35 -62 -26 23 -40 -33 30 -32 -29 47 -45 -55 52 10 -42 16 -10 -23 48 13 -38 16 20 -13 23 25 -15
3352 -15 27 6 -37 35 42 -5 21 7 -21 35 13 -25 32 32 -36 27 17 -30 35 26 -67 3 41 -31 4 12 -43 -2 45 -36 -25 33
3384 33 -19 -29 4 -34 -10 32 -42 -41 12 -2 -17 21 -43 -16 51 -23 -23 29 -5 -14 41 -10 -21 42 -5 -41 31 24 -8 9 -7 -2 25
3417 25 17 -16 2 7 -2 38 -8 -7 25 -7 -36 23 16 -8 27 -11 -56 31 28 -34 0 5 -31 9 14 -29 17 17 -53 -14 21 -17 -5 5 -44
3452 -44 -28 33 -18 -25 -1 -16 -14 10 -28 -13 24 -9 -11 26 -13 3 26 -40 -6 48 -7 -32 15 -11 5 38 8 -12 16 3 0 19
3484 19 10 -2 11 -27 -16 57 14 -23 8 -7 -17 52 6 -47 9 2 -44 19 19 -30 -3 -6 -56 5 49 -30 -13 -2 -17 9 16 -43 -28
3517 -28 18 -15 -17 1 -11 0 8 -21 -4 12 -20 1 12 -1 20 19 -37 -12 52 14 11 38 -14 -4 46 -1 -5 57 -6 -27 13 -12 1
3550 1 51 -6 -41 19 14 -14 12 -10 -19 29 7 -43 -5 15 -25 -11 0 -12 3 -21 -53 6 20 -6 -4 0 -43 5 27 -27 -4 25 -11
3583 -11 -12 2 -3 10 9 -21 -3 23 -5 8 -9 -28 38 59 -22 -7 29 -27 8 64 2 -12 38 -19 -41 38 26 -28 19 2 -19 35
3615 35 10 -39 12 3 -18 3 5 -33 13 17 -37 3 21 -30 -15 -2 -28 -2 3 -29 -17 -8 -2 20 6 -21 22 19 -31 13 25 -19 4 24
3649 24 -37 10 47 -11 -31 23 13 9 6 -13 -1 30 -4 -8 44 -22 1 25 -20 -12 58 -12 -53 22 7 -20 18 9 -43 8 10 -34 -17
3682 -17 19 -27 -8 -13 -33 0 -4 -42 -4 18 -19 -7 -15 -31 -9 22 -12 -19 -3 -5 14 -5 -24 14 15 -30 10 21 -15 27 14 -41 5
3715 5 52 -14 -8 44 -6 -13 31 -5 -7 48 10 -22 21 4 2 20 3 -12 19 -2 -40 15 20 -10 16 0 -34 9 24 -33 -23 10 -8
3748 -8 -14 -14 -22 5 -6 -26 -8 4 6 30 1 -34 7 25 -19 2 16 -10 16 17 -23 8 29 -2 -1 18 0 19 27 -20 5 45 -13 -11 23
3783 23 -2 7 33 -15 -31 31 29 -19 12 4 -25 -9 -7 -12 14 11 -31 -16 -13 -1 33 -7 -43 -6 -6 -12 0 15 -8 3 -17 -36 4 17 -2
3818 -2 3 -4 -13 6 2 -27 20 22 -13 5 -1 -22 14 26 -21 14 31 -5 -7 37 -2 20 49 -12 -15 22 14 -8 25 8 -1 26 -2 -24 23 12
3854 12 -6 6 5 -17 -1 -14 -26 12 18 1 1 -18 -21 3 -7 -1 13 -1 -31 -20 -7 2 35 24 -27 8 1 -19 16 21 1 23 3 -22
3888 -22 -3 16 11 17 14 -13 18 36 -12 9 32 7 12 14 -6 -3 28 9 11 40 2 -1 6 8 12 37 2 -24 2 1 -6 19 -3 -13 2 -5 -28
3925 -28 -26 -2 -7 -12 -7 -3 0 -19 -31 -1 8 2 19 -17 -34 7 5 4 29 6 -13 -17 4 -6 33 17 -18 -8 4 11 24 4 -18 8 35 12
3961 12 8 19 5 1 31 18 6 19 -23 -14 20 28 7 -6 -16 -11 23 6 -11 1 -18 -8 11 2 -1 7 -26 -26 -4 -7 2 -21 -37 -21 16 5
3997 5 -11 8 -16 -14 33 7 -12 15 -15 -32 13 21 0 -3 8 -30 21 32 2 2 -1 -15 14 26 -3 -5 6 -3 4 7 4 -9 -5 -6 15 17 -10
4034 -10 -27 1 -11 14 14 -33 -22 16 3 -3 19 -27 -12 -6 -28 -20 10 -5 -19 -2 -16 3 12 -15 -25 2 -9 -18 11 -11 -12 17 -1 -29
4068 -29 31 11 -23 9 16 -16 28 18 -28 14 30 4 5 8 6 13 24 4 -9 19 -4 -2 4 -7 11 0 -10 4 13 11 6 -18 -23 18 2 -30
4104 -30 -7 -1 -33 -8 12 -21 -15 22 -30 -34 25 1 -22 14 -7 -35 33 7 -28 4 16 -5 2 -1 -14 11 1 -3 20 0 -7 2 3 7 26
4139 26 11 -14 14 11 2 19 11 -23 19 30 -20 15 16 -24 -4 13 -16 -6 15 -9 -22 -3 -18 -1 -6 -10 -18 10 -8 -5 3 -31 3 11 -27
4174 -27 -11 18 -32 -26 22 -1 -20 23 -14 -23 38 12 -42 1 2 -18 14 18 -30 -5 9 -9 13 14 1 -2 -1 1 27 21 2 7 -4 7 35
4209 35 -3 -22 11 -5 -28 13 12 -23 5 2 -38 -2 20 -26 -26 12 -26 -11 10 -28 -16 4 -11 -29 -5 -9 -9 6 -19 0 23 -16 -14
4242 -14 1 -14 4 17 -17 -19 22 2 -19 13 -4 -17 17 -4 -19 23 18 -11 0 31 -9 14 11 -10 7 13 4 3 8 -1 4 -18 -4 19 -11
4277 -11 -8 7 -17 -33 6 6 -31 5 3 -37 -15 7 -20 -7 7 -33 -29 16 -3 -18 9 -20 -13 13 -1 -18 -4 4 -11 7 17 11 0 3
4311 3 0 18 1 7 15 -4 11 25 -10 -15 13 -12 -6 22 6 -10 18 1 -7 29 14 -15 -7 -3 -8 16 13 -17 -8 -7 -5 3 -1 -26 -9 -3 -31 6 -1
4350 -1 -28 -29 -11 -32 8 12 -33 -18 2 -10 -3 0 -19 -10 17 -4 -1 10 -1 -16 -3 13 18 21 -19 3 3 15 30 21 -17 3 20 8 12 24
4386 24 -23 -20 10 3 4 23 -12 -30 -1 12 1 10 -17 -18 9 9 -7 -16 -13 -13 -14 9 -4 -12 -8 -23 -1 3 3 1 -17 -32 6 2 -8 -6 -6 -12 7 11
4426 11 -10 -9 6 1 15 15 -9 1 -6 -6 17 41 8 -3 -6 -2 24 34 3 -6 -2 -4 2 15 -6 -7 8 -25 -5 23 10 -17 4 2 -19 -7 -6
4463 -6 -34 -5 5 -4 -6 -14 -30 -25 -7 4 9 2 -16 -22 -12 -5 11 -1 -32 -4 -9 -3 3 -15 -19 -3 21 -9 2 14 -7 3 21 14 7 5 -14 -2
4501 -2 29 19 12 -1 -20 -7 23 12 14 15 -11 -22 10 -8 -2 -5 -15 -1 9 -6 -27 -10 -17 -16 12 -2 -28 -16 -12 -7 12 -4 -18 -16 -6 1
4537 1 9 8 -1 -9 -5 5 12 -5 -13 2 0 10 9 -12 -12 6 -1 -12 16 21 -17 -7 8 4 23 29 -8 -16 9 8 -1 16 -10 -14 21 8 -1 16 3 -8
4577 -8 -3 -4 -5 0 -8 -13 -7 -3 -14 -5 -12 -18 10 -3 -19 -9 -11 -27 -4 -15 -7 3 -11 -18 5 19 1 -1 -7 -10 5 16 0 -3 8 -15 7 11 2 15 19
4618 19 -13 8 26 0 4 -7 -4 10 25 3 -4 2 -7 3 21 0 1 13 -6 -14 8 11 -16 -8 -10 -9 7 -3 -11 -24 -6 4 -7 -9 -11 -3 -6 6
4656 6 9 -4 -8 -6 -14 -9 22 8 -6 -6 -6 3 14 5 -7 5 7 -10 9 14 0 12 11 -9 -2 23 -7 5 14 5 -7 8 -10 11 11 2 7 3 -3 2 6 -5
4698 -5 -4 3 -5 -25 -3 -3 -7 9 -26 -8 -4 -3 -25 -12 -14 -22 0 -27 -9 -3 -5 -13 -11 -5 1 -6 -5 -18 -4 3 -3 15 -1 -1 7 19 3 3 35 16 13 14 7
4741 7 10 17 9 -8 24 18 0 15 1 12 3 2 4 12 11 -2 -4 -11 1 5 -15 -3 7 3 -22 -7 -21 -9 0 -10 -1 -6 -1 -8 2 -4 -10 7 -2 -14 3
4782 3 1 3 -9 -12 -11 6 15 -4 9 9 -3 12 11 10 15 15 3 -3 14 22 9 -3 -4 13 11 6 25 4 10 2 -9 -12 10 -1 -1 2 4 2 -7 -17 -16 -5 -6
4825 -6 -22 -25 0 -17 -8 -13 -10 -15 -20 -9 -8 3 15 -16 -18 -12 -1 10 -1 -20 -10 -4 0 14 8 3 -3 -3 -2 3 9 0 6 0 8 26 13 -1 20 17 4 0 10
4868 10 3 1 9 13 7 2 -2 -1 4 0 5 1 -7 -5 -9 2 -1 -17 -19 -17 -1 -22 -10 -11 -23 -15 -9 -22 -8 7 -16 -19 10 -2 -4 8 -10 -5 21 14 1 5 -6
4911 -6 -1 -3 7 4 13 18 8 6 9 22 1 3 15 6 10 12 4 4 -11 11 0 -15 -3 11 9 8 10 -4 -2 -2 -16 5 3 -13 -16 1 -9 -22 -5 -26 -30
4952 -30 -8 -14 -7 -12 -8 -7 -6 -7 5 17 6 7 8 -11 10 12 -7 -2 10 1 1 14 7 -4 14 9 6 17 16 7 9 2 7 4 1 -1 -1 29 7 -1 -2 -12 3 -5
4996 -5 -2 6 -10 -6 4 -4 -1 3 -16 -11 4 6 -8 -1 -1 -27 -20 3 -3 -16 4 -20 -14 0 1 -10 -6 -8 -4 -2 5 -4 9 -7 14 16 16 3 10 20 17 15 7 12
5040 12 21 3 -5 14 22 0 5 9 -1 20 -2 -11 -10 7 2 15 4 -16 -6 11 -9 -4 6 -8 -5 -20 -10 -6 -6 -28 -16 -8 -4 -3 -15 -14 -1 4 -17
5079 -17 -6 -4 -13 -7 1 -6 2 -5 -16 -14 0 6 -3 15 -3 4 12 10 5 7 21 10 4 0 8 3 4 6 17 8 11 11 9 -5 9 20 -7 5 -1 -7 4 -14 -13 -1
5123 -1 5 -13 -7 -7 -9 -12 -8 -12 -14 -8 -6 -5 -7 6 -8 1 -10 -6 6 -1 9 4 8 -1 1 3 -2 3 0 3 7 7 10 12 10 9 21 10 14 18 3 3 12 6 4 5 8 5 -2 15 8
5174 8 6 17 -5 -12 17 -1 -5 -9 -13 -7 -8 -19 -6 -22 -16 -8 -10 -12 -3 -11 -18 -4 5 -8 -16 -2 -7 -2 17 -6 -5 18 11 -8 10 15 12 12 -2 -1 5 17 3
5217 3 7 9 8 11 5 2 11 6 4 0 8 9 19 4 -1 -3 4 -7 3 10 0 2 1 -2 0 -2 7 -18 10 -4 -5 -6 -20 -12 5 2 -19 -17 -8 5 -17 -7 -8 -2 -5 4 -2
5264 -2 -4 -9 -3 6 3 15 7 -5 6 13 4 6 24 -2 17 8 -8 10 1 4 21 16 6 14 16 17 -4 8 -2 10 4 3 11 13 -7 15 2 -2 0 7 -23 -2
5306 -2 15 -8 -2 -12 -14 -10 -3 -5 -18 -6 -9 -24 -8 -14 -10 -12 1 -10 -10 1 4 -8 3 3 -1 3 6 15 3 19 25 14 15 9 5 3 23 13 9 13 -1 -2 20
5349 20 5 0 6 12 -3 6 11 -6 6 -4 -9 14 -10 -4 -4 -7 4 -14 -9 2 -8 -6 -1 -17 -4 -9 -4 -8 -4 -12 0 -4 -6 -3 -4 1 3 -3 -6 12 12 2 12
5392 12 11 10 10 15 11 16 20 20 18 12 15 3 14 7 15 3 4 21 -14 -5 4 4 7 9 1 5 13 5 0 0 1 -13 -2 -2 -13 -3 -8 -11 -5 -9 -10 -1 -11 -10 -5 -10 -14 3 -12
5441 -12 -11 -5 -5 9 6 0 -9 -4 8 -15 2 9 -2 2 14 4 7 11 2 8 20 14 12 13 0 2 20 8 5 10 23 0 3 2 4 7 -1 1 1 3 -10 -11 -1 -17
5485 -17 -8 -18 -10 -13 -10 -3 -8 -13 -11 -1 -8 -7 3 -3 2 -5 -10 -3 -8 3 -19 0 6 -15 11 -13 -8 2 3 -6 7 0 10 15 9 -1 0 12 -1 6 15 1 -7 17
5529 17 1 -8 12 13 0 4 7 4 -4 -4 -12 -2 -1 3 -5 -10 -6 -2 -20 1 -16 -15 -5 -5 -18 4 0 -9 -6 6 -3 -17 -3 -12 -8 7 6 -9 11 12 -2 -1 -1
5572 -1 -3 17 14 1 4 14 11 6 22 2 7 2 8 3 10 0 -1 10 5 16 12 10 -1 9 -1 1 -7 -13 -7 6 -11 -2 -7 -8 -2 -12 -11 -15 -16 -21 -13 -6 -14 -14 3 -14
5618 -14 -3 -8 -10 -13 -6 -9 -10 1 1 -1 4 19 -9 6 16 3 2 14 4 11 20 23 1 17 20 18 6 1 10 9 6 -2 19 -1 3 5 0 -3 9 8 5 1 -1 6 -1
5663 -1 -8 2 7 -9 -3 5 -13 -7 1 -17 0 10 -14 -11 -5 3 -13 -5 -12 2 -2 -4 -3 -3 8 -5 1 8 2 9 5 6 -1 3 14 13 24 12 21 22 16 16 6 8 13 4
5709 4 9 4 1 3 6 8 -1 4 6 -8 -9 3 -3 -18 0 -25 1 3 -17 -10 -11 0 -16 -3 -22 -5 14 -7 -6 -1 16 -1 -1 -3 -9 -3 -5 5 -5 19 -7
5750 -7 1 -2 0 6 0 0 11 6 7 6 8 8 7 -2 11 17 -1 4 8 6 7 9 -1 3 7 0 1 -2 6 2 0 -5 -12 -8 -2 -16 -10 -16 -4 -11 3 -9 -14 4 -11 -11 -9 0 -4 -2 1
5801 1 -1 5 7 -1 10 11 1 5 9 -11 -4 16 6 11 1 5 10 0 1 16 11 6 16 2 4 17 10 -1 1 -3 13 7 -1 9 6 13 -7 -3 8 -12 2 2 3
5844 3 -8 -7 -14 -15 0 -9 -8 -8 -5 -4 -6 -14 -18 -11 -20 7 -1 -1 -8 5 -5 -5 -3 6 3 10 4 -4 18 1 11 10 9 4 19 15 8 19 10 1 4 2 3 5 9 3 4 12 -3 5
5894 5 5 13 8 17 7 4 -7 -5 6 -12 -5 8 -12 -8 -8 -21 -21 -16 -5 -9 -4 -3 -5 -7 1 -4 -12 -2 -7 6 -8 1 7 0 6 1 19 -6 17 16 1 5 14 15 16 5
5940 5 5 14 9 5 1 14 0 6 10 20 9 14 -4 0 -10 0 6 1 11 -2 1 -5 4 -4 5 -5 -7 -12 -10 -9 -10 -13 2 -6 -10 -3 -16 0 5 1 -16 -18 7 1 -3 5
5986 5 -2 1 10 9 -8 3 13 8 10 5 8 7 5 2 17 22 16 5 11 10 12 6 7 -2 1 4 9 14 17 2 5 -3 0 -1 -4 8 3 -17 -9 1 -13 -9 -14 4 -5 -5 -3 -12 3
6035 3 -3 -9 0 7 0 -13 -11 1 2 -12 2 -3 0 -2 -6 -12 -3 4 -9 -7 18 5 1 3 18 -7 10 -1 8 5 19 10 8 6 4 17 18 7 1 11 -9 17 -4
6078 -4 -2 -3 7 -5 -10 -14 -14 -18 -12 -18 -14 -15 -17 -9 -10 -12 1 1 -8 -7 2 -3 -10 4 4 -2 -3 -7 -6 6 -2 -7 3 3 5 -2 3 14 9 17 1 9 3 11 20 12 1 13 8 8 7
6129 7 7 9 10 14 4 10 12 3 4 8 -3 -3 -3 -9 -5 0 -4 -9 -10 -9 -6 -6 -11 -4 -5 -9 -24 -13 -7 -6 -8 1 0 -4 5 -1 3 -8 2 11 5 7 9 0 2 -1 1 16 18 1 3 11 15
6182 15 6 6 10 3 15 3 2 12 6 8 3 11 15 11 12 3 2 -1 -4 -1 -1 1 3 5 -6 -11 1 -11 -5 -8 -7 -12 -1 -12 -5 -6 -9 -11 -11 6 -13 -7 -5 -2 -1 1 -3 12 3
6231 3 -2 9 5 15 24 13 3 11 14 6 21 13 0 10 15 13 18 7 -7 -3 3 -1 8 19 -2 -2 9 -6 13 9 2 2 -12 -2 -3 2 3 0 -13 -7 -8 1 -6 -1
6275 -1 -8 1 3 -4 -5 -11 -6 6 1 -8 -8 -3 8 3 3 8 5 2 13 4 23 17 24 27 13 16 14 11 14 8 15 13 14 17 -2 8 15 11 -1 19 1 2 9 -4 2 2 7 4 4 -6
6325 -6 -6 -10 -11 -3 7 1 1 -7 0 -2 -13 -9 6 -3 -10 -4 0 -4 -6 -1 -3 -10 10 8 -5 2 9 -4 2 9 6 7 10 0 18 7 10 7 14 2 13 9 0 22 26 7 10 1
6373 1 10 5 -1 5 7 8 -8 8 -4 1 -12 -4 -7 -17 -8 -7 -17 -9 -3 2 -1 -4 1 -8 -1 -4 -12 3 -9 -3 -6 -5 4 1 -10 -3 -1 -7 1 13 -9 11 8 1 -1 11 15 14
6421 14 19 3 12 23 2 -8 -3 7 15 14 6 0 11 5 10 9 6 -6 9 -17 10 2 7 -1 -7 1 -8 0 -2 5 -3 6 -5 -7 -2 -2 -9 2 2 8 2 -3 3 6 4 11 13 -1
6469 -1 -3 14 13 10 7 -5 0 15 0 7 23 17 1 9 5 -12 8 3 9 1 15 -1 8 7 9 12 7 7 3 4 6 -6 -2 0 -2 11 -6 -9 -12 -7 -14 -6 -22 -12 -1
6514 -1 -12 -4 -7 -13 -12 -8 -15 -7 -3 -7 -8 -8 -3 -1 -10 -6 -8 10 4 4 -1 -2 3 -1 -4 12 19 0 3 13 0 10 -10 -2 15 19 3 0 -2 0 -10 -2 -1 2 11 2 1 11 5
6563 5 -12 -4 -9 -7 -3 -4 -8 -11 -18 -11 -1 -7 -15 -13 -10 -8 -13 -10 -11 -3 -10 -13 3 -8 -5 -3 2 -4 -2 3 -2 11 16 15 14 -8 1 17 3 6 16 5 9 6 -3 9 5 25 0
6612 0 8 12 3 2 -3 4 -7 3 -7 0 0 -4 -16 3 -4 -7 -4 -2 1 7 3 -6 -7 -5 12 -10 -5 -12 5 -3 -3 1 1 -5 6 5 -3 -2 10 -3 10 3 17 12 5 11 8 17
6660 17 7 15 11 8 16 18 4 9 21 10 6 15 8 11 -3 3 4 15 -2 2 10 -1 -4 5 10 -3 -1 -9 -13 1 -4 -7 3 -6 -10 -4 3 -5 12 1 2 7 0 -1 2 12
6706 12 -3 4 8 1 5 -5 -6 3 18 14 8 4 -6 2 25 7 11 11 9 0 8 17 16 2 0 8 5 4 11 3 0 13 14 1 5 -4 -8 3 5 -11 -1 0 -10 -7 8 -13
6752 -13 -8 -15 -17 -3 2 -1 5 -15 -10 1 3 1 2 10 6 5 6 6 13 3 5 5 13 -3 4 3 12 11 10 14 11 11 3 10 4 19 8 0 -3 3 13 9 6 8 10 13 12 6 -6 -7 5
6803 5 1 10 -3 -6 -7 -27 -19 -3 3 -10 -12 -15 -8 -6 2 -17 3 -6 -3 4 -1 -4 -1 -11 -7 4 4 9 3 11 11 21 14 5 9 12 5 8 22 5 10 6 9 3 10 3 11 10 6 5
6853 5 1 0 -4 5 5 5 -5 -7 2 -3 7 -16 3 9 -4 -12 -9 -7 12 -12 -10 5 -10 3 1 -11 -13 -7 -11 -9 -2 -1 -6 -3 3 -2 6 7 -9 -2 16 18 15 15 18 10 14 4
6901 4 16 9 19 14 5 6 3 10 6 -2 8 22 5 4 9 1 4 -2 -1 -5 3 5 4 -13 -6 -10 -4 -10 -9 7 -5 -7 -4 -1 1 -8 -8 -13 3 5 -5 2 -10 -6 7 -11 -10 7
6949 7 2 2 3 -2 6 6 1 1 7 17 16 14 15 18 22 8 -1 11 5 10 8 11 13 8 5 8 16 14 -1 -3 9 -3 -12 -9 -10 -20 -5 0 -19 -19 -18 -7 -9 -2 -8 -6 -14 -7 -4 -5 -3
7000 -3 -5 -12 4 5 -3 4 4 -10 -3 2 -4 16 6 -3 0 -8 14 15 14 11 0 5 1 11 10 5 9 10 9 13 10 9 11 12 6 15 21 1 6 2 11 3 -1 -8 -15 -18 -8 -4 -1 -15 -9
7051 -9 -11 -5 -4 -7 -8 -8 -17 -7 1 -12 -19 -11 -7 1 3 0 -5 0 10 -3 -7 11 13 -11 9 8 12 4 0 8 0 10 13 1 12 15 8 4 1 9 11 10 -2 3 5 9 -6 -5 -5
7100 -5 0 -1 2 -4 -19 -12 -11 -19 -5 -5 -27 -1 -9 -17 -5 -13 -12 -15 -19 -10 -19 4 -15 -5 -12 3 1 -1 -1 1 10 -2 10 6 0 2 4 8 0 12 18 2 15 9 3 3 4
7147 4 -2 -8 7 15 9 28 8 9 13 5 5 8 8 -1 -5 -14 -8 -5 1 3 -7 -15 -14 -3 -6 0 -7 -3 -5 -14 -17 -9 -10 -6 -14 -16 -15 -23 -12 0 -2 2 3 2 0 12 9 -1 14 0
7197 0 14 14 5 4 17 9 3 6 15 11 5 9 6 9 14 -4 8 1 13 0 0 2 8 1 2 -4 -11 -15 4 -5 -11 -7 -16 -4 1 -4 6 -2 -12 -5 0 -5 -7 -6 -9 0 3 -1 -18 -8
7247 -8 -1 11 3 -9 4 8 13 -1 8 10 12 18 17 3 10 18 11 -2 11 15 13 11 -6 6 16 16 -5 4 5 -10 6 -7 3 -3 -5 -9 -13 2 -3 8 -12 -3 -23
7290 -23 -2 -8 -9 -5 -11 4 7 -4 1 -5 -6 -10 4 1 1 3 -20 -6 -8 1 5 -8 -5 -12 -3 13 9 3 7 11 4 17 14 1 3 4 21 9 7 16 8 6 2 7 -1 -2 14
7337 14 -6 11 1 -4 -11 -18 -6 -7 -7 -11 -20 -5 0 -5 -12 -23 -13 -19 -2 -2 -8 -4 -15 -20 -1 -5 -2 -11 -9 -9 -5 -1 5 4 0 9 10 6 5 -8 0 6 -6 4 12 -8
7383 -8 -3 3 6 13 11 6 9 -1 11 -4 7 -4 -2 3 6 3 4 -4 -11 -7 1 -1 -4 -19 -21 -2 -10 -1 -10 -6 -6 -11 -5 3 -4 -6 1 -8 -4 0 -5 -4 -9 7 6 5 4 5 2 5 10 16 17
7436 17 4 4 21 12 4 17 6 -4 9 10 3 16 -1 -9 6 6 10 10 -6 6 10 13 12 7 -6 2 2 4 -4 3 -3 -4 2 2 -10 -5 -3 -7 -8 -5 -3 -6 -19 -9 -25
7481 -25 -15 -14 -9 -7 -10 -8 3 -1 -7 1 3 8 -4 9 3 12 5 4 14 11 5 11 23 16 19 -1 -1 5 10 -2 8 10 3 5 8 0 -6 -4 -12 -7 -3 -2 -7 -6 -5 -13 -5 -1 -6 -4 2
7532 2 -11 -2 -4 -4 -1 -16 3 -7 -10 -3 -8 0 -9 -4 4 -1 -1 11 2 -1 0 0 3 9 3 19 16 4 1 15 19 6 11 3 1 5 2 18 13 12 11 4 10 9 -6 -2 -12 3
7580 3 -8 -6 -7 -8 -3 -16 -13 -15 -10 -4 -6 -9 -8 3 -2 -5 -1 0 -4 -1 -6 -2 -4 5 -8 -9 -3 -11 5 3 -6 11 12 -2 10 3 5 4 16 5 16 7 3 13 8 16 24 10
7628 10 8 14 22 19 13 5 5 5 1 8 0 13 -2 2 -9 1 -12 -18 6 -7 -10 -19 -10 -4 -9 -5 -12 -13 -5 4 -10 -8 -11 -4 -5 -3 5 -9 -7 14 6 10 5 -1 5 9 10 5 1 -2
7678 -2 1 6 2 -1 12 4 7 23 5 13 11 2 16 13 8 20 16 10 1 -12 8 9 6 -4 -9 -4 4 -10 -1 -21 2 -8 -14 -12 -11 -8 -18 -8 1 -10 -4 -11 -6 -16 -6
7723 -6 -8 -5 11 5 15 0 0 4 9 10 -1 16 5 12 4 15 15 7 11 9 2 -2 7 3 13 4 19 18 6 5 1 5 11 0 -7 5 13 -5 4 10 2 -2 -8 1 2 -2 2 -8
7771 -8 -10 -12 -9 -14 -16 -4 -3 -19 -7 -11 -9 -4 -6 -2 -12 -6 -6 -9 -8 2 0 -8 7 -4 9 13 7 9 13 13 15 6 14 9 6 -1 8 14 9 8 6 15 15 -1 -12 2 1 9 3 -2
7821 -2 2 4 4 -5 -4 -4 3 -5 -10 -4 -4 3 13 -2 -14 0 -9 -19 -14 -12 2 4 -9 1 -4 6 8 -3 -1 5 6 7 3 -2 -6 16 17 8 10 -1 -4 12 3 6 1 10 5 17
7869 17 5 -6 1 0 6 3 2 -8 5 -5 -1 -4 1 -12 -3 0 -9 -12 -8 -3 -20 -11 -6 -3 -3 -14 -12 -5 -11 -7 -9 -4 4 0 -9 -2 -2 -11 -7 -8 -1 3 -4 3 4 4 4 4 -4 -4 5 11
7921 11 7 3 7 1 3 13 3 7 16 5 29 23 15 8 9 5 3 13 0 5 1 -6 -2 3 -7 -1 -9 -5 -7 -11 -20 -6 -7 -3 0 -12 -1 -13 -9 -4 -5 0 -6 -1 -8 0 0 8 9
7970 9 5 8 11 12 0 5 1 11 -9 8 4 4 5 7 12 4 12 12 6 17 17 1 7 13 -4 6 1 1 4 6 -3 10 -6 -8 -2 -3 3 -8 -3 -21 -11 -5 2 -2 -7 -13 -13 -11
8018 -11 -16 -5 -4 -7 -7 -15 -6 -9 2 -7 9 -5 -1 13 4 4 3 2 4 -7 3 22 1 5 2 4 14 9 -7 5 1 -1 14 9 -3 6 14 10 7 1 0 -3 -3 -2 0 4
8064 4 -3 -4 -1 -6 2 -11 -12 -6 -1 -19 -14 0 -7 -17 -10 -8 -8 -16 -11 -13 -11 -4 -4 -13 -5 -7 -4 8 1 17 6 11 16 -1 -2 17 7 5 8 18 8 7 3 10 3 6 0 1 7
8113 7 3 6 8 4 11 7 -2 -10 -8 -4 0 -8 -11 -6 -3 -6 -3 -6 -8 -6 -18 -5 -8 -8 -7 -17 -10 -7 -2 -20 -5 0 3 -16 -5 2 -1 -3 6 -5 7 24 5 16 1 12 5
8160 5 11 3 -3 5 17 3 13 13 12 8 9 7 11 24 0 -1 -4 2 -13 -4 4 1 2 0 1 -5 -4 -7 -9 -16 -11
8191a1
$$ Imaginary data points
##PAGE= N=2
##DATA TABLE= (X++(I..I)), XYDATA
0 0 0 0 0 0 0 0 0 0 0 0 0 0 0 1 -8 8 -8 8 -8 9 -16 16 -16 24 -24 25 -32 36 -40 48 -52 57 -65 73 -81 90 -102
37 -102 113 -126 138 -154 170 -190 209 -231 255 -287 319 -353 397 -449 509 -582 673 -790 950
56 950 -1174 1526 -2143 3543 -12797 9789 21961 -22239 8297 17819 -23307 -8973 21583 -6670
70 -6670 -5374 14151 -6042 -11329 8784 136 -2684 6144 -3730 -4595 6998 -1763 -3633 5015 -2398
85 -2398 -4549 6290 2019 -4312 -444 619 -395 -366 972 4471 -2988 -7155 6520 3770 -9086
100 -9086 4914 6435 -12914 1615 14242 -9490 -6484 10984 -5984 -5757 13763 -1249 -9598
113 -9598 5367 -3015 -5118 11683 870 -7396 5305 -5556 -8483 14588 3623 -12104 7535
126 7535 1673 -15602 8080 12296 -11994 59 9931 -10799 -4066 12155 -2421 -6008 5754
139 5754 -440 -4392 2781 947 -1771 333 473 1593 -705 -3233 2115 1321 -2981 3026 1653 -5317
155 -5317 1545 2577 -4140 3384 3336 -7330 1029 5163 -5769 2214 6887 -9148 -2665 9899 -4583
170 -4583 -3760 9863 -4237 -8790 8293 1597 -6611 6329 1906 -8759 2045 4375 -3308 1947
184 1947 1937 -4365 526 1660 -1999 2282 1008 -3214 1754 622 -3580 2503 2252 -3445 1169 1849
200 1849 -3309 571 1842 -1999 1580 1606 -3136 179 978 -1839 2725 1798 -4119 286 1787 -2864
216 -2864 1939 3337 -3463 -697 1700 -2970 1346 4020 -2888 -1095 1825 -3218 859 4626 -3247
231 -3247 -1670 3861 -3014 -2049 5360 -1208 -3681 3889 -257 -4061 3355 1741 -3862 1041 2163
246 2163 -2095 130 1129 -1444 153 1261 -182 -264 -854 -388 1366 -41 -402 1103 -1288 -1573 1873
263 1873 497 -613 1569 -1350 -2700 2099 1398 -1005 1578 -797 -3416 1913 2143 -1840 1382 1078
279 1078 -3853 -69 3058 -1033 190 1831 -2773 -1607 2699 344 -655 1007 -1204 -1177 1417 100
295 100 -336 989 -821 -926 1098 -153 -427 1167 -660 -1222 1361 528 -1155 145 160 -443 802
312 802 521 -865 -568 31 404 614 -73 -172 -212 -1083 105 1617 147 -549 -49 -1343 -428 2215 615
331 615 -1201 57 -668 -1056 1629 1169 -1016 84 -242 -1644 876 1951 -563 -556 -40 -1302 326
348 326 1997 -220 -1041 156 -495 -302 1176 369 -574 -104 -470 -366 867 607 -370 -423 -451 48 843
367 843 213 -591 -247 7 135 431 11 -400 -166 -21 156 435 129 -306 -551 -412 663 1010 -193 -733
387 -733 -442 -359 627 1271 -278 -991 -68 -293 -60 1325 472 -1064 -435 -222 -279 1302 1107 -1182 -1107 188
407 188 141 638 945 -648 -1170 108 347 188 676 125 -1009 -638 428 659 380 -43 -718 -753 410
426 410 1065 68 -660 -253 -163 -8 753 317 -710 -311 36 -169 590 746 -657 -898 85 378 610 480
446 480 -734 -970 193 654 484 159 -564 -635 -18 300 597 487 -554 -868 -118 333 745 635 -743
465 -743 -1095 185 615 361 361 -381 -877 53 524 192 259 -49 -696 -344 380 587 286 -439 -678 -39 409
486 409 466 178 -650 -524 440 281 -82 319 -226 -715 295 435 -159 283 -21 -983 90 973 14 -239
506 -239 -80 -627 100 978 -47 -556 35 -164 -129 539 209 -242 -153 -317 -39 564 256 -177 -348 -501 274
527 274 832 -115 -437 26 -288 -19 701 -115 -481 363 -156 -519 595 308 -565 71 71 -319 515 222 -855
548 -855 -32 552 -105 155 65 -760 -19 667 -127 -53 281 -451 -326 331 85 168 226 -535 -306 434 152 41
570 41 -26 -573 84 807 -105 -417 87 -342 -101 771 179 -366 -12 -426 -379 654 598 -28 -245 -730 -223
591 -223 807 221 -253 221 -376 -434 711 54 -734 472 306 -673 415 564 -860 -351 342 -101 547
610 547 667 -817 -816 89 165 699 558 -761 -480 151 -399 261 1011 -349 -678 295 -186 -164 760 -117 -864
631 -864 241 601 79 -52 -533 -506 371 484 371 257 -755 -811 302 263 308 924 -267 -1386 -160 575
651 575 256 473 -9 -705 -134 187 44 257 -214 -305 610 -1 -616 546 -30 -1217 608 1250 -603
670 -603 -175 302 -1331 -281 1773 262 -830 138 -405 -661 679 594 -99 5 -406 -382 365 124 61
689 61 289 -586 -303 961 67 -823 81 61 -184 698 299 -615 -267 -165 -44 650 227 -156 93 -819 -593
710 -593 1249 468 -836 349 64 -1066 581 889 -942 -141 833 -466 -354 536 -127 -285 55 -62
728 -62 396 161 -657 58 119 -580 787 839 -1301 -381 1047 -625 -353 1246 -305 -951 632 24 -586
747 -586 668 285 -627 -30 68 90 382 -414 -308 567 -198 -306 685 -254 -625 682 43 -644 571 262
767 262 -608 134 47 -130 549 -266 -561 695 -113 -652 908 -54 -1106 997 499 -1507 505 1143 -1225
786 -1225 -182 1123 -695 -391 940 -386 -576 597 54 -266 48 -157 261 173 -630 241 549 -700
804 -700 69 669 -773 -59 1010 -622 -558 836 -201 -453 588 -187 -273 565 -394 -333 736 -263 -350
823 -350 679 -514 -482 1139 -189 -1001 797 186 -831 632 288 -777 366 201 -635 447 331
840 331 -459 272 -195 -652 882 288 -1001 557 390 -1100 450 745 -1069 210 985 -936 -321 921
858 921 -466 -380 615 -194 -65 447 -499 -292 393 -143 285 428 -757 -140 543 -573 8 917 -390
877 -390 -365 431 -623 -194 978 -271 -413 649 -406 -445 709 -409 -416 1121 -139 -879 661 -103
895 -103 -854 837 386 -763 538 247 -1110 129 669 -253 270 198 -703 52 266 -407 319 362 -393
914 -393 199 32 -748 308 516 -529 216 514 -613 -91 266 -608 206 854 -351 -271 231 -571 -83
933 -83 631 -205 40 570 -581 -557 398 -76 65 671 -267 -445 282 -287 -311 570 158 -32 282 -554 -556 530
955 530 123 -120 578 -169 -634 271 -115 -396 767 374 -675 22 100 -485 307 420 -376 110 330 -468
975 -468 -208 249 -64 144 237 -263 -73 126 -196 -35 160 27 184 6 -399 38 204 -190 129 210 -239
996 -239 131 188 -536 -61 532 -121 -70 353 -334 -332 348 -106 -166 612 113 -598 -98 47 -62 399 248 -321
1018 -321 -128 17 -176 51 224 108 6 -190 -239 89 143 18 66 -109 -142 172 -35 -279 194 223 -181 2
1040 2 36 -212 127 236 -238 -54 271 -140 -186 174 54 -39 113 -148 -208 202 196 -81 -114 -63 35 102 19 44 47
1065 47 -129 -61 47 -31 193 238 -306 -301 253 114 -79 189 -79 -313 182 164 -247 107 275 -259 -210 170 19
1088 19 -1 153 -111 -215 115 174 -138 -106 140 70 -146 -41 71 -67 63 185 -203 -201 257 21 -273 188
1110 188 211 -238 0 65 -259 141 424 -243 -304 214 0 -144 235 49 -215 75 26 -209 96 280 -59
1131 -59 -230 -51 82 52 60 24 -125 -83 146 7 -179 133 186 -222 -117 170 -47 0 160 -181 -175 243 43
1154 43 -200 73 80 -68 30 -53 -95 132 86 -65 -20 -65 40 150 -139 -63 282 -53 -249 132 16 -99 302
1177 302 -14 -417 165 272 -259 48 247 -215 -66 186 -183 -37 327 -49 -289 19 120 25 13 -14 -41
1198 -41 -50 36 81 -107 -9 276 -139 -301 272 114 -272 215 80 -440 241 342 -512 7 507 -368 -193 407
1220 407 -275 -168 536 -217 -448 424 59 -374 267 118 -247 200 12 -319 183 217 -158 2 -51 -112 211
1241 211 24 -167 186 13 -195 131 -45 -89 331 -36 -348 166 94 -147 209 -34 -252 263 15 -326 246
1262 246 103 -253 211 -67 -375 423 151 -500 260 199 -484 287 246 -597 293 467 -720 11 615 -480
1282 -480 -64 573 -528 -217 707 -335 -417 633 -101 -446 410 -59 -350 464 74 -460 180 161 -188 119
1302 119 27 -108 155 -73 -120 161 -73 58 213 -381 -65 498 -273 -218 490 -304 -308 622 -229 -495 734
1323 734 -46 -743 522 163 -604 557 183 -830 405 434 -756 260 522 -652 124 448 -694 112
1341 112 706 -567 -166 592 -419 -142 599 -380 -238 621 -262 -413 452 -62 -224 355 -172 -269 365 -43
1361 -43 -221 241 -54 -98 195 -232 -63 370 -173 -125 241 -296 18 482 -401 -169 587 -381 -328 649 -296
1382 -296 -393 796 -299 -744 868 106 -852 629 235 -896 554 449 -975 302 697 -796 6
1399 6 683 -584 -88 624 -527 -194 699 -277 -329 422 -190 -205 384 -159 -185 366 -90 -249 127 -77 71
1420 71 224 -208 -23 160 -311 41 267 -281 189 394 -608 -175 551 -312 -76 647 -428 -374 598 -345
1440 -345 -421 827 -5 -563 464 -161 -616 663 176 -646 549 245 -807 236 316 -609 403 571
1458 571 -712 -62 519 -546 -131 633 -170 -118 389 -364 -383 375 84 -81 210 -44 -132 -29 -192 25
1478 25 259 62 115 -56 -412 48 192 -231 273 408 -385 -126 106 -513 163 775 -308 -239 412 -509 -408
1499 -408 670 -26 -260 692 -179 -871 355 244 -419 482 348 -613 41 194 -592 102 632 -126 -91 110
1519 110 -435 -180 317 -11 89 312 -165 -297 -86 -126 180 360 2 -70 -43 -245 -61 93 16 290 232 -296
1541 -296 -181 -2 -190 192 380 -125 20 131 -473 -227 412 72 87 325 -408 -430 284 -38 -139 527 98
1562 98 -386 84 -145 -371 456 340 -324 101 113 -478 -14 272 -127 198 335 -378 -308 141 -55 27 294
1583 294 -23 -126 24 -183 -142 178 183 77 -53 -189 -42 33 -84 107 139 -72 71 -24 -329 46 286 -114
1605 -114 40 239 -246 -150 192 -190 -52 457 -37 -343 125 -48 -194 279 86 -224 164 50 -341 41
1625 41 195 -70 107 57 -251 12 109 -157 22 169 -72 -4 -16 -216 74 217 -81 -41 74 -117 -2 90
1647 90 -111 42 176 -146 -119 88 -6 39 94 -151 -55 171 -50 -73 96 -37 -4 103 -130 -43 212 -49 -114
1670 -114 100 -54 -20 157 -119 -132 225 -2 -189 108 20 -126 181 14 -247 123 137 -212 17 133 -125
1691 -125 40 88 -190 0 172 -106 -87 89 -10 9 27 -129 -13 129 -25 -1 37 -70 30 24 -129 68 184
1714 184 -92 -75 36 -121 48 206 -114 -74 164 -92 -144 120 17 -9 149 -105 -178 143 50 -80 84 -7
1736 -7 -93 80 -46 -124 160 98 -108 22 -34 -75 159 19 -157 90 81 -158 22 66 -95 99 55 -216 7 174
1760 174 -75 -51 69 -100 -11 118 -83 -40 118 -40 -76 8 -8 66 75 -121 -52 58 -10 38 39 -93 51 66 -171
1785 -171 -10 187 -44 -43 67 -183 -29 253 -93 -147 170 -43 -158 125 8 -86 164 -26 -256 72 130 -65
1807 -65 26 -7 -117 49 30 -94 61 77 -83 -23 -65 -78 156 66 -137 -6 18 -111 62 43 -75 87 39 -208
1831 -208 -18 142 -30 57 32 -187 32 119 -111 32 138 -99 -40 55 -110 60 199 -128 -120 81 -60 18 125
1854 125 -114 -48 132 -127 -97 162 -8 -52 74 -143 -82 228 0 -138 119 -34 -126 108 -7 -77 151 3
1876 3 -195 12 50 1 114 -56 -151 107 -3 -111 127 29 -117 100 -68 -213 218 153 -201 52 44 -203 122
1899 122 153 -188 84 145 -240 -48 178 -50 65 121 -236 -50 191 -67 -28 125 -105 -52 70 -129 9 190
1921 190 -79 -101 34 -117 58 183 -155 -40 153 -186 -69 204 -108 -16 211 -250 -174 319 -27 -164 221
1942 221 -105 -233 265 -5 -224 269 64 -303 85 60 -139 227 81 -293 94 114 -193 140 130 -193 104
1963 104 49 -274 127 229 -152 21 72 -201 95 171 -183 62 145 -219 -22 110 -130 153 161 -300 -39 173
1985 173 -159 76 186 -264 4 195 -288 0 336 -183 -107 179 -288 -47 407 -179 -194 311 -188 -217 353
2006 353 -66 -201 346 -117 -381 311 110 -247 213 8 -327 215 115 -271 151 142 -252 59 72 -149 180
2027 180 78 -260 65 80 -141 156 53 -229 156 55 -294 171 181 -212 139 26 -372 195 259 -288 120
2048 120 206 -391 20 246 -299 149 366 -427 -174 299 -222 24 418 -297 -203 333 -237 -182 448 -54 -220
2069 -220 261 -186 -219 408 -4 -273 228 -12 -239 242 -11 -240 244 34 -258 173 48 -180 153 -35
2089 -35 -198 240 50 -212 138 -32 -193 243 -10 -229 299 32 -350 181 43 -271 336 143 -417 184
2109 184 146 -445 191 342 -312 106 198 -542 8 491 -240 -10 331 -400 -188 363 -175 -42 451 -205 -323
2130 -323 228 -64 -80 355 -94 -229 212 -51 -161 217 -16 -99 205 -120 -147 249 -67 -137 201 -92 -78 262
2152 262 -170 -217 302 -51 -197 304 -80 -254 316 -74 -344 355 116 -317 258 52 -409 241 161 -394 251
2173 251 289 -440 14 202 -340 168 379 -336 -90 253 -294 -55 369 -131 -63 225 -292 -154 312 -22 -72
2194 -72 162 -174 -109 220 -101 -64 230 -114 -121 136 -125 -6 249 -167 -129 240 -122 -93 241 -148 -138 296 -152
2217 -152 -219 323 -57 -223 257 -78 -262 330 21 -336 250 94 -331 179 122 -284 204 156 -368 77 239
2238 239 -235 76 182 -284 22 218 -231 -1 250 -162 -84 142 -157 8 225 -143 -99 139 -90 -22 153
2259 153 -97 2 145 -183 -65 194 -69 2 146 -193 -72 244 -102 -76 228 -108 -162 196 -95 -102 298 -64
2281 -64 -264 176 2 -142 230 -15 -245 162 35 -233 171 132 -215 68 49 -203 134 161 -205 12 106 -148
2303 -148 45 105 -151 43 150 -176 -41 126 -84 18 124 -140 -26 124 -146 -50 164 -24 -14 50 -162
2324 -162 -42 193 -9 -33 88 -129 -47 126 -71 -13 187 -101 -158 146 -12 -51 155 -85 -157 202 47 -161
2346 -161 77 -23 -149 142 76 -140 72 15 -215 44 162 -47 48 0 -226 22 149 -53 29 73 -98 -28
2368 -28 45 -81 35 110 -49 -14 55 -92 -6 48 -72 73 162 -92 -116 0 -61 84 198 -65 -92 30 -123 -64
2392 -64 170 42 -39 35 -138 -120 160 43 -66 55 -36 -63 105 -33 -134 79 61 -57 90 14 -140 -5 1
2415 1 -50 154 113 -144 -115 -28 -25 126 116 -77 -50 -16 -83 17 78 -2 30 1 -113 -10 74 -47 -8 45 -18 49 27
2442 27 -147 -45 123 27 42 49 -132 -77 54 -17 38 143 -35 -135 -19 -21 24 143 -21 -126 19 18 -13 42 2
2467 2 -26 57 -3 -46 22 0 -55 23 25 13 67 -64 -135 24 78 24 46 -27 -97 22 31 -45 54 61 -67 -29 -8 -29 61 42
2497 42 -74 0 53 -18 2 -1 -40 52 79 -59 -28 35 -41 -4 65 -20 10 51 -68 -63 73 36 -23 4 -44 -26 52 8 -53
2526 -53 13 22 -18 -8 -10 4 23 -23 -13 0 -4 32 21 -66 13 73 -40 -37 40 -15 -9 63 -60 -61 85 25 -79 27 15 -51 40
2557 40 35 -75 36 48 -80 -10 72 0 -8 8 -51 34 86 -2 -41 -4 -5 9 32 1 -11 -10 -33 -1 15 24 20 -38 -76 32 56
2588 56 -6 -11 -37 -34 57 39 -50 -16 11 -42 16 38 -16 1 -3 -81 32 110 -27 -50 -15 -63 30 132 -54 -93 30 -18 -49
2617 -49 74 31 -70 2 -3 -51 73 91 -77 -86 13 39 54 29 -65 -72 7 58 23 -1 -11 -29 -59 5 81 14 -24 -34 -71 -3
2647 -3 130 8 -124 -12 17 -22 82 26 -107 -1 30 -66 41 91 -87 -78 43 -19 49 93 -78 -120 64 63 14 25
2673 25 -45 -71 41 47 21 49 -19 -81 -21 35 61 71 -37 -108 -2 74 53 21 -53 -76 32 43 7 39 -11 -61 -2 8 38
2702 38 83 -38 -100 0 29 17 57 -70 -126 51 53 -36 39 9 -111 2 80 -43 19 48 -122 -55 142 18 -30 19
2728 19 -95 -53 128 33 -70 20 -15 -60 67 64 -19 12 -21 -85 33 92 8 -12 -54 -28 54 51 -25 -20 -35 -25 39 -5 -15
2757 -15 48 -43 -88 41 44 -14 43 -22 -100 80 78 -71 -16 35 -62 28 71 -81 -4 53 -70 -11 85 -29 -34 32 -72 -1
2785 -1 126 -44 -87 48 -6 -24 101 -10 -93 52 24 -78 51 66 -62 -11 -3 -38 66 52 -52 -27 4 7 54 12
2811 12 -31 27 -2 -61 27 33 -30 30 -32 -73 62 43 -45 6 15 -59 49 27 -89 65 84 -103 -12 80 -82 12 95 -80
2839 -80 -43 113 -44 -77 102 0 -49 66 -40 -60 90 13 -72 35 2 -41 53 -6 -53 90 24 -99 15 35 -25
2864 -25 55 22 -54 26 19 -27 26 20 5 46 -44 -66 67 43 -49 34 -12 -88 66 38 -78 37 58 -113 1 50 -57 44
2892 44 55 -115 6 117 -51 -17 61 -100 -20 137 -41 -43 95 -63 -107 97 50 -8 61 -56 -121 53 57 -7 30
2917 30 -8 -39 18 -29 -38 76 10 -30 55 -17 -55 58 -20 -50 99 57 -66 -21 -51 -32 135 60 -58 11 -53 -107 93
2944 93 88 -42 66 -2 -179 25 127 -49 9 47 -98 26 99 -80 -66 65 -40 27 90 -59 -57 26 -76 27
2968 27 183 8 -97 -13 -83 -17 169 50 -71 -24 -46 -49 75 33 8 36 -55 -56 53 -24 -28 69 -31 -11 111 -40
2994 -40 -151 39 42 22 129 -1 -138 -15 11 -23 141 89 -103 -43 -56 -70 141 115 -106 -29 18 -92 35 70 -99
3019 -99 -13 110 -39 -20 49 -64 -48 59 24 58 53 -126 -97 34 21 92 95 -106 -89 52 -17 17 120 -1 -50 13
3045 13 -45 -19 98 -29 -49 58 -3 -16 44 -71 -56 128 46 -49 40 -56 -113 79 65 -32 73 -3 -150 -1 80 10
3071 10 62 -12 -116 13 51 -34 33 28 -59 21 44 -77 27 45 -80 -6 65 -19 -2 19 -70 3 92 -9 -29 9 -57 22
3099 22 64 -47 6 51 -59 -36 61 -24 0 68 -63 -31 84 -5 -58 41 -26 -20 75 -36 -63 58 -13 -47 58 -1 -50
3126 -50 45 0 -85 63 44 -91 3 36 -36 38 35 -63 -2 45 -28 15 21 -7 27 7 -65 30 34 -32 31 27 -54 26 34 -76 27
3157 27 80 -39 -9 33 -49 37 82 -54 -8 50 -51 -10 59 -13 5 66 -55 -43 78 2 -40 46 -10 -12 78 -33 -73 28
3185 28 16 -7 51 -14 -51 38 -22 -51 68 31 -64 10 5 -37 72 36 -74 7 52 -16 20 14 -34 16 24 -29 21 23 -34 12 8
3216 8 -18 73 25 -95 6 43 -22 43 29 -76 15 56 -46 3 75 -65 -26 51 -29 6 77 -56 -64 66 14 -14 31 -44
3244 -44 -52 57 14 -44 8 -10 -49 17 5 5 45 -34 -45 36 11 -8 28 -51 -60 68 22 -49 29 2 -57 32 25 -37 32 20 -76
3275 -76 16 49 -13 11 7 -53 32 64 -39 -6 10 -36 20 40 -43 10 23 -31 4 55 -3 2 10 -72 3 73 -20 -26 18 -42 -11 56
3307 56 -30 -15 55 -23 -39 25 2 -20 17 -38 -25 41 2 -19 12 -20 -2 41 -29 -44 51 -5 -47 42 10 -34 42 2 -46 47
3337 47 34 -58 4 32 -23 20 21 -45 6 44 -20 -3 13 -16 8 18 -17 9 43 -17 -3 -6 -10 32 31 -37 5 26 -30 11 30 -23
3369 -23 13 25 -64 -11 56 -6 -17 28 -34 -8 49 -3 -34 51 -8 -34 18 6 3 33 -28 -36 46 12 -19 19 -9 -10 44 2 -37 31
3401 31 23 -22 19 12 -24 29 17 -47 22 30 -32 -14 -5 -28 36 25 -36 1 8 -9 17 -5 -21 28 -1 -41 12 28 -13 5 0 -33 18
3434 18 41 -38 -17 22 -9 -10 28 -16 0 48 -37 -28 39 6 -19 8 -24 -5 30 1 -28 15 4 -9 12 -12 -18 25 4 -28 29 -3
3466 -3 -15 13 -2 -6 51 1 -43 7 12 -4 20 -8 -33 10 11 -25 7 15 -16 9 -28 -20 46 15 -53 0 -4 -21 31 6 -46 9 26 -32
3500 -32 5 32 -29 -2 24 -28 1 48 -26 -26 29 -9 11 19 -31 -31 43 15 -22 12 1 -3 8 -15 1 15 -20 -22 16 -9 11 19 -39
3533 -39 -17 49 18 -16 1 -12 -23 45 3 -28 28 -3 -43 12 5 -10 17 -5 -57 16 34 -41 16 9 -32 11 21 -42 -2 32 -25
3564 -25 -3 20 -11 -1 -3 -39 -2 47 -14 -14 5 -17 1 39 -8 -16 25 -15 -21 3 -4 -7 12 -12 -3 4 -11 -12 4 -17 24 40 -28 -21 27
3599 27 -6 -1 50 -16 -41 20 -15 -49 41 46 -42 -13 -6 -45 16 14 -44 2 15 -37 -14 11 -32 4 36 -30 -6 25 -12 -29 17 8 7
3632 7 14 -26 -17 14 1 12 13 -15 4 27 -33 -1 32 -26 -7 22 -8 7 41 -4 -27 29 23 -16 -4 -16 -17 39 3 -8 34 -15 -9 29
3666 29 1 -14 35 -2 -58 5 18 -37 20 29 -31 5 23 -31 -11 23 4 -19 1 -14 -1 19 -9 -14 23 -2 0 -6 -18 10 36 -6
3698 -6 -25 3 12 18 5 -15 6 14 -14 -6 31 -2 9 18 -35 -5 40 -13 -30 22 7 -27 17 0 -17 27 4 -41 -1 4 -11 13 12 -25
3732 -25 17 16 -26 9 28 -9 0 3 -26 10 34 -22 -20 11 1 -5 5 -9 3 2 -13 -5 21 6 27 -4 -28 19 31 -9 -5 11 -11 1
3766 1 17 -16 -13 31 -15 -13 13 0 2 27 -16 -7 39 -5 -20 29 4 -7 20 3 -36 23 18 -30 -11 4 -11 0 13 -5 7 11 -14 -6
3800 -6 31 9 31 -4 -37 -10 10 -3 11 25 -15 -17 8 -18 2 34 0 -8 -3 -19 8 19 -9 9 23 0 -13 16 -12 9 25 -16
3832 -16 -26 26 -6 -11 17 19 -6 21 -3 -26 26 11 -9 11 7 -6 9 1 -15 8 23 -14 -4 10 -10 4 10 -14 24 29 1 -11 10
3865 10 0 24 24 -12 13 8 -15 -12 5 6 35 18 -18 -20 10 -5 21 22 4 2 -8 -15 -7 29 9 8 5 -7 -15 16 -8 -12 37 10 2 -1 -11 -12
3903 -12 35 4 -5 19 2 -22 -2 2 8 31 -14 -43 -3 13 -11 11 10 -10 1 2 -26 -2 4 1 10 10 -1 17 -1 -23 -3 33 12 14 -20
3938 -20 -17 15 31 2 15 5 -18 -13 6 8 4 9 -37 -6 19 14 11 10 -13 -10 25 -1 -9 7 2 8 26 -2 -9 8 -7 -16 33 17 -12 -4 -7 -5 21
3977 21 12 -11 -2 -7 -6 8 4 -12 -6 -7 11 10 11 2 4 -20 9 43 18 -4 8 -5 -5 25 13 -29 7 5 -20 17 36 -7 -11 7 -18 14 42
4014 42 -11 -34 6 -7 4 12 -1 -3 10 14 -9 7 6 3 -3 -4 15 22 -24 -9 8 -5 13 18 -31 -12 8 9 2 12 -9 -16 11 -6 -3 24 3
4051 3 -17 4 11 6 31 0 -19 23 15 -3 14 -2 -9 32 9 -19 17 16 -21 -6 17 -12 17 19 -22 0 49 -8 -8 10 -9 -6 17 -4 -15
4086 -15 21 1 -10 6 -7 -4 2 -10 -6 14 8 -3 -23 -13 21 19 -31 -11 8 -19 -1 24 -14 -20 34 -20 -30 34 0 -32 9 13 -19 16
4120 16 15 -29 13 23 -9 -2 13 -19 2 6 -12 4 4 -1 6 9 -1 8 8 -34 -1 21 -22 -5 -1 -29 3 27 -20 -23 24 -12 -12 13 -1 -11
4156 -11 14 -11 -13 28 14 -6 -2 -9 -13 9 -3 -8 5 -15 -1 9 -26 -17 31 -20 -17 31 4 -29 10 1 -10 42 24 -31 4 28 -23 4
4190 4 33 -16 -3 24 -9 -17 19 -4 -13 -1 9 13 -7 -20 -9 -3 8 20 -9 -21 2 5 -22 16 20 -22 -7 24 -29 -1 35 -31 -27 22
4224 22 -1 -13 19 -5 -26 23 16 -11 9 -1 1 8 5 -6 21 8 -11 6 4 -3 12 -5 -25 20 12 -11 10 3 -16 16 5 -17 16 17 -17
4259 -17 1 21 3 3 9 -4 4 4 7 -9 -5 0 11 1 -16 11 15 -12 2 8 -24 16 13 -32 -5 22 -14 -7 25 -13 -4 13 -7 -15 30 20 -21
4296 -21 -1 5 -9 17 -3 -16 -6 7 -12 8 13 2 2 -11 2 14 0 -7 -1 -10 -6 20 -9 -13 9 6 -6 20 13 -13 -3 2 -23 -3 23 -7
4332 -7 -12 12 -1 10 12 -5 -15 18 5 4 19 -15 -1 3 -6 14 22 -22 -6 16 -1 12 17 -19 -32 16 13 2 12 -11 -6 18 14 -10 19 6
4368 6 -21 11 1 1 3 -16 -11 14 20 6 9 -29 -5 16 6 -10 6 -10 -8 18 -13 -12 12 0 -36 3 24 0 -9 11 -3 2 24 -10 -20
4403 -20 -2 -1 7 21 -10 -9 -13 -11 -1 19 2 -5 -7 -23 6 27 -3 -5 -4 -6 1 12 1 -9 3 -7 0 22 -12 -9 1 12 16 13 -7 -21 -2 -2
4441 -2 17 25 -8 -28 3 -5 3 12 -3 -18 -7 -9 -14 10 2 -23 -1 8 -1 5 -9 -24 15 31 7 0 7 -8 -13 4 11 2 -5 -16 -18 7 4 16 1 -23
4481 -23 -4 4 5 1 -9 -7 5 9 -18 -3 7 -3 5 8 18 -10 -1 -21 -14 34 2 -13 -19 -29 -4 13 8 -27 0 -4 -4 -4 -8 -11 3 -6 -21 5 8
4520 8 -23 -1 1 -3 13 4 -16 -26 6 -3 4 18 -7 -13 5 2 3 18 -4 -15 -2 5 9 -17 -8 -7 5 5 3 -11 -28 -2 -2 -1 0 13 -15 -18 4 -3
4560 -3 5 10 -20 -24 13 7 -11 4 -5 -10 2 12 -1 -2 -4 -14 -1 8 -1 2 -8 -18 6 14 -10 -5 -17 -12 6 5 -12 -4 -4 -7 14 9 -5 -8 -2 -23 7
4601 7 19 8 -14 -6 -13 8 7 -10 -11 -3 -5 -9 9 -2 -6 -6 -8 -3 11 -3 -10 -1 -11 16 9 0 -24 5 -3 -9 10 0 -19 19 13 -16 4 -3 -25 -16 -7
4642 -7 -12 -6 -8 -12 -9 0 5 6 -14 -4 2 2 -14 1 -1 -12 -11 1 -1 11 7 -15 -3 11 -2 6 9 -11 -5 5 -6 -6 8 -2 0 19 -9 -15 12 -9 -23
4683 -23 7 -6 -19 -1 -15 -5 1 5 -17 -13 2 4 -2 1 -15 10 -12 0 -1 -3 -12 -8 -17 -14 3 6 -6 -13 0 -5 2 -12 -12 -7 -6 -13 -2 -1 -9 6 -6
4724 -6 -11 3 16 -6 -1 3 -4 5 6 -11 -15 8 -17 -8 -1 3 -6 2 -6 -6 1 -5 -5 -1 -3 5 6 -9 -3 -2 4 -14 -7 -9 -9 0 -11 -21 7 7 -5 -5 -1 -7 3 -8 -19
4771 -19 -4 3 -9 2 0 7 11 -4 -12 13 3 3 -2 -3 -9 -8 2 -2 7 4 -4 -3 6 5 -15 2 -6 -11 10 -6 -18 -7 1 -5 2 -4 -7 0 -1 -6 -16 -17 -10 -10 -19 -3
4817 -3 1 -11 -1 -7 -3 5 -6 -13 -12 6 1 -13 2 -14 -6 6 -2 4 -7 7 -8 -12 8 5 19 -5 -21 -13 -1 5 -8 -11 1 2 -8 -15 0 1 -6 -7 0
4858 0 -7 12 -4 -3 -5 14 -7 2 0 -4 -6 8 -1 -13 3 -9 -16 -8 3 -7 -3 -6 -2 6 1 3 -3 -13 1 16 12 3 -13 4 1 -4 0 6 9 -4 -13 4 6 -3
4902 -3 -3 -10 -3 0 -7 -12 -11 -4 -16 -5 -3 -15 -18 -3 -2 -4 -1 -7 -5 -12 -3 2 -1 -14 -10 -9 -10 -1 -1 -10 8 -1 -8 1 9 -6 -8 4 -11 2 0 -10 -21 -8 -7 0 -3 3
4950 3 -11 2 7 -2 0 3 2 2 -4 5 4 1 3 -1 4 16 4 4 -15 -1 -1 0 2 8 -13 -4 6 -14 0 2 -17 -16 6 -2 0 -15 -3 6 1 -2 -11 -7 -10 0 5 -12
4996 -12 -6 -6 -5 -10 -3 -6 1 -6 -13 -10 11 -5 -8 -6 -13 -1 7 -17 -17 9 1 -9 1 -4 -10 -2 -5 3 6 8 -11 -10 -5 0 9 3 -2 3 0 -2 0 -15 -1 -7 6 5 -4 -3 -12
5045 -12 -6 -1 -13 -1 -1 -19 -7 5 -4 1 12 -18 -4 -1 7 8 10 1 -3 1 -3 2 5 -17 -15 -8 -7 -3 -4 -4 -6 3 -6 -3 -11 -6 0 5 2 -9 1 -1 -14 3 1 -10
5091 -10 10 1 -8 2 8 -4 -5 6 -4 -1 1 -8 -6 5 -3 -9 -13 -6 8 -13 -10 10 -2 -14 3 -11 -23 2 8 -13 1 -3 -9 -9 5 -8 2 -8 -4
5130 -4 -1 11 7 -14 -4 12 -5 -13 -4 -3 12 -9 -8 -5 -2 -2 -7 -4 -2 8 -6 -9 9 6 -4 20 -8 -11 3 6 -8 14 5 -5 -3 7 -7 11 -9 -1
5170 -1 -8 1 4 2 0 -4 -4 1 -8 -12 -11 -5 -1 -19 -22 3 6 -15 5 -3 -4 -5 0 -2 -4 5 -5 -2 12 0 -6 7 2 -19 9 2 -14 -4 8 -4 -7 1 -1 17 2
5215 2 -11 -7 2 -11 15 -12 -10 2 4 -8 -15 -4 -2 4 -4 0 -7 4 2 -9 4 -5 0 5 -12 -11 -5 1 -13 -4 -10 -16 -5 14 -10 3 3 -12 -5 0 8 -1 0 2
5259 2 1 5 14 -8 -6 3 4 -5 -6 4 -6 -5 -4 7 7 9 -6 -3 2 -3 -5 -6 2 -8 -11 -6 -3 -2 -9 -3 -10 -3 0 -7 -9 -3 -1 4 0 4 -3 -5 4 -3 -13 -7 17 -8 -3 0 -4 5
5311 5 7 -6 -11 -3 -1 -16 -11 5 -6 2 -9 -19 -2 5 -12 2 0 -3 13 -7 -15 5 -11 -3 -2 1 -10 2 -1 -4 -5 -4 -8 6 -6 -10 7 -4 -23 1
5351 1 -6 -24 -16 -1 0 -2 5 -4 -2 10 2 -2 -7 1 2 1 3 -7 4 -2 -1 -6 1 -6 -7 -8 -7 9 -10 -5 -1 -13 -5 1 -18 -3 3 -3 -11 -10 -1 2 1 5 -2 5 0 -6 -1 0 0
5402 0 -7 -14 -21 -2 2 -13 -11 -13 -17 -12 0 -14 -7 -12 -1 -1 -3 -11 -2 7 -5 -13 -6 0 -12 -8 -12 -7 -2 3 8 -5 -7 6 -5 -4 5 -9 -8 -3 -7 -4 -3 -9 -15 -5 -9 -7 -10
5451 -10 -2 -2 -3 -2 -10 -7 10 10 -1 9 3 -12 1 1 -4 8 0 -12 -4 6 -3 0 -7 -6 -5 0 -6 7 -8 -4 3 -5 -15 -5 0 -1 -4 -3 1 -3 2 -9 12 9 -6
5496 -6 8 0 -11 -6 -3 0 0 -3 -13 0 -9 -12 2 -4 -16 2 15 -14 -9 3 -9 -5 -1 -18 -8 -1 4 -4 1 -9 -6 -12 -11 -2 -9 1 -8 -3 -4 -9 -4 -7 -10 -1 3 -7
5542 -7 -6 -7 -5 -3 2 -3 -3 -5 2 -13 0 -1 11 12 -6 2 7 5 9 14 -1 -1 15 3 6 0 -1 3 2 3 3 15 1 -8 7 -10 -6 -1 -7 -8 5 -9 -10 -3 -3 0 -6 0
5590 0 -4 -4 -13 7 -5 3 0 -8 -19 -9 -7 2 -3 -4 3 -15 3 -11 -12 2 -6 -17 -7 -14 -6 -11 -15 -9 -5 5 -16 2 6 -3 -5 5 -11 4 4 -19 -8 7
5632 7 6 0 1 4 -2 0 2 -2 -7 3 -3 10 6 -10 5 -5 -8 -10 -5 8 -2 3 -4 -9 6 6 1 0 9 -3 -2 -16 -3 -1 -6 0 -1 -2 -6 -4 -3 -3 -16 3 -3 -1 -11
5679 -11 -6 -7 -11 12 7 -2 4 -1 -2 3 8 0 4 12 15 0 -1 9 0 5 -5 -3 5 5 -7 -4 -3 4 3 -10 -9 -1 -13 -4 -15 -2 -2 -11 -2 -15 -3 -1 2 6 0 2 -2 -14
5727 -14 -7 12 7 -3 4 -9 9 11 2 -7 0 3 -4 -3 -1 7 -8 -4 -14 -5 2 8 4 8 12 -6 7 7 5 -3 3 3 7 10 10 0 -1 9 5 5 -3 -9 -8 1 7 -8 -5 4 -10
5776 -10 0 -9 -10 -18 -3 -9 -4 -4 -15 -6 -8 9 2 -5 -1 -9 0 -6 5 1 -10 -4 9 -3 -1 -3 -4 -3 -4 -9 2 1 -3 -8 -8 -3 -3 -8 9 1 2 3 -4 -6 1 -2 -6 0 -12
5825 -12 -1 -6 0 2 8 -4 2 2 -4 0 4 -11 -7 6 -10 7 -12 -1 -2 13 5 -7 5 -2 10 -7 10 -8 5 -5 3 3 14 -5 -5 4 7 8 4 -2 -7
5866 -7 -6 -7 9 1 -12 4 -5 -11 3 -4 -18 1 3 -3 3 -5 2 -15 -5 8 6 -6 4 -4 -6 3 0 0 11 12 -2 -6 -2 9 8 3 -2 -9 -6 -3 -7 -1 -7 -9 -8 2
5912 2 -5 -1 -7 -8 2 12 -2 -9 -5 10 -4 -8 -6 -4 -3 5 -16 -7 -4 7 -1 0 8 4 5 -1 9 9 -3 -8 0 -4 -7 1 -19 -21 1 -8 1 -4 -3 1 -1 7 7 -6 14 11
5960 11 13 1 1 4 6 -2 -6 -7 4 -2 4 -17 -3 6 0 2 -5 -8 -1 -8 6 0 -1 0 4 -10 4 0 2 -2 3 18 -1 -7 20 8 14 10 1 -8 -2 3 -9 6 3 1 -5
6007 -5 -13 6 -8 -1 -1 -6 -5 5 -2 -17 -4 0 -14 -6 0 -7 6 0 -2 -7 7 3 2 4 3 2 -2 1 -16 4 16 -5 -14 -7 6 -9 0 0 -9 -6 -5 6 -15 6
6051 6 -1 -5 -4 2 8 -5 -4 -6 -4 10 6 -10 9 2 7 -15 2 -14 -10 7 1 8 7 3 -3 1 2 -9 4 0 -12 1 -5 11 -5 -5 -1 -10 -5 -4 3 -4 9 1 -1 -4
6097 -4 15 -5 -5 -10 3 -3 -6 -3 -4 4 6 0 -6 -2 4 -4 -8 6 -7 -4 7 -12 -5 -5 -7 -3 -3 -2 -10 1 -1 6 4 1 -1 -5 17 14 9 0 17 3 0 5 -16 -4 3 -5
6145 -5 -13 -2 2 -3 8 4 8 8 -2 5 1 -1 6 1 -4 10 6 -2 -1 -11 -3 -1 5 -4 -4 16 -10 -5 9 5 7 9 -2 -3 -8 3 -16 -13 8 -17 3 -7 -4 -4 4 -2
6191 -2 1 7 11 -2 -5 2 -1 2 -1 2 -5 4 -6 -4 -6 -16 6 -14 -7 1 0 -6 -8 5 -3 6 9 2 -3 -9 -1 -6 -19 -11 1 5 -2 -4 5 6 9 -11 -10 8 0 -6 -7 4 -3 13
6241 13 -2 -4 4 0 2 5 5 -11 12 -1 4 0 2 1 -18 -3 5 -5 11 -14 2 -11 1 2 -8 -2 -4 -4 -2 1 1 13 -12 -4 -12 8 0 -3 -2 7 4 -7 -1
6284 -1 -18 -4 7 5 16 7 3 -2 3 -1 9 13 0 -11 -1 2 -10 0 -7 -3 -9 -3 -9 3 11 -5 -2 0 -2 -13 -1 -6 5 3 2 -9 -9 -14 6 -4 -5 -6 -2
6327 -2 -15 -10 -3 -4 11 -2 0 -6 5 0 -1 -8 2 6 10 -5 0 -6 -13 11 -8 2 8 10 7 9 6 0 10 6 -11 1 -4 -9 -5 7 1 0 -1 4 -7 7 3 4 -3 -7
6373 -7 9 4 -5 2 -18 -8 -8 -10 0 -3 2 -5 2 -2 8 3 -7 5 3 14 11 2 -6 -2 -5 1 4 2 0 -9 -6 0 11 -3 3 -5 -2 3 -2 13 0 7 4 6 8 3 3 -4 -12
6422 -12 1 12 2 -8 2 0 1 2 7 -10 15 0 -7 2 0 -7 -8 -2 -1 -7 2 4 -8 0 5 2 -2 -1 -5 9 -11 11 17 0 7 7 0 7 13 -5 4 -2 2 3 1 -12
6468 -12 -8 7 -5 12 4 -7 -7 4 -11 -3 -5 0 -12 -4 14 4 -3 -3 -6 3 4 0 1 -3 -6 -7 8 0 3 7 0 -6 -4 -5 -5 -10 -19 5 5 -11 4 -4 -4 1 -2 -12
6514 -12 5 -1 3 5 -6 0 1 4 -6 -1 5 0 -7 -3 0 -4 7 7 -11 21 -5 -1 -1 5 -4 3 -5 -1 9 -5 -4 3 -2 -8 3 -1 -15 5 1 2 7 5 1 -11 -13 -7 10
6561 10 7 2 7 -12 -2 4 -5 -4 13 -5 -8 1 10 -8 9 -2 -6 -14 6 5 -12 -4 3 -1 -2 -9 -16 -2 1 0 2 7 4 12 0 -5 5 6 -12 -12 -5 -3 -8 -13 -4 -1 -10
6608 -10 -5 -4 -1 -12 -3 -5 -6 14 13 -8 -7 -6 1 7 -8 -10 6 -2 5 2 4 -19 -1 1 -4 -2 -2 -3 -8 3 -5 3 2 -4 -3 1 -15 3 6 -5 5 4 -1 5 10 4 13 15
6656 15 9 12 16 5 -1 17 7 1 0 -7 -9 -1 0 -3 9 -11 9 9 1 -8 -4 11 1 -1 6 -9 -7 -10 -3 -3 13 4 7 14 -12 1 -1 2 0 10 0 -5 2 4 4 8
6702 8 -1 2 -5 -11 -10 -7 4 0 -3 1 -13 11 1 -3 -10 -1 4 -9 -8 0 2 -7 11 12 3 2 -5 -8 0 9 10 -1 8 -5 14 -7 -3 6 0 1 4 5 5 3 6 -4 -5 6 1
6751 1 -11 0 -1 8 24 10 -2 -9 0 0 2 3 9 1 1 -7 7 0 8 2 -9 7 14 12 -6 5 3 1 2 16 -16 -11 -4 7 -6 9 -1 3 1 -10 -2 9 -3
6794 -3 6 -3 3 6 4 -7 -15 -8 -5 -1 -1 0 -4 -2 -1 1 6 0 -7 -4 -5 2 8 7 0 -3 14 4 -9 8 12 2 -7 5 -3 5 -9 4 -1 10 7 -13 -3 9 15 4 6
6841 6 -2 5 -1 -4 -11 12 5 -1 -13 12 -6 3 -8 10 8 12 6 5 12 -4 2 7 -12 -1 1 -1 -4 2 1 9 11 8 6 -1 3 -2 -4 6 -9 6 -8 -7 0 4 3 13 2
6888 2 3 12 -11 0 15 15 9 2 -11 8 2 1 -3 -7 2 -10 3 2 2 8 -5 2 1 2 7 8 9 3 4 -4 -1 -10 0 -7 -7 -2 1 -6 10 -13 -4 5 -3 -3 -4 3 5 7 4 2
6938 2 9 0 -7 -4 5 -9 5 -16 14 8 3 10 1 3 12 15 16 15 13 -4 3 3 5 5 6 -6 -4 -1 12 -2 13 -2 -1 2 6 -10 -7 -1 -5 -1 4 -6 6 -6 0 0 1
6985 1 -3 2 -14 -10 -3 1 -5 0 4 -7 6 -5 -5 4 6 -1 7 -7 12 3 3 -9 -4 -1 -6 -6 -9 -3 -4 2 1 2 4 1 -4 4 -3 6 -5 3 -4 2 -2 2 -8 -5 -3 4 -4 4 16
7036 16 6 6 -16 10 -2 -8 -4 1 3 12 -2 -5 2 3 1 0 2 7 4 3 6 5 9 1 -6 -7 -2 1 -3 -9 -10 -19 9 9 6 12 -1 -13 5 -3 -6 -2 -3 -5 0 1 0 -9 0 6 4
7087 4 9 3 -6 -13 4 2 -2 6 3 -6 0 -9 -5 -5 -8 5 -3 -3 -1 11 1 -6 -1 -5 5 1 -5 6 2 -2 -9 0 1 -2 9 -4 0 7 -1 -3 -1 -3 -5 1 -1 2 8 0 -10 -1 3 6
7139 6 2 -6 -14 3 15 13 -3 -12 -5 1 -3 -11 0 -1 -1 9 2 2 2 5 -6 0 -9 -8 -4 -7 -9 -15 -9 10 -1 7 -12 15 -8 -18 -5 0 -1 1 5 -16 -1 10 -6
7184 -6 -10 7 -7 1 10 2 11 7 -5 3 -8 6 14 7 1 -7 3 2 -4 4 -1 -15 -9 -7 0 7 4 -8 -7 -10 6 11 -1 -3 -2 3 -5 0 -2 -6 2 4 9 -6 11 6 2 -2 3
7233 3 10 0 2 -4 7 6 4 5 -9 4 -2 -6 5 5 0 4 5 7 -3 12 -3 -2 11 12 -8 -2 -2 -8 -8 -4 -12 -3 2 9 1 7 2 -3 4 -7 -12 3 -10 -2 -11 5 -5
7280 -5 -12 -12 -5 -5 -4 -11 -7 0 9 5 4 5 -6 5 7 6 6 2 0 1 2 -1 -2 7 -1 -5 -3 10 -7 4 -3 -3 17 10 8 -7 -2 -9 -8 5 16 -2 -7 4 13 -1 6 -6
7328 -6 -5 0 1 2 13 1 12 9 1 0 5 -4 -7 0 0 -4 11 -11 -4 0 -5 13 1 -3 -2 3 8 9 10 9 4 15 6 1 6 3 -3 -6 1 5 -8 -4 3 -2 -11 -8 -4 -11 1 6 -7
7379 -7 -5 6 -2 -12 1 5 4 2 6 -8 -9 5 6 -7 2 -4 -2 5 -4 -5 -4 -3 -4 1 8 -4 0 -9 -10 5 -9 6 1 1 4 6 -3 12 -1 -7 11 8 4 13 -6 8
7425 8 14 10 8 -3 3 -2 -2 13 1 1 1 -2 13 9 -9 -3 -6 -19 -8 3 3 10 -1 5 0 5 7 -2 -4 -11 -3 6 -7 -3 4 1 -6 8 7 -1 5 7 18 3 -6 -7 -3 -5
7473 -5 1 -3 -1 -7 2 1 4 4 6 -3 -12 5 0 9 12 6 7 21 6 1 8 1 8 -7 -5 1 2 -12 8 -7 -3 -4 -3 -1 -1 3 -6 14 -4 4 -4 1 4 1 3 -10 6 -7 -12
7522 -12 8 -1 7 -9 -2 -3 4 13 -2 2 4 -5 6 -4 -3 -2 -15 3 2 -2 -1 9 -4 -4 4 -7 -6 7 7 3 10 8 4 -2 -1 9 9 17 7 -2 6 10 -7 3 0
7567 0 -1 3 10 -10 -5 2 0 0 -6 -1 -10 3 6 0 -1 -6 4 -7 -8 -1 2 2 -4 9 1 -2 -3 -3 3 -5 -3 -2 -6 -3 3 1 -4 -7 -2 -10 -2 -3 4 6 0 -6 7 9 11 11 2 -14 2
7620 2 16 -6 2 8 10 6 4 4 4 9 3 6 -7 9 3 1 -3 -10 8 1 -4 -2 -3 9 8 2 -5 -7 13 9 1 1 12 15 4 3 5 4 6 10 8 10 -8 5 2 9 1 -4 4 -3
7670 -3 8 6 -2 -2 -1 -1 7 1 -3 -9 3 10 2 -7 2 4 11 -5 5 4 10 9 -1 3 6 0 6 5 2 -3 5 -9 8 10 -10 4 1 -4 -8 1 -7 -15 7 0 0 0 -7 12 -5
7719 -5 1 10 10 3 8 7 7 -2 1 3 7 11 3 -6 10 1 -4 1 2 1 16 1 0 4 0 6 8 6 -1 0 14 7 11 4 -2 2 12 14 2 14 0 9 -4 3 -4 -6 -7 -2 -2 1 8 -5
7771 -5 2 -10 1 6 -1 13 -3 7 2 7 0 3 -1 0 13 5 3 0 1 6 -7 6 13 7 12 4 7 9 15 2 10 -19 6 -4 -7 -16 12 4 -8 -1 -10 -8 8 4 -2 1
7817 1 1 3 -4 -3 -4 -2 -1 3 12 2 6 6 2 7 9 7 4 9 7 -8 6 1 -6 -5 -4 7 5 -2 1 6 1 -6 0 0 3 15 4 -5 8 18 6 8 1 10 4 -2 -8 5 1 -1 1
7868 1 9 -9 -5 -1 -7 2 -3 -10 -5 5 3 7 -5 -2 -2 -2 -12 -10 2 8 0 3 -2 8 -4 5 8 8 -1 -2 0 -1 10 -2 -6 5 -2 4 -8 -1 -6 11 -2 7 4 9 11 8
7916 8 8 1 7 -1 1 -5 4 -3 -4 -2 -1 4 6 -5 10 -2 4 10 5 -4 -2 -6 0 -6 -2 -9 -8 2 2 0 -3 -4 8 -8 -7 -15 -4 3 -3 4 0 1 -9 -7 1 4 -3 -19 0 16
7966 16 -12 -8 6 0 4 -1 -6 1 -2 6 7 -5 -7 5 3 1 3 15 1 -2 -11 1 4 0 -2 -3 14 5 -10 -10 -5 -3 0 -5 -3 -2 3 -10 -2 -4 -9 -2 5 -8 -1 9 5 -5
8014 -5 1 -6 1 3 2 -3 -1 -3 4 3 4 4 -5 -8 -5 -1 7 5 7 -1 -2 4 5 10 0 -9 -4 0 5 5 2 3 7 1 4 1 4 5 4 1 2 10 0 -5 1 0 3 0 7 15 -4 7 -2 -4 3 10 0
8071 0 -3 2 1 4 -2 -3 1 1 3 1 11 -3 -10 0 8 0 -5 3 5 8 2 1 4 6 -4 6 2 10 -2 -5 12 5 9 -8 -8 -11 6 1 16 4 0 7 1 6 -4 1 2 -4 0
8120 0 1 -4 0 2 9 5 4 10 -1 5 0 2 3 -2 -1 7 2 -5 12 -1 6 11 -5 -3 13 -1 -5 -2 5 4 -2 -6 -4 0 10 -6 1 -1 -2 8 0 -2 1 -6 4 0 -4 8 6 8
8170 8 -2 -4 2 -4 -11 -12 3 2 2 12 -11 3 -8 -2 1 -8 5 21 14 -4 10
8191A0
##END NTUPLES=NMR FID
##END=
