##TITLE=1H_LY-856.1
 CCl4, 8 sc, 
 23.7.2019
##JCAMPDX= 6.0         $$ Bruker NMR JCAMP-DX V2.0
##DATA TYPE= NMR FID
##DATA CLASS= NTUPLES
##ORIGIN= UXNMR, Bruker Analytische Messtechnik GmbH
##OWNER= root
$$ XWIN-NMR		Version 3.5
$$ Tue Jul 23 15:09:11 2019 Russian Standard Time (UT+4h)  she@DPX200
##.OBSERVE FREQUENCY= 200.13155
##.OBSERVE NUCLEUS= ^1H
##.DELAY= (6, 6)
##.ACQUISITION MODE= SIMULTANEOUS
##.ACQUISITION SCHEME= undefined
##.AVERAGES= 8
##.DIGITISER RES= 18
##SPECTROMETER/DATA SYSTEM= spect
##.PULSE SEQUENCE= zg30
##.SOLVENT NAME= CDCl3
##.SHIFT REFERENCE= (INTERNAL, CDCl3, 0, 15.7039)
##AUDIT TRAIL= $$ (NUMBER, WHEN, WHO, WHERE, WHAT)
$$ ##TITLE= Audit trail, XWIN-NMR		Version 3.5
$$ ##JCAMPDX= 5.01
$$ ##ORIGIN= Bruker BioSpin GmbH
$$ ##OWNER= she
$$ F:/spectra/data/she/nmr/H-F/1/audita.txt
$$ ##AUDIT TRAIL=  $$ (NUMBER, WHEN, WHO, WHERE, WHAT)
(   1,<2019-07-23 15:08:12.09 +0400>,<she>,<DPX200>,
      <created by zg, POWCHK disabled, PULCHK disabled
       configuration hash MD5:
       00 E9 B6 7A A2 85 ED C7 34 08 36 98 17 FE 4E 26
       data hash MD5: 16K
       1C 2E C7 5C 5D CD 38 CF DB 31 A0 86 7A 35 A2 0F>)
$$ ##END=
$$ 
$$ hash MD5
$$ 84 69 9F 61 CC 96 2D 55 DC E3 85 BC CA B0 F2 8E
##$RELAX= 
##$RELAX= 
##$RELAX= 
##$RELAX= 
##$RELAX= 
##$RELAX= 
$$ Bruker specific parameters
$$ --------------------------
##$DU= <F:/spectra>
##$EXPNO= 1
##$NAME= <H-F>
##$PROCNO= 1
##$TYPE= <nmr>
##$USER= <she>
##$AMP= (0..31)
100 100 100 100 100 100 100 100 100 100 100 100 100 100 100 100 100 100 
100 100 100 100 100 100 100 100 100 100 100 100 100 100 
##$AQSEQ= 0
##$AQ_mod= 1
##$AUNM= <au_zg>
##$AUTOPOS= <>
##$BF1= 200.13
##$BF2= 200.13
##$BF3= 200.13
##$BF4= 200.13
##$BF5= 200.13
##$BF6= 200.13
##$BF7= 200.13
##$BF8= 200.13
##$BYTORDA= 1
##$CFDGTYP= 0
##$CFRGTYP= 5
##$CHEMSTR= <none>
##$CNST= (0..31)
1 1 145 1 1 1 1 1 1 1 1 1 1 1 1 1 1 1 1 1 1 1 1 1 1 1 1 1 1 1 1 1 
##$CPDPRG= <>
##$CPDPRG1= <>
##$CPDPRG2= <>
##$CPDPRG3= <>
##$CPDPRG4= <mlev>
##$CPDPRG5= <mlev>
##$CPDPRG6= <mlev>
##$CPDPRG7= <mlev>
##$CPDPRG8= <mlev>
##$CPDPRGB= <>
##$CPDPRGT= <>
##$D= (0..31)
0 1.2 0 0 0 0 0 0 0 0 0 0.03 0 0 0 0 0 0 0 0 0 0 0 0 0 0 0 0 0 0 0 0 
##$DATE= 1563880091
##$DBL= (0..7)
120 120 120 120 120 120 120 120 
##$DBP= (0..7)
150 150 150 150 150 150 150 150 
##$DBP07= 0
##$DBPNAM0= <>
##$DBPNAM1= <>
##$DBPNAM2= <>
##$DBPNAM3= <>
##$DBPNAM4= <>
##$DBPNAM5= <>
##$DBPNAM6= <>
##$DBPNAM7= <>
##$DBPOAL= (0..7)
0.5 0.5 0.5 0.5 0.5 0.5 0.5 0.5 
##$DBPOFFS= (0..7)
0 0 0 0 0 0 0 0 
##$DE= 6
##$DECBNUC= <off>
##$DECIM= 24
##$DECNUC= <off>
##$DECSTAT= 4
##$DIGMOD= 1
##$DIGTYP= 9
##$DL= (0..7)
0 120 120 120 120 120 120 120 
##$DP= (0..7)
150 150 150 150 150 150 150 150 
##$DP07= 0
##$DPNAME0= <>
##$DPNAME1= <>
##$DPNAME2= <>
##$DPNAME3= <>
##$DPNAME4= <>
##$DPNAME5= <>
##$DPNAME6= <>
##$DPNAME7= <>
##$DPOAL= (0..7)
0.5 0.5 0.5 0.5 0.5 0.5 0.5 0.5 
##$DPOFFS= (0..7)
0 0 0 0 0 0 0 0 
##$DQDMODE= 0
##$DR= 18
##$DS= 0
##$DSLIST= <SSSSSSSSSSSSSSS>
##$DSPFIRM= 0
$$ [...]
##$SUBNAM2= <"">
##$SUBNAM3= <"">
##$SUBNAM4= <"">
##$SUBNAM5= <"">
##$SUBNAM6= <"">
##$SUBNAM7= <"">
##$SUBNAM8= <"">
##$SUBNAM9= <"">
##$SW= 24.9336996594482
##$SWIBOX= (0..15)
0 0 2 0 0 0 0 0 0 0 0 0 0 0 0 0 
##$SW_h= 4990.01996007984
##$TD= 16384
##$TD0= 1
##$TE= 0
##$TE2= 300
##$TE3= 300
##$TEG= 300
##$TL= (0..7)
0 120 120 120 120 120 120 120 
##$TP= (0..7)
150 150 150 150 150 150 150 150 
##$TP07= 0
##$TPNAME0= <>
##$TPNAME1= <>
##$TPNAME2= <>
##$TPNAME3= <>
##$TPNAME4= <>
##$TPNAME5= <>
##$TPNAME6= <>
##$TPNAME7= <>
##$TPOAL= (0..7)
0.5 0.5 0.5 0.5 0.5 0.5 0.5 0.5 
##$TPOFFS= (0..7)
0 0 0 0 0 0 0 0 
##$TUNHIN= 0
##$TUNHOUT= 0
##$TUNXOUT= 0
##$USERA1= <user>
##$USERA2= <user>
##$USERA3= <user>
##$USERA4= <user>
##$USERA5= <user>
##$V9= 5
##$VALIST= <valist>
##$VCLIST= <CCCCCCCCCCCCCCC>
##$VD= 0
##$VDLIST= <DDDDDDDDDDDDDDD>
##$VPLIST= <PPPPPPPPPPPPPPP>
##$VTLIST= <TTTTTTTTTTTTTTT>
##$WBST= 1024
##$WBSW= 4
##$XGAIN= (0..3)
0 0 0 0 
##$XL= 0
##$YL= 0
##$YMAX_a= 30286
##$YMIN_a= -40249
##$ZGOPTNS= <>
##$ZL1= 120
##$ZL2= 120
##$ZL3= 120
##$ZL4= 120
##$ABSF1= 10
##$ABSF2= 0
##$ABSG= 5
##$ABSL= 3
##$ALPHA= 0
##$AQORDER= 0
##$ASSFAC= 0
##$ASSFACI= 0
##$ASSFACX= 0
##$ASSWID= 0
##$AUNMP= <proc_1d>
##$AZFE= 0.1
##$AZFW= 0.1
##$BCFW= 1
##$BC_mod= 2
##$BYTORDP= 1
##$COROFFS= 0
##$CY= 11.3945322036743
##$DATMOD= 1
##$DC= 2
##$DFILT= <>
##$DTYPP= 0
##$F1P= 18.9103706918063
##$F2P= -1.10871071338519
##$FCOR= 0.5
##$FTSIZE= 0
##$FT_mod= 4
##$GAMMA= 1
##$GB= 0.15
##$INTBC= 1
##$INTSCL= 1
##$ISEN= 128
##$LB= 0.24
##$LEV0= 0
##$LPBIN= 0
##$MAXI= 10000
##$MC2= 0
##$MEAN= 0
##$ME_mod= 0
##$MI= 1.114404
##$NCOEF= 0
##$NC_proc= 0
##$NLEV= 6
##$NOISF1= 3.799351
##$NOISF2= 2.8
##$NSP= 1
##$NTH_PI= 0
##$NZP= 0
##$OFFSET= 15.70392
##$PC= 1
##$PHC0= -8939.637
##$PHC1= 14.20096
##$PH_mod= 1
##$PKNL= yes
##$PPARMOD= 0
##$PSCAL= 0
##$PSIGN= 0
##$REVERSE= no
##$SF= 200.130013532006
##$SI= 16384
##$SIGF1= 3
##$SIGF2= 2
##$SINO= 400
##$SIOLD= 16384
##$SREGLST= <1H.CDCl3>
##$SSB= 0
##$STSI= 0
##$STSR= 0
##$SW_p= 3612.71676300578
##$SYMM= 0
##$S_DEV= 0
##$TDeff= 0
##$TDoff= 0
##$TI= <>
##$TILT= no
##$TM1= 0
##$TM2= 0
##$TOPLEV= 0
##$USERP1= <user>
##$USERP2= <user>
##$USERP3= <user>
##$USERP4= <user>
##$USERP5= <user>
##$WDW= 1
##$XDIM= 8192
##$YMAX_p= 0
##$YMIN_p= 0
$$ End of Bruker specific parameters
$$ ---------------------------------
##NTUPLES= NMR FID
##VAR_NAME=  TIME,          FID/REAL,        FID/IMAG
##SYMBOL=    X,             R,               I
##VAR_TYPE=  INDEPENDENT,   DEPENDENT,       DEPENDENT
##VAR_FORM=  AFFN,          ASDF,            ASDF
##VAR_DIM=   8192,          8192,            8192
##UNITS=     SECONDS,       ARBITRARY UNITS, ARBITRARY UNITS
##FACTOR=    0.0002004,     1,               1
##FIRST=     0,             0,               0
##LAST=      1.6414764,     0,               0
##MIN=       0,             -40249,          0
##MAX=       1.6414764,     30286,           0
$$ Real data points
##PAGE= N=1
##DATA TABLE= (X++(R..R)), XYDATA
0 0 0 0 0 0 0 0 0 0 0 0 0 0 0 0 0 0 0 0 -8 8 -8 8 -8 8 -8 10 -16 16 -16 16 -23 24 -24 31 -32 36 -40 44 -48 55 -60
41 -60 66 -74 82 -90 101 -113 126 -142 161 -182 211 -244 291 -355 445 -586 831 -1328 2713 -13474
61 -13474 -40249 19509 8984 -22911 23619 19626 -32506 -5064 17526 -11438 1730 16607
73 16607 -12200 -7356 10454 -3682 231 7472 -12795 -5394 15422 1401 -4529 5671 -8284
86 -8284 -14012 8736 15404 -72 -6235 -1690 -4505 -9494 7454 20473 -5961 -16983 9331 522
100 522 -16050 16614 14909 -25051 -1929 21400 -13274 -6424 19517 -12272 -14404 20540 2085
113 2085 -10517 11345 -7987 -16947 17118 7108 -10140 13432 -3646 -26272 13451 17467 -16538
126 -16538 6169 14244 -24069 -6095 24075 -5849 -11186 14389 -2453 -14067 9553 8071 -8944
139 -8944 -3073 3605 724 614 1836 1108 -4872 -6393 5527 7209 -3184 -112 527 -7881 560
154 560 7439 -932 1425 502 -9557 2551 8519 -7562 1414 9326 -13064 -3485 18264 -7507
168 -7507 -12563 15949 -1653 -15988 15367 7714 -18917 4072 10451 -12662 2440 13163 -9788
181 -9788 -5551 7871 -4027 -622 8085 -5271 -4021 5924 -3569 -1669 7964 -3791 -6066 6551
195 6551 338 -5217 4651 1869 -6062 177 4421 154 -2332 -833 1709 -934 -2260 5079 1745
210 1745 -8454 1250 7272 -5754 -1163 8458 -6029 -6534 8944 199 -5634 6343 -1011 -8031
224 -8031 5762 3208 -5277 4236 237 -8047 5566 4928 -7825 2835 4869 -9336 1284 9834
238 9834 -6311 -3917 7297 -4165 -4648 8820 1077 -7070 1508 1335 -2587 3137 2665 -2893 -1933
253 -1933 -377 828 2471 0 -1013 -166 -2267 0 3809 97 -1932 -224 -1814 450 3808
268 3808 -637 -1784 437 -2895 250 5789 -1550 -3799 3071 -2049 -3806 6917 2406 -6779 1271
283 1271 1956 -5098 3428 5978 -5437 -2793 3466 -2218 219 5089 -2522 -3659 2269 -695 -409
298 -409 4234 -1100 -3983 1321 304 -744 3612 340 -4451 -282 2011 29 1305 846 -2445 -1803
314 -1803 959 1866 1035 -659 -964 -1034 -1288 1847 3243 -1345 -2438 245 -957 324 3869 -266 -3536
331 -3536 304 160 -841 3141 1192 -3469 -410 688 -1359 2539 2507 -3483 -1707 1686 -792 1111
347 1111 3089 -2516 -3103 1803 628 -201 2440 -529 -3371 71 1410 413 1613 121 -2800 -1167
363 -1167 1297 1415 1182 -308 -2104 -1149 801 1541 1147 -435 -1554 -1048 48 1532 1759 -580 -1829
380 -1829 -929 -189 1472 2433 -647 -2613 -578 309 777 2326 154 -2796 -954 650 375 1949 1112
397 1112 -2529 -1907 713 865 1612 1255 -2212 -2439 740 1418 1082 940 -1431 -2371 188 1567 1147 779
415 779 -940 -2299 -586 1605 1788 614 -1235 -2077 -610 1470 1986 546 -1508 -1759 -316 1013
431 1013 1714 954 -1313 -1957 -398 875 1652 1338 -1232 -2432 -359 1271 1493 1099 -1065 -2453 -368
448 -368 1472 1191 820 -591 -2174 -787 1273 1341 888 -430 -2169 -1095 1335 1630 722 -637 -2004
465 -2004 -929 1334 1469 474 -518 -1589 -911 976 1351 632 -360 -1569 -1018 935 1455 730 -455 -1780
483 -1780 -918 1270 1350 301 -354 -1383 -932 1135 1231 112 -162 -1057 -1176 864 1476 197 -338 -1036
501 -1036 -1183 942 1633 -92 -622 -681 -900 718 1498 -230 -732 -257 -701 236 1399 163 -826 -553
519 -553 -519 428 1326 61 -901 -622 -434 704 1346 -354 -961 -30 -419 126 1396 -75 -1065 141 -219
538 -219 -290 1281 239 -1323 4 345 -51 1032 -83 -1722 207 997 -178 784 247 -1971 -248
555 -248 1394 -177 376 981 -1572 -1265 1208 517 40 623 -927 -1018 943 566 -229 -14 -785 -237 1334
574 1334 265 -620 -45 -1003 -636 1687 1055 -507 -359 -1270 -1130 1446 1592 72 -324 -1464 -1080 1397
592 1397 794 -384 713 -644 -1584 1457 981 -1645 359 633 -1598 1143 2301 -1741 -1621 464
608 464 -671 1042 2794 -866 -2197 -352 -841 725 2911 -88 -1629 -31 -1363 -661 2847 771
624 771 -1886 225 1 -1048 1371 778 -1873 -382 1103 522 696 -454 -1739 -474 257 1009 2353
641 2353 -188 -2717 -733 -127 -73 2937 1618 -2731 -1436 313 -602 1419 1801 -1386 -774 456 -873
658 -873 703 1144 -1779 -180 1703 -870 388 1791 -2783 -2145 2819 895 -403 1957 -1505 -3639
674 -3639 1204 2028 -21 1390 -90 -2698 -418 769 333 1739 -13 -2124 387 588 -943 1207
690 1207 454 -2243 679 2063 -1054 -493 402 -1555 -48 1915 421 78 -603 -2122 126 1511
706 1511 64 1329 433 -3264 -466 2470 -805 -79 2203 -1780 -1850 2192 3 -1330 1519 -192
722 -192 -1462 1386 420 -959 672 -879 -1071 2330 476 -1667 1061 -433 -2331 2052 1869 -2064
738 -2064 345 1056 -2310 4 2211 -575 -425 555 -1132 1 1061 -603 246 387 -1452 730
754 730 1440 -1795 -125 1744 -1606 -588 2291 -819 -1328 1462 -539 -1077 1612 66 -1015 671
770 671 -608 -412 1606 -738 -1020 1794 -695 -1664 2147 161 -2185 1707 801 -2502 988 1686 -1861
787 -1861 21 1329 -1186 43 995 -972 231 750 -1128 431 783 -1461 633 1404 -1901 -200
803 -200 1956 -1232 -732 1812 -800 -1098 1401 -271 -848 1064 -226 -651 680 -585 -125 1361 -1053
820 -1053 -879 1716 -593 -1224 1839 -305 -1903 1680 666 -1874 962 851 -1748 373 1026 -847
836 -847 591 409 -1552 417 833 -944 963 782 -2022 264 1475 -1556 55 1990 -1246 -931
852 -931 1498 -634 -842 1332 -249 -742 1004 -63 -580 334 -764 -96 1506 -349 -602 928 -1021
869 -1021 -1159 1616 351 -817 1155 -234 -1865 546 755 -431 840 154 -1106 427 -37 -1014
885 -1014 992 561 -946 975 358 -1940 349 1082 -1274 586 1799 -1202 -898 654 -1023 -97
901 -97 1908 -17 -707 310 -966 -606 1104 15 83 1167 -826 -1263 707 -168 -487 1433 345
918 345 -972 437 -200 -1293 454 901 100 611 -178 -1188 -115 4 -150 1203 548 -797 69 -442
936 -442 -1271 836 1232 -510 289 395 -1342 -397 624 -374 542 1214 -656 -684 44 -845 138 1341 -101
955 -101 -133 624 -1081 -1043 930 282 -53 1120 -228 -1272 245 133 -568 768 733 -367 34 -270 -921
974 -921 218 632 63 516 143 -850 -280 -32 -310 756 891 -422 -401 -203 -597 230 694 -73 134 234
994 234 -665 -305 232 -243 335 679 -413 -231 338 -639 -413 740 146 6 587 -560 -991 396 357
1013 357 -92 606 103 -740 -40 46 -302 539 500 -429 -126 71 -320 193 288 -333 90 427 -201 -177 26
1034 26 -270 111 420 -44 -23 74 -369 -165 255 116 264 154 -557 -263 364 25 87 266 -354 -240 395
1055 395 -116 -231 388 -67 -378 276 78 -235 263 -77 -509 307 425 -255 -17 -6 -379 207 426 -265
1075 -265 -92 210 -269 -90 372 -15 -110 98 -242 -161 376 193 -146 -116 -117 59 232 16 -59 -11 -105 48 136
1098 136 -94 88 144 -296 -71 349 -40 -84 155 -278 -101 529 -39 -411 190 -24 -261 402 128 -429 185
1119 185 129 -514 190 502 -308 -144 196 -312 23 516 -208 -358 255 30 -179 204 -1 -224 119 82 -150
1140 -150 95 167 -97 -158 3 157 124 -39 -59 -100 -48 249 99 -260 80 175 -270 46 315 -220 -33 306
1162 306 -332 -165 581 -101 -451 322 3 -329 455 50 -613 287 335 -508 115 400 -424 -62 371 -343
1182 -343 -69 525 -233 -412 323 78 -210 214 14 -314 136 233 -181 -94 191 5 -197 36 180 -78 -59
1203 -59 173 -186 -192 466 76 -515 222 291 -431 193 412 -565 1 649 -524 -287 816 -249 -552 655
1223 655 -91 -596 722 132 -880 458 515 -725 137 508 -634 5 639 -491 -254 635 -229 -444
1241 -444 426 70 -293 255 25 -385 105 307 -112 -192 112 120 -194 -47 258 -142 -162 401 -124 -484 526
1262 526 235 -721 294 477 -705 203 665 -862 -93 1038 -638 -494 1076 -355 -746 1007 -103
1279 -103 -949 1004 290 -1224 584 699 -1008 247 779 -923 -45 951 -651 -401 847 -248 -518
1296 -518 564 -33 -439 414 99 -481 114 294 -149 -147 87 101 -129 -44 233 -182 -265 503 -21 -652 532
1317 532 358 -892 271 662 -885 138 1003 -1011 -383 1327 -587 -765 1308 -276 -1061 1180 69
1334 69 -1301 1055 585 -1415 539 856 -1200 251 1011 -1099 -84 1205 -764 -550 1027 -331
1350 -331 -596 830 -66 -680 536 181 -607 177 392 -173 -130 39 19 -63 -13 264 -102 -394 397 191 -677
1371 -677 329 545 -788 63 730 -833 -57 1095 -836 -575 1296 -470 -897 1277 -190 -1173 1292
1388 1292 229 -1560 956 768 -1515 527 1141 -1346 32 1192 -1146 -298 1473 -570 -720 952
1404 952 -364 -716 922 58 -668 599 95 -734 207 261 -224 234 137 -261 -51 -65 -28 50 -93 380 263
1425 263 -659 -97 350 -593 223 1000 -667 -406 894 -831 -790 1443 87 -885 1066 -167 -1538 946
1443 946 641 -1223 880 983 -1478 7 831 -1263 191 1621 -798 -476 1055 -969 -908 1266 89
1460 89 -438 1115 -238 -1378 348 393 -376 716 543 -588 -225 -169 -445 253 533 302 155 -450 -435
1479 -435 7 -322 163 939 -6 -273 212 -923 -694 1110 303 -289 954 -358 -1480 479 263 -726
1497 -726 1356 913 -1535 -102 479 -1353 382 1654 -679 -197 994 -1304 -1067 1257 90 -225
1513 -225 1340 -274 -1397 291 -55 -598 1168 884 -634 -136 -337 -960 358 920 140 281 31 -765
1531 -765 -451 -85 141 754 418 -174 -142 -691 -584 517 267 69 930 -142 -1235 -5 8 -483 1161
1550 1161 878 -981 -87 130 -1280 203 1369 -297 87 712 -1252 -810 1042 -139 -190 1312 -200
1567 -200 -1057 401 -319 -786 1127 747 -626 237 -73 -1092 144 681 -86 505 414 -823 -484 89
1585 89 -72 504 546 -207 -104 -191 -538 99 332 64 469 75 -717 -55 83 -412 479 584 -416 93 133
1606 133 -960 -13 873 -235 48 610 -764 -534 678 -293 -233 1000 -127 -776 425 -126 -561 738
1624 738 270 -629 430 213 -770 172 374 -374 353 411 -601 -54 317 -390 93 475 -210 -2 181 -450
1644 -450 -22 441 -119 6 182 -340 7 305 -302 12 382 -299 -91 324 -335 -43 470 -329 -226 486
1664 486 -228 -284 435 -189 -280 555 -147 -517 432 63 -410 398 55 -534 314 168 -508 331 364 -477 64
1685 64 218 -417 193 446 -387 -23 346 -332 -69 332 -232 22 407 -286 -188 309 -165 -81 341 -128 -72
1706 -72 290 -258 -261 324 -9 -74 294 -201 -262 287 -90 -222 393 3 -254 217 -141 -314 399 102 -339 265
1728 265 86 -399 191 84 -353 319 271 -448 42 219 -377 115 328 -332 64 341 -417 -128 382 -158
1748 -158 -47 338 -266 -177 373 -141 -206 344 -20 -177 222 -130 -197 310 13 -218 211 -3 -158 162 -63
1769 -63 -165 265 21 -219 168 -15 -148 235 -64 -251 276 45 -316 182 69 -272 242 99 -406 200
1789 200 243 -388 82 251 -331 59 280 -394 -8 423 -266 -154 315 -198 -105 361 -183 -191 355 -77 -264
1810 -264 237 12 -145 246 -53 -231 220 34 -187 149 33 -92 197 -74 -207 212 54 -134 179 -37
1830 -37 -198 221 -29 -273 281 126 -289 130 51 -306 240 188 -381 121 248 -337 21 235 -283 55 314
1851 314 -314 -99 338 -190 -132 261 -152 -75 288 -179 -207 270 -33 -131 200 -88 -119 236 -99 -161 260 -18
1873 -18 -120 190 -124 -135 305 -67 -238 283 18 -217 247 -43 -278 348 81 -374 232 156 -352 175 170 -363
1895 -363 182 272 -404 14 294 -257 -15 258 -266 -33 319 -216 -128 269 -99 -104 176 -166 -60 239 -138
1916 -138 -106 173 -106 -28 173 -198 -13 295 -205 -111 279 -156 -78 353 -255 -227 462 -125 -325 409 -40 -356
1938 -356 412 -2 -459 417 190 -540 246 270 -429 206 306 -483 92 414 -397 -66 390 -259 -67 347
1958 347 -264 -125 361 -162 -202 245 -77 -85 181 -180 -84 239 -117 -64 160 -170 12 234 -266 -49 328 -253
1980 -253 -121 355 -246 -114 476 -311 -329 559 -98 -377 503 -71 -504 532 81 -594 490 260 -658 263
2000 263 357 -556 251 447 -615 33 550 -440 -120 481 -328 -122 507 -267 -249 423 -142 -251 326 -34
2020 -34 -135 240 -174 -219 272 -8 -85 180 -201 -107 265 -201 -92 376 -213 -171 338 -279 -209 542 -208 -380
2042 -380 562 -84 -490 468 -67 -544 659 230 -703 339 231 -743 344 560 -556 199 486 -784
2060 -784 -117 718 -329 -62 595 -468 -327 568 -236 -283 591 -52 -338 339 -128 -323 355 16 -195 346
2080 346 3 -297 66 -177 -80 468 20 -195 151 -334 -259 445 -60 -117 513 -258 -585 404 1 -370 630
2101 630 63 -663 455 172 -792 364 474 -597 344 507 -868 -64 608 -574 47 910 -422 -401
2119 -401 453 -503 -289 928 21 -469 405 -232 -535 487 178 -265 413 32 -521 140 89 -201 281 97
2139 97 -195 203 -79 -356 129 7 -24 473 -102 -447 224 -144 -348 602 196 -448 323 -92 -759 479
2159 479 486 -555 287 344 -797 114 575 -658 51 796 -557 -264 657 -502 -370 777 -197 -386 747
2178 747 -164 -729 441 122 -367 581 174 -664 165 171 -408 293 363 -292 45 66 -354 143 255 -162 108
2199 108 44 -237 178 18 -308 258 130 -288 233 45 -460 269 195 -482 307 355 -601 76 378 -554 136
2220 136 632 -597 -189 648 -432 -276 703 -292 -392 667 -200 -548 634 57 -578 441 139 -528
2238 -528 382 226 -578 227 332 -449 106 298 -360 83 296 -316 10 307 -208 -41 156 -185 79 178
2258 178 -232 38 157 -215 97 146 -277 145 227 -414 41 355 -320 12 330 -434 -95 518 -310 -216 500
2279 500 -270 -332 508 -129 -351 533 -97 -567 463 174 -456 338 111 -571 287 359 -450 133 330 -438
2299 -438 19 353 -279 32 328 -315 -77 339 -126 -79 176 -212 12 344 -148 -126 132 -200 -11 320 -77
2320 -77 -32 136 -330 -140 368 -4 2 214 -377 -268 396 -45 -155 361 -165 -356 342 -36 -339 373 67
2341 67 -413 317 207 -445 93 107 -378 321 480 -382 -158 105 -366 145 555 -134 -119 132 -426 -170 474
2362 474 107 -43 160 -291 -222 298 4 -106 202 -30 -83 191 -140 -237 146 -4 24 374 -49 -331 -35
2383 -35 -205 -61 583 220 -317 -94 -272 -281 446 340 -181 90 -97 -494 115 296 -155 154 158 -365 31 252
2405 252 -345 -103 291 -63 130 299 -381 -382 175 30 145 467 -88 -400 -91 -162 50 547 163 -254 -102
2426 -102 -208 -115 349 146 -119 120 -53 -210 123 3 -166 198 105 -101 194 -17 -410 -33 140 56 364
2447 364 100 -494 -195 87 -41 312 319 -283 -196 4 -233 94 399 -75 -171 64 -171 -33 227 -127 -128 217
2469 217 19 -85 71 -181 -168 215 96 0 170 -140 -304 57 67 74 306 -59 -311 16 42 -27 244 53
2491 53 -211 91 27 -211 148 123 -192 67 120 -194 67 125 -258 -7 246 -80 -40 91 -222 -80 240 -41
2513 -41 -85 138 -97 -153 117 -14 -40 137 -62 -162 63 18 -55 73 -38 -52 107 -46 -96 70 -9 -11 107 -93
2537 -93 -89 156 -21 -88 141 -17 -135 143 16 -131 204 65 -248 77 134 -132 120 106 -277 39 244 -148
2559 -148 -25 165 -172 -55 230 -78 -91 154 -134 -179 209 94 -83 24 -124 -153 161 154 -64 -40 -93 -95 81
2582 81 90 12 12 -102 -103 55 55 62 40 -199 -99 195 84 -20 30 -167 -143 266 119 -120 94 -90 -271 197 242
2607 242 -104 59 -33 -339 93 382 -75 -85 37 -256 2 362 -25 -161 76 -145 -119 284 98 -163 -27
2628 -27 -120 -102 268 181 -160 -176 -101 10 204 135 -79 -149 -140 5 197 78 -20 -71 -236 -73 277 127 -68 -28
2652 -28 -237 -111 361 156 -212 8 -99 -202 296 261 -235 -25 14 -273 184 413 -155 -190 53 -185 89
2673 89 453 -71 -305 44 -48 -12 327 49 -267 -26 -11 -28 257 125 -222 -154 -40 61 225 78 -192 -165
2695 -165 -74 101 222 -3 -145 -62 -134 22 283 24 -169 -32 -157 -80 390 117 -314 -13 -1 -156 318 216
2717 216 -351 -57 149 -191 153 374 -242 -232 169 -103 38 406 -112 -373 120 68 -34 275 6 -348 37
2738 37 117 -44 170 93 -234 -88 86 39 155 55 -191 -139 23 113 136 -67 -152 -20 -44 40 217 -50 -192
2761 -192 62 -57 -109 305 91 -339 16 95 -174 197 219 -370 -97 259 -149 20 288 -248 -182 263 -95
2782 -95 -77 356 -98 -339 194 85 -144 262 21 -353 104 208 -145 58 116 -202 -25 140 -27 29 70 -106
2804 -106 -63 30 48 113 -38 -159 50 39 -58 118 2 -183 84 55 -157 116 97 -213 36 92 -201 122 185
2827 185 -315 -26 268 -220 -80 310 -208 -183 360 -94 -274 312 42 -296 181 91 -230 153 128 -233 82
2848 82 156 -177 62 118 -148 86 124 -188 21 180 -102 -29 91 -91 28 122 -74 -38 22 -68 54 57 -62 125
2872 125 1 -290 62 212 -152 85 155 -332 -74 334 -122 -98 262 -152 -208 232 -34 -151 232 -90 -228
2893 -228 266 61 -237 133 -60 -257 330 257 -295 -12 82 -309 120 393 -90 -87 38 -243 -50 302 111
2914 111 2 -53 -197 21 149 -65 37 78 -161 70 207 -181 -108 118 -123 56 331 -51 -210 -77 -223
2935 -223 86 470 45 -183 -31 -341 -134 485 129 -172 174 -181 -418 298 261 -213 100 71 -277 113 217
2956 217 -274 -97 148 10 232 184 -340 -208 35 -50 309 426 -196 -325 -99 -180 165 526 74 -267 -143
2977 -143 -158 32 287 68 -12 33 -163 -9 187 -154 -118 224 -33 4 339 -182 -483 51 132 98 426 16
2999 16 -540 -173 40 50 434 221 -324 -161 -132 -205 332 350 -232 -81 90 -245 47 244 -227 -100 308 44
3021 44 -69 62 -259 -180 207 189 198 150 -327 -325 65 104 280 361 -211 -392 22 13 61 341 14 -246 47 -21 -94
3046 -94 183 29 -157 158 57 -102 124 -127 -335 210 286 -78 98 -49 -451 7 355 6 78 133 -345
3067 -345 -219 186 45 95 178 -219 -177 129 -27 -11 154 -138 -69 236 -46 -143 106 -65 -112 211 85 -99
3089 -99 44 -115 -140 198 140 -14 54 -146 -166 209 76 -93 152 -22 -210 140 98 -179 125 81 -226 59
3111 59 178 -153 -1 101 -165 59 175 -169 -58 127 -109 12 197 -150 -106 185 -93 -99 201 -30 -162
3132 -162 93 -11 -85 165 20 -152 31 23 -42 82 -40 -88 119 4 -92 76 -18 -87 149 54 -114 97 -1
3155 -1 -172 103 138 -57 86 -20 -209 102 167 -87 78 63 -212 22 167 -154 -8 183 -170 -68 213 -87
3177 -87 -135 123 -89 -73 248 5 -193 9 -53 -47 207 43 -150 22 -54 -107 160 116 -104 12 -52 -143 124 126
3201 126 -94 -31 -3 -48 109 46 -126 1 18 -50 139 90 -137 1 21 -115 173 206 -163 -98 31 -97 102
3224 102 227 -124 -123 79 -74 10 200 -60 -124 91 -80 -64 229 -22 -209 58 18 -62 158 14 -233 -2
3246 -2 90 -48 95 30 -158 -32 34 -24 112 64 -145 -32 29 -26 153 80 -172 -38 81 -25 66 88 -139 -44
3270 -44 80 -58 57 129 -108 -69 83 -53 44 168 -124 -125 140 17 -16 122 -76 -141 112 37 -56 104 -8
3293 -8 -159 25 39 -29 110 -15 -180 23 72 -34 66 3 -152 24 81 -74 33 59 -114 -30 67 -40 57 49
3317 49 -136 -22 103 -19 39 49 -146 -18 153 -47 -18 104 -102 -73 121 -10 -29 143 -60 -123 100 43 -43
3340 -43 92 -20 -107 107 46 -84 80 35 -110 61 67 -74 42 53 -110 -10 76 -16 27 4 -98 24 59 -52
3364 -52 19 30 -92 2 42 -82 27 79 -121 -47 76 -61 4 84 -109 -47 122 -52 -41 99 -65 -68 124 -45
3388 -45 -72 153 -14 -129 94 43 -80 98 26 -145 65 95 -83 37 50 -102 16 72 -56 35 64 -97 -24
3411 -24 65 -16 25 53 -100 -8 78 -30 -8 21 -63 -10 42 -57 29 62 -91 -30 55 -47 17 79 -123 -64 120 -22 -44
3438 -44 95 -72 -91 129 -17 -88 124 -5 -139 81 60 -79 94 34 -164 56 128 -80 21 75 -110 14
3460 14 110 -65 -4 86 -64 -23 84 -4 -11 50 -81 -25 98 19 -27 9 -63 -17 85 -22 -1 46 -68 -32 63 -44
3486 -44 11 79 -94 -71 125 -30 -50 90 -69 -100 147 19 -126 69 17 -100 90 60 -112 58 25 -154 64
3509 64 145 -76 17 63 -132 17 164 -65 -46 106 -42 -52 91 -2 -37 62 -5 -22 62 -8 -15 6 -60 30 117 -35
3535 -35 -62 29 -56 -7 114 -15 -70 51 -59 -68 93 11 -36 61 -77 -84 116 2 -125 101 23 -122 94 45 -184
3560 -184 51 123 -117 31 129 -123 -82 78 -58 30 144 -58 -93 32 -41 20 123 -44 -46 92 -36 -63 102
3583 102 13 -35 68 -5 -47 37 -4 -40 30 31 49 60 -112 -66 77 -21 0 135 -34 -141 63 -23 -106 143 75 -131
3609 -131 0 18 -102 45 60 -94 37 69 -107 4 59 -115 25 143 -95 -39 118 -104 -106 147 47 -38 83
3632 83 -52 -113 67 53 2 52 -7 -26 29 -41 -7 107 -11 -48 68 -23 -52 82 -7 -69 96 66 -70 20 -25 -64
3658 -64 86 23 -70 72 -6 -113 72 53 -109 84 72 -182 5 128 -102 -29 104 -74 -41 108 -47 -61 92
3681 92 -7 -33 57 -40 -35 76 -52 -25 112 -8 -65 66 -14 -49 101 17 -69 47 46 -24 33 6 -25 53 -8 -36 86
3708 86 -1 -63 100 16 -103 100 50 -139 39 109 -94 12 73 -96 5 109 -62 -20 72 -74 -5 67 -75 3
3732 3 103 -86 -57 111 -32 -54 85 -39 -73 99 13 -73 38 3 -43 53 -23 -28 58 -21 -35 82 8 -53 87 -18
3758 -18 -84 113 57 -90 40 49 -75 46 73 -77 23 42 -75 21 80 -53 11 40 -108 34 130 -74 -43 75
3782 75 -61 -37 108 -39 -75 81 -5 -69 54 -12 -40 30 -28 -19 74 -11 -68 37 -30 -12 124 23 -94 37 1 -86
3808 -86 77 61 -42 44 -3 -88 60 58 -30 40 20 -80 58 40 -98 47 123 -62 22 94 -101 -32 104 -38 2
3833 2 134 -35 -95 10 -34 24 124 -7 -55 8 -72 -58 88 37 -22 44 -54 -105 59 28 -34 42 24 -46 27 -23 -81
3860 -81 21 51 9 75 -11 -110 -2 -1 -60 126 109 -99 -25 -15 -91 80 157 -29 -21 21 -88 -1 98 -4 29 67 -78
3887 -78 -29 93 -44 -30 93 -16 -8 100 -59 -138 30 55 24 106 -9 -129 -30 -18 4 121 54 -72 -50 -60 -43
3912 -43 108 69 -66 -11 5 -54 37 31 -60 7 39 -23 27 18 -103 -25 39 3 103 63 -131 -77 33 6 91 121 -92 -97
3940 -97 39 -11 24 128 -4 -82 37 0 -2 101 -5 -94 56 41 -4 58 -33 -126 62 102 -6 32 -22 -118 -22 68
3966 68 25 51 1 -108 -57 52 41 68 -16 -122 -21 59 8 29 16 -94 -25 66 9 28 23 -95 -36 71 24 36 31 -105
3994 -105 -22 116 26 -1 49 -75 -53 115 44 -47 55 -35 -96 79 88 -18 11 -27 -88 69 109 -20 -4 -17 -63 45
4020 45 87 -25 -11 8 -52 8 74 -4 -29 -17 -46 22 85 -6 -39 -32 -45 58 81 -29 -32 -3 -60 14 104 -25 -27 36 -67
4049 -67 -26 96 3 -63 26 -8 -11 96 -13 -88 44 33 -29 73 21 -94 25 51 -29 60 60 -85 -34 51 -13 39 61
4076 61 -56 -44 58 16 16 28 -42 -2 49 4 -2 13 -48 -28 47 2 5 14 -74 -36 46 23 16 11 -76 -35 71 1 -34 40 -45 -53
4108 -53 82 11 -50 58 -23 -85 80 71 -54 -2 2 -66 64 105 -46 -36 9 -29 38 78 -25 -37 20 -38 14 100 19 -52
4136 -52 -5 -9 21 83 -6 -46 -22 -3 24 56 -17 -45 3 -25 14 69 -20 -54 -10 -47 -4 105 2 -88 5 6 2 94 2 -88 -3
4167 -3 27 -34 68 44 -90 -7 27 -26 53 70 -95 -46 51 5 41 63 -70 -58 65 20 4 57 -34 -62 28 25 28 47 -16
4196 -16 -50 6 33 44 10 -37 -47 28 23 15 26 -46 -35 31 1 -10 44 -37 -70 39 23 -25 48 -18 -92 34 53 -37 23 5
4226 5 -78 11 61 -44 6 38 -65 -27 71 -10 -3 56 -42 -35 70 14 -24 20 2 -15 53 12 -18 21 -4 -21 37 9 -2 37
4256 37 -21 -31 43 19 -14 18 -14 -20 46 -3 -49 29 6 -30 18 -7 -42 51 15 -71 9 36 -42 15 40 -59 -7 29 -44 -22 61
4287 61 -28 -36 28 -16 15 68 -20 -49 36 11 0 53 -10 -44 25 4 -1 45 24 -31 0 11 20 45 1 -51 -4 15 16 54 -22 -56
4319 -56 22 13 -3 57 19 -60 2 9 -5 50 40 -82 -29 37 2 21 26 -79 -24 66 -9 -2 29 -61 -46 48 8 16 45 -50 -69 38
4351 38 46 21 26 -22 -45 27 43 14 18 -21 -32 30 32 9 10 -18 -51 43 51 10 14 -32 -54 45 71 18 10 -28 -66 34 72 0 30 1
4385 1 -80 14 57 -14 -1 16 -60 -11 78 -21 -52 14 -20 9 82 -2 -73 -29 -29 -11 81 43 -47 -46 -53 -20 69 64 -32 -26 -15 -20 49 30
4419 30 -25 14 3 8 34 11 -29 0 12 26 74 24 -71 -42 9 23 103 57 -84 -57 16 1 53 72 -38 -48 -3 -29 6 53
4449 53 -31 -30 48 1 -22 14 -53 -65 60 69 -13 -1 -59 -97 16 84 30 20 -31 -89 -40 36 47 43 -6 -65 -31 27 5 13 6 -12
4481 -12 35 34 -18 -26 -35 -32 54 80 10 -9 -30 -83 33 98 26 10 -31 -87 -15 87 39 5 22 -42 -36 42 21 -32 11 -12 -32 44
4513 44 2 -72 -34 -14 1 75 45 -82 -79 -11 7 61 53 -44 -56 -23 -17 35 58 4 -35 -35 -14 29 38 -23 -34 -7 17 42 33 -49 -40
4546 -40 13 11 43 42 -40 -48 2 18 59 74 -20 -73 9 28 43 59 -8 -60 1 26 -3 47 -5 -65 -3 40 6 16 -5 -78 -23 34
4578 34 29 14 -21 -68 -32 39 20 -9 -20 -66 -21 33 8 10 -10 -66 -21 21 38 25 -10 -57 -31 45 30 14 7 -44 -13 50 17 0
4610 0 17 -25 -33 50 35 -1 10 -17 -23 63 46 -9 -21 -19 -33 46 55 -24 -27 -15 -45 15 63 0 -19 -9 -47 2 37 -10 -30 -16 -15 2
4644 2 25 -35 -29 7 -7 5 26 -17 -29 -3 -13 18 58 -1 -27 -15 -23 5 60 8 -24 2 -3 -10 23 14 -19 22 14 -10 23 10 -32 3
4678 3 34 -4 26 32 -40 -28 40 7 6 16 -28 -30 8 -13 -3 19 -12 -15 9 1 -9 20 -22 -23 9 -3 -6 -5 -17 -18 6 2 -30 14 -9 -10
4714 -10 7 -4 -6 19 -5 -27 10 12 -20 14 -9 -26 16 17 -16 9 26 -16 13 24 -11 5 29 -23 4 33 -5 -5 20 -16 3 22
4746 22 -11 -22 4 -7 -16 5 -21 -20 18 -1 -29 8 -2 -12 15 -16 -28 4 -6 -17 2 -14 -20 -2 -2 -22 23 8 -31 -5 12 -13
4778 -13 27 8 -26 4 5 -18 15 22 -10 3 13 -19 14 40 -23 3 26 11 13 26 -29 -12 32 0 5 21 -11 -22 22 2 -3 21 -8
4811 -8 -33 12 23 4 23 -16 -41 8 17 -3 3 -17 -33 3 8 -25 2 -9 -43 6 14 -3 0 -6 -40 -1 40 -1 -8 4 -41 8 39 3
4845 3 -5 16 -26 -8 41 11 4 9 -14 -11 45 18 -12 2 -23 -9 48 17 -15 -1 -1 -3 37 14 -25 -3 -19 -14 25 32 -12 -15 -5 -8 36 29
4881 29 -22 -24 -4 -20 28 14 -27 -19 -12 -19 18 38 -24 -30 -13 -23 34 32 -21 -37 3 -5 16 34 -17 -44 15 4 12 41 -6 -35 3 11 12
4916 12 41 -3 -55 -10 25 8 32 -9 -29 9 22 1 6 8 -31 -13 19 10 23 -9 -49 -30 17 6 13 -10 -47 -9 26 7 8 -13 -45
4949 -45 -13 29 -1 12 10 -45 -26 19 0 -2 4 -41 -26 27 31 -3 -5 -23 -14 37 27 -9 8 -10 -34 27 35 4 9 -15 -17 34 44 -6 -18
4984 -18 -6 -16 34 32 -10 -6 -10 -14 18 32 -11 -10 -13 -18 22 37 -2 -27 -9 -19 6 38 -38 -23 -12 -18 6 14 -6 -33 -6 -19 -10 36 3
5019 3 -29 -19 -5 15 48 5 -37 -11 17 0 27 7 -24 15 13 -2 26 23 -23 -19 9 11 26 15 -18 -13 34 7 11 6 -25 -5 16 2
5053 2 10 31 -21 -18 9 10 -2 10 -15 -37 0 4 -4 -6 -12 -17 21 0 -9 2 -23 -15 22 10 8 0 -14 -36 17 23 -8 3 7 -32 23 25 -4 7
5091 7 11 -14 16 26 -7 13 21 -1 9 31 7 -2 5 -16 10 30 -4 -23 -14 -5 10 25 19 -15 -8 0 -12 14 4 -10 -2 -12 -20 8 -11 -23
5127 -23 -13 6 -10 9 -4 -20 -8 2 -6 3 -2 -9 -13 2 -9 -3 12 -23 -9 -3 -18 3 16 -12 0 20 3 -4 25 -2 8 21 11 0
5161 0 9 -10 -12 15 16 -5 7 -10 -14 10 7 -10 -3 -5 -5 10 1 -12 8 5 -16 6 7 0 9 -9 -25 0 18 -5 -6 16 -1 -2 10 -5 5 11 -5
5200 -5 -8 9 -16 -10 8 -10 -7 17 1 -10 8 1 2 31 15 -1 18 -1 -21 14 22 8 10 4 -9 22 11 -9 6 9 -7 19 17 -7 17 14
5236 14 -10 -13 6 -12 -8 0 -19 -10 -4 -11 -17 -1 2 -3 0 -12 -9 4 -22 -13 12 -2 -8 5 -9 -13 10 11 0 6 -10 -3 8 7 4 13 12 -2 18 22 -1
5277 -1 17 14 -7 0 24 10 2 23 -8 8 25 -10 -9 14 -3 -1 9 4 -6 3 -16 -10 2 14 -18 -15 -12 -10 -1 6 -14 11 -1 -13 4 -12 -4 -6
5315 -6 -5 1 11 11 -17 -11 -11 11 21 9 -8 -1 -1 -15 22 16 -2 9 3 -20 8 29 10 2 8 -10 5 16 -14 -7 25 -1 8 16 1 -3 26 3
5353 3 -4 14 5 -23 -8 2 -2 22 21 -25 -11 0 -10 12 2 6 -11 -8 -20 -15 3 -1 -1 4 -4 16 6 -14 9 10 4 11 2 -29 -6 14 -2 12
5391 12 18 -8 -3 -1 -15 9 42 7 -11 15 -5 -2 17 6 -1 22 4 -20 4 6 -6 6 12 -11 3 4 -13 -10 9 3 2 -3 -26 -2 6 -4 2
5428 2 -15 -18 -3 -12 -10 12 -1 -20 0 -1 -2 7 -3 -20 -3 16 -11 -10 10 -11 5 24 -8 -5 24 -4 -14 28 14 -4 22 6 -19 24 19
5463 19 -5 3 10 -1 9 18 -7 0 4 0 -6 14 2 6 15 -8 0 5 -7 -14 -2 5 7 0 0 -5 2 -7 11 -3 -14 3 4 -10 -3 9 -29 -4 8 -2 -1
5504 -1 18 -6 -14 23 4 -9 18 -2 -9 24 17 -6 10 17 -22 8 27 12 13 12 -10 -5 19 8 9 13 12 5 15 -6 2 7 9 8 -5 -8 3 0 -25
5543 -25 10 12 -6 -2 -14 -27 6 5 -13 4 14 -30 -3 18 -10 -18 21 -15 -22 20 -6 -25 9 2 -15 13 26 -13 -3 9 -9 20 15 -2
5577 -2 5 14 -4 -4 9 5 -3 -6 3 9 6 10 4 -1 8 19 3 1 1 0 -7 7 -1 -5 -7 -3 -13 4 19 -15 -4 5 -9 -4 16 -12 -11 8 -17 -9 7 13 -19 5
5621 5 -3 -28 -1 4 -19 -7 17 -3 8 -2 -2 -4 10 -1 2 13 12 3 13 2 -3 9 4 -13 7 2 3 11 3 1 -2 7 18 -4 -4 4 7 -20 9 11 -6
5662 -6 -1 9 -4 -13 15 -13 -19 2 -15 -9 4 -8 -18 -4 6 -19 0 -1 -17 -5 1 -12 -3 15 -9 2 8 -1 -8 16 -6 -7 13 12 5 14 9 1 17
5701 17 4 13 3 9 10 -7 2 12 1 6 7 12 -1 8 21 9 19 11 -11 16 13 2 0 0 -1 -4 11 9 -14 4 -7 -9 -6 -1 -24 -2 -5 -17 -6 13
5741 13 -18 -6 3 -13 -4 -4 0 2 6 8 -3 10 2 5 2 2 -6 10 8 2 3 5 12 9 0 7 16 -1 2 2 -1 7 14 4 13 14 6 6 13 3 4 13 5 -5 15 -7 -14 -2
5789 -2 1 -17 -4 -5 -13 -9 15 -9 -11 14 -9 -2 1 -3 -15 6 -7 -1 2 6 -1 15 -3 -4 15 13 -6 1 0 4 15 -11 14 2 11 3 -2 9 16 9 18 3
5831 3 15 6 3 -2 3 11 1 6 -4 5 6 -8 8 16 -6 -13 6 -11 2 5 -8 4 1 -5 -8 -1 -3 -17 2 -3 -23 5 -13 -11 7 4 -12 14 3 -9
5871 -9 6 25 1 22 4 15 9 3 5 7 8 10 17 8 10 9 14 17 8 11 -5 7 4 0 4 22 13 13 4 -10 -11 17 1 -6 9 -16 -14 -8 -9 4 -3 -5 -6 -6 -22
5916 -22 -16 -1 2 -6 -10 -3 -9 -13 9 -6 -7 0 -10 -11 -1 -19 -1 11 -9 0 2 -6 -8 -6 1 -1 13 3 -6 5 3 8 7 8 8 16 -5 -8 2 -8 0 0 3 -4 9
5961 9 10 6 8 -3 -1 10 -3 -20 -2 -9 -12 1 -5 -3 0 3 -10 -1 -2 -12 -16 -4 -28 -2 -5 1 -10 2 -5 -6 3 -19 -5 13 7 2 0 -2 3 3 -5 -18 7
6004 7 6 -5 -2 8 -6 1 13 14 12 -2 1 -6 5 -9 9 7 4 11 -5 -15 -14 -5 -13 -1 -5 -4 -10 3 -17 -7 -6 -4 -7 -4 -10 -11 -8 -13 -12 -7 -14 -15 -5 -8 -8 -2
6050 -2 -12 -9 10 -5 0 -10 -8 -2 -1 11 -4 4 1 -9 17 4 -6 8 10 -5 2 13 5 21 9 9 10 4 3 3 4 10 -8 0 -14 9 5 1 4 -4 -17 -9
6092 -9 9 -7 -9 -3 -17 -17 -20 -13 3 -1 -15 -12 -2 -10 -11 -3 -6 -19 -4 -12 -4 -6 -4 -12 -6 0 2 -3 -1 -6 0 5 1 1 -4 -4 0 10 3 18 5 -3 1 10 -4 -6 -1 -6 7
6141 7 15 1 -2 4 -3 -12 7 -8 -18 -3 -12 3 -13 -2 -1 -6 -14 -14 -2 -5 3 -5 -8 -12 -2 1 -2 -11 -13 -8 3 -4 -2 -7 -10 -11 11 7 -7 -9 0 -5 -5 17 5 -8
6187 -8 6 -16 11 9 -9 10 -10 4 -4 6 3 -7 4 0 7 4 -4 -14 -4 -10 -3 -2 -1 -8 -12 -16 -5 0 -11 -2 -6 -11 -17 -3 -9 -16 -13 -10 -9 3 -13 -5 -9 -14
6231 -14 -8 -3 -17 2 -8 -8 -5 -5 3 2 5 4 3 -3 -7 3 -5 5 1 16 -4 -2 -3 1 -10 4 7 -4 3 -4 4 5 -1 -7 -8 -4 0 -2 7 -9 -21 0 -3 -4 -1 -8 -13
6278 -13 -5 -4 -13 4 -2 -9 -2 -15 2 -4 -13 -3 -20 3 0 -3 -6 -10 -8 -7 -3 5 2 -5 11 20 9 -8 7 4 2 11 8 16 14 -5 10 2 8 18 13 4 0 8 3 -7
6324 -7 3 -6 -1 -9 5 -2 7 5 4 2 -3 -4 -11 -12 -9 -9 -11 -9 -5 -13 -12 -4 -2 -10 2 -6 -7 0 -5 -4 5 4 -7 -11 5 -1 3 1 3 7 -3 6 -5 -10 -5 5 6 -1 3 2 4 7 -4
6377 -4 14 6 4 -2 -6 -1 -3 -7 -4 0 -11 -8 -11 4 -5 0 -5 -8 -2 -17 -20 -16 -14 -19 -16 -17 -13 -1 -5 -13 -14 -15 -7 -15 -3 -9 -16 -14 -6 -9 2 -7 -10 -4 -7 4 6 -5 -6 -8 4
6428 4 6 1 -5 4 1 8 -2 -2 -9 7 0 2 16 6 -6 5 2 5 9 7 10 -15 1 -8 3 -5 2 6 -7 -9 -14 -17 -11 -2 -10 1 -6 11 -14 -8 -13 -9 -7 3 8 -4
6474 -4 6 -5 -1 -5 -11 -13 -10 -5 0 9 -5 8 10 -2 11 10 7 8 3 15 0 2 8 1 0 0 -4 12 10 10 -9 9 11 17 5 -1 -4 -9 -4 2 -4 -18 -3 -8 -8 0 -6
6521 -6 -6 -9 -24 -1 4 -7 -1 -9 -8 -5 5 3 -5 -20 5 1 0 9 0 -2 -1 -3 4 0 1 -3 -4 3 3 -2 1 -5 -1 -1 16 10 11 -3 8 6 14 17 -7 8 -9 -2 -6 -2 -1
6570 -1 -3 -8 1 -5 -10 -6 -9 -13 -4 -7 -10 -9 -4 -2 -14 -2 -18 -1 -2 -4 -14 -4 -11 -11 -1 -7 -4 -2 2 8 0 -8 5 -1 3 3 -2 5 1 -7 2 12 -3 4 11 2 -8 7 18
6619 18 5 1 7 -1 1 2 -3 0 -7 1 -1 9 8 6 7 -1 1 -2 1 -7 -8 -2 -1 -14 -2 -1 -3 11 -6 -4 -2 -2 1 7 3 -13 -9 -5 1 0 -13 -2 7 4 -4 5 1 6 10 10 4
6670 4 5 11 4 11 15 20 7 6 3 0 3 7 3 8 10 7 6 7 12 -11 -1 5 13 -1 9 -10 1 -3 -2 -9 -16 -6 -1 -3 -6 -7 0 0 2 -14 -5 -7 -10 -15 -8 -10 2 9 -7 -3
6720 -3 -8 -11 -16 4 -8 3 5 -5 2 2 -3 -2 -3 -5 5 4 15 7 3 4 -1 5 -1 0 -3 10 10 15 1 3 -5 -7 4 -12 -12 -11 -8 -4 2 -13 -3 -6 -9 5 -1 6 -10
6767 -10 -12 -3 -16 -16 1 -10 -6 -18 4 9 -4 -7 -13 -3 -7 -7 3 2 4 -1 1 0 3 1 3 9 16 0 15 14 7 -5 5 11 9 18 2 -1 -5 6 4 7 6 8 -10
6812 -10 -2 -4 -9 -5 -10 1 -7 5 -4 -7 -9 -22 -2 -8 -11 -11 -14 -11 2 -2 -1 -9 -10 -9 -6 -13 -15 3 -7 -3 -1 -11 -2 4 6 -5 2 -4 -1 9 -1 5 9 16 -5 -5 0 -4
6860 -4 15 -8 -14 2 11 6 0 5 6 -12 -5 9 1 5 -7 5 -8 -9 -5 3 -17 7 -2 -4 2 -7 -11 -13 -8 -8 -15 -2 0 -3 -5 -4 -12 -1 -1 -21 -6 -5 6 -11 -1
6905 -1 -10 -1 -1 -4 5 2 7 14 1 3 0 -6 -4 4 0 4 0 -10 -5 -2 -2 1 16 3 -1 -2 -3 3 -8 6 -3 1 -3 2 -9 -5 -8 -18 -7 -13 -11 6 9 0 -11 -3 -8 -14 -8 -3
6955 -3 8 5 -11 -13 -3 -4 -4 -3 8 0 -1 -1 3 -1 -2 -1 -5 6 3 -1 -2 5 0 1 -4 0 5 -1 5 1 5 5 8 -5 10 5 -1 4 -9 -3 -4 -6 -1 -6 1 -6 -3 -12 -11 2 -15
7006 -15 -9 -13 1 1 -2 1 -15 -16 -10 -9 -3 -9 -2 -7 -17 -14 -14 1 -4 4 -8 6 -11 8 -1 -9 2 1 4 -1 -1 5 2 12 12 8 7 4 -5 3 3 4 8 7 -1 11 -7 -7
7054 -7 3 -6 1 1 -4 4 6 -13 -11 14 -3 -9 -8 -22 -12 -11 -9 1 12 -8 -3 -16 -12 -12 -14 -3 -10 -11 -7 -6 -2 -6 -6 5 -11 -8 -1 -9 -2 7 7 7 0 8 -4 -4 0
7101 0 2 1 -3 7 0 -3 3 2 1 -7 -3 -1 9 -1 2 -7 -4 -8 -2 -2 -8 -7 -9 -15 -15 -7 -11 5 0 -12 -13 -12 -15 -2 -17 -12 -5 -4 -1 -7 -9 -8 0 0 0 -4 -5 -8 -8 -10 -1 8 -1 7
7155 7 -7 5 5 2 -8 2 6 -1 -3 7 9 1 7 8 7 4 -2 -8 1 -7 -2 0 4 -7 -4 -3 -4 -8 -12 -16 -13 -12 -23 -20 -6 -12 -6 -7 -5 -13 -10 -23 -15 -6 -21 -5 -13 -14 -21 -5
7205 -5 -5 -4 -6 -4 -9 -13 -2 -4 4 -6 -7 -8 -5 -4 -4 2 4 -3 7 -6 2 3 1 0 -11 -16 2 -6 -7 -10 1 -7 3 17 -3 -6 -7 -9 -8 -13 -2 -10 -8 -15 -16 -12 -7 -24 -11
7254 -11 1 -26 -6 -11 -5 5 -12 -5 -14 -2 -10 -12 -7 -9 -11 -2 -2 -6 0 -8 1 2 1 1 -4 -1 -1 2 11 7 0 1 15 8 -1 4 -5 -2 7 3 -2 -1 -11 -4 -7 14 -6 -6 -8 -15
7304 -15 -9 -4 -4 -9 0 -8 -11 -11 -7 -18 -15 -16 -2 -1 -14 -21 -8 -3 -8 -8 -12 -8 -2 2 -5 -3 -3 -6 -12 1 -4 8 -2 -2 -1 -8 3 7 0 -2 -5 2 20 8 -13 -1 -4 -5
7352 -5 2 1 6 -9 -4 2 -8 -5 1 -3 -11 -2 -4 -4 -4 -9 -14 -7 -10 -10 -11 -7 -5 -15 -8 -13 -3 0 -21 -8 11 -5 2 -9 -3 -9 6 -2 -2 -17 -7 -6 10 -4 -3 15
7398 15 5 6 12 5 2 -7 -8 -6 2 9 -3 -13 -2 6 5 -2 1 2 9 -2 0 -3 -10 6 -12 -15 -1 0 0 -1 -4 -8 -2 1 -8 0 -3 -7 -5 -3 -12 -4 -4 1 -8 -4 -10 -18 -1 -10 -8
7449 -8 1 -3 2 -7 -8 -3 -7 -5 -7 1 -2 1 4 4 -1 13 8 -6 3 -4 -2 4 12 -4 -6 -5 0 11 -5 -4 -13 -7 3 6 -2 4 -6 -10 -18 -10 0 -7 -9 -10 -6 -22 -5 -1 -25 -9
7499 -9 -14 -7 -14 -16 -17 -8 -1 -24 4 -10 -3 -1 -8 5 2 -2 1 10 13 2 -5 -1 4 10 4 7 10 2 8 11 6 -3 7 2 -3 6 10 -2 -7 5 -4 -7 -4 1 -16 -10 -9 -11 -11 2 -9
7550 -9 -4 2 -9 -3 10 2 -9 -15 -7 0 4 -4 -1 -11 -9 -4 -14 -15 3 -10 -8 -2 2 12 -12 6 0 5 8 -1 4 -3 2 6 7 6 1 3 6 12 23 11 15 -5 3 0 -4 6
7598 6 5 -3 0 -2 2 -2 -4 2 -2 -15 2 -11 3 -10 -7 -4 -5 1 -10 -5 -19 -5 0 -3 -6 -1 -12 -9 -4 3 -15 -1 -2 -10 7 -4 2 0 1 11 5 11 3 7 5 2 10
7645 10 0 21 6 1 4 7 -1 0 3 2 7 15 8 -10 3 -12 -10 2 -5 4 0 -11 -10 -2 -14 -3 -10 -5 -13 -4 -9 -10 -19 -3 -19 -13 -4 2 -7 -5 3 -10 0 -5 -1 -12
7691 -12 -8 -2 5 4 0 0 7 7 6 1 5 4 17 0 1 4 17 16 21 10 6 9 0 10 -1 5 -4 2 8 -9 5 -5 8 -2 5 -4 1 -1 -11 -12 -6 -7 -10 -10 -9 -5 -5 -13
7739 -13 -18 -5 -7 -11 -3 -3 -9 -1 -6 3 -3 5 3 4 8 1 13 -4 14 -8 -8 -1 6 7 2 4 2 4 -1 10 15 3 -13 15 1 6 17 7 13 7 0 4 -2 7 5 4 5 -6
7787 -6 -3 1 -6 3 1 2 -20 -2 2 -10 -3 -1 -4 -17 -16 -12 -18 -4 -9 -10 2 -2 -5 -6 -1 -12 -3 8 0 -2 -10 -2 4 -8 5 -1 12 -7 7 10 5 20 4 10 -5
7832 -5 19 3 2 6 6 7 11 6 3 -13 -4 -2 -1 -16 2 2 -9 -6 -12 -1 -3 -4 0 -11 -18 -2 -8 -5 0 -10 -15 -4 -18 3 -14 0 -4 1 0 -9 8 -3 2 18
7876 18 -4 -1 1 15 9 3 3 7 10 1 18 11 5 2 8 20 19 11 9 5 16 1 19 10 6 3 11 13 4 4 -2 -2 11 -8 -4 -4 -6 0 0 -9 8 0 -6 -8 -12 -11 -10 1 0
7925 0 -7 4 8 3 -6 2 -18 -10 -7 2 2 1 1 -8 5 8 4 6 -3 12 1 7 2 13 6 4 14 8 17 12 3 14 18 6 -8 3 -1 5 9 0 3 2 -7 -3 1 -5 4 -8 -3
7974 -3 -13 5 -4 -3 -6 -10 5 -1 -2 -9 2 -5 -12 -2 4 2 3 1 -3 1 -7 -2 5 1 0 -12 2 14 -2 10 13 3 6 8 4 11 10 8 17 23 20 10 8 10 2 7 6 -7
8022 -7 -9 2 15 -3 7 2 6 -1 2 13 0 0 -3 -8 -5 -4 -10 -11 -3 -5 -10 -11 -12 -10 4 -13 -5 -7 -9 -16 -6 0 0 -5 2 -3 -6 3 3 1 -1 -5 -4 -1 7 5 15 9 13 4 12
8073 12 12 11 5 5 6 20 3 0 9 10 1 -4 4 -9 5 2 4 -2 9 -9 -3 -13 -10 -3 -6 -4 -7 -27 -6 -9 -4 -3 -21 1 0 -6 -6 6 -2 -4 -4 1 -1 1 7 0 4 3
8121 3 2 2 14 9 1 6 -11 6 16 -9 5 18 14 15 17 4 9 5 -3 1 9 14 7 4 -14 1 7 6 -5 -7 3 4 0 -5 5 -3 -6 -7 -10 -14 -11 -3 -13 -2 -11 -8
8167 -8 -7 -4 -4 -2 1 -2 -12 -2 1 -7 3 -3 5 2 -2 -4 -5 2 -7 -9 9 -6 8 7
8191G
$$ Imaginary data points
##PAGE= N=2
##DATA TABLE= (X++(I..I)), XYDATA
0 0 0 0 0 0 0 0 0 0 0 0 0 0 -5 8 -8 8 -8 8 -16 16 -16 24 -24 25 -32 37 -41 48 -56 61 -69 77 -89 97 -106
35 -106 121 -134 150 -166 182 -202 224 -247 273 -304 336 -376 417 -465 522 -590 666 -764 883
54 883 -1039 1248 -1547 2011 -2830 4708 -17222 10536 30286 -23995 10881 21255 -30657 -14420
68 -14420 27652 -4535 -6745 15535 -7991 -13596 13105 883 -5643 6309 -6767 -7038 16130
81 16130 3458 -11103 1554 -2630 -10250 10488 15981 -4501 -11908 -2491 220 -2746 7026 16208
95 16208 -6633 -20837 6727 9695 -12956 8745 17051 -22224 -9549 24805 -6241 -15044 17881
108 17881 -3273 -18206 18553 8805 -17613 4984 1167 -15751 14580 14080 -15298 2808 3285
121 3285 -22054 9421 24703 -15744 -6270 16074 -17003 -10901 26355 215 -18473 11054 3808
134 3808 -15351 6998 11314 -10117 -5176 6518 1714 -961 383 -570 -3462 -3788 5631 7819 -4608
149 -4608 -4403 1685 -4461 178 9006 -779 -3593 915 -6256 643 10370 -5057 -4293 9239 -7565
164 -7565 -7382 16890 -1797 -16806 12522 6065 -17152 9278 12661 -18771 -1838 15875 -9154
177 -9154 -3858 14093 -7238 -10096 9887 495 -4476 7092 -2839 -6925 6334 218 -4225 6505
191 6505 -1177 -7766 5690 3398 -6351 2506 3573 -5856 -538 5466 -245 -3276 -650 1777 335
206 335 -1972 2846 2261 -7141 -576 8563 -3506 -4676 7540 -2654 -8167 8260 3712 -7983
220 -7983 3386 2402 -8025 3908 6307 -6233 592 3139 -6921 2863 7343 -7337 -1287 6963
234 6963 -6605 -1930 10496 -4199 -7498 7379 -218 -6283 7223 2802 -8712 387 4369 -2215
248 -2215 1376 2740 -3635 -2377 1371 1376 1799 -337 -2160 -161 -646 89 3436 57 -3291 -158 70
265 70 308 3225 -572 -3327 585 -488 -174 4807 -859 -5459 2325 1099 -3642 4928 3425 -7561
281 -7561 -783 4735 -3369 967 6060 -4981 -4835 4852 275 -1603 4149 -1679 -4904 2694 1643
296 1643 -1412 2844 -483 -4646 1368 2436 -1066 1884 470 -4516 -294 3540 213 -248 330 -2246
312 -2246 -1377 1922 1987 158 -1398 -1338 -219 -13 1584 2481 -1739 -3249 779 909 130 2670 -345
329 -345 -4166 210 2067 -543 1741 1094 -3761 -972 2314 -441 1069 2121 -3390 -2385 2862 591
345 591 -256 2116 -2077 -3437 2387 2120 -991 1032 -326 -3279 391 2704 270 172 -272 -2552 -656
362 -656 2327 1460 0 -1004 -1943 -475 1665 1540 237 -1145 -1621 -361 955 1482 965 -1222 -2095
379 -2095 -208 995 1376 1445 -1211 -2865 -26 1677 845 1149 -404 -2948 -685 1961 847 775 355
396 355 -2588 -1723 1827 1619 558 189 -2197 -2089 1660 2193 260 -277 -1516 -1886 938 2241 590
413 590 -451 -1269 -1769 266 2244 1341 -557 -1745 -1551 395 2041 1484 -503 -2000 -1376 673 1630
430 1630 1184 -48 -1752 -1705 528 1648 1195 218 -1673 -2160 482 2107 1089 -96 -1487 -2045 366
447 366 2225 930 -362 -1081 -1739 -113 1980 1235 -244 -1064 -1761 -350 2004 1551 -340 -1286 -1578
464 -1578 -180 1904 1384 -468 -1147 -1227 -230 1511 1318 -196 -1005 -1276 -367 1472 1422 -143 -1092 -1400
482 -1400 -266 1706 1318 -532 -983 -993 -334 1441 1260 -548 -835 -705 -571 1104 1513 -385 -1044 -720
500 -720 -490 1103 1576 -560 -1301 -374 -174 800 1364 -535 -1288 -68 12 310 1183 -59 -1270 -394 154
519 154 545 1074 -228 -1294 -363 269 724 1025 -567 -1324 132 305 118 1043 -87 -1394 82 483
537 483 -225 839 302 -1449 -115 930 -66 362 2 -1529 164 1541 -193 -139 194 -1555 -272
554 -272 1929 109 -565 579 -1156 -1240 1565 1009 -602 91 -581 -965 1040 873 -683 -264 -280 -155
572 -155 1175 265 -1170 -205 -188 -243 1581 939 -1310 -876 -467 -379 1636 1582 -803 -1120 -905 -511 1626
591 1626 1196 -921 -70 -155 -1324 1106 1451 -1661 -329 1309 -1015 276 2073 -1693 -2172 1296 612
608 612 418 1953 -1200 -2923 264 811 714 2219 -444 -2692 -113 129 -283 2435 874 -2599 -370
625 -370 950 -755 778 1009 -1749 -531 1655 384 -257 -589 -1480 42 1313 898 1130 -743 -2980
642 -2980 -408 1556 551 1782 916 -3249 -1815 1608 508 769 1473 -1573 -1515 967 -108 112 1236
659 1236 -1295 -731 1981 -364 -857 1361 -1740 -2081 3195 1779 -1768 455 -797 -3151 1607 3261
675 3261 -568 -303 -200 -2495 -187 2022 466 624 -131 -2253 88 1492 -738 365 856 -1866
691 -1866 110 2332 -1022 -1445 777 -609 -126 2057 180 -1145 -613 -1309 407 2221 69 -200
707 -200 138 -2584 -603 3190 -27 -1319 1626 -1006 -2284 2168 1017 -1894 923 618 -1676 919
723 919 1020 -1402 182 125 -963 1807 916 -2268 217 686 -1838 1426 2377 -2259 -894 1623 -1515
740 -1515 -482 2547 -367 -1428 628 -525 -331 1299 -353 -494 611 -958 92 1626 -1347 -917
756 -917 1936 -776 -1266 2148 -148 -2014 1256 400 -1383 1269 597 -1519 378 220 -685 1269 -91
773 -91 -1512 1362 234 -1920 1546 1051 -2375 819 1636 -2288 148 2270 -1595 -841 1752 -752
789 -752 -660 1268 -628 -442 1016 -804 -209 1140 -1039 -151 1591 -1370 -912 2116 -571 -1476 1669
806 1669 -85 -1605 1234 406 -1256 781 292 -1017 562 57 -535 1105 -452 -1284 1488 187
822 187 -1638 1321 524 -2055 1098 1407 -1957 171 1456 -1526 -193 1570 -730 -242 710 -1257
838 -1257 3 1406 -742 31 976 -1669 -361 1936 -939 -741 1938 -750 -1617 1494 110 -1251
854 -1251 1153 306 -1126 737 295 -954 281 -55 -277 1297 -99 -1260 628 -251 -1143 1503 892
871 892 -1338 398 211 -1738 464 1496 -517 111 324 -1187 94 634 -784 613 964 -1090 152
888 152 681 -1655 -17 1749 -783 -230 1655 -1084 -1555 1018 -38 -301 1716 32 -1489 124
904 124 -242 -509 1273 445 -565 591 -586 -1451 822 674 -562 979 461 -1413 -45 345 -933
921 -933 487 1306 -206 -180 -247 -1139 2 749 54 735 395 -1226 -410 152 -714 771 1472 -700 -571
940 -571 381 -1012 -451 1162 87 18 891 -753 -1150 356 -65 133 1337 -79 -883 292 -587 -929
958 -929 1197 835 -458 473 -184 -1422 221 798 -371 470 738 -695 -465 -21 -556 331 957 -33
976 -33 -64 -16 -862 -284 494 61 523 682 -718 -796 60 -140 284 804 -138 -336 112 -527 -340 527 96
997 96 81 537 -429 -578 353 -246 -382 824 347 -414 189 -366 -897 545 784 -232 172 69 -819 -105
1017 -105 454 -102 322 464 -547 -376 253 -124 85 379 -256 -104 411 -208 -349 130 -49 65 417 -93
1037 -93 -280 23 -227 -130 387 166 -21 0 -488 -262 496 174 -153 135 -275 -322 406 79 -334 273 86
1058 86 -424 197 250 -310 90 87 -436 203 502 -323 -249 125 -212 118 455 -261 -300 237 -103 -137 377 47
1080 47 -270 55 -88 -125 355 197 -299 -161 15 97 235 -11 -171 -28 -26 24 148 -89 -29 139 -205 -122 358
1103 358 5 -256 101 -91 -136 430 30 -533 120 206 -248 244 209 -475 15 305 -380 46 545 -286 -361
1124 -361 269 -92 -86 445 -130 -465 258 194 -232 112 83 -232 67 165 -141 30 165 -111 -160 61 172 66
1146 66 -110 -109 -26 2 194 100 -279 -30 229 -173 -71 324 -143 -199 284 -145 -266 500 28 -584 234 234 -370
1169 -370 237 209 -596 107 490 -440 -117 492 -313 -269 445 -154 -247 480 -99 -522 303 265 -287 80 107 -297
1191 -297 78 287 -172 -144 191 51 -197 14 201 -48 -142 124 -56 -185 331 154 -520 67 447 -347 -66
1212 -66 471 -418 -237 657 -262 -507 721 28 -749 483 251 -686 424 403 -869 185 744 -663 -210
1231 -210 660 -449 -279 690 -280 -483 597 -18 -584 358 240 -394 111 152 -347 49 352 -124 -237 106
1251 106 138 -163 -93 245 -16 -235 268 55 -483 336 401 -668 34 660 -525 -176 736 -562 -425 1015
1271 1015 -286 -838 928 76 -995 756 370 -1086 588 674 -1202 166 1049 -878 -236 976 -652
1288 -652 -436 1024 -352 -730 828 50 -760 462 251 -558 267 252 -493 33 396 -163 -219 106 116 -86
1308 -86 -93 179 -49 -284 344 158 -610 276 572 -753 -65 877 -607 -293 1032 -616 -774 1287 -79
1327 -79 -1135 1039 285 -1315 783 639 -1346 543 1039 -1350 -36 1235 -972 -320 1228 -755
1343 -755 -610 1259 -384 -960 1001 95 -883 660 270 -838 350 446 -630 42 512 -226 -243 109
1361 109 33 -21 -27 143 -25 -367 248 332 -568 48 678 -608 -290 838 -456 -454 1051 -398 -921 1161
1381 1161 67 -1200 955 404 -1334 803 782 -1547 404 1294 -1328 -115 1440 -1048 -608 1405
1397 1405 -642 -800 1452 -170 -1211 834 156 -908 761 412 -886 317 371 -757 105 547 -245
1414 -245 24 181 -309 -106 101 -1 128 -18 139 207 -582 -263 576 -223 -77 898 -473 -846 808 -218
1434 -218 -898 1266 508 -1284 497 368 -1460 616 1254 -1137 155 1205 -1355 -567 1290 -652
1450 -652 -294 1628 -546 -1180 975 -314 -1049 1302 607 -911 548 12 -1417 348 987 -340 273
1467 273 474 -820 -478 196 -129 330 599 9 -227 -484 -422 243 148 139 746 -97 -770 26 -366 -472 1177
1488 1177 645 -746 293 -132 -1420 443 1063 -560 640 883 -1644 -657 1082 -634 46 1755
1504 1755 -547 -1089 825 -691 -1131 1496 729 -733 696 -124 -1610 292 780 -379 811 834 -1085
1521 -1085 -642 83 -454 497 1146 -94 -351 -171 -709 -279 428 395 531 184 -602 -415 -329 -261 737 589
1541 589 -202 317 -211 -1291 18 741 -162 708 767 -1241 -649 549 -650 113 1564 -235 -735 486
1559 486 -824 -871 1318 449 -590 828 -84 -1399 274 420 -583 894 883 -1000 -325 223 -782
1576 -782 183 1067 -60 -75 219 -823 -524 522 271 309 397 -440 -436 -31 -262 190 567 16 56 -29 -727
1597 -727 -127 458 -161 263 599 -512 -358 258 -598 -66 1067 -88 -436 433 -508 -654 811 181 -455
1616 -455 736 50 -997 296 355 -524 531 508 -771 69 443 -681 12 657 -286 19 446 -560
1634 -560 -280 508 -171 -83 509 -192 -287 213 -247 -106 514 -54 -243 180 -222 -122 381 -162 -165 385 -177
1655 -177 -273 355 -119 -213 448 -160 -407 448 0 -429 377 54 -411 403 65 -592 332 321 -466 179 262
1676 262 -526 144 395 -438 91 490 -444 -162 398 -264 5 498 -330 -259 410 -172 -205 409 -69 -166 358
1697 358 -199 -336 341 29 -208 310 -17 -251 231 -101 -302 358 159 -219 179 -78 -336 280 98 -264
1717 -264 291 141 -388 106 70 -287 310 254 -412 88 218 -391 77 281 -287 135 344 -447 -118 367 -229
1738 -229 -25 393 -249 -156 373 -265 -249 454 3 -216 284 -131 -292 363 26 -301 296 108 -295 149 21
1759 21 -224 253 121 -285 103 103 -204 101 64 -204 175 90 -287 69 122 -186 127 69 -280 175 168 -331 68
1782 68 217 -261 86 200 -376 51 360 -320 -102 362 -238 -122 341 -247 -167 438 -149 -319 314 -22 -230
1803 -230 306 -30 -310 306 74 -341 195 157 -218 156 54 -256 156 155 -218 68 131 -142 98 25 -225 165
1825 165 169 -201 71 73 -224 147 100 -269 154 225 -316 -9 188 -248 102 278 -339 -54 328 -269 -135 325
1847 325 -173 -114 327 -218 -231 365 -65 -257 267 -11 -193 255 -52 -277 255 92 -230 136 26 -186 174
1868 174 13 -228 200 95 -214 132 25 -184 228 53 -292 215 152 -260 141 109 -292 213 205 -392 83
1889 83 289 -331 4 291 -293 17 343 -330 -154 391 -148 -176 281 -170 -178 302 -106 -240 284 -6 -209
1910 -209 153 -49 -124 234 -52 -195 185 12 -124 169 -86 -116 280 -88 -216 276 -22 -198 290 -87 -305
1931 -305 394 49 -432 292 157 -409 256 199 -479 241 359 -523 31 426 -379 -32 414 -374 -110 496
1951 496 -267 -261 430 -130 -242 353 -111 -253 359 -31 -303 226 40 -186 151 -57 -167 222 -15 -186 157
1972 157 -61 -89 233 -145 -173 329 -107 -245 355 -54 -268 396 -97 -443 486 153 -503 329 178 -550 341
1993 341 346 -611 228 479 -622 7 569 -448 -47 568 -481 -244 631 -260 -362 524 -138 -350 462 -95
2013 -95 -430 391 60 -362 288 98 -295 171 -24 -249 262 113 -217 98 -87 -181 269 -42 -214 319 -78
2034 -78 -326 297 -60 -308 464 27 -513 430 170 -606 306 265 -545 409 440 -752 45 514 -590 84
2054 84 755 -490 -195 564 -562 -304 869 -119 -406 514 -256 -536 568 51 -455 480 120 -537 208
2073 208 96 -369 288 193 -291 188 93 -378 43 78 -71 380 73 -388 49 -79 -243 429 173 -307 285
2094 285 -85 -651 363 347 -409 363 244 -758 180 469 -688 124 734 -521 -83 605 -690 -326 836
2113 836 -245 -266 835 -290 -753 482 -37 -379 839 175 -783 202 106 -517 434 425 -408 132 142 -565
2133 -565 52 344 -186 144 186 -286 43 26 -342 133 243 -92 256 -47 -568 134 194 -296 421 340 -588
2154 -588 36 198 -586 315 724 -559 -112 498 -616 -154 772 -401 -269 817 -341 -606 663 -131
2172 -131 -551 741 126 -632 518 99 -819 359 496 -433 294 308 -702 -8 461 -307 83 447 -338
2191 -338 -166 199 -237 74 355 -180 -78 123 -207 64 150 -272 137 257 -306 50 194 -412 103 375
2211 375 -402 36 468 -501 -176 537 -333 -131 680 -400 -458 670 -141 -501 622 -9 -610 527 110
2230 110 -665 446 338 -663 236 391 -543 153 416 -524 6 499 -376 -114 416 -262 -124 372 -232
2249 -232 -157 356 -128 -184 211 -97 -58 223 -160 -99 219 -146 -42 219 -216 -21 285 -311 -117 417 -206
2270 -206 -203 364 -245 -243 527 -127 -410 442 -22 -459 426 115 -471 374 140 -597 315 407 -488 99 323 -501
2292 -501 103 516 -404 -101 430 -342 -167 460 -161 -180 334 -207 -231 359 -37 -240 184 -80 -96 321 -78
2313 -78 -246 160 -39 -70 308 -40 -218 114 -162 -166 405 84 -235 99 -230 -281 428 128 -304 222 -17 -410
2335 -410 264 178 -388 238 233 -446 128 334 -442 -61 316 -241 134 480 -414 -360 263 -109 58 557 -140
2356 -140 -380 126 -176 -132 541 166 -284 28 -164 -239 333 153 -204 135 42 -188 113 -49 -244 200 156
2377 156 -67 205 -65 -422 2 95 16 456 157 -540 -217 16 -99 421 368 -354 -160 13 -346 114 448
2398 448 -142 -74 159 -315 -101 324 -216 -178 376 34 -99 164 -314 -390 338 256 21 249 -157 -504 2
2419 2 154 116 433 88 -468 -163 7 1 334 177 -258 -9 22 -214 89 132 -143 130 170 -175 11 9 -334
2442 -334 19 336 67 107 -2 -521 -182 321 100 155 203 -343 -317 148 3 71 371 -103 -330 53 -31 -71
2464 -71 240 -28 -180 191 71 -180 20 -52 -115 247 174 -103 47 -94 -260 136 240 32 140 -71 -354
2485 -354 38 204 -9 142 58 -248 22 137 -155 85 200 -176 -31 152 -146 -51 178 -182 -67 278 -44
2506 -44 -174 78 -111 -98 246 14 -190 95 -38 -180 118 73 -82 98 -8 -186 81 89 -75 32 4 -83
2528 -83 70 15 -128 69 56 -52 66 -34 -118 137 53 -148 85 50 -163 90 87 -150 97 107 -251 3 215
2551 215 -117 6 139 -213 -38 283 -106 -137 175 -81 -130 224 -17 -196 103 -33 -188 186 145 -176 -60
2572 -60 -37 -104 174 172 -130 -119 -13 -46 99 108 -40 -43 -92 -70 104 100 -17 0 -129 -86 222 115 -124 -29 -65 -94 261
2599 261 150 -213 -27 9 -209 157 320 -162 -116 24 -221 72 413 -96 -250 59 -106 -15 346 -3 -298
2620 -298 48 0 -96 237 101 -267 -91 11 -49 211 137 -258 -223 23 82 172 59 -188 -165 -44 77 198 41
2643 41 -133 -102 -133 6 304 106 -207 -83 -81 -37 330 164 -314 -88 65 -97 234 259 -288 -170 117 -131
2665 -131 112 386 -209 -350 114 5 36 352 -102 -429 67 150 -23 229 27 -353 -51 143 3 157 76
2686 76 -289 -171 106 128 147 2 -255 -147 79 136 156 -59 -220 -62 4 38 236 18 -285 -49 15 -21 293
2709 293 96 -393 -80 167 -65 191 216 -356 -162 278 -62 15 320 -214 -327 236 87 -69 302 -85 -435
2730 -435 131 245 -85 115 19 -335 24 246 -44 34 62 -234 -101 179 51 38 4 -204 -114 110 123 67 -95
2753 -95 -180 9 70 21 137 -47 -245 59 81 -103 184 110 -359 -55 242 -96 61 213 -333 -169 348 -33
2775 -33 -117 252 -141 -264 286 78 -166 255 -19 -388 168 228 -179 106 111 -330 55 318 -138 -66 151 -146
2797 -146 -86 202 0 -61 62 -97 -78 83 36 37 -39 -140 40 118 -55 28 36 -166 37 142 -129 37 143 -206
2821 -206 -39 180 -132 7 206 -240 -137 317 -103 -196 291 -83 -268 306 48 -338 234 177 -340 94 219
2842 219 -237 32 211 -222 2 220 -160 -48 174 -105 -5 168 -137 -53 209 -77 -102 125 -25 -48 133
2863 133 -54 -109 53 -38 14 80 -89 2 41 -234 28 287 -113 -73 160 -232 -138 356 -25 -231 206 -30 -260
2886 -260 214 99 -215 159 48 -258 201 163 -294 42 114 -206 214 284 -356 -162 207 -163 54 397 -121
2907 -121 -279 59 -93 -34 328 100 -156 -76 -129 25 223 -29 -55 78 -119 -21 196 -135 -182 170 -8 -37
2929 -37 256 -78 -320 -29 -3 97 392 -29 -392 -81 -118 -47 479 161 -369 -11 -34 -338 266 383 -257 -82
2951 -82 151 -224 9 279 -201 -157 251 67 45 83 -333 -221 230 124 172 267 -295 -462 54 99 197 425 -57
2974 -57 -453 -135 29 107 301 48 -167 -9 -92 -51 188 -67 -162 235 45 -136 192 -133 -461 136 371 43
2996 43 165 -82 -577 -126 308 153 255 82 -476 -251 109 -11 280 346 -310 -248 146 -110 -25 273 -129
3017 -129 -166 309 61 -221 4 -123 -118 304 235 -19 -38 -318 -277 232 287 142 148 -273 -458 118 227 36 210
3040 210 -5 -345 -9 112 -90 131 81 -185 80 115 -146 31 -17 -240 192 365 -153 -123 -22 -317 25
3061 25 462 1 -155 50 -280 -209 290 146 -29 75 -197 -225 187 76 -78 120 -64 -127 197 8 -217
3082 -217 89 43 -107 186 104 -181 -22 -2 -91 191 172 -103 -47 -93 -130 214 156 -159 37 29 -217 81 176 -182
3106 -182 8 128 -211 -28 217 -125 -102 151 -93 -25 188 -136 -147 169 -37 -79 173 -79 -178 174 -3 -170
3128 -170 154 23 -222 58 80 -105 98 70 -174 5 101 -54 48 21 -91 79 57 -121 51 51 -105 104
3150 104 91 -133 24 69 -148 79 195 -89 -39 16 -152 70 223 -93 -50 70 -173 -27 207 -98 -75 184
3172 184 -108 -150 208 -13 -183 126 23 -111 173 25 -251 6 77 -30 141 47 -209 -24 52 -77 137
3193 137 134 -145 -64 23 -77 94 147 -112 -89 44 -28 67 59 -124 -12 77 -40 70 80 -166 -38 107 -49 92
3217 92 185 -183 -175 105 5 37 192 -120 -209 114 17 -36 164 -40 -189 82 34 -84 155 17 -246 26 123
3240 123 -65 64 11 -220 -6 177 -16 2 38 -144 -36 111 10 43 52 -153 -55 98 16 57 52 -175 -66 153
3264 153 8 2 63 -115 -69 121 1 -4 105 -85 -113 119 31 -12 106 -96 -158 153 98 -85 62 -29 -147 103
3288 103 103 -102 30 17 -144 41 106 -32 24 7 -171 4 138 -43 -22 18 -138 -6 132 -45 -22 67 -95
3311 -95 -47 86 -17 0 54 -100 -36 128 -12 -37 50 -99 -32 162 -35 -90 75 -55 -96 125 42 -78 89 -21
3335 -21 -149 97 90 -74 35 0 -118 72 92 -109 12 62 -102 17 97 -76 -11 68 -95 -27 118 -21 -32 5
3359 5 -70 16 77 -39 -36 45 -78 -30 76 -52 -15 87 -90 -67 97 8 -51 89 -61 -80 122 -3 -85 86 -13
3384 -13 -95 100 32 -94 98 39 -153 73 108 -91 38 54 -132 27 125 -87 -40 85 -85 -19 94 -53 -13
3407 -13 76 -85 -60 97 2 -30 35 -63 -42 95 3 -45 25 -49 -33 68 -26 -36 53 -74 -62 70 -16 -37 69 -80
3433 -80 -89 129 21 -99 62 -19 -105 107 52 -126 78 49 -138 65 109 -98 27 72 -135 21 159 -68 -47
3456 -47 90 -63 -27 125 -28 -71 68 -36 -61 85 8 -54 39 -58 -52 105 15 -62 2 -26 -4 86 -18 -41 37 -44
3482 -44 -40 68 -19 -38 74 -64 -97 118 35 -101 70 -20 -95 112 58 -148 30 72 -111 42 92 -116 -14 68
3506 68 -114 19 162 -72 -76 79 -69 -5 167 -35 -114 94 10 -78 79 34 -70 44 10 -47 42 -1 -55 10 -8
3531 -8 6 92 -55 -106 39 -4 -34 76 -7 -111 21 -15 -65 82 35 -98 25 -14 -107 109 57 -139 56 89 -134
3556 -134 24 89 -150 12 168 -91 -51 124 -100 -116 112 20 -8 114 -49 -129 42 21 4 114 -27 -86 64
3579 64 5 -79 91 43 -79 30 21 -60 27 10 -48 30 35 0 4 -90 -82 88 31 -50 74 -36 -184 35 53 -90 83
3606 83 85 -153 -49 93 -64 15 108 -84 -29 100 -99 -53 89 -54 -21 146 -66 -124 108 -41 -120 132 74 -100
3630 -100 23 -18 -116 67 103 -31 1 -9 -52 22 5 -26 78 -6 -80 54 11 -84 59 47 -79 57 70 -95 -26
3655 -26 18 -50 59 40 -101 5 22 -116 22 87 -98 6 83 -162 -39 157 -62 -101 116 -32 -95 105 -7
3678 -7 -101 87 35 -63 41 2 -58 69 -7 -50 104 16 -95 43 42 -61 62 49 -96 10 65 -44 6 20 -52 25
3704 25 19 -66 45 27 -88 27 36 -104 58 82 -139 1 125 -69 -46 80 -59 -37 102 -48 -73 56 -45 -51
3728 -51 76 -48 -49 86 -50 -89 100 9 -100 49 -3 -83 64 40 -97 22 50 -38 22 28 -42 27 10 -50 62 25
3754 25 -66 39 16 -97 78 94 -115 -11 81 -73 6 87 -69 -43 72 -61 -10 75 -52 -51 55 -74 -3 128
3778 128 -49 -85 86 -14 -77 90 -12 -102 59 25 -91 20 17 -64 10 19 -29 47 -7 -93 13 23 -28 77 1 -126
3804 -126 16 47 -67 57 92 -65 -8 22 -70 51 102 -49 -5 44 -72 0 73 -67 5 128 -79 -64 82 -72
3828 -72 -65 123 6 -47 91 -31 -140 25 46 0 89 -21 -116 6 -5 -40 84 44 -64 -2 -33 -102 58 82 -54
3853 -54 -4 28 -71 -1 7 -61 24 60 -12 6 -20 -109 7 55 -15 75 83 -127 -88 27 -9 81 147 -52 -101 30 -37 5 123
3882 123 10 -36 34 -54 -67 98 -3 -70 88 28 -48 60 -32 -128 44 109 -19 29 -30 -144 -23 46 32 62 27
3907 27 -120 -76 -2 -6 90 73 -106 -55 35 -41 13 47 -63 -20 68 -25 -14 2 -84 -15 65 20 39 22 -128 -85 105 61
3935 61 40 56 -110 -119 73 51 -7 84 -26 -119 21 48 -10 76 9 -98 43 74 -29 13 -20 -111 46 114 -42 -42 -14
3962 -14 -84 -13 100 26 -22 -28 -112 -39 90 52 5 -34 -109 -17 103 17 -18 1 -78 -18 78 1 -24 21 -73 -24 103 33 -32
3991 -32 2 -75 -35 121 37 -60 4 -52 -56 115 65 -83 -10 5 -82 66 113 -49 -35 5 -56 63 108 -44 -64 3 -32
4018 -32 36 88 -41 -63 26 -25 -12 54 -19 -70 -4 -7 28 53 -24 -68 -23 -8 59 69 -51 -75 10 -27 3 83 -24 -69 26
4047 26 0 -16 87 29 -91 11 33 -30 62 17 -90 21 72 -22 21 20 -95 2 92 -32 14 57 -83 -50 83 22
4073 22 -1 42 -44 -54 62 31 -21 7 -38 -21 40 -3 -22 17 -33 -20 50 12 -29 4 -43 -30 62 30 -37 -16 -62 -35 78
4102 78 21 -59 13 -27 -59 70 48 -64 23 28 -61 56 93 -77 -35 41 -25 38 102 -53 -63 40 -6 -4 77 -38 -64 21
4130 21 2 2 67 -7 -79 -12 16 28 54 -24 -81 -16 19 17 25 -33 -66 9 8 18 60 -22 -71 11 3 -3 70 -20 -111 8 36 -12 58
4163 58 2 -114 8 63 -22 21 26 -85 -19 77 2 28 57 -70 -57 74 36 4 25 -60 -66 86 51 -25 22 -19 -68 47
4191 47 40 -6 6 -15 -62 29 53 5 -12 -53 -54 28 29 -20 -1 -41 -54 32 21 -29 6 -26 -86 30 43 -42 10 -10 -80 21 77
4222 77 -47 -34 12 -64 -15 67 -35 -38 53 -27 -50 74 16 -41 32 -12 -47 73 30 -47 16 7 -26 38 27 -28 27 19 -20 23
4252 23 27 -5 21 -2 -39 37 23 -40 -8 2 -47 33 11 -55 21 14 -49 1 20 -29 24 29 -68 -6 53 -39 -18 44 -54 -25 58 -20
4284 -20 -25 65 -11 -50 38 11 -3 49 1 -61 37 34 -4 23 3 -54 30 33 0 25 13 -35 11 25 12 33 -5 -38 5 36 13 43
4316 43 -10 -61 26 40 -26 21 9 -76 -18 41 -17 3 22 -75 -40 61 4 -20 0 -75 -42 62 16 -29 8 -45 -55 59 35
4345 35 -19 9 -36 -60 56 79 -20 -28 -22 -41 43 56 -8 -17 -14 -20 34 34 -13 -4 -21 -35 45 52 -18 -31 -23 -27 64 76 -31 -27 -26 -33 43 77
4381 77 -15 -32 -4 -64 4 88 2 -41 21 -33 -19 77 -3 -92 22 23 -15 38 -24 -97 -24 25 -3 54 19 -77 -45 0 7 70 45
4412 45 -61 -53 -6 15 30 34 -26 -16 26 7 5 1 -35 5 39 16 26 -2 -82 -32 41 55 59 14 -119 -82 41 27 34 49 -50 -69
4444 -69 19 -1 -13 38 -8 -59 12 6 -46 1 -22 -52 61 66 -52 -57 -45 -47 43 97 5 -43 -30 -76 -5 76 63 11 -24 -47 -12
4475 -12 59 17 10 -8 -3 29 37 -21 -30 -1 7 61 59 -18 -49 -29 -29 46 119 20 -59 -33 -61 11 104 25 -35 -14 -37 -42 58 27 -46 -4
4509 -4 9 -20 26 21 -70 -41 27 26 40 0 -97 -74 27 45 39 23 -73 -75 -4 10 47 63 -25 -55 -20 19 33 30 -30 -37 20 28 28 15
4543 15 -50 -26 43 41 25 20 -49 -51 34 56 27 39 -45 -79 22 47 19 23 -37 -82 12 48 -4 5 -4 -64 -6 53 -3 -21 -15 -58 -17
4576 -17 55 32 -32 -30 -54 2 52 21 -37 -33 -32 0 36 12 -17 -17 -42 -13 56 41 -8 -28 -38 4 62 39 -16 -13 -19 -5 55 22 -8
4609 -8 12 -12 -11 45 47 -16 -13 12 -13 50 51 -37 -34 -15 0 35 44 -47 -56 -13 -18 9 48 -14 -46 -24 -21 -5 40 -3 -53 -15 -6 -7 2 -25 -51
4646 -51 9 25 10 16 -14 -34 -1 18 16 38 7 -36 -6 7 26 46 2 -37 -1 7 -15 17 2 -29 13 30 -24 12 35 -30 -7 37
4678 37 5 -4 23 -46 -12 47 11 -15 14 -20 -28 18 5 -8 18 -9 -38 -5 -7 -11 3 -11 -32 -2 9 -21 -8 -15 -15 13 1 -26 -5
4711 -5 7 -11 21 11 -20 13 6 -26 9 27 -3 9 7 -16 16 23 -25 -2 24 -7 0 18 -9 -2 24 -13 -21 24 -14 -23 13 -3 -21 22
4745 22 -7 -26 22 22 -23 4 10 -16 16 -9 -18 1 13 -13 3 -5 -10 11 -2 -27 7 13 -29 -17 11 -17 13 8 -24 -5 18 2 26 20
4779 20 -17 0 35 -6 -6 36 3 -4 31 -7 2 32 -22 -19 26 15 7 15 -13 -19 36 18 -14 5 -15 -14 23 10 -14 8 -3 -33 12 28
4813 28 -9 4 -27 -29 21 29 -17 -21 -25 -30 -7 19 -15 -26 -10 -43 -6 24 2 -22 -16 -38 -6 41 -13 -23 -2 -10 7 41 -25 -18 7 -3
4847 -3 -4 48 11 -25 3 -4 -1 37 22 -28 0 1 -11 38 5 -47 -9 2 -8 11 10 -32 -24 -9 -17 30 21 -34 -25 -7 -11 19 11 -41 -30 8
4883 8 -1 1 20 -31 -33 12 -20 0 24 -17 -28 11 7 16 19 -38 -36 11 31 3 32 -11 -36 29 29 5 21 5 -26 16 31 17 18 -2 -47
4918 -47 4 37 -4 4 -27 -43 4 24 -7 0 -15 -26 -12 14 -9 -9 -5 -56 -17 32 4 -17 -19 -53 -14 39 -3 -20 -8 -27 -14 32 -3
4951 -3 -14 2 -28 -20 38 21 -26 -9 -24 0 33 25 -18 -3 -8 -4 42 37 -12 -10 6 -3 44 38 -4 -5 3 -11 22 36 -7 -22 4 1 10 21 -25
4988 -25 -28 -3 -9 -6 17 -21 -36 -17 -27 8 19 -25 -49 -14 -7 3 5 -14 -39 1 10 -2 20 -11 -30 1 5 -4 29 -10 -29 -6 9 17 28
5023 28 -12 -33 -4 32 1 5 9 -19 -13 22 5 10 14 -26 -19 26 20 9 7 -29 -14 32 22 -12 -1 -18 -12 26 12 0 3 -30 -35 -3 3 -13
5059 -13 -11 -15 -40 -9 -4 -20 -6 -25 -28 9 19 -26 -7 6 -7 12 11 -2 -2 -3 -26 19 37 -2 -4 -13 -17 23 38 0 1 7 -9 6 17 -19
5095 -19 1 4 -13 -9 16 1 -19 1 -15 -11 23 -6 -17 4 3 -4 19 -4 -23 9 -6 -18 20 20 -26 -8 -1 -27 6 -5 -38 -11 -4 -14
5129 -14 -2 -9 -33 -6 -6 -8 10 13 -20 -5 10 13 3 5 -20 -12 19 19 9 29 -11 3 22 2 -16 9 6 -15 1 5 -1 19 -4 -20 11 22
5165 22 -3 6 -3 -16 12 15 -5 2 15 -8 -3 10 -13 -12 6 -12 -5 6 1 -7 -8 -18 4 8 -8 3 0 -8 -21 1 -13 -11 4 -5 -19 -8 0 -3 13
5204 13 -8 -14 11 -1 -13 -2 -5 4 24 4 -1 -1 4 -15 -2 24 -4 4 11 -11 -7 10 -10 -6 0 -18 -6 1 -10 -14 -4 -17 -12 -7 -16 -18 -7 -20 -25
5243 -25 8 -5 -5 11 -9 -7 -3 -10 -14 1 2 -17 3 7 -9 1 -7 -17 9 15 -9 -14 11 -11 8 16 2 -2 12 -6 14 14 8 23 -1 -23 -4
5280 -4 22 -9 -7 8 -11 -2 25 -12 -22 1 -16 -10 21 -1 -23 -13 -9 -24 12 0 -18 -12 -20 -15 3 1 -22 1 9 -9 -11 -4 -12 -12 -3 -8 -3 -8 -22
5319 -22 -23 -6 -2 5 2 -29 -20 -1 -1 15 11 -7 -2 -2 -14 4 37 -2 -9 1 -20 3 18 -3 -6 18 13 0 7 -3 -19 3 11 -11 3 7 -27 -7
5357 -7 -6 -9 -3 -1 -44 -30 -10 -18 -3 1 -18 -16 -18 -24 -5 5 -10 -1 -12 -14 -2 -4 -18 1 12 7 -4 12 -20 -10 29 2 0 31 -9 -21 20 -5
5395 -5 1 32 9 -37 8 8 -2 8 2 -27 3 6 -18 -10 26 -6 0 18 -3 -2 8 -23 -4 19 11 -24 -23 -20 -10 -9 -7 -10 -8 -12 -9 -6 -19 1 -4 -18
5435 -18 -6 7 -19 -11 -9 -17 0 13 -19 -6 26 1 7 27 4 -20 14 6 -20 22 12 -11 19 13 -11 6 9 -20 3 15 -7 4 21 -15
5469 -15 -7 5 8 -2 16 2 -3 -5 -7 -4 -10 -10 -10 -6 -6 4 -9 -25 3 0 -18 2 -8 -30 -15 2 -23 -29 1 -19 -11 7 -17 -19 12 2 -21 26
5507 26 4 -16 16 6 -11 23 25 -7 8 -2 -16 6 21 -6 -6 -6 -12 -9 11 11 -2 11 -11 -2 -5 -1 -3 -7 -9 -17 -10 -22 -15 -11 -10 -5 8 -21 -14 -4
5547 -4 -15 1 25 -13 -13 -6 -23 -6 9 -7 -29 1 -10 -26 13 0 -32 9 9 -21 10 11 -25 8 21 3 14 19 4 0 27 16 9 8 2
5582 2 0 6 18 13 8 -4 2 10 11 3 21 1 1 -3 -15 1 3 -9 -4 -1 -11 -5 12 -23 -21 7 -14 -9 7 -18 -13 17 -1 -10 20 -1 -20 1 9 -20
5622 -20 2 10 -32 -8 3 -9 8 17 -8 -6 20 8 -1 12 -3 -2 16 12 0 10 -1 11 0 2 20 19 4 -1 10 1 -2 4 -22 1 5 -13 -9
5659 -9 -2 -17 -15 -9 -14 -7 5 -5 -38 2 4 -6 -4 0 -13 1 6 -8 2 4 -23 -5 13 -9 -3 2 -5 -9 17 -1 -3 7 -1 0 3 7 -1 5 1 -15 -4 8
5701 8 1 10 -4 -2 8 -3 19 10 -2 3 8 12 2 -4 -5 -4 0 -9 -5 -3 -12 -19 -9 -18 -12 3 -25 -19 5 -4 -25 -3 4 -17 -2 -1 -26 -18 9 -9 -12 1 -4
5744 -4 -10 8 -2 -4 16 4 -7 10 7 2 13 14 5 11 14 -3 0 5 0 6 -1 -7 10 5 -7 -3 7 5 9 -5 -1 14 -4 -8 0 -5 -9 5 -7 -3 -4 -20 -9
5787 -9 -7 -8 -13 -10 -12 -21 -2 -4 -29 -25 -6 -6 -24 -2 -4 -17 -2 1 -6 4 1 0 -1 11 4 11 10 0 7 2 2 7 14 3 7 0 5 0 7 -1 4 -3 3 7 4 7 8 -2 -2
5836 -2 0 -3 -12 4 4 -7 1 -3 -10 -2 -5 -8 -2 4 -11 5 7 -7 -4 1 -13 -13 -3 5 -10 4 3 -5 -2 8 -1 9 11 -14 11 7 -3 9 9 8 10 10 7 1 12
5881 12 11 4 9 3 17 16 9 8 4 1 5 2 1 -8 -1 -2 -1 -6 -9 -6 1 5 -5 -10 -8 -16 4 -12 2 3 -18 -12 -2 6 -5 1 7 -7 -13 -13 -8 -8 2 -10 5 11 9 5
5929 5 3 8 6 14 -7 0 2 4 0 23 11 5 12 9 8 12 12 20 24 20 10 0 0 5 -1 -3 0 1 -9 -11 -9 -5 -3 1 -6 -15 -25 -13 -11 -6 0 -5 -7 -6 -6 -4 -2 -8 -2 -8 1 -18
5981 -18 -11 -2 -6 11 -3 0 9 -4 -4 6 7 0 1 -7 -7 1 2 7 12 21 4 17 4 -4 -1 6 11 2 14 -11 2 0 2 13 14 1 -2 -5 -15 -9 0 -7 -11 -6 -21 -8
6027 -8 -6 -9 -9 -5 -19 -20 -6 -8 -15 -7 -14 -14 -7 -10 -9 -10 -7 -2 5 -8 -5 7 9 -9 14 3 -8 6 14 7 5 6 -1 16 4 3 6 16 -3 11 5 1 9 11 -3 5
6073 5 11 6 7 -6 -8 3 10 -16 -7 5 -8 -5 0 -4 -16 -1 -12 -14 -15 -6 -6 -16 -19 -16 -14 -24 -20 -7 -15 -8 4 -5 -23 3 -1 6 15 5 -7 -14 -10 0 15
6116 15 8 -6 0 5 -6 2 16 6 11 3 5 13 9 0 -3 6 6 2 12 2 4 9 -2 -9 12 10 -10 2 5 12 11 -9 -12 -1 -11 -11 4 -13 -1 -12 -15 -9 -5
6159 -5 -2 -6 -12 -17 -6 -7 -10 -9 -3 -1 2 4 12 1 5 14 15 14 14 2 9 6 5 20 23 5 2 3 7 5 24 6 -7 -3 -2 -3 -4 -4 -16 0 -8 -8 -10 -2 -4 -10 0 -5 -4 -15
6209 -15 -10 -14 0 1 -5 -8 -15 -20 -11 -13 -4 -6 -8 -7 -6 -10 4 3 -5 -11 7 -6 -1 -9 -3 -7 4 -4 14 -7 4 0 10 14 17 10 12 7 20 19 5 6 13 -8 16 11 7
6256 7 2 -6 -13 -3 5 -4 6 2 -6 -13 -6 -8 2 -9 -4 -12 -11 -3 6 -24 -9 1 -6 -15 2 -1 -10 7 1 -9 2 5 -11 -13 3 10 -2 9 -8 -12 1 6 7 6
6300 6 2 -10 13 5 6 8 13 2 10 6 15 5 4 1 -3 6 5 -1 -12 -7 -5 -9 -14 -7 -8 -19 -6 -13 -16 -16 -9 -16 -9 -15 -13 -4 -10 -18 -12 -8 -13 -1 -6 4 -10 3 -6 3 6 -12
6350 -12 -11 1 -5 3 10 9 1 0 -4 5 -3 -1 10 4 0 6 4 14 2 10 11 6 13 18 -4 8 2 -4 10 5 3 -2 -2 4 -12 -4 -20 -7 -4 -8 -4 -9 -12 -13 -20 -23 -13 -8 -14
6399 -14 -14 -6 -5 -1 -3 1 -4 -12 10 0 8 4 -4 -2 4 -1 -3 8 -1 -7 3 2 2 -6 0 -2 -2 -9 -8 4 -2 2 -1 3 -5 6 -7 -19 -8 -5 -3 4 -8 -3 -1 -2 -9 3 4
6448 4 -7 -7 -21 -8 0 -8 -20 -19 -12 -17 -5 -15 -10 -19 -3 -13 -8 -11 -8 -3 -7 7 14 4 6 2 1 5 13 -1 6 3 8 6 16 3 0 4 11 7 7 4 2 -4 0 0 1 -10
6496 -10 -11 -13 -16 6 18 4 -6 -3 -9 0 -10 -3 -8 -10 -4 3 -2 5 -17 -19 -19 -2 -17 -13 -15 -20 -25 -18 -20 -18 -9 -20 -13 5 -7 6 -6 -9 4 10 4 4 -7 -2 2
6541 2 5 3 7 16 13 5 10 6 14 3 -1 2 -5 -1 -9 -5 -4 -12 -7 11 -3 -14 -9 0 -11 0 10 -6 -14 5 -6 -1 1 -6 -13 -18 -6 -14 -5 -11 -3 -12 -10 -6 -5 -2 -1 -7 -6 -8
6591 -8 -7 4 -11 -11 -3 0 5 -1 9 2 -10 3 14 5 3 10 1 3 2 11 6 5 -12 10 -8 -4 -5 4 -12 -3 -6 -17 -23 -8 -2 -10 -13 4 -5 -5 -15 -10 -16 -29 -9
6636 -9 -5 -8 -15 -9 -29 -14 -6 -9 -9 0 -7 -9 -7 -10 -2 -11 8 -11 3 -5 -13 -5 -18 -5 -1 -3 -3 -3 1 14 8 -5 11 4 8 5 10 3 0 5 2 -10 1 6 11 -1 4 1
6684 1 -2 5 13 -3 -15 -9 -13 -3 -9 -24 -18 -13 -26 -11 -12 -12 -11 -15 -12 -8 -14 -16 -6 -7 -4 -8 -6 -4 -9 1 -4 -2 -16 -12 -13 -8 -10 4 -1 4 3 6 7 11 3 -3 5 -9 4
6733 4 1 3 5 -10 14 -13 13 -5 -1 -6 1 12 -10 8 1 1 -2 -9 -3 -8 -11 -18 -19 -11 -9 -21 -18 -17 -14 -14 -6 -9 -18 -11 -12 -6 -6 3 1 -12 3 -13 11 2 12 3 -6
6780 -6 1 11 13 13 4 8 11 -5 5 6 5 4 -5 -7 -2 -2 -12 -13 -1 6 3 8 3 -1 -10 4 4 4 4 -6 -17 -14 -11 -13 1 -6 -17 -8 -4 -13 -11 -18 0 -8 -19 -13 -4 -12 1
6829 1 0 -7 3 -11 -8 6 7 1 4 9 8 0 0 18 -1 4 18 15 10 14 6 3 6 3 3 11 -12 11 2 5 0 -3 -10 -7 -10 2 -9 -1 -2 0 6 -6 0 -3 -8 -10 -15 -13 -11 -8
6879 -8 -11 -6 -12 -6 -2 3 -6 0 -9 -1 -14 -5 0 -9 -5 -4 -3 -10 1 0 -4 5 3 1 4 4 22 4 9 2 4 8 0 1 11 11 3 3 0 10 1 -2 -6 -7 -6 1 1 -5 0 2 10 -11 -7 -11
6933 -11 -6 -5 -12 0 -10 -10 -12 -14 2 7 -7 -5 -6 -4 2 -4 -8 -11 -16 -5 -8 3 -3 -2 -10 0 0 -10 0 2 -20 2 0 7 0 11 15 3 3 11 10 13 1 7 12 3
6979 3 17 24 10 -9 7 4 2 -1 -3 5 -13 6 -10 -17 -3 -22 -21 -10 -1 -11 -16 -10 -6 -6 -4 -18 -7 1 -3 1 -14 -6 -4 -13 -3 -10 -1 -3 -16 -3 -12 -1 -1
7022 -1 13 15 -6 15 -4 -9 2 12 -1 2 7 11 22 9 7 10 4 6 4 12 -1 -1 11 8 7 -12 -2 -1 4 -2 -9 5 -6 -13 -12 -15 -12 -17 -16 -8 -14 -15 -12 -21 -8
7067 -8 -15 -8 0 -19 -1 -4 -7 -2 -7 -2 13 6 -12 -7 11 5 9 7 12 10 0 9 3 -2 4 0 0 5 10 15 10 1 14 14 11 11 17 5 1 12 -9 1 -3 5 -10 1 -12
7114 -12 -10 -16 -4 -13 -17 -14 -11 -9 -10 -17 -5 -8 -9 -10 -12 -10 -7 -9 -6 -6 2 -6 -5 -2 -4 -2 3 -11 7 0 10 -2 10 12 18 11 20 12 10 2 10 6 6 9 -9 -6 4 16 -3
7163 -3 3 12 3 10 3 9 -5 -3 6 -2 -11 -4 -4 -18 -23 -10 -9 -7 -8 -4 -1 -11 -8 -14 -1 -2 2 -24 -2 -8 -19 -14 -5 -6 5 -2 3 2 -4 -4 0 13 2 6 13 11 11 10 7 11
7213 11 14 13 17 2 1 4 -11 11 -2 12 2 1 0 2 6 -6 -6 -3 -8 -5 -16 -11 -11 -11 -6 -13 -5 -3 -11 -8 -8 -10 -15 -11 -14 -11 -1 -11 -15 -21 -5 -15 -19 -14 -17 -19 -4
7260 -4 -19 -8 3 -15 -10 -1 2 6 12 9 6 13 4 0 5 5 14 -1 2 4 6 10 -1 9 -4 1 -6 -1 1 -4 -6 -11 -20 -13 -7 -13 -19 -20 1 -11 -25 -15 -8 0 0 -15 -3
7307 -3 -19 -2 -7 -4 -7 -11 1 -3 -4 -8 -18 -13 -15 -14 -7 -4 7 -4 4 4 10 5 0 0 3 -3 -1 2 16 8 5 7 11 8 9 13 14 11 8 3 8 -10 -3 5 -3 -4 1 -1 -9 -11 -5 -2 -17
7360 -17 -1 -16 -5 -15 -16 -14 -5 -13 -1 13 -7 -6 -7 -11 -3 -13 -2 -13 -4 3 -1 5 8 4 -3 -4 -12 -1 5 5 4 2 1 -2 -3 3 -1 -7 1 5 10 9 8 8 2 8 6 8 5
7409 5 11 5 9 -4 -5 3 -8 -3 -17 -11 -13 -8 9 -17 -14 -1 -11 -8 -9 -4 -7 -3 -7 -12 -6 -7 -13 -12 -17 -19 -3 3 -6 17 8 11 14 -5 15 16 -2 9 2 2 6 3 3 0
7457 0 2 12 9 -3 -1 -2 5 12 9 11 1 5 9 -4 -2 9 3 4 -3 -4 -15 -5 -3 -9 -10 -13 0 -11 -14 -10 -10 -5 -12 -14 -22 -15 -20 -13 -14 -12 -13 5 -8 -7 -3 -9 6 3 5
7506 5 10 -2 0 -1 -1 0 5 0 -7 -3 17 1 6 5 1 5 17 12 -2 5 2 5 3 5 -9 -5 -11 -10 -10 6 -3 -6 -8 -6 -4 -15 3 2 -11 -14 -2 -7 -6 -19 -11 -15 -17 -12 -5
7555 -5 -17 -13 -18 -4 -2 -6 -4 -9 9 -6 5 -3 9 5 11 4 -6 5 6 3 -10 3 5 9 9 8 3 7 5 10 8 2 2 8 11 -3 -10 -5 -9 -6 -7 -8 -4 -5 -21 -19 -3 -5
7603 -5 -17 -3 0 -3 -10 -9 1 -10 -10 -16 -8 -14 -5 -9 -16 -9 -17 -18 -25 -22 -3 -9 -4 3 -10 -8 -11 -2 0 0 3 -4 -6 5 14 6 9 -4 14 24 1 0 1 -5 -6 0 -11 -16 -9
7652 -9 -14 -23 -3 -15 -12 -22 -20 -10 -11 -5 -19 -12 -11 -13 -13 -17 -5 -17 -15 -11 -15 -16 -11 -10 -12 -18 -13 -21 -3 0 -8 -14 12 -3 2 7 -9 -2 -4 -17 5 -14 4 -1 5 3
7698 3 -7 5 6 7 7 -2 -1 11 4 -1 2 3 4 -4 6 -8 -5 -21 -9 -6 -18 -12 -15 -23 -13 -7 -11 -24 -18 -7 -16 -24 -16 -17 -14 -16 -28 -13 -15 -11 -13 -10 -3 4 -1 0 -7 -2
7746 -2 -7 -3 5 4 0 17 -3 -6 -1 -5 2 2 19 -4 -1 12 -6 13 0 4 20 4 8 3 -4 4 0 -4 -10 0 3 -7 -5 -16 -3 5 -3 -16 -5 -6 -18 -7 -14
7789 -14 -11 -13 -20 -18 -13 2 -7 -12 -2 -12 -2 -6 -12 -6 2 -3 -3 -4 -7 2 -1 -4 -2 0 9 -1 5 -1 0 15 3 8 10 9 7 5 9 -6 -9 0 3 4 8 3 -5 -3 1 5 -1 -7 -3 -3
7841 -3 10 -4 -16 -5 -10 -3 -17 -8 -6 -11 -18 -13 -9 -3 -20 -7 -10 -3 -14 -7 2 -5 1 -9 0 1 -2 0 8 -2 9 7 8 8 3 -3 3 -1 12 10 7 7 1 11 6 9 3 -2
7889 -2 4 -5 -1 8 -12 -5 -5 -2 5 9 -12 -1 -8 -10 -9 -9 -6 -12 -10 -24 -5 -4 -8 -12 -12 -7 -12 -14 -8 -26 -11 -11 -20 -9 1 5 -8 7 -13 -4 5 -3 -3 -10 -2 -2 6 -3 -3
7938 -3 13 11 9 14 1 5 14 3 13 7 1 -13 6 3 -4 1 -4 -2 -5 -13 -1 -21 -16 -6 -11 -8 -13 8 -9 -7 1 -16 -8 -18 -10 -11 -4 -11 -14 -12 -2 -13 -3 -2 -11
7983 -11 -8 -11 -12 -1 1 11 -3 -15 -6 -2 1 -1 1 5 6 20 3 4 -2 -1 7 18 6 9 8 13 16 2 12 2 -3 -8 0 -10 3 -6 -16 -18 -4 -14 -16 -9 -5 -10
8027 -10 -12 -8 -13 -12 -19 -16 -15 -4 -14 -11 -14 -9 -7 -6 -10 -1 -4 -7 4 0 5 0 9 -6 -12 5 0 3 -6 -6 3 2 0 -6 9 3 19 13 15 17 19 12 3 20 -3 4 4 2 12 9
8077 9 -3 5 6 -6 -19 -1 -8 -5 -3 -14 -14 -12 -12 -16 -9 -23 -18 -24 -13 -12 -15 -18 -13 0 -7 -18 -8 -2 -7 -5 6 6 2 7 -5 9 11 5 -5 -3 6 7 9 5 -2 7 22
8124 22 18 12 -1 16 13 0 10 6 10 -10 4 -4 0 3 -5 -2 1 13 6 -3 -1 -2 -3 -11 -7 -21 -3 -9 -8 -21 -2 -21 3 -19 -11 -13 -3 -6 -5 -5 -5 -5 5 -5
8168 -5 3 2 -6 1 3 7 5 4 6 9 -3 9 4 -3 3 11 -5 4 8 7 1 0 -2
8191b
##END NTUPLES=NMR FID
##END=
