##TITLE=1H_LY-844.60
 CCl4, 8 sc, 
 27.6.2019
##JCAMPDX= 6.0         $$ Bruker NMR JCAMP-DX V2.0
##DATA TYPE= NMR FID
##DATA CLASS= NTUPLES
##ORIGIN= UXNMR, Bruker Analytische Messtechnik GmbH
##OWNER= root
$$ XWIN-NMR		Version 3.5
$$ Thu Jun 27 16:42:30 2019 Russian Standard Time (UT+4h)  she@DPX200
##.OBSERVE FREQUENCY= 200.13155
##.OBSERVE NUCLEUS= ^1H
##.DELAY= (6, 6)
##.ACQUISITION MODE= SIMULTANEOUS
##.ACQUISITION SCHEME= undefined
##.AVERAGES= 8
##.DIGITISER RES= 18
##SPECTROMETER/DATA SYSTEM= spect
##.PULSE SEQUENCE= zg30
##.SOLVENT NAME= CDCl3
##.SHIFT REFERENCE= (INTERNAL, CDCl3, 0, 15.7039)
##AUDIT TRAIL= $$ (NUMBER, WHEN, WHO, WHERE, WHAT)
$$ ##TITLE= Audit trail, XWIN-NMR		Version 3.5
$$ ##JCAMPDX= 5.01
$$ ##ORIGIN= Bruker BioSpin GmbH
$$ ##OWNER= she
$$ F:/spectra/data/she/nmr/H-F/1/audita.txt
$$ ##AUDIT TRAIL=  $$ (NUMBER, WHEN, WHO, WHERE, WHAT)
(   1,<2019-06-27 16:41:28.65 +0400>,<she>,<DPX200>,
      <created by zg, POWCHK disabled, PULCHK disabled
       configuration hash MD5:
       00 E9 B6 7A A2 85 ED C7 34 08 36 98 17 FE 4E 26
       data hash MD5: 16K
       DC 48 05 BD 85 E2 80 3A AF 50 49 F6 49 82 C3 45>)
$$ ##END=
$$ 
$$ hash MD5
$$ F1 52 07 CC 8E 2F CD 71 EA 4D A1 53 67 DE E8 54
##$RELAX= 
##$RELAX= 
##$RELAX= 
##$RELAX= 
##$RELAX= 
##$RELAX= 
$$ Bruker specific parameters
$$ --------------------------
##$DU= <F:/spectra>
##$EXPNO= 1
##$NAME= <H-F>
##$PROCNO= 1
##$TYPE= <nmr>
##$USER= <she>
##$AMP= (0..31)
100 100 100 100 100 100 100 100 100 100 100 100 100 100 100 100 100 100 
100 100 100 100 100 100 100 100 100 100 100 100 100 100 
##$AQSEQ= 0
##$AQ_mod= 1
##$AUNM= <au_zg>
##$AUTOPOS= <>
##$BF1= 200.13
##$BF2= 200.13
##$BF3= 200.13
##$BF4= 200.13
##$BF5= 200.13
##$BF6= 200.13
##$BF7= 200.13
##$BF8= 200.13
##$BYTORDA= 1
##$CFDGTYP= 0
##$CFRGTYP= 5
##$CHEMSTR= <none>
##$CNST= (0..31)
1 1 145 1 1 1 1 1 1 1 1 1 1 1 1 1 1 1 1 1 1 1 1 1 1 1 1 1 1 1 1 1 
##$CPDPRG= <>
##$CPDPRG1= <>
##$CPDPRG2= <>
##$CPDPRG3= <>
##$CPDPRG4= <mlev>
##$CPDPRG5= <mlev>
##$CPDPRG6= <mlev>
##$CPDPRG7= <mlev>
##$CPDPRG8= <mlev>
##$CPDPRGB= <>
##$CPDPRGT= <>
##$D= (0..31)
0 1.2 0 0 0 0 0 0 0 0 0 0.03 0 0 0 0 0 0 0 0 0 0 0 0 0 0 0 0 0 0 0 0 
##$DATE= 1561639288
##$DBL= (0..7)
120 120 120 120 120 120 120 120 
##$DBP= (0..7)
150 150 150 150 150 150 150 150 
##$DBP07= 0
##$DBPNAM0= <>
##$DBPNAM1= <>
##$DBPNAM2= <>
##$DBPNAM3= <>
##$DBPNAM4= <>
##$DBPNAM5= <>
##$DBPNAM6= <>
##$DBPNAM7= <>
##$DBPOAL= (0..7)
0.5 0.5 0.5 0.5 0.5 0.5 0.5 0.5 
##$DBPOFFS= (0..7)
0 0 0 0 0 0 0 0 
##$DE= 6
##$DECBNUC= <off>
##$DECIM= 24
##$DECNUC= <off>
##$DECSTAT= 4
##$DIGMOD= 1
##$DIGTYP= 9
##$DL= (0..7)
0 120 120 120 120 120 120 120 
##$DP= (0..7)
150 150 150 150 150 150 150 150 
##$DP07= 0
##$DPNAME0= <>
##$DPNAME1= <>
##$DPNAME2= <>
##$DPNAME3= <>
##$DPNAME4= <>
##$DPNAME5= <>
##$DPNAME6= <>
##$DPNAME7= <>
##$DPOAL= (0..7)
0.5 0.5 0.5 0.5 0.5 0.5 0.5 0.5 
##$DPOFFS= (0..7)
0 0 0 0 0 0 0 0 
##$DQDMODE= 0
##$DR= 18
##$DS= 0
##$DSLIST= <SSSSSSSSSSSSSSS>
##$DSPFIRM= 0
$$ [...]
##$SUBNAM2= <"">
##$SUBNAM3= <"">
##$SUBNAM4= <"">
##$SUBNAM5= <"">
##$SUBNAM6= <"">
##$SUBNAM7= <"">
##$SUBNAM8= <"">
##$SUBNAM9= <"">
##$SW= 24.9336996594482
##$SWIBOX= (0..15)
0 0 2 0 0 0 0 0 0 0 0 0 0 0 0 0 
##$SW_h= 4990.01996007984
##$TD= 16384
##$TD0= 1
##$TE= 0
##$TE2= 300
##$TE3= 300
##$TEG= 300
##$TL= (0..7)
0 120 120 120 120 120 120 120 
##$TP= (0..7)
150 150 150 150 150 150 150 150 
##$TP07= 0
##$TPNAME0= <>
##$TPNAME1= <>
##$TPNAME2= <>
##$TPNAME3= <>
##$TPNAME4= <>
##$TPNAME5= <>
##$TPNAME6= <>
##$TPNAME7= <>
##$TPOAL= (0..7)
0.5 0.5 0.5 0.5 0.5 0.5 0.5 0.5 
##$TPOFFS= (0..7)
0 0 0 0 0 0 0 0 
##$TUNHIN= 0
##$TUNHOUT= 0
##$TUNXOUT= 0
##$USERA1= <user>
##$USERA2= <user>
##$USERA3= <user>
##$USERA4= <user>
##$USERA5= <user>
##$V9= 5
##$VALIST= <valist>
##$VCLIST= <CCCCCCCCCCCCCCC>
##$VD= 0
##$VDLIST= <DDDDDDDDDDDDDDD>
##$VPLIST= <PPPPPPPPPPPPPPP>
##$VTLIST= <TTTTTTTTTTTTTTT>
##$WBST= 1024
##$WBSW= 4
##$XGAIN= (0..3)
0 0 0 0 
##$XL= 0
##$YL= 0
##$YMAX_a= 34654
##$YMIN_a= -45895
##$ZGOPTNS= <>
##$ZL1= 120
##$ZL2= 120
##$ZL3= 120
##$ZL4= 120
##$ABSF1= 10
##$ABSF2= 0
##$ABSG= 5
##$ABSL= 3
##$ALPHA= 0
##$AQORDER= 0
##$ASSFAC= 0
##$ASSFACI= 0
##$ASSFACX= 0
##$ASSWID= 0
##$AUNMP= <proc_1d>
##$AZFE= 0.1
##$AZFW= 0.1
##$BCFW= 1
##$BC_mod= 2
##$BYTORDP= 1
##$COROFFS= 0
##$CY= 11.3945322036743
##$DATMOD= 1
##$DC= 2
##$DFILT= <>
##$DTYPP= 0
##$F1P= 18.9103706918063
##$F2P= -1.10871071338519
##$FCOR= 0.5
##$FTSIZE= 0
##$FT_mod= 4
##$GAMMA= 1
##$GB= 0.15
##$INTBC= 1
##$INTSCL= 1
##$ISEN= 128
##$LB= 0.24
##$LEV0= 0
##$LPBIN= 0
##$MAXI= 10000
##$MC2= 0
##$MEAN= 0
##$ME_mod= 0
##$MI= 1.114404
##$NCOEF= 0
##$NC_proc= 0
##$NLEV= 6
##$NOISF1= 3.799351
##$NOISF2= 2.8
##$NSP= 1
##$NTH_PI= 0
##$NZP= 0
##$OFFSET= 15.70392
##$PC= 1
##$PHC0= -8578.896
##$PHC1= 15.40098
##$PH_mod= 1
##$PKNL= yes
##$PPARMOD= 0
##$PSCAL= 0
##$PSIGN= 0
##$REVERSE= no
##$SF= 200.130013532006
##$SI= 16384
##$SIGF1= 3
##$SIGF2= 2
##$SINO= 400
##$SIOLD= 16384
##$SREGLST= <1H.CDCl3>
##$SSB= 0
##$STSI= 0
##$STSR= 0
##$SW_p= 3612.71676300578
##$SYMM= 0
##$S_DEV= 0
##$TDeff= 0
##$TDoff= 0
##$TI= <>
##$TILT= no
##$TM1= 0
##$TM2= 0
##$TOPLEV= 0
##$USERP1= <user>
##$USERP2= <user>
##$USERP3= <user>
##$USERP4= <user>
##$USERP5= <user>
##$WDW= 1
##$XDIM= 8192
##$YMAX_p= 0
##$YMIN_p= 0
$$ End of Bruker specific parameters
$$ ---------------------------------
##NTUPLES= NMR FID
##VAR_NAME=  TIME,          FID/REAL,        FID/IMAG
##SYMBOL=    X,             R,               I
##VAR_TYPE=  INDEPENDENT,   DEPENDENT,       DEPENDENT
##VAR_FORM=  AFFN,          ASDF,            ASDF
##VAR_DIM=   8192,          8192,            8192
##UNITS=     SECONDS,       ARBITRARY UNITS, ARBITRARY UNITS
##FACTOR=    0.0002004,     1,               1
##FIRST=     0,             0,               0
##LAST=      1.6414764,     0,               0
##MIN=       0,             -45895,          0
##MAX=       1.6414764,     34654,           0
$$ Real data points
##PAGE= N=1
##DATA TABLE= (X++(R..R)), XYDATA
$$ [...]
962h2r35J817K86j702P54K60j537P76J010p18N15K42j363J56O14n49O71O32q34
981A3m0j8r00O85R85n54K8P1q86K82N63n75N22N77r77N0M23r06L93R67r01J21
1003g7J009j217o05J107l49l8J253p92j154Q37mn07J063J42q88K23j48n09Q28
1022A74L66o05J27k3l82M13L1m41M79K22m58J38m5m23M58K34m10L74O3p25J76
1043b57L61j92M12O2q63J53N87l52J25K99o00M6M96m11K0M96n03k35N22j47LL29
1065C51o16k26P82r0k97L55l82l13P02p8m48N42q3o78M27L43l84K31N4n98K47
1086a59N35l07j96J40r4N4J28j04j3j0%Q0j24K7K75l13k56N42pl93L07j51m16
1109d55P41J92q56K57L87o61L16O26p17l9N98p13j11J002l11o42M78j17l32O71
$$ plain form
962 -82 -1017 800 1086 -616 138 398 -1139 -363 647 -71 444 686 -677 -521 93 -456 215 847 13
981 13 -27 -45 -945 -260 725 171 199 270 -616 -334 229 -346 176 753 -224 -174 249 -657 -264 703 -198 -77
1003 -77 932 -285 -890 217 -132 -170 1083 291 -863 -26 -30 -537 526 668 -220 3 -145 -654 174
1022 174 540 -65 62 39 -343 70 101 -340 139 361 -97 41 -4 -427 31 265 -145 229 292 -433 -257
1043 -257 104 -88 324 386 -477 -324 263 -89 36 335 -265 -219 277 -134 -114 382 -121 -356 166 19 22 351
1065 351 -265 -491 291 201 -96 259 -123 -436 266 188 -260 282 199 -479 -52 291 -93 138 192 -406 -159
1086 -159 376 69 -127 13 -81 -27 101 -3 -16 -26 -26 54 -70 -43 232 -81 -337 205 198 -195 112 -39 -455
1109 -455 286 478 -378 -121 266 -395 -79 547 -170 -209 389 -324 -435 567 256 -386 92 -25 -357 314
1129C14lo55K88K78l90J13K57j99o7P7q5O0J31Qk14j36K96J63l34K0J71k33J42
1152BK37m24M8M47m20j41N60l05k44M86l49k25P61k98o46O38L7m90O10p3p62O58
1174A07K70q25M75M77q50J46N35o14J78O49p19l04P40j77k97M31j60l52L70P8
1194A58l08J06K68j66l05J83L26k84j08L57l56j61P41l52p07R28Q0j017P62L82
1214E27j172O48P63j416L19J275j314k87J456q75n90J409p26r13J507j70j258
1231h17J045K26j111P61M19j008M58N39r02R8P08l96j31K61k81l5L09k1j43j05
1251a26J94J06m48J79N18n54r3O39o73j24J096p85o45J364m35j036J369k10j289
1270i53J490J27j789J323P77j957Q66J177j906N41J508j929OJ979j515o79J888
$$ plain form
1129 314 311 -344 -56 222 -168 -55 202 3 -64 13 -72 -12 119 127 -87 -223 73 236 -98 -78 93 -140 2
1152 2 239 -185 -137 310 -110 -251 309 4 -240 246 -103 -328 433 135 -511 127 164 -326 284 211 -551 107
1174 107 377 -448 27 504 -346 -200 335 -279 -101 548 -171 -475 265 88 -209 222 62 -290 80 158
1194 158 -150 -44 224 58 -247 -64 262 -22 -130 227 -129 -290 451 99 -608 320 400 -617 145 527
1214 527 -645 3 766 -650 -331 944 -370 -657 799 -76 -666 743 17 -896 611 441 -817
1231 -817 228 454 -657 104 523 -485 -27 512 -390 -292 416 20 -111 150 -131 -166 143 122 -21 -126
1251 -126 68 174 -274 -95 423 -131 -224 415 -258 -382 714 -71 -716 648 213 -823 546 336 -953
1270 -953 537 664 -1125 198 975 -982 -116 1061 -845 -304 1204 -725 -719 1260 -255 -934 954
1287I54r49r23J734n75j241J487K7j316R43L92r86M40L61p08K55M61l61j99J46
1306e8K33j09l53M27J40p26N22M45j137N44J038j615M0J740j425n22J997j317
1324a36j125K439p96j870K380p2k334J961N50k405J674J062k643J032J689k330
1340i24L77J879j948q9J963j646o11K022r30r91J547m42r76J141j17q08P55J54
1358C56o24J36J14Q2Q0l22K49Q9o12O21K52j060P62O20j552N93J205j614K87J493
1378A155j889j8K214j835p93K562j407j410K687r31k021K779k18k652K370O70
1394A263k846J625J314k577J066J664k489K23J986j670k20J733j258n48J423q28
1410a39n70J280l12o12N56k12k59L23j25J34J24k99L55l14p37J109K74j207J039
$$ plain form
1287 954 5 -918 816 241 -1000 487 514 -802 141 533 -453 -13 348 -360 -105 356 -5 -204 -58
1306 -58 175 66 -287 140 280 -446 76 521 -616 -72 966 -649 -609 1131 -294 -816 1181 -136
1324 -136 -1261 1178 382 -1488 892 820 -1514 447 997 -1408 266 1328 -1315 -283 1406 -924
1340 -924 -547 1332 -616 -705 1258 -388 -999 1023 93 -898 649 207 -769 372 255 -553 202 356
1358 356 -268 -132 -18 64 144 -178 71 160 -452 169 421 -639 123 743 -809 -216 989 -625 -338 1155
1378 1155 -734 -752 1462 -373 -1166 1396 -11 -1421 1266 335 -1686 1093 875 -1777 593 1263
1394 1263 -1583 42 1356 -1221 -155 1509 -980 -757 1229 -441 -661 1072 -186 -734 689 -139
1410 -139 -709 571 259 -353 203 -9 -268 55 -70 64 188 -111 244 -70 -807 302 576 -631 408
1429D08L19j913J002J136j903R43J710k511k16K203j810k98K637j677j243K467
1445A254j332j679K757k63j878K158k75k487J941O75k151J698J143k461M59J105
1461F64j764P23J793j430l86J002j119l47J175j21J2L88o74l35R1q1O80J73m64
1480b0N56m31j193Q96M45o65J311Q5k015P26O71j617J368J586k105J68J169k386
1498a451L53K732j608n98K189j916j496K503n93j225K635m20k480J425J92j700
1514a458J823J016j708N80K77j906O30J460n97L42L94j396k15O19k60N71O51m99
1532C24k38m23n38P29L89j57P22l85j143N94j39p19J676N33j590M77J09j697J173
1551c03J450j416N64R74k293j30J814j041K09J800j679j007J639j021p08K200
$$ plain form
1429 408 727 -1186 -184 952 -951 -8 1702 -809 -1025 1178 -632 -930 1707 30 -1213 1254
1445 1254 -78 -1757 1000 737 -1141 1017 742 -1745 196 871 -1280 418 1561 -900 -441 664
1461 664 -1100 -377 1416 -14 -400 602 -517 -864 311 190 202 590 -84 -419 -328 -409 271 444 -20
1480 -20 536 105 -1088 -192 253 -412 899 984 -1031 -305 366 -1251 117 1703 -402 -234 935 -1451
1498 -1451 -1098 1634 26 -572 1617 -299 -1795 708 115 -1110 1525 1105 -1375 50 242 -1458
1514 -1458 365 1381 -327 253 530 -1376 -746 714 117 459 853 -543 -758 -139 -399 172 823 324
1532 324 86 -337 -875 -146 243 86 808 423 -720 -126 -265 -984 692 1225 -365 112 221 -1476 -303
1551 -303 1147 -269 295 1269 -1024 -1154 660 -381 -172 1628 -51 -1058 581 -440 -1148 1052
1567A052l25j255J238o95j498J624N14j051J068J24j631L84M93o22R52O38j079
1584f9j67R5m93N58M70l00L20k18p51L31J04j58Q71j51q26N99j97r12R92M17q16
1605c01Q17L4j577P20Q81j114O78R00j516K9R99j208K25J533j079n48J133q72
1623b66m72J347n16n97J198m64r55Q96o5n66R28r4q13O30o8o85P02J93n05M53
1643B81k09o29O62J39m82M64p7n28N40n2n58P10N6p41N34R4o35O33J18q48O08
1664H0L64q91M26M04q05M85M54j006L09P28q68J47P20q22J8P48q11k7R94o63l75
1685c91P59m95k52Q62m37m65Q12l06n44O62j24l63O21k32m97N84q1m68N05ol30
1706a86M66k44n01N79N5m02N01j15n21N18p2n41O87J47o84L89O1o14N84K52p48
$$ plain form
1567 1052 727 -528 710 15 -1483 141 655 -396 672 796 -835 -451 42 -580 372 1010 -69
1584 -69 -236 -141 -634 -76 394 94 414 196 -555 -224 -120 -278 593 442 -384 215 18 -894 98 515 -301
1605 -301 516 550 -1027 -307 574 -540 138 1038 -478 -449 550 -658 -433 1100 21 -527 606 -266
1623 -266 -738 609 93 -504 694 230 -725 171 106 -460 468 374 -439 191 123 -562 140 333 -172 281
1643 281 72 -557 105 244 -238 226 149 -379 161 109 -449 261 317 -424 110 204 -431 202 320 -528 80
1664 80 444 -447 -21 383 -422 63 517 -489 -180 548 -320 -173 547 -275 -257 491 -320 -347 647 -16 -391
1685 -391 368 -127 -379 483 46 -419 393 87 -457 205 81 -282 339 107 -390 194 113 -355 150 144 -186
1706 -186 280 36 -465 114 169 -233 268 153 -368 150 78 -463 224 371 -313 76 137 -477 107 359 -389
1727c89M68L25p91K69M00n93L77M27p93J13N62o53R3O15n78M4N32p01q2P78m27
1748dk02N72m54j97O30l85l04O95k46l97M71j84k56N31j90l84M83n9l54L49j14
1769Ak04M22j62l24M27p6k81L60j95k17N43k26m39N63p6m56N46p0n16O19lp09
1791d73N70K68p20L85K64o96M22M39p83J74N69o20K1N08n01M8N09n37j06N56l03
1812fj39L67l03n9L69l26q5M11k26q7K42l46N7M27l62o6L97l67q0L95l62QN76
1835D35m96k88N90k78k13O03l53l52O55k53m76O53n0m85N10j17m85O15L0o09M40
1856G6J48m81L57P7n02M39J52n71L19K36m46K51J26m62L44K15n17K33K40m55K70
1877D9J41n02L91K70o40K35L13n52L21L49p16K54N27p55P9O71n72k6N69o62p8
$$ plain form
1727 -389 79 404 -387 -118 282 -311 66 493 -300 -187 375 -278 -185 430 -148 -104 428 -273 -355 423 -4
1748 -4 -206 366 -88 -285 345 -40 -344 351 105 -292 179 -5 -261 270 80 -304 179 120 -234 115 1
1769 1 -203 219 57 -267 160 84 -197 163 -32 -249 294 68 -371 192 116 -340 206 136 -380 239 236 -473
1791 -473 97 365 -355 30 294 -402 20 459 -324 -150 419 -201 -180 328 -173 -125 384 -153 -259 297 -6
1812 -6 -145 222 -81 -140 229 -97 -182 229 3 -84 158 -188 -131 296 -66 -132 265 -102 -182 213 -149 -141 435
1835 435 -61 -349 241 -37 -250 353 0 -352 303 50 -426 227 177 -308 202 85 -400 215 245 -364 76
1856 76 224 -257 100 177 -325 114 266 -305 14 250 -196 55 181 -281 63 278 -239 -6 234 -221 49
1877 49 190 -312 79 349 -291 -56 257 -295 26 375 -341 -87 440 -315 -236 435 -137 -163 406 -256 -334
1898c34P78m92k87O79l77k89O01l22k63O54k75m21N02j14k27M36k51k75M97k01
1918A9k67M56j85j86M44l90k04O87l16l64O38l53l79Q27l23o13R20j60q43Q38
1938B46O3q24Q06J21j057P07M63j017M53N61r52L38N75q95K45P46q21m1O79o06
1958b10RO24n83r6O36m93j39N12l50QL74n02K7M78m25N0L93n54J52M57o81J62
1980a51O98p60n8P13p51K7R83q78l07J085p20m34J190n85o16J175n53q61J329
1999E26j33j067J037m1j082J053K33j213Q29M53j180N36N61r71M23N64r58K70
2017a60O56p74Q2M95n35K22L70o51J82L67n23K82K49n88M32K30q09M91M27q82
2037d37M53M73j002N04O78j289L32J048j122J27J048j298r4J374j040k86J509
$$ plain form
1898 -334 444 -48 -335 344 -33 -322 279 -43 -306 348 73 -348 154 40 -187 249 -2 -277 220 19
1918 19 -248 208 23 -163 281 -109 -313 374 58 -306 332 -21 -400 427 104 -509 411 251 -592 246
1938 246 309 -515 291 412 -645 62 525 -492 -39 522 -430 -92 483 -412 -167 579 -242 -283 396 -210
1958 -210 -201 423 -160 -256 380 -113 -252 260 -90 -82 292 -210 -183 295 -130 -80 313 -241 -89 368 -313 -151
1980 -151 547 -213 -271 442 -309 -282 701 -177 -484 601 -119 -553 637 52 -564 611 58 -803 526
1999 526 393 -674 363 322 -760 293 526 -687 142 595 -585 -49 512 -459 -36 528 -430 -160
2017 -160 496 -278 -196 299 -236 -14 356 -295 -113 254 -269 13 262 -326 106 336 -473 18 445 -437
2037 -437 16 489 -513 -9 669 -620 -288 760 -362 -235 813 -485 -579 795 -245 -531 978
2054I78j009q02J381o00o47J584n47j209J230j36j019J225R1j114Q76Q0j128Q39
2072G3M30r19N47K55q16M61K22p56N32L77n79L26k6o76O08J75n64O89j9q84O16
2093G2P3p81J023K19j255P53L84j252Q00O56j395P27R22j601K81J161j400K19
2111c94J475j308k46J348j345m87J814o20p22J257q53r72J479j18q45J156k06
2128D13j161P90R9o44R05N2q52M91M9n90N59Ll64O35j93o05N33k21l46R37k51
2149B39o42Q56m47q72J209M9q93J047j97j357J199L80j366J051N29j565P58P76
2167G54j586O44J160j509K20J303j406j54J304j097j36J523r89p62J202n74n49
2184f52J294l43p71Q35l48o74R11N8n04M89k89m48O34j25l22N62k89k79N80m63
$$ plain form
2054 978 -31 -833 548 -52 -699 885 338 -871 359 223 -796 429 520 -594 282 362 -766 73
2072 73 503 -416 131 386 -430 31 253 -503 29 406 -173 153 127 -549 59 234 -330 359 340 -544 72
2093 72 145 -636 387 606 -649 104 488 -764 36 692 -703 24 946 -655 -374 787 -613 -394
2111 -394 1081 -227 -473 875 -470 -957 857 237 -485 772 -81 -1053 426 308 -537 619 413
2128 413 -748 42 141 -503 402 454 -398 93 142 -448 111 114 -250 385 192 -413 120 -101 -447 490 239
2149 239 -403 453 6 -866 343 392 -501 546 349 -1008 191 571 -795 256 785 -780 -22 754
2167 754 -832 -188 972 -537 -317 986 -420 -574 730 -367 -503 1020 31 -731 471 -103 -652
2184 -652 642 299 -472 363 15 -659 252 310 -194 295 6 -442 192 67 -255 307 18 -261 319 -144
2204a44k47Q36m55l89Q79m76n36R99m63o66J269l19j036J108q9j069J206J27j368
2223h33J026M49j451Q14P31j372N38Q43j341L45J092j228l7J089r00j27J004q47
2241b05k59J019o19l89Q97m11l85O92l79l26P20k76l82N18k63j75N04l48j53N50
2261C30m40j98O19m05j27O80o28l09R45m50m61R13m32o19J024k97p73J082j37
2280C17j021R10J63r56Q66J96j189P51N43j076M62O10j056L20P28r02J49P76q48
2299b57q4P64n22j04O08n78j19O85m09k08M49l70j2N45m25j53M15m26p3O17k91
2320E2j24L40o03p7P90k75k00M48n78k58Q40l14l30P71m35n82P96j40n39P54j59
2341A77p24Q17J34q94M83J94o48P20L39r50K10L26o74M73O44o68k5K47p09K76
$$ plain form
2204 -144 -391 445 -10 -399 480 4 -532 467 4 -662 607 288 -748 360 271 -798 408 535 -833
2223 -833 193 642 -809 5 736 -636 -98 745 -596 -251 841 -387 -424 665 -235 -362 642 -205
2241 -205 -464 555 -64 -453 444 33 -352 340 -39 -365 355 79 -303 215 -48 -223 281 -67 -220 330
2261 330 -110 -308 311 -94 -221 459 -169 -478 467 17 -444 469 37 -582 442 145 -628 454 317
2280 317 -704 206 369 -587 279 475 -714 37 580 -496 -34 576 -480 -160 568 -334 -185 591 -257
2299 -257 -341 423 -99 -203 405 -173 -292 393 -16 -224 225 -145 -157 388 -37 -190 225 -201 -274 343 52
2320 52 -72 268 -335 -412 378 103 -97 351 -227 -485 355 41 -289 482 47 -535 261 121 -418 336 177
2341 177 -547 270 404 -490 -7 187 -461 259 598 -352 -142 184 -490 -17 627 -41 -66 181 -528 -252
2361b52P99m40j76K98n10M2N33l61m3M06l38m1L15m11m8L80k56J58M60n86l28
2382c99L29k06K97P05o11m96L51l22N2Q50k53m79L50m23k94Q63k2n04M33j52m67
2403c98N83m2o12N31K76m52L24k8p22L39M21k72L84J19q10o7L65n7M36K33p01
2424a50j50K47k00L18L34m17k2J90m09J20L73l50L7L49k94L4J67n42J5O29j03
2445A76m6J49o12j58O12n7J7L92n09m49M19J9nM98k97n22L68M4k30L51p5k78L63
2468A70j2l57K14ok31L52J01k58J48j65l70M09K88k11J14j75m12L51K40k57K24
2489A57M5m57J98J88k99K60J88m92J31L18l57K4K61l54J39M00l99j63L40k23k6
2510a21L70k24j59K64k08j51L77m4j80J45j28q8K68p6j72K01n0j05J23q5l8K17
$$ plain form
2361 -252 547 107 -69 229 -281 -239 294 -67 -110 296 -42 -83 232 -179 -227 153 -103 55 515 -71 -399
2382 -399 -70 -276 21 726 115 -381 -30 -352 -300 550 297 -182 168 -255 -549 314 292 -212 221 69 -398
2403 -398 185 143 -469 62 338 -114 210 182 -540 -201 220 -52 332 451 -359 -426 -61 -118 318 551 -150
2424 -150 -300 -53 -253 65 399 -18 -40 150 -259 -139 234 -116 -79 270 -24 10 177 -365 -350 279 176
2445 176 130 279 -333 -491 121 64 81 473 -36 -485 -66 -47 -52 446 149 -373 -5 39 -191 160 85 -193 170
2468 170 158 -199 15 9 -222 130 231 -27 121 -44 -414 -5 283 72 186 11 -401 -50 190 -67 157
2489 157 202 -255 -57 131 -168 92 280 -212 -81 237 -120 -96 165 -189 -50 350 -49 -212 128 -95 -121
2510 -121 249 25 -134 130 -78 -229 148 104 -76 69 -59 -147 121 45 -127 74 24 -81 42 -43 -81 136
2532A36j19r1J45j16k4K16j91p7L02k08j78L66j00j89K93j94k49M72J3m36K85
2553E6O0l55L37J32m48K04K04m00J71L23l77n3K48k43J14L52l18k59K42nJ6J97
2575A98j77j92J16J7L1J45p8j10o0l7K31J33k38p4L3p5K61J27l93RJ99j81J74
2598E9K60m14r1K61k15J23M56m16l80L65n5QM55l31m99L99J08k03L73p6n32K37
2620a08K29k03K70O1n53L4L77k3N4ol80k3L66O1k3r6k06j8J54J41J40j92k94Q4
2644a54R8J17K99k78m74K69K29j14K71j13n63K80L52k93K21J63o67M4N71k00%
2665E8K72o14j83P48l4k81K32l48k86O07J09l16J56j57l46L74K94k03k2j70k34
2686c44L26L08j67j28j67p7L04J34r8j8k38q9L16N8m5J09l62k12N01J12k15J54
$$ plain form
2532 136 17 -74 71 -45 -69 147 -44 -121 181 -27 -205 161 61 -128 165 -29 -278 194 207 -229 56
2553 56 116 -239 98 230 -218 -14 190 -210 -39 284 -93 -146 102 -141 -27 325 7 -252 -10 -15 1 198
2575 198 21 -171 -55 -38 -7 138 60 -50 -110 -147 84 217 -21 -95 -62 -137 124 251 -142 -133 66 -115 59
2598 59 319 -95 -186 75 -140 -17 439 23 -357 8 -47 -39 416 85 -414 -15 93 -110 263 187 -345 -108
2620 -108 121 -82 188 249 -304 -270 107 84 138 132 -248 -271 95 156 133 37 -169 -187 -33 108 248 56 -238 -154
2644 -154 -56 61 360 82 -392 -123 106 -8 263 150 -413 -133 219 -74 147 310 -357 -313 258 58 58
2665 58 330 -284 -467 281 247 -34 198 -150 -436 171 280 -36 120 -37 -383 -9 285 82 60 -110 -344
2686 -344 -18 290 123 -5 -172 -249 55 189 91 73 -165 -254 62 120 75 184 -178 -390 111 223 8 162
2708A62k76l23O09J53m54K20k7n09M73L94n29J02J80o02K66O92m78k23L20m12
2728b62M9P00l30m32L48j55j60N29l6m10J47n8j59M21R5l68n3K6K3K67j4k18m9
2751i9l5J11K00j39o8Q5k86P2M58k21k33K72l00j00O67j69n57M15k0l88N80Q5
2773C30o67L24K05n18M12L51o57P2L30m58K81M92o55j45N42l29m7N21l96k95M70
2794A63j39k17M29q7l66J81N2m8K01j23j96J27k5Q4J36k56l6K47k12rL14k49j12
2817a41K69k44l1M35l12k25M28j93k11N37k96m01O67j19n83O09O5o61M97K45p12
2838c77L77M17p09J18N44m91k7M06l94LM16l68p7L74k62n9L12k96m5L84k73j50
2860a77L07j43j02K42j14n8J38k22L3K32j65R5J09m82J16N01l72m3M40m99k19
$$ plain form
2708 162 -114 -437 172 325 -129 91 64 -445 28 422 -107 -5 175 -427 -161 531 53 -170 150 -262
2728 -262 -213 487 157 -275 73 -82 -242 287 251 -159 -12 -70 -229 192 287 -81 -134 -108 -85 182 168 -50 -99
2751 -99 -134 -23 177 38 -30 55 -231 -159 299 78 -155 117 -183 -283 384 215 -342 73 53 -335 245 330
2773 330 -337 -13 192 -326 86 437 -220 -148 182 -276 5 497 -158 -303 239 -90 -137 384 -12 -307 163
2794 163 24 -193 236 149 -217 -36 16 -32 169 46 -150 -23 -48 36 172 -84 -120 127 -85 -94 220 -29 -141
2817 -141 128 -116 -147 288 -24 -249 179 -14 -225 312 16 -385 282 163 -420 189 254 -407 90 335 -377
2838 -377 0 417 -292 -174 370 -121 -148 258 -136 -133 283 -85 -162 212 -50 -109 203 -93 -138 246 -27 -177
2860 -177 130 -13 -115 127 13 -45 93 -129 -96 136 -29 66 175 -307 -191 310 -62 -105 335 -164 -383
2881c83O70k46k95N90k72n06N67L3l81M30j51m45N95P4n71L62K9n20N68L01o85
2902b36J97K36o19K84O46m12j89J64l57R8M88j28j54J0k48J86J90k51J47J20l86
2923b14K01L27m52k4K54l06K26M90m82l05J77k06L46N63n00k71J98m73J57Q81
2943E87l59m18L92m80k68R43o2o57M19Nm18M77M1n73K99K30k01L32j04n93J95
2964b13K05r2N87J4q78k5L02p7N12K62o99j99J93j07L11K46l44Qj9k61L65J21
2986B12n24K51L37l64K58J43q66Q3P88j64M1K36p80k81O29L2J98L80o85m72M31
3007a17j6J54N87n53m99N52r6l08N54j57m46N33R4m62J84n7l29M45L15j97ql93
3029b20l59N64L48j55J64l71n59M64L39k32L10k3o28J90K87k25K30N5m25K85K51
$$ plain form
2881 -383 287 41 -254 336 64 -442 125 158 -223 207 56 -389 206 280 -291 71 100 -420 148 449 -236
2902 -236 -39 197 -422 -138 508 96 -93 71 -286 -188 300 172 18 28 -220 -34 156 -95 52 172 -214
2923 -214 -13 314 -138 -162 92 -214 12 502 20 -285 -108 -314 32 595 95 -176 22 -451 -294 587
2943 587 228 -190 202 -278 -546 397 335 -322 97 102 -316 161 202 -371 -72 158 -43 289 185 -408 -213
2964 -213 -8 -100 487 501 -377 -402 -100 -177 335 597 -102 -301 -108 -215 96 342 -2 6 -13 -274 91 212
2986 212 -312 -61 276 -88 170 313 -553 -470 318 154 195 431 -349 -630 -1 31 229 609 -76 -548 -117
3007 -117 -133 21 608 55 -444 108 12 -296 258 101 -345 188 282 -180 4 -53 -382 63 378 181 173 -220
3029 -220 -579 -15 333 178 342 -29 -588 -124 215 -17 293 270 -358 -168 119 -106 124 179 -246 39 290
3050B90m48J16P0l97M69M39o20q2K51n11K26P35l76k68K11m56l1P13p6k81J48
3071A22l12q1M71j35j81L10k33j55M05j89k61L64j16j79M37q9m28J90J4n1L90
3092B93j16l57J77p8q8M30j27l25L33j27l36N04N6m76K82J10m03L34J70n28K04
3113f8L07l68J50J63m34J94K91m00J22K89m48N8L88l52J8L60m07j27M76j52j98
3134a38K68j83j14L12j14j44K03j19m3J74j67l6K69k22n4L30k21j81K71j48n3
3155a10M15k27l15K71o3j08L97j57l18L33j15k67M64km40L13O1m05L89J35n41
3176b90K02L29l47R8J63m19J14L52k16L7J47l72J5K81j30J15J60m14o7L40r4J7
3198B1J76l14n9K97j13m7J54j93rK06j33L7J32l38J4L59j30m5J60l75p9N04r6
$$ plain form
3050 290 -158 -42 28 -369 100 539 -81 -163 88 -423 -197 538 162 -106 105 -351 -382 331 255 -26 122
3071 122 -190 -271 200 65 -116 194 -39 -194 211 22 -239 125 9 -170 267 178 -250 -60 -46 -97 293
3092 293 177 -180 -3 -81 -169 261 134 -191 142 15 -321 183 239 -237 45 155 -248 86 256 -272 -68
3113 -68 239 -129 21 184 -250 -56 235 -165 -43 246 -202 -144 244 -108 -90 270 -137 -264 212 60 -138
3134 -138 130 -53 -167 145 31 -113 90 -29 -72 102 -65 -101 168 -54 -108 222 1 -180 91 -57 -110
3155 -110 305 78 -237 34 -29 -137 260 103 -215 118 3 -264 200 198 -242 71 132 -273 116 251 -290
3176 -290 -88 241 -106 -8 155 -264 -150 202 -14 23 170 -202 -187 94 -36 79 239 -175 -242 98 4 21
3198 21 197 -117 -176 121 8 -39 115 -78 -87 119 -14 23 155 -183 -169 190 60 15 175 -200 -279 225 129
3221A29j95K37k41k08M10j1k10K84j87l18M04Q4k60J85r2l27M09J82m24J21Q6
3242E8k97K41K56l20j3J24k38J33K68j89m5k8j53K15K12k50k2M9j93K08K07k96
3264g3K6J32k51J14K92k26p0J32k48J09L47k67j37J95j87K8L42k45k03L00j19
3285ij47L54r0k68J92o1j06L23m1k97J12J5o8K64p2k68J83Oj86K62L4k74J45L5
3309C8k08K43J01l02P2J00j39J80K1k81J36J28k05J65J01l03J15J42k60J74K23
3330B41l52j9K19j67P7K23l08n6K90j92k9K47j98r4K49j58q1K99j51k08K29l8
3352B3r5K13j19j87J97Pq9J28p3r3J44q0o9K18p7j89J88o3j06K71r2k56K49J6
3376F6k05K09J5k52K00N8k70K22J20l11J14J53k32J38J68l52P2K55k13kK00k34
$$ plain form
3221 129 -66 171 -70 -278 132 121 -89 195 8 -310 94 178 -82 103 11 -316 93 275 -149 -28 58
3242 58 -239 2 258 -62 -75 49 -189 -56 212 23 -22 -50 -203 12 224 -26 -48 1 -192 16 223 -73
3264 -73 -47 85 -166 -52 240 14 -56 76 -172 -63 284 17 -120 75 -112 -84 258 13 -190 110 -9
3285 -9 -156 198 108 -160 32 -29 -135 188 147 -150 -38 -23 -91 173 101 -167 16 22 -164 98 132 -142 3 38
3309 38 -170 73 174 -128 -56 44 -95 85 106 -175 -39 89 -116 49 150 -153 -38 104 -156 18 241
3330 241 -111 -130 89 -78 -1 222 -86 -142 148 -44 -73 174 -24 -118 131 -27 -108 191 40 -168 61 23
3352 23 -72 141 22 -165 32 39 -50 78 5 -88 56 -24 -93 125 48 -141 47 -16 -122 149 57 -199 50 66
3376 66 -139 70 85 -167 33 91 -179 43 163 -148 -34 119 -113 25 193 -159 -87 168 -45 -47 153 -81
3398h1j3K33j86j2K23j73j21J96p3j2J66j86r5K13n0p1J24j10p2J69q0m6J68j02
3422Ij04J27p6J3J72j78j13K31p4p3J89j58j30K70q4j69K72n4k53K28J4k12K55
3445A02J0l37K19J64k63J18J12k69J05K04k43L3J87k24jJ87j23J5J11j98jK12
3467A20j01k3N8j42M0J70j26k9J08j35nJ26r8N0R2k24L1J89j35J6J36k45J6K93
3491A82k16r7K68j73j10K85j22j67K75j17k07L04Rk26J61l4j98K88N6k97J49R3
3513A06k61J69J53k59P8J38k27L7J87j24m4Q2p8P2O6j53L0M0o0J20L2k09P9R1
3537F5j90J26J61k09K0N9j97J47J98k27OJ35k25P0K20k72J6L01k51j20L23j77
3559b1j73L31r1j95L03q2l07K23R4j22J60p0k14J53L3j15K03nj93J08mj52J90
$$ plain form
3398 -81 -94 139 -47 -59 164 -9 -130 66 -7 -19 147 -39 -134 79 29 -42 82 -28 -100 69 -11 -57 111 9
3422 9 -95 32 -44 -31 141 -37 -150 81 7 -66 123 -35 -165 105 21 -148 124 70 -183 45 59 -153 102
3445 102 112 -225 -6 158 -105 13 125 -144 -39 165 -78 -45 142 -82 -83 104 -19 -4 107 -91 -92 120
3467 120 19 -4 54 -88 -48 122 -4 -33 75 -60 -65 61 -37 13 105 -119 -88 101 -34 -18 118 -127 -111 182
3491 182 -34 -131 137 -36 -146 139 17 -150 125 8 -199 105 114 -112 49 15 -183 105 161 -136 13 106
3513 106 -155 14 167 -92 -14 124 -103 -66 121 -3 -47 35 -43 29 95 -58 -28 12 -48 72 104 -105 -26 65
3537 65 -125 1 162 -47 -27 32 -165 -18 180 -47 -41 94 -131 -61 159 -113 -97 204 -47 -167 156 -21
3559 -21 -194 137 46 -149 154 72 -235 -12 82 -40 120 50 -164 -11 22 -93 110 105 -88 20 16 -136 54
3582E4P3k12P4J00j25K6J7q0J12N6r6O2q1j46K13J4j54K37j3l53J44J97k07J37
3606D9J47l49L9K36k11K7K18k00j7J92k57nK74k09m6K95j79j51K44j37j58L58
3628A60j5k67J16K3j31J44O6j04N6m8p2J03l8j2J44j36j28K57q2j66J94j2j39
3651h7J92l5k12J55M2j40J65oj63J51n6j93K65O8k94J70Q8k88J69K09l25N2K68
3674A95k65n7K43j60m3J95j36l6J49j38k9J49j00KJ63k04n5K47j00r5J59p9r1
3697h6J68p0q1J34m9n9J12j07J8J71k17m1K62j39j40K58j15j69K89n6k81K49O5
3720A16k47J47Q4k19J39M9j91J56Q3k06Q8N8j89J79J05k93J00J75k11L1J53j66
3742e9j0J40j06mJ24j10rN8j07J16P2k16N8J64j77N0J64k33j0K36j76o8K33j20
$$ plain form
3582 54 127 -85 -11 89 -36 -10 7 -73 39 95 -1 61 -20 -166 47 61 -93 144 131 -222 -78 119 -88 49
3606 49 196 -153 -114 122 -89 -62 156 -44 -61 131 -126 -131 143 -66 -112 183 4 -147 97 -40 -198 160
3628 160 145 -122 -6 17 -114 30 96 -8 48 0 -72 31 -7 -19 125 -11 -139 118 36 -130 64 52 -87
3651 -87 105 70 -142 13 55 -85 80 74 -89 62 6 -187 78 146 -148 22 110 -178 -9 200 -125 -73 195
3674 195 -70 -127 116 -44 -87 108 -28 -64 85 -53 -82 67 -33 -31 132 -72 -127 120 20 -75 84 5 -86
3697 -86 82 12 -69 65 16 -43 69 -38 -20 151 -66 -107 155 16 -124 134 19 -150 139 83 -198 51 116
3720 116 -131 16 100 -119 20 69 -122 34 117 -89 -1 57 -132 47 152 -141 -41 134 -77 -46 107 -59
3742 -59 -69 71 -35 -39 85 -25 -34 24 -83 33 105 -111 -53 111 -66 -16 148 -85 -95 141 -35 -103 130 10
3766A0j20J97p4n9J81j57r7K23p5r9J96j30j54K75n3k16K35K4k60J72P8j83J08
3789B2O1j87Q7J10j05K3j6j09J51L6j44J17Pk08J36J01j40J35N5k72N8J61j14
3812c5P0Q1j94M1J09j68P9J59k00N0J30k29L6K24k15l6K92j51j36J53j13p2K71
3835A46l3j53R8q9j11J72Kk9J31j28j77J74L6q7J60o5j69J51J1j52J14N2r4J01
3859F1k9j03O9l4q5K03N3j46N4r5j78K53J57j78M7%k46J11J88j12Q4O3k60NJ80
3884F2q3M2R8j98N6K00k27o1J77r4J2K08j55j68J23p0nK60k7j70k1r6L8K30Pj38
3910@J7j00m8K06j3j05R8n0j09J50J1j37P1j6j7J78n5j93L8KL1K19m7k54O2K2
3936c9j04K45J06k66OL2j27K09J44k38l3R7j00J03J02k21%J72j06L0J24j97q8
$$ plain form
3766 10 -110 87 13 -46 135 -22 -119 104 29 -70 126 -4 -158 117 64 -152 83 107 -153 19 97 -86 22
3789 22 83 -104 -17 93 -12 11 -5 -114 37 73 -71 46 53 -155 -19 82 -58 77 132 -140 -82 79 -35
3812 -35 35 116 -78 -37 72 -96 -17 142 -58 -8 122 -107 -71 153 -62 -98 194 43 -93 60 -53 -125 146
3835 146 113 -40 58 -31 -142 30 32 3 134 6 -171 3 39 -48 112 47 -122 29 40 -112 2 54 -40 61
3859 61 32 -71 -2 -36 -121 82 135 -11 43 -52 -230 23 180 2 49 49 -197 -86 102 -10 74 137 -123 -118 62
3884 62 -21 21 119 -79 -23 177 -50 -111 66 -28 -16 192 37 -131 -8 -78 -83 177 150 -20 -41 -137 -99 131 138 0
3910 0 17 -83 -131 75 62 -43 55 5 -104 46 57 -80 -9 -25 -42 136 81 -112 -74 -72 -41 178 131 -123 -61 -39
3936 -39 -143 102 208 -58 -52 -20 -147 62 206 -32 -65 32 -68 35 137 -84 -84 88 -18 12 136 -61 -149
3959a49J90k9J5J30j73j70J38P0O1N0j59j15J17L9K7O1j44o9J05j7J8J29j52j19
3983a46J39J9J6P9j67j04J89L1m5P3j19j20J93K3r3J36q6k11J94J15j34Q3j2k35
4007a82J55J97j48k4M1j54P7J82j34k8O5j31L1J66o8o1L5r9L0J76p2r7Nl4Q0J02
4033A10j01m6K0o7Q1J20j23k6N6j57O4K36j37j02J06q7oK03j23j58J61pq0J40
4057G7n2j46J40J7j00J61k8k08R0J21r0J13Lk33P3J51q1K6L2j34L1R7o8K5M0j20
4083f3L0Q9n0K5Qj50P2J26m8j5k6j13R5J09q2J3rj30Q5J29j19L1O4k05M6K42j41
4110A3q6J21j36oK63j14j95J52j3r4J98lk10R0L4j09J87M7k04OO0l1J18L3j85
4135f4j2R2rP1qj28K2K0%J05qj49M1J3k4J57j9k34O0J03p1J20J7k20K9J57j00
$$ plain form
3959 -149 41 12 27 157 -16 -186 -48 22 83 133 -26 -141 -24 15 42 103 -41 -110 -5 -22 -4 125 -27 -146
3983 -146 -7 12 28 107 -60 -164 25 56 11 84 -35 -155 38 61 -32 104 18 -193 1 116 -18 65 53 -182
4007 -182 -27 170 22 -2 39 -115 -38 144 10 -18 47 -84 -53 113 45 -16 19 -80 -50 126 54 -43 -38 -72 8 110
4033 110 9 -37 -17 -84 -3 117 -6 -32 24 -133 -69 167 30 -72 34 -53 -59 144 21 -137 24 17 -63 77
4057 77 25 -121 19 36 -64 97 69 -139 -49 72 -18 95 98 -135 -62 89 8 34 66 -68 -37 60 -8 17 57 -63
4083 -63 -33 56 6 31 39 -111 -39 87 39 24 -2 -115 -20 89 7 20 11 -119 -34 95 -24 7 71 -134 -88 154 13
4110 13 -73 48 -88 -94 169 55 -140 12 -1 -95 103 100 -110 -20 14 -95 92 139 -65 -59 1 -30 88 121 -64
4135 -64 -76 16 7 78 70 -58 -36 -16 -16 89 81 -68 -27 -14 -38 119 100 -134 -74 29 -42 78 95 -125 -96 61 -39
4162c9N8R8j97l9J67n0K9Q8k06o0K15m2l2J00j67p8K39l9r7J19q9j23J76M1r1
4187a9R0p6j46J67J00j04Kl3q4J21P4p3j3j4o0R9J4m0M6q0o9J46J6p6P9r6j22
4214a51K17L6j65P1Oj42J40J07j99O1R8j99P4J75j50l3J14j39J5K04j22j12J24
4237C0m9m4J29m6q1Q4j0n4Q3nm5K7n5RJ15o8n8Q0n5l2J13o3o7J31m9q5J14j6o7
4266c4R9n9q1J38k0j03R8j3r4J13kj20J16L1j89J06Q1j21P0M2j76R5J29j46PQ7
4292E4j27L5J12j07rJ13j29l2J50l5l8M8p6k0J31qp2%l1K4R0n3j0L4j16L8J26
4319I2o9oO2j57kK11o0j18R7p5n3J93l5j40Q7j3j02J47L5j51N0qp7J47P3j74j4
4346f0M6m7J08O9j68j6P4m5N3O7j12pK3m4R7L5j13j0N0j2Q9L0j85j6J23j1M8K6
$$ plain form
4162 -39 19 117 -80 -119 48 -2 27 115 -91 -151 64 22 -10 90 -77 -155 84 45 -52 67 -22 -145 31 72 -19
4187 -19 71 -5 -151 16 116 12 14 -19 -103 18 92 19 6 -8 -68 31 45 5 51 -29 -98 48 64 -12 67 -29 -151
4214 -151 66 102 -63 8 14 -128 12 119 -80 -19 79 -120 -46 129 -21 -54 60 -79 -64 140 18 -94 30
4237 30 -19 -63 66 20 -61 23 13 -41 42 37 -8 19 -36 -27 88 20 -38 42 -13 -45 68 5 -62 69 20 -65 49 33 -34
4266 -34 65 6 -75 63 43 -60 38 25 -69 44 42 -78 38 69 -120 -14 67 -54 16 58 -118 -23 106 -40 -33 54
4292 54 -73 -38 74 -33 -42 71 -58 -90 60 25 -13 35 -41 -61 70 62 -10 -10 -41 -17 73 20 10 44 -72 -34 92
4319 92 23 17 79 -78 -80 131 71 -47 50 -25 -78 115 80 -60 27 14 -88 59 94 -57 -7 -15 -92 55 128 -46 -60
4346 -60 -14 -61 47 116 -52 -68 6 -39 14 81 -31 -38 -15 -59 38 73 -40 -50 0 -12 77 107 -78 -94 29 18 66 92
4374I2j42k7Q1k8Q4O8j46o0Q1l6P9J09j87p5J72n7l2J14j14p5J78k3r2P6o7j02
4400a29J56Q7r4J6o9j28J44J34n8k9m8j00Q1R2l8Nk6n3M3L2k1J5l7l8J23K8j04
4427a6lm4k9K06K9j54k9lp5J71J20j31m0Pj35Q7J64r1m6N1r9L3J26j26n4J17k
4454C4j5O0j21j10J30P3j4P6r5j75N5Q6N4J02p7j64RO7L2N7l4q4M5Nj8L8l8l4
4482e6P6K8j5K1j27q6J51R5lK1j57j39J62J18m7N7m4j93O9J34n7L8L5j65K0J57
4508I3o5o8M8o3N0J47q6j38J7j0M7J47l2j25j7m2K5J66K0j04n9n1K4J54%j01j1
4535c4j6L2Q4m0p4K0mL4P8n1r2kJ2M6J47o4j61J8J8M3J39o1j61M2M5l8J16K6j65
4564f3J3O3l2Q6M4j80k6J24Q%K4j34l4J44J7k3oq2m1R3L7%jr0l6R1M6K2l5j23
$$ plain form
4374 92 -50 -77 4 -24 60 128 -18 -78 3 -33 46 155 -32 -107 65 8 -24 90 -24 -99 79 56 -36 40 -27 -129
4400 -129 27 114 20 36 -33 -161 -17 117 59 30 -18 -118 -37 55 17 22 -4 -57 -14 18 -3 12 -25 -63 60 88 -16
4427 -16 -19 -63 -92 114 143 -11 -40 -43 -118 53 173 42 2 9 -126 -39 125 34 -12 39 -60 -27 99 -27 -81 36 34
4454 34 19 79 -42 -152 -22 51 37 113 18 -157 -102 -16 38 140 63 -101 -92 -25 7 64 30 -54 -9 -4 -22 16 -22 -56
4482 -56 20 48 33 54 -73 -159 -8 87 84 105 -52 -191 -29 89 42 99 55 -138 -69 65 8 46 81 -84 -64 93
4508 93 28 -40 8 -55 -5 142 56 -82 -65 -75 -28 119 87 -38 -55 -97 -72 94 114 10 -49 -100 -76 78 78 -23 -34
4535 -34 -50 -18 66 26 -48 -28 -32 2 80 29 -63 -65 -53 -7 140 76 -85 -67 -49 -6 133 72 -89 -47 -2 -40 76 102 -63
4564 -63 -50 13 -19 67 111 -69 -95 29 37 37 61 -73 -107 37 54 31 25 -57 -98 -5 32 32 31 -59 -95 -4 42 64 29 -94
4594i4OJ09K3j5Pj14oJ00nJM6j09m2J21K5m9L1p5m7J31M1j05%j8k0J16K9j11J0
4623a4j2m7J13P4j00j4k4o4R3J00q7n0L7n5M5N6p4j5M3k3J1M7o6k0L0j6N6N4r0
4652a2o4M4pN7M3r4l8N2k3K7O9n5l6N8n9j0J04o1n4R9k3m1P9p3p9J18N7r4K9P
4682B0r5O9M7n9N8oq8K0N5j4L0rp7L4N0n0J5K0l9K2K3n2J0L7m9J9L1m0K1Qo3L4
4714a8O4p7JM0m7L1N2q2j3Q5n2k4P7m6k7Q8o5k4R0l9n0O4l1k0O2l6m9P0Mn2L9
4745A5J0n8N5j7n2M4L8n2J9Kl3M7Rp1N6J4o5K8K2m3N8mp9L0M9m6K9%n4K8L1n1
4777d1M1L6p2J4L1m9L1M5q1RP7m5k3N1o7QJ02o1l6N4m5j8P8l3k1N0n1l2R0Qo1
4808a1L0l8j1P3mo1J9mk1O1Kn4K2k8k6R2%n7Pk0k9Q4K5r6QL2l8N8K8r2K6L8o0
$$ plain form
4594 -94 -88 21 44 29 36 -78 -84 16 11 12 58 -51 -93 28 53 4 35 -40 -87 44 85 -20 -20 -38 -58 58 87 -24 -14
4623 -14 -26 -73 40 114 14 0 -24 -88 5 105 18 -32 5 -50 -5 51 -23 -38 5 -18 -7 40 -26 -46 -16 -32 24 78 -12
4652 -12 -76 -32 -39 18 61 -33 -71 -19 -42 -15 54 -1 -37 21 -38 -48 56 -5 -59 40 17 -24 55 -18 -97 21 78 -16 13 20
4682 20 -75 -6 41 -18 40 34 -54 -34 21 7 37 28 -49 -15 35 -15 0 20 -19 3 26 -26 -16 21 -28 -9 22 -18 3 11 -52 -18
4714 -18 46 -31 -30 10 -37 -6 46 -36 -49 36 -16 -40 37 -9 -36 52 -13 -37 53 14 -36 28 -3 -23 39 3 -46 24 28 -24 15
4745 15 25 -33 22 5 -47 -3 35 -17 2 4 -29 18 27 -44 12 26 -39 -11 11 -32 26 22 -57 -27 22 -24 5 5 -49 -21 10 -41
4777 -41 0 36 -36 -22 9 -40 -9 36 -45 -36 41 -4 -27 24 -43 -35 67 6 -30 24 -21 -39 39 6 -15 35 -16 -48 42 50 -11
4808 -11 19 -19 -30 43 39 -22 -3 -7 -28 33 35 -19 3 -25 -51 41 41 -16 -9 -29 -58 26 51 -45 -37 -5 -43 15 43 -49 -23 15 -45
4841d5M5L8n3k0K6k0M3L4q9mN4k1J6L6q6nP1l7M0L2q4j8O0j7K9N3j00n4J01Lk
4872B6M0q7n4J06Ql8L4m5n8P1K1j2K4m4o1Q3K0k1K8p5l4P9K0k6Kk9m3Q0L2o6L0
4903A1k1p4P5P2n6j6j6n2P5P4p0l1Rl2N5N8n9k7K6n0N4N6k9l3qm4P2P0q0m0J9
4934a2k1M6O4p5m2M7l4J7Q4n3o1M7k3JQ6m7r7L6L7RM4n8p7N7K1KM0l8o4N1J1M
4966BN4k7j10N0M5k4P1n5j02P6O0l5K8j4r1M6O2k6J7Nq7J7P9j5J2k1o6K3P2k2
4996B4Nk5m6L6N4m1QK9q0J0O5k6j0J5p9J8J06l5m6Km1K3R7k9p3J7j4j7P4Qm0J0
5028al2k0Q2J5o9KJ0j3P0j1p0K3J9k7O3np6M0Pl8P2L9j09mL1k3O5K0p9j7N5k4
5060eJ1K4m9kM3j6jK6m8%L2lK6oq4NN3OJ5Jq1LP0k3OK8m5l7O7jl2N3m1n7P5J9
$$ plain form
4841 -45 0 38 -15 -35 -9 -29 14 48 -41 -45 9 -12 4 40 -46 -51 20 -17 23 55 -29 -47 13 -4 25 78 -22 -76 25 28 26
4872 26 66 -21 -75 31 39 1 35 -10 -68 3 24 12 36 -8 -69 14 34 13 41 -34 -68 11 31 5 7 -22 -65 15 47 -19 11
4903 11 -10 -84 -9 63 7 -9 -25 -77 -2 72 2 -29 -20 -52 3 61 2 -25 1 -49 5 61 32 -1 -9 -53 19 89 9 -31 -12
4934 -12 -33 13 77 2 -40 7 -27 -10 74 21 -40 7 -16 -15 71 24 -73 -37 0 9 53 -5 -82 -25 -4 -2 38 0 -64 -13 -2 2
4966 2 56 29 -81 -31 14 -10 61 6 -96 -20 40 5 33 19 -72 -26 36 10 27 32 -55 -38 41 26 38 17 -49 -26 46 24
4996 24 29 4 -42 -6 48 7 15 44 -36 -26 39 13 3 18 -61 -43 63 28 -18 -16 -57 -34 63 34 -39 -22 -36 -53 21 29 -11 -1
5028 -1 -33 -53 29 44 -25 -23 -13 -26 44 33 -37 -14 5 -22 41 36 -40 0 7 -31 41 80 -29 -33 -2 -25 40 60 -19 -36 19 -5
5060 -5 6 30 -19 -21 22 6 5 31 -17 -17 15 12 38 32 -52 -47 6 12 27 28 -53 -50 20 -3 3 31 -14 -51 16 15 -17 36 -5 -62 13 32
5096C2n4K6j8k3P4jn7K3lk7M8K0k8%kl3L3L5l4jkm0N0J8o1J9M3n9K8L2m4PK3m3
5130a9RO0m8k7J9lJ5L4m7l3M4j7LM1m7j2M5m0nN6l1k5J9k1OM7m8j3M5Jj7K3j5
5163am5N8J2m6M4Kl7J2K3l5L9kn2J6L1lqLm1L8J4k8RJ0k0J1mj3K4Mn3J8L3k1Q
5198@J8n3K4L9m5pM1l1j7M0j3j6L3k4l2N4ok2J4oj4L8j3j7K9j4lRkpM8k7l6K5
5232GK4m2L1j2l6M0L0o2K0M2l9J4J4m7J7K8m9LN0l8OJ1l3KM4k8j0K7l7J1K0nr
5265fK6n8PM8j6pK1n0j3O7l1k6L9j0k1N2k3l0M6Km2N4J1n7K3rj7N1J7n7qJ4j3
5298a6M6K1m1KKm6L8K8k9JOl1K0M2n8rL5k6K7ln1K1L0j6J7K1m7lLj7M9K5m3l0
5332c2J2nL3K6n8mM7n2qQ3m7k0O6m1j5M8k9n9P6J5l5K9l2o6N1N9l2K2No2NK8M
$$ plain form
5096 32 -22 4 -14 -37 37 36 -21 2 -1 -28 20 40 12 12 10 -23 10 45 11 10 8 -32 18 36 -25 -6 37 -22 6 38 -6 1 24 -19
5130 -19 -10 50 2 -25 -6 -9 6 40 -7 -40 4 -13 -10 31 -16 -28 17 -23 -28 28 -3 -28 -9 -30 -24 23 -25 -38 7 8 -9 14 -1
5163 -1 -46 12 24 -22 22 24 -13 -1 22 -13 26 24 -28 -12 19 16 8 11 -30 8 22 -6 3 13 -7 4 0 -13 11 15 -38 -20 13 -8 0
5198 0 18 -35 -11 28 -17 -24 17 -14 -31 9 -4 -20 13 -11 -43 11 5 -17 -3 -9 -23 15 2 -15 14 0 -3 6 4 -3 45 18 -18 7
5232 7 31 -11 20 8 -28 12 42 -20 0 42 3 17 31 -16 1 29 -20 -17 33 -5 1 12 -21 -19 25 -3 -13 14 -23 -12 8 3 -6
5265 -6 20 -38 -31 17 1 -6 15 -35 -48 19 -12 -38 1 -9 -30 22 -1 -31 15 17 -25 29 40 -17 6 -3 -20 31 48 -9 -17 -3 -16
5298 -16 30 51 10 12 14 -32 6 34 5 6 12 -19 1 43 -15 -24 11 -15 12 9 -42 -21 9 -7 10 31 -16 -19 -16 -33 16 41 -2 -32
5332 -32 -20 -25 8 34 -24 -28 19 -33 -41 42 -5 -25 41 0 -15 33 4 -55 21 36 1 30 -2 -68 -17 42 10 32 37 -25 -20 8 12
5365A2QK7n3lJ5j1K9k2k1L9j6k1J0j1qN0Ln5M3mp4O0M4n2K1J0q4J9R3o7J1N1o7
5398b4j8P4m6j7P3l7l5N6j8l7M4j6k4O7j2o1K1Nj2N2rl5kJ4j9L5krJ9l9jM2k2
5431GjJ2j4LL8m3l0M4kl2M0k3m7N9mn0O1J6r3L8M2o2M8L7j00K2P3m8j8N1l2k5
5463c3P2m0k1M8j6n0N3jk8L2j7j5K8Nj8Pj3J6Nj2MPl1M0K3m2J5K8p0OO3m7j7O8
5497D9o1k6P9l1o2P0Jn4O0j4p0O5J5p1O1K7q8K3L9m5L4M3p0nM3k2jM3l8oK8k6
5529a0j2L9%j8MjJ8j8j8NK2nK9k3m6M1K4m8L7K8q2K6L2o1M2M9q5mP2n1j1O2o4
5562b7j9Q6k7n2O4k3n3P3Jo4N5J2p4J9O0m0Okl4K1L2j0j6OpJ4lLK1k4j3K4lj1
5596eL3k7l4N8J2m5L1rm6O4J3p1M4K4p5K8N8o5J7L3o4J4O6m3m9O9l2k6O1k8l5
$$ plain form
5365 12 20 47 -6 -9 6 -5 24 2 -19 20 4 -17 -7 -18 -26 24 27 -28 15 11 -63 -3 41 -11 10 20 -64 -45 48 -19 -8 43 -24
5398 -24 -42 32 -14 -31 42 5 -30 26 8 -29 15 -1 -25 42 30 -31 -10 -5 -17 35 26 -9 -11 3 -16 19 17 8 27 -12 -13 29 7
5431 7 6 18 4 7 45 2 -28 16 14 -18 22 -1 -48 11 7 -43 18 34 -59 -21 21 -41 7 44 -56 -34 39 -9 -27 24 -8 -33
5463 -33 39 -1 -22 26 10 -40 13 12 -16 16 -1 -16 12 17 -1 6 -7 9 14 2 6 13 -18 22 45 3 18 46 -24 -18 45 -2 -19 49
5497 49 -12 -38 41 10 -52 18 19 -35 25 11 -59 6 21 -50 11 38 -50 -27 12 -33 1 44 -26 -31 12 -10 -11 32 -6 -12 16 -10
5529 -10 -22 17 17 -1 3 2 20 2 -16 -11 11 6 35 12 -34 7 31 -17 20 48 -34 -8 24 -37 5 54 -31 -35 37 -14 -25 37 -27
5562 -27 -46 40 13 -39 25 2 -51 22 23 -41 14 26 -48 -29 31 -9 -3 -5 -39 -18 14 4 -12 -6 -13 1 -2 1 22 -2 -15 9 6 -5
5596 -5 28 1 -33 25 37 -8 23 14 -32 32 45 -26 18 42 -33 -5 53 -12 5 38 -26 -12 54 11 -38 31 -1 -27 34 6 -29
5627b9N4k3m6N9J0m8K2j3nK4J4l3MQKJ1rojjqK2j4J8Pl8KM6j5k2L2m0LO0m0k7
5663b0N8j6n0N3%m4N0Lo5L4M1o9J5M6n6K0M3o1k1P9m0l4N8k3k7M5k2j2L9j4l3
5694b3J0K2ql%%J3kj5J8j1jLj1MJ9j6j1J8k1J3K3k2kK5j2k7N3k5l5O7k8m3N2J3
5729C7n8M1Nm4M6on6K6M4n7K0K0m1K5K5l8kM1l8k1L7rj0K7j9j1K1Mk7K1mqMll
5764a1J2kLPk2K7Jk0nK5k9J1J9l0ML5l2j4M5j2j9L2k0j2M1l4k5L6Ol7L2Pl9L2
5798A2Pm8L0K2k0pK5m4J5L1l0nL3k2j7K6j0k3L5j6j0J5Kj5K0rNKk0ONORpj8J2
5834cJ4k8J5J4k1MJ4j1OL8m3j6K9Kl3M0j0k5L0nk5J9K0m7L2J1m1L5J2n5K5L4k9
5867BlLl2K3K7j8oJ6k6j9K4j1OJ9j7j2K4k0J0J8l0K2Lj2j2JJ4J1J1j2NooqL4k
$$ plain form
5627 -29 25 2 -44 15 25 -23 -1 -14 -19 5 19 -14 -10 -2 0 11 2 -4 -5 -6 -14 8 -6 12 19 -19 -17 29 14 -8 24 -16 -13 47 7 -20
5663 -20 38 22 -28 25 25 -19 31 34 -31 3 44 -25 -10 36 -20 0 43 -18 -39 40 0 -34 24 1 -26 19 -3 -15 24 10 -23
5694 -23 -13 9 1 -2 -2 -2 11 9 -6 12 1 0 3 -8 -4 15 -1 -12 6 -15 -2 21 -1 -3 22 10 -17 36 11 -24 43 15 -28 24 37
5729 37 -21 20 25 -19 27 21 -35 -9 35 -22 -2 18 -23 2 27 -11 -13 28 -10 -31 6 -3 -13 14 -5 -16 5 9 -18 3 -1 -9 -5 -8 -11
5764 -11 1 -1 2 9 -13 14 15 -5 -10 15 -14 -3 16 -14 -10 25 -7 -21 24 12 -7 25 5 -7 34 0 -25 11 17 -20 12 19 -20 12
5798 12 19 -29 1 23 3 -4 21 -23 -8 23 -7 -12 21 -1 -18 8 -2 -25 10 -6 -16 -1 1 -14 6 -3 2 4 -16 -10 -5 1 10 3 -15 -3
5834 -3 11 -17 -2 12 -9 -5 9 -2 4 42 -1 -17 12 14 -19 21 11 -14 16 11 -14 5 25 -22 10 21 -20 15 27 -28 -3 31 2
5867 2 -1 2 -30 -7 20 2 -4 12 -14 -33 -9 -20 -14 5 -12 -24 0 -20 -10 8 -22 0 3 -9 -21 -20 -6 5 16 4 9 3 -3 -11 23 21
5903B1J3lm5kL9pk2L0k0k0K6j4j4M1%l4L0Jm0K2J3j4K5Rn9J1K5kQJ5k7j6J8l0
5937b2KL9k3j1Nj0J2J2j6J2J4j4Mrj1OJ9j4OJ6k2k1K8mJ6K8l3k7K6lrL2j1l1L1
5972A7j5k5L2Nj6L0k9pQJ1l8M1J5l4Rj4k3M5J3k5lKk0KK5k0K3J0n1J8J4j3J7J0
6006A4k5LJ7k1kJ5mjRk7K6Kj0KK2l0J3J9k3ML6k1l0L8k6j3M0j1l9L7qk3K3%mJ1
6042A3j2k1L6rj8J9J3k7J3rj0J3J2k4J8%k3K9ll4K2K0l3RJ9l2J4Qk9K6K2m5J4
6075iJ7qjK7l7kL0k0PJ2j5mJ6j8QK6k8JJ2rJJ8k1jL0k0j0J1ok1L5lj7K5k0j7J9
6112HLj4L5k9l5J6QMJ8J1m0QMoK9jk8J9qqL5j5l7J6K6k2J0kk3K8K0k6J4%l3%L2
6149A7LJ1pl8PK6J4k0Mk2J3J7k6PK0l4QJ6L%%l9PN2k9oLm0NO0k1l0K3rk3M8%j5
$$ plain form
5903 21 34 31 -14 -16 23 16 -6 24 4 -16 10 -4 -18 23 23 -11 19 20 -20 2 15 1 26 35 -24 -13 12 10 18 33 6 -10 8 -22
5937 -22 -20 19 -4 -15 -10 -20 -8 4 -12 0 14 0 4 -5 -16 -10 9 -5 1 17 -5 -26 2 -2 14 42 9 -18 8 5 -4 28 17 -14 17
5972 17 2 -23 9 14 -2 28 -1 -8 0 11 -27 14 29 -5 4 -10 -33 12 25 0 -3 -1 -21 -19 6 -14 9 19 -32 -14 0 -13 4 14
6006 14 -11 -8 9 -12 -14 1 -3 -4 5 -22 4 6 -4 -2 20 -10 3 22 -1 3 39 18 -12 26 0 -13 27 16 -23 14 6 -17 6 6 2 13
6042 13 1 -20 16 7 -11 8 21 -6 7 -2 -12 1 13 -11 7 7 -16 13 10 -24 -2 18 -15 -6 13 -19 -5 3 -26 0 22 -23 -9
6075 -9 8 0 -1 26 -11 -13 17 -3 4 16 1 -3 13 -5 3 29 1 2 14 5 6 24 3 2 32 12 2 13 7 -14 21 18 1 26 6 -11 8
6112 8 11 -3 32 3 -32 -16 -8 -4 14 25 -15 -7 -3 -9 20 19 -9 10 2 -6 29 14 -23 -7 19 -3 7 5 -18 10 30 4 18 18 -15 -15 17
6149 17 20 31 24 -14 -7 19 33 13 17 -5 8 25 -1 6 26 -8 0 16 19 19 19 -20 -13 39 10 4 7 -33 -28 32 11 -19 4 -5 -28 20 20 5
6187EJ0k0l0L3L1k6Pl0NM0lk4JLk0K3J0PLk6j4L5J1j9kj7j1L9Rj7Mj5j8L6mk4
6223hK5Jk7J9L6m2nRk6M0Ol5NllJ6Nj5j2K4j8J2K1k1k9PkOK8j5j8PRmK4rk4J4
6261bnJ8Onj1Nk2K5K3j5pj1j4K7J1k8pK7j3j1M2ok5NNqJ9kl5J9J3l3K2J7l6MR
6298Aj1jK4k2nK5j8OJ6j2j0JlNJnKPj1JJ3j5OJ3k3RK0j1k0J9nJ1J0j4kJ7j5nJ8
6337A7j0JJ0j8jL0j4j7K3j4pJ9k0mJ7Ml6J5J8k8J9Kk3K7K0l3j1K1k4J2K9k6j1
6370a3Mj0J0J7j8KJj6K3LJ1j5j0pL0Qj3nJ7k6J1K0k8K0kl0J3L8j1k5J7k0JL6j2
6405B1l0J3J0k8L1Kj3k1QoL5Jk0j4RQJ9lk4j3J1oJ4J4k7j0KMK1J1l0j2J0JM1j0
6441A9k9nNK0kJ9l5j2J3QK2J5k3k7lK2J1J6k3m0L8jJ2J3j8l4J6J7RKj3m2K0PJ2
$$ plain form
6187 5 15 -5 -35 -2 29 3 10 -20 -15 25 22 -2 -1 2 -18 5 15 22 25 -1 -15 20 31 12 10 -7 -18 21 30 13 17 2 -16 20 16 -8
6223 -8 17 18 -9 10 46 4 -1 8 -18 22 28 -7 -2 -5 -8 8 13 -2 -14 10 -8 4 25 4 -25 -18 -20 -14 14 -1 -19 -12 -3 -7 17 8 -16 -2
6261 -2 -7 11 17 12 1 6 -16 9 32 17 10 -1 -15 12 23 -5 -12 15 2 -9 33 27 2 7 12 4 23 21 -14 5 18 -15 7 24 -12 -8 1
6298 1 -10 -11 13 -9 -14 11 -7 -1 15 3 -7 -6 -9 -4 -3 -8 -6 1 -10 -9 4 -11 -5 8 -15 -6 14 3 -17 2 -3 8 18 4 2 19 4 -1 17
6337 17 7 8 18 0 -1 29 15 -2 21 7 0 19 -1 -5 12 16 -20 -5 13 -15 4 6 -17 10 30 -3 -14 7 -17 -5 24 -2 -13
6370 -13 -9 -19 -9 8 -10 -8 -7 -23 0 3 14 -1 -11 -18 12 20 7 2 19 -7 4 24 -4 16 14 -16 -3 35 24 -1 16 -4 -3 33 21
6405 21 -9 4 14 -14 17 19 6 -15 -7 -13 22 23 3 -11 -2 6 25 22 -2 -15 -4 -10 4 18 -9 -19 -17 -13 8 19 -11 -23 -13 -12 29 19
6441 19 -10 -15 -10 10 8 27 -8 -20 -7 1 23 38 15 -12 -15 7 18 34 11 -29 9 8 20 33 15 -19 -3 14 23 25 12 -30 -10 -3 9
6476IQrl6J5J0J1Qj4l3J6J8NNjl6pJ9K5omk9%L1J0rj5l0K3K5lJ1%m2MK5J1nJ2
6514B2m7pM3Pj1Pk9J3K2JrJj1k0L4qJ8k6lk4L6K3k7oj4KK9Mok0j4qL7J1j9Mj4
6551il8L3L7l4J%j2J2L1l1oJ9j0MJ8j2n%j6J9K3j5k0MOPK1j3j3KnMK3k2KJrj1
6589a4L0Jj4onQJ7j0k1QQnK0j9mJ5qj1J4on%roK7Pl6J3PqJ7nj6J5K0k4j4K4j0
6628ej0L0j1JPj8mK6j0j1J0NoJ9j7j2J7j3J0J4k0mK2j0j2Olr%jJ6J1k0j6K5Jm
6665DJ4l2oK7qnQj4j4L3rKRj6k0J3K9j4Mj5j2J9L4l3j0J2j6LL8j6kpj8RK7J1j5
6702A4j0k1J2L2j2rj1k3K9K3mj7Rl2J9K5j8Mmk7J4L2j0mj1k4J6K6mk2oj2lN2j0
6737A3j4j1j9rO9Mm6LqMK7lj0rknK6jj3jj4J5K3J6k7j7mK0J7Jk1j5j1K0K9Nk5
$$ plain form
6476 9 17 8 -28 -13 -3 8 16 2 -31 -15 3 8 13 12 -24 -31 -12 13 7 3 -26 -26 5 15 6 -9 -39 -16 9 6 17 17 -25 -21 4 15 10 22
6514 22 -25 -32 11 18 7 14 -15 -2 20 21 12 13 2 -18 16 8 26 0 -3 -27 9 32 5 -1 -15 -13 16 20 14 -6 -20 -28 9 20 1 5 -9
6551 -9 -47 -14 23 -11 -10 -10 -22 -10 21 -10 -16 3 -7 -3 15 3 -2 -2 -18 1 24 9 -11 -7 -1 6 27 14 1 3 -2 2 25 3 5 6 -3 -14
6589 -14 16 17 3 -3 -8 0 17 7 -14 -6 2 -3 17 -2 -6 9 1 -10 4 -2 -7 -7 -16 -22 5 12 -24 -11 -4 -12 5 0 -16 -1 19 -5 -19 5 -5
6628 -5 -15 15 4 5 12 -6 -10 16 6 -5 5 10 4 23 6 -6 11 -2 8 22 2 -2 20 10 -2 4 1 -8 -8 -9 7 18 -2 -18 7 8 4
6665 4 18 -14 -20 7 -1 -6 2 -12 -26 7 -2 0 9 -7 -27 -14 15 1 5 -10 -22 -3 31 -2 -12 0 -16 -13 25 9 7 0 -18 -9 18 29 14
6702 14 4 -17 -5 27 15 6 -5 -28 1 24 20 3 12 -20 -1 24 6 10 6 -21 -7 25 15 11 0 -24 -8 18 14 -8 -14 -26 -29 23 13
6737 13 -1 -12 -31 -40 29 33 -13 -10 -18 -14 13 10 0 -9 -11 -16 10 9 -4 -5 -19 -4 19 35 8 -9 -13 7 24 25 4 -11 -22 -2 27 32 7
6774Gmrj0L7K2l7k4QmL8Ml2%Jj1J8K0l2qJ3qJ9J3k2k8PK6KJ7k5l5J5OJ9J5j1k5
6811a8J4j3K6J0rk3qNL2Pk6nJ5LkJ0j6JPj0OJ7j9k2%K2KL3l3k7LK9rJ8ll6OJ1
6849bj0J6J6m2J1%MNJ3k0j3L5Kmpl0J7K2llmj9J2l%J9jj8qK2nKJ5k5J0Rk4J2K8
6888B9k8j9L4roK7j9k7K4J1j0K2k1k2J9J9k5J8pk3JKLJ8j5j2j4L4pKmj6J9JmJ2
6924Gmj2lJ2%J0qrNNpjQj3J5KJqJ8k5J4Pj1LJ1j5j6K7jqJ5k6lJ5Oj5K8j3j9J4
6964Fj0nK7rk2J2QqJ4j0k0J8JnPKj4LKlJ4j0pj1J5J1J8k4l1L5mrK4rpl%j5K5L2
7004C8l9MNmJ8%k5%K0j4LJ1qj5K3JmRk2j2K1JRLk3j2JJ5kRk2j0J2OJ0J0j8j6J0
7043gjPlj0j2J9J4llj4mJ8qJ0Qok8K4JLPj6k2J4K9lnkj5MQ%QMl0lL0%j7Qj6%K9
$$ plain form
6774 7 3 -6 -16 21 43 6 -18 -10 -14 24 28 -4 -4 -3 -14 4 24 -8 -16 -3 -11 8 21 -1 -29 -22 4 6 23 -2 -37 -22 -16 3 18 7 -18
6811 -18 -4 -17 9 19 10 -13 -21 -16 16 23 -3 -8 7 10 8 18 2 3 10 0 6 23 4 -18 -18 4 6 39 6 -21 -18 11 2 20 17 -19 -13 -2
6849 -2 -12 4 20 -22 -11 -11 -7 -2 11 -9 -22 13 15 11 4 -26 -9 13 10 7 3 -16 -4 -7 -7 12 11 -7 -15 7 2 4 19 -6 4 13 -11 1 29
6888 29 1 -18 16 7 1 28 9 -18 6 17 7 29 8 -14 5 24 -1 17 10 -13 -12 -10 -7 11 -4 -16 -30 4 -3 -1 -5 -21 -2 -1 -5 7
6924 7 3 -9 -12 0 0 10 2 -7 -2 3 -4 -5 3 -10 5 7 8 0 18 -7 7 14 3 6 17 2 -14 13 12 4 19 -7 -10 5 11 -4 24 11 -8 6
6964 6 -4 -9 18 9 -13 -1 7 -1 13 3 -17 1 2 -3 4 6 -8 -5 -3 -6 8 -2 -9 -20 -5 6 24 0 -31 4 0 -9 15 6 -1 -4 -4 -19 6 38
7004 38 -1 3 8 4 22 22 -3 -3 17 3 6 17 9 -6 17 18 14 23 1 -11 10 11 20 23 0 -12 -11 4 2 11 -11 -21 -9 -3 7 17 -1 -17 -7
7043 -7 -8 -1 -4 -14 -26 -7 7 4 1 -13 -17 1 -7 3 11 5 -23 1 2 5 12 -4 -26 -12 17 14 9 7 -8 -4 4 4 12 16 -14 -17 13 13 -4 4 -12 -12 17
7086A7jj7mk0J6J1J8k0Jpj6K4MMj7k1QK6jlml9K5K2j4Llj0KJ3MpJ9k4LK8lj1N
7125A1j6pK7Kj6oJ3rPJ1j2Kj2jQJ0Nk5MLKJ0j4pMj1J2J3j2rKoK0jNr%nQnNj5r
7168b3mJ4RjoPj9%K7Nj1rnJ7J3k0pRK3k3J1Lj5PQj7J4Oj3KJ1knJ4j7j2J9Mj4l
7208cO%mOj6OJ5j1qkjR%j0J8qrO%mJ5j9pK7j1oPpjJ5JJlKj3J9rrJ4Nk0J4J0k3
7252hQnj0K1J4l0J6J2JqOkj6mJ0oJ0J1j8j2NOMkk1RKRkMojj1RJ3j3j0MmJ1J8j9
7294ej3QJkK8j4j9J9jj4J6K0l5jK1j7K5mk9J2RPKLk2kJ5lLQk3j%J1LKj5j0J3J1
7334Gj1n%kJJ4lkk5RK0okjk1J0J3%j3K3j4j7L2nj3K4j6nRlqK9j3k0J2K0k2LMp
7374dJ7J5k3j1J0lLK0k2QKj1KJJ3pj2j3J9Jj1KKjOkj9J0Qj3J5J2l0kJ2j8J5K3
$$ plain form
7086 17 16 -1 -5 -25 -9 2 20 0 1 -6 -22 2 6 10 -7 -28 -20 6 5 2 -2 -41 -16 6 -8 -5 -8 -18 -16 -3 1 -6 13 -11 -8 20 17 6 11
7125 11 -5 -12 15 17 1 -5 8 -1 6 17 5 7 -5 -6 2 12 17 -8 -4 -1 1 11 -3 -10 -6 -17 -5 8 -4 -13 -11 -17 3 2 7 -2 -2 -7 1 -4 1 -14 -23
7168 -23 -27 -13 -4 -5 -11 -4 -23 -23 4 9 -2 -11 -16 1 14 -6 -13 -4 19 -4 7 10 -5 2 10 -7 7 13 0 2 13 11 6 20 3 -9 10 14 0 -3
7208 -3 3 3 -1 5 -11 -5 10 -1 -9 -11 -12 -3 -3 -13 5 -3 -12 -6 -6 -10 5 -14 -21 6 -5 -11 -4 -11 -12 3 4 5 2 4 -9 10 1 -8 6 11 -9 5 15 -8
7252 -8 0 -5 -15 6 20 -10 6 18 19 11 17 15 -1 -5 5 -1 9 20 2 -10 -5 1 5 3 -18 -9 -7 2 0 4 -2 -3 -14 -5 8 -5 -15 -11 -15 -4 14 -5
7294 -5 -18 -10 -9 -11 17 3 -16 3 2 -12 4 24 -11 -12 9 -8 17 13 -16 -4 5 12 14 17 -5 -7 8 5 8 16 -7 -8 -8 3 6 8 -7 -17 -4 7
7334 7 -4 -9 -9 -11 -10 4 1 -1 -26 -17 3 -3 -5 -6 -27 -17 -4 -4 -17 6 -8 -25 7 2 -11 13 -3 -8 1 -2 -10 19 6 -14 -2 18 -4 -1 3 -4
7374 -4 13 28 5 -6 4 1 4 24 2 10 12 1 3 4 17 10 -2 -15 4 5 -6 -4 -2 -3 3 1 -18 -8 0 -13 2 14 -16 -18 -6 -24 -9 14
7412A4l1pJ7qK3j4%jK1k1pJ5j8J0MmNJ4j2oL0j7j0J0Mj8J4J9j9jnlJ5%k1J0J3
7449A5j4LLj4QoMJ1mj6OJ1j3K1j2j1qRKKMj5lMQJOj3pRmK4kj2mRKj7LJ2j3QjJ7
7493A3J1k3mnJ7NLj6j5K1kJKj9OjKJ0Qj4j0LMMkj5QPPm%j5kJ2K1j5rnJOjPnrM
7538hjJ4j0kkj1J7J2j4Oj1J3rRqJ7lk2J8K2k2J0j1j4L1jlj3mj5J8J1j6LK0l2l
7575a4K4Jj0Lj0mJ2Nr%oRroJ1k5J9QokMrLJ1J6k4oJ1nOJ6j7rJ2j2KJ4k%Qj4lJ0
7618CQrJRlOqj2J2J4k2PJ0j8J6lnlO%k0NoK0j1lkJ0k4J4pJ3nqQ%Np%KJ1j%k0J5
7663bOj6J2Lj7RJ7k5KJ8Mj5J3r%J2nj2J5Pj9PJ2j6RJl1K6K0j5j8Rj0QQj9J7kl
7702AmRj4J3j8%Pkj2K4ppJ5ok7K5%oJJ0qnJ8j3J0mj3OP%kLj2KJ3Jj1QRj7K7j4
$$ plain form
7412 14 -17 -24 -7 -15 8 -6 -6 -7 14 -7 -14 1 -17 -7 -3 -7 -2 12 0 -6 24 7 -3 7 11 -7 7 26 7 6 1 -2 13 13 -8 2 15
7449 15 1 4 7 -7 1 -5 -1 10 6 -10 -4 7 -6 15 3 -8 -16 -7 -5 -3 1 -14 -17 -13 -5 -4 2 -11 -18 -9 -13 11 9 -3 -7 2 4 -13 -10 2 -11 -3 -4 13
7493 13 24 1 -3 -8 9 14 17 1 -14 7 5 6 8 -11 -5 -6 -4 6 14 0 -10 -7 -3 1 -1 -16 -8 -1 6 2 2 -13 -15 -3 18 3 -6 -11 -10 -4 -5 2 -3 -12 -8
7538 -8 -9 5 -5 -7 -9 -20 -3 9 -5 1 -10 3 -6 3 -5 12 9 -13 5 27 5 15 4 -10 21 20 17 4 0 -15 3 14 -2 1 21 -11 -14
7575 -14 10 11 1 4 -6 -10 2 7 -2 -2 -8 1 -8 -14 -3 -28 -9 -1 -7 -9 -5 -14 -11 0 16 -8 -14 -3 -8 -2 14 -3 -12 0 -12 -10 4 2 2 10 -4 -7 3
7618 3 11 2 3 12 9 15 7 -5 7 21 -1 6 16 -2 14 11 6 3 9 9 -11 -6 -12 8 -3 -6 -8 2 -22 -8 -15 -2 -7 -15 -7 -7 -2 -9 -9 -7 4 3 3 -17 -2
7663 -2 4 -12 0 3 -14 -5 12 -13 -11 7 11 -4 9 0 0 12 7 -5 10 17 -2 5 17 1 10 11 -20 6 26 11 -7 2 -8 0 8 -11 6 4 1
7702 1 -3 6 -8 5 -13 -13 -6 -8 -20 4 -3 -10 5 -1 -28 -3 -3 -9 -8 2 -6 -11 7 -6 4 0 -13 -7 0 0 -2 1 -11 -9 4 5 -6 2 11 -6 21 7
7744GrnJ2%Nj0RKlj7QJ5mpQj4KQj3QQj7jJ8rlj1J0pJ8j6LNj9J4Qj8KJ4oJRk4Q
7788a1J9mj0J1qj1K0l%J1k2qK4Jj1RJlJ1j1j4K4k0kNJ5j5J2nk1K0Qj0J0j4jJ3
7825A0mk1J1J2k1MQkjmj6K7Kj6Kjj5J6QopJ4k9K1J5j0lnj5NK2jk5L2j8J5J6j7
7863Cj0PPoN%oj1J9j2J5Kj0jNqJ0mj6PRoOj4jJ1jLMoj6L%NJ1jk0KK3j9lOqJQo
7909a3lK8k4JK4j6lJ6j9pK9j5NJoORnk3K3pLNj1rJ0n%OkkRj6%K4j7j0RQj7LJ8
7951Gj7j1RJ0%Pj4%j0NJ0Rk7J0J5lqJ0j1rJ9j8mK8j3rJ2qJ2J1j3j6L2mjk0Rj8
7989a9L2j3%J2qj5J4nRjrnJ3mpRlk2K2kqM%j0%Nj1K1Kk1J9p%Kj1mJ2J4k0LNnm
8032a6J1lJ0Qk4J0RlJmLlJ1Kj9J2pKJ1j4J3mLj1KJ5j7%rNK3qp%%j1QnrJ1Mj7K2
$$ plain form
7744 7 -2 -7 5 5 10 0 9 11 8 -9 -1 14 10 3 11 -3 -1 7 -6 2 10 -7 -8 10 1 -2 -13 -3 -10 8 -8 -5 0 -19 -5 3 -15 -13 1 -5 -4 5 -19 -11
7788 -11 8 4 -6 5 -3 -14 6 3 3 14 -8 -16 8 9 -2 7 8 5 16 5 -9 15 -5 -7 -2 13 -2 10 5 -16 4 12 2 12 -2 -3 10
7825 10 6 -15 -4 8 -13 -9 -1 -3 -4 -8 -24 3 5 -11 -9 -10 -25 -9 -1 -7 -14 0 -29 -8 7 -3 -6 -11 -26 -21 1 0 -25 7 -11 4 20 3
7863 3 -7 0 7 1 6 6 0 -11 8 -4 11 13 3 2 7 -1 9 5 -11 -4 5 -1 5 -9 -10 1 0 3 7 1 -15 -12 -12 -7 4 3 -17 -15 8 -11 -14 -8 -16 -15 -7 -13
7909 -13 -16 12 -12 -11 13 -3 -6 10 -9 -16 13 -2 3 4 -2 4 13 8 -15 8 1 4 9 -2 -11 -1 -6 -6 0 -2 -4 5 -11 -11 13 -4 -14 -5 3 -14 -11 7
7951 7 -10 -21 -12 -2 -2 5 -9 -9 -19 -14 -4 5 -22 -12 3 0 -8 2 -9 -18 1 -17 -21 7 -6 -15 -3 -11 1 12 -1 -17 15 11 10 -10 -1 -19
7989 -19 13 0 0 12 4 -11 3 -2 7 6 -3 -8 5 1 -6 3 0 -22 0 -2 -10 -6 -6 -16 -16 -11 -22 -1 1 -20 -1 -8 -8 -6 -17 -21 -9 5 -15 -12 -7 -12 -16
8032 -16 -5 -8 2 10 -14 -4 5 2 3 -1 2 -1 10 12 -7 5 -2 0 11 -3 10 6 9 -2 0 15 -2 -2 -11 -6 17 9 2 2 2 -9 -1 -6 -15 -4 0 -17 5
8075Eqj6J3j6NJ4lj1J8JpMJj7JJ7j1Oj1J0JNmMlmpJ1J1rRKj2MJ2j1Lj0jJ2Mj3
8117aJ7j6RJKrlk%J0koK%j2J0Mj1Pmj0J6oJnQkNnj0LNjNj7RKkpJ4nPkOm%LMjQ
8167A5k1J1MqMLoOPnPj3koJ3Kk6K2Ljnj0MK
$$ plain form
8075 5 -3 -19 -6 -22 -17 -3 -6 -17 1 2 -5 -1 0 -17 -16 1 -10 -4 -15 -5 -4 1 -3 1 -2 -6 -13 -2 9 0 9 11 -1 3 15 4 7 -3 -4 8 12 -1
8117 -1 16 0 9 10 12 3 0 -2 -2 8 6 0 2 2 -10 0 4 -7 0 -4 -14 2 -4 -3 -8 0 -2 3 -2 -12 -9 -4 -5 0 -17 -8 -6 -8 -15 -1 -6 1 -1 5 1 1 4 8 7 15
8167 15 -6 5 9 1 5 8 2 8 15 10 17 4 2 -4 9 11 -15 7 10 9 4 -6 -2 0
8191@
$$ Imaginary data points
##PAGE= N=2
##DATA TABLE= (X++(I..I)), XYDATA
0@%%%%%%%%%%%JrJ6j6J6j6K4l2L2m0M8n2O0p2Q1q9J04j20J36j53J70j90K14k40
35a27K66k94L29l66M06m49M98n52O10o75P47q29R23j030J151j294J465j669J921
54A031k243K668l262M152n652Q796k5479L2281K2362o4664M2694J2676o1194K1105
68a4729M7250m0373N26K6496k9672m685L0643j5912n161J3793j5938J481K2874
81A6593j7060j0169J5244q444m982K2217j905k0067n60R123L45j617R267M171
95A2156k3883n107K9766o997j9972K7596l440l6789K9007K2362m1082P747K8557
108A9921l2440K040L5215k7549j4277K7299j5779l761L1745k0602j8226K5577
120I163j5965r464M1407j4813l3983L1886j104l1961L4769J4235m2381J1129K3824
$$ plain form
0 0 0 0 0 0 0 0 0 0 0 0 0 1 -8 8 -8 8 -8 16 -16 16 -24 24 -28 32 -40 41 -48 56 -64 72 -81 89 -101 113 -127
35 -127 139 -155 174 -192 214 -235 263 -289 321 -354 393 -436 487 -543 608 -686 779 -890 1031
54 1031 -1212 1456 -1806 2346 -3306 5490 -19989 12292 34654 -30010 12684 25360 -35834 -14729
68 -14729 32521 -7852 -7326 19170 -10502 -15187 15456 -456 -5617 8176 -7762 -6281 16593
81 16593 -467 -10636 4608 -3836 -8818 13399 11494 -8573 -9133 -10 335 -1282 7985 12156
95 12156 -11727 -16834 12932 5935 -14037 13559 10119 -26670 2337 24699 -16383 -8636 19921
108 19921 -12519 -10479 24736 -2813 -17090 10209 -5570 -9331 22414 1812 -16414 9163
120 9163 -6802 -16266 25141 10328 -23655 8231 7127 -24834 9935 24170 -18211 -7082 16742
133A6742k7722K327K5972j8070j1700J7701o98p704L803o31k116J29K962O232
147G227o939q398Q928O84n252J0245k155j1928P439P24n304J3034m684j4788J5561
162D394L69j6881J9830L712k9350J6735J8761k9546O425K4630k8906n133L2398
175A7438j5667j4879K4638r295j7809K1809J987j5656J0617m78j1363J1713J669
188D724r996Q588q42j0200J0571K596j1610O622M513r832L871O238o708j372L257
203D20L09J055k599k16L294n762J099J0444q436p281J2672l641r285J4249k52
218F070j5148R312M604j1280Q903M934j4080M744O631r876O770N909j4656M463
232b700J0403j2964K574J2586j4290l322J6128p935p325J3408m906j0592J1621
$$ plain form
133 16742 -10980 -8653 17319 -751 -12451 5250 4552 -3152 651 20 -2096 -1967 995 7227
147 7227 288 -8110 818 1502 -3750 6495 4340 -7588 -149 575 -4729 8305 3621 -11167 4394
162 4394 4763 -12118 7712 11424 -17926 -1191 17570 -11976 -5551 19079 -9827 -14960 17438
175 17438 1771 -13108 11530 2235 -15574 6235 8222 -7434 3183 2705 -8658 3055 4724
188 4724 -5272 3316 2474 -7726 2845 5441 -6169 453 4966 -4866 -995 5243 -1465 -2837 420
203 420 729 1784 -815 -1031 2263 -3499 -2400 8044 -392 -7673 4999 1358 -7927 6322 6070
218 6070 -9078 234 4838 -6442 2461 7395 -6685 -1941 4690 -5186 1584 7493 -7163 -2700
232 -2700 7703 -5261 -2687 9899 -4391 -7713 8415 480 -6845 6563 1657 -8935 2686
245B686L008r204L572J743n646L458L701k653q92j379j54L210p80l40J677m240
261b233r15N513r58j515J855m409n00O346k037j721L365n943j499R516l065n087
277c287P348m278p594J0949K527r729N108J923r736O056P751q596o38M862n917
292c251J264O893m803k245L731l732K40N956l327k983L217k364o42N661j724m670
308b779K087P92r47K571J45k980p08R84J636P78j146k80j128j873L472K949l607
325c4j044J152k725K045M776l529k706K515k100j01N332j909l842K464j338j515
341b559N684k22n461J835R18k522M180J785n697M3K896k115J450L088l573k218
357b488K244r2N98K263k034k725J013J292Q98P88j572j839M37J211J147K24j321
$$ plain form
245 2686 5694 -3510 62 1805 -3841 -383 3318 665 -227 -1606 -1760 1450 670 330 2007 -2233
261 -2233 -3148 2365 1407 -108 1747 -2662 -3162 3184 1147 -574 2791 -3152 -4651 4865 1800 -3287
277 -3287 4061 -217 -7811 3138 5665 -4064 1044 2967 -6769 -713 7038 -1558 -2196 2666 -3251
292 -3251 -1987 4906 103 -2142 1589 -2143 -1903 4053 726 -2257 960 -1404 -2046 3615 1891 -2779
308 -2779 -692 100 -847 1724 1869 -1111 -1819 -835 801 1579 433 153 -975 -2848 624 3573 -34
325 -34 -1078 74 -2651 -606 4170 641 -2065 450 -1650 -1751 3581 1672 -2170 294 -1044 -2559
341 -2559 3125 2903 -2558 -723 195 -2327 1853 3638 -2059 -2016 880 -1235 215 3303 -270 -2488
357 -2488 -244 -336 262 2525 491 -2234 -1221 71 969 1757 185 -1654 -1217 -6 1141 1365 44
374D4j137k56Q33K062K04k085q64j49N46K770L97l335p35J052j30K100J429l333
392e87j559J676j48J202K380k629k962J564R84O74K046j923l483J290K032J67
408G24J036q51k990K49K221O22M03n04k416o82K080J729O6j422j798k51J574J875
426A665J53k021j447N14R59J293Q25j816k032O94J210J034J020j712k665Q65K045
443E84O26M03j369k474P86K263L90J0q81k170K19K175P60J9r81k260J31K442Q92
462A565l69j135j934L57K362N85o49p40j486L9J987P46m83p87j481L5J968Q54
480A434n44j095j452N46K116K47q55n76j186L50K050N3r47j22j132j52K253M05
498A393j374k55q02j71K361M52k004k13O1l30J781N92j969k46N62n28J140J004
$$ plain form
374 44 -1093 -1349 -516 1546 1750 -335 -1199 -1348 -802 1968 2365 -970 -1705 -653 -783 1317 2746 -587
392 -587 -2146 -470 -618 584 2964 335 -2627 -1063 -79 595 2641 718 -2765 -1475 557 724
408 724 1760 909 -2081 -1832 389 1011 1414 910 -1506 -2188 -108 1621 1687 265 -1533 -1784 -210 1665
426 1665 1818 -203 -1650 -1136 -177 1116 1941 125 -1907 -1213 -3 1031 2051 339 -2326 -1461 584
443 584 1210 1613 244 -2230 -1444 819 1209 1219 338 -1832 -1613 562 1322 1341 360 -1900 -1769 673 1565
462 1565 1196 61 -1873 -1516 846 1431 782 42 -1444 -1405 582 1328 845 58 -1423 -1388 580 1434
480 1434 890 -205 -1657 -1111 1005 1252 397 -179 -1365 -1015 1035 1088 141 19 -1113 -1265 988 1393
498 1393 19 -236 -1038 -1209 1152 1604 -400 -613 -552 -882 899 1491 -478 -724 -162 -690 450 1454
516A454j551q37M59J04J105N44j595o48M97K50J211J10j900K7Q92n81R45Q42j979
535f51k64J291p74M87J283j906p43J844l14k35R02j788n61K485l29j086J127j385
553f17j166K683K88j673J130o25k027K070J499j571Q0r3j326J456J164j445j19
570b92J07n57J515L67j893K42L83q41J770J103k268o51M29n29J780J522k006j073
588h92L2l89J994R99k179J93N82j885J633J921l015j09K470j983J49K811k950
605f18k132L293K79o59J917k311k730K564J025k17J916j985k931K130N44p09K917
622B293q80l918J852J734j827J337N95k874R81K382j227o51k32j110J439J420
638A314m56L21j746k464K509K194j066J075q48m062J522L421j185J86N38k868
$$ plain form
516 1454 -97 -934 -475 -371 734 1278 -317 -965 -468 -218 993 1103 -797 -770 122 -459 486 1328 -651
535 -651 -915 376 -398 89 1372 -534 -1277 567 253 18 920 -868 -1429 1056 727 -359 768 -617
553 -617 -1783 900 1188 -485 645 20 -2007 63 1562 -9 71 -22 -1348 108 1272 -173 -292
570 -292 -185 -742 773 1140 -753 -511 -128 -969 801 1904 -364 -1015 -586 -1115 665 2187 181 -892
588 -892 -860 -1249 745 1744 -435 -242 340 -1545 88 2009 -1006 -1115 1355 -628 -479 2332 -618
605 -618 -2750 543 822 163 2080 -231 -2961 -397 628 411 2327 342 -2589 -459 85 -624 2293
622 2293 1413 -2505 -653 1081 -746 591 1186 -1688 -707 1675 448 -203 -435 -1545 -106 1314
638 1314 858 1179 -567 -3031 -522 1672 606 1681 833 -3229 -1707 1714 529 715 1253 -1615
654a615L27K204j134N28P34k565J198K310k772J51J904l468Q74N107k882l065
670b164K777j800j404N246P6m070J010j91j750L039J345j961J31j118j071K937
686A032J29k095J617m79j969K960M35l566J266J613j657J407J033k589l10O12
702e61j18K319K3k609P33m19j604L870J082m448J248J893l584J592L444l553p24
719a416K962k074m98K593j818r52J897j001N60J495l175j20L113k150p3L455l326
736e28k279M240q98k353L668m78l685K107J102j648J478p3j747J310p5p97J852
753A196j245j629K955n87k517K939J05l399K326J429k777J373J075k627J052J345
769A014j631J117O7k167K256N07l106K504J425m207J823K855m162O39L784l664
$$ plain form
654 -1615 -1288 916 -218 310 1044 -1521 -323 1987 -785 -634 1270 -2198 -1324 3783 901 -2164
670 -2164 613 -1187 -2591 2655 2731 -1339 -329 -520 -2270 769 2114 153 284 -834 -1905 1032
686 1032 1161 -934 683 204 -1765 1195 1630 -1936 -670 943 -714 693 1726 -863 -1173 -561
702 -561 -679 1640 1663 -946 -213 -632 -2236 1634 2716 -1732 -484 1409 -2175 -583 2861 -692 -1416
719 -1416 1546 -528 -1026 1567 -251 -1203 694 -307 253 1748 -1427 -1547 1566 -584 -657 2798 -528
736 -528 -2807 1433 535 -1818 1850 1372 -2313 -206 896 -752 726 653 -1094 216 141 -656 1196
753 1196 -49 -1678 1277 690 -1827 1112 1217 -2182 144 1573 -1204 169 1244 -1383 -331 1014
769 1014 -617 500 567 -1600 656 1163 -1943 561 1986 -2221 -398 2457 -1705 -1066 2718 -946
785i46j005M026j952j760K821r97j249J938r85n92J684j404j80J906k130k01K995
802A969k300j448L405j314k116L008m79k279K235p2j850J839p8j329J498q62j000
819a173K636j168k073L002n15k714L100K62l539K458J392l327J589J858k899M82
835f29J525j744J136J010k449R33J024k202J750J480l318J010K282l284L84L329
851B237k626r69K884j701j179K507j100j201K003m98p31J019j391j78K041j200
867h3l39J938j954j231K513p86r18K495j061k183J801l1j024J851m92j327J670
884H39q67j476K283l52j604K518l91k778K174M76k739K228J764k816M35J095k369
901a580Q99K213j505m4Q81j812J49J281j039Q64J200k127j09J374j542K63J955
$$ plain form
785 -946 -1951 2075 123 -1637 1184 187 -1062 876 -109 -701 983 -421 -601 1305 -825 -1026 1969
802 1969 -331 -1779 1626 312 -1804 1204 725 -1554 681 609 -1241 598 520 -809 689 -173 -1173
819 -1173 1463 295 -1778 1224 709 -2005 1095 1357 -2182 276 1668 -1659 -70 1788 -1111 -629
835 -629 896 -848 288 1298 -1151 -218 806 -1396 354 1834 -1484 -474 1808 -1476 -1092 2237
851 2237 -389 -1358 1526 -175 -1354 1153 53 -1148 855 357 -374 645 -746 -924 1117 -83
867 -83 -422 1516 -438 -1669 844 58 -860 1635 574 -1609 192 161 -863 988 496 -831 839
884 839 -28 -1504 779 427 -1177 1341 950 -1828 346 822 -1917 311 2075 -741 -306 789 -1580
901 -1580 -681 1532 27 -17 864 -948 -799 482 -557 307 1507 -620 -729 645 -897 -634 1321
918A321j315l50J463j609q84J708k44o8J201j212q27R71q81P5J905p94p16R92
936G36j475p28K235k71r55J546o67j615J121n1o59J789K2j511O06m16r67J660
954D00L92j099J182l14k120J120J037j110J099O65k027J95J044j251L93J451q34
971B23k80M64j122m0J172l71J09O50r26m46M81m67M59J099p07n74L17n72J24Q94
991D87m55j1O45q95l43P86n03QJ090p20m79J009p97q70J340J74o38Q93m63j384
1011a126R01O51o72O38L15j134K8M06l97N92N15q17j45L00l38K74K81m77K45L71
1031D11n67m6K42l16L05L89m89N8K32o20P9O38k08K7J53p32K9Q11k68k34L63m31
1053a74j57O54k67k77N06k90l97N95K8l21K83l38l22P83J01n93K23o4l64N90J61
$$ plain form
918 1321 6 -344 1119 -490 -1374 334 90 22 1223 11 -816 155 -726 -651 1254 460 -256 736
936 736 -739 -1467 768 497 -458 1088 421 -1194 -73 -124 -783 1006 1028 -483 123 -293 -1260 400
954 400 792 -307 875 561 -1559 -439 598 -512 587 1252 -775 -580 464 -787 -394 1057 223
971 223 -57 407 -715 -755 417 46 155 805 -121 -567 -86 -553 -94 1005 298 -276 41 -531 -407 487
991 487 32 21 666 -229 -572 214 -289 -281 809 89 -390 619 -178 -1048 292 466 -172 721 258 -1126
1011 -1126 -225 426 -246 392 707 -427 -399 7 -390 202 717 -100 -245 55 -283 -9 272 -205 40 411
1031 411 -156 -202 40 -276 29 418 -71 -13 219 -401 -322 316 108 135 288 -444 -415 396 128 -106 257 -174
1053 -174 -331 323 56 -221 285 -5 -402 193 221 -100 183 -155 -477 306 407 -186 37 -27 -391 199 360
1074C60o34L22J86o63L04N48m55m8K40m60J02O32l12l85K28M9m1J30r5p9N7k4
1096c8N5l1n7K06j49k91M61J39n28J63J49l76M76L33q76K7O77m83l6P08n63l94
1118d28P04l47l62R37j23q98M38K71m43M58J69p29J57M95l77m6L39j87j56J22
1138fjLJ03l6j64p4K58J78l42j05K95j35k9K67l13j28M95k60l19N46r2m53M46
1161A34m4m02O00l2p93N32L84o28L11K44p73L99N81q14J17O95p16j83P71m23j87
1182b27P03n20n12Q04N4n55L49M6m24K98K09l50L7K76j49k69J80L12k31k45L49
1203A35j09l17N90n3q12O62M63j077L56P96j055J08J083j106k61J472q95q47J515
1222F48l37j119J263q3j280J249L91j521O86P86j184L18Q48r96K9Q49p64k00Q82
$$ plain form
1074 360 -274 48 234 -429 -125 423 -32 -80 160 -300 -198 434 122 -263 -35 14 -27 103 8 -71 -14 -38
1096 -38 17 -14 -71 135 -14 -305 156 295 -233 -70 79 -297 179 512 -364 -337 340 -143 -179 529 -34 -428
1118 -428 276 -71 -433 504 381 -517 -79 192 -251 207 376 -353 -196 299 -78 -124 215 28 -128 -6
1138 -6 -7 -4 99 63 -101 -175 83 261 -81 -186 109 -26 -55 212 -101 -229 266 6 -313 233 141 -312 134
1161 134 90 -312 288 256 -537 -5 379 -249 62 306 -467 -68 513 -301 -184 511 -205 -388 383 -40 -227
1182 -227 476 -44 -556 248 302 -253 96 142 -282 16 225 -125 -88 188 39 -230 -50 262 31 -214 135
1203 135 26 -291 299 246 -566 96 559 -518 -162 634 -421 -313 770 -336 -597 875 -20 -867 648
1222 648 311 -808 455 372 -908 341 732 -789 -103 683 -501 -183 665 -331 -302 547 -217 -417 465
1241D65l16m37L76j12j29L30k7k25l6J32J28l08kN42l78l76O72k88m55R60l09
1262B07r78J148J43j324R70M82j477R09Q13j808O47J421j811O1J732j556l50J894
1280A123j350q29K147q48j452J869j67j529J508J65j650J162O54j522N43R09j092
1297c59Q6P29o69j0O38l88l15K80J64o9k92K12L11o16J56O99r01k6J232j128o20
1318h86J836p26j294J863l78j763K048K32k386J728J006k605J130J595k423O20
1334d03J910k387j5K395j864p08K337j309j081K165q91j391K049k14j643J387
1350C37K34j383R18M43j077N40M84p97O4L67o1N7k49N3K71m76K53N13q96J91R78
1371G64j251p9J567j185n65J731j159q94K278r71j676K411l14k216K249K88k601
$$ plain form
1241 465 149 -288 88 -24 -153 177 150 -75 -111 21 149 -159 -161 381 3 -373 299 11 -444 516 207
1262 207 -771 377 520 -804 166 648 -829 80 893 -915 -268 1153 -658 -597 1135 -421 -771 1123
1280 1123 -227 -1056 1091 243 -1209 660 493 -1036 472 637 -1013 149 803 -719 -176 733 -359
1297 -359 -273 456 -213 -223 415 27 -288 -8 156 87 -205 7 318 -298 -142 557 -344 -370 862 -266 -886
1318 -886 950 224 -1070 793 415 -1348 700 932 -1454 274 1280 -1325 -195 1400 -1023 -403
1334 -403 1507 -880 -895 1500 -364 -1072 1265 -44 -1125 1040 149 -1242 807 593 -1050 337
1350 337 571 -812 106 549 -528 12 496 -301 -237 130 69 126 -123 -70 201 -275 -22 491 -405 -214 764
1371 764 -487 -566 1001 -184 -749 982 -177 -1071 1207 236 -1440 971 657 -1559 690 978 -1623
1388a623K034J007k998J407J824k865N50K285k332j10K330k002p61K483j083j164
1404a018J899o60j225J491j95j054J199J01j055N06J66m51L86K8j19K00l12Q2
1422c1P4o10P56O40j295L48Q50j617L38J750j552j64J973j916j075K612q51j377
1440a147K498p83k204K264k3k267K302Q06k612J340Q26k599J278J777k233O13
1456a64J747k364l68J973j217j13J980j264j211J287m59o54J351P9o11K63m90
1473b35m25N04J38L87K23p11J10K7r89P52J041q47M14M10j904K77J571j224M15
1492f6J800j975r04J794j369m10K907j035j898K022p97k053K531N61k014J778
1508H72L45k887J004J481j639J025J486k045k94J037j392L09J938o84n98M65j087
$$ plain form
1388 -1623 411 1418 -1580 -173 1651 -1214 -664 1621 -711 -821 1509 -493 -1254 1229 146 -1018
1404 -1018 881 221 -1004 487 292 -762 437 538 -517 -11 155 -296 90 118 -1 199 -113 -31
1422 -31 43 -567 189 829 -466 -118 732 -885 -547 1203 -349 -513 1460 -456 -1531 1081 230 -1147
1440 -1147 1351 568 -1636 628 605 -1662 640 1446 -1166 174 1000 -1599 -321 1456 -777 -164
1456 -164 1583 -781 -1149 824 -393 -506 1474 210 -1001 286 -173 -827 524 603 -8 255 -235
1473 -235 -660 -156 -18 369 592 -119 -9 18 -971 -219 822 -25 389 799 -1105 -828 743 -481 -66
1492 -66 1734 -241 -1145 649 -720 -1130 1777 742 -1156 866 69 -1984 547 1108 -906 872
1508 872 1217 -1670 -666 815 -824 201 1687 -358 -652 385 -1007 -698 1240 556 -42 423 -664
1525f64l32J192J7O4N15o96n89N2j79O89O62n00J27j63j132N21O61o39J017P00
1545A323j885j30R40j188O69J826j419n72J239j598o01K333m22q87J566j122j639
1562a567J830N3j233J832K02j982Q05K67j494J385J169j490K87N86j587J86J236
1579D85n19L17O58j221m62O51j92L29O19n06j32J1o63L29N44k55M32L6j005L48
1599a96L82q29P00Q02j027J65M55j342L77J411r76r4J089j268n12J412o63m05
1617e19J559p51j179J205k07q62J265j9j068R33K6j201P79M98q17N98K46j008
1635e22M08M07p38M75N00o93J28J70o20M90M58o43J76K50o07L52L00o24M21L33
1655D21p95K72M74o79K85M59q33K66O79q60N5P50p03K4P16q33p5R56o47l10Q87
$$ plain form
1525 -664 -996 196 213 277 792 96 -493 -441 -620 69 731 231 358 195 -937 -416 245 -394 623 1323
1545 1323 -562 -692 248 -940 -271 1555 136 -436 803 -795 -1396 937 515 -372 1194 72 -1567
1562 -1567 263 316 -917 915 1117 -865 -60 207 -1287 98 1267 -223 64 650 -937 -751 485
1579 485 -34 283 941 -280 -742 -91 -283 46 665 159 27 38 -625 -296 248 -7 425 461 -544 -196
1599 -196 186 -643 57 859 -168 -3 452 -890 -513 898 -78 -172 917 -351 -863 549 -114 -519
1617 -519 1040 289 -890 315 108 -754 511 492 -576 357 383 -818 -39 459 -358 240 486 -522
1635 -522 -114 293 -445 30 530 -163 -35 135 -485 5 463 -180 -4 246 -361 -9 291 -333 88 421
1655 421 -374 -102 372 -307 -22 437 -396 -130 549 -311 -256 494 -209 -185 531 -302 -377 579 -68 -378 509
1676E09n70l92Q86m48m30J015l84p73Q19p1n80P77j00p45O82P4p52N58K36n96
1696b85M33P7o41M50K49n94L52K59n03K77N4n68M83L20n68K73J51n96L51K79n92
1717c39M27L78p63J27M23n75L04N05p51J17N86p14l5O77m65k1N94o82j84P76m43
1738e8k35P20l96l18O06m15l46Q34j84n48N57j41m59O16r0n02N99J4o08M06J20
1759A72m25M04L9n04L71J69m67K55J13l16K98K8m23L49J32m17K61Q0l45L88K5
1780A87n55M45K09n72L33K28o00L75L13p61L13N64p23N4N65o23Q5O60o74j50P50
1801D23m63k86O40l11k71N77l47l37O23j03l65L71j14k45L95j57k61M50j05l02
1821a88K78j51j13M50k34k85M27j83k63M54j73k23N24k74m86O01K0m51N03r2n34
$$ plain form
1676 509 -61 -453 433 -15 -445 570 186 -587 232 161 -419 358 258 -487 195 269 -483 75 311 -285
1696 -285 148 225 -416 34 283 -311 41 300 -203 74 128 -440 43 363 -205 68 219 -377 -26 253 -339
1717 -339 88 466 -297 -170 253 -322 -18 487 -264 -147 439 -275 -310 367 -98 -119 475 -207 -391 385 -58
1738 -58 -293 427 31 -287 319 -96 -442 392 208 -340 217 76 -383 233 143 -359 240 254 -354 52 172
1759 172 -253 151 190 -314 57 226 -241 14 127 -189 109 137 -286 63 195 -222 39 119 -226 162 187
1780 187 -368 77 286 -286 47 275 -325 50 363 -398 -85 479 -244 -190 375 -248 -163 497 -177 -327 423
1801 423 -40 -326 314 3 -268 309 -38 -375 248 145 -220 151 37 -208 187 30 -231 219 114 -188
1821 -188 90 -61 -174 276 42 -243 184 1 -262 192 19 -204 320 46 -440 161 181 -270 233 141 -393
1842c93N60N6o13N08K41o60L15K16n59L93L00o71K19M22n40J38L29m84J87L73
1862C37n63Q7M65m39J7L22m22J30M01n00J1M23m01L3L33m25J26M47n85m5N64m34
1884a18j6N30n78q6P02n49k55P91l79l98O71l63l68Q05k32n92O59p8n23N49j1
1905A61m87N38pn96M39J71m15L22om30M38N6m46L76M7l80L68j04l85O07n0n99
1927c82N31L5n96O44O6q14O90K48r85N55N19r24L99N48j047L17Q49r72J1Q80p94
1948b22j24Q70o99j93R21n90m42Q39l30l70O90l47l64O64k28m39N79j17l10M27
1968B15k88k03N72k82k42M91l38j72N95m45k10P92m97m45Q26l75m00R80m96p41
1988f63J099k09q82J069n7j043R78O7j144J057M06j362O70N79j205O11P27j252
$$ plain form
1842 -393 167 223 -390 118 359 -301 14 230 -329 64 364 -307 -88 334 -206 -68 261 -223 -36 337
1862 337 -226 -139 326 -113 -96 226 -196 -66 335 -165 -154 269 -132 -99 234 -191 -65 382 -203 -248 316 -118
1884 -118 -134 396 -182 -268 434 -115 -370 421 42 -356 315 -48 -416 389 157 -435 224 146 -377 172 161
1905 161 -326 212 205 -391 48 219 -196 126 120 -310 128 184 -262 114 161 -219 149 45 -340 267 217 -382
1927 -382 149 184 -412 232 298 -516 174 422 -563 -8 511 -413 -14 534 -513 -196 653 -319 -308 572 -222
1948 -222 -346 524 -175 -368 553 -37 -479 360 30 -340 350 3 -361 303 75 -364 215 98 -212 215
1968 215 -73 -276 296 14 -228 263 -75 -247 348 -97 -307 485 -12 -457 369 -6 -406 574 78 -663
1988 -663 436 227 -655 414 357 -686 292 359 -785 272 678 -684 -14 565 -640 -29 698 -554
2006e54L51R11j142Q9R74q76n6Q74p99j43R10o30k85P20l72j64N26m88j24O01
2026C23m27m0M72n16O6M95o74J09P06p48j3P80q35KR56r70k10J306p97n35J203
2047F53p92o35J500m99r49J408m26j302J370J42j150J227M4j573R79N89j237Q07
2065A56N93j324M32O50j129M65Q80r88Q8O35q16J38O10o95K09O22o60qL18o02
2085d26L70N28o63K60L27r30L49N64p60N25N80j287K54R30j116K24J112j204o
2104c69J298j318l75J560r11n19J615q65j003J473n78j005J756o5j410J017j17
2121A84j232J332M93j282P20K93j318N97P00p95M85L80j033K71M84o19L51L37
2139C48n52L64R1p41M25K59n03O62O5r13N84J16r71R42N64j175N27L86j360P74
$$ plain form
2006 -554 -203 708 -434 -345 629 -247 -303 571 -228 -371 539 -91 -376 344 -28 -192 334 -154 -278 323
2026 323 -104 -144 328 -188 -122 373 -301 -192 514 -234 -247 533 -302 -300 656 -314 -524 782 -15 -550 653
2047 653 -139 -774 726 227 -722 686 260 -1042 328 470 -680 547 591 -982 -3 586 -651 156
2065 156 749 -575 -143 507 -622 -157 723 -265 -177 458 -358 -220 390 -305 -96 526 -134 -142 176 -426
2085 -426 -56 472 -191 69 396 -534 -185 379 -381 144 724 -563 -309 621 -495 -271 841 -363 -369
2104 -369 929 -389 -764 796 -115 -634 981 116 -887 586 8 -997 759 694 -716 301 184
2121 184 -1048 284 777 -505 215 508 -810 -213 487 -308 177 557 -476 -205 279 -340 11 348
2139 348 -204 160 251 -490 -65 194 -309 353 418 -495 89 205 -766 176 740 -435 92 478 -882 -108
2159a08J001j420L71J062j481Q6J333j290p8J536j193n16J544r41p82J536n21
2176A39p89J436m90j285J224R9r46J066P3j165O62K23q34P37L98q11K67R5n54
2195d55N49K03n54M02Mm91M98q2m91P31o9p27P48m5q15Q39P7r34R45K06j298P82
2217B3N62j228P25O66j450N07J033j406K19J235j251j09J230j034k57J341q85
2234g9o07J300n33o47J075m21p26J065k04p77Q57l8p19O40Nn85O36J4o38M65N7
2255A40l97M39q4l98N28j63m43O21j12m48O23k70n76Q74n1p92P55L5q85Q22K05
2276D23j000P34L68j175N90O61j044L94O37j133L00R63j016m8R52q63j58J003
2294E88o80l33R41n58m89R21k67m73O53l02l84P02j84n08N15q5k75N16k19m19
$$ plain form
2159 -108 893 -527 -156 906 -575 -489 844 -446 -524 1012 -181 -697 847 -94 -876 660 139
2176 139 -650 786 296 -989 235 334 -612 454 527 -638 24 247 -587 150 548 -263 4 99 -455
2195 -455 94 297 -257 145 149 -342 156 74 -417 314 245 -482 266 221 -594 245 322 -612 333 539 -759 23
2217 23 585 -643 82 748 -702 -195 838 -568 -349 886 -365 -474 756 -278 -535 806 -79
2234 -79 -686 614 81 -566 509 88 -638 427 223 -554 303 265 -454 186 191 -394 242 256 -382 83 140
2255 140 -257 182 98 -300 228 65 -378 243 131 -317 306 36 -540 334 283 -509 246 281 -604 218 423
2276 423 -577 157 525 -650 -60 601 -443 -49 588 -545 -245 718 -298 -346 606 -257 -415 588
2294 588 -92 -425 516 -42 -531 390 123 -350 303 1 -383 319 135 -373 142 57 -218 298 79 -340
2314c40M76j53k68O20j41m55L79k58k46P92j12n67L93k14m00Q10ro53N81n6p57
2335e78O84K61p49N12K34q47N40M68r74K26O04o21K97N42r38r2P08m66J19P42
2355F72o70m14N29l70K4Q47m06n38L91k19j40O22k20l18M35j87k77L65k00j94
2375b68M76j05j52L77m34m39N32R4oN13n37p09N34J38j55O73j56q00L15J2l37
2396d34P53J85p68K37J69n22M12K59o53L57M92n88mK47n82K21O83l36n2J83o68
2417d09j09O88K9O3J52o92k42N50j4N9L22m15k27L19k18l1M48k58j81L93k00k11
2439a84K65k90q9O87q6l92J29l34j76P40P1l31K20l13m98N47K89k47L06j90o03
2460d79L64L28l27K00Q6l71K37J49m08J22K22k52K20J90l72J7M4k59L36L59l40
$$ plain form
2314 -340 136 -17 -285 335 194 -261 118 -140 -386 406 294 -273 120 -94 -494 316 307 -346 235 179 -578
2335 -578 106 367 -382 130 364 -483 57 525 -449 -223 381 -240 57 599 -339 -431 277 -189 -70 672
2355 672 2 -412 117 -253 -229 618 212 -326 65 -154 -294 328 108 -210 225 38 -239 126 -74 -268
2375 -268 208 103 -49 328 -106 -545 -13 81 75 588 51 -658 -124 14 -141 532 376 -424 -109 -97 -434
2396 -434 319 504 -264 -27 142 -380 32 291 -362 -5 487 -101 -105 142 -440 -219 464 128 76 259 -409
2417 -409 -518 170 199 262 414 -278 -520 30 16 75 397 -18 -245 74 -144 -175 273 15 -166 227 27 -184
2439 -184 81 -209 -298 389 303 -89 40 -294 -470 270 341 10 230 -83 -581 -34 255 8 314 124 -479
2460 -479 -115 213 -114 86 172 -199 38 187 -221 -99 123 -129 91 281 -91 -74 -30 -289 47 406 66
2481F6j17J9l06K92L85l33j0J44l88Q3L61k60M9K60m20k9M43k80j43L34k01p0
2503a21L99k95k95L95l7j80L38j32l00K80k7k30L43O2l24J15J0j41K34L4k55J50
2525B3N3j56R2Oj08J97m5j97J71Mj21K01r0j69K67o4k67L17M5l24K32Pl16L57
2549A15J61n07J54K68l61J70K64m31K4L70l44k4M11l11k00L49j04r0L31k34l35
2570c24L24J32j26J23j29k12J67J04k1Q4r6j39J8M8J56R0k49j13J51k2J37J15
2592B18l52q7L37r9k4K35l06k15L87m1j00L62l02m69M51J86k03K75j86n31M09
2613e5L45l43J57O0n07J79M31k53L5J35m67oN13l5j63pk58J0M26L2j98q7j50P5
2637a31K13Q5j2j75k50J43K39J7J01k07m25K80L91j88J6Qm74K08N34l08j02K47
$$ plain form
2481 66 -51 -32 -338 -46 339 6 -4 140 -248 -165 196 -64 -15 245 -175 -204 239 -41 -184 150 -51 -121
2503 -121 278 -17 -312 83 46 -134 204 72 -228 52 25 -205 138 200 -124 -9 1 -140 94 128 -127 23
2525 23 76 -80 12 18 -90 107 62 -135 36 40 -81 120 30 -139 128 64 -203 114 159 -165 67 74 -242 115
2549 115 276 -231 -77 191 -170 0 264 -167 -143 227 -117 -141 270 -41 -241 108 4 -86 245 11 -324
2570 -324 0 132 6 129 0 -212 -45 59 38 122 26 -113 -95 -47 109 199 -50 -163 -12 -34 103 218
2592 218 -134 -221 116 17 -7 228 -78 -293 94 53 -47 315 13 -456 -5 181 -22 253 67 -464 -55
2613 -55 290 -53 104 164 -343 -164 267 14 49 184 -283 -289 224 189 26 19 -239 -229 197 229 31 -56 -206 -131
2637 -131 82 167 155 -20 -270 -127 112 129 230 23 -402 -122 269 81 97 105 -369 -161 373 65 -37 210
2659B10m78q8P00j37l16K53l44k44P52Q2n59J35l6k87N33K41n26J4Q8k89L21L58
2681C83l42j74J3j27K93L05k75k33j7K0K68J30k24r5q1m7L32J03k28J0j52j88
2703c26M87J90m04Pk4k76M99K86n92K5K33m16K83N27n63j72L93l79M3P31m34n10
2725c92M36r6j45O06j98o24L58J60k78L87O1n29J09J98j67K73J36m50p4K16K6
2746A3J59j8k95rR1Q3J61j23j96J38j01k7M21j56l96K74l5k25N48l3o83L23L05
2769B19m55L50K67p10J30M95m73J25N04o20j70N82k99m8N27n17l39O75j11l24
2789a92M57k07m58M91R4l78L25L8m20J59K26j52J12n2k35J64Q7l3R6j68j30K73
2811I7p8j62L16j28k61L11n9j96L87j55l72M12L0l79M03k5n24N34J61o85L85L83
$$ plain form
2659 210 -268 -356 344 207 -109 144 -200 -444 308 390 -169 -34 -70 -357 176 417 -109 -95 -7 -296 25 383
2681 383 41 -133 -120 -247 46 351 76 -157 -174 -154 114 244 20 -75 -156 -203 129 232 4 14 -138 -326
2703 -326 161 351 -53 -46 -70 -346 153 439 -153 -128 105 -311 -28 499 -64 -236 157 -222 -179 552 118 -392
2725 -392 44 -52 -197 409 211 -413 -55 105 -173 214 275 -254 -145 53 -114 159 295 -155 -229 -13 13
2746 13 172 154 -141 -150 -59 24 185 62 -134 4 -97 -124 297 141 -255 19 -16 -241 307 274 -409 -86 219
2769 219 -236 114 381 -329 -199 296 -177 -52 452 -168 -338 244 -55 -103 424 -93 -432 243 132 -192
2789 -192 265 58 -400 91 185 -193 132 170 -250 -91 135 -17 95 43 -192 -28 59 26 122 -46 -176 97
2811 97 19 -143 173 45 -216 95 36 -160 227 72 -300 112 142 -237 166 141 -383 151 312 -373 12 395
2833C95p19K34N09o74O7O25n94j44O82l67k91N17k26k17M43k10k63M03j20k30
2853a80L46j57k02L95j40l12L32%k22K31j9j93J64q6p2K81j22q8J51l29ON73k78
2876G9l17M64k54l87O70j4n24M55lo00M62K97n38K28J42m80M04K87o67J75L36
2897B15m70K78M65p07p0N10m29L2P03m07m65L38j11k1M86j42l56R0r3R9K64k33
2919b4l4K26l14K9L99l61k12M21j35j9M32m30m48L98P3R5M35m90n04L94q8k6P87
2942F04l03p22L97m4l68Q11J31q81K67L36m75K83K50n96J95M43l18M0O6n53K07
2963b30M88j61J94L6q39k3O70MJ43J84p19k73N07N0R1K38l94j52J72j65K19K17
2985B57m66P0M82l65o4K63n91k2R36j31m22J82m86k71Q22J98k42J86n17n09O32
$$ plain form
2833 395 -324 -90 419 -255 -188 437 -157 -301 381 14 -277 240 14 -203 240 30 -233 170 50 -180
2853 -180 166 9 -193 202 62 -250 82 82 -140 91 72 -121 43 -43 -115 166 44 -44 107 -222 -216 357 79
2876 79 -238 226 -28 -415 255 241 -283 172 169 -431 31 328 -210 18 160 -320 84 371 -296 -121 215
2897 215 -255 23 488 -219 -289 221 -208 -176 527 120 -345 -7 -118 -139 347 205 -151 -61 -154 -55 209 -24
2919 -24 -58 168 -146 -117 282 -79 -291 130 -5 -24 408 -22 -470 -72 1 96 531 41 -463 -69 -157 -183 604
2942 604 301 -421 -24 -68 -436 375 506 -375 -108 228 -247 36 286 -310 -115 328 10 50 116 -437 -230
2963 -230 258 97 291 327 -512 -535 135 139 282 466 -253 -526 -19 31 122 360 -34 -186 -14 -179 40 257
2985 257 -209 -139 343 -22 -86 177 -414 -436 500 369 -53 129 -357 -628 194 392 150 336 -181 -690 -58
3006e8K73j19L55l92o55N93K25m56L84R6n40L56K79n56M9K28k65L10L42l98k00
3027a49q6k06N69M18m08j07j60m30M78N31l54k1Q9n39J16N18k27k1J86l86R9L78
3049B88m19o8L05k66K21M48o19l01M94k35KP17l49n97L30j11j28O89l2n65J24
3070g2l1j40M58j7l71K69m6k82L64j0l82L26Q5l12L00M7m81J72K46j41K04k6m40
3093b80J67J90j69K83mm42K42J11l57L49K18n38J22L15l88J49L11m76K4M50l22
3114d5o1K76l17OM18l28j04L68l19j25M74k22j99L78k16k76M91k3l72K55pk24
3136a72K92j0k43J95j2j62J95n8j39K47q8j94L02r2k89K92J4j90L04q4m09K71
3158c0J48k12K74n3l99K66J28l29L17J44m99J74K66l84J76K93m98L7M82l04j33
$$ plain form
3006 -58 215 96 451 59 -596 -3 222 -234 150 246 -294 62 341 -215 -166 62 -203 107 449 51 -149
3027 -149 -235 -441 128 546 138 31 -129 -559 -81 450 96 75 164 -375 -259 259 32 11 197 -189 -90 288
3049 288 -131 -199 106 -160 61 509 -110 -411 83 -152 -150 567 218 -379 -49 -160 -288 401 369 -196 -72
3070 -72 -103 -243 215 198 -173 96 50 -232 132 122 -260 66 151 -161 139 186 -295 -123 123 -18 186 160 -280
3093 -280 -113 77 -92 191 187 -255 -13 98 -259 90 308 -230 -108 207 -181 -32 279 -197 -173 277 -45
3114 -45 -106 170 -147 -141 277 -51 -155 213 -106 -231 243 21 -178 200 -16 -292 199 176 -196 59 52 -172
3136 -172 120 110 -133 62 50 -112 83 25 -114 133 45 -149 153 61 -228 64 78 -112 192 108 -301 -30
3158 -30 118 -94 180 127 -272 -6 122 -207 110 254 -245 -71 195 -189 -13 280 -218 -181 301 -3 -136
3179a36K80l02KM28k04j76K08k39o6L82q6r1J54k97j49M45k8j67J71k14j41L54
3201A28k5k03J69r9q9K52q0j14J60k04p9L97o4k45J66j81j52N02ml93J72l1k48
3224b65L70J23l64J62Ql22L25K42l88P9R5l06K69K98m53m5K84k22O7L11l03j44
3246a79K34j17K6K54j76j79J05p1J34K11k51j33J55j05J01K34k71j31K37j53j9
3267i4L24j90k04K04j04k0L36j99k80K66l7r9L13j47l07K88M3k33K59K3l40J53
3289d5J17j65K22J1l44R8J65j07J47Rl00J39J52k02J55R6k88O8J56j88J18J87
3311B01l17j9K29j19M9J07k63N1K35j87QJ71k50jK56j92oK60k79j35L17q2q6K36
3335A84k20j72L42p8j75K46q1k19K71m2j90K70m6k95K21J01j89J31pk10J59J16
$$ plain form
3179 -136 144 -158 -156 272 68 -108 100 -139 -205 177 91 0 154 -143 -292 153 125 -42 129 -85 -226 128
3201 128 103 -100 69 -30 -119 133 53 -61 99 -105 -184 213 149 -96 70 -111 -263 239 235 -158 14 -17 -265
3224 -265 105 228 -136 26 34 -288 37 279 -109 -30 65 -241 28 326 -127 -172 112 -110 -43 268 -35 -179
3246 -179 55 -62 -36 218 42 -137 -32 -103 31 242 -9 -142 13 -92 9 243 -28 -159 78 -75 -94
3267 -94 230 40 -164 40 -64 -84 252 53 -227 39 2 -97 216 69 -238 50 93 -140 119 142 -198 -45
3289 -45 72 -93 129 140 -204 -106 59 -48 99 108 -192 -53 99 -103 52 148 -140 -72 84 -104 14 201
3311 201 -116 -135 94 -25 24 131 -132 -81 154 -33 -25 146 -104 -105 151 -41 -47 213 -66 -201 116 34 -52 184
3335 184 -36 -208 134 56 -119 127 46 -173 98 56 -134 136 90 -205 16 117 -72 59 52 -158 1 117
3357A17j58O9Oj46J31J7j26J78j5k41J59Q4j66J68K3k97J87J65k54J05J27k64
3379a31J01J86k67Q7K24l00j0K63j97RK08k73m3L16j51j40K40j37j20K58q6j44
3401a07K25j00j64K00Jj04J37j03j38K19J9j57J21m2j12J68k3j07J39m6j48J47
3423B5Rq2J48j17j49K17L0j58J62o7j89K52K7k49J95P6k98J59J49k47J39J11l19
3446a76J21K64k62j8K01k22KK77j95j04K45j52j00K31p1r7J33j11p0K14m7j47
3468h4J07o1k9J91j06r4J28p1o0J57o7m6J20j64l7K37j02q0J43j39q4L03j17k30
3492a85K74m3k08K57ok39K01K9k56K23J19k88R2R5k11K07J29l30P6J96k34N5K25
3515A78k36k7K02j65m1K12r0j16J17k6j9Q8j41j2J14n0M4N3j95K9J65j54M9J92
$$ plain form
3357 117 -41 28 34 -112 19 36 -90 88 73 -168 -9 75 -91 77 100 -197 -10 155 -99 6 133 -131
3379 -131 -30 156 -111 -24 200 -100 -110 153 -44 -35 173 -100 -143 173 22 -118 122 -15 -135 123 37 -107
3401 -107 118 18 -146 54 55 -49 88 -15 -153 66 85 -72 49 7 -105 63 40 -67 72 26 -122 25
3423 25 34 -48 100 -17 -166 51 81 -77 85 18 -171 81 108 -141 54 130 -168 -9 140 -107 32 143 -176
3446 -176 -55 209 -53 -71 130 -92 -90 187 -8 -112 133 -19 -119 112 41 -56 77 -34 -104 110 63 -84
3468 -84 23 -38 -67 124 18 -76 52 -19 -79 78 11 -35 85 -79 -116 121 19 -61 82 -57 -141 162 45 -185
3492 -185 89 46 -162 95 89 -150 51 80 -176 47 166 -122 -30 65 -146 61 190 -140 -64 132 -102 -47 178
3515 178 -58 -85 117 -48 -89 123 33 -83 34 8 -11 77 -64 -76 38 -12 32 85 -110 -81 84 -70 -21 171
3539A71k17p7J64j22L5K46k12j19K04j26m1K46j71j23L09j52k27L30m6k75K96
3560I3M5k79J93O0l47J90K28k06M2L4k13J28J49j59R5N6k07N9J01j45R8J39k16
3583f2j8J76j08k4P1p5O1Q5j38J1J2j17J65R6k06Q6R7l22Q1L23k12rJ85k73p9
3608a94L39j36j14K44j31j36K14j16j04K90j23j65K66p3k60K49jk03K88N6l51
3629a61Q1J62j49J02J01j47rJ4q3J12K9o0R6q1j48K20Rk26J58J03k09R6Q8k45
3653a47J13J54j66O0Q9k12P3R8k00J73J65l32L5K25k46M2K86k73r9L38j79j67
3675a70K69n7j47J91n2j34J69m6j02J59m6r7J57j36j09K57l1j96J74oj47J47K4
3698G1j54J13K2j24J01j2o0J45j06j30K47m6k16K10L1k52K29P6l24J64J97k95
$$ plain form
3539 171 -46 -123 41 -81 -46 200 -12 -131 73 -53 -94 152 -19 -142 167 15 -212 118 72 -203 93
3560 93 138 -141 52 112 -235 -45 183 -23 19 53 -160 -32 117 -42 53 109 -98 -39 62 -83 15 154 -62
3583 -62 -80 96 -12 -36 35 -40 21 106 -32 -21 -9 -126 39 135 -71 15 112 -210 -129 194 -18 -27 158 -115 -194
3608 -194 145 9 -105 139 8 -128 86 -30 -134 156 33 -132 134 61 -199 50 49 -154 134 190 -161
3629 -161 -80 82 -67 35 136 -11 -20 -6 -89 23 52 -8 88 7 -141 79 88 -138 20 123 -86 10 98 -147
3653 -147 -34 120 -46 14 103 -109 -36 62 -138 35 200 -132 -97 128 -118 -76 210 -63 -162 176 -3 -170
3675 -170 99 42 -105 86 34 -100 69 23 -79 80 34 -63 94 -42 -151 106 75 -121 53 47 -100 47 71
3698 71 -83 30 52 -72 29 17 -43 102 -4 -134 113 67 -149 61 92 -160 69 145 -179 -15 182 -113
3720a13P1J60k20M5J47j74O3J45k10LJ75j68P0J51k51j5K61j58r3K14j12r5J83
3743G9q0o1J38p9o5J02o0K7J08j72k4K07j18p4J96j59j01K59r1j80K33l2j85J72
3767D0L9j62J56n2j64J96K7j69J31kj96K01P0k51J47J19k59P0J79j79K0J16j56
3790g9K1J57j13l8O0q7J01Q6j65N4M6j64Q4J68j53J3J07k17pK49q1n4J13j61j2
3815g2J61j16j5J81j41p0J70j47o8K59j23j37K49n4k43J78K2j31K24J1k34O0L1
3838er9J61O8j30O0o0j81J89J13j41P7Kj78J03J08j63O7J21j32K5M1j34N1N9q8
3863f6J41P7k06j5L6j29K13K03k58o5R3j82P9K61j25p0J10k08l3K48o5o2J33j45
3887c5n1K00j30j41K21j1r2J70j07k21J63O5p3J74qk41qN1K4K28k7k32K0J0m8
$$ plain form
3720 -113 -42 118 -102 -57 90 -84 -21 124 -86 -83 92 -76 -6 145 -106 -121 140 -18 -111 103 -9 -104 79
3743 79 -1 -62 76 -3 -68 34 -26 1 109 -63 -87 120 2 -72 124 -35 -136 123 32 -148 85 53 -132 40
3767 40 79 -83 73 21 -143 53 80 -89 42 40 -156 45 115 -136 11 130 -129 -59 120 -59 -39 77 -79
3790 -79 -58 99 -14 -52 8 -79 22 108 -57 -3 43 -121 -37 131 -22 -9 98 -119 -126 123 42 -12 101 -60 -72
3815 -72 89 -27 -42 139 -2 -72 98 -49 -117 142 19 -118 131 77 -166 12 34 -97 127 138 -96 -36 -5
3838 -5 -104 57 125 -5 55 -5 -186 3 116 -25 52 54 -124 -21 87 -76 -9 112 -20 5 46 -88 -37 22 -66
3863 -66 75 152 -54 -69 -33 -162 51 254 -4 -69 24 -158 -79 182 57 -13 97 -111 -144 104 39 -23 110 -35
3887 -35 -86 114 -16 -157 64 53 -39 131 24 -197 -34 31 -42 132 124 -117 -125 -74 -50 178 151 -81 -61 -51 -99
3912i9J78L1j81O4L4j24J07O8j51M1O7m0R2k5k20N9J31rJ26m5k88O6J57o8J28
3937I9R0k88l8J62q3J09J49k47j05J85l9OJ09j86n4K42o2q6J20j26j26K48J0q7
3961BP6j15j64J82J42n9lj34j05J67Q9m5J9r3p3J22L9m0Q0j13j30J59Q2q0L1q0
3987d4j19K08P9j34L5o2j09J91J02j89N9K8k07J41J99j91k0P3j77Q8K53j59j43
4010i8J06o8K1J91j15j10J04p6j0J62o4j23Q2m2qJ64o3j55M2M8L2Q2j00r1O4j2
4036c7M1J06j12p7R2p0KK09r9j97J36J3o3J61n2k09J64Q0j41Q9K1j80J25J12j58
4061d4P1N3k22Q4J84j22MP0j99L6K07q6o3N1q3K6J06o5l9O5q1j1J32n1m6L4j04
4088i3L8J73p5q8Lm1N9J36r7o8M5o7M5J34r7o3J02j33pK54j06j79J46k3r8K53
$$ plain form
3912 -99 79 110 -71 -7 27 -97 10 78 -73 -32 35 -5 87 62 -158 -99 32 23 149 104 -184 -118 39 -29 99
3937 99 189 -99 -137 25 -58 51 200 -47 -152 33 -6 0 109 -77 -131 111 49 -37 83 -43 -169 79 89 2
3961 2 78 -37 -201 -19 123 64 61 -73 -178 -11 78 33 52 -41 -114 8 47 7 87 -26 -156 3 85 5 36 -44
3987 -44 -163 45 124 -10 25 -37 -146 45 147 -42 17 45 -162 -21 178 -13 -33 40 -137 -49 204 45 -98
4010 -98 8 -60 -39 152 37 -73 31 -45 -55 107 43 -80 2 -40 -48 116 53 -102 -60 -12 20 102 2 -89 -25 -37
4036 -37 4 110 -2 -79 13 -57 -55 154 55 -142 -6 7 -56 105 53 -156 8 88 -53 36 57 -123 2 114 -44
4061 -44 27 80 -142 -58 126 4 8 78 -121 -85 122 36 -27 24 -59 -33 73 8 -31 34 -47 -58 74 23 -23 11 -93
4088 -93 -55 118 43 -45 -42 -83 -24 112 15 -53 -8 -75 -30 104 7 -56 46 -87 -94 160 54 -125 21 -2 -100 153
4114A53o6k58J47J04j49J39L7k45Q0J23q6P0P1k23j9J60k2L7L7j77l0J55J8j7
4138C9j6p8kP8nM8j8j41K6R4k5P3J1k29M6J86n6nM5j91LK23p8n8J00j54n6K17
4166G7l3o0R1j50q0K37J9j37Q1r1q4K32K4j83P3j4j17J58P9j57K7Kj21J38J25
4191A36j26o3L0m9R0R3j16m9L0k9P8M0q1Rj5p0J33N3j20K9j5r8J67Q5k23K1J23
4218F3j51Q3J55k00l8J75j47j1K02j25j20J56o2m9J89p8j71J48K3q6R4nj16P1
4242@L6p7P6Pp7M2j7k2R3l2j03R2%n4R8m4j00J12J9j25Q8N1j00M9J9j13J07N0
4270G5j32O2M0j04P1N3j30O9P4j60L9J27j07nQ9j41K2J71j21n5J09q2k6J61j04
4295eo1J25p2o9J39Mj17N3om5J21jj09J6PJ3O3k8n4M5n3j3J43n9q1P0p5l5K06
$$ plain form
4114 153 87 -171 -24 80 -69 70 107 -138 -58 65 -21 49 120 -103 -122 38 16 53 90 -87 -117 38 56 39
4138 39 23 -55 -57 21 16 64 46 -95 -69 25 0 73 84 -145 -99 87 31 26 71 -120 -117 106 28 -30 70 -84 -140 77
4166 77 44 -16 75 -75 -155 82 101 -36 45 -46 -130 102 126 -57 16 2 -115 43 122 -35 -8 -6 -127 11 136
4191 136 10 -53 -23 -72 18 111 -5 -54 -24 -53 25 65 -16 -7 -22 -92 41 94 -26 3 -12 -110 57 142 -81 -60 63
4218 63 -88 -5 150 -50 -88 87 -60 -71 131 6 -114 42 -20 -69 120 42 -129 19 42 -44 50 45 -71 0
4242 0 36 -41 35 42 -35 7 -10 -32 61 29 -74 18 18 -36 62 18 -82 30 49 -76 12 63 -37 12 31 -82 25 75
4270 75 -57 5 45 -59 12 65 -65 4 78 -82 -43 84 -23 -28 61 -80 -58 113 -8 -63 46 -36 -62 99 -5
4295 -5 -66 59 -13 -82 57 61 -56 -3 -9 -54 67 66 -43 -27 -20 -7 56 28 -26 19 -34 -47 96 37 -44 26 -49 -84 122
4324A22m2j72P1J9o2J45Nj80O9O4j06J00P3j75NR4p8R4P4j81o5J49k4L2N9j40
4350e0o1J33j7nP3j00m3O6j1M8M4j34k6J01kK3J9j49nJ61%m1K8j24m4J54Mj1N4
4379H5j41o3J31J7oP6j43q7J63J2q3Q8n0j04J60L7j64M6K9r8J14J11j30m5lq3
4405a31J37J45j03r5om4P6J20o7n3J7n2M5M5k7j9J3l4P2L0j20k2M1J2J29L9k11
4432f3n7R3k9R5J33j68r7Q0n4L7J82j01j13P5m9mJ14q0j01J47K7q8M3o8r1J59
4458B2R3r5J8n8j53Q5J59J0Pp8j65L6J52K3ml9p9L0O2n4K9jm1O7M1o2j5n8n8J61
4488C5J15j01n5p7q1J63J61j14m3qj32P8J58o1m0M6j13j8J75n2j08P1OjJ03q6
4514B1j56P1O0L6Q6o8j49NN0L3J29j0j78j9J9M4J28k6j31NL8LN2j9q4L0M9oM6
$$ plain form
4324 122 80 -92 -21 -2 -64 81 86 -94 -25 39 -67 33 106 -69 -64 30 -48 46 120 -61 -126 23 -1 31 90 -50
4350 -50 -111 22 5 0 73 -27 -70 -4 -15 33 77 -57 -83 18 16 39 58 -91 -96 65 65 24 52 -72 -116 38 42 31 85
4379 85 -56 -119 12 29 23 99 -44 -131 32 44 -39 49 -1 -105 55 92 -72 -26 3 -95 19 130 0 -45 -48 -131
4405 -131 6 151 48 -47 -53 -97 -21 99 32 -21 -4 -56 -11 34 7 -12 1 -33 39 69 -51 -73 -32 -20 109 148 -63
4432 -63 -120 -27 -56 39 172 4 -93 -13 -67 -30 152 51 -62 13 -36 -40 74 -6 -107 40 67 -21 22 -46 -137 22
4458 22 115 20 38 -20 -173 -88 71 81 88 10 -155 -119 33 56 52 13 -66 -36 26 -28 1 0 -41 26 67 5 -10 -68 -126 35
4488 35 150 49 -6 -83 -164 -1 160 46 3 -5 -137 -59 99 38 -2 44 -69 -87 88 36 -72 -1 5 4 107 21
4514 21 -135 -64 -4 32 118 50 -99 -94 -44 -11 118 108 -70 -89 -70 -26 102 76 -55 -50 -12 -9 43 24 -60 -30 19 13 59
4543E9l4j19M2O7K3O6o5j72N7J05K2N6o0j75O8J01m0N1K2j54j7J39l0PM8j33n2
4570a18J78J0p2J0p2k2J46J3q3jm2k6J23K5n3k4n8mJ02L9l3n8n9J6J27J2q2%n9
4599f5NJ23op3M5n4o0J25M0r2LMn4J14L7j48%N3k0P5K9j15k2L0lO4O1j00n1L7
4629a8l2Q1Q2j11o9O4j8K6O2o4n4Q7k2k9N1m1l9M6PkM7q3n7P2L6K5Np1o1P3J4
4660Gk3O1m1n9O2j4k1Q4l2j00R2L0o8M4or5J01O7j13qN1p1L9Q7p8lK7p9OR4k5
4691A6j5J3n3MP2l2l3L9l3KL5n6K3M2k4j9N2m7nK6m4J7O9m9n0O4k3j2O4n1m1Q5
4723C6k5n6P4j4n8P6l0n1Q2lp4M5J4l7N4j2p9O8L7r1L8L2m3J7K2o0M3M6o9rM6
4754A9n5M0J8n3J9L2n3PM1l3OK5p5K1P1l8rK9m5J2N7n4NM6o2qO2l9NN3p0k8R8
$$ plain form
4543 59 25 -94 -52 15 38 104 39 -133 -76 29 51 107 47 -128 -60 41 1 52 74 -80 -97 42 12 19 67 -66 -118
4570 -118 60 70 -2 8 -64 -86 60 73 -10 -11 -53 -79 44 69 16 -8 -66 -70 32 71 38 -20 -79 -63 64 76 -6 -6 -65
4599 -65 -60 63 57 -16 29 -25 -85 40 80 -12 -9 -5 -59 55 92 -56 -56 -3 -23 52 81 -34 -56 -26 -29 35 96 -4 -55 -18
4629 -18 -50 31 113 2 -67 -3 -21 5 67 3 -51 36 14 -15 36 -5 -44 2 9 7 54 -29 -86 -14 22 47 52 -19 -80 -7 7
4660 7 -16 45 4 -55 7 -7 -28 56 24 -76 16 46 -22 22 16 -79 22 89 -24 -32 19 -52 -13 74 -4 -7 20 -59 -53 41 16
4691 16 1 14 -39 -35 37 5 -28 11 -22 -20 15 -41 -18 24 0 -19 33 -14 -19 7 -37 -20 49 0 -50 14 -9 -21 43 -8 -49 36
4723 36 11 -45 29 15 -43 33 3 -48 34 31 -43 2 16 -21 33 21 -58 10 47 -44 -6 26 -17 0 22 -38 5 51 -18 -27 19
4754 19 -36 4 22 -31 -12 20 -33 -26 15 -18 -12 13 -62 -41 30 -8 -17 12 -33 -21 36 -18 -13 33 -29 -37 25 -14 -9 44 -26 -54 44
4787D4m3m1M0j6j5O9k6n4N2Jm7O7qn1M0kn3P8J8r0J7NnM3K0q3K2K7k6L2K5p6J5
4820b1L2n1N6K7p1lK6j4M4L1j14NO8k2J1M2p9oN8k4J5L8o2m2N4jK1K4p4k7R2j0
4852B3j1Po2kP3oj3K4n9l7P1J9k5L2o4m3R4K6m3Om2l9J07K6o8J6j7m5N0M0m2l
4884gj4n7P4N4n0j7j9l9R5M6q9jJ1k7N3M9p8nK3n2M5R6q5l9K0j8M0P5p5o3M9o
4916a1K8M0n8m0L1oJ9O1m7n7J5RK9N8o7o7N9PJ6N1p8n6O7rnP2m9q4N9J7j2O5m3
4949A4r5N6N2j8K9m0p6O4O4n5K0k0o8N3M3k0J7jr3L8P5j6Qj9q9N9Q9m5l2J5o0
4980e1K1J00m0l8K1n7rJ11j5m5pm0J3J00k3n9Mj8K1O2n2k7L4m4%Q7k6m3K5m3l
5011d1J09l2r3K4J7j4Q4j2j02M2Pj7N7J4p8J1J4k2O1%n9jL9k4N8k2p0K4N4k2J3
$$ plain form
4787 44 1 -40 0 -16 -31 38 12 -42 10 11 -36 31 23 -28 12 10 -43 35 53 -37 -20 -15 -20 23 43 -40 -18 9 -17 15 40 -36 -21
4820 -21 11 -40 16 43 -28 -31 -5 -19 25 56 -58 -53 15 -7 4 46 -33 -39 19 -5 10 48 -14 -56 -2 -3 18 42 -32 -59 33 23
4852 23 12 19 -43 -45 28 22 9 33 -26 -63 8 27 2 34 -30 -73 21 47 4 10 -32 -71 36 62 -6 10 -7 -52 -2 38 -4 -7
4884 -7 -21 -78 -4 50 0 -17 -36 -75 20 66 -23 -24 -13 -40 13 62 -16 -21 2 -50 -5 91 6 -33 -13 -31 9 84 9 -54 -5 -11
4916 -11 17 57 -1 -41 -10 -16 3 64 17 -40 -25 -16 13 71 4 -63 -4 3 19 70 -8 -64 3 -6 -11 61 12 -72 -13 4 -8 57 14
4949 14 -81 -25 27 9 38 -2 -78 -14 50 -5 15 -5 -73 -20 23 3 20 19 -74 -36 39 23 31 12 -77 -18 71 26 -6 9 -51
4980 -51 -30 70 30 -8 13 -44 -53 58 43 -2 -9 -49 -36 64 41 -18 -14 -32 -11 51 -1 -28 6 -38 -38 49 23 -20 5 -38 -41
5011 -41 68 36 -57 -33 -16 -30 54 42 -60 -18 -11 -28 29 43 -35 -24 -10 -32 29 29 -30 -31 8 -16 42 20 -50 -26 28 6 19
5042A9Op1K3L7j9L1K8r3j9P2oJ3L8r6l0R3j9j6K6m5%L5j2oK7k4l2N5Oj8Rn1oP2
5076B7Lm0J8n4mP6jm4M1l0m9O6J6k7J8k3m6P1K5o3MJ5k1M8J8o8OK4k3L1K5l3k2
5109a6K5l7M2M5o2j0Ok3M6K8o0JL7m4RL3l1j8N0k4j6M8l9k5K6J4KK8l4o3O5Rj8
5142fK0pm7O2k4k3N8l4m0L2J4j1L2k8m8N3K1m5K6Kn5N7K3o0K6K2m5J5L9k1JPl1
5175a5pM7k2qNj9J7K5k9kJ0k7J3K6l5J6J3m3J3M9k8j1J8l1lN0j4n0N6jm3M5rl6
5209c0M1Pm6M2K0m7J4j0j3M2Jm3K7Rl2J6J3k5L1om3L9K7n5J6J4m2L3M6o7RM2l0
5242@j2L5l5ML1k9j1M7k6l1K7j3jL8k6k4K3j2J5K4l1oJ0k9OM7j3j0Ok8j5P8j7
5275B2n5M6Jl8M4jm9M1Ml2J2L8m5LJ3j9M1J2o7kL1lJ5K3m0j1K5m3K3N4m4qLk4
$$ plain form
5042 19 25 -46 -23 14 -5 26 54 -39 -58 14 8 21 59 -37 -67 26 7 -9 17 -28 -28 7 -5 -11 16 -8 -40 15 21 3 12 -39 -45 27
5076 27 30 -10 8 -46 -50 26 25 -19 22 -8 -57 9 25 -2 16 -7 -53 18 43 -20 -16 -1 -22 26 44 -24 -18 6 -17 14 39 6 -16
5109 -16 9 -28 14 59 -3 -13 -7 -30 16 44 -16 -15 22 -22 -13 20 -11 -29 21 -3 -19 29 -10 -35 -9 5 7 35 1 -62 3 12 -6
5142 -6 14 7 -40 22 -2 -25 33 -1 -41 -9 5 -6 26 -2 -50 3 24 -21 5 7 -48 9 32 -28 -2 20 -25 -10 29 8 9 16 -15
5175 -15 -22 25 3 -5 0 -19 -2 23 -6 -8 2 -25 -12 14 -21 -5 8 -35 -22 27 -1 -12 6 -25 -28 22 8 -42 14 13 -30 15 6 -30
5209 -30 11 18 -28 14 34 -13 1 -9 -22 20 21 -22 5 14 -18 -2 11 -14 17 11 -32 7 34 -21 -5 9 -33 0 46 -21 -12 30 0
5242 0 -12 23 -12 -8 23 -6 -17 30 4 -27 0 -13 -14 24 -2 -26 -3 -15 0 24 -7 -13 -3 -32 -26 21 8 -2 4 -24 -39 39 22
5275 22 -33 13 14 -24 20 19 -30 11 15 -17 -5 33 -12 -9 4 -15 26 38 -29 -31 0 -3 12 35 -5 -16 9 -34 -11 43 -1 -9 -6 -30
5309c0J8M6l8j2L2j0%Ql8oN2j5j6K5l7k1L7J0J8K7n7m3L5J8jL9l8l2L8j1l5O5
5341B8om5N1op0O6Rp0N6M3n5jQn3L1O9n2qJ0l9MN6pj0J3m3qK8KRj3pJ2J8m6J1
5377a5J6l3M4Lm7J3K9o1L5O9o0j6K9p1K2J00m2m1M3k3l7O0pm5O6j0m3M4jn1L0
5408@J8l2M2Po9J4M3k6K1Nn9K4J8j2J4Pj8J0k1pM4ml8J8Lj4K2j8l6N5Om9L8jm7
5443d2L3L7p6M3M0p9K4O3p2K1N8q5j8R7l9n2O9k2n4P6Rp7N2K6p2M1K6m1NJ3k2
5474a8NL8j7l3J2J4Npj9J3qJ2K2m0JL9m8j3Q2l7m6M8j6n0R5j3q2P5J0p4N4K5p7
5507d8M0N8q7J7O7p9rO5l7OM4n8k8P6k2k2K7nk9K4Lk7L8Jl0J4NLJ1k4mM0k2QK
5542A8n6K4N2n5J6K5m7kN1l1LM2n3n7R8k0n3P1k7o0Q0Lq2O3J5p4M2M5n8J3K9m9
$$ plain form
5309 -30 -12 34 -4 -16 16 6 6 14 -24 -30 22 7 -9 16 -21 -42 -5 5 23 50 -7 -50 -15 3 2 41 3 -29 9 -2 -37 28
5341 28 22 -23 28 22 -48 18 27 -43 13 56 1 0 8 -45 -14 55 3 -5 5 -34 -30 26 19 9 22 -21 -29 -1 1 10 -3 -10 2 20 -26 -15
5377 -15 1 -32 12 15 -32 -19 10 -51 -16 53 -7 -23 6 -65 -43 57 15 -26 17 -6 -43 17 10 -35 31 21 -22 22 21 -30 0
5408 0 18 -14 28 35 -34 -20 23 -3 18 23 -36 -12 6 -6 8 15 -3 7 -14 -21 23 19 -19 -1 2 -12 10 -8 -44 11 17 -32 6 5 -42
5443 -42 -9 28 -48 -5 35 -44 -20 43 -29 -8 50 -35 -53 44 5 -47 22 0 -54 22 31 -46 6 32 -40 1 27 -14 -9 4 -18
5474 -18 -13 25 8 -25 -13 1 6 -1 -20 -7 -15 -3 19 -21 -20 19 -29 -42 40 3 -43 5 -11 -61 34 21 -61 14 24 -50 4 29 -48
5507 -48 -8 50 -37 -20 47 -32 -41 24 -13 -7 37 -21 -49 27 5 -17 10 5 -24 0 3 -24 14 15 -15 -1 4 7 18 -6 -10 30 8 16 18
5542 18 -38 -14 38 -17 -1 24 -23 -25 26 -5 -2 40 -13 -70 28 8 -45 26 -1 -61 19 22 -60 3 18 -56 -14 31 -27 -14 15 -34
5574c4K0N3n2k0K9j4ML7k2k6K7j3mOK5lpl0K5Kj2K5k7k9N0K0o0K4K1n0L7M4p8
5607c2K5M3p1J3O3m2k7N9m8j0P4m8m5O5j2m2N3mn6M7Rm4K8K9n7J4K7l0K5K7m4
5638a1j8L9JpJ3k1PoKMQj1%qj1M1km7L8j0j5L2mm7K9K7o2L2M3o8K5K5m8K8M2o0
5674b0j4N7l8kN2m6k3M4rk9L8ql3K4%j0K2Qm2K3J0j9J5j4jLJ3j0oJ1m%jpL4j7
5710Aj3K2k4J7K6l3j8M5ll9L6qk8L4om7L8K0n0K7K3k4LJ7n8K5M6l5k4N1j9j7K8
5743A3k9j3L4ok7K5PrKRl8K6J4j8nJ3%kpMQj5J0nkOK2k7j2M1j1k7L5j5j2L1l4
5780a4j8M3Ol3J6rj8L7ll4K0J5l0J4J8l0J9K0m7LN3l9j1L0j3j5K9l0mL6qj0KP
5814Bk6K8j2j0J6Rk9LMJ2PnqJ5Kj2JqLK0j7nJ7k3ML5k4lK3j6k4K9J0k9J6Oj6K4
$$ plain form
5574 -34 -14 39 -13 -33 -4 -18 -14 23 1 -25 2 -11 -15 -9 16 13 6 -24 1 3 -9 16 -11 -40 10 30 -30 -6 15 -35 2 46 -32
5607 -32 -7 36 -35 -22 41 -1 -28 31 -17 -27 47 -1 -46 19 7 -35 18 14 -42 5 14 -30 -2 27 -30 -16 11 -19 6 33 -11
5638 -11 -29 10 11 4 17 -4 3 -3 -1 3 11 0 0 -8 -19 22 20 -27 11 1 -14 18 14 -33 -4 23 -39 -7 36 -32 -7 18 -30 -2 40 -20
5674 -20 -34 23 -15 -17 35 -11 -34 10 1 -28 10 2 -31 -7 -7 -17 5 13 -29 -6 4 -15 0 -14 -15 -12 1 -9 -15 -4 -8 -8 -9 -16 18 1
5710 1 -12 10 -14 3 29 -4 -22 23 20 -19 17 9 -19 15 9 -38 0 20 -30 -3 20 -4 -1 16 -42 -17 29 -6 -30 21 2 -15 13
5743 13 -16 -29 5 -1 -28 -3 4 -5 -3 6 -32 -6 8 -10 -15 -2 -2 -4 -11 -7 1 -14 -4 -9 -11 -5 17 -10 -22 19 8 -19 16 1 -11 20 -14
5780 -14 -32 11 17 -16 0 -9 -27 10 7 -27 -7 8 -22 -8 10 -20 -1 19 -28 -25 28 -11 -22 8 -5 -20 9 -21 -25 11 3 -7 -5 2
5814 2 -24 4 -8 -18 -2 7 -22 -19 -15 -3 4 -1 -9 6 8 -4 -3 -11 -8 12 -5 -10 7 -16 -12 23 -1 -4 19 3 -21 8 18 -11 5 11 -5 19
5852A9ql7J8L3l7jK4l3J6K9m8J7L2j0k5J5k3PL8k9j9L2j0k5L0qnJ3rj9J9Mj2Q
5886dj5K2Qk5jRJ6lo%j3mOJL0lk0jnkL0rk2K2kl9L3Mk3L4Jn0K3J5k3MK9k9J1J7
5926A6l9j9N1Lj0J4j7k9K7oML0j8j9Oj1MJ7noJ8j5qJ8j8PK7k4j7K4j3nK6Ok0L4
5962C3l6l1L4Lj7M2j8l7L5%k5L4J0l1KJ3l2K9J1k8J7J2m1J1Nj4J7K5k9oJ8k5j
5995b0K9mj1J0l0mL7mNjk5K0Rkk8K1jnJ6k5KK7j6pJ8Ll1K7j5pM1j5l3L1Jk7K3
6032IKk9L5jl6J5PnjJ6k3J7J0k1MK8l0NKk0K6Lk7J5mrJ6lj9J8Ol1K0J8k2J7J0
6069A8l2NL7m0j7M8nk2K6l7qL4Oj7J9j5j7J2LOJ8j4l6M3j6jK2j7l0M1Ll4J9J2
6103A4k9L2ok4J4lk2J6K8j6Jql5L7J8k2J1Ol6K3LnJ2Lk2jK6j7J7Jk7J3K0k1j0
$$ plain form
5852 19 11 -26 -8 25 -12 -13 11 -22 -6 23 -25 -8 24 14 -11 4 -19 -12 26 -3 -22 10 0 -25 5 -3 -8 5 -4 -23 -4 0 -12 -4
5886 -4 -19 3 11 -14 -15 -6 10 7 1 1 -12 -16 -10 -9 21 18 -2 -3 -8 -10 20 11 -11 11 9 -30 3 7 -16 18 19 -31 -8 7 -16 -12 17 -12 -1 16
5926 16 -23 -42 9 12 2 16 -1 -30 -3 -9 -5 25 7 -12 -6 -17 -13 4 -1 -7 11 -4 -12 6 -12 -5 22 -2 -19 5 -8 -13 13 19 -1 33
5962 33 -3 -34 0 3 -14 28 10 -27 8 8 -17 17 27 -4 -2 11 -21 8 19 -9 8 20 -21 -10 -5 -19 -2 23 -6 -12 6 -19 -20
5995 -20 9 5 -6 4 -26 -30 7 3 8 7 -18 2 11 9 -19 2 1 -4 12 -13 -11 16 0 -7 11 14 -17 10 -5 -12 29 14 -19 12 13 -14 9
6032 9 11 -18 17 16 -20 -5 2 -3 -4 12 -11 6 16 -5 -1 27 -3 2 4 -16 10 13 -14 1 -3 -12 4 1 -18 0 6 -25 -5 13 -9 8 18
6069 18 -14 -9 28 -12 -29 19 14 -8 18 -19 -27 7 13 -4 15 0 -17 -5 -2 4 22 8 -28 15 -1 -2 20 3 -27 14 17 -17 2 14
6103 14 -15 17 11 -13 1 -2 -24 -8 20 4 5 -3 -38 -1 17 -5 6 12 -24 -1 2 -3 9 12 -10 -11 15 -2 15 16 -11 2 22 1 -9
6138iRk5PN0j9j7J1k2NK6J1k4jj6rM7j4j4Rj3oJ4lnK2k3kK2oj3J9l3qO7k1l3P
6175a0pj6M9Km5L4j5j9L0K1l9MLk3L0J7k7pPk0L7Pk2qJ4j0K5Mk4J2qpK1K1l6q
6211a3J2j6K6J6m2lJ5MJ2Oj8mlj9K1L5l5j5J9JQJ6k7k5M0%j8K5k5k8M1j2j3L8
6245A9j3l8J2J6MK6k4l1J1J7JK0l0j6J2K6j3J1Kl6K2nJ0K7k5j0PJ0j1J1j6k0M2
6278A8j4j6K0Mm2K0Qk1K8J8m7LL6j4pJ8l0JK6j3j5K5ok5K5rQMMk2K9oj1jljJ8
6315A0j3NkklPrMJ8j8k0L3j3lJ9k3mJ8Rk0J5%rRlk0L2%m0K9%j8J9kk2K0jk5J7
6354fJ2k7J4jk5K1K1k2pK5j7LJ6k2KJ6j1j1L1lk3MrK2J1j4%j0jJ1K0l2JJ3j3k
6390a3L6k6lMopM4j0n0K0Qj0L1ll3J5J0j6J1Qj9mJ1kJ9Ok9j2RJ4J2ql1JK2qJ6
$$ plain form
6138 -9 0 -25 -18 32 13 -4 7 -15 -10 16 27 3 2 -14 -23 24 10 -4 5 -8 -14 0 -3 -8 14 -9 -11 11 5 -8 11 -22 -30 37 16 -17 -10
6175 -10 -17 -33 16 18 -27 7 -8 -27 3 24 -15 -11 -8 -31 -1 16 -11 -18 -11 -31 6 13 -9 -17 -3 -13 12 16 -8 4 -4 -11 10 31 -5 -13
6211 -13 -1 -17 9 25 -17 -20 -5 -1 11 17 -1 -5 -8 -27 -6 29 -6 -21 -2 -1 7 23 -4 -29 11 11 -7 18 -7 -35 6 -6 -19 19
6245 19 6 -32 -20 -4 0 26 2 -29 -18 -1 0 20 -10 -26 -14 12 -1 10 12 -24 -2 -7 3 30 5 -5 2 12 1 12 -4 -24 18
6278 18 4 -12 8 12 -30 -10 -2 -23 5 23 -24 -21 15 1 -6 12 -18 -17 9 -4 -19 6 0 -25 0 -9 -1 3 7 -15 14 8 -3 -4 -7 -8 10
6315 10 -3 2 0 -2 -5 2 -7 -3 15 -3 -23 10 -3 -6 13 -10 -14 4 13 -7 8 8 -1 8 5 -15 17 17 -23 6 6 -12 7 5 -17 3 2 -23 -6
6354 -6 6 -21 -7 -8 -33 -12 9 -13 -20 5 -12 -9 7 -15 -13 3 -8 -19 12 9 -14 -10 -19 3 14 0 0 -10 -11 0 20 -12 -11 2 -11 -13
6390 -13 23 -3 -6 -2 -8 -15 29 19 -31 -11 -3 -13 18 15 -18 -3 7 -9 2 10 -9 -13 -2 -4 15 21 -8 -20 -11 3 15 7 -24 -23 -1 -9 7
6427Gjqj1KMRJ5l5rJ5K1J4ol3oRJ6MKj0k6K1J4MQl3rOK5J7ql1j7L6MKjj7j9J1
6467a4K5jOj4l0J8K9jkj8k4OK8J4j8k2%oK0K0j5j1qOK3Koj1k4K3K8pj8j3m%L7
6504A8jj4Ok9J0K8Mk2%j5mL9J2k6j1mjK5J0l1mjPRJ5k3rJj9M5K1l1k6qQL5Pj7
6542Dk2LlK4J4j7j5KqJ9J3j8k4K7j9J9K3l0k2J6J8oK0k6noPJ4K2j7j8NlJ3K5j6
6578A3m2J5K6j6J0%l0J3J3%Ook2J2J3qK1k1j4MK2j7J0j0j4J4J3k0OJ5k6QKoJ7
$$ plain form
6427 7 6 -2 -13 -11 -7 2 17 -18 -27 -12 9 23 17 -16 -22 -13 3 7 9 -1 -27 -6 8 12 20 -13 -22 -16 9 26 18 -13 -30 6 10 12 11 -6 -25 -14
6467 -14 11 10 16 2 -28 -10 19 18 16 -2 -26 -20 8 22 4 -18 -18 -24 -4 16 1 -10 -18 -12 11 13 7 -4 -28 -5 23 16 -2 -15 -19 -19 18
6504 18 17 3 9 -20 -10 18 22 0 0 -15 -19 20 32 6 -5 -9 -10 15 25 -6 -10 -11 -4 5 20 -3 -12 -11 -30 15 36 5 -21 -29 -21 14 21 4
6542 4 -18 -15 -18 6 20 3 -12 -10 -18 1 14 -4 -28 -1 -20 -1 22 -8 -30 -14 4 -2 18 -8 -13 -19 -12 2 24 7 -11 -6 -9 4 29 13
6578 13 -29 -14 12 -4 6 6 -24 -11 2 2 8 2 -20 -8 5 -3 18 -3 -17 -13 9 -8 2 -8 -22 -8 5 -15 -9 6 -20 -12 -10 -16 1
$$ [...]
8191E
##END NTUPLES=NMR FID
##END=
