##TITLE=1H_LY-844.40
 CCl4, 8 sc, 
 27.6.2019
##JCAMPDX= 6.0         $$ Bruker NMR JCAMP-DX V2.0
##DATA TYPE= NMR FID
##DATA CLASS= NTUPLES
##ORIGIN= UXNMR, Bruker Analytische Messtechnik GmbH
##OWNER= root
$$ XWIN-NMR		Version 3.5
$$ Thu Jun 27 15:59:38 2019 Russian Standard Time (UT+4h)  she@DPX200
##.OBSERVE FREQUENCY= 200.13155
##.OBSERVE NUCLEUS= ^1H
##.DELAY= (6, 6)
##.ACQUISITION MODE= SIMULTANEOUS
##.ACQUISITION SCHEME= undefined
##.AVERAGES= 8
##.DIGITISER RES= 18
##SPECTROMETER/DATA SYSTEM= spect
##.PULSE SEQUENCE= zg30
##.SOLVENT NAME= CDCl3
##.SHIFT REFERENCE= (INTERNAL, CDCl3, 0, 15.7039)
##AUDIT TRAIL= $$ (NUMBER, WHEN, WHO, WHERE, WHAT)
$$ ##TITLE= Audit trail, XWIN-NMR		Version 3.5
$$ ##JCAMPDX= 5.01
$$ ##ORIGIN= Bruker BioSpin GmbH
$$ ##OWNER= she
$$ F:/spectra/data/she/nmr/H-F/1/audita.txt
$$ ##AUDIT TRAIL=  $$ (NUMBER, WHEN, WHO, WHERE, WHAT)
(   1,<2019-06-27 15:58:27.37 +0400>,<she>,<DPX200>,
      <created by zg, POWCHK disabled, PULCHK disabled
       configuration hash MD5:
       00 E9 B6 7A A2 85 ED C7 34 08 36 98 17 FE 4E 26
       data hash MD5: 16K
       CA 39 0C 4D AD 78 0E 09 8D D9 6D F0 F9 D7 FE 71>)
$$ ##END=
$$ 
$$ hash MD5
$$ 54 A2 1D ED 88 4D 77 E7 19 98 7B 1A 9F 14 CD C5
##$RELAX= 
##$RELAX= 
##$RELAX= 
##$RELAX= 
##$RELAX= 
##$RELAX= 
$$ Bruker specific parameters
$$ --------------------------
##$DU= <F:/spectra>
##$EXPNO= 1
##$NAME= <H-F>
##$PROCNO= 1
##$TYPE= <nmr>
##$USER= <she>
##$AMP= (0..31)
100 100 100 100 100 100 100 100 100 100 100 100 100 100 100 100 100 100 
100 100 100 100 100 100 100 100 100 100 100 100 100 100 
##$AQSEQ= 0
##$AQ_mod= 1
##$AUNM= <au_zg>
##$AUTOPOS= <>
##$BF1= 200.13
##$BF2= 200.13
##$BF3= 200.13
##$BF4= 200.13
##$BF5= 200.13
##$BF6= 200.13
##$BF7= 200.13
##$BF8= 200.13
##$BYTORDA= 1
##$CFDGTYP= 0
##$CFRGTYP= 5
##$CHEMSTR= <none>
##$CNST= (0..31)
1 1 145 1 1 1 1 1 1 1 1 1 1 1 1 1 1 1 1 1 1 1 1 1 1 1 1 1 1 1 1 1 
##$CPDPRG= <>
##$CPDPRG1= <>
##$CPDPRG2= <>
##$CPDPRG3= <>
##$CPDPRG4= <mlev>
##$CPDPRG5= <mlev>
##$CPDPRG6= <mlev>
##$CPDPRG7= <mlev>
##$CPDPRG8= <mlev>
##$CPDPRGB= <>
##$CPDPRGT= <>
##$D= (0..31)
0 1.2 0 0 0 0 0 0 0 0 0 0.03 0 0 0 0 0 0 0 0 0 0 0 0 0 0 0 0 0 0 0 0 
##$DATE= 1561636706
##$DBL= (0..7)
120 120 120 120 120 120 120 120 
##$DBP= (0..7)
150 150 150 150 150 150 150 150 
##$DBP07= 0
##$DBPNAM0= <>
##$DBPNAM1= <>
##$DBPNAM2= <>
##$DBPNAM3= <>
##$DBPNAM4= <>
##$DBPNAM5= <>
##$DBPNAM6= <>
##$DBPNAM7= <>
##$DBPOAL= (0..7)
0.5 0.5 0.5 0.5 0.5 0.5 0.5 0.5 
##$DBPOFFS= (0..7)
0 0 0 0 0 0 0 0 
##$DE= 6
##$DECBNUC= <off>
##$DECIM= 24
##$DECNUC= <off>
##$DECSTAT= 4
##$DIGMOD= 1
##$DIGTYP= 9
##$DL= (0..7)
0 120 120 120 120 120 120 120 
##$DP= (0..7)
150 150 150 150 150 150 150 150 
##$DP07= 0
##$DPNAME0= <>
##$DPNAME1= <>
##$DPNAME2= <>
##$DPNAME3= <>
##$DPNAME4= <>
##$DPNAME5= <>
##$DPNAME6= <>
##$DPNAME7= <>
##$DPOAL= (0..7)
0.5 0.5 0.5 0.5 0.5 0.5 0.5 0.5 
##$DPOFFS= (0..7)
0 0 0 0 0 0 0 0 
##$DQDMODE= 0
##$DR= 18
##$DS= 0
##$DSLIST= <SSSSSSSSSSSSSSS>
##$DSPFIRM= 0
$$ [...]
##$SUBNAM2= <"">
##$SUBNAM3= <"">
##$SUBNAM4= <"">
##$SUBNAM5= <"">
##$SUBNAM6= <"">
##$SUBNAM7= <"">
##$SUBNAM8= <"">
##$SUBNAM9= <"">
##$SW= 24.9336996594482
##$SWIBOX= (0..15)
0 0 2 0 0 0 0 0 0 0 0 0 0 0 0 0 
##$SW_h= 4990.01996007984
##$TD= 16384
##$TD0= 1
##$TE= 0
##$TE2= 300
##$TE3= 300
##$TEG= 300
##$TL= (0..7)
0 120 120 120 120 120 120 120 
##$TP= (0..7)
150 150 150 150 150 150 150 150 
##$TP07= 0
##$TPNAME0= <>
##$TPNAME1= <>
##$TPNAME2= <>
##$TPNAME3= <>
##$TPNAME4= <>
##$TPNAME5= <>
##$TPNAME6= <>
##$TPNAME7= <>
##$TPOAL= (0..7)
0.5 0.5 0.5 0.5 0.5 0.5 0.5 0.5 
##$TPOFFS= (0..7)
0 0 0 0 0 0 0 0 
##$TUNHIN= 0
##$TUNHOUT= 0
##$TUNXOUT= 0
##$USERA1= <user>
##$USERA2= <user>
##$USERA3= <user>
##$USERA4= <user>
##$USERA5= <user>
##$V9= 5
##$VALIST= <valist>
##$VCLIST= <CCCCCCCCCCCCCCC>
##$VD= 0
##$VDLIST= <DDDDDDDDDDDDDDD>
##$VPLIST= <PPPPPPPPPPPPPPP>
##$VTLIST= <TTTTTTTTTTTTTTT>
##$WBST= 1024
##$WBSW= 4
##$XGAIN= (0..3)
0 0 0 0 
##$XL= 0
##$YL= 0
##$YMAX_a= 485647
##$YMIN_a= -331015
##$ZGOPTNS= <>
##$ZL1= 120
##$ZL2= 120
##$ZL3= 120
##$ZL4= 120
##$ABSF1= 10
##$ABSF2= 0
##$ABSG= 5
##$ABSL= 3
##$ALPHA= 0
##$AQORDER= 0
##$ASSFAC= 0
##$ASSFACI= 0
##$ASSFACX= 0
##$ASSWID= 0
##$AUNMP= <proc_1d>
##$AZFE= 0.1
##$AZFW= 0.1
##$BCFW= 1
##$BC_mod= 2
##$BYTORDP= 1
##$COROFFS= 0
##$CY= 11.3945322036743
##$DATMOD= 1
##$DC= 2
##$DFILT= <>
##$DTYPP= 0
##$F1P= 18.9103706918063
##$F2P= -1.10871071338519
##$FCOR= 0.5
##$FTSIZE= 0
##$FT_mod= 4
##$GAMMA= 1
##$GB= 0.15
##$INTBC= 1
##$INTSCL= 1
##$ISEN= 128
##$LB= 0.24
##$LEV0= 0
##$LPBIN= 0
##$MAXI= 10000
##$MC2= 0
##$MEAN= 0
##$ME_mod= 0
##$MI= 1.114404
##$NCOEF= 0
##$NC_proc= 0
##$NLEV= 6
##$NOISF1= 3.799351
##$NOISF2= 2.8
##$NSP= 1
##$NTH_PI= 0
##$NZP= 0
##$OFFSET= 15.70392
##$PC= 1
##$PHC0= -8653.144
##$PHC1= 11.00098
##$PH_mod= 1
##$PKNL= yes
##$PPARMOD= 0
##$PSCAL= 0
##$PSIGN= 0
##$REVERSE= no
##$SF= 200.130013532006
##$SI= 16384
##$SIGF1= 3
##$SIGF2= 2
##$SINO= 400
##$SIOLD= 16384
##$SREGLST= <1H.CDCl3>
##$SSB= 0
##$STSI= 0
##$STSR= 0
##$SW_p= 3612.71676300578
##$SYMM= 0
##$S_DEV= 0
##$TDeff= 0
##$TDoff= 0
##$TI= <>
##$TILT= no
##$TM1= 0
##$TM2= 0
##$TOPLEV= 0
##$USERP1= <user>
##$USERP2= <user>
##$USERP3= <user>
##$USERP4= <user>
##$USERP5= <user>
##$WDW= 1
##$XDIM= 8192
##$YMAX_p= 0
##$YMIN_p= 0
$$ End of Bruker specific parameters
$$ ---------------------------------
##NTUPLES= NMR FID
##VAR_NAME=  TIME,          FID/REAL,        FID/IMAG
##SYMBOL=    X,             R,               I
##VAR_TYPE=  INDEPENDENT,   DEPENDENT,       DEPENDENT
##VAR_FORM=  AFFN,          ASDF,            ASDF
##VAR_DIM=   8192,          8192,            8192
##UNITS=     SECONDS,       ARBITRARY UNITS, ARBITRARY UNITS
##FACTOR=    0.0002004,     1,               1
##FIRST=     0,             0,               0
##LAST=      1.6414764,     0,               0
##MIN=       0,             -331015,         0
##MAX=       1.6414764,     485647,          0
$$ Real data points
##PAGE= N=1
##DATA TABLE= (X++(R..R)), XYDATA
$$ [...]
2564A95K868m209Q57J564l673J688L463l081k81K277l000j196L676K77o39J05
2580H91k710o83L352Q59p68p58j883N96K081o47K57L67k536L14K300j062P98J517
2598B285m640r28N098k67j296J853m049k457O347Q44l734K672j233n051M318L410
2614C172l846J873R87o680J768O701k607j616J573m350j45O883j205l952J855
2629D11j422j956M240J589k590l27j322j535K996K927q83k241k774J56L904J142
2645B315p99q41l407N0M293k35j175K065l479l396N325K257k867J871k149n603
2661e775N384N378m842l88J273n320K239P134m088k558L481m294k003P656K46
2676C523m542J679k396k859O823K659n348q39L25k119L932L051l541j312J61j626
$$ plain form
2564 195 3063 -1146 -289 1275 -2398 -710 2753 -328 -609 1668 -1332 -2528 1148 1425 786 891
2580 891 -1819 -2502 850 1709 941 183 -1700 -1104 977 330 587 954 -1582 -1268 1032 -30 768 2285
2598 2285 -2355 -3283 1815 1548 252 2105 -1944 -4401 1946 2790 -944 1728 495 -4556 -238 3172
2614 3172 -674 1199 2186 -4494 -2726 3975 1368 -248 1325 -3025 -3170 3713 2508 -1444 411
2629 411 -1011 -2967 1273 2862 272 -55 -1377 -2912 84 3011 2128 -113 -2887 -2731 1173 2315
2645 2315 1516 675 -2732 -2682 1611 1376 201 2266 -1213 -4609 716 2973 106 1977 -172 -5775
2661 -5775 -391 4987 145 -243 1030 -4290 -2051 5083 995 -1563 1918 -2376 -4379 3277 3523
2676 3523 -1019 660 -1736 -4595 2228 4887 -461 -1300 -975 -3094 838 3889 348 -964 -803 -2429
2692b429K076L206j123j526k046j467L349K943j241j196k605j609M664K213l132
2707G7M53l80m196L382M407l968M06J840o200J042Q069l096l600L544m142k157
2723d519R027o20p255L647L39n076N672L624o445Q00K110n268K857O380m266l172
2739b165K244k260R96N292k474l874J755k54m08K986k46j993j32j137O50K697
2755A677j75q47r35l012K315M433k825j659K316l470l87O334k608l890M965k000
2771B32m806O572J720o198L052O68o100N448M724p373J44M421n402J484O511n893
2787g96k412O452l985l278P764j219n639L983j78m199N205J880n553N82K219j873
2803a047J581J141k496N57M34j533J755P92j685J344j050k393L494J280l342J285
$$ plain form
2692 -2429 -353 2853 1730 204 -1842 -3309 40 2983 1742 546 -2059 -3668 996 3209 77
2707 77 530 150 -4046 -664 3743 -225 181 2021 -4179 -3137 4932 1836 -1764 1780 -2362 -4519
2723 -4519 4508 3888 -3367 280 619 -4457 1215 4839 -1606 -806 1304 -3964 -1107 5273 1007 -2165
2739 -2165 79 -2181 -1185 4107 1633 -2241 -486 -740 -1148 1838 1592 -401 -533 -1670 -1020 1677
2755 1677 1502 655 -280 -3292 -977 3456 631 -1028 1288 -2182 -2569 3765 1157 -2733 2232 232
2771 232 -4574 1998 3718 -2480 572 1240 -4860 588 5312 -2061 -1917 2504 -2898 -1414 5097 -796
2787 -796 -3208 3244 -741 -4019 3745 2526 -3113 870 692 -3507 1698 3578 -1975 -1393 826 -1047
2803 -1047 534 1675 -821 -264 170 -1363 392 1184 -501 843 -207 -2600 894 2174 -1168 117
2819A17L56k898L369J422m823K577K466n468K293L900n722J304N468o851j225
2834c715Q479m264m831P319j771n544O945l1p069N260K751o460K436L030m806
2849b271K217K877n283J504M109m430p5L653l723J25M154l508j456M098j628k303
2865a940K318k17m4J625k561o57K064j727J550K621m581l35M529m301j430P077
2881C991k340m870M993j589m317O815M64o879L851K071m983L810J742o610L344
2896e07L946o258K640N263p663j213O570m091k87P744n132o663N450Q15k147M742
2912C209m88n029J472K93j481L823O7k703J862j773j850N026r66n117L793K009
2928B147k880K931n67o169K473L629j702L357K30o871O96K231k898O307M459r293
$$ plain form
2819 117 473 -2425 944 2366 -2457 120 2586 -2882 -589 3311 -2411 -1107 4361 -2490 -3715
2834 -3715 4764 500 -4331 2988 1217 -4327 2618 2587 -4482 778 3529 -2931 -495 2535 -2271
2849 -2271 -54 2823 -2460 -956 3153 -1277 -1352 2301 -1422 -1297 2857 -651 -2107 1991 363 -1940
2865 -1940 378 161 117 1742 -819 -1476 588 -1139 411 3032 -1549 -1884 2645 -1656 -3086 3991
2881 3991 1651 -3219 1774 185 -4132 2683 3147 -3732 119 2190 -2793 1017 2759 -3851 -507
2896 -507 3439 -2819 -179 5084 -2579 -3792 2778 -1313 -1600 6144 1012 -5651 -201 614 -1533 3209
2912 3209 2721 -2308 -836 -543 -2024 1799 1866 -837 1025 -748 -2598 2428 1462 -3655 138 2147
2928 2147 -733 2198 1631 -4538 -2065 1564 -138 3219 3449 -3422 -2726 -495 -3393 2914 7373 -1920
2944a920j933M799m609K136Q455o167n165O871k220m378O611p15n332M736J065
2959B234l554L508j365o338L965L952j620L913j899r576K289O186j545L065K487
2974E702p693k986L747l45K658M045m239k862Q86j326K817K701n123L22N188l389
2990A03q37L491n886k372Q566k2k881L857m350p362N337M272k16M439l586r014
3006f461K841L679j304N652M86q590J724L752n339K914N543o236j369N981k965
3021C08j950L247m011j599O793Q99k264k23n193j288O554J132m10K580n470n348
3037f243M947J913n22M842k383p096K649K696j854K880k44m264L492J540m337
3052a984K175O02m958M441M377n295P88K183p461P87Q774j883k108K459n908k768
$$ plain form
2944 -1920 -3853 946 -3663 -1527 6928 761 -4404 2467 247 -4131 2480 1765 -3567 1169 2234
2959 2234 -1320 2188 823 -5515 -1550 2402 782 4695 2796 -6780 -4491 1695 150 3215 5702
2974 5702 -1991 -4977 -1230 -1575 1083 5128 889 -1973 -1087 -2413 404 3105 -2018 -1696 3492 103
2990 103 -734 2757 -3129 -5501 3065 3043 162 4019 -331 -7693 -2356 1916 1700 6139 2553 -6461
3006 -6461 -3620 59 -1245 4407 4893 -3697 -1973 1779 -3560 -646 4897 -1339 -2708 3273 308
3021 308 -1642 1605 -2406 -4005 2788 3687 1423 1200 -3993 -5281 1273 2405 1995 4575 -895 -6243
3037 -6243 -1296 617 95 4937 2554 -4542 -1893 803 -1051 1829 1585 -2679 813 2353 -1984
3052 -1984 191 793 -4165 276 4653 -642 146 2329 -5132 -4345 4429 2546 438 2897 -3011 -5779
3068e779P484Q20k751K940k864l637M129J21j872M175j592m727M306J291l776
3083a732K428J64m190L878L381m456n23J122k652K490K909k805M35N18m129J896
3099a266L753k750J058J612n642O79N989l498j611M100l270j628N268k355l299
3114b860M690j046l458M375m88l687L852o46m193N003J622n868K310K238m379
3129b535K855L233n573j0M429l119o43L476k319j108K666k053o03L094j675j010
3145h95J972j993P0K796k787j282M188j147k134K373j950j773M436m74k772K808
3161A436j096l228L517M78k626L795n92n346L372K806m330K137K096n118J920
3176g79M472m959j040M347k843q32M475k393k337L044k181j554M951k97k944J450
$$ plain form
3068 -5779 1705 2525 -226 2714 -150 -3787 342 463 -1409 2766 1174 -3553 753 2044 -1732
3083 -1732 696 860 -3330 548 3929 -527 -1050 72 -2580 -90 2819 14 449 967 -3162 -1266
3099 -1266 2487 -263 795 2407 -3235 -2556 3433 -65 -1676 2424 -846 -2474 2794 439 -2860
3114 -2860 1830 784 -2674 1701 1213 -2474 1378 732 -3461 1542 3164 -2704 -394 1844 -2535
3129 -2535 320 3553 -2020 -2030 2399 -720 -1363 2113 -206 -1314 1352 -701 -1304 1790 115 -895
3145 -895 1077 -916 -846 1950 -837 -2119 2069 922 -1212 1161 -789 -2562 1874 1400 -1372 1436
3161 1436 340 -2888 629 1107 -1519 2276 1684 -3662 -290 2516 -1814 323 2419 -2699 -779
3176 -779 3693 -1266 -2306 2041 -802 -1634 2841 448 -1889 1155 -1026 -2580 2371 2074 -870 580
3192E80j705j856M938O28l840J573J13k797K649J521k666J015P98k524J437J755
3208A619j850K60m72j693L237J700l765K18Q34k392K698L068m055m65K419l530
3224b169K86M963k040j984K059k958o33N461j216l763K603r09j900M452k47m544
3240b539K406J419l518K721K370m007j8J572k086J853K926l233j467J180p12J845
3256G12J896l286p10J926j777P24K953k378j324K065k186lM064j611k723J626
3272c2p62j68L596j576l321K532Kj817L240j91l495K295M85k984L017K050m153
3289a282j83K048j861J779K250l874q46K817j376M40K331k732r10K450j930n08
3305a387L542j363k397J868p32p82L208j070k868K033N08j293J847p39j994K247
$$ plain form
3192 580 -1125 -2981 1957 2585 -1255 318 431 -2366 283 1804 -862 153 951 -1573 -136 1619
3208 1619 -231 29 -443 -2136 1101 2801 -964 -746 88 -2304 394 3462 -593 -1058 1361 -2169
3224 -2169 -1883 3080 1040 -944 1115 -1843 -2476 2985 1769 -1994 609 -300 -2200 2252 2005 -2539
3240 -2539 -133 1286 -2232 489 2859 -1148 -1166 406 -1680 173 3099 -134 -1601 -421 -1133 712
3256 712 2608 -678 -1388 538 -1239 -515 2438 60 -1264 801 -1385 -1388 2676 1065 -1658 -32
3272 -32 -794 -962 2634 1058 -2263 269 271 -1546 1694 1503 -1992 303 788 -2196 821 2871 -1282
3289 -1282 -1465 583 -1278 501 2751 -1123 -1969 848 -528 -88 2243 -489 -1399 1051 -879 -1387
3305 -1387 2155 792 -1605 263 -469 -1251 1957 887 -1981 52 560 -733 1114 375 -1619 628
3321F28o0k178K628M53l144J677P10k658K824J766m316L24K614k200O73K376l121
3338a004k15K994k399q95L337j555j661K511j384j361L494q78l106K299N80j692
3354i35J883k15k284J710N65j721J140P50j440P69k05j536K234Q61k655P41J008
3371F70j908J542J338k971P64K236k657O8K450j978o5K080k753k36L384j683j761
3388a480K644j290j514L537j287k685L112O0l107K385J137k896J805O02k959J858
3404g8K248k844r6J528j869J087J887k633j16K005j571m32J996j087l42J201j798
3421i14j56K382q31r57P31j335M23K386j670j156K118j445q72K677j041j486K578
3438A432j304k602L438O96l012J736J00k791K988J729m056Q78K409l012N09K899
$$ plain form
3321 628 568 -1610 1018 1471 -1673 4 714 -1944 880 2646 -1670 -1346 1268 -932 -259 2117 -1004
3338 -1004 -1219 1775 -624 -1519 1818 263 -1398 1113 -271 -1632 1862 984 -2122 177 757 -935
3354 -935 948 733 -1551 159 724 -997 143 893 -547 222 17 -1519 715 1576 -1079 -338 670
3371 670 -1238 304 1642 -1329 -565 1671 -986 -918 1532 -446 -511 1569 -1184 -1420 1964 281 -1480
3388 -1480 1164 -126 -1640 1897 610 -2075 1037 1097 -2010 375 1512 -1384 421 1023 -1936 -78
3404 -78 2170 -674 -770 758 -1111 -24 1863 -770 -886 1119 -452 -884 1112 25 -317 884 -914
3421 -914 -1070 1312 481 -476 255 -1080 -657 1729 59 -1097 1021 -424 -1296 1381 340 -1146 1432
3438 1432 128 -2474 964 1660 -1352 384 484 -2307 681 2410 -1646 -768 1641 -1371 -862 2037
3454B037k755l44K721k508j023L753j118j935J652r20q32K980q10k441J718J34
3470C09j210J785j97j721J393j00j504J663P99j501L22n12r05K362L62k194Q58
3487IJ10j524K360M17k953J695J352l175J084K715k901R1K018k778M73L732k773
3504d8j920K880j164r60L421j707k904L360k75k866L187R49l477J491R91k871
3520a913J876K369k999n00J860r19L87P08j670J60J370q19L53O21j833M56J157
3537F64j727J065K218k380j281J444q48R16K154k338j263K184j505l76K749j681
3553ej436L288j862k387L939k07l742K829J092l105K393J078m303J012L326j902
3569HJ17J518k921j32K387j722M05K701k446j450K036j169k65K962j439k441K331
$$ plain form
3454 2037 -718 -1062 1659 -849 -1872 1881 763 -1172 480 -440 -1272 1708 898 -1543 175 309
3470 309 -901 884 687 -1034 359 259 -1245 418 1217 -284 38 -474 -1379 983 1345 -849 9
3487 9 119 -1405 955 1372 -1581 114 1466 -1709 -625 2090 -811 -720 1298 -1480 -1007 2725 -48
3504 -48 -1968 912 -252 -1212 2209 502 -2402 958 683 -2183 1004 1953 -1524 -33 958 -1913
3520 -1913 -37 2332 -667 -1167 693 -226 161 869 -801 -641 729 -90 263 884 -949 -493 664
3537 664 -1063 2 2220 -160 -1441 3 -845 71 2225 -113 -1376 808 -697 -1073 1676 -5
3553 -5 -1441 1847 -15 -2402 1537 1330 -2412 417 1509 -1596 797 1875 -2428 -1416 1910 8
3569 8 125 1643 -1278 -1410 977 -745 -340 2361 -85 -1535 501 -668 -933 2029 590 -1851 480
3586D80M43j728Q17N6p80J474j20p60O99j300n11K054p57n74K972k081l496K989
3604a23J219k068K416K99m001J522K158k736R58K349k609K44J708k839P19K885
3620B101l078n56L767j989j696K927k132k002M382L54l621J764N95k616J360J474
3636A034j221Q36N0j984P49P72o61J579m36k420K122R50k618R28J331j926J055
3653A40J451k489K20J527j780L73J734j400N57R09l287Q10L527k412r52K953k574
3670f93j656M326j319l123L688N17l738J949J279k315J276R06k486J389J440k340
3686i00M93J060j723J445J490l125K11K515j878o33K471j514o81J735j267o77
3702i78J878n31o93P76j309N81J996k426n95K918j625j398L011j442k226L537
$$ plain form
3586 480 923 -805 12 68 -712 762 642 -118 581 -719 -1230 824 67 -507 2465 384 -3112 -123
3604 -123 1096 -972 1444 1743 -2258 -736 1422 -1314 -356 1993 -616 -372 1336 -1503 -784 2101
3620 2101 -977 -1533 2234 245 -1451 1476 -656 -2658 1724 2078 -1543 221 816 -1800 -440 1034
3636 1034 -187 649 699 -1285 -536 236 -425 1154 718 -1702 420 1370 -1248 -320 1011 -915 140
3653 140 1591 -898 -678 849 -931 -558 1176 -224 333 1242 -2045 -1235 2292 -120 -1072 1881 -693
3670 -693 -2349 1977 658 -2465 1223 1740 -1998 -49 1230 -1085 191 1097 -1389 0 1440 -900
3686 -900 -407 653 -1070 375 1865 -1260 -1049 1466 -412 -1045 1426 -88 -769 966 -301 -978
3702 -978 900 369 -324 452 -857 -276 1720 -706 -1301 1617 -8 -1406 1605 163 -2063 1474
3718A474k87l313K469J128k887J389J182k315J452R65k822J110J927k178P48J199
3734A241k899J016K789k915o35L054j667j424K571r57j215K059p54j558J575K86
3750E67p75P35j195l86K408r76j628K128n95j875K565l5k593K262O33k943J470
3767b33J735k145O72O86k218J324J942k415M6J660k282P34K456k693m70L141k107
3784a67j709L209p21j920K117m88j775K187L36k261Q92M66o79J724n80j935J500
3801A96Nj617K017P50j931J047K1k566J611K364j921j23R43k011P48J471j931
3818i27O92J906k094l68J960k193m1K844k053r96L293j374k758K344j52j268K779
3835A594Rl025J098P81j976J723J109j399Q56j32k784J383K050j520N77R38k215
$$ plain form
3718 1474 1187 -2126 343 1471 -1416 -27 1155 -1160 292 1257 -1565 -455 1472 -706 42 1241
3734 1241 -1658 -642 2147 -768 -1403 1651 -16 -1440 1131 174 -1041 1018 264 -1294 281 567
3750 567 -208 527 -668 -1054 1354 378 -1250 878 283 -1592 973 938 -1655 607 1240 -1703 -233
3767 -233 1502 -643 29 715 -1503 -179 1763 -652 -606 1054 -1228 -494 1962 -731 -1201 1940 -167
3784 -167 -1876 1333 612 -1308 809 321 -1454 733 1069 -1192 -300 166 -513 1211 631 -1304 196
3801 196 201 -1416 601 1351 -580 467 488 -2078 -467 1897 -24 -147 796 -1215 -467 1004 -927
3818 -927 -235 1671 -423 -791 1169 -1024 -1065 1779 -274 -1270 2023 649 -2109 235 83 -1185 1594
3835 1594 1603 -1422 -324 457 -1519 204 1313 -86 770 638 -2146 -763 1287 -233 344 1282 -933
3852i33K41J631j939J9K291p88o08P07j365j61J398j048K80K061j324j121P44
3869H5j685k8L511m80k059J435j085j958K449P84j131J657k70l318J187J407j187
3886f86J552M93k578J323J294k870M76K177j715L79K162k311j113J973j436m03
3902a283K972j45j588J43j563n61L025M84j327N49j123j474J989M55r34J508l24
3919H03k139R41J053j133O12l5j094J663Q58j864k32r1q72K308J352k301J4M23
3937B66k418J055L127j176p06P24k672k29L483k36j518Q95j386p99K739l08j994
3954a153J810l59j850K402O89k417O37L30j878K090K314k543j296N80o63J538
3970B31J897j737j128M30q62R51J622r49n19J00j501O26K575q79j339J35p95O20
$$ plain form
3852 -933 -692 939 -1000 -981 1310 522 -86 621 -744 -905 493 -555 -275 1786 462 -659 85
3869 85 -1600 -1628 1883 1403 -656 779 -306 -2264 185 969 -162 1495 1225 -2093 -906 501 -686
3886 -686 866 1359 -1219 104 1398 -1472 -996 1181 -534 -155 2007 -304 -1417 556 -880 -1283
3902 -1283 1689 1544 -44 99 -1464 -2025 1000 1484 157 706 -417 -1891 98 553 -381 1127 803
3919 803 -1336 -395 658 -475 137 102 -992 671 1529 -335 -567 -658 -1530 778 2130 -171 -157 266
3937 266 -2152 -1097 2030 854 148 872 -1800 -2029 1454 1218 -300 595 -791 -1590 1149 841 -1153
3954 -1153 657 298 -1552 850 1539 -878 -241 89 -1789 301 2615 72 -1224 -644 -1307 231
3970 231 2128 391 -737 -307 -1169 -218 1404 455 -64 36 -1465 -839 1736 857 -482 -347 -1142 -522
3988e22K389j263j702Q45n37K18K174j056j518J332r09j142L074N02k931N74M75
4005Cj505K483J461l337n86J787q93P25J709k133q73J557j037P1K355j170j764
4022a147J023l42k0K197r92k187R28Q39j10P59p10j368Q52M10j82J140o38j419
4040i67O77l1l62K418m19k806P31Q42o00J542L09k581N27J582j401M82J266j913
4058g04J30J520j497L16J876k071j230K551m48q33J778j556k135K755Q37j855
4074e66R82J19j950J175J109j315Q04M82j782L46J189o18K68M4j345Q13J477j014
4092B18m82J27q02J006R67j144P3L56j245N46J362j204L91Q88k408J21K994j252
4110E12j454J764j225j055K992m81k825J889P22k047J767P68k324N95J085j815
$$ plain form
3988 -522 1867 604 -1098 -253 -790 -572 1602 546 -972 360 -549 -1691 1383 1885 -1046 -472 3
4005 3 -1502 981 2442 -895 -1481 306 -587 138 1847 -286 -1159 398 -639 -568 1787 617 -1147
4022 -1147 -124 -466 -486 1711 719 -1468 -540 299 189 948 238 -1130 -278 132 -50 1090 452 -967
4040 -967 -290 -321 -683 1735 1316 -1490 -759 83 -517 1025 1334 -1247 -720 862 -539 -57 1209 -704
4058 -704 -574 946 -551 -235 1641 -430 -1660 891 443 -390 1388 -168 -2303 452 1289 -566
4074 -566 416 535 -1415 -240 869 -446 358 840 -942 -596 593 -25 243 287 -1058 -245 1232 218
4092 218 -264 -137 -939 67 1034 -110 -37 319 -926 -380 982 -222 169 1057 -1351 -1230 1764 512
4110 512 -942 822 -403 -1458 1534 1053 -1772 117 839 -1208 559 1327 -997 -402 683 -1132
4126a132J169J719k140o59J176o93P09J498j927j138J638j85k39J280j061j005
4142i90J153k83k09J363p36j146P16l46L65J699j266j661J017L70m1J224r06j823
4160a500J577K57r66J534n6k119R73N87j115J782O00l084L40K083j161N01J294
4177A527k760k91K856j068j031K032j415j608K287J11j200J588n04k396J479J478
4193A085r42K48j22j663R66J469p48k60P8q44N81N12m65Q03k25j500O78Q16o02
4212a35J043l04k345J162J901j516J48R61k076J72K249j452n12J913j323j394
4228a508K226j68j217J628q28j889K249Q26k044P20M47j527J190R44j787N02R75
4245G39j386J49J128p17Q6O46j414K22J488p84l75P34r67O7J186r22o49J448n35
$$ plain form
4126 -1132 37 1756 -384 -1043 133 -560 149 1647 -280 -1418 220 35 -204 1076 15 -990
4142 -990 163 -120 -329 1034 298 -848 -132 -478 -113 1586 320 -1341 -324 46 5 1229 323 -1500
4160 -1500 77 334 -632 902 846 -1273 -300 287 -828 954 1554 -1530 -1190 893 -268 233 1527
4177 1527 -1233 -1524 1332 264 -767 1265 -150 -1758 529 640 -560 1028 524 -1872 -393 1085
4193 1085 143 391 269 -1394 -428 1041 293 33 111 -733 -152 360 -105 698 473 -1027 -349 467 -135
4212 -135 908 604 -1741 -579 1322 -194 -46 915 -1161 -989 1260 -192 -704 1209 -114 -1508
4228 -1508 718 550 -667 961 133 -1756 493 1319 -725 -5 442 -1085 105 1049 -738 -236 739
4245 739 -647 -498 630 -87 -1 645 -769 -547 941 157 -218 516 -451 -384 802 -120 -769 679 144
4264A44o31Q30n33o6J120r17q29J469m52n50J130p74r82J960o11j747J944O06
4282A111k117J194M19j877J529J379k617J13J667j273J40J558j498m08J442j142
4298c80m94J958o38j245R28l70l15J638m11j644N43N07KP36o41q03O73k77k00
4317d33J349l47j240P89m20o63K153J95k366K12Q98p34J272P79k349O1J370r00
4335c74L43J370j710o13J256o07K66J844j624j899J595L46j72J498j221k203J515
4352c90R38o97R60lj830M61O11k21R76J41j749n0Q97R9P38l89j792L33J728k31
4372E30N7k36j653M12J366k04O32J62k146m61J511J07R89O77k598j087K291M4
4390C93m40J393j428j426J993M13j638J092J05j854J303J572j162r9k99j874J079
$$ plain form
4264 144 -487 343 -190 -256 864 -53 -882 587 135 -415 715 -59 -1041 919 308 -1439 505 1111
4282 1111 -1006 188 607 -1270 259 1638 -979 -866 801 -472 -332 1226 -272 -680 762 -380
4298 -380 -874 1084 446 -799 129 -241 -556 1082 671 -973 -430 77 79 815 174 -629 44 -233 -433
4317 -433 916 569 -671 118 -302 -965 1188 1383 -983 -771 127 -607 665 1444 -905 -844 526 -374
4335 -374 -31 1339 -371 -984 272 -335 -69 1775 151 -1748 -153 193 21 1519 298 -1905 -390
4352 -390 548 -149 811 808 -1022 -561 50 -171 805 946 -803 -853 44 143 881 492 -1300 -967 761 530
4372 530 587 351 -1302 -890 476 272 904 1066 -1080 -1541 -30 77 1066 1743 -855 -1942 349 393
4390 393 -47 1346 -82 -1508 485 898 -740 352 457 -1397 -94 1478 316 217 -82 -1956 -877
4407h77K704n59q88o56j606P36K229j81n54J89j311n15J477L47j36K28j175k92
4425h40J344p8m20l81p06O37K061m49j643j32p46K27K443L04j465N3j067j245
4443b103K297J513j075n1p86j672J750J594j707rQ85j103M17J269j858p18J716
4460C59l20q3J789j163k163N52M45M78K135k57k640o92N71P11J426J71j436k38
4478c55Nk60Q70K62o01J11m0k92J023k98j502J05Q54N73J205o01k616l7J386K37
4498B9J230N17k140j057J103m63Q75J999j534j950J062K07j63J378q57j652J474
4515E8J025j001J67n00j393J472J518q42O4k90j943K01K007N89k7k60k235k81
4533a671J891P81k59l04j247q7J061R5Lnp87j68J061J01J1k3j574l19K106M75
$$ plain form
4407 -877 1827 1268 380 -276 -1882 -1146 1083 902 348 537 -774 -1289 188 535 399 627 -548 -840
4425 -840 504 426 6 -375 -1081 -444 1617 1168 -475 -607 -1353 -1126 1317 1621 156 209 -858 -2103
4443 -2103 194 1707 632 581 -205 -1877 -127 1467 -240 -249 636 -467 -50 1219 -639 -1357 359
4460 359 39 -44 1745 582 -1581 -1029 -584 -106 2029 1772 -868 -1560 -989 -278 1148 1319 -117 -355
4478 -355 -350 -610 260 522 -79 32 -8 -300 723 425 -1077 -972 -118 455 1660 1059 -1557 -1594 -208 29
4498 29 1259 1776 -364 -1421 -318 -781 94 2093 559 -1391 -329 -122 -285 1093 236 -1416 58
4515 58 1083 82 249 -251 -1644 -172 1346 504 568 278 -1665 -1464 543 1132 1105 845 -1390 -1671
4533 -1671 220 1001 742 438 -809 -896 165 260 263 258 -529 -697 364 465 476 453 -1121 -1440 666 1141
4553A141m65l54j600l11K289M59j027K60o52j290J479J329j092J99Qj964R25K065
4571A399p92p95R5j027N15K094q28j332M17l39J57J335j95r64P7l31k91J541M31
4590A167j111n96m82L01J786K91j577m13k07K36J380K45j118j09j75o38J337P79
4608A096r64k27j93p96J267J148j396p30N74j85P64Q84j501p34R81k48K86J094
4626A120p27j352P41k36o4J921k90j939J19N09j47J125J80j656K22P98m54J72
4644D2M60r80K01M49l40M23M19j141k78O20K26O34J68j564m78J070J95J27N71
4663H24r39o42Q05m62J13J244n29j042P29j61l50J203m76j373J058Q44r47K35
4681A34N4j055P88J012j075R2N77j089j00J047k84J34N28j231m39J201ll35N20
$$ plain form
4553 1141 676 322 -1278 -1589 700 1159 132 392 -260 -1550 -71 1258 166 365 373 -1591 -666 1399
4571 1399 607 -188 -93 -1120 -605 1489 661 -671 -254 -593 -436 899 704 -260 -183 -514 -805 736 1167
4590 1167 56 -540 -1022 -721 1065 1356 -221 -634 -841 -605 775 1020 -98 -207 -382 -1020 317 1096
4608 1096 132 -95 -288 -1084 183 1331 -65 -795 -221 -406 358 1242 -259 -993 -12 -260 26 1120
4626 1120 393 -959 -218 -454 -518 1403 1113 -826 -707 -198 -345 780 960 -696 -474 324 -130 42
4644 42 502 -478 -277 172 -168 255 674 -467 -745 -125 101 735 903 -661 -1139 -69 126 253 824
4663 824 -115 -757 48 -414 -301 943 414 -628 101 -60 -410 793 317 -1056 2 846 -101 134
4681 134 188 -867 -79 933 -142 -50 527 -562 -662 385 101 235 763 -468 -907 294 291 -44 476
4700D76p64l12J141l69o53O94j03m40N36j98k91P26l50o98P93J62n01L43k18p88
4720h14R99M35r90L94M09q12M61K43r44O76P03j146p5J003o56r4P03q04j27J240
4740H04p56q42J155k61m84P93m26n24R66L0j117O89L17n89M67O2r30P36M28r18
4760d00L51L27o52L38L39p82N50O32j000j62N28j98L54L63r75n9Q15l46k04P58
4780E77p18k11O76p06o3J179l87r50N25O3k08R19m65j121R64M27p81M43J34q65
4800e68M24N96q20M75N19j201M4P20l24M56L06j193k04J134j67l3K68r06L5Q82
4820D43m40l47P71n43o23Q96J7j88P31q41r54J067O38n45K27l49r59J051O05p90
4840a33K59K02j056M64O46m53L78P1j203L12J134l48j01Nr74L79J277o09m07M54
$$ plain form
4700 476 -288 -600 541 172 -481 213 110 -330 206 8 -283 443 93 -605 188 350 -151 192 -26 -814
4720 -814 185 620 -370 24 433 -379 82 325 -619 57 760 -386 -461 542 -114 -208 495 -309 -436 804
4740 804 48 -794 361 100 -384 409 -17 -541 425 455 -662 27 344 -245 222 284 -646 90 518 -400
4760 -400 -49 278 -374 -36 303 -479 71 703 -297 -459 69 -129 225 588 -387 -446 369 23 -181 577
4780 577 -141 -352 324 -382 -445 734 347 -603 -78 -15 -223 696 231 -890 74 501 -280 163 297 -568
4800 -568 -144 452 -368 107 626 -575 -531 189 -135 321 627 -566 -770 364 197 164 432 -474 -439 443
4820 443 3 -344 427 -116 -739 157 174 -14 717 -124 -1078 -11 627 82 309 -40 -999 52 657 -133
4840 -133 126 328 -728 -264 382 -71 307 378 -825 -513 621 273 172 177 -797 -418 859 250 -157 297
4860B97q09j8J124m28m31N90o32o00J301L79p99P2m49m28J396M63j256L3rk82
4880d86Q08L91r04N9N1p23Q07P80o24k01j15q73Q80J320r65o51K50l86O23R96
4900A037r90o98P68l53k58J352l48r39M05l65k83J628o4j461Q3J91J21R55m6j381
4920f46K06N34l19O52L20j082J5K64l67Q48O18j312m78M12Q9P44O10j417o89Q83
4940a15M8K31O97r78p58Q95j66MJ028n06j144L54L10K25R08p65j324O95O21j65
4960I5N76m49j179O93N70m62O09K48j424J40P68k73O02L94j723k95J585m9k23
4979B03L82j103l80J419q4m77K87m14o19R34L19k66M40p40j104R59P98l6oq32
4999c20p65J020P49n91J36j77r23O73P77o21L44P7j276L33J255l83j43N9j127
$$ plain form
4860 297 -512 -530 594 166 -265 325 -307 -907 394 773 -26 46 -403 -831 565 1028 -228 -195 -204 -486
4880 -486 322 713 -191 -132 -81 -804 3 783 159 -42 -157 -1030 -150 1170 205 -446 -196 -582 41 1037
4900 1037 47 -651 117 -236 -494 858 510 -429 -24 -389 -672 956 892 -569 -486 -295 -174 781 735 -646
4920 -646 -440 94 -225 427 747 -335 -320 -56 -423 425 1043 -269 -747 -335 -246 498 1108 -309 -998 -115
4940 -115 -67 164 861 -117 -875 20 -146 -142 886 380 -764 -410 -100 125 1033 268 -1056 -361 260 95
4960 95 671 222 -957 -264 306 -156 453 701 -723 -583 185 -88 514 908 -815 -1110 475 426 203
4979 203 585 -518 -898 521 437 -40 247 -167 -786 148 467 201 641 -99 -1203 -244 554 518 512 -320
4999 -320 -1085 -65 684 93 229 52 -871 -198 579 -42 302 379 -897 -564 691 308 165 224 -903
5018i03L23J555m90p03J42n76J52J148k74n17N38o63o39J160K77m88K68o76n02
5037h68J348L64j094R5n3l79J029L43j090l5M56o71N36R63p24m13J14p56N53J413
5057A131o24r79J23j05K88Q09l69p10N86k44k59O73j61l84M34l56k46R57j9r66
5077d21J68J26j98J046j34j249K15N76l71N29M57j045K1M27o62M22R49p56m33
5096c33L02k86K72P82r70m39Q98o9j98L43n31l32P24l7k73O51k30q54M07J09k00
5117b64R99l39j071L35O22l63L02J38q27L33O16o30j06N85n30j69N42k83P0M86
5137D46p52l79R47l8j45K36p06k01J022j44m70M58k85m51O73o9m05O77j76r22
5157f84N68M43l70K70p0q18O12P85q35j66M69l43R8M82m84j86O37n47l61P99q3
$$ plain form
5018 -903 -580 975 485 -218 -76 -652 -500 648 374 -143 395 -268 -907 253 530 42 310 -366 -868
5037 -868 480 844 -250 -155 -208 -587 442 785 -305 -340 116 -555 -19 944 220 -193 -79 -835 -282 1131
5057 1131 507 -472 -349 -454 -166 643 274 -436 150 -94 -353 320 159 -225 209 -147 -393 564 545 -421
5077 -421 -253 -127 -325 721 587 -662 -447 129 -242 287 744 -301 -280 147 -515 -93 856 100 -333
5096 -333 -31 -317 -45 737 -233 -672 226 157 -41 302 -229 -561 163 126 -147 504 274 -580 -173 -64 -264
5117 -264 735 396 -675 -340 282 -81 221 359 -468 -135 481 -149 -255 330 -200 -369 173 -110 -40 446
5137 446 -306 -685 262 224 79 315 -391 -592 430 286 -184 274 -11 -462 211 142 -263 414 238 -684
5157 -684 -116 327 -43 227 157 -661 -49 736 -99 -265 204 -139 -41 441 -43 -229 408 -139 -500 299 216
5178B16j74k0l48j18Q91j22n73J81p6j93O43j50o12P20N3p10L84K80l98K70K8
5199A72p30M57O15o95l3M43m90K66M34p17r0P35m96j14M79k02j06L09m07k12Q77
5220D95j36n58L07l00j06P03k89n01N32J10o32L62K53n06M48J11q70M55P36p60
5240a46n5M41m43K05N63p41k25P40l60j23L62k54j55N42m29k62O94j13l92J21
5260c0k26N8N74k12n11L16J63m30N17J7m89N20j07p60M89O30n67K44m5p12M85
5281g6P00q69q0N98k99o9M70n91j16O42m81j29P69k00n18K18k81j31J147j24r03
5302c23L55p4m61O09L75o50L41K60j020K83O86l63M8J32m30K66M04p20k68M94
5322e6J38L46N7p76k53N24k51K58O44l58l70J58q46M20J210m49o75L32m00k70
$$ plain form
5178 216 42 22 -326 -444 447 325 -248 -67 -143 -336 307 157 -455 265 318 -392 -8 272 -126 144 172
5199 172 -558 -101 514 -181 -214 229 -261 5 439 -278 -368 367 -129 -243 236 34 -72 237 -170 -382 495
5220 495 359 -199 108 -192 -298 405 116 -385 147 257 -375 -13 240 -266 182 293 -577 -122 614 -146
5240 -146 -201 240 -203 2 565 -176 -401 339 -21 -144 218 -36 -191 351 -78 -340 354 241 -151 -30
5260 -30 -256 -198 376 164 -347 -31 132 -298 219 236 -253 267 160 -600 -111 519 -48 196 151 -561 -76
5281 -76 624 -245 -325 273 -26 -95 375 -216 -332 310 -171 -300 469 269 -249 -31 -312 -443 704 580 -323
5302 -323 32 -42 -503 106 481 -169 172 432 -588 -305 381 18 66 198 -232 34 438 -282 -550 -56
5322 -56 82 428 485 -291 -544 -20 -271 -13 631 273 -97 61 -785 -365 845 396 -279 53 -347 -617
5342f17J145l67p05R33J08j130O42L31r09N02N80p99L48P06j172l88Q24N1K54
5361C37N40r00p52P20p3j0N78q6m07L9k35j17P47p2m85J43j57J03M35n50l74O63
5383H7J64k98N26n40p41P93J84n23Q72J30j110Q2L38n52J035M48j370n0Q89p19
5403c55J27Q86r53j55J097p30n92J210k16q69P75J62o57O44j83q89M70R32o09
5422I5k9n1n02K09M78j74P8J77m11m5r3J57N17k14m69J84R1j51M69k08q08P64
5444F4N25r27K62N57r45K38R57j100r9J309j083n74J405l04q01R97l80r43J153
5463C11M56j335M49N15q42M72M53p62J37P05o97k62P40k77j90K79k82n9N05j27
5483A89n34J88J20L25l6m77J22K16l50M23J94o91L59L84r82J38J101o88m25Q76
$$ plain form
5342 -617 528 161 -544 389 497 -633 9 340 -569 -67 513 -286 62 768 -404 -792 32 83 337
5361 337 877 -23 -775 -55 -128 -138 440 354 -53 -14 -249 -366 381 309 -176 -33 -190 -87 348 -202 -576 87
5383 87 251 -47 479 -61 -802 -9 175 -348 524 654 -456 -374 -36 -588 447 895 -475 -525 364 -355
5403 -355 -228 658 -295 -450 647 -83 -675 535 319 -550 225 387 -270 374 191 -698 -228 704 95
5422 95 66 15 -487 -278 200 26 104 281 -130 -175 -268 -111 406 192 -277 -93 -2 -153 316 108 -700 64
5444 64 589 -338 -76 481 -464 -226 731 -369 -468 841 -242 -816 589 285 -516 481 101 -842 311
5463 311 767 -568 -119 396 -446 26 479 -283 -146 559 -138 -400 340 63 -127 152 -130 -189 316 189
5483 189 -345 -157 -37 288 252 -225 -103 113 -237 186 380 -311 48 432 -550 -412 689 1 -424 452
5503D52n30n03J288o31j008J395P5j120P50J80j113Q41O74j205L85R83j281k82
5521f50J000m90kR73q69q09J099N6n94N07O2n41K70K63n67L02K19m03K32j45K03
5542A16K13n75j70N27k1P7K30p50k17R17k20m48R01l89q32Q69m3p89J149L0j377
5563h02M58Q93q20J41P72j167j09J450p89p01J089l89o70J061j28o97P58k1j143
5582h14P18P04n77K7J4n54M52L74k40k07Q2q0k3J36o2L17j42l93L73j21n2M85
5604D17l71p33P14M47p44L40R7o86N58P04r41K2Q37q64k89J015n29l46R04o72
5624a20o87J233K05j070N21J23p58P49L76j123M08O34q56M2P94m77j85M51n07
5643b47l1O29l3m68l0PK15K25j87k07J10m3J0J26k18L07K23q19J72N49l03j3K96
$$ plain form
5503 452 -78 -581 707 76 -932 463 538 -582 168 348 -765 76 750 -455 -70 913 -368 -650
5521 -650 350 -140 -142 831 -38 -847 252 308 -286 221 283 -258 12 275 -292 10 229 -174 58 -87 116
5542 116 329 -246 -416 111 90 167 397 -353 -570 347 127 -321 580 191 -641 228 185 -604 545 575 -802
5563 -802 -344 549 -271 -130 642 -525 -634 816 27 -674 415 26 -644 417 289 -408 350 329 -814
5582 -814 -96 608 31 58 72 -482 -30 344 104 -103 -21 -101 -124 12 -50 267 125 -268 105 -16 -68 417
5604 417 46 -687 27 474 -270 70 167 -519 39 743 -198 -176 661 -203 -492 523 -6 -352 552 -120
5624 -120 -807 426 631 -439 82 205 -553 196 572 -551 -143 491 -365 -323 471 -6 -191 260 -247
5643 -247 -278 351 318 -150 -180 -173 42 267 80 -127 -17 -60 -50 76 -142 165 388 -431 -259 290 -13 -26 270
5666B70p31K08Q85n33o97R91k64o34Q16j18q04Q72K03j197P23N26p36K4N26q19
5686d89L21Q24p30m56R34k85n38P49k59m27O14r1o44N86K25m17rJ05k29L41Q7
5707B12l55k4J20O3J71k85l7K92q7l04K01Jo8M06l46m42O93J45o91L81J59n15
5729c10M39K96q63L67O29p42j78Q80o06j83Q38n43o17J065j25q11O61R1o41N25
5749A72R6o88M60L85o62j1M38k98J9L37m81Q3M43j95l95K72l1M5K42m02nM03k15
5772A2q7P0j34L09J53n25M7M37k92rJ81l72J24M70m40k64O37k04m44N08j06k92
5794b21O35j86q23O46L25p03M07K03o43L21M51o52j6O97m26l46N28k76j81O49
5814C89l56n11N15J69l13J24pk32L16J42m79J85J58j09N8Jj85K16J9k95J33J93
$$ plain form
5666 270 -461 -253 632 99 -598 393 129 -505 311 193 -611 261 464 -733 -10 516 -220 -196 330 -489
5686 -489 -168 656 -74 -530 404 119 -419 330 71 -356 258 167 -477 109 334 -83 -92 13 -216 125 212
5707 212 -143 -167 -47 16 187 -98 -135 157 70 -234 -33 -32 -100 306 -40 -482 211 356 -335 46 205 -310
5729 -310 129 425 -438 -71 558 -184 -362 518 -88 -271 567 24 -593 472 347 -464 197 288 -353 172
5749 172 268 -420 40 425 -237 -248 190 -108 -89 248 -233 -150 293 98 -297 -25 -56 -11 231 -171 -176 227 12
5772 12 -75 -5 -139 170 323 -202 -155 282 -10 -19 162 -210 -86 384 -56 -320 317 113 -331 177 71 -221
5794 -221 414 228 -595 51 376 -327 80 283 -360 -39 412 -240 -256 441 15 -331 197 -79 -260 389
5814 389 33 -478 37 206 -107 17 10 -222 94 236 -243 -58 100 -9 49 50 -135 81 100 -195 -62 131
5836A31N0qk65k87M17K59k51n2J89l62N9J89l38L88L80n38k52O18l54p2K92m34
5858b41n1P29k46o15M34k1l17O38j69m04M24J44p64J92O49m40M6K60o61J2P15
5879C14l89j75M84j94k10J98r6k07M91%l58J79O1k08M6p5R2K20M4l53o9k9J10
5902a24M07j63o8K45j96n57M75J03j65M28j12q58M72M36n81K71M09m82Q3L22o45
5923c00j36P30k38j56M07j61m07L01j68k63P11J59o69J57j46k04M47L18n69L28
5943A41O1m81J72P7j42M06J19m42m8L75l91r1L26r1L02j8n09j90M01N6J24J52
5965C09l40n1J37l30j15O67M8k90J33l73j45N70j22m29N55L7m51K38j7m69O13
5986A75J77o23J40N42o00RK38k57K07N81p01k88M21k0l5L20l50o0L10j55m46M96
$$ plain form
5836 131 181 173 -92 -379 38 297 46 -6 183 -179 -120 69 -269 119 499 -39 -291 327 -27 -99 193 -241
5858 -241 -292 437 191 -424 10 -11 -328 310 141 -263 161 305 -459 -267 382 -58 -12 248 -413 -401 314
5879 314 -75 -250 234 40 -170 28 -68 -275 216 216 -142 37 98 -110 -64 -139 -47 173 217 -136 -205 -234 -124
5902 -124 283 120 52 297 101 -456 19 122 -43 385 273 -585 -113 323 -258 13 422 -60 23 345 -300
5923 -300 -436 294 56 -100 307 146 -261 40 -128 -391 320 479 -190 -33 -179 -383 64 382 -187 141
5943 141 202 -279 -107 -30 -172 234 353 -89 -137 238 -153 -244 82 -9 293 275 -234 -424 -23 33 157 309
5965 309 -31 -82 55 -275 -390 277 325 35 168 -205 -350 220 98 -331 224 261 -190 48 31 -438 175
5986 175 352 -271 -131 411 -189 -180 58 -199 8 589 -112 -400 21 1 -34 286 -64 -124 186 31 -415 81
6008H1J40k35J32k99qM71j97k78K33J11j71K17j36l50L83K17n83L08K23m54K02
6029GJ18n24L77M57n59j41L39j54M6K70l21j79N97l31l44L98J9j32K91k91l00
6050c57N54j31k36K56o7j78K94j31l85N68J33o50L41M9k65M47J11o24K51M12n61
6071a69qK63k78J99L45m96j31M73k56j43M41k17p4M24n16l52O64L6k76L93m15
6092i3k56N62j90l56O40o8n49K67J25l25L34K48o77K08N81l86j66O6l13L72L05
6113C29l74rJ37k95j7L91j08R5K56p55q4N45r8J62J63m31k93P00k70l52N04j07
6135H9l35M72j43k98M51k04n02M36M67m33R9j07m32L21O27k96k77J44l17R8M13
6156B73k59J64J31n24j45L96N1J58K2o51J73O32l71j33K44l96o5N53j20l95M97
$$ plain form
6008 81 221 -14 118 -181 -189 282 85 -193 40 151 -20 197 61 -289 94 311 -272 36 259 -195 7
6029 7 125 -399 -22 435 -124 -265 74 -80 -34 236 -85 -264 333 2 -342 56 75 -57 234 -57 -357
6050 -357 197 66 -170 86 19 -159 135 4 -381 187 320 -330 11 60 -205 242 353 -271 -20 392 -169
6071 -169 -177 86 -192 7 352 -144 -275 198 -58 -201 240 23 -51 373 -143 -495 169 205 -71 322 -93
6092 -93 -349 213 23 -333 307 239 -310 -43 82 -243 91 339 -338 -130 451 65 -101 -35 -348 24 329
6113 329 -45 -54 83 -212 -229 162 54 149 405 -350 -434 111 13 175 338 -93 -386 314 44 -308 196 89
6135 89 -246 226 83 -215 236 32 -470 -34 433 0 99 -8 -440 -119 508 212 -65 79 -238 -140 273
6156 273 14 178 309 -215 -360 36 87 245 267 -384 -211 421 50 -83 161 -235 -300 253 133 -262 235
6177B35k95m97P17K85m13J98l60m80N90N01m58N4Rn55M29L90m01L0K01m43L4N14
6199B85k16p3K30o23J51N65Rl55n0k17M7O23j04l22J77k57j79M56M0m2J24m91
6221b22k89N41M24l11j28l26j67P16Q1m68K34j40l87M12K63l86K54J28p58K36
6241b93P29k97j00J9m36K38O77m05n74N61k63j59O81r6l75J27o8l73L56L99j86
6262A62p2k76j18M43J95k96j27K8o9L42j78j53K30mm71L47K08j32L3j24m85N87
6284G0M22n69k9J69l31J51N20m48j41L73l14j02M01m6k57L05l02l26P05m7m36
6305b32K08J08k96L80L7m15K75J02n09K81J71j36P9O1n12L11L21k35QM8k66J35
6327g6L30k99q5L08k05j11K34j51O0L25m55j75M87j49r6K22k90KL27j93k93N37
$$ plain form
6177 235 -60 -557 160 445 32 230 -130 -610 -20 481 23 77 86 -469 -40 350 -51 -21 180 -263 -229 285
6199 285 69 -4 226 -397 -246 319 328 -27 -77 -294 -247 376 272 -50 127 -130 -309 147 187 145 269 -222
6221 -222 -511 30 454 143 15 -311 -478 238 319 -149 85 -55 -442 -30 233 -153 101 229 -529 -293
6241 -293 436 139 39 58 -378 -140 537 132 -442 119 -144 -303 378 282 -93 34 -34 -407 -51 348 162
6262 162 90 -186 -304 139 334 38 -89 -61 -130 212 34 -119 111 107 -364 -17 191 59 92 -32 -517 70
6284 70 492 -77 -106 63 -268 -117 403 -45 -186 187 -127 -229 172 126 -131 174 -128 -454 251 204 -232
6305 -232 -24 84 -212 168 205 -210 65 167 -342 -61 110 -26 53 114 -398 -87 234 -1 7 55 -211 -76
6327 -76 254 -45 -130 178 -27 -138 96 -55 5 330 -125 -300 187 38 -58 164 -126 -124 203 10 -283 254
6349B54j1m91J77J29k14L11J77o31J76L50l84K18J88m27R3L21m40Q2L68j11k70
6370a35N3O0J3L29k74k27J37P4J64n4j95q7J27j04N5K58M2m21J79k55Q7N96j51
6393B71n71J18O4j4M16P6o53K05J54k29J92K93k87k63J53j59K97L64m04l64K05
6414a36J88J18K90m56m35N03o5j52M10q8m52N6J43r8N94j02n05j70J05L14K52
6435C14j7n80lL00nK11K0l09j74K2J02L30K52l45n17Q3J57M66J27m40n01M62L9
6458fK0L51j86m95J46Q1lM90m4p10K0K22Q9N27j41o28j73N49N5N1J13m39l11K16
6482b06J94R0L25l51m97K32K28K11K54n31m43L19K98K08n6k38l14J48J38K7L15
6503C51j31n48q5J91L17M23k34p77j9O14J08J52qn56k37M62J48L3J11m59l55K63
$$ plain form
6349 254 243 -248 -71 58 -156 155 332 -299 -123 227 -157 61 249 -178 -85 236 -204 -122 246 135 -135
6370 -135 -82 -22 -9 320 46 -181 -44 30 194 140 -55 -142 -15 -119 -64 194 236 -185 -6 -261 -174 422 271
6393 271 -300 -182 -118 -132 284 360 -293 -88 66 -163 29 322 35 -228 -75 -234 63 427 23 -341 -136
6414 -136 52 170 460 4 -431 72 7 -145 265 177 -275 -219 -76 -174 420 318 -187 -357 -252 62 314
6435 314 297 -283 -286 14 9 220 240 -69 -243 -221 -119 211 463 118 -399 -316 -159 307 434 -6 -507 -45 -6
6458 -6 14 365 179 -316 -170 -89 -92 398 354 -356 -336 -114 -25 502 361 -267 -440 109 164 215 328 -111 -422 -206
6482 -206 -12 78 403 52 -445 -213 15 226 480 -51 -494 -175 123 331 275 37 -277 -129 9 36 351
6503 351 220 -328 -413 -222 95 518 284 -493 -512 102 210 362 354 -202 -439 23 171 204 315 -144 -499 -236
6525b36J98M16O0o22l55M05L44R2o2n26k23M87K39pkl5m67m4L41J81K08j93o99
6548e00M9N82M5O4j08n17J09L78p2jK01l58j28K64N9oK21m06l78M81K67J5o2k94
6572i5l78N23K52k10M3q5l96K49K21k19L20j6m76j60N31L5j5q4l14J01L86q6j43
6595a6K0l3n4J26k5L3Q0k60j46L48m5L7N1j69k67M87l7j94J59p3k20L89j43l29
6619b81L92Q9m01J24K54l64K68K24o02Q6M97k72j92K91j34j45L30k40j20M01o1
6640A44k53N5O4j26L70j22m02L55j0j98J21J18j86J8R5l79L18K04j0k15j91J00
6662a30K44J24l09J4P8j94K01Q3k32K38L3n13K24M71k59j93J17l26J65O29k18
6683B47l85K69k45q8M82q0l28K13k29k61N27L27l64j96n8k14N30L04l79k55K9
$$ plain form
6525 -236 -38 378 438 -184 -539 -134 210 302 240 -286 -509 -22 217 210 208 173 -294 -338 3 184 392 199 -500
6548 -500 -451 131 176 240 132 -385 -276 102 30 29 230 -128 -256 8 67 61 282 -124 -502 -21 246 261 199 -95
6572 -95 -473 50 302 92 135 50 -346 -97 124 -95 225 209 -267 -427 104 139 124 40 -274 -173 213 127 -16
6595 -16 4 -29 -83 43 18 51 131 -129 -275 73 28 65 116 -53 -320 167 130 -64 95 22 -198 191 48 -281
6619 -281 111 200 -201 -77 177 -187 81 305 -297 -211 286 14 -178 113 -21 -166 164 -76 -196 205 144
6640 144 -109 -54 10 -116 254 132 -270 85 75 -123 -2 116 -70 -52 43 -336 -18 186 176 -39 -230 -130
6662 -130 114 238 -71 -57 21 -173 28 111 -121 117 150 -363 -139 332 73 -120 -3 -329 -164 465 247
6683 247 -138 131 -114 -202 280 200 -128 85 -144 -405 122 449 85 -111 -169 -383 147 451 72 -183 -154
6704a54j63M11J57j79r3l2l16K28N38r6l43j35l83L60P65j92m23j12k06K28L71
6725B31j12j64O9l60k6N82O4k97n1k69q1P21J49n94o0M9j77N89K39n49j00J59
6747A2l35K76N87l06l55j6k44L30O59k45n88M8j9K51M14j87m22j82J27J32L82
6768C19j91j16j65k76K09O93j9n33j56k30K18P15K1o16q6J1k09O03K62l57j27
6789c0j34l52M96O32m75k67l7j56L38M55l54n07L03j5J34L63k29m74Q1O9j28M99
6811B12K60n51k09J5P9N39rl41j62J0R4L71j40l52K49j37r2K48Q9j68p3j30LM99
6835C04K5l95j74L2j44N87K54n57JK10m36N3O06j33k90J45l59r9N68K7l27J59
6857E7k4r4J80M2m06J96K05k48J59J27j80q6R7j04J26K14j09l02K7Q5K10L9k10
$$ plain form
6704 -154 -317 94 251 72 -21 -53 -369 -141 397 301 -42 -177 -560 -200 565 373 -50 -162 -368 -140 231
6725 231 119 -45 24 -336 -362 220 284 -13 -64 -333 -414 307 456 -138 -198 -149 -326 263 502 -47 -147 12
6747 12 -323 -47 540 234 -121 -137 -381 -51 608 363 -225 -177 -196 55 469 282 -140 -322 -195 -63 319
6768 319 128 12 -153 -429 -220 473 454 -79 -235 -465 -247 468 489 -127 -213 -202 -411 192 454 97 -30
6789 -30 -164 -516 -20 612 137 -130 -167 -323 15 470 116 -391 -88 -103 31 394 165 -309 -228 -159 -287 212
6811 212 472 -79 -288 -273 -194 345 336 -5 -167 -157 -63 308 168 -184 65 -72 -164 84 173 5 -68 -198 -195 304
6835 304 329 -66 -240 -208 -352 235 489 -68 -67 143 -293 -240 366 233 -57 88 -271 -370 198 225 -102 57
6857 57 33 -61 119 161 -245 -49 156 -92 67 194 14 -72 25 -79 47 261 152 -150 -123 -38 172 211 1
6880AJ4Q4k10R3P3j36J80J70m91R4M17k93l2K03l97R5M11j94k34K54o6l14L27
6903D9K6j89K44r5m77L54M22l49nj1k56K00L94l59m8J77j51j38K29J30o0J26m56
6926b43m6L87Q0J3m7l75M7L14P3j41k6n4j50K49j05N5K72l21k10K21J37p5K11
6949B66l30k49L93J31k59J02K0m33K75K10k47K87O7n54k1M71L5j10R3l61j67M14
6971C3J63k11K04j73k90K68R8j01K18j88l65K31K22N2q6j88k36K77L01m7j71L3
6993D4l55K47Q7MK54j74m38N7L15L2J89k0n14L4L64l4j56J92k64q2L81k02k9K77
7017B09k00l29L38J02j5J04k92l39M36K51r7Rk60k93K36K85j46O7J74l86j77M17
7039I4kJ3n1k41k0K12J74k12K9j70l1K34J15j57J17j28j72R1J28R9O8l38j83K28
$$ plain form
6880 1 15 99 -111 -18 55 -81 99 269 -222 -128 289 -4 -36 167 -230 -135 276 82 -152 102 36 -278 49
6903 49 75 -114 130 35 -442 -88 334 -15 -20 -31 -287 -87 307 -52 -100 77 -74 -212 17 147 87 213 -243
6926 -243 -289 98 178 191 144 -231 -184 130 203 62 36 -18 -168 81 -24 31 303 -18 -228 -7 130 55 266
6949 266 -64 -313 80 211 -48 54 74 -359 -84 126 -121 166 233 -321 -342 129 164 54 147 -214 -381 33
6971 33 196 -15 189 16 -274 -6 92 -9 209 21 -344 -113 109 161 75 -113 -349 -72 229 182 11 44
6993 44 -311 -64 23 27 281 107 -331 -274 41 73 262 242 -272 -238 126 92 -64 128 -136 -218 163 -39 -68 209
7017 209 9 -320 18 120 105 209 -83 -422 14 265 168 177 -83 -376 -140 145 -1 66 240 -146 -323 94
7039 94 92 105 54 -187 -207 5 179 -33 -4 -174 -205 29 144 -13 104 -24 -196 -105 23 122 190 -148 -331 -103
7063a03J24J24J63l69k54M15oj40K02M0l78P9J66j58K07J06m67o0M04kj3Nl00
7086b15r8L21J04j01J5J9l89L81J96j64J33p0l94P2L11J7J5k02k15J93K24j8j07
7109B8L0j96K0J41p2J44P3l54o6J70K01J64k54k20n3M02m9Pj28j62m1K04l0Q0
7133C9J78k28k46K40Q7MK39l06k65K25K63j69j4M3k58K36M9j55J2K31k72k58L49
7156B4J71p0l9k40m7K83J78k47m5o1P2O3L6j8O7q6j54O9M8J27m6j65j87L62j1
7181H4o3P8j45k19L89J4k49J78J3k29N6J59k9O7O0k86j8L02j09j70J48j23L0K25
7205A63o5k35J50J98l20M8J49j10J17O9k22J7J06l8q7J66j77k2J64j14j25K44
7227G6L1k16J4K7J54J0j25p3O9k1Q9Q7j06Q7l3j32KK18l6j56J29k63R2L61j02
$$ plain form
7063 -103 21 145 308 -61 -315 100 94 -46 156 196 -182 -103 63 -95 112 218 -249 -309 95 93 80 85 -215
7086 -215 -313 8 112 11 26 45 -344 37 233 69 202 132 -262 -190 121 138 153 -49 -264 -71 153 135 28
7109 28 58 -138 -118 23 -49 95 168 -186 -252 -82 119 283 29 -191 -244 158 109 116 -12 -174 -215 -11 -41 39
7133 39 217 -11 -257 -17 70 74 313 7 -258 -33 230 61 47 90 -168 68 117 -38 -26 205 -67 -325 24
7156 24 195 125 86 -154 -201 82 260 13 -32 -93 -21 42 78 60 127 41 -113 -44 4 131 85 -80 -267 95 84
7181 84 21 99 -46 -265 124 138 -111 67 80 -149 -93 66 37 104 164 -122 -140 162 53 -117 31 -92 -62 163
7205 163 98 -137 13 211 -109 -61 88 -22 95 164 -58 -41 65 27 -60 106 -71 -93 71 -43 -168 76
7227 76 107 -109 -95 -68 86 96 -29 -102 -33 -54 35 122 16 103 70 -62 -60 158 122 -34 95 -168 -76 285 183
7252A83l52K4K95k20J49J48l45L1J61l06K11K79j60k33M2K9P9K56j05l34l6J64
7274d0K0K22j63j41M2M6p5J94J00k45j39RJ12K40J10l54j34R4J62J62n8l59J64
7297c1J1k7K36J9l22K9Qn8K19K18l21k84J94P3J19K29l00l46L13krK67j84l24
7321b73J38J23j15L55P2n33pK35J29K40r5m53j3L08kn5K1k6k07Q5m8K42P9k65
7345f5j74J69J13J89J9l96j16K62P6J05Kl08m6J06O3l8L74l50l16K47J50l6K91
7368C21k27m60K31L14o1m3Q0l48J32K50j76J3J56l70k1K42N4K4Q7k60j89J60K65
7391A74j39O7j56j37K06J02j03m1P9j96O5K5J44L6j80k35M06K9j9k4k67j04K46
7414b2K34j31m9j42k0R7K47l16J74L2l05P4K01L0n8K8k14M1K74q5k55J58mN6Q3
$$ plain form
7252 183 -169 -145 150 -70 79 227 -118 -87 74 -232 -21 258 98 -135 -93 -64 15 271 166 -168 -204 -40
7274 -40 -20 202 39 -102 -60 -14 -89 105 205 -40 -179 -170 -58 182 292 -62 -196 -102 60 222 164 -195 -31
7297 -31 -20 -47 189 208 -114 -85 -77 -135 84 302 -19 -303 -109 -36 83 312 12 -334 -21 -23 -32 235 51 -273
7321 -273 -135 -12 -127 228 300 -233 -240 -5 124 364 269 -184 -197 111 109 54 75 49 -158 -73 -121 121 200 -65
7345 -65 -239 -70 43 232 251 -145 -261 1 77 182 184 -124 -170 -64 -1 -39 335 -15 -331 -84 66 30 321
7368 321 94 -366 -135 179 118 75 155 -193 -61 189 13 26 182 -188 -209 33 87 111 198 -62 -251 -91 174
7391 174 35 102 -54 -191 15 117 14 -27 52 -144 -79 -54 90 126 -54 -289 117 146 127 103 -164 -268 -22
7414 -22 212 81 32 -110 -130 -33 214 -102 72 104 -201 -127 74 104 46 74 -140 -99 175 90 -165 -7 -11 45 128
7439A28j30j45J59p8qJ87j2j55J28k33L6J81R0k33k2P7m2K21o7k63L9L43k38J13
7463G6j7j85KJ84j00J15J52k81j43J93l8J24J83l65q6J34J21j2J1m3q8J43o3o8
7487e1J71l4j35n4l3J86Q0p4k85J83J80p6m8j28J2K3K00o7M4m7j83OJ40l8J60
7512A32Ll36rK63J9R2l7l68L3L10m0MP0j91m9K00m1o1J37r7k35K46K20j37p0j07
7538d9j99K49K54j76Rj22n3R4K8J50r6q0j77R4J08N7Q5j82k37K14K57k31J07j83
7562g9n7J82K07l47L0J12j71M8K26j0k4K6l58j9M20L0k07J7j20o5J30K04j56q8
7586f9J11n0q3J11N2q9L1r6l3K62K3k50j5J7J05J9M1n2j07j9J38k2o9J69j46j33
7612a54J12J71nn8l2q5o0K78j31j21J46j4j30L03j55k56J99J12k17J05K62l80
$$ plain form
7439 128 -2 -147 12 -66 -74 113 101 -54 74 -159 -123 58 148 -85 -107 -30 -72 149 82 -181 -142 201 -37 76
7463 76 59 -126 -124 60 -40 75 227 -54 -197 -4 -42 82 265 -100 -186 -52 69 57 68 25 -63 80 17 -51
7487 -51 120 86 -49 -103 -136 50 130 56 -229 -46 134 58 10 -118 -106 -83 117 50 94 47 -136 -130 10 -28 132
7512 132 135 -201 -210 53 72 164 127 -241 -208 102 62 66 136 -55 -104 96 55 -6 131 34 -201 45 265 128 58 -49
7538 -49 -248 1 255 79 88 -34 -87 7 35 185 89 9 -168 -74 34 91 176 -6 -243 -29 228 -3 104 -79
7562 -79 -136 46 253 -94 -64 48 -123 -75 151 141 117 143 -215 -234 186 216 9 26 -94 -159 -29 175 19 -69
7586 -69 42 -8 -91 20 72 -17 14 -82 -115 147 170 -80 -95 -78 27 46 87 35 -72 -91 47 25 -44 125 -21 -154
7612 -154 -42 129 124 66 34 -51 -111 167 36 -85 61 47 -83 220 65 -191 8 120 -97 8 270 -110
7634a10P5K2r2J30K31k14j67J86j36j2J71k9p2J52j16p6O6O8q8j4l0N5j2L4Rl7
7660fn6n3J88j17j51K00L7j64J55N0j43J69j07j76J81J47k79J42j21Q1P1M7k42
7683a47P5K23j52j0K6j5p2K50r9k18K11k8j26J19o0m5M5J13j24P8l3j00K2J37
7707G0o3J2k8j32O2J66r8j8n0K3J76r8j59K04o1l2R4m9O5P7j9j93N8J11j05K3
7733C6P7j49p5K93j81k75L97o0k03K17j6j64J09N4j90J56Q3r3n0LL5L9J15j65
7757gp7J12j6r2P6l3q8J20qM5J02L9j55pq0J48p8R9j19l6Q4k9L8q9MJ28j21oJ26
7786H0K1j64J24n3q8K61Ql12L0M9K6J03J20k75J02k4J2j16K16q5j48J08P1k06
7810a40K59k2l68K32L0K0P3j06m6N5J06j41L5J20j11O8o6j2k5J05j06o5R1P1k5
$$ plain form
7634 -110 -35 -13 -105 25 256 42 -125 61 -75 -87 84 55 -17 135 19 -57 9 77 -11 -25 -55 0 -12 22 31 -6
7660 -6 -62 -115 73 -44 -195 5 42 -122 33 83 -60 109 2 -174 7 154 -125 17 -104 -23 48 95 -147
7683 -147 -72 151 -1 -11 15 0 -72 178 79 -139 72 44 -82 37 -23 -68 -23 90 -34 44 11 -89 -67 70
7707 70 7 19 -9 -141 -79 87 -11 -29 -79 -56 120 22 -137 67 6 -26 68 19 84 161 142 -51 7 118 13 36
7733 36 113 -36 -111 182 1 -274 123 63 -140 77 61 -103 6 60 -130 26 109 16 -34 -31 4 43 158 -7
7757 -7 -84 28 12 -80 -4 -37 -125 -5 -13 32 134 173 18 11 -69 79 1 100 -19 -55 29 0 38 -51 -47 81 -40 -46 80
7786 80 101 -63 61 8 -80 181 189 -123 -93 -44 -18 85 205 -70 32 8 20 -96 120 35 -113 -5 66 -140
7810 -140 119 97 -271 -39 -9 11 84 -22 -68 -13 93 -48 -13 107 -4 64 -2 -14 -39 66 -40 -105 -14 57 32
7835C2jo7j0K20j19j17M9Pm1J35j80K4K36j73m6J26J7N8Mj76j28J88J49j80l2
7860b5J0q5J18J63m18K33K31l54N6K27j14n0Q1l13J04K69o6j44Ln7R8K25j81j14
7884a03L1J78k22P7J01p5K5l9MlL2o7P8k6q3J70p2r4J13n8K7Q2p7n0O9K8q3R0
7912E3J33j72j18J4l8J53J71j65k16J73K1rJ31m4j88Q2M8j20J61k2k17J06R5j03
7936g1J82j8j81l1J37L7J10r3j25mJ77j71N5rJ7q6R4j06J33P6r8j00Q0R6l0k0
7962E1j25MJ08l7j2RK1j00J36m6l0O1L5k23J30J17k1O0n4j83Q5J83k64K11n0n6
7988A0j88K58k3j62L9J7j14L06j2j86J52j26n1R8Q5o1n1l2p1J81L6j13o2J15j41
8013i6N3J27j05L6P8k56J66J45j29M0q4o6J23J25k76k1K18m8n7N5P6j79J82j43
$$ plain form
7835 32 31 -36 -46 174 55 -62 -13 -6 -47 88 -92 -68 168 -5 -51 75 92 150 154 -22 -150 38 187 7 -25
7860 -25 -15 -100 18 181 -237 -4 227 -127 -71 156 42 -8 73 -240 -136 133 67 -77 -74 -131 -33 192 11 -103
7884 -103 -72 106 -116 -39 62 -13 12 -27 -23 -26 6 -61 17 -9 -92 78 6 -88 25 -33 -6 76 -1 -51 18 46 -37 53
7912 53 186 14 -104 -90 -128 25 196 31 -185 -12 9 0 131 87 -101 -19 29 -91 70 48 -169 -63 32 -71
7936 -71 111 93 -88 -119 18 55 165 72 -53 -57 120 -51 4 -5 12 -74 20 -86 47 123 25 -75 5 101 71 51
7962 51 -74 -70 38 1 -11 -2 19 -81 55 9 -21 40 75 -148 -18 99 78 138 84 -99 -14 169 -95 116 66 10
7988 10 -178 80 57 -105 -66 -49 -163 143 131 -55 97 -29 -80 18 103 42 -9 -41 -112 69 105 -8 -70 45 -96
8013 -96 -43 84 -21 15 93 -163 3 148 19 59 -25 -91 32 157 -119 -140 78 30 -27 28 104 -75 107 -36
8037c6O7J58m9k29O2j07J02J49j28mm4J15j44J10P5o9L2k4o8m5J41o4mL2p4J17
8063G1N9k22j06K15M6r5MK3N6J9q8M7qJ7j16J57j74M0J44n1j16K6M5N2n2M9j53
8090a11J48j1j58R0M0l1l9O8L7j8P9r2ljR1L5n6j68P1J55j61O9o6J36j47N2J7
8117B6m0O1J5r0J30m2o1N0J8k12K28j06o6L3PJ9N2j2j28J64K6q5p6J56mm9M1j7
8145C8j08J28j00p4Q0jR7RK7j56L9O7j50l7K40L5R5j87q5J76j08pL7j01J01j3
8171D2p6l4R0J4j18N6Q3r4P8k7j0j09R3P3K0j94M3P5k4m2
$$ plain form
8037 -36 31 189 140 -89 -27 -134 -32 117 -11 -15 -59 56 -88 22 97 28 60 36 -32 -77 64 0 -4 28 -46 71
8063 71 130 -92 -198 17 63 -32 -28 -5 51 70 -18 29 21 38 -78 79 -95 -55 89 38 -78 -52 -7 45 -7 42 -111
8090 -111 37 26 -132 -42 -2 -33 -72 -4 33 15 94 2 -1 -2 89 124 68 -100 -29 126 -35 34 -32 104 -43 9 26
8117 26 -14 47 62 -28 102 60 -1 49 67 -145 83 -23 -89 -56 -49 -30 22 10 -118 46 72 -13 -89 67 63 14 55 38
8145 38 -70 58 -42 -116 -36 -37 60 69 96 -60 -21 46 -104 -141 99 134 229 42 -43 133 25 18 55 -46 55 42
8171 42 -34 -68 22 36 -82 -26 57 -37 41 14 4 -105 -12 61 81 -113 -70 5 -19 -61
8191f1
$$ Imaginary data points
##PAGE= N=2
##DATA TABLE= (X++(I..I)), XYDATA
0@%%%%%%%%Qj6Q%Qj6J6j6J6j8K3k9L2l6M1m2M9n7O2o7P2p9Q9r8J06j16J27j40
36g3J54j66J79k01K21k40K66k97L34l75M21m77N52o47P68r28J143j452J912k625
56a531L813o016J0785k4480J21735L81341o23816m2641M83246m85874j47577O38248
68C07233j50218l72864L19458m7662k78064K85907P7237k43548J17142K0060j50495
79a15814J99665M8233k61675O7929J19681j33137R3100J65386j80694j60040J01702
90e5664R3437k5278O316R8963p5393k49803J20985K75747k02140r1265K95401
101A91306j98714k72923M14684O9310m26570K05781K08896l65076J22247L09709
111B58650l40178p9074K78613j90394m642L17945k38091j77364K68589j61884
$$ plain form
0 0 0 0 0 0 0 0 0 0 8 -8 0 0 8 -8 8 -8 8 -10 13 -16 16 -20 21 -21 28 -29 33 -34 38 -41 48 -50 56 -60 67 -73
36 -73 81 -85 94 -107 114 -126 140 -157 177 -198 223 -254 298 -349 419 -509 634 -818 1094 -1531
56 -1531 2282 -3734 7051 -17429 104306 485647 -138169 -180810 302436 -183438 -331015 307233
68 307233 157015 -215849 103609 55947 -222117 63790 141027 -102521 14621 34681 -115814
79 -115814 83851 132084 -129591 -61662 58019 -75118 17982 183368 2674 -157366 -55664
90 -55664 37773 12495 18811 117774 42381 -207422 -86437 189310 -12830 -104095 191306
101 191306 -7408 -280331 134353 203663 -222907 -17126 191770 -173306 -51059 258650
111 258650 -81528 -160602 118011 -72383 -77025 240920 2829 -174535 94054 -67830
121f7830j03455M28275j26803l79487L05812M6955l55235L00077K32145m23247
131a42793J4164L02235k32846p8209K90136r5994j95167J43948O4677q3745R664
142c930J0351k3977j5334J6731Q8996j7817j26453M0622N4421p2063P1262O8512
154I1321j26041r07N1501q3419R0574Q6293j81896L2382J40344j90688K8567K49487
166A87518k28626j37234L25169r1939k39219K96059J8890l39245J93295J86682
176A71350k73874O1290J99559k33017m2118K19305r2937o0492J29355r8960n9656
187h0195J40045n2299n5621J15089o7834q2308J33636j1755j05711Q9746K2018
198D4811j02368M5599O3756n1403k4208J2770J6823R593l0791K5706K8715r6608
$$ plain form
121 -67830 -171285 256990 130187 -249300 56512 103467 -251768 48309 280454 -142793
131 -142793 -128629 173606 -59240 -137449 152687 56693 -138474 5474 70151 -13594 -3930
142 -3930 6421 -17556 -32890 -16159 72837 55020 -71433 -30811 23610 -48453 22809 91321
154 91321 -34720 -35627 15874 -67545 23029 109322 -72574 -40192 100152 -90536 -61969 187518
166 187518 -41108 -178342 146827 54888 -184331 111728 130618 -208627 -15332 171350
176 171350 -102524 -41234 158325 -74692 -116810 102495 9558 -50934 78421 -20539 -80195
187 -80195 59850 7551 -48070 67019 -815 -83123 50513 38758 -66953 22793 44811
198 44811 -57557 -11958 51798 395 -23813 -11043 5780 15373 -15418 10288 39003 -57605
210e7605J5066J31206q5419p5841J35037m7779j19253J50738L3650j52214P5955
221C541N0189j35758P4968R7456j28141J5414P4325j16403M2005J22448j35174
232c5130k3428J39150j08379n1262J76192o8562j32275J42899Q987j32832J08981
243B4341O1134j46653J5874R1429n5942J87N4131n2716l0796L6897R428J1043
255A8357k952l2006R065L846j4845M1495R096n4229O160J5855j6589M1530R823
268C4606o2402J2475J9429l2443N5660K6911r7432J4700O5238p2239J8202J01079
280H3784r0249o4622J02118k5032n4841J06216j2365j16830N8201M8680o2513
291b7453M2282L2316q6359R982N6553l8993J3272L9929o2072j5010N3939k0090
$$ plain form
210 -57605 -42539 88667 3248 -72593 62444 14665 -104588 46150 79800 -72414 3541
221 3541 53730 -82028 -7060 90396 -37745 -22331 51994 -64409 -22404 100044 -35130
232 -35130 -58558 80592 -27787 -79049 97143 28581 -103694 39205 48192 -84640 24341
243 24341 85475 -61178 -45304 46125 -9817 -9630 44501 -8215 -39011 -2114 7314 18357
255 18357 15405 -16601 -7536 -3690 -18535 22960 32056 -22173 -16013 -158 -16747 24783 34606
268 34606 -27796 -15321 4108 -28335 27325 54236 -43196 -28496 36742 -35497 -17295 83784
280 83784 -6465 -71087 31031 5999 -48842 57374 45009 -71821 -13620 35060 -27453
291 -27453 14829 47145 -39214 -29232 27321 -11672 1600 41529 -20543 -35553 18386 -1704
303a704l144M3901m3200m2291M9672J7095k0831J4649r181l2581J2886K7492N452
316A8215r321j6940k191J252l599L0517J6549m6886j4560K8438j0919J1767L9907
329D2229m1044m0912L9432M074j4282M1877j2310n4110K6192J7241k5744L8493
341B1136J5072o5501K687M1190k2596J3495L4306n3839k7131N1827m21j6695L1737
354B5267j7009m2449K4571K1549j0986J5428j641l7434L96K6689P692M092q006
367H159k5200k598J9499J2519K707j0444j5962k402O588J3955J3600j2626k0576
380a2781q49K687J3233K6106j3701l6113M471J3568J912K3202P67m0365m274K2085
394e2k975J3213J8609l2572k4642K0441Q541P506K0328k3153l6582J5627K3008
$$ plain form
303 -1704 -4848 39053 -4147 -46438 3234 20329 -502 14147 4966 -27615 -14729 12763 18215
316 18215 8894 -8046 -10237 -8985 -12584 17933 34482 -12404 -26964 1474 -9445 2322 42229
329 42229 1185 -39727 -295 3779 -10503 31374 19064 -35046 -8854 8387 -17357 21136
341 21136 36208 -29293 -26606 14584 -8012 5483 39789 -14050 -41181 10646 10225 -6470 25267
354 25267 8258 -34191 -9620 11929 943 16371 14730 -22704 -22308 4381 12073 16165 8159
367 8159 -17041 -19639 -140 12379 15086 4642 -11320 -13722 -7134 6821 20421 7795 -12781
380 -12781 -13630 -10943 2290 28396 14695 -21418 -16947 -3379 -1467 21735 22502 -17863 -22137 -52
394 -52 -3027 10186 28795 -3777 -28419 -7978 563 8069 28397 5244 -31338 -15711 7297
407G297J951R626r966l1725L022K4241N699M011k196k4542j1479J8134J8985O340
421A9398r292k1925j0954J3096K2848R827j5648k1795k428R512J3513J4050p893
434A2309k4088n386Q660R512J8360O02l0224j3338J4792J3112J3614K054k8665
447h686j6699J7881J4262O146M123j9092j9633J0436J4528P521Q055j5016k5436
460b1610M837J9353J0808N261j5155k5094M937K1394P502J319r120j9870R9J6359
474A020Q072L882n471j9490n040J4180J2062P134p931k3457k778J8710Q692K599
488A2184m472k0504l571J8950M721o87L435j6314j1951J6672R829j263L919j5137
502d189j7307J8204J6735o805j229q123j5726J4811J8480j0308m520J522j3089
$$ plain form
407 7297 9248 18874 8908 -22817 -19795 4446 10145 14156 11960 -12582 -24061 -5927 13058 19398
421 19398 10106 -11819 -22773 -9677 13171 22998 7350 -14445 -16873 -7361 6152 20202 12309
434 12309 -11779 -17165 -8505 1007 19367 19969 -10255 -23593 -8801 4311 17925 19979 -8686
447 -8686 -25385 -7504 6758 12904 17027 -2065 -21698 -11262 3266 10787 18842 3826 -21610
460 -21610 -16773 2580 13388 18649 3494 -21600 -16663 4731 12233 13552 4432 -15438 -15339 1020
474 1020 9092 12974 7503 -11987 -17027 -2847 9215 16349 8418 -15039 -17817 893 9585 12184
488 12184 7712 -12792 -16363 2587 7308 6621 10056 -6258 -18209 -1537 8292 7029 10948 -4189
502 -4189 -21496 -3292 13443 6638 5409 -2714 -18440 -3629 14851 4543 23 1545 -11544
515a1544L311J8148k094n892k015j1488L017J8057L90o963n429j1879Q046K0187
529A3852o871r477M552j1005j095K1284m128j2583J0110o770j1751K0528N473
542A2119j7870M515or620K0348O288k6629K462J1379j0928J4448J3414k8907n618
556a4605K0607j1343P90K4773j5280k0694J4295n8l343J8994o931k0461R534O834
570C112k404Q596j0711j4468J7155P267q358R454p396k2235J2933J5460n008R199
584A2596k863k7535J575J7110M124J1791o459k7408P897J4139j1683J4134Q940
597A6358l2114N908K8500k3073m597K6450k6547j5681M2001P48k3571J2925j5629
610h322k3191L7171J9804k0487L417j3428k6747K9156K1423j9367J2888J226m1072
$$ plain form
515 -11544 -8233 9915 7821 1929 -86 -11574 -8557 9500 9890 2927 -2502 -14381 -6335 13852
529 13852 6981 -2496 2056 -8949 -10044 11240 7112 -5471 4639 -2131 -13882 6646 12119
542 12119 -5751 -1236 -1242 -10862 9486 15774 -10855 -8393 2986 -7942 6506 19920 -8987 -14605
556 -14605 6002 -5341 -4551 20222 4942 -15752 -1457 -1515 -4858 14136 7205 -13256 -3722 3112
570 3112 708 9304 -1407 -15875 1280 8547 189 9643 2247 -19988 -7055 8405 3397 12596
584 12596 9733 -17802 -16227 883 5007 16798 10339 -17069 -9172 4967 -6716 7418 16358
597 16358 -15756 -9848 18652 -4421 -9018 17432 -9115 -24796 17205 17953 -5618 7307 -8322
610 -8322 -31513 5658 25462 4975 8392 -5036 -31783 -2627 18796 -571 12317 13543 -27529
623b7529J1959L4589j8862k538J7378k5895n419L3904o800k1367M528k673O962
636a763K0222p988j1923m270j8490J2831L5612r614j2439P193l0879j1904M7905
649A4493R767k3346P300j3263k0879K8832J1106j8219J1330n291j9150K7453L635
662A3768l1893J9962P161l5428L2325L4744n0254j1909K9356k7925O246N5755
674D1908k3621m1380J9356m923j0394L6294L552k3534M596j2649q769L2541r85
687A1992k1000J7791q325k1505L4452O205m0622J1635K0350j7746J2972J3642
699A9841k8658n603J0540m269K0140Q842k6333K525l16k4456L2933L0913m3531
712g432n871K9269l2240k530M7528k2895k7818L4326o766k3437K8349j764k3250
$$ plain form
623 -27529 -15570 19019 157 -2381 14997 -10898 -16317 17587 10787 -10580 -6052 -8725 -1763
636 -1763 18459 10471 -1452 -5722 -24212 -11381 24231 14617 2178 9371 -21508 -33412 14493
649 14493 24260 914 8214 -5049 -25928 2904 14010 -4209 7121 1830 -17320 10133 13768
662 13768 -18125 1837 8998 -26430 5895 40639 -9615 -21524 7832 -20093 -13847 41908
674 41908 18287 -23093 -3737 -8660 -19054 17240 20792 -2742 1854 -10795 -19564 12977 11992
687 11992 -9008 8783 458 -21047 13405 19610 -21012 -9377 10973 -6773 6199 19841
699 19841 -8817 -14420 -3880 -8149 11991 20833 -5500 -2975 -3291 -27747 5186 36099 -7432
712 -7432 -13303 15966 -16274 -18804 28724 5829 -21989 12337 5571 -17866 10483 8719 -14531
725a4531J7928k675j0051K8983j2563l1898K8394K794k5570L7388P207n3375J7611
738a0358L0685l5972Q779L5662l2185j4272K6131j2490l281K2082j4390q130J2493
751D754j2990P410J9197k9182l254L3566k2433j3630L6706j6423k7024L3628r37
764I388k6572K5895L900k7358J4372M680j3502K1113n666k5514K7575K533l2540
777b1696K9502J2530m4416K1488K9532m6029M701M3153l3533j5634L7431j5421
789A608j6709K7722r820j5106K0705q031q520J9023j4812o689K8460j9171j9630
802b0970L6419o018k9813K9139L472l2328K2684J3737k9300J0590J4302k0592
814h678P030Q344j5803J4711M376k6865J7604J5312l0680J2829K1556l6317N224
$$ plain form
725 -14531 3397 722 -9329 19654 7091 -24807 3587 6381 -19189 18199 25406 -27969 -10358
738 -10358 20327 -15645 -6866 28796 -3389 -17661 8470 -4020 -7301 14781 391 -7739 4754
751 4754 -8236 -826 18371 -10811 -14065 19501 -2932 -16562 20144 3721 -23303 10325 9388
764 9388 -17184 8711 12611 -14747 -375 4305 -9197 11916 6250 -19264 8311 10844 -21696
777 -21696 7806 20336 -24080 -2592 26940 -19089 -14388 28765 -4768 -20402 17029 1608
789 1608 -15101 12621 2801 -12305 8400 369 -8151 10872 -3940 -10629 17831 -1340 -20970
802 -20970 15449 9431 -20382 8757 12229 -20099 2585 16322 -12978 -2388 11914 -8678
814 -8678 -1648 6696 -9107 5604 9980 -16885 719 16031 -14649 -1820 19736 -16581 -11357
827a1357L6934l0206j3567L5177j6668j7819L0246o785j6924K0570j0235j5183
839a5817K5455m385j3965K2788j4423k3060L5055J356l2561K6970J0460l7785
851a9912J6033K1648l0705O601K4431k3913k949K0799j4337m125J0955j2498P685
864b87J6664k0696k791J5071j9929K719K9017j7792j2134K3022j6098j6982K7512
877G296J317j3656J5363q687j6637J9480j828j3856K0965k681j8540K1525l285
890F776k9417K3428J4904k8331J4830J9019l2721j031K2004j9153K889K8533j6689
903E041j5151J2571j0714j557K1750q602o754J5887j5194j3365K0489l529r396
916h524K2207m538k1561J4449J788j8612J3479J1554j0269P183j286j9266O660
$$ plain form
827 -11357 25577 -4629 -18196 16981 313 -17506 12740 5955 -10969 9601 -634 -15817
839 -15817 9638 5253 -8712 14076 -347 -23407 11648 13004 -19557 7413 17873 -19912
851 -19912 -3879 17769 -12936 -6335 18096 -5817 -8766 12033 -2304 -6429 4526 -7972 -287
864 -287 16377 -4319 -7110 7961 -11968 -9249 19768 1976 -10158 12864 -3234 -20216 7296
877 7296 8613 -5043 10320 1633 -15004 4476 2648 -11208 9757 7076 -11464 10061 6776
890 6776 -22641 787 15691 -12640 2190 21209 -11512 -12543 9461 -9692 -6803 21730 5041
903 5041 -10110 2461 -8253 -9810 11940 3338 -3416 12471 -2723 -16088 4401 872 -8524
916 -8524 13683 9145 -12416 2033 3821 -14791 -1312 10242 -27 7156 5870 -13396 -6736
929f736Q856o264J2171M233j8307M151M007j7701J2128J9901j5284k298J0048
942H905j8131k600J8271p993j506J7420j0439j2153Q512q315j320K2016n022j2505
956d860J2689q185j6777J7471O127j1372J4749J949k4332M865J2813j1354N350
969h67J2357j1154k121O246j2214j178J3525j723k80N094j0381m365P571m938
983d428P99J3129l590p723K010o603j088J2654j079n329O411m568o783P107k876
998a957m017J3061n93j1637P062O73j1956P902P062q892P173O498j6882l313J1871
1013B055k933J492Q880r183o577P399l441k713J0077m33n890K553l366l273Q337
1028B984j28o270M493J595m058K869j926n237O523L667n046J434M60n193K617
$$ plain form
929 -6736 2120 -4144 8027 12260 -6047 -1896 2111 -15590 -3462 16439 1155 -1143 8905
942 8905 -9226 -11826 6445 -1548 -3054 14366 3927 -8226 286 -8029 -9349 12667 7645 -4860
956 -4860 7829 -356 -17133 338 6465 -4907 9842 11791 -12541 -7676 5137 -6217 -867
969 -867 11490 336 -1785 4461 -7753 -8931 4594 2871 2591 7685 -2696 -7061 510 -4428
983 -4428 -3629 9500 5910 -1813 197 -6406 -7494 5160 4081 -1248 5163 595 -6188 919 -1957
998 -1957 -5974 7087 6494 -5143 1919 2592 -9364 -1462 5600 -3292 3881 10379 -6503 -9816 2055
1013 2055 -878 614 9494 311 -6266 1133 -2308 -5021 5056 4623 -1267 1286 -2080 -5353 2984
1028 2984 2856 -3414 1079 2674 -1384 1485 -441 -5678 845 4512 -534 900 1360 -3833 -1216
1043a216K401l119M953K067q711l65M846j947L176K686q403k59P593l670k019
1058a987N100m243k034O270l052k974P238l047p155N916K339l377M805k405q622
1073g228O486O014o452R57L113o326J001O152m541p09N642m318m598M945K013
1088B151j231N23k731j811L600J673j229j475j486K353J594l457R34L150l786
1103a228m94M002l354o1N682n905m672R059P22o262M286j463o680Q183M252r719
1119c652K467N875q262j23Q146m372j694O061o012m540Q955J400o261J725N59
1134B72k924L767J645m415L13K790j500j038J083J013J58k118p99J653O82J150
1150A732l85m283R31N203k663k262L267k236j624N559k960m470P140m52p575N561
$$ plain form
1043 -1216 1185 -1934 3019 5086 -3625 -3990 856 -1091 2085 4771 -3632 -3891 3702 32 -1987
1058 -1987 3113 -1130 -3164 3106 54 -2920 4318 1271 -5884 32 2371 -1006 3799 1394 -7228
1073 -7228 -742 5272 -1180 -223 2890 -3436 -2435 3717 -824 -1533 4109 -209 -4807 138 2151
1088 2151 920 1443 -1288 -3099 501 2174 945 -530 -2016 337 1931 -1526 -592 2558 -1228
1103 -1228 -1722 2280 -1074 -1135 4547 -1358 -6030 3029 3751 -2511 1775 312 -6368 1815 6067 -3652
1119 -3652 -1185 4690 -3572 -3695 4451 79 -1615 4446 -1566 -6106 2849 4249 -2012 -287 272
1134 272 -2652 1115 2760 -1655 -1342 1448 -52 -1090 -7 1006 1164 -954 -1753 -100 582 1732
1150 1732 1347 -2936 -2005 3198 535 -1727 1540 -696 -2320 3239 279 -4191 2949 2497 -5078 483
1166D83L114o554M117K131r236M645Q781r398k279Q264n450k363R235n031n927
1181e468R357j451q727P196L840p353K215K722o107K540O475n080m063M407J235
1196A738k739N80J746j369j363K637l60m264M079M491q194j249R124m457m629
1211d229Q896m256p967J2508O85j4341R018P665j4359M054J0628j3497O67J4480
1225I952j2709o085J7346n754j1416J2784r38j1049J1921K340j4425O805Q132
1238F904j0731J487P762p313q47O618n229k508P162m13m978L77J834P64q99j49
1254a59J480k904J05N396n177l754J0017k129r793R194K307j1696R414N103j6869
1269i465P601J3771j8060o66J7703j4167n106K0207j2291j2287K3174m758k0171
$$ plain form
1166 483 3597 -2957 1160 3291 -5945 -1300 7481 -1917 -4196 4068 -1382 -3745 5490 459 -5468
1181 -5468 3889 2438 -6289 907 4747 -2606 -391 2331 -3776 -1236 5239 159 -3904 503 1738
1196 1738 -1001 -421 1325 -44 -1407 1230 870 -3394 685 5176 -3018 -4267 4857 400 -4229
1211 -4229 4667 411 -7556 4952 5637 -8704 314 7979 -6380 -2326 8302 -5195 -4528 9952
1225 9952 -2757 -8842 8504 2750 -8666 4118 3180 -7869 4052 6392 -8033 -1228 6904
1238 6904 -3827 -2340 5422 -1891 -2738 3880 -1349 -3857 3305 2892 -2086 -1709 125 889 -10 -159
1254 -159 1321 -1583 -1478 3918 -1259 -5013 5004 2875 -6918 2276 4583 -7113 2301 7404 -9465
1269 -9465 -1864 11907 -6153 -6819 10884 -3283 -8389 11818 -473 -12760 10414 5656 -14515
1282a4515J9347M500k0892J2821R399k1502Q047J6041j9203k041J7786j0823n958
1295f993J4310o648q342J2508j146j0127O696M038n950K69K078r39m3N73J736
1310B020l294k891Q157l01j0855P872O692j4445M678J2330j6338N65J9316j7285
1324c779r280K5522q577j7777K2884k511k2555K1870O313k7597J5651J5899k7698
1337a1635N628K0652k2492j58K3867j9695r142K5852j0426j5896K1043k370j6385
1350a1157J6410K144j8021J0274Q809j3379K138Q130o630o71L779l043K96J760
1364H39M47J83n362J733Q331p588l617J1563p147o943J5228n869j3125J9286p76
1379G183k1576J7218Q464k3971J3026J4296k8034P724K4709k7567m688L0790j9014
$$ plain form
1282 -14515 4832 9332 -11560 1261 10660 -10842 -2795 13246 -5957 -7998 9788 -1035 -6993
1295 -6993 7317 669 -7673 4835 3689 -6438 258 4296 -1654 -1385 693 -246 -289 284 2020
1310 2020 -1274 -4165 3992 3691 -7164 708 7400 -7045 -2367 9963 -6375 -5810 13506 -3779
1324 -3779 -13059 12463 3886 -13891 8993 6482 -16073 5797 12110 -15487 164 16063 -11635
1337 -11635 -6007 14645 -7847 -8005 15862 -3833 -12975 12877 2451 -13445 7598 5228 -11157
1350 -11157 5253 7397 -10624 -350 8459 -4920 -2782 5348 -1282 -1953 1826 -1217 -921 839
1364 839 1286 1469 -3893 -2160 6171 -1417 -5034 6529 -618 -7561 7667 1798 -11327 7959 7183
1379 7183 -14393 2825 11289 -12682 344 14640 -13394 -5670 19039 -8528 -13216 17574 -1440
1392a440j3919L0683j1982k2161K9137o83k7259K2034R756k6807J0515J3151k1564
1405a0539P204J7345j8506k864J5874j0652m797J2577n113l944Q771m540n837
1418e021M604N53M76P70k774M523q31r153O524L362r474J1273O545k1118M466
1433e275J5525j9055J433K3936j7169r469K3061j5864j6220L0748k228k3099K2629
1446H953J400k8362J8441J0848k6549J5829K0041k8870J94K0110k2238j383K7628
1459A6042j4212j0429K1778j2176j8832J9425M115j0796J3202M52j6888M392M775
1472H48o505N936O089k848k98n992m586N865j42K047R190p244o620Q033r878p050
1488a3155K0608R26j1573J2694o940k1390J7984R089j8600J6959J2785l0028J584
$$ plain form
1392 -1440 -15359 15324 3342 -18819 10318 9635 -17624 4410 14166 -12641 -2126 11025 -10539
1405 -10539 -3335 14010 -4496 -7360 8514 -2138 -6935 5642 529 -3415 5356 816 -5021
1418 -5021 -417 136 612 1382 -1392 3131 2300 -6853 -329 3033 -6441 4832 11377 -9741 -5275
1433 -5275 10250 -8805 -7372 16564 -605 -10074 12987 -2877 -19097 11651 9423 -13676 8953
1446 8953 10353 -18009 432 11280 -15269 560 20601 -8269 -8075 12035 -10203 -11586 16042
1459 16042 1830 -8599 13179 1003 -17829 1596 5711 -5085 8117 8569 -8319 -3927 848
1472 848 -5657 279 6368 3520 3222 -2770 -7356 -1491 -1633 414 9604 2360 -4260 3773 -6105 -13155
1488 -13155 7453 8379 -3194 9500 2560 -18830 -846 8243 -10357 6602 19387 -10641 -9057
1501i057J7549k1658N233K9940j9783j2896K3144j5170j7819K6796J371j5411
1513g761K0457j555k7787J0843J0638j4286J2410J3145j7035k185N310j3985L389
1526h402J7448l160k897K355j0141l491O163m10M961N983m969k068l834r053Q365
1541c150R130o643O168N063j7409j236J0056j0909O349K0782j4461j1718J3054
1554E076j1612q482K4335j268j4100J6755m787k4045J4950J0170j4965J3667R706
1567A5400k3587K413J2947j7850K526K1750j0118o198J1220j3477q749J7326N3
1580C656o362J1439l308j2599M163K01k565J1071J870p780O82l054l591O745m7
1595E21j361Q318m221q703N245k382m112J2537m4j0255Q879p23j4797Q979P774
$$ plain form
1501 -9057 8492 -13166 -7933 22007 2224 -10672 12472 -2698 -20517 6279 7650 -7761
1513 -7761 12696 11141 -16646 -5803 4835 -9451 2959 16104 -931 -3116 2194 -11791 -8402
1526 -8402 9046 5886 2989 5344 -4797 -8288 -2125 -2535 2426 8409 3440 1372 -2462 -11515 -3150
1541 -3150 5980 -663 5505 10568 -6841 -8077 1979 -8930 -2581 18201 3740 -7978 5076
1554 5076 -6536 -15018 9317 8049 -6051 10704 5917 -18128 -3178 6992 -7973 5694 15400
1567 15400 -8187 -5774 7173 -10677 -8151 13599 3481 -2717 8503 -4974 -13723 3603 3656
1580 3656 -2706 8733 5425 -7174 -3011 -2810 -5375 5696 7566 -214 468 -2586 -6177 568 521
1595 521 -840 7478 3257 -5446 -201 -2583 -6695 5842 5798 -4457 4422 3699 -11098 -2119 5655
1610E655j0255Q645O575j8698J439J3378j1603N19J5271j0722o285J2727r361
1623b715p516J6945j962j0880J0705j269j1278R507J624j0136R436N146j1523
1636c916K546L838q005N199O206q364J954N119q014L21N855m466K532M076q359
1651c478L09O953n269J37N435o563M51P077p355j690R010n226l504Q016n218l773
1667d688R993m301p418J0238o36q586P698j82q224R326K274j1494N400N381r501
1682d720M000O330r125K334P110r878n86R757n399k276O783n906k495Q349m483
1697b05m285P753j275m604M829k707l822P136j075n078N653k49n403M173p48m056
1713c963P128R09p673L703J460n629N048K347o802M541L656q957J705N830n628
$$ plain form
1610 5655 -4600 4045 10620 -8078 -6639 6739 -4864 -4345 10926 204 -6081 6646 -2715
1623 -2715 -10231 6714 4752 -6128 4577 3308 -7970 1537 3161 -6975 2461 7607 -3916
1636 -3916 -1370 2468 -5537 -338 5868 -2496 -542 4577 -3437 -3116 2739 -1727 805 4881 -3478
1651 -3478 -3169 3784 -1485 -1348 4087 -2476 -2025 5052 -2303 -3993 5017 -209 -3713 4303 -915 -4688
1667 -4688 5305 1004 -6414 3824 3188 -5398 2300 2118 -6106 3220 5494 -6000 -600 4781 -4720
1682 -4720 -720 5610 -3515 -1181 5929 -3949 -4535 5222 -177 -2453 4330 -1576 -4071 4278 -205
1697 -205 -4490 3263 1988 -2616 2213 -494 -4316 2820 1745 -3333 2320 2071 -3332 841 93 -3963
1713 -3963 3165 4074 -3599 104 1564 -4065 983 3330 -3472 1069 4725 -4232 -2527 3303 -2325
1728b325K178N204p986K57P331o818j818Q155l938k493O675n739m120R257k070
1743A750o071P424j022o193O188m99o805P152K703q319L228L183n954L246L398
1758C409o626K432N120o136l60M477l628O46L664m953nN069l714j340L630k740
1774a055M01L837m975p27N833l699j993M964l475j420O473m570m307P922j226
1789A983n850O351j085o021P120O32q247N790L968q204K664M279o617K867N437
1804E067p932k18P110m828j618N480l739j359N272l951k877O038j236k881L366
1819A694k134j887M755k227k956M665o22k935K973k172k098N917j302m837M539
1834A373j55m396M614k9m872N664J063p624L726L823n818K877L369p305K540N761
$$ plain form
1728 -2325 -147 5057 -2929 -2672 4659 -2159 -3977 4178 240 -2253 4422 -1317 -5437 3820 1750
1743 1750 -4321 3103 2081 -4112 2076 1577 -5228 1924 4627 -3692 -464 2719 -3235 11 3409
1758 3409 -3217 -785 4335 -1801 -2161 2316 -1312 -666 2998 -1955 -1960 3109 -605 -1945 1685 -1055
1774 -1055 -654 3183 -1792 -2519 3314 -385 -2378 2586 -889 -2309 4164 -406 -4713 3209 1983
1789 1983 -3867 2484 1399 -4622 2498 3130 -5117 673 4641 -3563 -899 3380 -3237 -370 5067
1804 5067 -2865 -3083 4027 -801 -2419 3061 -678 -2037 3235 -716 -3593 2445 1209 -1672 1694
1819 1694 -440 -2327 2428 201 -2755 1910 1288 -1647 1326 -846 -2944 2973 1671 -3166 1373
1834 1373 1218 -3178 1436 1407 -3465 2199 3262 -4362 -636 3187 -2631 246 3615 -3690 -1150 4611
1850D611o872m35O373m640j102N390m846j354O864l844l932N935j297k936M616
1865B531k627l342N818q36m555M182k4l289L911j238m140N502M49n196L717N03
1881A366m464M798L64o489N489L083p686K752L916o652L364N096q210P72P472
1896D971o696j656P408m757k045O999m893m011Q199j642n310N163q17m040N269
1911B142q62m925N303O57m872L031K37k942M490p92n007M591O83m378M243j87
1927A412n127N958O89q016N360M044p911L719M188r187L675P724j0153N1R778
1942F204p756k863R802o459l744J0924n023p889J0115m72p984P825qq038P168
1957A802K294r131M867M403p012K443L135o153L213L898o255J178M006m291J313
$$ plain form
1850 4611 -2261 -2696 3677 -963 -2065 3325 -1521 -2875 3989 145 -3787 2148 851 -2085 2531
1865 2531 -96 -3438 2380 1544 -3011 1171 1147 -2142 1769 531 -3609 1893 2342 -2854 863 1366
1881 1366 -3098 1700 2064 -4425 1064 4147 -3539 -787 3129 -3523 -159 4937 -3273 -2501 4971
1896 4971 -1725 -3381 4027 -730 -2775 4224 -669 -4680 3519 1877 -3433 1730 913 -3127 2142
1911 2142 1280 -3645 1658 2315 -2557 474 711 -2231 2259 1467 -3540 1051 1734 -2644 1599 1412
1927 1412 -3715 2243 2932 -5084 276 4320 -3591 128 4316 -4871 -1196 6528 -3625 -3574 6204
1942 6204 -1552 -4415 5387 -1072 -4816 6108 1085 -6804 3311 2839 -5145 2680 2672 -5366 1802
1957 1802 4096 -5035 -168 4235 -2777 -334 2801 -3352 -139 3759 -2496 -1318 2688 -1603 -290
1972b90K189m875L334L271o402J786L597n466L184L997q356K592O896q908K69
1987c182Q980p761j224R485q966l683J3323n482q074J1570l291r260J2040n91
2001C884j1681J0933L197j3957P169O706j1673M869P328j2163K221J0475r669
2014b361j921R216o074k201Q225n539l376P833l652l890O228j990k005M664m668
2029a511k024O667l080k110N668m876k015Q023n770m380J0433l662o626J0095
2043D832l409q772J1581j064j1543J2069L691j4541P228N054j3703Q244J0760
2056A0427j5323J339J1733j3534j100J4781r171l827J3351r747q496J4526k230
2069B729q640J0649j693r485R395P0r754P625L448p584M833J562p498M336J837
$$ plain form
1972 -290 1899 -2976 358 3629 -2773 -987 2610 -2856 328 4325 -4031 -1439 5457 -3451 -3182
1987 -3182 5798 -1963 -3187 6298 -2668 -6351 6972 1490 -6584 4986 1695 -7565 4475 3884
2001 3884 -7797 3136 6333 -7624 -455 6251 -5422 -553 6775 -5388 -3167 7308 -2361
2014 -2361 -4282 4934 -1140 -3341 4884 -655 -4031 3802 150 -3740 2488 498 -1507 3157 -1511
2029 -1511 -3535 3132 52 -2058 3610 -1266 -3281 4742 -1028 -5408 5025 1363 -5263 4832
2043 4832 1423 -7349 4232 3168 -8375 3694 7385 -7156 72 5126 -8577 -333 10427
2056 10427 -4896 -3557 8176 -5358 -6458 8323 -848 -4675 8676 -1071 -9567 4959 2729
2069 2729 -5911 4738 3045 -6440 2955 3025 -6729 896 4344 -3240 1593 3155 -4343 -7 1830
2084A830o094N620L161o220K730r64o449P808L455q092N333J890j0487N838N114
2099D473j0581O809Q397j4266J471J0971j2453j03J4043j1104l230J6240j0473
2112A94j0855J5459l491r337J6289j812j5960J1457K209j4760J1582R159j3969
2125c835L492N737j3779M408J2080r590p70Q604q557k309P929n609n66P992m702
2140E25k710N001m629r41N163m740J562P319p205k822N773o525J013J1169p730
2155B23m552J0457p780o882J3922k948q591J3170l494j4104J3160L479j4712J0295
2169A643O408j5381P404Q798j7068L166J4310j2304j132J3745j1480n819J3536
2182E826o862o018J4911l420j1218Q504r37p153R940J262q998N312J339p031M497
$$ plain form
2084 1830 -4264 1356 4517 -1703 1027 63 -6386 1422 4877 -3215 2118 4008 -6479 -641 4473
2099 4473 -6108 701 9098 -5168 -3697 7274 -5179 -5282 8761 -2343 -5573 10667 194
2112 194 -10661 4798 1307 -8030 8259 6447 -9513 1944 4153 -10607 975 10134 -3835
2125 -3835 -343 5394 -8385 -3977 8103 -1487 -2257 6347 -2210 -4519 3410 -2199 -2765 5227 525
2140 525 -2185 2816 -1813 -2754 2409 -2331 -769 6550 -655 -3477 2296 -4229 -3216 7953 223
2155 223 -4329 6128 -1652 -8534 5388 2440 -6151 7019 3525 -10579 2581 6060 -8652 1643
2169 1643 8051 -7330 74 8872 -8196 -5030 9280 -3024 -4156 9589 -1891 -7710 5826
2182 5826 -1036 -7054 7857 4437 -6781 1723 786 -6367 3573 4835 -4163 1149 2488 -4543 -46
2197d6K261m362M565l85o173N018R98n035M892k91n639P384J80r276O573L186
2213C850r089O774M322j1857N442P445j3157L028J1916j1869j098J2051j0898
2226c140l513J5310q175q804J4437l354j0617J2263p95j1619J1161K531j3005
2239g320P503O057j1409M153O413r962L126P821r343m50Q091n932j239O180m941
2254a252j065O006m608j968N441k831p42L835n083KO242n071j258O380n372j955
2270c299P701n618l180J0067m431p455R346j338p192R764j122j0689R159L325
2284E038j1032O606N615j1627L949P334j0713K568J0146j0319k630J0108o182
2297a139k602R629n914n736R501k061o284P352q17n902O132m48n573N817M77o395
$$ plain form
2197 -46 2215 -2147 2418 2033 -4140 878 1876 -3159 1733 1442 -4197 3187 3367 -5909 664 3850
2213 3850 -5239 1535 5857 -6000 -558 6887 -6270 -3242 8674 -3195 -4293 7758 -3140
2226 -3140 -6653 8657 482 -8322 6115 2761 -7856 4407 3612 -8007 3154 5685 -7320
2239 -7320 183 6240 -5169 -1016 5397 -4565 -1439 6382 -2961 -3411 4680 -1252 -2491 3689 -1252
2254 -1252 -2317 3689 -919 -2887 2554 -277 -1019 2816 -2267 -2265 3977 -1094 -2352 4028 -1344 -3299
2270 -3299 4402 -1216 -4396 5671 1240 -6215 3131 1793 -5399 4365 3243 -7446 1713 5038
2284 5038 -5994 612 6227 -5400 -1451 5883 -4830 -2262 7884 -2435 -5065 5043 -1139
2297 -1139 -3741 5888 -26 -5762 3739 1678 -4606 2746 1929 -3973 2159 1711 -3862 1955 2432 -3963
2313c963M138K132l899L859o74o486M181L495l906L162L91o501L209K629m984
2328c217M967L509q255R66M007n787L761O279q909p62Q225o139k125P857n702
2343a325l475R784l193o069P974k624p995P998K444n456O011q76j0745M620O576
2358C649m787L505K713q844L61N347m358J754O134n513k422L867l185R4M601l947
2374a031j070N371k000k048J786m658r2P468j090k416K995n323m326O634J176
2389A376q05N710m529q789M765K921k203N827k68q256L567K833o176L507M437
2404C917o057J726M809o228k47M580n933l93Q726j817l241J870n905k204Q978
2419B581J341k942K315l975n286M723K195r30M411j844o409K069J960j896L807
$$ plain form
2313 -3963 175 2307 -1592 2267 1593 -4893 -712 2783 -1123 2039 2430 -4071 -862 1767 -3217
2328 -3217 1750 5259 -2996 -2030 1977 -3810 -49 6230 -2679 -3441 4784 -1355 -3480 4377 -1325
2343 -1325 -4800 4984 1791 -4278 3696 1072 -6923 1075 3519 -1937 4074 3198 -7547 -2927 3649
2358 3649 -1138 2367 5080 -3764 -3403 1944 -2414 -660 5474 -39 -2461 1406 -1779 -1685 2916 -1031
2374 -1031 -2101 3270 1270 -778 1008 -3650 -3742 3726 2636 220 3215 -2108 -6434 200 1376
2389 1376 571 6281 1752 -7037 -2272 649 -1554 4273 4005 -4251 -684 2149 -4027 -520 3917
2404 3917 -2140 -414 4395 -1833 -2080 2500 -3433 -3826 4900 3083 -158 1712 -4193 -6397 2581
2419 2581 3922 980 3295 -680 -5966 -1243 952 22 4433 2589 -3820 -1751 209 -1687 2120
2434B120k66m501L646K005n084Q90J382l240L973L715m966J09R53n726J968O984
2450C962j758m26R55p285j205P912q7j727L216m112l639M899j98k650M694o09
2466A942m594L028J003l193K275j42l360M262K648m263m36j20k647M113L336l632
2482B20K9N54m192J439M024j684J119J081n556J3M995j909n84K660l369p17M711
2499B834k927k713M525j128k664M192q35l739L404k34m018M216K338m296O42R12
2515E09l245K958K787l969q8K504k485L3K179j690K79J932k314o98K285r69k37
2532b29Q65j611Q58J755k465j73K042j466N21J526l478J95M302k541j861L438
2548A678j978k028M435j602l045M560m58n072L786K156m096K158J128m877K772
$$ plain form
2434 2120 1854 -2647 999 3004 -2080 -1190 192 -3048 925 4640 -326 -217 736 -4990 -3022 3962
2450 3962 2204 1778 2733 -4552 -5757 2155 2068 341 3557 -555 -4194 705 507 -2143 2551 1942
2466 1942 -2652 376 1379 -1814 461 319 -3041 1221 3869 -394 -830 -950 -3597 516 3852 220
2482 220 249 803 -3389 -1950 2074 390 1509 2590 -2966 -2953 2042 133 -451 2209 -1160 -1877 2834
2499 2834 -93 -2806 1719 591 -2073 2119 1284 -2455 949 715 -3303 913 3251 -1045 -403 509
2515 509 -2736 222 3009 -960 -1048 1456 -1029 -996 1183 -507 -228 1704 -610 -1308 977 8 -229
2532 -229 636 -975 -117 1638 -827 -1000 1042 -424 97 1623 -1855 -1660 2642 101 -1760 1678
2548 1678 -300 -2328 2107 505 -2540 2020 1562 -3510 276 2432 -1664 494 1622 -3255 -483
2563d83M300m554j093L162k656J50M103k704k127K884j578j693L848O68k540O4
2579b49j177n32L355R28k248q23q73Q27K318p54r73O07j634j41K984p74r70J293
2597A164k950j289N410N10l765J083j403k365N738J983n629Q74J391m418L319
2612c47M794m388j175K452m603N92P299k331m470K218j647q64O213o16n936J521
2628a288J364j903L334J832l939j108O49p03K949K316k495k859r73J308L853O00
2644B937k732j206j425N04M255K99l219R20j247l022N110L071m592l47L97l962
2660d259M227O069n693l320L356k716O51P099l633n446M048q84k922O741J051
2675D369o793O72J263k333N020L159o904j920L128o82K067K929m207k637K024
$$ plain form
2563 -483 3817 -737 -1830 1332 -1324 -1174 2929 225 -1902 982 -596 -2289 1559 2227 -313 -249
2579 -249 -1426 -1958 1397 2325 77 -746 -1619 -792 1526 772 -201 406 -1228 -1369 1615 841 -129 1164
2597 1164 -1786 -3075 2335 2845 -920 163 -1240 -3605 2133 4116 -1513 -639 752 -3666 -347
2612 -347 4447 59 -1116 1336 -3267 -2675 4624 2293 -2177 41 -1606 -2470 3743 3127 -2809 -1288
2628 -1288 76 -1827 1507 3339 -600 -1708 -1059 -1762 1187 3503 1008 -1851 -2824 -1516 2337 2937
2644 2937 205 -1001 -2426 -1922 2333 2632 -587 333 -914 -3936 1174 4245 -347 -694 -297 -4259
2660 -4259 -32 6037 344 -2976 380 -2336 -1685 5414 1781 -3665 383 -501 -3423 3318 4369
2675 4369 -2424 -1752 -489 -2822 2198 5357 -1547 -3467 -339 -1021 1046 3975 -232 -2869 -845
2690h45n7J306K764k011k730m63N3L056K539k661k418p50j50M015K290m374j070
2707a506J542k690K201M910m010k490L147l612m33Q138k406o570L564m7l202P245
2723C781Q44q761K059M166m735L149M809o841j785M942l390N43O338m040n290
2738d211L717L69n96M364k032n157K307J830r06K045j72l006J91N01L88K410n95
2755A447k154l96r73J573M312k871l527K944j062j385N411j143n796M043J072
2770A495n347M912L550p080P27L748m907K468O054p102k629O577l056j539O631
2785D502m087m991O798j103m977O397J026p292K814K946m376L147L164o030p06
2800b768M272j393j61J687k411l07J627j222R35J276k041K31M65k039K382K187
$$ plain form
2690 -845 -902 404 3168 1157 -1573 -2036 -1983 1073 3612 951 -1467 -2217 -2367 1648 3938 -436 -1506
2707 -1506 36 -2654 -453 4457 447 -2043 1104 -2508 -2941 5197 2791 -3779 -215 -262 -3464 3781
2723 3781 4625 -4136 -2077 2089 -2646 503 5312 -1529 -3314 1628 -1762 -1219 5119 1079 -4211
2738 -4211 -494 -125 -721 3643 1611 -3546 -1239 591 -315 1730 1558 -1448 -1257 -756 -368 2042 1447
2755 1447 -707 -1103 -2076 -503 3809 938 -2589 355 -707 -2092 3319 2176 -3620 423 1495
2770 1495 -3852 1060 4610 -2470 -1743 2005 -2902 -434 5620 -1482 -4111 2466 -590 -2129 4502
2785 4502 415 -4576 2222 1119 -3858 2539 3565 -3727 -913 2033 -2343 804 3968 -2062 -2768
2800 -2768 1504 111 -50 1637 -774 -1081 546 -676 259 1535 -506 -275 190 -1849 533 2720
2816B720l816k3K053k557J713K624m541N86L887m231k66N262m220j734O290m477
2832g30l688Q156j394p204O293J513p037M883K927p708L194N220o674K01N207
2847C159m243m91M461m113q82N115l235k295M545k003k074M379j986l062M216
2862A491k76l471K543R17j393J193j620j367K796m99n15K617l346k083N013j767
2878B33l283O323o70o662L928J919n013M522K723p421J839M756m944J057L728
2893C035n774Q23O120n330q49O167n690l426P820j183l876O276k913p920N986
2908g34M254m180K341N58n591J349K809j476K266Q32l792P27O49k181L690P07
2924B228n363K479L932l758N04J161n270K119N641k288k02O96o004K96N399j526
$$ plain form
2816 2720 -1096 -1119 934 -1623 90 2714 -1827 -1241 2646 -1585 -1851 3411 -809 -2543 3747 -730
2832 -730 -4418 3738 2344 -4860 1433 2946 -4091 792 3719 -3989 -795 4425 -2249 -2048 3159
2847 3159 -1084 -1575 2886 -1227 -2109 3006 -229 -2524 2021 18 -2056 2323 337 -2725 1491
2862 1491 1215 -2256 287 1204 -189 1004 -616 -1983 813 314 -201 2416 -930 -3013 2000 233
2878 233 -3050 3273 2603 -4059 -131 1788 -3225 1297 4020 -3401 -1562 3194 -1750 -693 3035
2893 3035 -2739 -1916 4204 -1126 -1975 4192 -1498 -4924 2896 1713 -2163 4113 1200 -6720 -734
2908 -734 3520 -660 1681 2239 -3352 -2003 806 -670 1596 2428 -1364 -637 12 -2169 1521 2228
2924 2228 -3135 -656 3276 -482 22 1183 -4087 -1968 3673 1385 1183 1879 -4125 -3829 1570 44
2940D4K149L939q820l976P765j014j121P235m713p683O827J672n936N020J812
2955C200o412L046L426m967J530J166n374L243N988l385l33l28p442K259R006
2970D623j577j670J856o428l238O621J872l64K447m159m073K865O98R85K846m197
2986h93j610N540k075l614L778k572k928Q144J367o687J958j135o229N898O851
3001E793l151r7k195p843L738P272j911J207R56q317K73P019l680k91O058n063
3017b32l817O629j137m373L644j229k500O314J192n442p81j662m26O941J726l967
3033H80K94l136m584O061M486k799J587j262p020K623N548k316O05Q99m307J876
3049e65L271m417J64L101l799K133N145n384k393M030m314n40R113j440o326K219
$$ plain form
2940 44 2193 6132 -2688 -6664 1101 87 -1034 6201 1488 -6195 632 2304 -3632 1388 3200
2955 3200 -3212 -166 3260 -1707 -177 989 -4385 -1142 4846 1461 1128 800 -6642 -4383 4623
2970 4623 3046 1376 3232 -3196 -6434 187 2059 1695 4142 -17 -4090 -1225 -527 458 3304 -893
2986 -893 -2503 3037 962 -2652 1126 -1446 -4374 3770 5137 -1550 408 -727 -6956 -1058 5793
3001 5793 2642 2545 350 -7493 -3755 3517 1606 2813 3769 -4548 -4275 2744 -936 -1227 4831 -232
3017 -232 -4049 2580 1443 -2930 714 -515 -3015 3299 4491 -951 -1732 -3394 -3820 3121 4847 880
3033 880 1174 -1962 -6546 -485 4001 1202 2789 1527 -5493 -2870 2678 362 967 1866 -2441 -565
3049 -565 2706 -1711 -1547 1554 -2245 -112 5033 -351 -2744 1286 -3028 -3568 5545 4105 -2221 -2
3065bk037l045P737K118n497J042m20l820L921K364l241K275J23m977L078L357
3081B976m512O60K438l690K052M172m885k092L287j279Q12L318l121j531J918
3096E23k681P84M667k528j565K247l714n94O456k264m187M289r86l392N032l93
3112A694m893L927J197m378L065J596m502K279J836m394K886L253n889K97M433
3127B407l530K73M189m708j690N417j729k645L689r74k707K766n52j691K949o19
3143H45k391K041m23j254K662j267k390L888J8l566J865J36k268L653P64m034
3159a721J704R56l410K570K228l357J702J007n012K129M555m160k82L519m110
3174a682j80N289l637l135N243j026k806L977r43l768L039R0k459M079O26m569
$$ plain form
3065 -2 -2039 -5084 2653 4771 -726 316 -104 -3924 -3 2361 -880 1395 1518 -3459 -381 2976
3081 2976 -1536 -876 1562 -2128 -76 4096 -789 -2881 406 -873 -61 3257 136 -1395 523
3096 523 -2158 -1374 3293 765 -800 1447 -2267 -2861 3595 1331 -2856 1433 447 -2945 2087 1694
3112 1694 -3199 728 1925 -2453 612 2208 -2294 -15 1821 -2573 313 3566 -2323 -2026 2407
3127 2407 -1123 -850 3339 -1369 -3059 2358 629 -2016 1673 699 -2008 758 206 -1485 1464 845
3143 845 -1546 495 72 -1182 1480 213 -2177 1711 1729 -1837 28 164 -2104 1549 2313 -1721
3159 -1721 -17 939 -2471 99 2327 -1030 672 1679 -3333 -1204 3351 -809 -1091 2428 -1682
3174 -1682 -1862 3427 -210 -3345 1898 872 -1934 2043 1100 -2668 371 461 -1998 2081 2707 -1862
3190a862R33P36j902L881J502m923L61K171k421J411K468k947j91J766k139O35
3206e21K335j945q47R91j141J913J997l978r52K765j455J112L007l729k251L565
3222H66j388j169M757j439m015K279k95j711M831k80n171K093J751k591K896R50
3238B364n136J540L344l322R40L215l985j250L273j300J56K911l003k490K635
3253a08M40K46J600k846j591K875n39n89K562j787k371K470m11j056L370q88l888
3270b511J960J076j182K606p76l843K289J746k386J861R41l710J170K313k832
3285a278J281K717l913j122L455j058j42K325l184j726L602j78j276K122j801
3300a76j972K991n08j559L119p57l283J799J001j389K151j95l430J772J785j806
$$ plain form
3190 -1862 -929 -193 -2095 1786 3288 -1635 -1274 897 -1524 -113 2355 -592 -783 983 -1156 -521
3206 -521 1814 -131 -978 13 -1128 785 2782 -1196 -2148 617 -838 274 3281 -448 -2699 866
3222 866 -522 -1691 3066 1627 -2388 -109 -404 -2115 2716 2436 -2735 -642 1109 -1482 1414 2364
3238 2364 -2772 -1232 2112 -1210 -270 2945 -1040 -2290 983 -317 -161 2750 -253 -2743 -108
3253 -108 332 578 2178 -668 -2259 616 77 -512 2050 263 -2108 362 -49 -1105 2265 1377 -2511
3270 -2511 -551 525 -657 1949 1173 -2670 -381 1365 -1021 840 1781 -1929 -759 1554 -1278
3285 -1278 3 2720 -1193 -2315 1140 82 -60 2265 -919 -2645 957 779 -497 1625 -176
3300 -176 -2148 843 335 -1224 1895 1138 -2145 -346 655 -734 1417 1222 -2208 -436 1349 -457
3316d57P63M11k314J683J124k490J582J319l211O95K159k304J238K223l807q75
3332b261L879j394j083K588k176j483L352j102k016L218n87k813K345K20k237
3347a550K713K67l614J742J987k212P22R89k353Q86J787k016K32J544j557kQ42
3364D07j469J305J575k735j98K031j378L12J803k501k82K640j903r72K760j124
3380B71j366K142j335j403L587r25l049K608K34k276K627J25l466K373J643l506
3396a716J374K318k862K03J985k545O01K962k637j239K467j048m51K210j909j252
3412a539K464p43j305J961l92j286J203p31o42K216l55j945J076l12k14K090j113
3429D33j997K024j42j692K270Q9k443J934K61k813K601J814l520N21J799k546
$$ plain form
3316 -457 306 717 -1597 86 1210 -1280 302 1621 -1590 -895 1264 -1040 198 2421 -1386 -2261
3332 -2261 1618 224 -859 1729 -447 -1930 1422 320 -1696 1522 935 -1878 467 687 -1550
3347 -1550 1163 1430 -2184 -442 1545 -667 55 1044 -1309 -423 1364 -652 -420 1124 -433 -435 407
3364 407 -1062 243 1818 -917 -1115 916 -462 -150 1653 -848 -1130 1510 -393 -1365 1395 271
3380 271 -1095 1047 -288 -1691 1896 971 -2078 530 764 -1512 1115 1240 -2226 147 1790 -1716
3396 -1716 -342 1976 -886 -683 1302 -1243 -642 2320 -317 -1556 911 -137 -588 1622 -287 -1539
3412 -1539 925 182 -1123 838 446 -840 363 -368 -1010 1206 851 -1094 -18 -330 -544 1546 433
3429 433 -1564 460 318 -1374 896 985 -1458 476 737 -2076 525 2339 -1181 -660 1139 -1407
3445a407J440K533l735n81L498k134r86L352j960j782L014j077k044L429j53l155
3461a748J731M31j518K345M7l174J451J525j705J049N90k125P38J108j683J082
3477A44J316j988j35N31o01J537Q09k724L58J294j369J244J200l004N64K460k663
3494a027J1L119k232j521K863j556r85L528j622l130L047L59j889K441m19l593
3510b606K715J591l327J890J983l644L42K338k381N94K708k575j380K580l56q88
3526d16J041j189l26J906p69n94R27j296j40J793r94k22K056j933k011K269K16
3543C18l80J818j755k053K460j57j266K336o75k255K713l82l182L231J316m281
3559b194J807K640l420O42K383l726J34M273j755j822J944j822q65L006p78j078
$$ plain form
3445 -1407 33 2566 -1169 -1750 1748 -386 -1372 1980 20 -1762 1252 175 -1869 1560 1407 -1748
3461 -1748 -17 414 -1104 1241 1288 -1886 -435 1090 -615 434 1024 -1101 -363 745 -938 144
3477 144 1460 -528 -663 -132 -733 804 1613 -1111 -753 541 -828 416 1616 -1388 -824 1636 -1027
3494 -1027 -1016 2103 -129 -1650 1213 -343 -1328 2200 578 -2552 495 854 -1035 1406 987 -2606
3510 -2606 109 1700 -1627 263 2246 -1398 -1056 1282 -1099 -505 2203 -372 -1752 828 472 -416
3526 -416 625 -564 -890 1016 247 -347 580 -716 -856 937 -57 -279 1777 -156 -2167 102 318
3543 318 -62 1756 1 -2052 408 251 -1015 1321 646 -1609 1104 722 -2460 771 2087 -2194
3559 -2194 -387 2253 -1167 -525 1858 -1868 -1734 2539 784 -1038 906 -916 -1781 1225 447 -631
3575f31K372j536k549K483K70j175K314o19l019K032J373k175N13Q53r50R38K67
3592G61j297L83j84p31J928n8j408J920r14l596K798K751k743O55J328l687O39
3609a455L265k220m40K801k131j262K466j609n94L140j967j956L794r15l038K657
3625E36j62k639L689J201m415Q35K136k424O67K370j736k34O75j766L60J735o55
3642A73M08J97k444J519J856k751qK383j661k39J990k042p05K270j138o06K074
3659A276j137p55J356j885j47L647j628k575L041r14k664L769K85l983K625J764
3675B075m007R83K706k503K05J941k213K34K106k117n12K023j315K25J924k670
3691i15o37L027j309j545K488o93j678J825l15j259J766Mj513Q51l40k19J856
$$ plain form
3575 -631 1741 205 -2344 139 409 -766 1548 929 -2090 -58 1315 -860 -347 506 -444 494 761
3592 761 -536 -153 -337 -1068 860 802 -606 1314 400 -3196 -398 2353 -390 265 1593 -2094 -1455
3609 -1455 1810 -410 -850 1951 -180 -1442 1024 -585 -1179 1961 -6 -1962 1832 917 -2121 536
3625 536 374 -2265 1424 2625 -1790 -955 1181 -1243 -576 1794 58 -176 499 -1267 -907 828 173
3642 173 581 778 -1666 -147 1709 -1042 -1050 1333 -328 -567 1423 -619 -1324 946 -192 -798 1276
3659 1276 139 -616 740 -1145 -1292 2355 727 -1848 1193 279 -2385 1384 1669 -2314 311 2075
3675 2075 -1932 -949 1757 -746 -541 1400 -813 -579 1527 -590 -1102 921 -394 -169 1755 -915
3691 -915 -1552 1475 166 -1379 1109 416 -1262 563 248 -1011 755 759 -754 97 -243 -462 1394
3708A394j589j321K706n93k257K478J35k900K583J163l687J427K472k989K0K484
3724A526k116J22J770k473J29K681j802n79J902k113j76L152j936j985L189o35
3740F56k332K378J89k170J771J80j948J366R72j557N44l27p19K100k32k337J749
3757B83N09k131J770Q56k740J320J779k921N43K515k100n52J768j755M14K329
3773A887k265r06K234j362n61K708j929j510L277j046k701L016M63k720J579P22
3789H86k239J662J131k654M68J606j030Q24K6k134R66J234j734J201J536k556
3805h07J29J243j964R22K899k121j400J500j132j03K118j359n25K053j603j297
3821a447K299j006j123K858j047k137K740j98l253K120J493k027J716O41l375
$$ plain form
3708 1394 -195 -1516 1190 597 -1660 818 953 -1947 636 1799 -1888 -461 2011 -978 -958 1526
3724 1526 -590 -468 1302 -1171 -1042 1639 -163 -742 1160 -953 -1129 2023 87 -1898 1291 656
3740 656 -1676 702 891 -1279 492 672 -1276 90 1062 -495 49 -278 -997 1103 871 -1466 283
3757 283 792 -1339 431 1287 -1453 -133 1646 -1275 -732 1783 -317 -869 899 -856 -442 1887
3773 1887 -378 -1284 950 -412 -973 1735 -194 -1704 1573 527 -2174 842 1305 -1415 164 886
3789 886 -1353 309 1440 -1214 -746 860 -170 654 680 -1454 -488 746 -988 213 1749 -807
3805 -807 -678 565 -1399 -477 2422 301 -1099 401 -731 -834 1284 -75 -600 1453 -150 -1447
3821 -1447 852 -154 -1277 1581 534 -1603 1137 939 -2314 -194 1299 -728 988 1629 -1746
3836a746O32K038j754Q74J702j912j88P27k085R80K739j676p94J420j673o15K231
3853I00r64q71K334n68j657Q71n39n48J712m13n70J795j012j979J121r1l88L078
3871B211n39l136J024L63j872K180J734j898L04K93k840R79K692j361K16R32k552
3888a270M27K130k191m38K807j216q72K064j653j773K288o1j168K462N4k584O4
3905i30N5m22K829N60k552J14p9j256J881J261j764P01K94k116O71J799j106j79
3923b39O00j041J001J089k054o24J147l99J327J387k603r88J543j252L36L151
3939B381j257k047R01j178m03L514kk816N51Q9r81K157L63k480J112Q85j907J483
3957C65J265k628k8J573j222Q80K217k679j789J606L05O61J447j962j687J274
$$ plain form
3836 -1746 -1114 924 -830 44 1746 -166 -354 373 -1712 -732 2007 331 -463 957 -716 -1331 900
3853 900 -64 -935 1399 831 -826 45 -494 -1042 670 257 -313 1482 470 -1509 -388 -479 -867 2211
3871 2211 1672 -1464 -440 -77 -1949 231 1965 67 371 664 -2176 -1197 1495 134 350 1282 -1270
3888 -1270 -843 1287 -904 -1342 1465 249 -623 1441 -212 -1985 303 242 -926 1536 1590 -994 -930
3905 -930 -875 -1297 1532 2092 -460 -346 -425 -1681 200 1461 -303 398 692 -1424 -753 1046 -60 -239
3923 -239 361 -680 321 1410 -644 -1268 -121 -520 807 2194 -409 -1397 146 -1106 -770 2381
3939 2381 1124 -923 -22 -1200 -1603 1911 1909 -907 -356 -267 -1248 909 1272 -1208 -96 789 -1118 365
3957 365 1630 -998 -1026 547 -675 205 2422 -257 -2046 -440 -135 526 1973 11 -1676 -402
3973d02J11K98J606j060j517O92n05L82K189q33k264N86L22L24J860j187k146
3990a544J131L88k44J671p69k088J302M34j386K215Q89l419R8J876j232J299J630
4007B251l318j151K953l21m82J618j767j589K055M1p75J963q15k440J367P55m93
4024a48J335n33k412J114J647p77J85k91j364R68J016o19M38l39j475P48R25n38
4042a20J337k16k734M30K110n64L64M30k408J62K348j059n66J542j389o78J882
4059H71q25p15J841j355j585K544L69j814J091m09k018K448J511k571Q2J113j636
4076a058O96J657j404k81J127j461l7J716o25o22M98r05L72J534q69j170P20j76
4094b88M05R21j139o07Q71p19J02J644j088o28J144j380m86K904p29k371J652
$$ plain form
3973 -402 -291 7 1613 553 -964 -272 -777 -395 1794 961 -1303 -717 -395 -71 1789 602 -1544
3990 -1544 -413 -25 -269 1402 633 -1455 -153 281 -1105 1110 1999 -1420 -1322 554 -678 621 2251
4007 2251 -1067 -2218 735 414 -68 1550 -217 -1806 249 290 -485 1478 663 -1777 -410 345 -148
4024 -148 1187 654 -1758 -644 1003 226 411 120 -1244 -276 740 121 559 220 -1255 -507 418 -120
4042 -120 1217 1001 -1733 -1303 807 243 607 1037 -1371 -1209 1139 80 -486 1056 -333 -1011 871
4059 871 46 -669 1172 -183 -1768 776 1145 -669 422 13 -2005 443 1954 -617 -535 578 -1058
4076 -1058 -362 1295 -109 -390 737 -724 -761 955 330 -292 206 -699 -327 1207 338 -832 -112 -288
4094 -288 117 1038 -101 -708 163 -556 -454 1190 102 -526 618 -762 -1248 1656 927 -1444 208
4111B08J10j495K273L54l169J115J959k062N51J506k249j54K092j339mK035k027
4128b96j349J882J88m08J249j505j483K105L78r33O87m21j219J171M83p81R80
4145G28m88j303P34O58k47J030r10j901J402J195p40M95l10j933J376J257j377
4162c34O44N10k116N55J582j027M35J110k688j48K838q94q51J451k025q61L243
4179A424l24k159J493k08j981K038J115k008Q32M11k415J221K316j574m76L82
4195H7j262Q31J672r16r73M75n26L84Q39m72LN8j306O91J337p02K2K09j807N83
4215g73K371j285j075J301j123m89K256o41j684J913n06j831K148M72j884J054
4231B24J12j907J794J516k293k9J113j082M32J270j469m25J486r92m71J434o00
$$ plain form
4111 208 318 -1177 1096 1450 -1719 -604 1355 -707 -156 1350 -899 -1053 1039 -300 -304 1731 -296
4128 -296 -1645 237 425 17 1266 -239 -1722 383 761 -172 515 94 -1125 46 529 -252 728
4145 728 240 -1063 -329 329 82 1112 202 -1699 -297 898 158 653 343 -1590 -214 1043 -334
4162 -334 310 820 -1296 -741 841 -186 249 1359 -1329 -1477 1361 467 -384 1067 -958 -1819 1424
4179 1424 1100 -1059 434 226 -1755 283 1398 -610 222 633 -1782 -561 1755 181 -295 87
4195 87 -1175 -344 1328 412 -561 -86 -612 -228 611 139 142 200 -1106 -415 922 220 242 451 -1356 -773
4215 -773 1598 313 -762 539 -584 -1073 1183 542 -1142 771 265 -1566 582 1054 -830 224
4231 224 336 -1571 223 1739 -554 -583 530 -552 -120 1150 -319 -744 742 -250 -721 713 113
4248A13n02Q06q34k18J633o21j062Q33l12k57J071n02j041J389j52r89P49J01
4266B05m74Q85n39j048J445j9r63R49p4j386J444K93j903J323J307k322K69J356
4284G48j608N96J836k169p95K343q02o98J454r56j061J775n23j085J781o4j890
4301a118Q59O23o44J119j61j803O02J051l05K89m25r32Q16K98m21O79j5j401O68
4320b21M01o93J436L29k595J54J916p82L93P84j976n20K284o71n07J318j257j068
4338a275J688m0o49J576j212k087J822J370j008O04o67k073J457J982j264mJ86
4355D06j568M07J305k56J42K47j621j21J564N1j98j16j440M83J849l82q03j46
4373a97r17L05J694q7n04O4j612k08K095K82k50L11k056j101K648Q50j330N62
$$ plain form
4248 113 -389 417 -417 -635 998 377 -685 148 -164 -421 650 148 -893 496 344 -645 104 205
4266 205 -269 616 77 -971 474 455 -508 441 367 -1019 425 718 -1185 138 1445 -877 -608 748
4284 748 -860 -264 1572 -597 -1392 951 149 -549 905 -51 -1112 663 140 -945 836 772 -1118
4301 -1118 -259 364 -280 839 678 -1125 -523 528 223 512 87 -845 -29 269 -152 527 512 -889 -221
4320 -221 180 -513 923 1252 -1343 -1189 727 -55 338 1122 -854 -1374 910 239 -268 1050 -207 -1275
4338 -1275 413 373 -276 1300 88 -1999 -177 1193 185 789 122 -1951 -494 1488 224 220 406
4355 406 -1162 -755 550 294 436 683 -938 -1059 505 556 358 242 -1198 -715 1134 752 -51 -197
4373 -197 -1114 -809 885 798 294 358 -1254 -1462 633 915 665 976 -1080 -2181 467 1317 -13 549
4391E49n91j554J910R89j974M68P69j624O85J944j294j054N21j030R49K438r20
4408A181j978r3m10P35K223l27j713O6m47l22J488O05p96j16n09l64J243J60r77
$$ plain form
4391 549 -42 -1596 314 1303 -671 -203 566 -1058 -373 1571 277 -777 -256 -1286 -337 2101 1181
4408 1181 -797 -890 -1300 -565 1658 1331 -382 -316 -763 -1085 403 1008 212 96 -413 -777 466 626 -351
$$ [...]
8191a6
##END NTUPLES=NMR FID
##END=
