##TITLE=1H_LY-844.24
 CCl4, 8 sc, 
 27.6.2019
##JCAMPDX= 6.0         $$ Bruker NMR JCAMP-DX V2.0
##DATA TYPE= NMR FID
##DATA CLASS= NTUPLES
##ORIGIN= UXNMR, Bruker Analytische Messtechnik GmbH
##OWNER= root
$$ XWIN-NMR		Version 3.5
$$ Thu Jun 27 15:49:00 2019 Russian Standard Time (UT+4h)  she@DPX200
##.OBSERVE FREQUENCY= 200.13155
##.OBSERVE NUCLEUS= ^1H
##.DELAY= (6, 6)
##.ACQUISITION MODE= SIMULTANEOUS
##.ACQUISITION SCHEME= undefined
##.AVERAGES= 8
##.DIGITISER RES= 18
##SPECTROMETER/DATA SYSTEM= spect
##.PULSE SEQUENCE= zg30
##.SOLVENT NAME= CDCl3
##.SHIFT REFERENCE= (INTERNAL, CDCl3, 0, 15.7039)
##AUDIT TRAIL= $$ (NUMBER, WHEN, WHO, WHERE, WHAT)
$$ ##TITLE= Audit trail, XWIN-NMR		Version 3.5
$$ ##JCAMPDX= 5.01
$$ ##ORIGIN= Bruker BioSpin GmbH
$$ ##OWNER= she
$$ F:/spectra/data/she/nmr/H-F/1/audita.txt
$$ ##AUDIT TRAIL=  $$ (NUMBER, WHEN, WHO, WHERE, WHAT)
(   1,<2019-06-27 15:47:22.39 +0400>,<she>,<DPX200>,
      <created by zg, POWCHK disabled, PULCHK disabled
       configuration hash MD5:
       00 E9 B6 7A A2 85 ED C7 34 08 36 98 17 FE 4E 26
       data hash MD5: 16K
       6E 2F AF 45 85 FE CB 95 6C 84 78 D0 5D EE 51 17>)
$$ ##END=
$$ 
$$ hash MD5
$$ AA 6B F4 7B D2 89 CA 76 D6 7B 77 26 D0 D1 68 54
##$RELAX= 
##$RELAX= 
##$RELAX= 
##$RELAX= 
##$RELAX= 
##$RELAX= 
$$ Bruker specific parameters
$$ --------------------------
##$DU= <F:/spectra>
##$EXPNO= 1
##$NAME= <H-F>
##$PROCNO= 1
##$TYPE= <nmr>
##$USER= <she>
##$AMP= (0..31)
100 100 100 100 100 100 100 100 100 100 100 100 100 100 100 100 100 100 
100 100 100 100 100 100 100 100 100 100 100 100 100 100 
##$AQSEQ= 0
##$AQ_mod= 1
##$AUNM= <au_zg>
##$AUTOPOS= <>
##$BF1= 200.13
##$BF2= 200.13
##$BF3= 200.13
##$BF4= 200.13
##$BF5= 200.13
##$BF6= 200.13
##$BF7= 200.13
##$BF8= 200.13
##$BYTORDA= 1
##$CFDGTYP= 0
##$CFRGTYP= 5
##$CHEMSTR= <none>
##$CNST= (0..31)
1 1 145 1 1 1 1 1 1 1 1 1 1 1 1 1 1 1 1 1 1 1 1 1 1 1 1 1 1 1 1 1 
##$CPDPRG= <>
##$CPDPRG1= <>
##$CPDPRG2= <>
##$CPDPRG3= <>
##$CPDPRG4= <mlev>
##$CPDPRG5= <mlev>
##$CPDPRG6= <mlev>
##$CPDPRG7= <mlev>
##$CPDPRG8= <mlev>
##$CPDPRGB= <>
##$CPDPRGT= <>
##$D= (0..31)
0 1.2 0 0 0 0 0 0 0 0 0 0.03 0 0 0 0 0 0 0 0 0 0 0 0 0 0 0 0 0 0 0 0 
##$DATE= 1561636041
##$DBL= (0..7)
120 120 120 120 120 120 120 120 
##$DBP= (0..7)
150 150 150 150 150 150 150 150 
##$DBP07= 0
##$DBPNAM0= <>
##$DBPNAM1= <>
##$DBPNAM2= <>
##$DBPNAM3= <>
##$DBPNAM4= <>
##$DBPNAM5= <>
##$DBPNAM6= <>
##$DBPNAM7= <>
##$DBPOAL= (0..7)
0.5 0.5 0.5 0.5 0.5 0.5 0.5 0.5 
##$DBPOFFS= (0..7)
0 0 0 0 0 0 0 0 
##$DE= 6
##$DECBNUC= <off>
##$DECIM= 24
##$DECNUC= <off>
##$DECSTAT= 4
##$DIGMOD= 1
##$DIGTYP= 9
##$DL= (0..7)
0 120 120 120 120 120 120 120 
##$DP= (0..7)
150 150 150 150 150 150 150 150 
##$DP07= 0
##$DPNAME0= <>
##$DPNAME1= <>
##$DPNAME2= <>
##$DPNAME3= <>
##$DPNAME4= <>
##$DPNAME5= <>
##$DPNAME6= <>
##$DPNAME7= <>
##$DPOAL= (0..7)
0.5 0.5 0.5 0.5 0.5 0.5 0.5 0.5 
##$DPOFFS= (0..7)
0 0 0 0 0 0 0 0 
##$DQDMODE= 0
##$DR= 18
##$DS= 0
##$DSLIST= <SSSSSSSSSSSSSSS>
##$DSPFIRM= 0
$$ [...]
##$SUBNAM2= <"">
##$SUBNAM3= <"">
##$SUBNAM4= <"">
##$SUBNAM5= <"">
##$SUBNAM6= <"">
##$SUBNAM7= <"">
##$SUBNAM8= <"">
##$SUBNAM9= <"">
##$SW= 24.9336996594482
##$SWIBOX= (0..15)
0 0 2 0 0 0 0 0 0 0 0 0 0 0 0 0 
##$SW_h= 4990.01996007984
##$TD= 16384
##$TD0= 1
##$TE= 0
##$TE2= 300
##$TE3= 300
##$TEG= 300
##$TL= (0..7)
0 120 120 120 120 120 120 120 
##$TP= (0..7)
150 150 150 150 150 150 150 150 
##$TP07= 0
##$TPNAME0= <>
##$TPNAME1= <>
##$TPNAME2= <>
##$TPNAME3= <>
##$TPNAME4= <>
##$TPNAME5= <>
##$TPNAME6= <>
##$TPNAME7= <>
##$TPOAL= (0..7)
0.5 0.5 0.5 0.5 0.5 0.5 0.5 0.5 
##$TPOFFS= (0..7)
0 0 0 0 0 0 0 0 
##$TUNHIN= 0
##$TUNHOUT= 0
##$TUNXOUT= 0
##$USERA1= <user>
##$USERA2= <user>
##$USERA3= <user>
##$USERA4= <user>
##$USERA5= <user>
##$V9= 5
##$VALIST= <valist>
##$VCLIST= <CCCCCCCCCCCCCCC>
##$VD= 0
##$VDLIST= <DDDDDDDDDDDDDDD>
##$VPLIST= <PPPPPPPPPPPPPPP>
##$VTLIST= <TTTTTTTTTTTTTTT>
##$WBST= 1024
##$WBSW= 4
##$XGAIN= (0..3)
0 0 0 0 
##$XL= 0
##$YL= 0
##$YMAX_a= 599427
##$YMIN_a= -456105
##$ZGOPTNS= <>
##$ZL1= 120
##$ZL2= 120
##$ZL3= 120
##$ZL4= 120
##$ABSF1= 10
##$ABSF2= 0
##$ABSG= 5
##$ABSL= 3
##$ALPHA= 0
##$AQORDER= 0
##$ASSFAC= 0
##$ASSFACI= 0
##$ASSFACX= 0
##$ASSWID= 0
##$AUNMP= <proc_1d>
##$AZFE= 0.1
##$AZFW= 0.1
##$BCFW= 1
##$BC_mod= 2
##$BYTORDP= 1
##$COROFFS= 0
##$CY= 11.3945322036743
##$DATMOD= 1
##$DC= 2
##$DFILT= <>
##$DTYPP= 0
##$F1P= 18.9103706918063
##$F2P= -1.10871071338519
##$FCOR= 0.5
##$FTSIZE= 0
##$FT_mod= 4
##$GAMMA= 1
##$GB= 0.15
##$INTBC= 1
##$INTSCL= 1
##$ISEN= 128
##$LB= 0.24
##$LEV0= 0
##$LPBIN= 0
##$MAXI= 10000
##$MC2= 0
##$MEAN= 0
##$ME_mod= 0
##$MI= 1.114404
##$NCOEF= 0
##$NC_proc= 0
##$NLEV= 6
##$NOISF1= 3.799351
##$NOISF2= 2.8
##$NSP= 1
##$NTH_PI= 0
##$NZP= 0
##$OFFSET= 15.70392
##$PC= 1
##$PHC0= -8632.749
##$PHC1= -11.39902
##$PH_mod= 1
##$PKNL= yes
##$PPARMOD= 0
##$PSCAL= 0
##$PSIGN= 0
##$REVERSE= no
##$SF= 200.130013532006
##$SI= 16384
##$SIGF1= 3
##$SIGF2= 2
##$SINO= 400
##$SIOLD= 16384
##$SREGLST= <1H.CDCl3>
##$SSB= 0
##$STSI= 0
##$STSR= 0
##$SW_p= 3612.71676300578
##$SYMM= 0
##$S_DEV= 0
##$TDeff= 0
##$TDoff= 0
##$TI= <>
##$TILT= no
##$TM1= 0
##$TM2= 0
##$TOPLEV= 0
##$USERP1= <user>
##$USERP2= <user>
##$USERP3= <user>
##$USERP4= <user>
##$USERP5= <user>
##$WDW= 1
##$XDIM= 8192
##$YMAX_p= 0
##$YMIN_p= 0
$$ End of Bruker specific parameters
$$ ---------------------------------
##NTUPLES= NMR FID
##VAR_NAME=  TIME,          FID/REAL,        FID/IMAG
##SYMBOL=    X,             R,               I
##VAR_TYPE=  INDEPENDENT,   DEPENDENT,       DEPENDENT
##VAR_FORM=  AFFN,          ASDF,            ASDF
##VAR_DIM=   8192,          8192,            8192
##UNITS=     SECONDS,       ARBITRARY UNITS, ARBITRARY UNITS
##FACTOR=    0.0002004,     1,               1
##FIRST=     0,             0,               0
##LAST=      1.6414764,     0,               0
##MIN=       0,             -456105,         0
##MAX=       1.6414764,     599427,          0
$$ Real data points
##PAGE= N=1
##DATA TABLE= (X++(R..R)), XYDATA
0 0 0 0 0 8 -8 9 -16 16 -24 32 -40 48 -58 73 -91 113 -135 159 -188 222 -261 305 -354 405 -467 535 -610
27 -610 695 -785 888 -1002 1125 -1259 1410 -1576 1755 -1951 2167 -2404 2666 -2952 3267 -3614
43 -3614 4005 -4438 4924 -5465 6085 -6799 7626 -8599 9765 -11192 12984 -15313 18474
56 18474 -23029 30193 -43128 73704 -284074 -9701 503668 -287711 -904 425212 -237712
67 -237712 -406942 288911 84398 -182078 181593 85543 -251405 43538 110819 -88204
77 -88204 53827 44654 -185080 39361 181417 -53133 -40193 64280 -135208 -115271 152043
88 152043 148441 -37702 -66162 -14203 -51054 -100675 85357 227373 -59655 -199114 101781
99 101781 31994 -201497 143934 223875 -253863 -103255 264291 -80342 -151369 219553 -34465
110 -34465 -247460 155040 126449 -134084 100447 39314 -255320 40112 172766 -106726
120 -106726 84910 162635 -276559 -124011 259559 -57425 -113208 258337 -26947 -298134
130 -298134 119746 155591 -171895 28496 163537 -129710 -95942 131579 26980 -72568
140 -72568 730 5179 -10989 11514 32556 39981 -46667 -89966 35432 55119 -24003 42276
152 42276 29379 -95272 -20496 46109 -22723 52731 53717 -113595 -12235 95901 -86171
163 -86171 -10129 158222 -105216 -137581 187796 24091 -182752 124348 91554 -220784 28209
174 28209 195951 -117930 -62281 149604 -81541 -117416 135346 33870 -84301 55284
184 55284 -5188 -87056 62498 39677 -62476 40852 20319 -86091 32953 67149 -65657
195 -65657 -8710 61700 -43197 -33175 58901 10058 -38698 -8800 9287 16958 -3238 -10231
207 -10231 29946 -19736 -62876 58283 59790 -79953 -3232 70579 -74459 -34092 112225
218 112225 -15625 -75151 60053 -9088 -75121 73971 42733 -74036 23490 17986 -75919
229 -75919 49936 69127 -86842 -2934 73647 -76801 -20815 114327 -40396 -84130 77826
240 77826 6554 -79267 66118 53814 -86528 -16536 49395 -19903 3128 41536 -23164 -36115
252 -36115 4393 9637 20179 11641 -19647 -6223 -4113 -17483 25581 31085 -23755 -15898 86
265 86 -17393 23593 36984 -25251 -17498 4833 -30321 19143 61559 -32319 -38532 36802 -26521
278 -26521 -37111 78680 24025 -74518 12870 23209 -58233 28924 75025 -47755 -42112 34584
290 34584 -18392 -11447 58199 -5777 -47228 15353 72 -19425 40317 16595 -41390 -1877
302 -1877 8017 -21000 25563 36293 -31479 -28924 12345 1476 6301 24463 -4522 -27494 -11211
315 -11211 8408 17485 9393 -3267 -3283 -18610 -20313 25655 31811 -12609 -10108 -3242 -29070 6217
329 6217 47164 -1685 -24783 4726 -16743 -16696 38340 18341 -24191 3050 -5714 -32705 23035
342 23035 40756 -18780 -14148 5957 -27632 -238 48734 741 -31403 3610 -5977 -16946
354 -16946 28080 24649 -19076 -11873 -3398 -15022 11369 30690 699 -18451 -13636 -9363 9557
367 9557 24304 6890 -13225 -15933 -8828 7119 16265 9318 -1737 -15011 -17750 4103 18012
380 18012 11099 5277 -12309 -29342 -1673 27871 12206 -408 -3563 -25677 -15322 25235 19512
393 19512 -3219 1489 -13474 -27555 8503 29123 6355 -1347 -8751 -29134 -5194 32078 16861
406 16861 -6736 -8943 -19352 -12110 20970 22659 -1468 -8766 -13720 -15912 6377 24660 12718
419 12718 -7378 -18903 -16977 3022 22083 18632 -3104 -22355 -17696 4777 16910 14111 4369
432 4369 -14610 -21610 -1746 14316 13946 10855 -6525 -27028 -11643 16531 18299 10073 -3718
445 -3718 -25232 -16892 15007 20210 7191 -960 -16642 -19864 4989 18313 10826 4532 -10904
458 -10904 -24250 -4847 18836 16569 5823 -9825 -24154 -8255 17795 16717 4243 -5944
470 -5944 -17831 -11214 9946 14796 7498 -466 -14515 -15508 3701 14809 12693 2784 -16318 -19008
484 -19008 4287 16041 9552 3124 -11489 -18424 1874 14363 5640 4192 -2214 -17636 -7036
497 -7036 12738 8918 5025 1212 -17858 -13368 13595 13592 1355 -266 -11994 -14092 10542 14873
511 14873 -2050 -1399 -3216 -12769 695 13595 4007 -733 -3917 -12910 -2022 13674 7439 -60
525 -60 -5989 -14936 -707 16382 4138 -3640 641 -10363 -7617 13532 5791 -6056 4911 -2989
539 -2989 -13781 7630 12284 -5829 -1140 -1084 -11379 8468 17224 -9078 -9682 2789 -8390 3303
553 3303 22268 -3789 -16646 4311 -3498 -9621 17601 12724 -13205 -4617 -469 -9063 9134
566 9134 14512 -8416 -8174 1501 -1248 8289 7544 -13771 -8338 6815 251 6951 13922 -10448 -17550
581 -17550 500 54 5594 20949 2037 -18606 -10412 -5796 5384 22650 3095 -14933 328
594 328 -4408 -9775 17684 8571 -21314 3052 14015 -13800 4095 20209 -20618 -20829 16178
607 16178 6134 3407 21673 -11375 -33957 239 10287 6998 24924 1317 -30128 -5424
619 -5424 3240 -9020 20736 22915 -21627 -13801 10048 -8097 137 20439 -8884 -19542 10611
632 10611 12196 1671 1446 -14131 -15399 6222 9881 14127 16271 -17225 -28395 959 2452 4815
646 4815 33279 8370 -35080 -13565 5193 -3549 18018 18555 -17070 -10057 5510 -8483 6110
659 6110 13507 -17845 -4770 20296 -8650 -2796 25281 -19514 -35720 21344 18162 -8112 22785
672 22785 4758 -46294 -10687 25879 2984 10187 17296 -20142 -20366 3649 -1971 11074 20595
685 20595 -12434 -12929 9120 -8518 -2657 22604 -9352 -23926 17385 13893 -10299 6111 -1611
698 -1611 -22796 1486 15467 5218 11524 -3324 -23566 -2413 2832 -3976 26832 16124 -33816
711 -33816 -10374 17882 -14373 684 31777 -12554 -23831 19033 2043 -17036 14524 4392
723 4392 -17252 7474 5861 -6934 13943 -2684 -26162 10093 14300 -13508 15023 15061 -34800
736 -34800 -8758 28748 -9325 -8220 26396 -7057 -24687 10915 4636 -8177 13219 2230
748 2230 -13618 3757 -638 -3841 15464 -4968 -19246 16161 8143 -20297 11084 13766 -24072
761 -24072 -121 20337 -13217 -4157 18536 -9998 -11305 10693 -4036 570 13863 -13909 -8558
774 -8558 19343 -9577 -12464 24766 -4622 -24599 22248 8558 -30266 11956 22360 -24019
786 -24019 -4087 20168 -12476 -5634 16472 -8049 -6942 11488 -6286 -2722 11239 -11191 -2855
799 -2855 19411 -12263 -14894 22399 -184 -19217 15906 5091 -21390 9801 13353 -16048 1385
812 1385 10722 -10320 676 5783 -9595 7762 8845 -18113 2399 16021 -15882 -1292 20716
825 20716 -17112 -13078 26587 -2516 -20312 16112 3334 -19265 10533 9164 -12141 8263
837 8263 4004 -17697 5218 8924 -10146 11669 9045 -25175 762 20428 -15966 -4443 24326
850 24326 -10424 -15527 18230 -2761 -16949 14495 5758 -13959 6963 6141 -8186 3774 -3170
863 -3170 -11930 12446 9250 -9487 6899 1303 -21640 4301 16556 -9931 3016 16474 -14547
876 -14547 -13332 9394 -3192 45 15887 -5261 -9275 8845 -6887 -9237 13512 -2218 -8744
889 -8744 19923 2120 -22792 6838 6896 -19025 8208 20998 -10701 -3052 9468 -18044 -10704
902 -10704 17895 4655 -435 9357 -9836 -12551 7198 -3216 -4535 17401 3568 -11532 5339
915 5339 -3307 -16416 8462 11636 -7918 5559 10509 -11496 -7714 1204 -6875 5790 15565 -1508
929 -1508 -3432 -341 -13368 -3812 11185 -841 3120 14705 -7917 -16505 3904 -956 -4876 14634
943 14634 6878 -9456 3016 -667 -15280 994 9031 -283 9730 6185 -15625 -5826 5240
956 5240 -8120 2445 17453 -1826 -6500 5090 -10672 -12563 12899 8579 -5165 6130 1985
969 1985 -11801 -1468 1892 -5435 6167 11020 -2432 -2883 -2082 -9100 -394 7471 77 3546 7365
984 7365 -6231 -8543 -455 -2227 3156 10713 -53 -5525 1299 -3765 -5082 4674 1061 -1065 8684
999 8684 575 -9775 1059 1433 -7026 4456 8398 -3818 1305 4324 -11348 -7088 9091 3674
1013 3674 511 5685 -4388 -9187 2434 1519 -2570 6181 4289 -4743 -1464 -995 -4146 3561 4659
1028 4659 -3645 -475 3524 -1912 -961 611 -4285 391 6427 101 -2246 796 -3074 -2270 3073
1043 3073 345 600 4711 -2027 -6261 941 1766 276 4453 -656 -6563 1510 3843 -2628 576
1058 576 2118 -3779 36 3817 -2887 -446 4633 -3332 -4783 3493 1312 -311 3882 -2922 -6717
1073 -6717 3622 4605 -2566 866 1210 -4765 -34 4079 -1970 -590 3975 -2140 -4356 1443 2179
1088 2179 861 1247 -1970 -2891 1138 2239 858 -941 -2270 472 1999 -1484 -344 2437 -1296
1103 -1296 -1522 2331 -1211 -1545 4601 -506 -6334 1835 4225 -1922 1417 1321 -6666 -174 6745 -1972
1119 -1972 -2650 4748 -1450 -5090 3031 1252 -2591 3921 1660 -6757 -837 4926 -393 -674 1323
1134 1323 -2764 -1227 3430 464 -2395 411 908 -650 -670 187 1347 801 -1175 -1083 -757 409 3159
1151 3159 297 -3985 -54 2607 -1038 323 1822 -3001 -525 4161 -2389 -2917 4933 26 -4626
1166 -4626 2577 860 -3672 4375 2516 -7645 196 6546 -2954 -1528 4431 -3841 -3016 6257 -843
1181 -843 -5163 4776 2406 -6010 717 3239 -2602 1239 3317 -4136 -2824 4448 1837 -2522 -250
1196 -250 1017 -715 -675 1320 178 -1834 1298 2443 -3806 -2246 5712 176 -5248 2950 1350 -5355
1212 -5355 4159 4783 -8527 -674 8842 -5030 -4664 8216 -2238 -6686 8062 450 -9827 6545
1226 6545 6283 -10024 354 7848 -6017 -1149 7782 -6000 -5372 9085 278 -6792 4443 1984
1240 1984 -5570 2303 2994 -4379 1126 4331 -3111 -3413 1947 1840 -66 -622 -112 -239 -1395 1479
1256 1479 1911 -3694 -480 5887 -2962 -5005 6068 621 -6086 5749 1779 -9724 5374 8028
1270 8028 -10964 -1113 10825 -7354 -4189 11995 -5925 -9244 13414 325 -13853 9114 7008
1283 7008 -12992 3924 9149 -11889 -225 12980 -8279 -7300 11378 -1273 -7815 7420 701
1296 701 -8202 5001 4425 -7114 285 5453 -2203 -2333 1557 33 -444 563 939 -836 -3206 2755
1312 2755 4386 -5744 -2315 7777 -3488 -6038 8880 -790 -9908 9470 4136 -15078 5059
1325 5059 12595 -12656 -1690 13584 -10930 -6557 17157 -5418 -13191 15541 2011 -16526 9455
1338 9455 6887 -15054 6580 11675 -15247 -1170 14964 -9222 -6900 12949 -3875 -8264 11197
1351 11197 -81 -11402 6310 5606 -7423 897 4960 -3413 -681 2069 -1850 -314 1378 1719
1365 1719 371 -4448 -279 5960 -3062 -3558 6656 -2460 -6401 8729 48 -11061 9176 6175
1379 6175 -14407 3589 10970 -12829 255 15107 -12989 -7324 19354 -6084 -15373 16326 2131
1392 2131 -17076 12882 8380 -19690 5100 14473 -15808 -2402 17219 -8160 -7536 12539 -6014
1405 -6014 -10212 13070 2768 -10380 5779 3394 -8702 2107 3877 -4767 2616 5202 -3304
1418 -3304 -2636 -224 -744 1783 -844 461 5466 -2311 -4862 3726 -4312 -6126 12656 4532 -11834
1433 -11834 5465 4852 -16091 2218 13779 -9781 387 16455 -12804 -13402 15013 -2289 -11172
1446 -11172 17130 3734 -16529 8932 4746 -20187 5092 16791 -10043 939 13584 -14646
1458 -14646 -10225 13420 -4173 -7023 17200 3882 -13439 1324 -612 -9916 6754 10677 -2799
1471 -2799 354 1547 -7105 -4470 186 1740 7249 3976 -2460 -777 -5998 -7275 5405 3365 -1593
1486 -1593 10667 3426 -14641 -2787 2396 -8932 8467 16995 -8534 -5094 8753 -14196 -11432
1499 -11432 17787 3373 -6787 15658 -1271 -23350 4442 8833 -12724 8470 18194 -11000
1511 -11000 -5902 7310 -14730 -8270 18540 4695 -4654 9334 -4113 -16265 1609 3377 -2747
1524 -2747 11667 9641 -8261 -6584 -3144 -6498 3257 8986 2768 2977 -93 -7978 -4858 -2519 -677
1539 -677 10434 7463 -4174 335 -2151 -12878 223 9145 -1756 6520 11543 -12276 -12589 5701
1553 5701 -3718 -2384 17736 2959 -11640 4985 -2640 -16948 7069 13404 -5577 4901 8012
1566 8012 -15439 -6828 9797 -5979 -2196 16768 768 -9694 3115 -5379 -10961 9198 9281
1579 9281 -3532 3928 1926 -10874 -3871 3019 -707 6137 7707 -3870 -4557 -2254 -4553 1847
1593 1847 4927 -113 3930 3161 -7125 -3561 1388 -3916 3698 9054 -3804 -2657 4949 -7159
1607 -7159 -6817 8195 1501 -2417 9518 -1501 -12993 3195 4441 -7117 5576 8246 -7944
1620 -7944 -963 5408 -8907 -2681 10922 -1557 -4199 6781 -2777 -6822 5520 -226 -5854 6863
1634 6863 4205 -6167 677 779 -5723 3133 4973 -3929 845 3395 -4763 -1585 2959 -2045 1893
1649 1893 4265 -4408 -2250 3713 -2066 -555 3971 -3075 -1789 5061 -2464 -4008 4957 -175 -3673
1664 -3673 4345 -525 -5389 5105 2204 -6578 2527 4102 -5119 1294 3554 -6367 747 7310 -4425
1679 -4425 -3006 5398 -3005 -3365 5888 -1172 -3969 5925 -17 -6718 2811 2362 -3572 3406 2256
1694 2256 -5522 1320 3601 -4626 -481 3937 -1919 599 3063 -4211 -1637 3917 -1939 -1331 4000
1709 4000 -909 -1649 2770 -3167 -3326 5067 1236 -2528 2646 -861 -4207 3250 727 -4383 3650
1724 3650 3518 -4395 153 1580 -4421 1735 4617 -4054 -722 4983 -3322 -2787 3681 -2188 -1432 5937
1740 5937 -1427 -5186 3757 392 -4185 3294 1493 -4039 3198 2007 -5966 416 4305 -2748 71
1755 71 3073 -3455 -634 3962 -2735 -2427 3871 -227 -1717 2159 -1535 -1891 3341 -229 -2891 2104
1771 2104 596 -1560 1851 -972 -2694 3057 1212 -3266 1620 1211 -2692 2120 1202 -4415 1972
1786 1972 3975 -4051 -793 3351 -3085 -414 4707 -3354 -2918 5244 -949 -4338 3658 704 -3443
1801 -3443 3479 601 -5488 2531 3731 -3664 208 2634 -2920 300 2804 -3095 -546 4174 -1208
1816 -1208 -1879 1592 -1544 -473 3004 -1465 -1770 2758 -462 -2010 1552 -995 -955 3877 -529 -3671
1832 -3671 2163 525 -2622 2440 882 -3229 2671 1761 -5129 718 3705 -2705 332 2897 -4036
1847 -4036 -718 4915 -2542 -2958 4035 -536 -2546 3324 -1023 -3292 3793 841 -4383 1821 2110
1862 2110 -2565 1507 975 -3588 1611 3044 -3108 -178 2135 -2074 302 2005 -3187 107 3772
1877 3772 -2024 -1294 2393 -1994 -664 3687 -2605 -2358 4866 -540 -3897 3043 -107 -3325 4255
1892 4255 1059 -5596 2509 3294 -4709 681 3745 -3641 389 4014 -4206 -1978 5204 -1053 -2418
1907 -2418 2840 -1389 -2012 3513 -592 -3133 2841 848 -2597 1359 -278 -1747 2978 242 -3385
1922 -3385 1842 959 -2489 2408 310 -3820 3196 2294 -5221 1009 3852 -3911 798 4032 -5380
1937 -5380 -860 6753 -3465 -3817 6000 -1238 -4597 5247 -195 -5784 5455 2506 -6834 1825 3908
1952 3908 -4780 1367 4271 -5286 -423 5491 -3563 -2533 4470 -1409 -1893 3500 -1960 -2574 3972
1967 3972 -98 -2839 2210 -317 -1604 2664 -1367 -2619 3650 234 -2910 2596 -972 -3246 4483
1982 4483 508 -5232 3628 2562 -5978 2165 3486 -5782 2293 5721 -7428 -1895 7796 -3813
1996 -3813 -2983 7426 -3429 -5646 7690 -766 -7573 6697 3012 -7794 3156 3489 -7153 2704
2010 2704 6123 -7139 -1274 6599 -3556 -2230 4906 -3103 -2753 5305 -1275 -3454 3853 -214 -3131
2025 -3131 2158 -1014 -1448 4404 -394 -3643 2236 -737 -2314 4261 -770 -4102 5125 1011 -6327
2040 -6327 3230 2022 -5998 4084 4549 -7495 1805 6550 -8191 -2257 8181 -3983 -1733 9199
2054 9199 -5361 -8107 8144 297 -6854 8336 2817 -9337 3481 2977 -9030 3756 8627
2067 8627 -6462 -1401 5507 -5681 -2011 6706 -3522 -3071 6884 -908 -4384 3181 -1656 -3533
2081 -3533 4325 494 -2312 4169 -352 -4785 972 -838 -1158 6587 664 -5591 2176 -669 -5476
2096 -5476 4881 3244 -5455 4625 3573 -9463 297 6615 -6474 459 9105 -5961 -3224 9093
2110 9093 -5970 -8539 9607 1527 -5826 8711 629 -12395 3655 5044 -8003 4795 9520
2123 9520 -7633 -3080 4408 -7140 -1095 10622 -1652 -4744 4873 -2658 -5361 4575 303 -2877
2137 -2877 5227 1089 -4364 1319 -597 -3101 3123 613 -1684 4992 172 -5986 1129 -371 -3293
2152 -3293 7016 3372 -7060 1802 2475 -8420 1785 7741 -5516 546 7679 -8377 -5134 9506
2166 9506 -2913 -5745 9304 -764 -7761 7877 927 -11478 5218 6755 -7628 3090 6959
2179 6959 -9088 -2184 7081 -5663 -1777 10225 -1990 -6280 3954 -2304 -4294 6835 1897
2192 1897 -4845 2615 706 -4615 1981 1464 -2174 3304 930 -4176 1554 1080 -3083 2584 812
2207 812 -4116 3801 2605 -6020 1238 3288 -5379 2052 5848 -6427 -800 7030 -5680 -3848 8272
2222 8272 -2168 -5019 7687 -1690 -8207 7540 3185 -8780 3872 5058 -7964 1858 6324
2235 6324 -7354 -677 8003 -5005 -3528 6978 -2398 -4111 5894 -1472 -5383 5609 1500 -5410
2249 -5410 2544 1742 -3852 2279 1796 -3751 1603 2490 -3151 262 1522 -2137 2123 1547 -4262 1078
2265 1078 2576 -3351 1224 3110 -4331 304 4530 -4750 -1645 6562 -2399 -3425 4999 -2473 -4186
2280 -4186 7119 227 -6824 4256 2188 -6531 3495 4258 -6336 1514 5024 -6838 -1003 7358
2294 7358 -3007 -3074 5025 -3228 -3721 6414 -35 -5135 3467 1095 -4086 2754 1564 -4009 2064
2309 2064 2097 -3935 1477 2962 -2994 -380 1037 -2907 2069 4377 -2662 -1901 800 -2798 822 4572
2325 4572 -1507 -772 2504 -3948 -2863 4525 343 -1001 4063 -2738 -5252 4622 1825 -4559 2788
2340 2788 1841 -4652 2867 3646 -5964 -661 3971 -3841 28 6620 -1917 -3261 2158 -4105 -3146 7601
2356 7601 3228 -3552 806 -2197 -5396 3542 3986 -1981 1931 1700 -5158 -1038 2403 -1337 1254
2371 1254 2727 -2497 -236 2912 -2056 -2222 517 -1664 1693 5594 -991 -3521 -380 -3427 -1381
2386 -1381 5828 2806 -902 1677 -3737 -6765 2748 4626 140 2867 -89 -6438 -143 3130 -2536
2401 -2536 650 3978 -2451 -902 3344 -2925 -3081 3045 -1342 -1804 5745 1973 -3693 -999 -2821
2416 -2821 -3769 4923 5943 -1063 -883 -1813 -5382 71 4032 912 2115 1748 -4354 -3091 1750 64
2432 64 1038 2720 -2037 -1384 3018 -786 -2818 571 -765 -88 4536 1191 -2996 -78 -1947 -3734
2448 -3734 3046 4422 70 1037 -1412 -6578 -634 4752 883 979 1597 -3885 -2461 2444 -634 -858
2464 -858 3182 -148 -2458 1308 53 -1785 1240 -493 -2075 2646 2717 -1477 -861 -1580 -2835 2088
2480 2088 3702 -612 122 -8 -3357 -1099 2144 175 1552 2256 -2916 -2641 1964 163 -292 2196
2496 2196 -1256 -2041 2706 247 -2722 1329 739 -2080 1801 1728 -2377 567 1457 -3046 -394 3242
2512 3242 -332 -529 1041 -2323 -1327 2937 370 -1474 1059 -53 -1512 1007 -68 -1179 1405
2527 1405 753 -1520 63 430 -539 792 0 -1246 1192 660 -1326 145 272 -956 1630 948 -2848
2544 -2848 63 1951 -1252 20 1947 -2077 -963 2500 -1325 -1608 2902 56 -2711 1541 692
2559 692 -1739 2134 1039 -3724 169 3068 -1049 -197 1319 -2434 -944 2921 55 -902 1466 -794
2575 -794 -2384 643 1334 549 1438 -721 -2772 -208 1494 1160 815 -1149 -1665 277 610 287 1217
2592 1217 -625 -1652 419 27 -105 2452 530 -3591 -687 1553 29 2293 1582 -4286 -2050 2661
2608 2661 96 366 2863 -2008 -3629 1652 708 -905 3585 837 -4751 -719 2261 -157 1884
2623 1884 1615 -4266 -2349 2984 1207 -17 1249 -1840 -2930 885 1687 733 1474 -760 -3116 -1265
2639 -1265 1453 2575 1913 -1592 -3008 -838 640 2114 2419 -1471 -2924 112 -31 129 3470 681
2655 681 -3680 -851 364 -902 3451 3011 -4351 -3024 1989 -34 1283 3900 -2562 -4555 1898
2670 1898 1086 -813 3647 895 -4800 -936 1600 -492 2672 2707 -4191 -3355 1931 1264 1363 2130 -2414
2687 -2414 -3392 791 1397 873 1813 -602 -2724 -1000 309 1799 2789 -260 -2708 -1473 -468 1952
2703 1952 3528 -951 -3213 -239 -412 -147 3549 943 -3496 -95 227 -2238 2890 3995 -3392 -2498
2719 -2498 1490 -1764 808 5259 -2030 -4994 1847 808 -1529 3739 1478 -4602 -294 1690 -1943
2734 -1943 1830 3850 -2871 -3092 1101 32 904 3419 -1454 -3681 428 917 176 1891 112 -2013
2750 -2013 -641 -13 265 1942 491 -1104 -1033 -1700 541 3506 27 -2297 365 -976 -1269 3382
2766 3382 1294 -3522 617 1166 -3233 1309 3853 -2228 -1429 1948 -2675 -677 5128 -539 -3861
2781 -3861 1742 -239 -2217 3774 1380 -4356 916 2047 -3444 716 4067 -2269 -1834 2041 -1767
2796 -1767 -1145 3811 273 -3081 216 539 -477 1540 353 -1327 267 -157 -640 1205 256 -505
2812 -505 720 -1024 -1625 1965 1001 -1307 589 -631 -1817 2038 1275 -2493 943 1394 -2837 781
2828 781 2474 -2900 114 3834 -3070 -2498 4461 -277 -3479 3191 408 -3994 2748 2189 -4087 618
2844 618 3102 -2545 -427 2397 -2061 -356 2941 -1754 -1579 2656 -665 -1568 2091 -820 -1796 2470
2860 2470 496 -2291 1082 1010 -1516 -29 181 -387 1455 457 -1429 98 -770 -1004 2760 716 -2537
2877 -2537 1511 970 -3749 625 3489 -1728 -207 2436 -3080 -1767 4087 -267 -2367 2212 -707
2892 -707 -1967 3415 156 -3717 2086 964 -3406 2652 3425 -3418 -681 1742 -3842 -153 5999
2907 5999 -27 -3017 483 -1627 -1957 3204 1781 -914 551 -1181 -2115 1185 543 -279 2094 -691
2923 -691 -2438 2137 1498 -2484 -20 148 -1630 2715 3283 -2375 -1922 -742 -2638 1805 4300 -12
2939 -12 -65 92 -5632 -2121 5448 1540 -435 2830 -3203 -5279 3362 2681 -2904 1792 2015 -3472 540
2956 540 2434 -2612 -780 1343 -1907 1163 4482 -817 -2343 -919 -4090 -349 6850 2619 -2274
2971 -2274 -705 -3320 -4086 3054 4208 581 997 -1244 -4184 -608 1765 1072 2257 -95 -2830 1558
2987 1558 1747 -2750 -310 795 -2561 1881 5335 -1567 -3128 182 -3422 -1553 5776 3408 -799
3002 -799 -344 -4535 -5061 3280 4255 801 2067 -1526 -5717 566 3034 -1759 1480 3184 -3177 -1562
3018 -1562 3219 -1344 -1985 1536 -1221 -979 4276 1803 -2348 -1978 -3049 -1084 4686 3314 -348 -60
3034 -60 -3107 -4607 1838 3605 756 2253 242 -5072 -1540 2712 247 1040 1414 -2456 -372 2338
3050 2338 -1537 -1165 1302 -1832 -62 4383 -180 -2555 1019 -2185 -3633 3959 4141 -1264 45
3065 45 -1011 -5015 493 4583 274 134 749 -3104 -1336 2114 -470 233 2425 -1742 -1973 2214
3081 2214 -60 -1445 1590 -827 -2101 2812 2017 -1875 -532 -518 -1643 1823 2178 -913 277 -316
3097 -316 -2534 455 1934 -727 1226 1167 -3347 -722 3017 -596 -879 2008 -1534 -1532 2745 -58 -2322
3114 -2322 1702 293 -2074 1780 744 -2153 1346 684 -2762 999 2518 -2094 -536 1600 -2099
3129 -2099 -263 3253 -998 -2173 1741 -99 -1497 1661 349 -1385 902 -9 -1594 838 741 -748
3145 -748 820 -122 -1361 1291 670 -2144 454 1481 -806 686 687 -2523 -298 1910 -579 113 1652
3162 1652 -1572 -1110 1418 -1270 -388 3061 -633 -2488 1467 -91 -1684 2343 520 -3180 1229
3177 1229 2346 -2060 -150 1194 -2034 -256 2424 -685 -378 1484 -1777 -1897 1631 664 163 1947
3193 1947 -1486 -2940 1172 1350 -429 1177 243 -2083 352 861 -928 608 822 -1249 -192 856
3209 856 -80 857 201 -2386 -236 1702 39 671 815 -2543 -1384 2340 113 -364 1932 -898 -2464
3226 -2464 1046 567 -471 2150 193 -3145 156 1657 -659 1152 870 -2854 -369 2507 -688
3241 -688 -626 1501 -1332 -1734 1609 400 -618 1301 -620 -2333 600 1367 245 897 -841 -2216
3257 -2216 817 1300 -361 813 74 -1979 202 1049 -805 966 1298 -1933 -1164 1279 74 585
3273 585 1326 -1771 -1481 1533 381 -415 1380 -870 -1815 1392 495 -1133 1429 653 -2310 -128 1352
3290 1352 -429 1046 861 -2304 -900 1713 25 95 1045 -1434 -998 1384 -248 -486 1655 -186
3306 -186 -1736 474 206 -485 1430 394 -1954 277 992 -342 580 122 -1473 527 983 -885 466
3323 466 964 -1409 -409 1067 -1000 189 2067 -1229 -1709 1200 178 -480 1467 -305 -1838 1062
3339 1062 587 -1421 828 934 -1325 276 691 -1394 371 1692 -1203 -1056 1168 -156 -179 1231
3355 1231 -707 -1098 1141 202 -721 695 49 -484 526 -422 -675 1297 446 -1236 302 -88 -957
3372 -957 1142 593 -1384 376 937 -1293 33 1030 -940 196 1180 -1408 -638 1913 -338 -962 1017
3389 1017 -675 -915 1877 161 -1927 1043 768 -1491 545 1000 -1227 477 1005 -1724 -217 1738
3405 1738 -296 -585 626 -926 -549 1631 -176 -988 824 -80 -740 691 -23 -397 805 -83 -1228
3422 -1228 481 753 -88 439 -470 -1214 931 741 -910 336 179 -1145 496 1051 -1142 290 1382
3439 1382 -1504 -870 1579 -247 -393 1325 -1051 -1637 1908 667 -1489 928 442 -1690 665 1122
3455 1122 -1420 194 1209 -1513 -636 1386 -245 -129 944 -1256 -956 1643 374 -772 491 -342
3471 -342 -710 990 365 -726 589 -24 -1104 342 588 -119 718 -303 -1412 460 751 -430 568
3488 568 -40 -1625 641 1258 -1219 -4 1220 -1224 -579 1472 -644 -475 1631 -786 -1802 1468
3504 1468 704 -941 977 -396 -1869 1232 1463 -1336 277 1091 -1547 -400 1419 -773 -185 1505
3520 1505 -838 -1665 1209 581 -399 365 -409 -710 932 346 -668 16 -379 -559 1043 381 -591 800
3538 800 -82 -1679 201 993 -27 840 149 -1853 -226 1144 -397 348 740 -1276 -309 1180 -1248
3555 -1248 -542 2165 -592 -1502 1556 139 -1677 1089 259 -2168 968 2096 -888 -494 395 -1568
3571 -1568 81 1625 -507 56 1045 -1111 -1218 1106 -104 -179 1606 -332 -1499 862 792 -736 140
3588 140 203 -378 691 343 -586 -196 -389 -399 1099 413 -560 1023 -5 -2409 202 1754 -290 518
3606 518 1074 -1970 -1158 1607 -172 -717 1486 -193 -978 818 -384 -1278 1586 349 -1494 1054
3622 1054 1007 -1476 336 692 -2048 339 2603 -706 -1219 768 -611 -965 1204 535 -400 702 -344
3639 -344 -980 270 170 342 1135 -502 -1140 997 340 -1152 474 359 -921 774 773 -1207 -217 465
3657 465 -747 164 754 -532 526 456 -1889 -218 1833 -477 -294 1543 -1202 -1467 1966 96 -1715
3674 -1715 1087 975 -1645 141 906 -1146 211 947 -967 -178 1063 -671 -182 510 -1003 33
3690 33 1709 -702 -905 1045 -188 -830 1126 172 -966 625 374 -906 211 391 -143 402 -356
3707 -356 -777 1111 396 -1315 498 607 -1267 521 1188 -1652 -233 1879 -808 -958 1256 -178
3723 -178 -887 953 -181 -981 1159 221 -1178 495 166 -823 1127 348 -1900 427 1193 -1135 -119
3740 -119 1109 -877 -455 956 -569 -462 923 -147 -718 350 -118 238 845 -792 -833 971 33
3757 33 -630 979 -297 -1234 1127 532 -1428 682 884 -1241 -80 699 -687 303 993 -1252 -469
3774 -469 1078 -424 -130 1162 -1166 -880 1477 -273 -1282 1165 500 -1287 587 561 -1068 534
3790 534 869 -1156 -273 921 -175 25 35 -1186 149 1083 -475 23 667 -993 -518 777 -597
3807 -597 -327 1610 -20 -1404 117 -66 -402 1093 368 -931 718 73 -1256 308 354 -824 998
3824 998 871 -1417 -3 1096 -1228 -677 1439 -130 -172 1165 -835 -1793 701 614 -326 1052 332
3841 332 -1106 220 -335 -1095 1076 1276 -656 -22 -33 -1386 23 998 -568 -81 1298 -350 -673
3858 -673 40 -711 -169 1074 113 -110 707 -570 -960 285 -503 -197 2028 516 -1646 -198 -355 -1118
3876 -1118 939 1415 -504 283 234 -1702 -634 1126 72 384 833 -1205 -527 1108 -567 -1022 1144
3893 1144 384 -454 1113 -189 -1712 115 308 -785 893 1430 -548 -453 -599 -1383 508 1982 233
3910 233 -298 -224 -1298 -346 1079 -76 100 943 -476 -1048 350 324 -250 400 -370 -569 1077 496 -704
3929 -704 -368 -611 -539 1550 1199 -781 -53 -327 -1476 241 1790 159 155 226 -1738 -988 1452 783 -83
3948 -83 345 -881 -810 1255 395 -937 520 -30 -990 810 857 -815 -57 249 -1318 69 1830 -62
3966 -62 -592 -445 -1123 -36 1634 498 -587 -359 -900 -495 883 487 -201 273 -720 -1014 808 925
3984 925 -53 135 -697 -1075 855 1301 -248 -173 -448 -952 652 1231 -499 1 281 -1391 -310 1570
4002 1570 259 -440 470 -1145 -1135 1618 1258 -863 -80 -295 -1019 876 1297 -541 -135 147 -970 -23
4020 -23 1267 -76 -147 265 -999 -363 1411 586 -631 -269 -420 -237 1069 269 -589 -183 -455 -177 889
4039 889 280 -298 161 -582 -1087 843 1163 -309 -64 -295 -1192 333 1331 -549 -428 398 -656 -195
4057 -195 1023 -255 -560 745 -485 -630 1194 343 -1033 210 -123 -757 1163 1256 -1230 -660 430
4074 430 -454 182 991 -423 -425 404 -303 -461 757 192 -474 84 -298 -205 946 112 -813 -177 227 216
4094 216 618 -89 -921 87 58 -103 547 140 -676 182 -108 -827 749 1091 -996 -466 631 -616 54
4113 54 1214 -879 -1124 1105 275 -634 734 -89 -1192 419 624 -655 372 598 -991 -401 722
4130 722 -60 347 742 -1096 -802 646 361 47 413 -582 -691 573 331 -268 459 -248 -710 96 303
4149 303 172 645 -324 -1167 95 591 176 481 -248 -1200 283 959 -343 391 369 -991 -210 706 -263
4168 -263 90 953 -1023 -955 844 355 -244 741 -532 -1503 911 915 -742 207 299 -1182 -112 1026 -233
4187 -233 -55 777 -843 -900 830 427 -101 276 -588 -787 624 672 -122 -221 -427 -397 330 326 33 310 -183
4208 -183 -644 169 135 84 772 -169 -1320 173 805 -161 216 311 -1074 -150 1065 -343 -323 663 -439
4227 -439 -902 709 63 -355 895 -73 -1247 489 957 -357 185 275 -896 42 785 -495 -323 525
4245 525 -283 -289 619 -157 -3 640 -312 -684 444 240 -170 290 -232 -516 527 180 -621 280 327 -301
4265 -301 164 -56 -604 504 326 -513 -40 289 -543 222 505 -761 9 752 -518 -535 786 -70 -332
4284 -332 748 -326 -915 892 567 -808 180 141 -625 424 747 -465 -58 647 -758 -254 651 -29
4302 -29 -146 343 -543 -617 779 451 -247 -259 -420 -172 634 242 -363 89 -500 -441 581 270 -121 478 -324
4323 -324 -1045 459 985 -195 -112 -43 -903 126 1247 -145 -403 196 -466 -211 842 23 -389 385 -581
4342 -581 -844 990 937 -450 -30 -509 -1120 760 1336 -281 -499 -106 -612 22 969 153 -252 139 -630
4361 -630 -378 666 416 -34 -155 -680 -238 1052 474 -589 -478 -429 -73 987 561 -491 -349 -497 -721
4380 -721 680 889 20 -13 -489 -1283 276 1541 44 -227 115 -1020 -200 1205 96 -767 369 -68
4398 -68 -450 783 508 -720 -300 -114 -462 972 1334 -416 -849 -622 -599 870 1569 106 -779 -365 -521
4417 -521 -192 863 324 -138 24 -434 -283 468 319 -341 -216 -344 214 1092 124 -1011 -555 -126 241
4436 241 1322 831 -892 -729 -500 -539 640 1425 64 -429 -363 -1066 24 1406 233 -568 327 -318
4454 -318 -322 709 -123 -1162 304 702 -17 517 371 -1218 -885 243 117 941 1199 -506 -1475 -662 48
4473 48 846 1071 63 -663 -307 -311 29 441 216 -126 50 -67 -31 537 -154 -706 -98 249 589 1169 51
4494 51 -1579 -750 281 486 1042 857 -942 -956 -101 -423 447 1325 91 -913 -95 -201 -230 833 101
4513 101 -1074 174 612 126 296 -190 -1175 -108 831 393 137 422 -985 -999 284 652 760 752 -607
4532 -607 -1216 -192 465 601 469 -358 -749 6 350 85 267 -182 -547 138 240 156 493 -138 -952 -241
4552 -241 571 606 780 45 -1248 -581 653 409 401 531 -794 -915 371 170 -12 714 -189 -1079 -95 560
4572 560 213 468 -65 -1146 -224 957 373 -33 -204 -695 -359 579 439 140 186 -591 -636 431 575 287
4592 287 181 -669 -834 188 872 402 16 -578 -746 140 536 79 287 -24 -693 -224 373 103 391 255
4612 255 -731 -445 508 352 115 -25 -658 -289 839 425 -247 -23 -294 -647 492 533 -141 212 -164 -1068
4632 -1068 -140 754 277 75 -45 -709 -421 634 185 -183 41 -145 -183 329 132 -281 39 -224 -267 286
4652 286 335 41 -4 -464 -657 392 766 131 -75 -506 -641 213 475 12 113 241 -443 -379 244 42 -4
4673 -4 393 -394 -494 413 211 -461 -47 -59 -322 497 518 -614 -162 182 -406 67 492 -200 -6 -63 -541
4694 -541 -150 697 302 -125 -9 -297 -98 408 141 -446 162 81 -144 199 97 -216 226 -13 -304 60
4714 60 385 -183 57 -78 -409 149 395 -309 -239 236 -157 -50 365 -306 -199 624 -129 -400 324 153 -176
4735 -176 174 -50 -343 274 345 -520 70 207 -250 45 379 -282 -101 569 -84 -289 322 -61 -85 334 -136
4756 -136 -377 278 247 -263 156 -164 -53 305 -27 -263 253 205 -260 -178 -86 -24 377 232 -453 -96 302 -147
4778 -147 -4 310 -283 -215 326 -316 -240 567 41 -282 61 -189 -126 507 280 -611 115 347 -60 258 156
4799 156 -418 -33 349 -311 -65 473 -60 -432 66 -115 40 558 -128 -682 90 45 67 420 -273 -469 142
4820 142 258 -221 188 108 -401 110 103 -96 341 301 -661 -449 251 96 361 281 -458 -475 334 170 -27 344
4842 344 -150 -321 151 26 -5 424 93 -479 80 154 122 419 24 -548 -148 417 41 215 138 -601 -228
4863 -228 437 -94 -86 440 -240 -499 88 95 42 459 -204 -777 188 461 161 157 -161 -630 50 473 -37 123
4885 123 82 -471 -329 229 121 310 265 -537 -453 466 409 163 180 -549 -526 365 326 -71 291 -149 -661 145
4907 145 328 -65 312 163 -673 -287 517 201 157 25 -664 -197 493 303 -94 -29 -425 -172 403 181 -13
4928 -13 170 -275 -624 231 367 154 163 -410 -711 145 522 7 97 -94 -499 115 537 25 29 59 -485 -276
4950 -276 326 222 204 47 -529 -596 468 395 8 -2 -524 -411 510 399 -255 20 -79 -611 146 493 -83
4971 -83 236 33 -610 -172 634 238 -67 -75 -481 -237 711 222 -370 -85 -150 -276 313 362 -110 -47 -241 -539
4993 -539 36 448 57 -80 -464 -619 236 624 -102 -112 -95 -481 65 360 -48 -174 154 -317 -300 367 219
5014 219 -221 -69 -280 -328 438 605 -236 -324 -198 -344 365 480 -206 21 8 -499 82 522 126 -62 -31
5035 -31 -417 -184 658 84 -252 -24 -220 -211 509 332 -451 -10 -25 -115 354 383 -298 -14 -11 -423 95 577 79
5058 79 -331 -188 -306 17 601 48 -278 55 7 -115 270 3 -266 97 -18 -126 327 153 -176 2 -141
5079 -141 -134 489 499 -444 -344 36 -105 149 405 -190 -155 172 -354 -226 527 100 -97 157 -162 -117 353 191
5101 191 -471 -68 164 -45 459 166 -459 -71 249 -114 113 311 -218 -118 10 -299 50 521 -37 -346
5121 -346 55 -116 -112 237 -123 -376 50 267 -250 85 70 -96 57 186 -179 43 295 -217 -203 19 -51 209
5143 209 319 -270 -255 141 71 46 171 -140 -195 263 -177 -264 303 241 -322 11 113 -217 263 221 -388 -113
5165 -113 260 -165 70 135 -186 -158 311 -66 -166 182 144 -74 60 -79 -47 248 74 -266 12 78 39 28
5187 28 -33 -390 103 277 -351 -79 263 -139 -73 5 -280 -68 285 -15 -256 91 12 27 196 -167 -280 148
5209 148 190 -119 36 -29 -177 99 87 -160 147 165 -187 -32 185 -23 119 207 -337 -270 200 17 -87 79
5231 79 -182 -282 134 -104 -293 298 218 -288 -116 47 -159 61 229 -304 -121 405 -58 -87 220 -77 89
5252 89 330 -100 -153 198 61 -74 -4 -82 -84 288 -61 -386 68 245 9 237 37 -267 131 87 -310 -51
5274 -51 364 -16 -109 89 -187 42 459 -108 -293 192 59 -67 243 7 -319 133 135 -204 160 60 -186
5295 -186 -2 -82 -276 263 416 -293 -170 46 -191 1 302 -114 -300 170 -100 -331 141 -1 -39 267 -108
5316 -108 -202 58 97 -308 -120 119 138 392 65 -452 -201 77 -152 168 288 -127 -75 -105 -395 73 424 90
5338 90 -45 7 -271 -319 565 38 -257 296 204 -311 120 126 -389 16 289 -202 -57 366 -316 -363 -9 -56 102
5361 102 570 -64 -438 -181 -73 -109 151 192 -140 46 -95 -292 -33 228 -65 -40 -135 -108 223 122 -254 -42
5383 -42 147 28 284 139 -374 -240 209 -193 27 410 -75 -118 106 -325 -167 633 173 -311 51 -43 -368
5404 -368 251 158 -336 142 432 -238 -205 339 -277 -168 303 -115 -96 441 55 -445 -16 31 39 354 11 -410
5426 -410 -240 101 -71 -53 -50 -100 76 -176 -97 170 275 -46 101 -190 -223 298 39 -398 42 139 -167 138
5448 138 337 -404 -109 420 -172 -350 524 77 -447 259 103 -327 255 317 -455 -80 230 -131 -120 215 -343
5469 -343 -313 410 56 -515 461 164 -107 67 -70 -210 147 -52 -193 10 131 266 -163 -270 -224 112 32
5490 32 115 20 -208 -194 142 -2 -306 285 342 -362 23 159 -349 -3 408 -504 -125 540 -145 -383 88 -158
5512 -158 -312 495 203 -503 199 306 -392 103 351 -264 125 345 -349 -350 489 170 -303 92 -88 -253 208
5533 208 -29 -297 99 193 -18 -53 -80 -6 41 -227 -122 168 23 36 94 -278 -354 196 158 -227 163 -73 -365
5556 -365 84 278 -241 201 555 -331 -369 378 -121 -245 364 -168 -496 473 374 -491 129 246 -284 69 370
5577 370 -350 -209 318 -368 -255 222 90 -94 141 -268 -320 384 252 -109 -57 -44 73 -83 -48 -112 71 -10
5599 -10 29 62 -175 144 175 -269 -283 206 301 -204 151 -40 -448 358 374 -318 -4 280 -401 -146 323 -124
5621 -124 -98 398 -301 -560 503 347 -278 171 123 -397 248 491 -359 -133 231 -101 -166 128 -45 -173 187
5642 187 -199 -266 186 158 -61 -116 -133 -106 150 112 -46 -46 -234 -170 77 -79 -14 197 -213 -166 101 -69 -220 317
5666 317 -99 -333 111 207 -284 -7 150 -337 -13 356 -219 -214 370 -110 -314 265 20 -99 219 43 -413
5687 -413 95 384 -207 5 150 -108 -77 161 -155 -165 206 69 -142 -6 43 -41 54 -121 -190 -1 -3 -19 -97
5710 -97 -151 -4 48 -9 -80 119 -22 13 130 70 -96 229 51 -268 19 131 -234 121 85 -390 -7 357 -169
5733 -169 -277 332 -47 -157 335 -148 -316 348 98 -431 -61 244 -173 53 122 -229 -13 294 -167 -183 53
5754 53 -105 -45 147 -36 -147 258 14 -258 11 109 -8 18 -176 -79 93 87 -31 -32 62 5 121 -40 -219 224
5778 224 131 -17 45 -26 -191 213 106 -306 -128 196 -119 -54 88 -123 -97 306 -75 -424 144 70 -150 4
5800 4 -55 -208 222 352 -349 -86 315 -167 -177 214 -187 -86 196 30 -282 110 169 70 110 -64 -120 65 67
5823 67 -213 -63 224 64 10 -60 61 72 114 4 -8 169 109 -38 -20 -194 63 234 -91 -23 -14 -83 5 124
5847 124 -77 -52 242 89 -250 98 161 -92 51 41 -187 166 222 -217 -76 36 -88 91 157 -156 -169 339
5869 339 -41 -178 151 105 -66 89 -105 -309 110 311 -39 -33 -21 -140 -142 62 3 -154 259 194 -54 31 -14
5892 -14 -141 52 -102 -20 138 161 -13 -209 -177 93 223 123 9 -2 -121 -125 69 -75 -34 211 137 -304 -58
5915 -58 162 -61 29 157 -240 47 279 -204 -307 177 -12 -101 157 -62 -145 4 14 -416 52 333 20 -85
5937 -85 -12 -203 33 214 -46 4 210 -20 -61 102 -186 -92 270 159 -79 3 -20 -76 45 -37 -107 282 145
5960 145 -222 -161 20 -92 231 163 -137 14 55 -206 -134 92 -8 85 155 -219 -262 252 -21 -69 181 47 -10
5983 -10 37 -10 -368 25 240 -142 138 221 -94 -34 84 -189 31 358 82 -148 -92 -154 -25 208 -37 -111 198
6006 198 11 -191 -47 -71 -11 183 -11 -292 181 171 -110 19 -46 -234 204 189 -101 -88 102 -58 41 180
6028 180 -269 -68 56 -163 -180 187 128 -38 103 -5 -137 251 230 -166 16 39 5 126 30 -198 -4 213
6050 213 -173 -53 78 -62 148 164 -138 -64 348 16 -339 71 34 -30 237 -110 -177 235 102 -134 -76 -38
6072 -38 -103 253 -19 -213 2 355 -99 6 44 -201 -146 101 -122 -55 297 25 -75 64 -44 -150 307 11
6094 11 -152 72 114 -258 17 -25 -114 215 285 -250 -22 184 -136 -141 -63 -106 39 318 -46 -219 69 9 -118
6117 -118 155 34 63 47 -310 -222 144 139 -60 293 -133 -282 198 267 -205 81 26 -116 -5 182 -213 -24
6139 -24 130 -145 -110 289 -4 2 155 -123 -150 275 331 -175 -181 -165 -153 177 98 -141 81 34 -145 2 -11 6 103
6164 103 37 -381 -4 272 -41 -22 -81 -187 -57 313 39 -75 61 -178 -224 136 67 -4 177 -116 -436 -9
6186 -9 316 104 98 -23 -166 -29 277 -41 60 135 -131 -88 103 2 12 214 -103 -313 207 197 29 61 -273
6209 -273 -238 120 116 -74 -10 -24 -267 99 14 56 2 58 -270 -8 -15 5 126 26 -378 -170 195 -5 106 27
6233 27 -261 -135 238 -33 -45 176 -97 -206 57 129 -8 168 73 -400 -50 341 50 -137 184 -224 -15
6254 -15 130 64 -27 129 17 -170 -38 61 72 118 -217 -266 45 162 -13 80 -73 -248 130 5 -125 62 -42
6277 -42 -97 87 25 -21 236 100 -341 -167 170 114 48 226 -259 -157 214 71 -194 150 76 -123 -4 77 -111
6300 -111 82 106 -193 -88 81 -30 5 7 -244 87 172 -21 -161 46 66 -20 176 -47 -104 127 12 -209 -49
6323 -49 36 -28 138 -55 -203 90 133 -20 80 -29 35 144 -11 -172 104 163 -93 30 -65 -189 197 92
6345 92 -104 -72 277 -45 -85 -20 -193 -27 148 2 -270 23 205 -19 33 166 -135 12 112 -175 19 115
6367 115 -80 -41 124 -53 -48 216 9 -13 62 281 102 92 -104 -84 31 60 -34 112 37 -193 94 -104 -76 325
6391 325 89 -241 -168 16 53 173 14 -268 -176 71 51 -59 230 19 -178 9 -78 -35 266 3 -326 -130
6413 -130 -34 41 222 11 -235 -125 175 76 -1 88 -157 -59 5 -14 39 258 42 -231 -152 39 162 328 -38
6436 -38 -291 -8 117 106 140 6 -197 -201 59 18 139 62 -87 -250 -152 -124 126 300 -76 -209 -102 -13 180
6459 180 160 -204 -196 -16 -86 -56 157 223 -294 -208 -114 2 166 245 -174 -374 106 -54 308 174 -226 -245 -10
6482 -10 33 87 169 61 -157 -182 -63 31 419 161 -95 -221 -59 123 245 156 -188 -254 -17 42 96 157 -43 -272
6506 -272 32 -83 126 225 -62 -423 -85 -29 157 299 151 -220 -225 -33 -30 109 163 -78 -196 -90 -7 231 405
6529 405 -4 -197 -72 -17 207 283 -54 -361 -59 57 -56 253 88 33 -136 -100 29 217 275 -119 -62 -200
6551 -200 -107 102 267 -158 -163 9 -46 149 160 40 -274 -11 -21 -134 162 179 -33 -148 -69 -23 236 144 -310
6574 -310 -90 -51 -32 147 219 -131 -180 22 54 30 206 113 -12 -97 -90 67 195 141 -105 -10 39 57 103 76 -183
6599 -183 81 2 -58 71 41 -112 91 -93 -218 134 226 -19 -118 39 12 102 142 -35 -139 143 -53 -183 60
6622 60 58 -87 120 57 -250 73 277 -63 -98 72 -84 -55 56 -104 -81 22 -10 -161 -26 -50 69 198 -77
6645 -77 -63 -32 -39 -57 31 4 -2 72 -21 -163 32 121 -9 -138 -35 -90 162 33 -116 -76 -39 7 84 80 -111 -64 -65 -123
6673 -123 -51 105 64 68 47 -81 19 227 12 -144 -46 -16 -42 238 119 -198 24 83 -134 68 321 58 -123
6696 -123 -100 -123 80 246 178 -276 -169 -53 81 250 34 -108 -224 -13 -109 167 80 36 -64 -268 -194 76
6718 76 350 75 -215 -77 -113 80 250 -43 -136 -113 -78 -71 190 19 -60 -101 -183 -264 246 147 -25 -67 -239 -194 247
6743 247 250 -162 -55 -174 -154 139 322 14 -138 -100 -268 0 252 167 -74 -91 -165 -134 307 200 -12 -233 -44
6766 -44 -110 137 136 9 -156 -208 -107 57 209 97 -156 -148 -410 97 382 86 -154 -69 -164 -11 114 95 56 17
6790 17 -88 -99 149 92 62 -44 -71 -309 177 382 -65 -130 -116 -104 83 295 41 -220 75 -212 -139 202 180
6813 180 121 27 -226 -122 167 194 144 -97 -72 -152 33 12 -28 -25 8 -109 116 109 33 -63 -68 -330 105 200 147 100 -40
6840 -40 -281 -112 231 31 95 70 -193 -203 135 62 -59 230 99 -254 -10 124 -75 -40 73 -121 52 185
6862 185 47 -96 0 -86 -90 41 -35 -186 -5 9 -16 -70 139 144 -60 -201 -58 65 187 9 -94 -107 18 2
6886 2 16 -105 147 155 -98 -44 -50 -127 150 32 -210 -128 162 3 -32 84 49 -55 211 -43 -230 184 44 -205
6910 -205 0 -13 34 216 193 -149 -67 24 -59 33 233 63 13 52 -303 -46 135 -48 -37 -68 -120 26 152 122
6934 122 -110 -82 -88 -76 82 103 -97 177 16 -188 -76 43 0 134 -85 -264 99 368 -10 -118 75 -285
6956 -285 23 217 -161 38 37 -144 -154 151 53 58 21 -153 -291 -61 346 19 -16 -69 -164 -33 94 -69 -85 -7
6980 -7 -91 2 92 204 161 -50 -165 -22 149 185 39 -133 -145 -113 152 169 -13 142 -102 -131 -45 80 0 106
7004 106 83 -292 -8 136 61 40 37 -187 -79 205 87 67 134 -37 -133 56 -33 -109 149 87 -236 29 154 -2
7028 -2 37 -24 -289 -53 86 -29 69 -46 -84 -63 -86 28 133 148 -35 -164 -73 -31 34 118 -94 -182 -30 47 166
7053 166 57 -132 45 1 -18 3 214 54 -123 -112 -102 44 224 207 -116 -169 79 24 -69 302 -166 -152 114
7076 114 -42 -107 114 136 -78 -1 126 140 138 102 -242 -244 63 83 84 186 -126 -21 108 -69 12 148 23 -103
7100 -103 -42 -115 19 171 67 -167 -74 59 36 58 36 -175 -21 30 -92 145 210 135 -83 14 -127 118 191 -131
7124 -131 -66 -76 -134 140 201 34 -149 -40 22 -86 63 165 -91 -83 -69 -158 182 198 -86 -201 -4 10 111 125
7148 125 -49 -208 -10 61 21 -36 19 -28 58 75 -41 31 110 31 -135 -22 114 30 38 -46 -20 45 -106 -13 81 43
7174 43 -23 66 -87 -25 160 -28 -67 -81 -79 127 92 -115 -121 -29 4 -86 -76 109 -85 -12 93 -87 -45 151 78 -129
7200 -129 -28 -205 -70 172 -79 -62 15 -19 -115 -22 -46 -40 47 -60 -155 106 127 -15 54 41 -124 -7 106 -24
7224 -24 -98 27 3 -134 -92 -69 -47 77 49 -192 -168 -53 -22 1 -38 37 -45 20 -162 -5 38 78 -55 -23 -78 161
7250 161 202 -92 -14 40 75 43 147 -139 -94 32 -23 -77 77 177 -92 -69 -126 -137 -9 160 -2 -138 -53 -74
7274 -74 92 89 -77 -132 196 -39 -15 99 -5 -43 -106 -12 46 181 12 -128 -169 -112 56 108 48 -90 -112 43 -76
7299 -76 240 64 -45 61 -96 -105 88 304 -3 -203 -91 22 135 282 -2 -132 -114 32 133 187 22 -279
7321 -279 -38 48 -3 195 209 -6 -191 -120 -46 101 258 3 -307 -47 42 110 132 -115 -82 -55 66 76 143 58
7345 58 -53 -135 -157 149 190 173 -98 -103 -97 80 183 142 -112 -168 17 -32 38 79 -71 -33 -191 -134 -43 366 56 -122
7371 -122 -63 -63 137 68 -14 -288 -174 120 66 123 28 -112 -164 19 -138 238 142 88 -263 -104 7 119 159 -72
7395 -72 -179 -125 52 10 101 -13 -43 35 112 -12 65 -84 -13 -44 -42 -7 137 73 -140 -44 13 -20 275 152 -37 -151
7421 -151 100 13 26 189 -28 -161 1 -9 29 151 -22 -90 -66 60 14 -49 -15 -86 -106 182 66 -115 -94 -200
7445 -200 -5 154 34 134 -32 -2 25 2 14 102 64 -56 -158 42 121 63 -66 -91 -37 52 -54 35 9 128
7469 128 -115 -113 72 36 123 68 -185 -113 86 -34 -70 12 -130 -41 59 21 -56 -119 150 -13 -61 86 -32 -11 -109
7494 -109 -219 -10 112 131 -22 -64 -176 -11 125 23 -92 -170 -66 -10 27 -87 -38 -11 -72 -108 68 66 -23 105
7518 105 -21 -49 71 185 -28 -45 -56 -195 54 34 23 -41 -29 -22 -189 108 119 19 -87 -185 -180 168 119 56 -51
7543 -51 -74 32 226 26 -118 29 -59 -20 29 5 -9 46 -150 -144 48 -72 85 -5 -55 -111 121 31 -59 -94 -17 -99
7569 -99 -163 48 93 -106 -74 -221 -105 70 160 100 25 -172 -108 13 141 44 -74 34 -21 42 47 44 -74 -45 -16 -20
7595 -20 37 48 -3 -112 -108 75 88 224 6 -143 -152 -70 177 -58 18 78 -201 -96 -122 -61 58 97 -39 -180 -53
7620 -53 88 -49 -54 62 -19 44 92 -101 -146 86 -9 -51 57 118 -78 87 -36 -168 77 162 -34 10 79 42 -151
7645 -151 62 22 -181 60 -53 -119 6 26 111 204 42 -60 56 -9 -64 -80 -117 38 -79 61 -31 13 -2 19
7669 19 11 3 -148 114 81 -100 15 -38 -83 40 -70 -196 110 184 -100 -117 47 -56 -90 90 -40 -91 140 59
7693 59 -209 -37 76 -131 13 12 -134 0 106 -43 -26 7 26 -63 128 -5 80 -27 42 -146 -5 0 -42 103
7717 103 -61 -22 -10 54 14 -28 -97 -100 -25 -68 -155 31 53 -58 -29 -45 -78 25 24 63 -62 117 19 10 -20 4 -89 112
7745 112 34 -21 78 64 -183 -60 78 -127 39 75 -112 -100 112 -11 -122 -83 -69 -78 63 -71 -96 103 22 3
7769 3 83 -96 70 145 -38 -164 -144 49 76 179 -42 -6 5 -27 -83 73 -21 -125 -143 29 -4 146 93 -72 -80
7794 -80 24 77 19 27 -94 -106 79 125 -135 20 -48 -177 98 60 25 -131 62 41 -213 147 136 33 90 -72
7818 -72 -129 129 164 17 -75 -97 -72 90 -28 -74 10 92 -72 -38 -187 -71 89 12 -4 -84 77 64 -61 -101 -23
7843 -23 -22 -5 -162 -44 26 47 -16 -16 42 47 27 -95 -174 -5 153 -11 30 119 -203 -39 120 -13 -133 5 -247
7868 -247 -76 182 34 -95 83 -84 -150 -17 180 -60 10 7 -109 95 133 11 143 -67 -61 22 85 -9 -66 1
7892 1 -94 0 81 46 19 -28 -123 108 185 66 20 31 -152 18 152 -15 -148 -49 55 -3 -158 -49 -19 -63 20 -107
7918 -107 -18 -6 54 -82 -30 -130 4 151 -39 -175 -13 -18 -35 -39 -34 -28 -89 -67 -23 108 70 37 -5 19 -5 49 70 -64
7946 -64 65 67 15 -39 96 -135 -63 -31 -67 34 92 64 -176 37 -119 -30 41 -14 -140 -12 -52 -59 75 -4 -42 -7
7972 -7 -53 -24 41 185 -44 4 -16 -36 -81 -49 169 -85 -48 -45 -55 36 85 -58 55 -167 -73 -39 98 33 86 14 -65
7999 -65 102 94 -38 -35 125 103 26 65 31 -92 -36 2 -27 62 96 -119 108 10 -212 34 142 -25 -94 -20 -34 74
8025 74 9 -120 -16 62 -85 5 28 39 -95 94 22 -15 35 126 10 59 21 110 202 78 -46 -49 12 9 27 156 -67
8052 -67 77 -33 47 -48 67 18 -4 -58 82 69 -13 47 -10 92 13 -34 149 -35 -75 -28 -39 -68 -158 114 61 -110
8078 -110 87 -80 82 202 -97 -119 56 -35 110 21 -167 -165 73 -52 -40 4 20 52 -28 -82 -136 96 100 -67 66
8103 66 37 4 65 -18 -35 -30 20 -13 -91 -8 -45 89 109 -28 -104 19 21 -176 66 -48 107 -20 -88 -132 114 88 52
8130 52 -94 -67 -104 130 70 -20 -40 82 44 12 55 -49 94 111 -66 -113 21 -17 32 37 -70 -35 15 -83 1 -161
8156 -161 51 -16 16 -33 9 -12 18 -3 -34 34 5 5 -128 -47 -83 -77 84 33 -7 1 -58 18 -26 -16 21 54 -88 -149 4
8185 4 26 -44 75 -88 -9 -52
8191e2
$$ Imaginary data points
##PAGE= N=2
##DATA TABLE= (X++(I..I)), XYDATA
0 0 0 0 0 0 0 0 0 0 8 -8 0 -4 8 -8 8 -8 9 -14 16 -20 20 -22 23 -28 33 -35 38 -42 47 -52 56 -61 67 -73 81
35 81 -89 94 -104 117 -128 139 -153 170 -190 212 -237 269 -310 361 -421 502 -611 762 -979 1304
55 1304 -1821 2712 -4431 8373 -20753 125199 599427 -141509 -247889 369346 -151247 -456105
67 -456105 288386 263221 -240397 69038 136257 -248006 -18565 194672 -78738 -27026 77298
78 77298 -130056 2040 202604 -53579 -125734 54132 -57299 -85150 168181 142878 -100898
89 -100898 -120574 -8733 2788 -27674 81837 176297 -71361 -236382 68144 124681 -151887
100 -151887 61341 230440 -209150 -178774 273534 11745 -222856 160456 59677 -250555
110 -250555 111324 206069 -160839 -17794 88570 -200734 4180 246471 -73081 -51955
120 -51955 139797 -203374 -161464 293468 47484 -192772 168271 37283 -304866 78621
130 78621 242695 -151497 -58385 176672 -92716 -134517 141104 57392 -106666 -8246 36175
141 36175 -5275 12400 20568 8232 -42579 -71744 43440 84987 -27564 -8235 25722 -80651
153 -80651 -29242 82533 1798 3082 44514 -92010 -43298 114916 -34475 -59588 131022
164 131022 -47454 -160971 154750 89959 -197764 50912 145143 -184647 -30922 225129
174 225129 -79332 -137833 141663 -15957 -141268 123189 80007 -119898 14234 39221
184 39221 -81226 40609 71615 -69240 1129 45043 -71071 6945 84079 -53541 -40006
195 -40006 68208 -20500 -48731 56311 19149 -52232 -6891 22855 13213 -1983 -16421 13511
207 13511 -2180 -48358 39584 67819 -72634 -37550 79197 -36599 -54928 101848 9853
218 9853 -102805 39991 34973 -72986 47897 65012 -82826 -11410 50530 -55072 17480
229 17480 81216 -74229 -41367 86585 -39037 -50515 103385 -10896 -107456 63415 48442
240 48442 -82741 33931 68760 -84497 -35779 73357 -2513 -21588 33494 -18725 -42482
251 -42482 17049 24119 9735 3399 -23919 -12371 9411 -4892 16946 27242 -28168 -27277 13605
264 13605 -198 13460 31210 -27849 -32561 16798 -5194 7975 51276 -27259 -57532 35248
276 35248 8253 -37743 58008 33261 -84328 -8458 52104 -36508 5782 72368 -43223 -64493
288 -64493 44104 12382 -22999 43693 1722 -59154 11332 25781 -18035 23669 19331 -46400
300 -46400 -10794 27267 -9268 10947 30868 -32698 -35742 23683 16600 -1378 13343 -8079
312 -8079 -29445 -2913 19595 16967 2417 -12782 -9678 -8270 -7926 24900 29707 -20869 -25186 3686
326 3686 -9490 6582 42815 -3863 -40660 1655 3809 -10623 31801 20059 -35130 -10360
338 -10360 9208 -18726 17133 41059 -23082 -31220 12255 -7114 -1746 42721 539 -44440
350 -44440 147 12893 -9774 20744 22629 -26815 -21069 7591 -1096 10216 25761 -6961 -27920
363 -27920 -8496 4792 14033 19886 -1691 -21932 -13426 1895 13550 15443 1357 -11087 -14268
376 -14268 -9070 11145 21296 4324 -8278 -14243 -19101 6311 32621 8821 -16122 -10502 -14765
389 -14765 -6092 29116 20569 -15389 -11489 -7288 -16007 13510 32780 -879 -17750 -9998 -15972
402 -15972 3097 35000 12831 -21503 -15672 -8254 -1247 23703 20025 -12293 -18587 -8357 -3987
415 -3987 12857 23711 3156 -18557 -18504 -5804 13094 22954 8729 -14541 -23572 -8751 15445
428 15445 20504 5947 -7426 -17150 -15293 7452 21367 9811 -2379 -12810 -21820 -2611 25054
441 25054 17552 -3557 -13118 -20508 -7525 23022 21806 -3692 -12405 -14658 -11112 12706 22564 3874
455 3874 -8338 -13361 -16550 4108 25153 12631 -7579 -15735 -17446 1007 24149 14793 -7170
468 -7170 -13491 -13406 -3096 16268 15462 -1194 -9110 -13212 -8649 10843 17871 5120 -7252 -16758
482 -16758 -12459 11679 20277 3575 -7284 -12437 -12585 7372 19020 3098 -5840 -5365 -12951 -2529
496 -2529 17700 9508 -4326 -5018 -13298 -7978 17823 15699 -6559 -8263 -7973 -8009 12877 16687 -6351
511 -6351 -9280 -1632 -6689 2659 15343 2038 -8338 -4746 -7038 1324 15414 5411 -7965 -7786
525 -7786 -8244 2877 17734 3418 -11136 -2622 -4195 -4685 13532 8219 -10573 -974 1345 -10248
539 -10248 6036 14406 -7535 -7516 2830 -5514 5238 15798 -9965 -15349 6440 1291 885 17003
553 17003 -4043 -22115 3577 7196 -6426 12555 12169 -17438 -10111 6307 -2483 6039 13372
566 13372 -9723 -12327 5517 3169 3317 5033 -12100 -8897 11924 5538 169 6832 -10667 -18212
580 -18212 6345 11028 4273 11883 -3326 -23552 -7395 7607 9650 16902 -411 -21515 -2964
593 -2964 5339 -5553 12385 11061 -20650 -3297 19278 -8986 -5932 17561 -13991 -21762 21623
606 21623 15906 -6515 7463 -10313 -31905 7098 26040 5332 8779 -4106 -32622 -5517
618 -5517 18833 70 11234 17851 -23803 -21474 16321 2949 -4716 16231 -4711 -21183 11230
631 11230 16530 -6070 -6187 -9502 -9582 13275 15995 4367 2433 -18985 -26673 9847 19718 4796
645 4796 17506 469 -39739 -13784 21580 6962 9435 13398 -20001 -17202 11429 66 365
658 365 13438 -12160 -10136 21347 -1653 -13874 16754 -9784 -32723 23725 31217 -14880 1591
671 1591 4274 -39530 -8096 41032 9519 -6570 7347 -19722 -22680 13502 11102 5342 14004
684 14004 -12993 -20065 10985 2311 -6623 17380 -2930 -24823 14929 20292 -15664 -4725 3713
697 3713 -16289 3280 22863 2352 -2380 -5666 -21550 -362 16778 1060 13293 10883 -33930
710 -33930 -16427 27343 -1022 -7845 25668 -7319 -30770 16499 13247 -19487 7778 11558 -17797
723 -17797 2519 13255 -8854 3761 2597 -22292 6957 23529 -12038 -352 14581 -27716
735 -27716 -13476 34872 688 -18759 19412 -856 -28638 10182 15917 -10164 5845 5540 -15679
748 -15679 1074 7409 -4921 9047 313 -19269 10910 15235 -19527 1282 18191 -19271 -7388
761 -7388 24520 -7079 -13029 17371 -4353 -16698 12208 4100 -6011 10420 -7797 -13277 18051
774 18051 357 -17435 18390 4824 -26959 14107 18018 -28135 2158 28229 -19731 -13766
786 -13766 24072 -5341 -13671 16286 -2083 -13008 11336 -69 -8331 10441 -4132 -8437 16518
799 16518 -4658 -18850 18685 8238 -22489 8634 13043 -20282 2945 18987 -14287 -5970
811 -5970 14679 -7480 -5236 9904 -6112 512 10668 -13984 -4167 18774 -9576 -9800 19889
824 19889 -8222 -18291 23506 5738 -25212 10198 12368 -19313 4733 15642 -13015 -619
836 -619 8591 -14960 959 15720 -8245 956 10603 -20335 -5322 24840 -8189 -13060 21960
849 21960 -3592 -21992 15398 6658 -18894 10081 12332 -15693 1199 10573 -9594 -1233 3206
862 3206 -8500 9013 12476 -12533 -2255 5381 -15953 1800 21849 -6749 -7240 13468 -10949
875 -10949 -16871 13572 6103 -4221 11495 -3133 -14934 6956 1040 -10084 12140 5021 -11824
888 -11824 11674 5192 -24100 1806 16209 -13172 1964 22457 -10854 -14095 9737 -9052
900 -9052 -10186 21320 9249 -9758 2407 -6683 -13610 9531 6347 -5305 12357 4434 -16860
913 -16860 -291 3799 -11876 7403 16589 -8328 -3157 8998 -11169 -10626 7331 1202 3782
926 3782 13572 -4273 -11918 -572 -6206 -1875 15025 3251 -3986 7715 -7390 -18363 6033
939 6033 9140 -3547 9906 6847 -14026 -3433 3380 -10445 1963 14874 165 315 2832
952 2832 -15241 -7857 11408 65 33 15023 -2566 -14295 2376 -3029 -9199 13996 12677 -8993
966 -8993 -1361 2512 -11197 -2096 7976 -1235 3592 9461 -5385 -8636 -547 -4060 1178 10348
980 10348 1370 -2011 3382 -6512 -9828 3128 4167 2794 7924 -1495 -9605 -201 303 -3627 5447
995 5447 4421 -2716 3903 428 -10892 -421 6094 -3751 2475 8921 -4474 -4660 3560 -7324
1009 -7324 -6102 11892 6748 -4319 1072 -3464 -9031 3514 6354 -1906 3242 3526 -6699 -3551
1023 -3551 1796 -1589 2974 5352 -3900 -2813 3641 -1330 -2602 1535 -1637 243 6146 -184 -4820
1038 -4820 38 -832 -1652 3801 1830 -1450 2277 -1694 -6377 1660 4722 -187 1614 -520 -6103
1053 -6103 1098 5707 -2211 -1735 2632 -2441 -1087 4382 -1582 -2406 3941 -1678 -5029 3904 3366 -2120
1069 -2120 1355 -1620 -5735 3505 6319 -3103 -1986 2029 -3215 -650 4981 -922 -2316 3103 -1166
1084 -1166 -4458 2014 3518 -291 -500 -1666 -2479 1719 2949 -205 -1622 -1681 505 2354 -845 -1456
1100 -1456 2176 -456 -2341 1999 415 -2328 2886 532 -5727 1379 5830 -2146 -1628 1567 -4517
1115 -4517 -1016 7333 -703 -5189 3318 443 -5419 2679 3542 -2983 1460 2246 -5901 -1315 6315
1130 6315 106 -2921 790 -1236 -1462 3370 915 -2847 16 1567 -730 -611 509 989 310 -1479
1146 -1479 -1122 308 896 1924 -39 -3829 -484 3554 -382 -1213 1722 -1775 -1332 3946 -922 -3949
1162 -3949 3876 1675 -5318 1342 3025 -3402 1820 3320 -6540 -1264 7642 -1785 -4394 4038 -1267
1177 -1267 -4148 5493 1363 -6124 2996 3865 -5962 -647 5197 -1620 -1141 3046 -3078 -3195 4683 2342
1193 2342 -3585 -977 1760 -252 -688 1159 443 -1497 357 2260 -2687 -2572 4919 1360 -5910 1320
1209 1320 3864 -4325 1376 5489 -6513 -3150 9240 -2163 -7295 7154 1567 -8277 5353 3798
1223 3798 -9777 3148 8702 -8941 -3143 9724 -3540 -4958 7483 -2592 -7072 8129 2801
1236 2801 -8546 2412 4540 -5519 504 4612 -3741 -865 4600 -2526 -4010 2782 2662 -922
1250 -922 -1209 -324 145 -550 609 1865 -2432 -1459 5207 -1127 -5946 4585 3186 -6710 2728 4441
1266 4441 -8428 1705 9657 -8559 -5040 11780 -3328 -8112 10607 -809 -11576 10222 5335
1279 5335 -14727 4664 11323 -11973 -1760 11903 -8491 -5151 13396 -4421 -10827 10735 3060
1292 3060 -10301 4914 4472 -8522 2579 6668 -6710 -1947 6770 -1625 -3929 2225 987 -963
1306 -963 484 359 -624 -1886 1611 4079 -4188 -3911 7013 -247 -7417 6529 3173 -10177 5211
1321 5211 7721 -13251 326 15042 -9387 -8025 14110 -4980 -10990 15143 677 -16367 11305
1334 11305 7983 -17324 4169 12789 -13321 -214 14745 -11923 -6865 16436 -4616 -11757 12178
1347 12178 1466 -11516 8202 4146 -12350 3747 9098 -7554 -2026 6559 -2808 -2769 3104 -788
1361 -788 -1112 1985 676 -472 -2995 -663 5664 -1138 -5391 5094 934 -7297 6001 3856 -10761
1376 -10761 4571 9425 -12647 -1761 13943 -8667 -6003 15236 -7122 -12536 17351 780
1388 780 -18777 12139 9586 -18061 5730 13710 -17573 -1693 18505 -11230 -8660 17955 -3481
1401 -3481 -13585 11161 636 -12183 10836 6871 -12684 1780 6947 -8277 -143 7115 -3717
1414 -3717 -271 5398 -3628 -4191 1577 464 1418 708 -850 3244 -1506 -6432 2792 758 -4938 9340
1430 9340 6219 -13348 -350 8610 -11451 -1246 16916 -5840 -7329 13677 -7666 -16896 14962
1443 14962 6561 -13605 11019 8044 -18860 1972 11142 -15475 987 20762 -7883 -8752 12112
1456 12112 -9383 -13348 15364 4099 -9993 12083 5074 -17772 -2032 6471 -5719 5435
1468 5435 12089 -5243 -5775 1262 -5351 -3210 4877 4133 4799 1484 -6468 -3840 -2515 -3860 6911
1483 6911 7538 -2935 3540 2044 -15049 -4474 9627 -2043 4284 14885 -9416 -13489 8025
1496 8025 -5375 -10326 18697 9560 -12905 5880 1668 -22454 2701 18230 -7939 1116 16983
1509 16983 -11455 -14364 8778 -5023 -7379 19555 7880 -12511 1710 -1567 -15129 3483
1521 3483 11808 -873 5569 6398 -12294 -10075 2032 -85 4924 10036 126 -3778 -2841 -7538 -3174
1536 -3174 3819 3623 8198 5205 -8587 -5503 -72 -7628 1776 13677 471 -1508 6348 -11334
1550 -11334 -14343 9488 5802 -3162 12783 3199 -17105 -436 3952 -11731 6341 17962 -6030
1563 -6030 -4904 6318 -12267 -8705 14010 1503 -5201 12928 1020 -15441 393 1776 -7237
1576 -7237 9221 11968 -6522 -3112 1752 -9287 -3080 8204 2544 2808 4787 -6305 -7590 404
1590 404 -297 2818 6244 -454 -795 1171 -6814 -4302 4813 393 1870 7677 -3941 -7233 3880
1605 3880 -2867 -6352 9100 5524 -5630 4069 123 -12964 2209 9819 -5106 1216 8569 -7784
1619 -7784 -5703 6834 -4391 -4044 11354 802 -8181 4410 189 -7838 4723 3911 -5837 4001
1633 4001 5411 -7352 -2097 3556 -3618 1452 6237 -3729 -2293 3731 -3503 -2717 4344 -167 -457
1648 -457 3588 -3508 -3826 4460 135 -2509 3620 -1166 -3377 4520 -398 -5030 4113 2159 -4775
1663 -4775 2523 1893 -5507 2919 4187 -6227 301 5816 -4257 -1673 4858 -4134 -1405 7499 -2729
1678 -2729 -5699 5063 -50 -4766 5050 1327 -5346 3931 1994 -7155 1458 5090 -3249 699 3269
1693 3269 -4801 -615 4822 -3258 -2010 4834 -867 -1973 2663 -2757 -2532 4621 47 -2702 3417
1708 3417 83 -3248 1798 -965 -3283 4610 2785 -4147 716 644 -4056 2191 2998 -3979 1755 4288
1724 4288 -4711 -2156 3404 -2610 141 5194 -3019 -3045 4744 -1633 -4303 3926 569 -2673 4504
1739 4504 -142 -6238 2693 2942 -4258 1695 3263 -3959 700 3157 -5172 -788 5517 -1737 -2180
1754 -2180 3173 -2087 -2139 4011 -1289 -3366 3724 1167 -3056 1478 65 -2479 2641 1021 -3355
1769 -3355 1257 1796 -2111 757 354 -2693 2233 2131 -3574 307 2555 -2428 435 2244 -3540 390
1785 390 4588 -3112 -2684 4212 -1262 -2144 4317 -1471 -4077 4664 1049 -5331 2661 2694 -3989 1569
1801 1569 2186 -4846 1106 5036 -3364 -1980 3531 -1863 -1378 3351 -1673 -1761 3959 -505 -3302 1700
1817 1700 163 -1251 2614 -343 -2797 2367 597 -2712 1149 728 -1351 2726 306 -4238 1422
1832 1422 2321 -2584 1156 2072 -3168 968 2578 -4244 -682 4807 -1854 -1903 3033 -2591 -2059 4820
1848 4820 -1083 -4139 3698 1365 -3698 2184 905 -3722 2699 2249 -4437 720 3495 -2502 -345
1863 -345 1947 -2856 372 3870 -2564 -1791 2928 -1204 -991 2461 -1943 -1035 3930 -1247 -2890 2451
1879 2451 -362 -1819 3282 -846 -3267 4009 1037 -4831 1969 2100 -3452 2473 2526 -5497 692 4739
1895 4739 -3902 -1447 4602 -2389 -1924 4175 -2482 -3098 5137 459 -4186 2340 652 -2813 2770
1910 2770 840 -3609 2020 2148 -3023 389 1334 -1819 1845 1246 -3597 869 2396 -2314 801 1778
1926 1778 -3388 1303 3396 -4443 -796 5118 -2690 -1685 4439 -3224 -2889 6723 -1229 -5798 5208
1941 5208 1432 -5877 3561 2489 -6044 3014 4521 -6850 -473 6058 -3770 -1402 5067 -3641 -2568
1956 -2568 5754 -1713 -4367 4418 582 -3412 2687 -31 -3454 3452 1265 -3646 1287 1434 -2185
1971 -2185 1692 162 -3060 2808 1574 -3580 1272 1172 -3229 2980 2292 -5390 1400 4114 -5291
1986 -5291 -272 5429 -4164 -772 6267 -5297 -4411 8333 -939 -5887 6263 -327 -7271 6069
2000 6069 2766 -8310 4094 5700 -8042 206 6187 -5703 -406 7220 -5349 -3808 7391
2013 7391 -1408 -4845 4833 -638 -4098 4865 793 -4803 2879 1549 -3972 1507 1297 -2103 2974
2028 2974 553 -4516 1672 1586 -2677 2836 1137 -4830 3053 2904 -6329 1131 4660 -5013 1233 5982
2044 5982 -6381 -1739 7512 -5426 -4708 9277 -760 -5499 7055 -2105 -9663 7534 4978 -7959
2058 -7959 4464 5074 -9829 222 6479 -6677 841 9812 -5617 -5546 6333 -2709 -4040 7217
2072 7217 -643 -5031 5721 782 -6442 2240 1433 -3556 3845 2415 -3697 1785 556 -5330 907
2087 907 2603 -1039 4194 1105 -7026 424 2594 -4195 3241 5160 -5645 370 4818 -7852 -1996
2102 -1996 9034 -3413 -3147 8644 -3478 -7140 7813 -1472 -9439 8772 5867 -8310 3708
2115 3708 3150 -11985 1454 9779 -5872 275 9485 -7336 -7253 6468 -2195 -2533 10254 -195
2129 -195 -8501 3199 537 -5636 4354 3407 -3822 2926 2000 -5699 28 1885 -2638 2541 2643 -2610
2145 -2610 2230 807 -6585 319 3422 -2291 4258 4050 -7919 -1447 4999 -5696 -40 9217 -3731
2160 -3731 -4023 6863 -5097 -7073 9746 1451 -8118 6899 2837 -9614 4423 4800 -10343 2612
2174 2612 10122 -6817 -1921 7728 -7082 -5166 9016 -1843 -4367 8872 -452 -9306 3073
2187 3073 2138 -4293 5482 3555 -6525 257 2650 -4135 957 3664 -2256 1128 1682 -4362 517
2202 517 2903 -2652 789 2283 -3600 1584 3726 -5590 -1008 5244 -3517 -586 6144 -4570 -3881
2217 -3881 7257 -2536 -6032 7897 979 -7442 5334 1846 -8760 5023 6246 -8855 403
2230 403 7712 -6643 -1624 7790 -5141 -3749 8358 -2311 -6291 6701 619 -6061 4485 1227
2244 1227 -6059 4158 3685 -5907 649 3870 -3739 401 3207 -3527 -79 3625 -2811 -1062 2706
2259 2706 -1472 291 2094 -3561 -332 3850 -2335 -946 3578 -2993 -1775 4852 -2571 -3167 6241
2274 6241 -402 -5571 4021 678 -5082 5198 2532 -7634 2023 4784 -5896 838 5946 -5410
2288 -5410 -1596 6175 -4415 -3241 7767 -1209 -5710 4380 -121 -4637 5406 2038 -6319 1973
2302 1973 3255 -4303 1132 3153 -3661 474 3286 -3253 -297 3763 -2444 -1844 2415 -1310 597
2317 597 4064 -2629 -3715 1920 -524 284 4429 -1237 -3410 1996 -1758 -2888 4969 2003 -3212
2332 -3212 1927 -959 -5128 3871 3909 -4722 611 3604 -4181 379 4343 -4847 -2429 5533 -1437
2347 -1437 -1886 5818 -1414 -5912 2118 -356 -2570 6793 3556 -6251 -1573 345 -3531 3469 5495
2362 5495 -2797 -1222 1735 -4233 -1490 4228 11 -366 2506 -2177 -1717 2813 -1234 -2856 1651
2377 1651 472 880 4187 -1685 -5484 90 149 -341 5773 2647 -3994 -1249 -2189 -4680 3860 6683
2393 6683 -1050 -956 -446 -5520 -373 5331 -1083 -1061 3778 -1831 -2898 2855 -1398 -3640 3451 1368
2409 1368 -2197 3937 1907 -5649 -2142 599 -1094 4841 5724 -3371 -4191 -938 -2941 1161 5833
2424 5833 957 -1092 61 -4220 -2858 3362 1897 -17 1845 -1566 -2388 2339 83 -3138 1166
2439 1166 1253 -211 3143 702 -4557 -1091 448 -1719 3239 4874 -1645 -2504 -1298 -4422 623 6780
2455 6780 1189 -1965 200 -3015 -2577 3470 1321 -1516 2290 332 -3221 714 1240 -1896 612
2470 612 957 -1596 1740 2629 -2480 -2193 -97 -1144 2290 3882 -1311 -2126 -105 -2158 -538 3330
2486 3330 901 -278 946 -2664 -2850 2729 1524 -998 1460 -683 -2454 2193 1132 -3211 557
2501 557 2005 -1748 772 2228 -2439 -769 2000 -1813 -890 3579 104 -2113 703 -1175 -1267 3099
2517 3099 1037 -2324 304 562 -1519 609 833 -1159 769 1035 -1631 -263 839 -434 304 282
2533 282 -1263 473 1077 -1462 -299 916 -600 706 1121 -2335 -624 2695 -709 -1023 1704 -1147
2549 -1147 -1592 2454 -232 -2298 2313 890 -3243 811 1934 -1909 760 1579 -3169 -426 3597
2564 3597 -574 -1782 1103 -1286 -1329 3030 547 -2021 663 -223 -2198 978 2062 -75 63 -681
2580 -681 -2419 402 2337 896 -268 -1409 -1588 709 1430 41 230 -496 -1745 451 1190 -317
2596 -317 1377 263 -3360 -659 2901 566 457 655 -3736 -2100 3887 1404 -1086 1499 -1591 -3812
2612 -3812 2056 2430 -1351 1566 747 -4648 -821 3983 450 -243 879 -3457 -2058 4022 1906 -1572
2628 -1572 32 -1284 -2616 1670 2690 -14 -146 -1084 -2610 -128 2725 2211 273 -2385 -3020 309
2644 309 2329 1703 1059 -2032 -3179 757 1603 131 1993 320 -4027 -1116 2422 168 1699 2147
2660 2147 -4483 -3414 3554 1685 -360 2058 -2290 -4731 2359 3377 -1213 1396 841 -4759 -1036
2675 -1036 3724 639 569 1562 -3949 -3412 3432 2730 -180 538 -2130 -3236 1765 2706 353 327 -1021
2692 -1021 -2709 -269 1697 1691 1427 -1267 -3207 -633 1377 2003 2292 -1530 -3854 129 1655 261
2708 261 2302 601 -3955 -710 2160 -1082 1582 3488 -3538 -3717 2619 772 -197 3753 -1634 -5702
2724 -5702 1966 3160 -1738 1625 1619 -4661 -1068 3577 -773 330 3153 -2756 -3760 2243 1671 -66
2740 -66 1932 -1326 -4019 820 2581 110 750 -155 -2418 -381 1030 612 1162 108 -1639 -958 -260
2757 -260 912 2881 -108 -3309 -132 822 -736 2404 1526 -3820 -621 2591 -1874 34 3958 -1855
2773 -1855 -2980 2191 -620 -1411 4291 23 -4904 1109 2104 -2019 2393 2055 -4510 -518 3533 -2182
2789 -2182 -596 4158 -1862 -3223 2351 -94 -1600 3246 632 -3836 93 1797 -413 793 439
2804 439 -1714 -107 764 -519 832 481 -1091 197 -270 -1358 1732 1493 -1878 -364 438 -1358
2820 -1358 1344 1870 -2276 -223 2182 -2043 -466 2969 -1767 -1343 3600 -1701 -3493 4053 1232
2835 1232 -4222 1817 1937 -3868 1299 3474 -3621 -897 3904 -1783 -1908 2646 -891 -1436 2680 -706
2851 -706 -2320 2438 361 -2406 1421 506 -2188 1683 1149 -2568 344 1770 -1581 -561 1052 -224
2867 -224 832 456 -1796 -238 481 -577 1858 1102 -2925 20 1933 -2718 -7 4061 -1347 -2001
2883 -2001 2106 -1548 -2413 3909 717 -3394 1513 950 -2380 2134 1107 -3962 1016 2628 -2818
2898 -2818 913 3747 -3624 -2428 2810 -1582 -592 5563 -44 -5099 6 593 -1126 3011 2215 -2339
2914 -2339 -766 -391 -1846 1396 1503 -708 898 -127 -2693 1350 2038 -2843 -650 1743 -597 1427
2930 1427 2680 -2891 -3230 651 -343 1769 4171 -941 -2764 -324 -3334 -1103 6421 2252 -3221
2945 -3221 576 -1669 -4727 3521 4515 -3092 -158 2487 -3061 -692 3078 -1986 -1816 2451 -301
2960 -301 11 3577 -1381 -4204 -361 -702 783 6462 1682 -5312 -2261 -1039 -1792 4199 4897 -1172
2976 -1172 -1875 -1513 -3386 334 3602 936 472 -462 -3024 495 2397 -2434 -1253 2138 -859 773
2992 773 4302 -2220 -5175 603 -131 -382 5531 2903 -3904 -2607 -2567 -2600 4698 5659 -1057 -1238 -1670
3009 -1670 -4820 943 5082 -970 -560 2831 -2586 -2809 3121 -102 -2863 1818 646 -1035 3081
3024 3081 1116 -4085 -2186 -405 647 4690 2727 -3090 -2225 -1885 -2695 3067 4985 -418 -888 -501
3040 -501 -4445 -975 4365 1246 -702 803 -2015 -1191 2442 -764 -2011 1669 -154 -659 3493 -183
3056 -183 -4114 362 167 -2467 3660 4515 -2900 -2647 -213 -3013 1174 5494 40 -2372 0 -2142
3072 -2142 -1285 3027 694 -904 1653 -1068 -2509 2111 962 -2128 817 445 -1956 2213 2192 -2734
3088 -2734 -1567 821 -599 1520 2273 -1581 -1138 158 -1750 542 2772 -523 -429 988 -2666 -1142
3104 -1142 3676 167 -2114 1480 -475 -2047 2307 838 -2845 867 1484 -2022 791 1627 -2087
3119 -2087 189 1629 -2230 284 3085 -1733 -1703 1942 -984 -853 2960 -503 -3036 1524 1188 -1680
3135 -1680 1165 978 -1699 307 834 -1365 501 1282 -1003 10 388 -1306 644 1185 -1783 -26
3151 -26 2141 -680 -425 782 -1904 -659 2580 -79 -961 1181 -1104 -1575 1600 -80 -794 2322
3167 2322 -144 -3036 1087 1318 -1743 1307 1364 -2880 363 2988 -1855 -1385 1855 -1023 -702 2707
3183 2707 -287 -1637 1128 -995 -1926 2076 1402 -825 614 -793 -2593 1329 2435 -790 42 471
3199 471 -1848 -27 1652 -498 -209 930 -887 -583 1250 -33 82 176 -1841 -286 2427 166
3215 166 -673 385 -1886 -1169 2796 1027 -1470 983 -462 -2506 1006 1881 -676 813 356 -3132
3231 -3132 -41 2598 -400 -297 910 -2052 -691 2862 -138 -1737 1190 -524 -1824 1798 1350
3246 1350 -1211 487 -192 -2180 879 2140 -164 -156 -769 -1860 793 1968 -525 -243 212 -1670 -81
3263 -81 1765 -289 -182 1077 -1722 -1274 1827 645 -235 691 -1256 -1670 1919 1057 -1175 565 -260
3280 -260 -1642 1241 1399 -1241 447 965 -2224 -458 2151 -327 -288 659 -1829 -962 2242 576 -850
3297 -850 429 -1049 -1216 1657 474 -973 972 104 -1951 305 1217 -448 793 432 -1843 -126
3313 -126 1586 -399 -274 299 -1297 269 1553 -785 -305 1133 -1063 -718 1463 -225 -568 1484
3329 1484 -769 -1961 1242 1023 -976 873 69 -1900 878 1281 -1384 209 1449 -1194 -253 1207
3345 1207 -964 -229 1645 -969 -1578 1417 279 -773 889 -352 -1230 929 635 -914 357 326
3361 326 -737 305 44 -795 1073 675 -1276 -208 595 -554 516 867 -1348 -224 1336 -794
3377 -794 -487 1175 -385 -487 1091 -784 -934 1879 157 -1529 723 135 -1032 1507 574 -2030
3393 -2030 340 1268 -1391 121 1456 -993 -402 1197 -1120 -593 1762 -193 -1282 597 -296 -530
3409 -530 1452 -2 -1584 492 395 -941 479 538 -731 215 207 -1063 425 966 -359 -218 -174 -896
3427 -896 834 1184 -985 -311 631 -923 95 1230 -926 -389 1342 -894 -1234 1779 297 -1013
3443 -1013 940 -432 -1667 1634 1280 -1805 94 967 -1547 282 1528 -1210 -566 1291 -1062 -1048
3459 -1048 1640 182 -914 640 -652 -992 1532 707 -1261 41 193 -621 857 699 -1036 125
3475 125 184 -908 179 957 -85 91 -163 -1221 336 1306 -431 -175 144 -1283 445 1577 -832
3492 -832 -627 1484 -760 -1054 1416 116 -1117 1305 -141 -1728 1270 1345 -1209 22 214 -1704
3508 -1704 874 1982 -1427 -747 1438 -1029 -798 1821 -131 -951 1230 -305 -1632 970 1123 -897
3524 -897 -241 148 -566 711 573 -967 -179 102 -396 825 616 -1011 77 226 -1329 243 1590
3541 1590 -90 -163 25 -1433 -178 1539 -47 -430 749 -993 -596 1332 -644 -1070 1769 9
3557 9 -1886 1180 895 -1790 359 943 -1713 429 2290 -1056 -1431 592 -704 -133 1909 -141 -900
3574 -900 677 -678 -1368 1309 731 -591 934 -178 -1890 553 1327 -981 -249 741 -266 322 342
3591 342 -846 -400 213 -125 723 583 -924 164 250 -2013 368 2393 -215 -689 777 -1452 -1278
3608 -1278 1891 508 -1244 901 288 -1388 479 394 -1179 1132 1002 -1733 341 1406 -1418 -382
3624 -382 1289 -1151 0 2498 -529 -2140 686 182 -899 1183 655 -995 70 -180 -1020 465
3640 465 749 -103 544 -413 -1251 822 797 -1199 122 860 -675 263 864 -1162 -598 990 -258 -215
3658 -215 942 -459 -321 582 -1355 -393 2108 -252 -1190 1015 -466 -1613 1648 1042 -2073 680
3674 680 1563 -1594 -446 1294 -729 -280 1205 -731 -556 1223 -343 -822 655 -463 -279 1455
3690 1455 -427 -1518 909 462 -1013 662 509 -1050 303 766 -933 103 678 -290 11 -111 -759
3707 -759 852 884 -1340 -26 1040 -983 -147 1344 -1297 -727 1759 -391 -1372 1090 368 -1206 745
3724 745 241 -1125 728 589 -1383 222 969 -835 541 535 -1623 -36 1597 -812 -734 1231 -368
3741 -368 -851 1124 -152 -890 974 158 -999 291 226 -247 596 -488 -1061 1059 476 -688 664
3758 664 194 -1309 743 1030 -1306 56 1291 -921 -677 935 -331 -150 846 -918 -704 1271 64
3775 64 -575 732 -602 -1157 1430 237 -1488 871 961 -1501 136 960 -894 9 1015 -922 -509
3792 -509 1267 -82 -618 115 -743 38 1318 -273 -641 611 -717 -783 977 247 -368 1179 -91
3809 -91 -1747 204 834 -194 711 427 -1206 163 564 -1129 236 1075 -621 333 953 -1338 -535
3826 -535 1267 -768 -784 1704 327 -855 650 -500 -1540 1035 1304 -584 338 244 -1183 -76 412
3843 412 -581 872 1317 -897 -709 368 -818 -125 1271 -256 -529 887 -255 -1124 104 -124 -64
3860 -64 1070 214 -687 329 -462 -1127 370 478 98 1473 323 -2118 -474 629 -337 905 1511
3877 1511 -825 -697 222 -1270 -376 1686 458 -352 474 -861 -814 1161 25 -996 1027 704 -879
3894 -879 487 107 -1762 156 1270 -552 428 1209 -981 -1199 -53 -311 777 1858 -238 -1152 -312
3911 -312 -811 -128 1406 256 -613 486 -355 -1141 462 695 -457 223 121 -641 664 525 -1061 -388
3929 -388 96 -140 1228 1062 -1393 -814 246 -699 247 1947 -44 -914 -114 -1201 -720 1817 1091 -891
3947 -891 -208 -389 -834 1182 700 -1154 55 602 -821 487 1110 -982 -635 606 -576 22 1768
3964 1768 -38 -1403 -478 -332 211 1659 449 -1171 -458 -273 -155 1098 476 -637 -158 -426 -736
3981 -736 824 1211 -526 -603 -329 -700 922 1343 -613 -877 -225 -367 673 1239 -607 -556 332 -791
3999 -791 -431 1580 511 -1153 39 -335 -850 1556 1300 -1403 -739 163 -407 721 1298 -733 -966
4016 -966 370 -585 -24 1345 140 -853 65 -499 -353 1304 499 -1061 -470 222 89 805 250 -961
4034 -961 -243 76 73 781 481 -623 -201 -178 -687 932 1305 -712 -696 1 -672 508 1449 -412 -941 453
4054 453 -283 -306 897 24 -909 597 46 -741 959 526 -1249 -177 568 -602 754 1073 -1312 -1000
4072 -1000 929 36 -34 958 -325 -949 429 151 -510 662 303 -688 -113 6 -90 588 141 -936 -155
4091 -155 609 223 357 -131 -823 238 639 -77 219 175 -819 -106 331 -520 339 1017 -930 -962 796 -34
4111 -34 -286 1005 -514 -1360 810 778 -856 196 360 -1029 259 963 -733 -80 667 -862 -603 1008
4129 1008 239 -156 360 -843 -778 1014 719 -517 -76 -387 -603 586 544 -368 80 -78 -557 258 498
4148 498 -36 228 -281 -982 173 948 116 -93 -183 -994 246 1168 -166 -386 324 -791 -379 973 42
4167 42 -226 667 -662 -968 964 752 -511 379 -235 -1153 692 1435 -655 -529 507 -871 -163 1319
4185 1319 -200 -650 515 -423 -872 974 713 -516 -99 -324 -734 814 832 -563 -334 -21 -255 458
4203 458 382 -185 51 -129 -697 401 734 -98 252 34 -1008 153 1132 -342 -281 248 -697 -252 1278
4222 1278 -55 -867 592 6 -965 633 393 -554 295 180 -1219 298 1162 -425 -365 322 -717 4
4240 4 1038 -380 -568 525 42 -400 392 148 -355 325 -92 -704 546 555 -349 12 22 -433 607 451
4260 451 -639 -97 416 -366 -155 147 -352 233 578 -508 -317 393 -198 36 523 -650 -265 965 -298
4279 -298 -708 801 95 -609 497 -8 -911 675 814 -840 -321 507 -388 149 805 -542 -378 560
4297 560 -298 -532 841 122 -499 131 -230 -429 748 368 -760 -161 -25 134 570 320 -583 -63 -150
4316 -150 -330 664 361 -441 166 -115 -758 486 1101 -393 -569 67 -591 189 1265 -285 -844 43 -54
4335 -54 -166 781 314 -698 96 -115 -590 915 960 -813 -432 -174 -434 760 1342 -526 -1118 -18 -134
4354 -134 216 1013 151 -736 -144 -330 -408 817 289 -440 -391 -343 43 998 518 -918 -479 -33 232 858
4374 858 340 -858 -600 -218 -227 796 947 -284 -622 -543 -685 607 1629 -24 -986 -223 -443 -225 1140
4393 1140 150 -1071 207 256 -546 627 491 -871 -416 376 10 634 843 -812 -1346 -228 309 960
4411 960 1195 -437 -1431 -476 108 148 828 398 -596 -160 -202 -262 568 359 -455 -218 144 223 619 -155 -1270
4432 -1270 -551 486 465 992 207 -1222 -851 156 130 743 1307 -463 -1209 -301 -309 137 1280 210 -1085
4451 -1085 4 168 -384 513 131 -895 114 1003 -168 -177 255 -997 -644 823 917 527 644 -862
4469 -862 -1596 -256 924 901 701 -298 -1218 -187 196 310 437 124 -329 -187 108 -122 181 -180 -614
4488 -614 57 751 482 395 -455 -1506 -315 1088 781 580 150 -1313 -924 445 296 508 909 -277
4506 -277 -1249 -143 450 -101 547 129 -1075 110 939 -115 -256 -160 -686 108 1353 416 -404 -78 -709
4525 -709 -711 800 1050 270 192 -786 -1218 203 1020 432 179 -404 -684 82 633 125 17 -55 -450 176 421
4546 421 28 199 -296 -1001 -79 833 491 38 -301 -1200 -401 1094 705 -64 -7 -790 -798 691 813 -64
4566 -64 188 -142 -1136 -1 991 268 -137 -155 -913 -192 1119 397 -467 -264 -405 -115 907 346 -325 -64
4586 -64 -303 -444 587 647 -40 -184 -528 -647 583 1021 49 -375 -488 -580 472 736 39 -190 -162 -637
4606 -637 28 624 234 143 -131 -760 -299 793 383 -262 -55 -365 -187 895 464 -585 -279 -115 -331
4625 -331 563 715 -337 -256 -130 -848 -14 1095 324 -426 -309 -579 -334 839 368 -421 -46 -90 -68 350
4645 350 156 -234 -60 83 -206 188 369 -279 -298 -276 -340 574 816 -202 -493 -361 -281 252 604 -59 -205
4666 -205 207 -439 -337 396 179 -95 303 -173 -636 474 399 -639 -82 135 -83 366 484 -621 -324
4685 -324 311 -89 -19 558 -49 -312 23 -316 -208 600 365 -392 10 -160 -181 403 346 -371 -26 317 -149
4706 -149 -85 25 -197 16 213 -260 -16 246 -77 -77 20 -134 47 501 -214 -330 248 15 -65 299 -10 -227
4728 -227 391 157 -540 177 371 -89 101 172 -429 229 473 -446 -130 418 -146 -111 243 -190 -91 444 -150
4749 -150 -396 331 131 -318 251 10 -379 332 267 -342 44 191 -99 70 185 -284 149 194 -376 -185 205
4770 205 7 79 268 -517 -322 503 47 53 260 -275 -206 375 -53 -332 518 123 -485 129 171 -176 278 168
4792 168 -635 -172 450 -84 85 230 -310 -54 394 -101 -23 382 -256 -398 221 173 25 389 -142 -611 3
4813 3 352 -50 101 -186 -467 176 351 -175 3 248 -340 -62 300 -148 62 369 -395 -531 330 268 82
4834 82 167 -504 -458 402 446 -165 84 -186 -359 145 280 7 199 118 -494 -75 335 80 179 -14 -581 -182
4856 -182 751 67 -159 54 -353 -236 444 8 -241 117 -196 -590 229 334 41 239 -164 -687 164 660
4876 660 37 -164 -202 -485 130 521 -35 -60 -126 -328 -137 449 102 27 154 -498 -359 505 448 -87 -96 -248
4898 -248 -408 596 593 -213 -188 11 -348 92 533 -106 7 110 -539 -76 645 257 -287 -100 -454 -120 718
4919 718 204 -433 -3 -275 -241 434 245 -208 85 -177 -419 188 573 -62 -117 -251 -600 297 792 -89 -362
4940 -362 -112 -389 118 618 -76 -189 59 -240 -179 444 369 -108 -86 -357 -291 553 412 -323 -329 -277 -253 605 430
4963 430 -317 -136 43 -418 100 778 -10 -181 -20 -418 -125 770 227 -546 -140 -119 -96 634 202 -480 -261
4984 -261 23 -212 313 468 -153 -319 6 -265 281 575 -41 -282 -166 -207 371 742 -25 -476 14 -147
5004 -147 182 547 -76 -306 156 -127 -289 524 225 -436 -148 37 -251 455 487 -446 -441 56 -26 306 344 -380
5026 -380 -339 -56 -201 35 469 -2 -296 4 -274 -150 586 169 -400 -122 42 27 374 50 -491 -195 382
5047 382 76 286 407 -402 -195 30 -222 214 601 -160 -515 -166 18 78 539 -36 -501 72 -76 -61 183
5068 183 37 -347 176 -3 -196 238 264 -468 -225 89 -98 350 428 -603 -475 207 3 115 280 -230
5088 -230 -384 135 -167 -184 586 246 -345 11 -57 -141 442 164 -528 -165 246 115 111 98 -455 -146 336 21
5110 21 -72 243 -152 -246 126 -29 -63 442 -121 -613 29 233 -87 229 16 -513 12 351 -155 -48 203
5131 203 -170 -25 126 -128 21 244 -276 -243 63 3 177 237 -303 -265 355 130 -149 13 -140 -298 169
5152 169 79 -258 194 142 -248 -138 97 -143 117 312 -289 -201 350 43 -101 89 -182 -135 345 116 -253
5173 -253 157 149 -251 -45 77 -5 51 -2 -318 -17 235 87 40 -74 -322 113 348 -161 -115 227 -145 -145 164
5196 164 -78 -98 289 49 -360 132 266 -16 18 -76 -232 198 334 -254 -72 129 -65 82 137 -74 83
5217 83 198 -257 -310 218 58 -7 218 -309 -170 352 128 -205 151 60 -159 173 155 -342 154 334 -310 -75
5239 -75 157 68 78 191 -256 -255 314 -20 -85 172 62 -78 328 7 -289 169 121 -152 -18 74 -66 178 -106
5262 -106 -386 18 301 -136 -82 130 -325 62 252 -289 61 364 -116 -260 7 -61 -122 399 -46 -298 134
5283 134 81 -43 -61 -89 -293 218 338 -252 -71 204 -86 -81 141 -126 218 412 -361 -367 92 74 102 305 -125
5306 -125 -358 8 74 -352 96 217 -105 107 -60 -324 117 191 -165 -51 270 204 198 3 -487 -93 191 119
5328 119 70 292 -258 -183 -43 -147 29 535 12 -316 -51 -194 -43 520 94 -365 16 334 -332 -86 218
5349 218 -367 30 451 -77 -166 203 -227 -641 59 232 217 272 -62 -598 -108 326 54 78 161 -231 -158 -93
5371 -93 -185 108 242 -121 -109 -29 -96 44 -38 -191 -242 268 12 143 40 -485 -228 370 -27 -10 270 -128 -391
5394 -391 120 5 -160 550 313 -401 -127 80 -341 172 333 -266 80 433 -255 -249 244 -35 -245 225 152
5415 152 -208 376 30 -503 -24 376 13 156 -19 -342 -130 200 91 21 -17 -102 -126 -134 3 38 -5 -161 -95
5438 -95 -31 -164 231 106 -319 11 365 -92 -154 390 -249 -181 488 18 -491 402 129 -436 129 318 -351
5459 -351 225 402 -480 -240 558 -41 -184 121 -250 -224 327 113 -466 278 138 -205 -57 168 -67 19 80
5480 80 -260 18 161 96 -68 -161 -189 155 124 -33 64 -160 -76 179 229 -280 165 250 -316 5 316 -192 -90
5503 -90 314 -407 -356 451 93 -457 227 176 -229 294 184 -643 -30 406 -273 27 462 -148 -237 260 -313
5524 -313 -314 548 335 -429 54 167 -244 226 168 -242 118 156 -25 -100 -7 -66 69 -95 -129 183 -9 -99 -146
5547 -146 -122 -306 344 159 -292 -57 74 -280 149 306 -303 10 453 -291 -348 566 162 -324 208 -54 -331
5568 -331 431 278 -531 -64 341 -300 -126 326 -297 -308 290 -194 -298 392 296 -337 -1 -42 -103 314 264 -152
5590 -152 -105 -19 17 133 61 -77 -46 32 -41 242 -26 -10 199 -111 -342 325 269 -193 52 10 -361 223 383
5613 383 -365 -154 380 -156 -316 334 41 -274 247 -55 -476 325 434 -351 -22 113 -325 164 522 -412
5633 -412 -228 390 -28 -253 256 6 -168 88 36 -218 136 153 -128 -64 -135 44 303 166 -135 -150 -170 172
5655 172 213 -77 -131 252 -197 -185 14 55 -145 202 -25 -353 173 325 -257 -255 252 -55 -25 395 -113 -191 371
5678 371 -8 -484 177 338 -296 44 206 -348 37 407 -294 -136 233 -52 -49 194 -25 -218 124 122 -219
5699 -219 -2 208 -36 78 -81 -152 164 91 -87 -177 -13 73 2 -45 -138 57 137 -62 98 20 -138 150 175
5722 175 -188 17 301 -23 -96 113 -186 2 368 -109 -374 206 15 -130 120 -26 -292 219 221 -412 10
5743 10 258 -36 -50 208 -224 -178 231 -19 -258 167 102 -143 29 -5 -217 138 160 -108 -53 67 167 -7
5765 -7 -90 -267 18 162 -134 -143 -63 37 12 -58 -211 145 103 -13 -7 -39 -53 30 152 -161 -98 279 -130 -26 169
5790 169 -36 -117 294 -80 -242 102 238 -163 14 171 -144 203 418 -241 -252 398 -43 -46 206 59 -197
5811 -197 166 63 -266 147 258 -208 -95 51 1 143 128 -190 -83 100 65 -90 -153 20 -27 133 -62 -55
5833 -55 171 69 -52 66 -246 26 225 22 -102 -110 -22 -11 68 -32 -52 218 34 -264 -44 202 77 35 34
5856 34 -256 69 231 -264 -185 106 53 38 169 -76 -350 199 202 -356 173 210 -118 3 -44 -233 9 393 -39
5879 -39 -146 97 -70 -149 139 -101 -113 274 163 -159 83 -35 26 21 69 -30 101 75 -167 -66 -143 103 276
5902 276 105 -152 69 -23 -56 80 263 -6 195 12 -447 -168 377 148 -98 262 48 -5 235 -79 -270
5923 -270 145 287 -68 106 106 -199 15 109 -100 20 260 -26 -71 -75 -214 110 397 124 -179 -54 -11 -142
5945 -142 69 -42 -2 246 -13 -174 -4 48 -241 -42 191 -18 170 83 -350 -97 30 24 195 118 -157 -66
5967 -66 3 -193 -138 120 178 97 144 -178 -155 204 -24 -217 92 69 -76 117 -32 -341 5 271 36 52 132
5990 132 -209 -74 158 -76 -14 363 11 -301 -31 -45 -83 176 20 -109 44 -38 -275 -124 16 -79 140 13
6012 13 -249 -55 222 -72 -20 7 -75 81 269 -239 -214 119 49 -62 80 -55 -135 220 -121 -226 173 180 -135
6035 -135 -7 80 -214 84 211 -154 -56 174 -88 -19 15 -149 29 243 -92 -168 98 27 38 157 -136 -82 233
6058 233 62 -160 56 -38 -86 87 -96 -139 69 215 -217 35 127 -98 124 87 -175 11 144 -134 -179 97
6080 97 -127 -109 93 -151 -80 205 180 -282 -77 -32 -129 253 274 -254 50 131 -258 -23 241 -73 4 123 -248
6103 -248 -128 203 36 -180 -53 -50 38 276 0 -292 -79 -65 16 165 80 -29 13 -173 -248 161 319 -46 -69
6126 -69 -65 -414 92 226 -232 -69 139 7 -49 256 -198 -223 206 24 -169 103 153 -249 32 -8 -74 340 322
6149 322 -144 -147 -37 -17 88 216 -155 -53 -39 -203 -63 178 60 -38 126 -302 -1 372 56 -174 -47 -152
6171 -152 -30 268 9 -90 -19 -25 -179 249 249 -100 39 -32 -329 9 279 -66 -168 -113 -184 51 198 -99 -198
6194 -198 34 -14 -177 170 115 -75 -17 -132 -275 94 298 14 -98 -162 -152 294 270 -132 -185 -79 -19 26 271
6217 271 39 -84 29 -265 -22 196 131 -31 -38 -329 -91 282 191 -179 60 -236 -163 214 150 -100 95 41
6239 41 -300 46 250 78 -4 -22 -374 16 377 -9 -135 119 -64 -33 226 92 -201 -56 -93 -265 -57 161
6261 161 -72 33 39 -237 21 253 51 -28 -43 -135 157 88 -87 16 20 -116 -110 90 -53 209 24 -212 -86
6284 -86 97 33 42 -38 -128 -190 234 -4 -45 40 -68 -216 84 114 -220 156 108 -296 -121 172 62 -81 2 -150
6308 -150 -8 269 49 -173 -24 -54 -161 130 -98 -110 60 54 -230 -71 76 -42 70 -45 -161 102 135 12
6330 12 -59 67 -104 -19 -26 -254 34 185 91 -33 59 -138 22 186 -85 -193 190 85 -185 85 73 -87 208
6353 208 -20 -241 -86 224 -62 -42 89 -76 88 234 -37 -74 103 54 -79 68 57 -8 -50 92 -217 122
6375 122 233 -61 -130 -90 -105 81 124 -106 -67 31 -223 9 -98 -96 129 60 -187 -177 155 43 60 14 -201 -181
6399 -181 293 16 -146 148 3 -309 55 109 -13 108 58 -273 -125 238 172 121 -143 -362 -60 287 143
6420 143 -61 75 -89 -102 63 117 183 101 -34 -386 -120 107 171 60 -236 -240 -8 187 85 90 -145 -126 71
6443 71 -33 75 206 76 -263 -283 33 75 271 142 -205 -216 -9 168 209 154 -181 -236 -45 21 58 149 158 -240
6467 -240 -177 88 19 224 116 -293 -175 41 212 151 60 -252 -389 105 -15 -47 126 -32 -158 -159 133 279
6489 279 125 -29 -297 -224 199 85 134 23 -210 -290 18 174 14 165 -162 -410 -72 158 109 250 -23
6510 -23 -357 -124 38 254 152 -48 -298 -155 137 118 94 14 -187 -240 -1 173 150 125 -80 -261 1 135
6532 135 159 161 -40 -368 97 302 224 23 115 -129 -229 80 20 176 88 -44 -248 -82 97 312 129 -226
6554 -226 -246 37 53 78 70 -109 -193 53 111 -45 153 -4 -280 -142 -136 149 188 33 -239 -185 80 29 86 52 -185
6579 -185 -83 198 97 88 184 179 -246 -141 6 -57 125 92 -178 31 158 -15 70 -115 -113 -44 -111 -121 -5 68 -117
6604 -117 -123 -17 -11 41 249 -17 -113 -65 35 75 140 -64 -228 45 77 -161 132 66 -166 25 -63 -168 33 168
6628 168 -90 -64 28 -69 3 78 -129 -91 149 -85 -202 59 -9 -96 91 -65 -280 115 106 -134 91 83 -87 -87 101
6653 101 125 78 92 48 -78 30 -7 138 114 -75 -171 36 45 60 144 -25 -45 189 64 13 147 43 -325 -115
6677 -115 -40 -49 184 215 -278 -82 108 58 120 184 -227 -95 149 30 -143 195 -1 -278 -13 27 -40 212 142
6700 142 -368 -126 35 126 153 115 -95 -77 18 29 264 145 6 -160 -43 -104 32 226 -91 -223 -113 88
6722 88 203 218 -18 -276 -52 112 43 203 113 -248 -157 23 -11 349 222 -238 -72 -112 -81 311 370 -218 -392
6745 -392 -66 76 31 198 8 -316 -193 -106 -49 370 168 -266 -186 -143 12 256 153 -194 -244 106 -13 145
6767 145 127 -81 -237 -82 32 220 224 -20 -183 -235 -175 234 361 79 -287 -144 -100 58 251 183 -135 36
6789 36 -24 23 306 165 -135 -144 -107 -108 195 214 -146 -238 -135 58 15 219 -42 -266 -14 19 4 290 95 -28
6813 -28 -253 -166 2 222 307 24 -115 -195 -32 99 272 -106 64 -29 -56 45 225 -14 -98 -100 -88 61 361
6836 361 39 -126 -82 -240 32 290 38 -132 -84 -87 -189 31 103 -144 98 -62 -164 -47 192 55 -54 0
6858 0 -181 -3 119 -89 -230 26 107 -67 40 80 -89 35 -119 -177 -8 164 26 -100 -131 -107 63 208
6880 208 -46 137 96 -92 38 9 -72 62 87 -76 -169 66 53 75 132 67 -155 73 50 -90 58 27 -73 91
6904 91 124 -96 156 144 -162 -10 10 -36 105 -11 -99 -163 45 72 -76 54 62 -43 39 -15 -154 84 49 -215
6928 -215 -96 18 41 137 115 -63 -217 -27 -88 70 -14 -112 -29 -27 -258 6 48 -22 -74 -38 -246 137 261 -122
6952 -122 -116 39 -26 -9 348 -40 -74 -29 -30 -97 187 206 -77 -20 43 -38 139 288 41 -61 -74 -58 -150 208 32
6977 32 -27 -3 51 -102 103 165 -57 -168 -90 -95 193 131 -101 -42 -199 47 266 132 -106 -17 -131 -231 26 127
7001 127 -55 177 -57 -208 -80 123 203 105 -98 -143 -64 237 104 -162 -21 23 -189 69 192 -85 59 -1
7023 -1 -159 45 283 104 27 -99 -213 38 182 48 44 66 -8 -115 66 131 39 127 29 -183 1 338 114 -10
7047 -10 -8 -128 45 233 -21 -20 -157 6 42 40 91 67 29 -269 -160 106 91 84 40 -235 -88 143 195 -5 34 -43
7073 -43 -140 61 -42 -70 143 162 -113 -157 69 157 151 -4 -174 -152 230 71 -9 -65 -61 -145 30 25 -44 159 163 -118
7099 -118 -59 234 16 21 123 -118 -112 -52 123 140 -44 -143 24 27 72 98 154 -7 -52 -59 -73 113 239 -28 -302 -13
7125 -13 -3 71 50 -88 -258 -46 109 -106 64 202 -127 -120 144 -64 87 85 -77 -176 -100 46 50 95 -55 -170
7149 -170 153 153 38 47 127 -95 19 24 -84 92 191 47 -135 101 111 119 54 -119 -50 23 12 31 -9 34 -128 -87
7175 -87 -100 -37 220 24 -104 -12 -67 4 88 43 -213 29 90 -65 -57 28 -23 47 23 -106 -67 202 -134 -44 20 57
7201 57 -88 91 82 -10 61 80 -125 -126 136 8 -26 122 -108 0 -30 -142 -73 66 -96 -15 90 30 -66 115 62
7226 62 -83 -74 15 31 17 -26 -165 -127 -39 4 -27 45 -111 25 64 -65 -115 90 -91 -119 7 -21 78 90 -145 -51
7252 -51 46 58 67 220 25 -294 108 179 86 50 187 -203 -1 39 -113 -42 147 -111 -129 -14 90 132 48 -60
7276 -60 -128 47 75 -45 -63 -88 -53 26 -27 76 149 74 -149 -209 -44 68 186 72 -254 -193 67 -77 171 135
7300 135 -65 16 110 -93 174 105 -109 -146 -62 109 91 119 2 -299 -21 226 103 114 -4 -304 -95 199 37
7323 37 188 144 -222 -198 95 23 -102 181 -123 -288 -25 166 83 184 -177 -90 -72 49 72 -46 201 -46 0
7346 0 70 -35 187 78 -113 -162 16 203 184 -12 -246 -120 122 108 43 160 -40 -259 -15 -34 40 108 50 -233
7370 -233 -33 154 -63 274 -30 -156 -63 149 52 88 -27 -172 -158 85 130 52 229 -15 -194 -184 -84 130
7392 130 60 -163 -186 -96 118 -41 -3 23 13 33 150 11 54 52 -28 -79 -9 22 173 -19 -276 -94 171 150 -4
7417 -4 -7 -171 -173 62 54 -154 -21 -27 -159 -52 67 63 17 -28 -116 -62 159 25 -69 68 -113 -5 70 -19 -94 -32 9
7444 9 11 -38 22 -15 81 -84 -214 3 93 42 -49 -184 -59 76 156 -22 -58 -72 -10 75 149 -16 -104 5 -148 61
7470 61 -11 -139 -15 62 -165 -40 212 97 -114 -86 -126 45 122 75 -73 -106 82 -62 14 -78 -29 65 77 -21 -148
7495 -148 147 44 -107 -80 16 41 166 0 -137 -7 15 60 36 116 -46 123 -133 -171 159 122 21 -15 35 -64
7519 -64 136 135 -155 55 45 -59 69 260 -161 -187 14 -22 0 140 63 -94 -57 -55 -84 37 86 -193 -216 -53 19
7544 19 -35 106 -199 19 57 -21 58 57 82 11 -39 -183 108 116 89 -23 -98 -71 12 158 54 -136 -110 -57 -60 180 139
7571 139 27 87 -125 -118 186 358 -22 -70 -71 -65 132 147 -80 -15 -37 191 -138 113 -30 110 77 48 -118 185
7595 185 113 -121 -97 -46 42 92 140 -100 -148 25 129 126 103 -68 46 9 -61 47 91 30 3 -105 -106 77 66 -30
7621 -30 -68 -33 -10 11 87 -74 -94 105 87 -48 89 184 -80 34 -37 -36 56 93 -10 -135 6 -107 30 62 -109
7646 -109 -17 33 92 -127 -39 -38 -29 -62 -4 -90 -2 1 28 27 -44 -3 199 36 -164 39 5 33 103 30 -67 82 89 -190 38
7675 38 151 -9 42 48 -98 -58 81 -9 -91 45 67 22 42 60 14 201 95 -150 -38 217 -33 112 -52 1
7699 1 -45 235 -95 -85 112 40 -50 -42 52 -65 107 -78 -111 -62 118 99 67 -47 -158 29 95 9 25 -26 -146 -28
7725 -28 -125 22 41 64 -49 -146 127 -5 -37 150 -15 -123 71 58 13 -12 -42 -86 101 89 -53 10 186 -124
7749 -124 -71 -33 -54 55 62 -143 -43 -21 91 -51 -30 -82 -3 87 14 -10 -60 117 -13 -71 -43 -6 26 -18 52 -56
7775 -56 75 -43 -162 -19 13 91 -15 -119 5 104 -47 -18 85 -117 -22 106 -75 -116 143 3 34 67 -85
7798 -85 -146 59 12 -116 6 82 -67 41 48 -31 -110 126 -83 -64 16 -25 -31 -19 -66 -23 104 75 15 -49 164 23
7824 23 -10 98 115 19 -56 -23 23 -34 21 -33 96 -184 -35 173 -89 -9 -82 -1 48 87 5 -199 137 -75 66
7849 66 95 -58 -61 10 75 -173 4 138 60 -187 0 -68 3 128 31 -129 56 -1 34 73 103 -27 67 55 -116
7874 -116 129 250 -104 -61 -42 30 190 188 -10 -24 -113 15 41 38 30 -156 32 -31 -17 -46 27 -24 -10 17 -6 275 79
7901 79 -165 -30 28 135 -15 -9 -150 -92 31 -34 -50 186 -50 -194 -32 -83 45 122 125 -189 -35 -27 -92 73 -27
7926 -27 -165 -2 36 13 -50 50 -75 117 112 -103 -24 171 67 11 -3 17 74 103 -100 -129 66 31 61 43 -19 80
7952 80 78 71 -21 37 -65 -31 -10 -116 32 45 35 -173 -67 83 35 -14 59 21 -60 120 66 -2 4 -7 -108 -27 -58 -26
7980 -26 165 96 -167 84 4 82 107 60 -112 -83 58 8 33 12 -168 -28 -8 17 -59 84 16 -76 35 28 20 76 -71
8007 -71 -55 -6 -11 70 95 140 -29 58 -7 39 153 46 -109 -87 53 56 -39 -41 -132 -60 -56 -61 -26 74 26 -16 45 10 -55 175
8037 175 89 -101 -65 -51 6 -23 100 -45 -92 12 47 174 -67 -125 -29 -22 -164 -67 -35 -58 -87 -44 71 -11 47 -18
8063 -18 -192 85 -33 48 78 85 -131 71 65 -142 -75 8 -98 -55 18 -28 93 84 -74 -42 -31 170 22 62 5 -30
8089 -30 67 38 -23 -34 -83 -121 42 -72 -25 140 62 -61 -36 -22 -33 74 -89 -122 75 152 -7 69 54 102 -59 28
8115 28 129 56 218 -43 -123 -74 45 20 197 -56 -87 95 128 53 -105 -23 10 68 -8 4 -4 -39 85 -149 -54 -81
8141 -81 11 96 14 -194 45 74 95 -63 -41 129 -47 -10 -136 35 -7 -11 71 -84 -22 19 33 110 -3 36 -92 68
8167 68 -40 -4 64 -55 -32 23 -31 56 105 -51 -125 -110 67 3 6 2 -72 71 123 50 -137 40 99 68
8191F8
##END NTUPLES=NMR FID
##END=
