##TITLE=1H_LY-844.1
 CCl4, 8 sc, 
 26.6.2019
##JCAMPDX= 6.0         $$ Bruker NMR JCAMP-DX V2.0
##DATA TYPE= NMR FID
##DATA CLASS= NTUPLES
##ORIGIN= UXNMR, Bruker Analytische Messtechnik GmbH
##OWNER= root
$$ XWIN-NMR		Version 3.5
$$ Wed Jun 26 16:03:37 2019 Russian Standard Time (UT+4h)  she@DPX200
##.OBSERVE FREQUENCY= 200.13155
##.OBSERVE NUCLEUS= ^1H
##.DELAY= (6, 6)
##.ACQUISITION MODE= SIMULTANEOUS
##.ACQUISITION SCHEME= undefined
##.AVERAGES= 8
##.DIGITISER RES= 18
##SPECTROMETER/DATA SYSTEM= spect
##.PULSE SEQUENCE= zg30
##.SOLVENT NAME= CDCl3
##.SHIFT REFERENCE= (INTERNAL, CDCl3, 0, 15.7039)
##AUDIT TRAIL= $$ (NUMBER, WHEN, WHO, WHERE, WHAT)
$$ ##TITLE= Audit trail, XWIN-NMR		Version 3.5
$$ ##JCAMPDX= 5.01
$$ ##ORIGIN= Bruker BioSpin GmbH
$$ ##OWNER= she
$$ F:/spectra/data/she/nmr/H-F/1/audita.txt
$$ ##AUDIT TRAIL=  $$ (NUMBER, WHEN, WHO, WHERE, WHAT)
(   1,<2019-06-26 16:01:55.68 +0400>,<she>,<DPX200>,
      <created by zg, POWCHK disabled, PULCHK disabled
       configuration hash MD5:
       00 E9 B6 7A A2 85 ED C7 34 08 36 98 17 FE 4E 26
       data hash MD5: 16K
       98 BB 17 CD 24 F4 C9 AD 14 D2 09 C2 5E 4E 21 E9>)
$$ ##END=
$$ 
$$ hash MD5
$$ E8 D6 CA 4C F9 40 41 3A 99 2B 98 63 47 09 2A C7
##$RELAX= 
##$RELAX= 
##$RELAX= 
##$RELAX= 
##$RELAX= 
##$RELAX= 
$$ Bruker specific parameters
$$ --------------------------
##$DU= <F:/spectra>
##$EXPNO= 1
##$NAME= <H-F>
##$PROCNO= 1
##$TYPE= <nmr>
##$USER= <she>
##$AMP= (0..31)
100 100 100 100 100 100 100 100 100 100 100 100 100 100 100 100 100 100 
100 100 100 100 100 100 100 100 100 100 100 100 100 100 
##$AQSEQ= 0
##$AQ_mod= 1
##$AUNM= <au_zg>
##$AUTOPOS= <>
##$BF1= 200.13
##$BF2= 200.13
##$BF3= 200.13
##$BF4= 200.13
##$BF5= 200.13
##$BF6= 200.13
##$BF7= 200.13
##$BF8= 200.13
##$BYTORDA= 1
##$CFDGTYP= 0
##$CFRGTYP= 5
##$CHEMSTR= <none>
##$CNST= (0..31)
1 1 145 1 1 1 1 1 1 1 1 1 1 1 1 1 1 1 1 1 1 1 1 1 1 1 1 1 1 1 1 1 
##$CPDPRG= <>
##$CPDPRG1= <>
##$CPDPRG2= <>
##$CPDPRG3= <>
##$CPDPRG4= <mlev>
##$CPDPRG5= <mlev>
##$CPDPRG6= <mlev>
##$CPDPRG7= <mlev>
##$CPDPRG8= <mlev>
##$CPDPRGB= <>
##$CPDPRGT= <>
##$D= (0..31)
0 1.2 0 0 0 0 0 0 0 0 0 0.03 0 0 0 0 0 0 0 0 0 0 0 0 0 0 0 0 0 0 0 0 
##$DATE= 1561550515
##$DBL= (0..7)
120 120 120 120 120 120 120 120 
##$DBP= (0..7)
150 150 150 150 150 150 150 150 
##$DBP07= 0
##$DBPNAM0= <>
##$DBPNAM1= <>
##$DBPNAM2= <>
##$DBPNAM3= <>
##$DBPNAM4= <>
##$DBPNAM5= <>
##$DBPNAM6= <>
##$DBPNAM7= <>
##$DBPOAL= (0..7)
0.5 0.5 0.5 0.5 0.5 0.5 0.5 0.5 
##$DBPOFFS= (0..7)
0 0 0 0 0 0 0 0 
##$DE= 6
##$DECBNUC= <off>
##$DECIM= 24
##$DECNUC= <off>
##$DECSTAT= 4
##$DIGMOD= 1
##$DIGTYP= 9
##$DL= (0..7)
0 120 120 120 120 120 120 120 
##$DP= (0..7)
150 150 150 150 150 150 150 150 
##$DP07= 0
##$DPNAME0= <>
##$DPNAME1= <>
##$DPNAME2= <>
##$DPNAME3= <>
##$DPNAME4= <>
##$DPNAME5= <>
##$DPNAME6= <>
##$DPNAME7= <>
##$DPOAL= (0..7)
0.5 0.5 0.5 0.5 0.5 0.5 0.5 0.5 
##$DPOFFS= (0..7)
0 0 0 0 0 0 0 0 
##$DQDMODE= 0
##$DR= 18
##$DS= 0
##$DSLIST= <SSSSSSSSSSSSSSS>
##$DSPFIRM= 0
$$ [...]
##$SUBNAM2= <"">
##$SUBNAM3= <"">
##$SUBNAM4= <"">
##$SUBNAM5= <"">
##$SUBNAM6= <"">
##$SUBNAM7= <"">
##$SUBNAM8= <"">
##$SUBNAM9= <"">
##$SW= 24.9336996594482
##$SWIBOX= (0..15)
0 0 2 0 0 0 0 0 0 0 0 0 0 0 0 0 
##$SW_h= 4990.01996007984
##$TD= 16384
##$TD0= 1
##$TE= 0
##$TE2= 300
##$TE3= 300
##$TEG= 300
##$TL= (0..7)
0 120 120 120 120 120 120 120 
##$TP= (0..7)
150 150 150 150 150 150 150 150 
##$TP07= 0
##$TPNAME0= <>
##$TPNAME1= <>
##$TPNAME2= <>
##$TPNAME3= <>
##$TPNAME4= <>
##$TPNAME5= <>
##$TPNAME6= <>
##$TPNAME7= <>
##$TPOAL= (0..7)
0.5 0.5 0.5 0.5 0.5 0.5 0.5 0.5 
##$TPOFFS= (0..7)
0 0 0 0 0 0 0 0 
##$TUNHIN= 0
##$TUNHOUT= 0
##$TUNXOUT= 0
##$USERA1= <user>
##$USERA2= <user>
##$USERA3= <user>
##$USERA4= <user>
##$USERA5= <user>
##$V9= 5
##$VALIST= <valist>
##$VCLIST= <CCCCCCCCCCCCCCC>
##$VD= 0
##$VDLIST= <DDDDDDDDDDDDDDD>
##$VPLIST= <PPPPPPPPPPPPPPP>
##$VTLIST= <TTTTTTTTTTTTTTT>
##$WBST= 1024
##$WBSW= 4
##$XGAIN= (0..3)
0 0 0 0 
##$XL= 0
##$YL= 0
##$YMAX_a= 27330
##$YMIN_a= -35192
##$ZGOPTNS= <>
##$ZL1= 120
##$ZL2= 120
##$ZL3= 120
##$ZL4= 120
##$ABSF1= 10
##$ABSF2= 0
##$ABSG= 5
##$ABSL= 3
##$ALPHA= 0
##$AQORDER= 0
##$ASSFAC= 0
##$ASSFACI= 0
##$ASSFACX= 0
##$ASSWID= 0
##$AUNMP= <proc_1d>
##$AZFE= 0.1
##$AZFW= 0.1
##$BCFW= 1
##$BC_mod= 2
##$BYTORDP= 1
##$COROFFS= 0
##$CY= 11.3945322036743
##$DATMOD= 1
##$DC= 2
##$DFILT= <>
##$DTYPP= 0
##$F1P= 18.9103706918063
##$F2P= -1.10871071338519
##$FCOR= 0.5
##$FTSIZE= 0
##$FT_mod= 4
##$GAMMA= 1
##$GB= 0.15
##$INTBC= 1
##$INTSCL= 1
##$ISEN= 128
##$LB= 0.24
##$LEV0= 0
##$LPBIN= 0
##$MAXI= 10000
##$MC2= 0
##$MEAN= 0
##$ME_mod= 0
##$MI= 1.114404
##$NCOEF= 0
##$NC_proc= 0
##$NLEV= 6
##$NOISF1= 3.799351
##$NOISF2= 2.8
##$NSP= 1
##$NTH_PI= 0
##$NZP= 0
##$OFFSET= 15.70392
##$PC= 1
##$PHC0= -8577.337
##$PHC1= 15.60098
##$PH_mod= 1
##$PKNL= yes
##$PPARMOD= 0
##$PSCAL= 0
##$PSIGN= 0
##$REVERSE= no
##$SF= 200.130013532006
##$SI= 16384
##$SIGF1= 3
##$SIGF2= 2
##$SINO= 400
##$SIOLD= 16384
##$SREGLST= <1H.CDCl3>
##$SSB= 0
##$STSI= 0
##$STSR= 0
##$SW_p= 3612.71676300578
##$SYMM= 0
##$S_DEV= 0
##$TDeff= 0
##$TDoff= 0
##$TI= <>
##$TILT= no
##$TM1= 0
##$TM2= 0
##$TOPLEV= 0
##$USERP1= <user>
##$USERP2= <user>
##$USERP3= <user>
##$USERP4= <user>
##$USERP5= <user>
##$WDW= 1
##$XDIM= 8192
##$YMAX_p= 0
##$YMIN_p= 0
$$ End of Bruker specific parameters
$$ ---------------------------------
##NTUPLES= NMR FID
##VAR_NAME=  TIME,          FID/REAL,        FID/IMAG
##SYMBOL=    X,             R,               I
##VAR_TYPE=  INDEPENDENT,   DEPENDENT,       DEPENDENT
##VAR_FORM=  AFFN,          ASDF,            ASDF
##VAR_DIM=   8192,          8192,            8192
##UNITS=     SECONDS,       ARBITRARY UNITS, ARBITRARY UNITS
##FACTOR=    0.0002004,     1,               1
##FIRST=     0,             0,               0
##LAST=      1.6414764,     0,               0
##MIN=       0,             -35192,          0
##MAX=       1.6414764,     27330,           0
$$ Real data points
##PAGE= N=1
##DATA TABLE= (X++(R..R)), XYDATA
0 0 0 0 0 0 0 0 0 0 0 0 0 0 0 0 0 0 0 0 0 0 -6 8 -8 8 -8 8 -8 8 -8 15 -16 16 -16 19 -24 24 -26 31 -32 38 -40 45 -49
43 -49 55 -62 68 -75 84 -96 107 -123 143 -167 199 -244 310 -414 595 -974 2047 -10513 -35192
62 -35192 14463 9658 -20459 17718 20245 -25767 -7957 15423 -8584 -1316 15468 -7639 -8737
75 -8737 8474 -1750 -1397 7925 -8717 -8796 11571 4503 -4192 5333 -3351 -14525 1450 13742
89 13742 4132 -3970 -1306 -2369 -10108 -940 18107 4499 -15403 2471 6113 -15573 3884 21290
103 21290 -12891 -13766 17901 -1229 -13768 14786 1819 -19624 8375 11332 -9618 6433 4541
116 4541 -19169 1629 13732 -7690 5668 12125 -20933 -8878 20093 -4575 -7757 18995 -4661
129 -4661 -21507 11682 10356 -13299 3899 10154 -11489 -4291 11045 216 -6181 84 912 -51
143 -51 1240 3086 1245 -6628 -4464 5992 2698 -1458 3722 -2228 -7236 2415 2794 -317 5320 -2543
159 -2543 -8201 5784 2291 -7453 7924 4295 -14904 3898 13564 -12107 -3747 14665 -9108
172 -9108 -9980 16611 794 -13647 8192 3274 -12302 6123 9093 -8383 -824 4099 -6118
185 -6118 1878 6539 -5147 -924 4143 -5352 -152 7252 -3893 -4082 5412 -1128 -4109 4582 1911
200 1911 -4700 -953 2671 1127 -1174 -705 1802 -1664 -3430 5178 3335 -7298 115 5892 -5451
215 -5451 -1341 8707 -3597 -6636 5989 -64 -4752 6418 998 -7415 2859 2290 -4336 4726
229 4726 2247 -8074 2328 5299 -6228 1542 6636 -7527 -3146 8591 -2248 -4424 6514
242 6514 -1350 -7413 4404 4484 -3500 346 998 -3740 117 3395 623 -498 -1484 -1614 1043 820
258 820 361 1666 -1461 -2960 1241 1560 139 1313 -1558 -2873 1657 1303 -155 2343 -1771 -4495
274 -4495 2927 2549 -2921 2603 2023 -6628 -318 5962 -2079 -1069 4276 -4014 -4456 5500 1874 -3117
290 -3117 2069 -601 -4334 2680 3115 -2179 594 367 -3711 975 3549 -1131 -314 759 -3191 -643
306 -643 3969 615 -1799 -104 -1078 -1001 1988 1861 -592 -1615 -1069 334 743 823 1454 -935 -3162 226
324 226 2242 84 835 521 -3323 -1145 3032 505 -411 1254 -2038 -2352 2345 1242 -787 1511
340 1511 -953 -3426 1519 2626 -964 469 226 -3312 80 3568 -162 -1069 711 -1797 -1454 2518
356 2518 1465 -852 -109 -1129 -1694 1320 2222 141 -859 -1348 -1143 913 1864 578 -763 -1383 -849
373 -849 572 1210 985 -77 -1660 -1244 646 1146 1137 490 -1975 -2000 1015 1588 575 567 -1211 -2397 476
392 476 1945 418 450 -236 -2409 -750 2009 1153 274 -168 -2146 -1378 1907 1807 -37 -473 -1453 -1386
410 -1386 1184 1929 273 -531 -1093 -1435 347 1945 1091 -501 -1501 -1416 270 1809 1384 -382 -1762
427 -1762 -1321 477 1433 1093 68 -1387 -1581 172 1324 1136 502 -1115 -2057 -173 1677 1260 313
444 313 -982 -2015 -377 1774 1235 44 -663 -1576 -770 1310 1390 295 -433 -1483 -1196 1038 1756 498
462 498 -631 -1485 -1098 980 1708 403 -654 -1155 -946 600 1420 553 -345 -1010 -1138 312 1416 789
480 789 -194 -1150 -1334 404 1618 573 -423 -857 -1127 192 1489 506 -428 -460 -991 -316 1313 863 -334
499 -334 -541 -1001 -475 1362 1082 -562 -692 -636 -379 1123 1033 -664 -647 -153 -403 527 1068 -209 -732 -366
519 -366 -314 559 1083 -154 -826 -497 -252 787 1105 -488 -846 -2 -262 262 1154 -210 -886 202 -194
538 -194 -281 1080 222 -1092 -26 231 -100 915 68 -1493 11 862 -124 630 353 -1680 -437 1236
556 1236 -100 133 1015 -1031 -1351 755 492 -13 740 -474 -1197 482 687 -106 99 -551 -593 972
574 972 655 -464 -30 -581 -979 909 1272 -92 -73 -651 -1495 282 1509 611 194 -773 -1568 350 1103
593 1103 -162 501 263 -1564 152 1521 -874 -542 1053 -1058 -612 2277 295 -1716 -71 -617
609 -617 -722 2284 1500 -1389 -812 -866 -1100 1754 1800 -802 -168 -338 -2009 549 2213 -493 -595 581
627 581 -1054 -326 1681 -204 -1441 77 393 665 1012 -609 -1243 -548 -475 1185 2256 -362 -1451
644 -1451 -426 -1406 -200 2969 1086 -1601 -459 -721 -984 1592 1178 -950 75 -107 -948 1100 510
661 510 -1637 402 773 -1166 1316 1781 -2544 -1579 1467 -336 529 2755 -1078 -2933 297 387 8
678 8 2012 498 -1657 -493 -507 -276 1795 446 -1283 386 -108 -1035 1397 613 -2052 138 1479
695 1479 -420 275 577 -1566 -764 836 426 1048 510 -1619 -666 141 -649 1608 1926 -1994 -1248 1264
713 1264 -964 -350 2401 -510 -1862 1266 211 -1273 1112 326 -1356 586 452 -533 1077 -277
729 -277 -1941 877 977 -991 1220 747 -2599 -129 1923 -970 -111 1771 -1135 -1371 1042 10
745 10 -248 1016 -461 -731 560 -348 88 1032 -1115 -705 1655 -428 -1142 1525 -128 -1711 1178
762 1178 723 -1324 715 657 -1403 167 755 -528 610 160 -1337 741 741 -1418 692 1169 -1809
779 -1809 71 1765 -1500 -617 2092 -795 -1402 1484 8 -1076 1003 42 -945 756 2 -678 828
796 828 -227 -738 1170 -256 -1393 1322 595 -1629 646 884 -1423 292 1197 -1040 -198 910 -659
813 -659 -165 612 -483 273 484 -1158 249 1157 -1099 -155 1299 -1150 -574 1838 -595 -1362 1343
830 1343 56 -1223 1054 439 -1052 471 32 -920 934 515 -861 567 -99 -1386 1060 1030 -1420
847 -1420 363 1095 -1490 -253 1399 -758 -446 1235 -476 -707 834 -205 -572 443 -210 124 975
864 975 -677 -805 642 -440 -332 1520 -5 -1179 596 -144 -1178 921 972 -593 171 -47 -982
881 -982 386 493 -563 613 488 -929 324 348 -1370 322 1377 -762 -84 1156 -1076 -1054 949
898 949 -98 -211 1396 -87 -1293 48 -150 -288 1073 329 -579 417 -363 -1166 581 604 -433 714
916 714 448 -1185 -168 457 -699 143 1065 -22 -148 -57 -940 -271 673 156 447 490 -826 -496 212
935 212 -615 188 1369 -97 -653 272 -576 -701 798 338 -209 746 -1 -1025 -61 -20 -236 980 558
954 558 -711 34 -36 -1031 226 952 -161 232 467 -1035 -638 648 -17 -36 777 -34 -484 47 -424
973 -424 -394 629 426 -6 217 -386 -652 136 80 -38 731 305 -598 -278 -221 -267 557 513 -222 31 -21 -511
995 -511 -17 197 -148 429 412 -500 -157 194 -473 -45 620 -50 18 432 -570 -696 435 308 -6 448
1015 448 -111 -639 55 97 -230 394 355 -338 -103 -20 -305 173 301 -260 -38 285 -112 -104 8 -256 37 394
1037 394 -4 -110 36 -232 -122 173 25 162 241 -343 -329 179 69 89 279 -261 -328 294 72 -237 201
1058 201 51 -288 171 133 -252 167 180 -423 -37 379 -46 -17 110 -372 -96 465 -3 -217 125 -104 -178
1079 -178 238 84 -162 119 -19 -304 54 252 36 -38 -140 -174 122 183 -28 -58 -124 -55 156 -19 -101 148
1101 148 -3 -221 95 93 -126 160 13 -383 122 381 -161 -94 117 -276 23 422 -171 -239 286 -99 -324
1122 -324 285 138 -200 177 3 -408 169 365 -209 -132 122 -126 16 222 -124 -162 149 23 -121 45 88
1143 88 -33 -87 -65 8 85 95 -9 -193 -126 214 84 -166 53 21 -198 122 153 -274 51 282 -329 -166 384
1166 384 -75 -177 276 -176 -296 452 117 -473 150 220 -325 140 281 -350 -5 353 -297 -178 425 -22
1186 -22 -260 154 -28 -180 272 125 -305 -43 203 -18 -114 59 31 -103 -2 91 -109 -65 254 -56 -349 189
1208 189 261 -306 27 216 -394 6 521 -321 -331 553 -117 -479 447 79 -528 411 217 -685 222 557 -556
1229 -556 -118 517 -351 -151 590 -282 -436 523 37 -462 306 184 -360 126 200 -318 68 340 -154 -242 114
1250 114 123 -71 -11 100 -48 -137 176 67 -348 126 369 -367 -161 471 -233 -286 541 -199 -527 667 155
1271 155 -805 392 422 -755 256 612 -801 -24 876 -644 -430 932 -239 -639 734 -50 -745 679
1289 679 297 -856 271 523 -579 28 492 -414 -124 498 -239 -310 382 79 -250 49 96 -52 -5 81
1309 81 2 -192 69 328 -257 -266 458 -41 -495 456 168 -677 429 451 -924 140 905 -713 -295 918
1329 918 -561 -538 1056 -253 -868 973 161 -1087 618 478 -976 423 665 -1001 63 944 -723
1346 -723 -343 864 -341 -428 730 -156 -630 555 203 -535 195 311 -281 -45 137 -69 -3 89 114 -127
1366 -127 -234 271 225 -399 97 401 -466 -54 566 -470 -231 840 -387 -671 860 0 -855 769 189
1385 189 -1067 675 633 -1245 227 1026 -976 -152 1107 -816 -566 1170 -394 -818 1076 76 -992
1402 -992 551 223 -786 547 538 -752 57 464 -510 -66 475 -166 -11 282 -247 -227 121 42 75 19 21
1423 21 212 -222 -360 288 -10 -184 675 48 -875 323 318 -848 436 902 -765 -84 713 -995 -384
1442 -384 1292 -278 -586 1035 -289 -1085 779 110 -899 988 663 -1143 133 472 -1038 186
1458 186 1102 -502 -120 744 -808 -776 695 160 -122 683 -61 -706 -12 -27 -173 389 389 85 -77 -456
1478 -456 -273 121 -2 345 542 -275 -214 101 -719 -207 985 154 -171 549 -605 -1003 630 220 -470
1497 -470 1059 449 -1264 -21 303 -958 524 1296 -686 -273 716 -978 -737 1020 81 -213 1024
1514 1024 -269 -1235 209 128 -453 829 699 -554 -139 -165 -830 150 838 184 116 37 -604 -370 27 41
1534 41 460 467 -33 -100 -452 -585 298 388 -19 571 234 -853 -221 103 -507 548 1087 -450 -411 292 -803
1555 -803 -398 1053 107 -245 777 -389 -1157 426 285 -413 806 488 -907 12 219 -890 146
1572 146 981 -175 -52 343 -763 -534 551 68 18 626 -111 -588 -103 -201 -31 604 244 -147 -9 -317
1592 -317 -274 202 19 126 501 -133 -393 64 -258 -175 587 128 -253 403 -144 -724 260 293 -260 519 301
1613 301 -770 -51 389 -486 111 702 -341 -204 388 -477 -343 675 -20 -332 453 -74 -495 290 1
1632 1 -397 433 286 -396 58 74 -351 178 272 -239 111 179 -350 -49 177 -131 163 173 -322 -4 219 -213
1654 -213 31 217 -246 25 269 -300 -78 378 -185 -135 316 -207 -163 402 -153 -311 412 25 -342 244 -4
1675 -4 -321 364 147 -441 143 197 -369 102 273 -296 75 246 -404 -95 362 -141 -61 261 -236 -136 274
1696 274 -174 -171 298 -7 -153 169 -121 -193 263 -2 -175 222 35 -234 91 -54 -168 297 125 -257 94
1717 94 52 -230 153 124 -205 186 170 -356 -10 209 -196 90 238 -270 -23 278 -271 -133 301 -83 -77 269
1739 269 -199 -244 301 -34 -244 271 47 -257 174 -15 -278 227 189 -276 66 121 -239 48 135 -216 79
1760 79 212 -202 -76 134 -120 13 153 -154 -23 181 -95 -77 127 -86 18 169 -176 -83 224 -88 -111
1781 -111 196 -97 -87 265 -115 -219 279 25 -229 181 26 -238 213 100 -335 139 211 -281 23 198 -209
1802 -209 55 249 -277 -108 274 -124 -118 202 -98 -100 184 -120 -174 183 11 -134 95 -44 -109 132 -33 -148
1824 -148 142 41 -100 76 -69 -132 205 26 -172 137 57 -193 116 52 -183 197 143 -283 35 188 -198
1845 -198 39 194 -221 -1 260 -193 -125 240 -78 -91 191 -94 -133 227 -57 -211 152 32 -126 119 -39
1866 -39 -166 150 46 -157 97 32 -141 114 -8 -177 149 81 -211 70 58 -178 124 85 -273 98 200 -239
1888 -239 -29 176 -205 11 246 -226 -97 287 -129 -191 229 -43 -143 232 -47 -240 206 74 -193 106
1908 106 57 -151 133 39 -189 102 99 -138 38 32 -118 124 44 -192 96 95 -176 94 49 -217 146 124 -287 42
1932 42 234 -225 10 236 -267 -43 344 -241 -198 353 -102 -237 322 -63 -272 337 40 -360 222 157 -289
1953 -289 134 147 -291 107 240 -279 -17 242 -157 -42 156 -128 6 191 -127 -67 144 -51 -1 78 -144
1974 -144 51 182 -158 -29 145 -174 18 213 -234 -73 312 -206 -204 325 -108 -195 350 -127 -369 379 92
1995 92 -406 271 152 -433 198 235 -428 126 375 -397 -71 373 -261 -91 364 -232 -190 400 -86 -264 242
2016 242 -26 -184 236 9 -193 173 21 -195 112 57 -43 144 -88 -188 163 6 -110 203 -43 -193
2036 -193 231 -42 -305 267 106 -321 230 116 -399 185 210 -472 118 460 -350 -70 325 -437 -129 562
2056 562 -196 -251 458 -198 -440 401 47 -291 428 61 -534 181 218 -333 169 253 -285 94 205 -333 -44
2077 -44 245 -134 38 202 -160 -44 68 -237 38 268 -33 65 40 -369 7 272 -163 86 289 -316 -134
2098 -134 256 -300 -70 538 -183 -315 401 -158 -410 417 4 -397 502 193 -602 127 169 -490 252 482
2118 482 -406 -24 314 -541 -179 563 -82 -97 343 -303 -371 353 4 -187 321 34 -265 129 -62 -209 200
2139 200 97 -102 159 -25 -181 81 -127 -117 350 87 -186 109 -179 -307 346 136 -254 303 54 -542
2159 -542 113 251 -342 241 359 -520 -56 438 -392 -138 515 -235 -197 511 -242 -465 441 2 -367 422
2179 422 155 -467 162 95 -459 226 418 -276 -13 174 -318 3 291 -119 -4 211 -174 -100 114 -86 48
2200 48 157 -153 -1 147 -166 -3 134 -188 85 284 -251 -84 251 -222 -89 373 -174 -192 379 -168 -374
2221 -374 401 53 -363 315 58 -484 287 265 -464 129 338 -390 -13 344 -337 -65 406 -258 -195 382 -103
2242 -103 -216 290 -65 -231 283 27 -261 187 87 -189 129 38 -151 136 58 -179 80 49 -95 131 -21
2263 -21 -163 175 54 -190 162 63 -234 158 85 -302 166 253 -311 6 232 -262 15 314 -276 -144 347
2284 347 -195 -199 368 -92 -268 288 -68 -312 353 119 -377 127 116 -284 153 196 -308 14 201 -217 -10
2305 -10 219 -155 -26 164 -137 -9 202 -127 -111 121 -38 50 190 -150 -167 111 -50 21 226 -84 -140 75
2327 75 -145 -75 306 28 -169 117 -93 -190 287 72 -282 158 112 -244 130 131 -298 66 247 -200 60 250
2349 250 -280 -197 180 -56 70 349 -173 -344 94 -32 -50 322 54 -228 33 -74 -188 211 157 -114 46
2370 46 4 -147 88 46 -175 65 160 -19 96 -42 -295 -7 156 7 202 164 -273 -191 8 -92 214 352
2392 352 -155 -220 13 -158 5 315 -33 -123 153 -100 -197 156 6 -158 185 90 -133 116 -24 -351 5
2413 5 238 48 141 37 -361 -164 139 35 166 218 -168 -209 -32 -106 88 284 -21 -128 26 -83 -30 149
2435 149 -65 -78 181 36 -78 53 -124 -155 145 111 14 159 -63 -314 -29 116 46 245 68 -316 -115 65
2457 65 -52 118 190 -134 -78 54 -138 -20 175 -47 -85 120 -20 -37 57 -129 -112 170 100 -22 40 -126 -176
2480 -176 77 80 1 139 -34 -194 -13 17 -3 187 53 -191 -6 56 -91 66 74 -124 35 122 -121 -37 111
2503 111 -88 -27 154 -38 -40 108 -116 -146 141 67 -57 58 -59 -133 77 44 -88 40 35 -86 4 1 -65 56
2527 56 44 -86 0 43 -36 12 -10 -69 62 37 -96 3 37 -47 62 50 -144 30 103 -89 -2 105 -102 -45 112
2552 112 -77 -44 171 -48 -142 115 20 -83 109 -19 -176 101 105 -100 9 53 -120 24 124 -51 0 66 -128
2575 -128 -78 99 54 13 -1 -122 -63 81 64 11 -33 -94 -41 36 -13 31 22 -114 -43 63 -7 65 59 -172 -106 145 54
2602 54 2 81 -132 -157 150 100 -55 107 -9 -223 54 156 -32 70 38 -239 -44 223 20 -14 47 -154 -88
2625 -88 186 64 -69 15 -68 -133 107 132 2 -21 -105 -117 71 157 56 -56 -154 -91 96 98 33 7 -140 -108 82
2650 82 50 33 79 -108 -209 72 130 -12 86 -66 -251 53 215 -47 0 40 -211 -39 242 30 -47 92 -144
2673 -144 -162 211 126 -73 19 -95 -186 148 195 -72 -47 -36 -122 64 182 2 -42 -41 -118 20 136 66 -28 -112 -145
2698 -145 42 130 40 -3 -113 -151 59 123 -30 37 -15 -196 3 181 -27 23 49 -222 -106 243 54 -83 62
2721 62 -130 -180 224 126 -153 38 29 -202 80 222 -69 -33 51 -164 -13 239 21 -110 -3 -80 -34 177 46
2744 46 -98 -6 -28 -44 84 72 -18 -44 -79 -37 82 56 16 -37 -149 -16 150 -21 -46 55 -115 -105 162 30 -108
2769 -108 102 -28 -224 114 150 -128 30 47 -220 43 213 -114 -74 116 -121 -61 219 -27 -118 148 -63 -168
2791 -168 163 100 -143 34 27 -133 69 143 -90 -49 34 -27 18 58 -28 4 -14 -58 27 47 -24 38 -28 -110 53 77 -68
2818 -68 0 13 -109 39 87 -122 10 96 -128 -40 142 -87 -56 170 -112 -162 209 16 -188 117 52 -175 98
2841 98 98 -174 41 147 -123 -10 125 -82 -2 110 -102 -32 131 -56 -64 102 -39 -52 94 -23 -78 83 16
2864 16 -78 2 2 24 63 -47 -38 31 -53 -5 129 -53 -72 104 -83 -155 148 80 -140 59 11 -176 85 130 -151 -1
2890 -1 90 -122 17 110 -150 -51 126 -102 -31 223 -78 -177 82 -42 -58 234 85 -223 -30 15 -75 95 115 -54
2914 -54 -44 -41 -87 64 86 -33 23 -24 -106 91 71 -138 -18 76 -29 80 95 -156 -98 26 -35 108 174 -96 -119
2939 -119 -54 -175 62 312 -25 -151 31 -132 -119 224 65 -164 86 31 -178 59 79 -139 7 86 -43 83
2961 83 58 -215 -101 68 30 177 176 -188 -203 23 -26 88 249 10 -171 -80 -96 8 177 75 -56 -26 -103 -17
2985 -17 103 -63 -96 116 18 -42 115 -80 -239 23 95 -1 172 60 -275 -176 5 10 202 163 -183 -152 -35 -111
3009 -111 86 204 -80 -102 66 -131 -88 159 -20 -133 103 56 -52 56 -65 -185 41 131 81 89 -87 -206
3031 -206 -29 54 56 195 66 -200 -107 -8 -42 152 152 -117 -92 25 -57 33 77 -85 7 92 -46 -14 45 -144 -89 152
3057 152 17 -3 129 -136 -238 77 123 10 110 -29 -220 -23 69 -37 100 58 -120 -44 24 -57 67 65 -118
3080 -118 -28 97 -38 -13 51 -106 -35 130 26 -34 25 -81 -49 66 12 27 65 -86 -93 67 -3 -10 112 -62 -116
3105 -116 96 33 -83 65 16 -106 43 55 -111 18 51 -95 0 72 -66 -5 58 -122 -20 121 -59 -73 72
3128 72 -59 -61 115 -23 -101 59 3 -83 49 41 -55 27 -1 -60 50 25 -39 35 7 -42 62 10 -92 35 61 -43
3154 -43 30 18 -99 7 60 -38 39 62 -81 -28 35 -50 20 111 -84 -72 84 -30 -45 84 -34 -88 88 18 -107
3179 -107 26 -1 -103 34 54 -54 24 -6 -132 -7 93 -9 7 5 -116 -15 85 -26 -11 27 -60 -35 45 -6
3203 -6 -13 46 -48 -25 49 5 -8 14 -65 -15 98 6 -33 20 -61 -69 89 45 -37 36 -19 -112 42 73 -21 32 6 -103 18
3232 18 96 -41 -11 20 -86 -12 86 -49 -48 44 -58 -56 83 26 -60 6 -49 -64 65 43 -39 -19 -38 -46 59 22 -43 3
3260 3 -30 -63 36 49 -28 11 -10 -80 33 73 -25 -11 -5 -58 28 60 -38 -14 26 -44 -11 76 -22 -30 34 -61 -53 84 21 -71 -6
3291 -6 -29 -51 64 29 -57 -9 -12 -51 36 40 -50 8 -7 -69 15 51 -34 -16 -2 -55 2 39 -36 -27 23 -33 4 41 -25 -18 36 -51
3323 -51 -7 74 4 -35 42 -22 -32 71 16 -72 18 -2 -49 39 35 -41 19 26 -62 2 66 -32 -3 16 -63 12 58 -37 -31 27 -16
3354 -16 -29 18 -19 -30 22 -29 -19 20 4 -12 23 -37 -27 49 -1 -28 25 -17 -41 36 -7 -53 34 3 -57 9 21 -29 38 8
3384 8 -62 12 48 -40 -6 32 -39 0 51 -34 -28 68 -22 -41 52 3 -18 52 -25 -64 42 24 -28 24 1 -42 29 21 -43 8 13 -43
3416 -43 -13 9 -21 15 9 -59 -21 20 -13 -12 -1 -40 5 23 -50 5 32 -45 -6 27 -39 -1 47 -55 -40 55 17 -24 34 -29 -44
3447 -44 59 32 -50 42 17 -74 32 33 -48 27 29 -62 -10 57 -14 -11 21 -42 -7 57 -11 -23 23 -18 -37 30 -6 -11 9 -32 -27 15
3479 15 6 -14 1 -41 -23 35 0 -29 24 -28 -36 32 -11 -38 37 2 -64 21 27 -40 13 12 -68 21 65 -48 -18 35 -40 -4 61 -15
3511 -15 -24 37 -44 -35 59 14 -35 23 -1 -51 23 31 -42 -8 10 -21 18 8 -37 2 -7 -27 12 7 -24 -13 -26 -50 22 56 -21 -15 -15 -50
3545 -50 5 32 -28 -17 20 -54 -14 34 -42 -2 45 -40 -46 62 -5 -53 37 6 -36 54 28 -78 -8 26 -27 38 37 -40 8 -3
3575 -3 -47 23 61 -12 -10 13 -35 -25 47 -17 -29 29 0 -17 2 -25 -20 2 -9 1 6 -20 -30 -2 -45 -1 58 -27 -59 13 -12 -39
3607 -39 43 16 -45 6 -2 -61 -1 32 -32 21 17 -42 8 28 -66 -9 52 -29 -4 44 -43 -45 47 0 -26 37 5 -40 -11 4 0 35
3639 35 4 -36 -2 -11 -5 25 -7 -28 26 17 -46 15 -1 -33 7 17 -33 6 3 -43 -8 3 -27 26 24 -66 -13 35 -28 -5 27 -42 -28
3672 -28 43 -30 -48 46 10 -45 21 27 -27 24 3 -27 20 19 -34 16 1 -30 29 19 -39 0 33 -31 4 28 -10 3 13 -25 -14
3703 -14 29 -6 -1 2 -27 3 42 -35 -17 26 -28 -23 39 -24 -45 35 -6 -35 19 10 -32 1 -6 -31 28 12 -39 3 10 -37 2 14 -45
3736 -45 5 27 -31 -3 45 -13 -10 23 1 -4 31 -5 -8 22 11 5 23 -23 -21 25 -18 -23 30 -2 -21 41 3 -26 40 12 -38 7 3 -18
3770 -18 16 -5 -34 18 18 -35 1 16 -51 -10 16 -44 -7 40 -27 -27 26 -13 -33 10 -21 -21 12 10 -14 -9 -16 -19 26 -2 -8 21 1 -32
3804 -32 12 17 -10 31 4 -43 -13 13 -26 17 9 -19 4 21 -33 -3 25 -15 0 32 -23 -15 18 -34 -17 40 1 -31 3 -19 -32 18
3836 18 22 -26 33 -9 -35 1 6 -3 36 -4 -43 -10 -2 -25 -8 17 -20 3 17 -20 -16 16 -5 5 22 -15 -2 17 -27 -7 29 15 19
3869 19 28 -32 -28 26 19 -5 46 7 -47 -8 -12 -18 41 11 -22 -4 -3 -32 10 10 -34 8 24 -44 -10 19 -37 -18 28 -11 -7 2 -53 -50 6
3904 6 16 19 31 -22 -42 -22 -6 -12 38 1 -39 -14 -15 -25 28 11 -30 -1 2 -7 8 -10 -33 8 15 -2 14 -5 -51 -3 20 -6 23 16
3938 16 -42 -33 16 9 19 27 -35 -39 16 -18 4 22 -31 -37 10 -18 -37 10 -1 -52 3 20 -13 5 -13 -63 -13 34 -5 2 -18 -36 -15
3971 -15 19 4 3 -5 -31 -18 16 -1 9 7 -33 -27 27 14 3 -4 -19 -18 8 2 -1 8 -11 -6 32 -1 -7 26 -20 -37 21 39 1 5 8 -42 5
4008 5 30 -13 -8 5 -38 -8 31 -9 -2 5 -36 -32 22 5 -20 4 -29 -31 25 9 -16 -21 -13 -14 16 12 -6 -4 -18 -17 20 10 -1 12 -18 -28
4044 -28 29 29 -9 -11 1 -32 8 20 -14 2 11 -17 -5 19 -16 -15 2 -17 1 38 -6 -38 4 -4 -12 17 9 -36 -10 -2 -26 4 1 -28 -9
4079 -9 -5 -12 9 -2 -12 -16 -10 -1 -3 -6 -20 -27 14 -7 9 -5 -17 2 6 -12 19 21 -16 -7 12 -5 5 31 -21 -19 15 3 -10 17 -8 -32 15
4116 15 18 -17 6 12 -26 -1 19 -9 5 14 -32 -3 29 3 -20 -5 -25 -8 15 7 -25 -7 -14 -7 17 8 -11 -11 -25 -23 22 0 -21 -11 -21
4151 -21 -20 8 -5 -20 3 -7 -10 28 8 -11 11 -1 -32 7 29 -17 -2 -8 -22 15 35 -3 -21 6 -14 -13 19 -11 -13 7 -3 -9 27
4184 27 6 -20 -4 -9 -16 20 6 -32 -24 -3 -16 -5 5 -31 -19 -7 -13 -7 -1 -28 -6 -9 -14 -1 4 -24 -18 -16 -20 3 11 -10 -17 3 -19 -16 26 -8
4222 -8 -19 18 -13 -10 28 -1 -24 7 4 -11 14 12 -30 -1 11 -7 11 25 -4 -7 11 -17 -11 13 -6 -12 -7 -6 4 1 -14 -17 0 -18 -15 -1
4258 -1 -18 -19 2 -15 -2 -3 2 -6 10 5 -14 10 -1 -16 17 -18 -19 -1 -2 -19 6 19 -31 16 11 -4 6 16 -15 2 26 1 -14 3 -2
4293 -2 -13 8 0 -3 18 -5 -16 6 8 -13 -6 -18 -8 17 6 -8 -16 -19 -16 -17 -16 -19 8 -22 -29 2 11 -15 1 -14 -24 1 11 -2 -12 -7 -24
4330 -24 -8 11 -3 -10 7 -13 -6 17 8 -6 4 -12 -9 26 20 -15 -3 -8 -10 19 24 -14 -2 0 -13 5 28 2 9 3 -24 -1 6 -2 -16 -15 -6 11
4368 11 19 -11 -20 7 -16 5 21 -6 -23 -21 -25 -2 7 6 -23 -14 -25 -1 18 5 -19 -3 -15 -20 16 2 -17 5 1 -13 15 8 -17 -10 2 23
4404 23 22 26 -20 -22 -2 15 19 26 -9 -16 -11 -16 3 11 -1 -8 -22 -12 4 4 -10 -17 -8 7 -12 -1 -29 -35 -9 0 4 4 -3 -32 -23 -4 3 21 9 -29
4444 -29 -19 -7 -8 9 4 -26 -19 -3 -13 -12 5 -14 -10 15 5 -13 -5 -15 -15 17 23 6 -2 -7 -15 7 32 18 3 3 -25 -11 3 1 12 5 -16
4481 -16 -9 7 -8 -3 -25 -20 4 10 -18 -26 -36 -18 -6 16 -16 -24 -29 -33 -22 12 9 -5 1 -30 -31 6 12 -20 -2 -21 -17 2 3 -26 -9 -13 -11 10
4519 10 18 -37 -26 -3 -6 11 12 7 -22 -20 -10 16 21 -5 -15 -13 -9 -3 11 -10 -3 -15 -10 4 6 4 -14 -12 -13 -1 4 -10 -52 -27 -18 -13 12 -4 -27
4558 -27 -21 -10 -4 1 11 -28 -28 -16 -19 8 1 -29 -26 4 -5 -2 10 -15 -28 -11 -1 -1 3 -9 -23 4 19 12 0 -16 -20 4 8 17 3 -9 -18 -16 11
4597 11 11 5 -11 -17 -17 2 -9 5 11 -15 -17 3 -2 3 -3 -42 -30 -2 2 -9 -7 -24 -30 0 -7 -16 -7 -13 -44 -3 3 -5 -9 -23 -24 -8 16 -12 -3 -3 -22
4638 -22 -2 12 -3 5 -2 -3 3 4 -1 2 -11 -15 -10 14 1 -22 -9 -4 -6 19 15 -7 1 -18 -18 2 1 -10 -6 -9 -23 -5 -9 -9 0 -7 -24 -6 -8 -13 -13 -6 -7
4681 -7 -6 6 -16 -19 5 -13 -17 18 2 -11 -16 -14 -15 9 0 -15 -10 -6 -11 6 -1 -9 2 10 -6 3 6 -4 6 -7 -10 2 7 -14 -11 0 1 6 11 -24 -6
4722 -6 -1 -6 -1 -1 -25 -7 4 -22 -27 1 -13 -21 -4 -12 -15 -7 -7 -15 6 1 -19 -6 -5 -16 -5 -5 -20 -19 -14 -7 -8 -12 -19 -18 1 4 -13 5 -9 -8 12 -5
4764 -5 2 12 -7 0 5 10 -2 -5 -8 -9 14 -13 -12 13 -7 -15 -8 -12 -10 4 -7 -26 -9 -1 -3 -19 -18 -21 -6 -12 -18 -15 -2 -20 -14 -2 0 -7 -9 -6 -8 1 -2 -9 -9
4809 -9 -13 3 12 6 -10 4 -2 -5 -5 -2 -3 -1 -11 -8 10 9 -5 -3 -4 -1 18 8 -3 -6 13 0 8 14 -19 -8 -6 -15 -6 14 -13 -15 -18 -6 -9 14 -17 -35
4851 -35 -10 -11 -17 6 -16 -26 -14 -2 -17 -4 1 -11 -13 -2 -2 7 0 -26 -3 3 -5 -2 10 -19 -15 8 -5 -4 9 -9 -1 5 4 10 14 0 -15 3 -13
4890 -13 1 12 -13 -12 4 6 5 -2 -5 -30 -9 7 -17 6 -10 -24 -17 5 -7 14 -12 -30 -14 7 -8 -5 -4 -32 -21 5 -5 -1 6 -28 -21 -8
4926 -8 0 -2 -13 -32 -16 6 -6 -10 -9 -16 -15 7 -1 -19 -12 -16 -15 9 4 0 1 -13 -18 1 9 -4 -4 -9 -12 -1 18 -4 -14 -12 -15 4 11 -13 -13 -12 -21 -4 14
4969 14 0 -16 -7 -28 -27 1 3 -19 -12 -16 -7 -4 4 -13 -10 -3 -15 12 8 -5 -19 -22 -16 10 12 -1 -9 -9 -6 2 14 -6 -9 4 -2 -11 19 5 -5 1 -6 -4
5011 -4 13 -2 -17 -14 -11 -6 0 -3 -16 -7 -3 -5 11 19 -17 -14 -12 -3 4 8 -21 -23 1 -18 6 7 -19 -20 5 2 -7 1 -13 -13 1 -8 -5 10 -8 -20 -2 5 0
5054 0 -1 -14 -25 -12 6 2 17 -9 -6 -4 3 -6 -4 6 -9 -7 12 1 5 2 -11 -12 3 4 -9 3 -12 -15 -3 -5 -14 -3 -8 -12 -11 0 -8 0 -20 -30 -5
5095 -5 -10 -13 -5 -5 -20 10 5 -15 -17 -3 -3 -12 11 -17 -7 -7 -16 0 7 -9 -3 -2 -17 0 12 0 -7 2 5 -8 -3 7 0 7 -1 -7 5 6 0 8 5 -5 5
5138 5 2 -3 3 -1 -4 6 -1 -21 -3 -1 -14 -19 -5 -8 -19 -11 -11 -5 1 -3 -9 -7 1 -15 -6 -10 -18 -1 -2 -14 -6 5 -9 -4 -9 -15 4 3 -8 -13 4 -1 4 9 -8 -4
5184 -4 4 -10 -5 -4 -8 -3 -3 -5 -12 1 1 -10 2 -3 -14 3 -5 -5 -2 4 -5 2 -10 -14 -9 -12 -9 -16 -1 -16 -9 -13 -8 8 -9 -18 -15 -3 -3 -7 -6 -12 -2 4 -16 -15 6
5231 6 -3 -3 6 -16 -3 18 -3 0 5 11 -2 18 8 -10 0 0 -10 14 3 -6 -3 1 -15 5 -3 -10 4 14 0 -1 -2 -26 -14 4 -10 -12 8 -3
5269 -3 -7 -12 -14 -14 1 -5 -15 -3 -7 -13 0 -12 -12 -1 -11 -10 -10 -6 -5 9 1 -24 8 12 -17 -10 8 5 11 14 -4 6 19 6 8 12 18 -1 9 -16 -13 3
5311 3 -1 -8 -2 -7 -7 0 2 -6 3 -12 -6 1 -3 -19 -6 4 -10 -3 5 -15 -8 -2 -15 -1 3 -10 -3 0 6 1 11 -17 -13 6 -18 -7 10 5 -7 8 17 -15 12
5354 12 -5 -15 6 34 8 2 3 -19 0 8 4 2 15 -7 -6 7 5 8 4 -4 2 9 -9 -5 -9 -11 6 13 -2 -3 -4 -15 6 8 -9 -11 8 -10 -23 11
5394 11 6 -8 -1 7 -39 1 6 1 -1 17 -8 -8 17 -26 -17 15 -7 -16 14 1 -4 12 2 -12 16 10 5 5 9 7 4 6 -9 3 -12 -11 8 0 -2 2 -2
5435 -2 -7 2 -4 8 4 -8 -13 19 9 -11 12 2 -10 -2 3 -16 -4 3 -24 -14 18 -10 -18 6 9 -7 8 -1 -14 0 -5 -5 5 9 -3 -2 -8 -3 -6 8
5475 8 2 2 12 9 2 8 0 3 15 10 13 -4 1 5 6 -1 10 -2 -8 4 7 -6 14 12 -16 0 6 -6 -11 11 0 -19 6 -6 -25 1 -7 -18 -4 6
5515 6 -18 -5 2 -29 -7 9 -9 -20 5 -6 -14 9 -7 -5 6 12 0 -3 8 1 2 7 8 14 3 3 1 -11 15 22 0 -11 3 7 1 7 3 -14 6
5554 6 0 -12 16 6 -11 26 4 -35 6 17 -12 4 -2 -17 -13 9 -20 -10 7 -21 -12 -4 -2 -2 0 -6 -17 9 17 -2 -5 -7 -9 1 5 -7 -5 8
5592 8 -2 -3 3 -7 4 5 -5 14 5 -8 1 12 3 15 7 -23 5 -2 -17 7 7 -6 6 16 -19 -13 17 0 -3 -2 -6 -13 8 -2 -21 4 1 -11
5630 -11 -7 1 -3 -12 -5 -19 -8 10 4 -7 11 -1 -3 8 1 -5 -2 -7 -6 -8 -4 6 8 -3 7 7 8 -5 21 -9 -4 11 10 2 11 2 -1 25 -10 -6 10 -6
5672 -6 -3 6 7 -20 -2 -4 -16 7 19 -32 -12 9 -6 -3 -4 -12 -8 -2 -7 -17 4 -5 -14 3 -1 -8 -6 16 -15 -3 -3 6 0 8 -2 2 7 6 -4 -3 1 0 -2 -5
5716 -5 25 -7 -4 2 6 15 19 11 0 10 23 1 6 5 -3 5 24 -9 -15 19 -8 -2 8 -11 -15 12 -13 -12 0 2 -13 -10 -10 -17 -3 -10 -16 -9 -5 -10 -19 1 3
5759 3 -5 11 -5 -1 -10 -5 14 -12 -1 -2 16 -7 -11 -4 -5 -2 3 -8 8 3 1 1 2 -2 5 9 0 -5 14 12 -16 17 3 -8 7 -4 -11 17 12 -8 -6 11
5801 11 2 -14 13 -19 -10 6 -20 -13 1 -7 -10 7 -14 -12 3 -3 -27 5 5 -7 2 10 2 4 -1 -7 -1 1 -6 -2 -13 -9 1 5 -5 -4 4 4 0 3 -11 -8 -6 -2
5845 -2 7 11 -1 -8 15 -21 -11 -5 2 -15 -1 4 -6 7 -9 -19 -8 -4 -18 9 0 -10 -9 -7 -25 1 -1 -15 -16 -15 -11 -17 -5 -14 -11 -5 3 -11 -12 -7 -2 0
5887 0 2 -8 0 -7 4 2 -1 10 14 7 -6 -2 5 6 9 15 4 8 4 -9 5 8 1 5 -7 -21 3 2 -12 -8 9 -9 -17 -9 -6 -15 -1 7 -8 -5 -9 -15 -14 -20 -13 7
5933 7 -2 -18 -15 -7 -14 5 0 -11 0 5 -23 -11 8 -9 -6 2 -14 -2 -5 -8 3 -1 7 6 -2 -15 -13 8 4 5 4 -4 -2 6 -10 -1 12 6 -11 -14 -9 -13 -8 -9 -21
5978 -21 5 3 -8 -20 -16 -18 -15 -9 -12 -12 -2 -10 -22 -8 -8 -9 -6 -9 -14 -6 -3 -5 7 4 7 4 -2 -13 0 -9 -2 4 -14 -4 15 -8 -14 -1 11 -1 -6 -8 -3 -4
6022 -4 6 -10 -9 17 -8 1 3 3 1 8 -21 -14 4 0 -19 5 0 2 4 -11 -13 -5 -7 -21 -17 -9 -31 -8 -12 -13 -14 -9 -9 -5 -1 -16 -5 -2 -22 -4 -9 -4 -16 -15
6066 -15 -6 -10 3 -8 -7 12 0 8 11 -3 -18 12 3 -3 -1 -10 1 0 -15 -24 1 5 -6 -6 1 -13 -14 2 -6 2 7 -6 -8 3 -1 -6 -4 -8 -13 -9 -5 -17 -9 -21
6110 -21 -5 -7 -12 -14 -9 -19 -20 10 -8 1 4 -2 -7 6 12 -5 7 2 -20 0 1 -8 5 -4 -12 4 8 4 8 2 -2 5 17 4 6 -4 -1 4 16 -5 -13 5 -1
6153 -1 2 0 1 3 6 -10 -17 3 6 2 8 -18 -7 9 1 -13 3 -10 -11 -11 -3 -16 -13 -5 -26 -5 9 2 -6 -4 -21 -13 3 -3 -4 -8 -6 -11 -1 0 -14 10 -4
6196 -4 -8 18 6 -3 8 -17 -7 12 7 -11 -13 -7 -15 -12 -4 -16 0 -3 -24 -2 3 -5 -10 -4 -3 -11 4 -11 -7 7 -15 -15 -1 -13 -7 -9 -14 -19 0 4 -20 2
6238 2 -13 -6 16 0 -8 -7 -3 -6 2 0 -5 -4 -12 -5 2 3 7 -1 -7 -3 8 21 4 -11 3 -7 -4 16 -2 -3 -4 8 -8 -5 1 -9 -4 -8 0 12 0 1 5 -10
6282 -10 -14 -2 -9 -11 1 -11 -18 0 0 -25 -18 -17 -10 1 6 -3 -12 -10 -15 12 -1 -5 -19 8 -4 -10 2 -6 -10 12 6 -8 -5 4 3 -12 -7 -6 14 -10 -7 -4 -5
6325 -5 -4 4 0 -5 1 -4 -12 -4 1 10 0 5 -11 1 -4 -18 -15 -6 -8 -2 2 -18 -1 8 -26 -8 -1 -16 -14 0 -11 -7 4 4 -1 0 -7 -10 -2 1 -9 20 12 0 -1 1
6371 1 -5 7 3 -7 0 12 -4 2 -2 2 0 -7 -10 6 10 -6 -22 -13 2 0 4 2 -5 -13 0 -3 12 -11 -17 -5 -17 -19 7 8 -21 -13 -6 -10 -7 -3 -24 -8 -1 -1
6415 -1 7 3 -8 -11 8 -9 11 20 3 -21 -12 -6 -13 15 6 -13 -9 3 12 5 11 -7 1 -2 -15 20 15 -1 4 -2 7 20 3 -24 -6 9 -1 16 4 -12
6455 -12 -12 -16 -6 1 -4 -16 -23 -11 -9 9 10 -12 -29 -10 -2 -14 5 -10 -21 -13 -5 -4 5 -2 -9 -18 -3 -2 5 -1 -24 -22 -9 0 -4 -2 -6 -12 -15 -10 4 8 -2 -17
6499 -17 -3 2 -4 9 -8 -4 1 4 16 13 -4 -23 -3 -1 4 15 -8 -25 -1 -4 -9 17 11 -16 -22 -9 -3 -3 8 -13 -15 -1 2 -4 -1 -16 -3 5 11 1
6539 1 11 -11 -6 -4 1 17 -1 -1 -20 -5 -1 10 10 -11 -8 0 4 7 6 13 -15 -1 -15 -3 -3 4 -14 -11 3 6 3 7 -14 -4 6 7 2 -6 -15 -29 -20 9
6581 9 -12 1 -3 -20 5 7 -9 -2 -11 -19 -7 -4 -5 -6 -4 -7 -1 -1 -2 1 -8 -4 3 1 9 -10 -3 -22 -7 2 0 -10 5 -5 2 7 12 -4 6 6 -6 5 10 -10
6625 -10 6 3 -12 4 14 -2 -11 5 4 2 -4 -1 1 10 -7 -5 2 -2 -18 -3 -9 -19 -10 -6 -17 -4 -6 -10 -6 -18 -18 5 15 2 0 -8 -14 -6 1 -2 1 -1 -6 18
6669 18 7 1 -1 -5 -20 -3 25 3 -9 10 -3 -10 15 -2 -5 9 -3 -15 7 8 4 6 -3 -14 -3 14 1 0 -12 -11 -3 6 2 -16 -16 -15 -14 -3 -9
6708 -9 -13 -5 -25 -15 -7 -10 -9 -21 -24 -8 6 7 -2 -13 -12 -5 11 3 3 0 -16 -9 12 9 1 5 -2 -19 16 24 -1 -5 7 -5 8 19 -8 -7 0 -15 10 15
6750 15 -1 -13 -13 -18 -4 9 0 -19 -9 -13 -4 -1 -4 -19 -10 -15 -8 4 2 -10 -17 -19 -23 13 -4 -11 -20 -12 -8 12 15 -2 -4 -8 -5 13 14 -22 -2 -14 -20 -1
6792 -1 14 -2 -9 -12 10 1 19 9 -21 -1 -9 -2 13 13 -14 -12 -28 -11 18 19 -4 -22 -11 -5 -4 13 -10 -9 -27 -18 -8 -8 -12 -10 -10 -16 -4 14 0
6831 0 -27 -18 -31 5 18 -7 -7 2 -17 -7 5 0 -8 3 -32 -20 7 7 -1 11 -12 -20 -2 12 -4 8 5 -17 8 2 -1 -1 7 -4 11 7 9 -9
6869 -9 -15 -13 -2 18 -2 -16 -11 1 -4 -14 -3 0 -12 -17 -8 -5 1 -15 -23 -24 -9 2 -11 -7 -8 -11 -25 -1 -4 -10 5 2 -14 -7 8 0 -2 -4 -25 -3 6 3
6911 3 -7 7 -9 -13 14 1 6 8 3 -2 21 8 12 -3 -13 -15 0 -7 -3 -3 -7 -11 4 8 8 -2 2 -8 -11 5 -3 4 -11 -10 -13 -6 -5 -9 -6 -20 -10 -2 -11 -5
6955 -5 -7 -34 -26 5 -12 4 16 -12 -14 -4 0 10 9 2 -18 -1 2 -12 6 9 -15 -2 3 -5 0 1 -19 -18 -2 -7 -5 -11 -18 -8 -3 0 -12 -11 -23 -19 -14 -5
6997 -5 6 2 -10 -19 -10 -15 -11 1 -10 -10 -2 -14 -16 6 -9 -26 -7 -15 -18 -11 -5 -17 -10 -9 16 -9 -9 -6 -20 17 0 -4 9 -5 -12 6 2 2 22 3 -7
7038 -7 -3 4 1 -11 7 -5 -4 -10 -2 -8 -6 -14 1 -12 -2 5 0 -16 -7 -12 -1 5 -10 -16 -10 -7 4 2 -4 -18 -7 -13 -24 -6 -6 -3 -10 -2 -2 -9 0 -4 -9 -11 2 -16
7084 -16 5 -16 -8 0 1 5 5 12 -4 -12 -1 7 19 8 -3 -4 -1 7 4 -4 -13 -5 -2 -9 11 -4 -4 -16 0 -1 0 2 -22 -20 2 -10 -9 1 -15 -17 -10 -13 -13 -1
7128 -1 -19 -24 -18 -14 -13 -4 -1 -12 -8 1 0 2 1 -25 -12 -8 -2 -1 -3 -10 -26 -3 1 2 11 -6 -16 4 8 3 7 12 -13 -2 -3 4 11 -5 -2 -18 -2 -3 -15 -9 -17 -16
7174 -16 -20 -1 -6 -4 -8 -16 -2 -4 -13 -5 0 -23 -3 -14 -8 -4 -4 -20 -9 -13 -16 -7 -4 -10 -4 -6 -5 -2 11 4 3 -6 -5 -12 5 -13 -13 8 5 -4 -5 -2 -5 9 1 -1 4 4
7222 4 -8 -1 1 -17 -9 0 0 -4 -8 -5 2 -1 -3 -3 -5 -22 -19 -15 -5 -2 -6 -17 -16 -5 -22 -16 -11 -11 -11 -8 -15 -15 -3 -3 -9 0 1 -3 -1 -16 -18 3 9 -6 -4 1 -14 -1
7270 -1 0 -4 7 -3 -3 5 19 17 -7 -6 -8 -9 -1 1 -7 -28 -10 -1 8 3 -2 -12 -19 -9 14 -4 -7 4 -13 -10 4 -10 -5 -5 -15 -22 -3 -2 -13 -7 -9 -16 -5
7313 -5 6 -18 -1 -18 -14 5 16 6 -12 2 4 5 14 5 -11 -5 1 0 14 12 3 1 2 5 14 4 -2 3 5 3 7 6 -9 -12 -9 4 -1 -7 -11 -10 -5 -3 0 5 -12 -6
7359 -6 -13 -8 -3 19 -6 -11 -11 -5 -6 -8 -18 -23 -12 -2 -14 -2 1 -14 -11 0 -2 15 6 -6 -17 2 0 21 15 -6 -11 -2 7 6 7 3 -5 8 3 7 4 -13 -6 11
7403 11 -4 -12 3 -18 -23 -2 -4 -8 -7 -19 -22 -1 -14 -18 -6 -9 -8 -6 -10 -12 -6 -10 -15 -24 -16 -12 -10 -22 -13 -11 -1 -10 -4 -5 -3 -5 -10 -3 -4 -2 -14 7 1 -13 -11 -16 -12
7450 -12 -9 -4 -12 -13 5 -1 14 6 5 -6 1 -2 -16 8 2 -6 5 -19 -14 -11 -5 -9 -9 -4 -9 5 -1 -12 -20 -4 -18 -4 -8 -7 -15 -18 -16 -16 2 -10 -8 -14 -9 -3 3 -11
7496 -11 -16 1 5 3 5 -2 -9 -4 -10 -11 8 -12 -16 -8 -10 -12 5 6 -13 -21 -1 3 15 4 -8 -4 13 0 -7 4 -3 -14 -18 -15 -12 5 -10 -18 -9 8 0 -12 -14
7539 -14 -11 -9 -2 0 -1 -7 -18 -27 -15 8 -4 -9 -9 -10 -9 9 -4 -11 -3 3 -5 -5 4 -6 0 -3 5 -14 2 0 -7 -17 -10 6 -2 14 -11 -14 6 11 4 3 0 -5 -7 8
7585 8 0 -2 0 -4 6 -3 2 -12 -5 -10 -7 -9 -3 -12 -19 -11 -5 -6 -2 -15 -10 -9 -11 -14 -2 2 -16 -26 -24 -6 -9 -11 1 -11 0 -5 -6 -7 3 -13 -4 -2 -3 -3 -12 2 -10
7632 -10 6 3 7 4 6 -1 3 8 -2 5 -3 -2 -11 -6 -2 -19 -10 -9 2 9 -10 -7 3 -13 -1 4 -2 -11 -10 -9 -11 -10 -3 -2 -9 -13 -6 -5 -10 -6 15 -5 -14 -4 0 -12 -6 0
7680 0 -6 -9 3 -14 -5 10 -12 -1 3 9 -5 3 8 -9 1 11 11 5 9 -2 18 -7 4 0 3 -7 -11 -14 -9 -8 -10 -2 -2 -8 -8 4 -11 -9 -2 -6 -11 -1 -2 -5
7724 -5 -12 -8 -7 -6 5 -7 -10 -8 0 -9 -2 -11 3 -4 -15 3 12 12 0 -5 2 4 -9 5 -4 2 2 5 -7 -2 11 -1 14 -8 2 1 2 -1 2 0 5 7 2 -10 9
7769 9 4 -7 1 -2 -2 -4 -5 -6 -26 -7 4 4 -13 -16 -5 -9 -18 -15 -3 -2 -3 -5 3 -6 4 0 13 7 -13 3 0 2 -7 7 -1 -16 11 2 -9 0 6 2 13 -11
7813 -11 -4 -4 9 2 7 6 1 2 6 -2 -1 9 -13 -1 6 -4 -3 -7 -10 -4 1 -2 -2 7 -12 -25 -8 -1 2 -8 -19 -8 -4 -9 -7 0 -10 -11 -5 3 -12 4 2 -17 -7
7858 -7 15 7 1 -3 2 0 5 -6 3 6 -4 -9 -1 -5 3 6 -3 0 4 6 1 3 -3 -9 1 -1 -10 -4 -8 -4 -1 10 -13 -7 -5 -12 -5 10 1 -9 -16 -12 -9 -1 -19 -9 -4 -15 0
7907 0 -4 -7 -2 -2 -11 -11 -2 -8 -5 -6 -6 5 13 0 -2 10 -1 3 -1 0 5 10 -2 -10 2 17 4 -8 2 2 11 9 5 -2 4 -10 -10 6 -4 4 -10 0 -1 -4 -3 -12
7953 -12 -10 -2 -15 -4 -1 -22 -20 -21 -14 -14 -2 -16 2 -10 -13 -7 -11 -4 -10 -6 -8 13 15 2 -11 -3 4 9 5 -15 -12 -7 -14 8 -4 7 -13 -3 2 5 15 -5
7995 -5 -6 8 -5 6 14 6 -6 -4 2 -4 -12 -13 -18 -13 -13 -11 -20 5 -10 -13 -16 -13 5 -1 -17 -8 -14 -11 -1 -4 -12 -12 -6 -21 -9 -6 -12 -10 -9 -4 -15 -3 -7 -2 -4 3 3 2
8043 2 -8 1 7 -1 -12 4 -3 -9 6 -1 6 3 10 3 6 17 14 -8 -5 -6 7 8 -1 -15 -8 -10 -7 -7 6 -2 -2 -6 -18 -4 -2 -7 -8 -22 -5 -7 2 2 -7 -7 -4 -13 -8 -12
8091 -12 -12 1 -4 -3 4 -1 2 -1 -10 1 -3 -8 -8 1 -10 1 0 6 2 -2 6 -9 8 2 -4 4 -6 -4 7 4 -3 3 -6 1 0 2 -15 2 4 6 -9 1 -7 -8 -1 -1 -1 -2
8139 -2 -5 -11 -2 -6 -12 -11 -9 -7 -8 -8 -8 -15 -8 -4 14 -2 4 5 -1 -9 4 -4 -4 5 13 -3 12 16 5 1 3 0 17 3 -2 -3 2 -1 4 3 -5 2 -13 -7 -7 -6 -5 -6 -11 -10 -9 -4
8191d
$$ Imaginary data points
##PAGE= N=2
##DATA TABLE= (X++(I..I)), XYDATA
0 0 0 0 0 0 0 0 0 0 0 0 0 0 0 8 -8 8 -8 8 -8 16 -16 16 -24 24 -25 32 -37 41 -48 53 -57 65 -73 82 -95 105
36 105 -116 129 -143 159 -176 194 -216 239 -264 291 -325 362 -403 453 -512 579 -663 768 -903
55 -903 1087 -1347 1759 -2485 4167 -15530 6454 27330 -19672 7026 20535 -23693 -16262 22689
69 22689 -1297 -7543 13431 -3666 -13720 9447 2973 -5518 5330 -3690 -9144 11754 7234
82 7234 -8597 -198 -271 -10774 3701 15624 1810 -9374 -4133 -455 -3947 1592 15328 3593
96 3593 -18002 -2486 11132 -9117 -1034 20019 -8599 -19038 16254 6601 -17150 8661 8286
109 8286 -18675 4147 17169 -10160 -2926 7465 -14507 -1417 18951 -4666 -4774 10426 -14942
122 -14942 -11859 22591 3115 -14606 12579 1025 -22233 8912 17131 -13118 -2833 12272
134 12272 -8798 -7308 12090 1786 -8898 295 3372 227 740 1197 -448 -5123 -3157 6978
148 6978 4403 -3960 310 -770 -6335 2741 5975 -1530 1380 -1029 -7848 4183 6222 -7033 2758
163 2758 6627 -12237 -613 15417 -8403 -9498 14306 -2824 -13136 14021 5677 -16466 4045
176 4045 8919 -11086 2052 11605 -8266 -5231 6794 -3232 -992 7287 -4015 -4207 5147 -2507
190 -2507 -2333 7025 -2054 -6174 5059 1485 -5009 3255 2963 -5028 -1215 3807 986 -1708 -1123 1232
206 1232 -229 -2656 3421 3752 -6583 -2021 7083 -2754 -3876 7603 -1288 -8408 5245 3617 -5810
221 -5810 3645 3060 -7775 1079 5428 -4034 1364 3720 -7117 -97 7402 -4581 -2110 6950 -4952
236 -4952 -5309 8793 482 -7011 4704 1436 -7469 3398 6351 -4360 -2097 2224 -2433 -152
250 -152 4048 109 -2070 -1159 -864 1453 1587 -378 384 -1006 -2612 1532 2595 -643 -140 -936 -2413
267 -2413 1820 2494 -1071 463 -835 -3834 2506 4080 -3073 -147 2577 -5044 -1267 6951 -796
282 -796 -3820 3326 -1732 -4702 5316 3476 -4672 107 1200 -3597 1962 4158 -2715 -1417 1309
297 1309 -2431 456 4092 -1177 -2193 947 -1622 -650 4003 638 -3156 -450 239 -419 1877 1531
313 1531 -1507 -1909 -366 1056 1233 352 235 -1020 -2536 620 3078 46 -831 142 -2342 -928 3563
330 3563 1036 -1876 300 -1020 -2019 2503 2076 -1709 63 -174 -2729 1413 3410 -1338 -1263 556
346 556 -2124 -16 3841 -107 -2552 358 -510 -1105 2508 1626 -1891 -943 -256 -847 1507 2205 -695
363 -695 -1738 -899 -198 1363 1757 -189 -1468 -1153 -99 1173 1248 218 -771 -1503 -681 1351 1440 280
381 280 -439 -1769 -1374 1694 2086 -205 -609 -1053 -1699 961 2504 73 -863 -483 -1628 -216 2528
398 2528 1105 -993 -819 -1406 -638 2315 1810 -1058 -1326 -900 -539 1541 1907 -506 -1430 -868 -523 912
416 912 1956 408 -1411 -1507 -532 1059 1877 623 -1243 -1789 -572 1276 1637 404 -810 -1447 -961
433 -961 913 1708 594 -516 -1318 -1443 565 2161 855 -773 -1294 -1353 353 2176 957 -963 -1122
450 -1122 -972 -59 1687 1265 -569 -1085 -1044 -391 1481 1679 -315 -1366 -1155 -283 1412 1621 -301 -1345
468 -1345 -936 -204 1019 1388 -8 -1025 -930 -461 793 1488 271 -948 -1106 -639 898 1713 144 -1162
486 -1162 -853 -410 599 1513 231 -1081 -598 -328 122 1337 689 -939 -809 -375 63 1350 896 -1075
504 -1075 -1005 -46 181 1012 824 -985 -962 237 143 426 853 -454 -1038 -79 223 538 808 -411 -1092 -191
524 -191 339 708 778 -713 -1133 223 327 170 823 -240 -1185 189 382 -246 722 283 -1197 -127 747
543 747 -58 368 101 -1336 -16 1348 -42 -146 225 -1287 -434 1650 278 -573 566 -699 -1309
560 -1309 1024 1066 -379 163 -283 -1109 542 1039 -329 -280 -209 -395 846 693 -838 -425 -58 -489 908
579 908 1306 -599 -847 -384 -797 600 1759 193 -776 -830 -1079 583 1559 -191 -330 228 -1159 -136
597 -136 1681 -508 -1131 1092 -204 -855 1828 410 -2277 -223 662 -242 1717 1209 -2152 -1373 253
614 253 -112 1614 1756 -1404 -1208 138 -1047 556 2436 -473 -1527 549 -321 -529 1501 42 -1643
631 -1643 257 1005 299 326 -793 -1377 78 591 1049 1549 -911 -2236 -180 76 266 2533 757 -2583
649 -2583 -993 372 -309 1404 1317 -1392 -630 433 -663 618 856 -1459 -49 1413 -810 209
665 209 1513 -2193 -1859 2270 825 -395 1667 -1045 -3239 738 1894 6 1071 231 -2189 -610
681 -610 634 128 1400 521 -1724 -91 632 -823 792 928 -1833 -214 1958 -325 -682 495 -1124
698 -1124 -700 1476 716 132 49 -1619 -789 1065 150 844 1447 -2004 -1878 1692 199 -806 1901 -77
716 -77 -2357 929 1070 -1405 555 893 -1369 208 1034 -702 310 162 -1683 640 1695 -979 86
733 86 908 -2131 -502 2506 -392 -1038 1481 -657 -1737 1243 754 -676 646 -153 -1026 612 236
750 236 -310 818 -592 -1016 1513 208 -1543 1037 558 -1753 745 1351 -1385 9 1056 -1217
766 -1217 -233 1217 -438 -77 438 -1121 270 1206 -1158 -64 1428 -1356 -637 1954 -843 -1290 1955
783 1955 -111 -1882 1274 751 -1408 605 583 -1108 464 535 -849 510 302 -908 769 321 -1409
800 -1409 850 1118 -1611 18 1360 -1139 -286 1444 -778 -743 1090 -309 -569 776 -207 -232 589
817 589 -782 -186 1288 -699 -756 1322 -521 -1017 1621 1 -1745 1053 758 -1387 589 883 -1220
834 -1220 28 613 -787 550 835 -1044 -14 444 -1078 633 1374 -1311 -379 1343 -1051 -734 1622
851 1622 -249 -962 1113 -66 -1066 741 242 -771 461 234 -217 669 -461 -1051 734 255 -491
868 -491 1113 168 -1542 254 545 -929 686 1214 -862 -463 259 -726 234 910 -487 83 582 -916
886 -916 -164 695 -907 14 1560 -543 -827 978 -614 -1224 1162 586 -572 838 -8 -1570 69
903 69 655 -146 786 387 -988 -35 70 -896 566 1087 -496 62 448 -1115 -398 913 -229 -59 1050
922 1050 -129 -737 -63 -499 -93 999 310 -94 173 -794 -658 567 17 66 1143 -160 -1183 106
940 106 -21 -532 839 652 -534 188 31 -1068 -47 612 -28 616 464 -1014 -392 312 -590 234 1198
959 1198 -160 -424 271 -779 -632 957 399 -288 461 -56 -774 0 35 -191 660 512 -343 -156 -275
978 -275 -531 318 490 -8 401 153 -788 -364 208 27 509 490 -436 -293 47 -361 3 458 -30 139 292
999 292 -552 -379 357 -162 -87 656 11 -364 192 -358 -633 580 599 -201 90 -96 -659 67 408 -134 209
1020 209 343 -422 -278 176 -107 132 357 -209 -164 312 -73 -242 76 -57 47 390 -21 -282 15 -82 -72
1041 -72 268 120 -2 98 -291 -328 277 241 -29 124 -183 -352 285 224 -284 89 160 -273 57 230 -236 9
1063 9 232 -312 -104 432 -17 -228 78 -186 -107 452 59 -379 68 54 -173 207 154 -218 27 80 -227 63
1085 63 319 -29 -146 -81 -76 162 211 -51 -122 -53 0 140 41 -131 103 57 -215 50 183 -119 29 75 -278 56
1109 56 405 -159 -257 141 -100 -44 388 -83 -358 234 63 -341 215 251 -279 3 113 -312 93 410 -220
1130 -220 -273 171 -9 -61 198 -82 -213 150 108 -143 20 104 -46 -74 -17 60 107 31 -57 -142 -68 223 136 -194
1154 -194 -19 113 -135 43 215 -190 -61 301 -189 -243 386 60 -309 183 14 -313 333 228 -510 24
1174 24 365 -257 -33 345 -268 -170 370 -150 -280 379 73 -375 96 122 -188 164 162 -309 -69 276 11 -152
1196 -152 45 58 -76 -18 98 -47 -79 186 13 -310 130 329 -253 -132 280 -218 -122 503 -152 -454 477
1217 477 127 -552 310 329 -527 168 408 -591 1 684 -420 -381 591 -140 -371 517 -78 -567 442 259
1237 259 -549 146 340 -376 -25 307 -243 -58 336 -123 -317 143 168 -97 -60 60 -23 -116 100 111 -263 22
1259 22 382 -253 -290 458 -35 -418 406 68 -578 466 386 -804 137 678 -617 -103 760 -557 -359 915
1279 915 -333 -706 878 115 -852 541 335 -816 406 566 -823 -2 756 -471 -267 591 -247 -324
1297 -324 497 -95 -435 338 178 -327 -2 163 -57 -47 48 -4 -130 18 257 -150 -332 360 149 -525 249
1318 249 378 -606 118 620 -723 -175 1003 -446 -663 890 -129 -797 883 175 -1041 672 569
1335 569 -1123 268 863 -882 -21 906 -772 -347 1050 -421 -694 880 -12 -714 608 139 -744
1352 -744 399 434 -588 32 445 -278 -172 205 -37 -57 95 27 -112 -183 186 255 -343 -91 425 -297 -264
1373 -264 572 -203 -459 713 -50 -831 685 383 -932 429 575 -998 276 948 -1037 -217 1250
1390 1250 -639 -639 1136 -369 -899 1107 110 -1054 806 465 -1141 286 678 -710 209 723 -734
1407 -734 -263 655 -323 -250 561 -67 -262 236 -171 -263 233 136 -5 4 -81 78 -133 -333 269 244 -255 349
1429 349 122 -887 96 663 -594 79 968 -648 -596 767 -485 -580 1285 93 -1011 699 128 -1197
1447 -1197 612 705 -869 512 838 -1217 -322 883 -626 -79 1242 -358 -668 632 -451 -814 883
1464 883 551 -397 317 -47 -828 26 378 -54 326 337 -219 -292 -351 -150 366 234 148 317 -378 -520 144
1485 144 -253 -124 1002 265 -667 148 -300 -894 714 769 -522 481 474 -1349 -330 863 -447 203
1503 203 1303 -655 -922 685 -428 -760 1189 542 -626 505 -90 -1303 249 795 -272 489 655
1520 655 -831 -540 158 -364 264 1000 38 -389 -142 -506 -261 403 302 309 266 -327 -397 -270 -274 462 651 -111
1542 -111 64 72 -867 -320 550 -78 310 904 -574 -896 325 -245 -319 1110 363 -692 314 -167 -1122
1561 -1122 461 865 -377 347 479 -1009 -335 580 -454 58 1104 -153 -587 226 -448 -473 779 385
1579 385 -214 327 -125 -727 -9 216 86 510 175 -440 -172 -146 -173 327 223 -3 262 -167 -560 66 83
1600 83 -111 512 208 -480 89 22 -634 230 601 -247 137 292 -747 -237 641 -212 -120 687 -255 -522 385
1621 385 -164 -391 667 202 -543 267 120 -536 220 284 -350 268 362 -479 -122 249 -230 102 349 -227
1641 -227 -86 233 -289 -131 312 -27 -7 171 -275 -121 311 -104 -97 246 -160 -110 283 -189 -209 362 -58 -270
1663 -270 272 -46 -285 323 12 -393 318 173 -429 130 197 -321 198 273 -440 -12 356 -281 -34 368 -215
1684 -215 -117 301 -251 -173 435 -24 -222 222 -94 -215 286 -2 -229 282 95 -265 99 25 -196 221 124
1705 124 -248 133 97 -272 36 123 -141 201 169 -327 -24 157 -196 74 225 -196 14 199 -321 -115 312
1726 312 -92 -52 233 -194 -164 273 -128 -217 327 25 -221 198 -69 -276 288 125 -295 170 165 -283 70 141
1748 141 -249 149 268 -277 -60 221 -154 -14 214 -146 -37 228 -149 -167 204 -31 -61 151 -111 -91 200
1769 200 -43 -147 144 -8 -72 140 -104 -141 213 -4 -189 159 7 -159 178 -4 -272 204 140 -284 71
1790 71 136 -240 95 182 -303 23 290 -232 -99 266 -141 -86 250 -181 -186 286 -18 -202 183 12 -173 168
1812 168 2 -204 175 109 -176 51 43 -123 112 51 -161 108 112 -137 26 26 -129 136 82 -217 61 114 -196
1835 -196 33 129 -172 82 184 -260 -69 229 -128 -72 201 -150 -107 259 -108 -213 230 21 -180 173 -4
1856 -4 -192 187 54 -243 117 128 -158 55 41 -161 108 120 -171 23 120 -133 44 73 -159 106 169 -190 -9
1879 -9 138 -143 24 149 -212 11 270 -180 -135 232 -94 -108 246 -128 -186 269 -14 -264 199 61 -216 160
1901 160 29 -265 160 166 -230 17 134 -165 38 95 -180 42 161 -147 -30 91 -86 61 89 -159 25
1922 25 162 -147 -6 134 -165 46 203 -245 -56 299 -144 -119 270 -144 -153 349 -98 -293 340 51 -328
1943 -328 246 92 -316 216 167 -383 103 291 -286 -10 249 -246 -29 288 -214 -134 291 -80 -159 168 -75
1964 -75 -100 189 -84 -139 146 -11 -86 83 -95 -36 191 -99 -117 175 -85 -84 230 -123 -159 308 -65 -282 298
1987 298 69 -292 263 44 -400 295 263 -431 106 301 -376 34 371 -337 -60 455 -295 -242 423 -110 -248
2008 -248 341 -77 -309 354 47 -357 175 129 -252 141 105 -264 85 103 -217 69 140 -111 51 -14 -213 136
2030 136 120 -156 108 35 -236 139 80 -303 166 244 -302 66 247 -353 17 349 -348 -39 517 -263 -291 376
2052 376 -191 -239 573 -12 -451 352 9 -496 349 280 -366 220 200 -531 70 399 -274 -3 328 -267 -102
2073 -102 271 -236 -131 316 -56 -102 184 -140 -149 144 -108 -9 297 -57 -139 29 -241 -24 380 -59 -88 244
2095 244 -233 -268 313 -67 -169 470 -38 -456 307 85 -447 323 260 -416 275 320 -620 -39 430 -313 77
2116 77 574 -376 -303 375 -283 -248 627 64 -355 214 -146 -399 365 210 -271 181 99 -341 38 104 -184 167
2138 167 179 -178 29 32 -222 56 47 -86 268 103 -328 -2 3 -232 308 277 -330 68 178 -473 31 454 -227
2161 -227 -1 407 -422 -260 522 -170 -283 518 -37 -388 416 -26 -534 385 272 -420 254 298 -495 14
2181 14 298 -329 105 481 -286 -235 230 -175 -71 362 -55 -179 187 -106 -178 175 8 -26 142 -123 -109 161
2203 161 -91 -86 160 -113 -39 264 -167 -214 266 -52 -190 345 -31 -323 310 32 -408 329 258 -407 154 232
2225 232 -431 126 418 -401 -51 437 -283 -183 415 -177 -225 420 -100 -335 343 60 -319 223 69 -280
2245 -280 206 140 -312 98 191 -203 38 130 -161 60 131 -175 13 114 -109 37 45 -172 103 132 -206 67
2267 67 151 -225 40 188 -241 46 303 -254 -141 299 -140 -107 344 -164 -250 362 -12 -288 322 55 -355
2288 -355 215 123 -312 233 245 -388 19 275 -209 48 283 -279 -90 290 -129 -108 255 -77 -140 175 -57
2309 -57 -87 199 -64 -182 147 32 -42 115 -127 -195 156 54 -50 159 -60 -226 79 -5 -92 272 79 -275
2331 -275 32 25 -168 217 152 -296 59 204 -233 10 210 -225 -14 318 -127 -96 232 -181 -233 281 94 -55
2353 -55 253 -141 -381 146 174 -36 212 50 -308 -11 84 -114 176 209 -176 -72 59 -120 49 114 -146 37
2375 37 177 -54 -54 -35 -222 11 282 30 31 69 -293 -209 160 80 150 265 -203 -340 70 44 6 285 10 -245
2399 -245 86 1 -205 151 132 -152 106 142 -202 2 60 -254 39 353 37 -34 -15 -299 -122 299 138 37
2421 37 107 -203 -263 68 77 99 223 -57 -246 10 7 -48 140 -5 -101 137 48 -172 -6 -31 -121 170 171 -72 3
2446 3 -62 -285 25 264 64 85 1 -317 -112 215 49 54 139 -140 -150 89 -25 -36 191 2 -116 96 21 -88
2470 -88 52 -35 -86 182 148 -100 -30 -66 -109 135 156 -35 44 -19 -192 15 135 13 95 40 -223 -43 146 -46
2494 -46 14 93 -107 -34 127 -97 -91 117 -34 -97 133 -2 -119 68 -53 -139 143 111 -108 -5 -5 -101 82 100
2518 100 -94 -5 61 -92 -14 78 -28 32 57 -62 -17 65 -19 -2 26 -33 32 67 -81 -5 76 -29 12 54 -104 -4
2544 -4 120 -58 -63 98 -50 -79 103 -27 -78 129 -21 -162 89 85 -95 53 17 -148 53 152 -112 -51 77 -94
2568 -94 -15 146 -38 -73 52 -82 -69 136 85 -45 -23 -80 -26 123 84 -19 -31 -55 -8 76 21 6 36 -68 -35 108
2594 108 30 -2 34 -117 -93 179 92 -82 3 -91 -141 157 132 -118 2 22 -185 40 211 -51 -59 24 -182 -50
2618 -50 254 17 -127 10 -80 -64 200 86 -161 -24 -24 -81 106 136 -63 -85 -68 -49 97 163 -14 -114 -114 -22 138
2643 138 123 -19 -52 -95 -47 134 114 -24 25 -57 -152 118 200 -36 -26 -23 -178 71 271 -52 -125 38 -116 -33 256
2668 256 29 -165 42 -65 -152 198 170 -157 -74 -33 -114 141 225 -126 -145 3 -48 62 160 -22 -118 -23 -38 34
2692 34 140 35 -95 -103 -68 88 156 1 -78 -76 -90 101 170 -38 -64 4 -134 5 216 9 -89 47 -130 -96 254
2717 254 99 -170 27 -11 -125 190 168 -200 -55 82 -134 45 215 -95 -147 47 -97 -32 223 6 -201
2738 -201 -14 -4 -28 143 49 -166 -39 19 -12 65 62 -59 -67 -43 -6 101 57 -40 -47 -92 8 171 22 -106 36 -41
2764 -41 -79 165 91 -138 32 47 -166 91 209 -124 -50 97 -128 9 251 -70 -155 140 -37 -97 188 14
2786 14 -180 98 38 -160 119 157 -171 -35 76 -105 27 155 -89 -110 62 -2 -8 39 -19 -40 11 -34 18 59 -34
2811 -34 -22 -2 -77 51 107 -46 -26 58 -59 11 120 -79 -40 124 -66 -76 153 -34 -106 147 -24 -173 168 98
2835 98 -211 58 120 -182 24 161 -147 -29 167 -89 -79 136 -31 -73 105 -53 -76 125 -17 -97 77 8
2857 8 -89 81 16 -99 54 39 -93 -6 47 -7 41 -29 -74 40 5 -17 103 -19 -119 80 3 -122 136 124 -152
2882 -152 -10 78 -125 28 175 -116 -60 148 -63 -43 141 -81 -88 154 -36 -90 173 -36 -219 83 77 -77 142
2905 142 60 -256 -56 123 -17 61 112 -105 -96 3 -37 52 114 -46 -26 4 -81 52 83 -130 -49 121 3 -6 56 -144
2931 -144 -113 109 62 56 116 -128 -177 35 -8 81 274 -42 -245 28 5 -65 220 122 -203 -2 102 -131 19 139
2955 139 -98 -34 140 -26 -8 53 -174 -94 164 85 59 72 -233 -223 120 106 54 157 -52 -252 -56 30 56 162
2979 162 44 -139 -60 -22 -14 125 -24 -110 115 70 -87 46 -23 -190 65 212 -6 38 22 -269 -136 176 133
3002 133 124 91 -225 -196 84 53 93 206 -84 -176 68 -15 -59 166 57 -154 67 102 -84 -6 -19 -138 74 193
3026 193 12 -46 -101 -196 20 159 60 82 4 -236 -118 116 58 98 114 -157 -141 58 13 -7 94 -46 -31 104
3050 104 -28 -56 50 -63 -62 175 76 -74 48 -60 -177 139 211 -22 11 -19 -187 4 169 19 21 50 -116
3073 -116 -51 88 -4 33 88 -60 -46 118 -2 -59 56 -46 -31 144 42 -89 10 -35 -43 89 37 -37 27 -54 -103
3098 -103 80 68 -32 58 -46 -147 66 106 -90 26 60 -95 20 93 -86 -23 90 -61 -18 112 -41 -32 77
3121 77 -52 -34 126 -15 -100 77 8 -63 102 18 -111 49 56 -74 40 67 -44 7 16 -46 24 58 -46 3 28 -47
3147 -47 22 32 -77 23 99 -35 -9 29 -61 0 97 -33 -20 55 -67 -63 72 3 1 80 -72 -96 101 32 -53 71 8
3174 8 -93 86 58 -106 24 65 -67 30 108 -48 -18 33 -65 14 126 1 -35 8 -77 -18 114 9 -57 25 -57 -56
3200 -56 64 10 -23 29 -34 -42 43 17 -43 -16 -41 -23 93 11 -83 5 -21 -38 71 58 -81 -12 5 -88 24 116 -32 -28
3228 -28 1 -89 11 115 -33 -51 39 -30 -22 96 -19 -67 40 -8 -39 101 41 -69 -2 9 -30 75 65 -68 -18 13
3254 13 -3 66 47 -51 1 16 -42 36 61 -46 -18 6 -46 26 92 -29 -52 9 -18 19 79 -40 -53 43 -26 -15 84 -15 -61
3283 -61 34 -13 -42 90 49 -77 -4 23 -19 46 41 -86 -23 42 -20 23 68 -37 -12 18 -40 25 84 -11 -32 16 -12 17 70
3312 70 -13 -42 25 9 -13 34 -9 -27 38 -23 -34 68 6 -70 25 -2 -39 45 23 -85 -4 41 -48 17 41 -55 -1 27 -42
3341 -42 -7 63 -33 -27 47 -33 -10 63 -29 -39 45 16 -16 43 6 -26 34 2 -18 42 19 -19 9 3 -22 56 24 -35 18 21 -17 26
3373 26 41 -29 23 35 -34 13 54 -24 8 30 -51 6 75 -34 -26 27 -30 -19 59 -25 -51 59 6 -53 37 16 -46 19 -10 -51
3403 -51 29 36 -58 -10 8 -35 22 28 -25 8 39 -30 -5 38 10 -4 2 -35 10 46 4 -20 17 -21 9 32 -14 -5 36 -20 -9 43
3435 43 -2 -18 51 -22 -41 57 23 -43 19 -6 -54 42 46 -61 16 42 -63 3 53 -50 -6 39 -52 -28 60 0 -41 20 -10
3464 -10 -9 46 2 -42 22 16 -21 27 17 -8 22 -15 -21 34 48 -11 16 4 -8 51 17 -28 27 3 -22 35 25 -27 23 21 -47 22
3496 22 57 -40 -20 36 -38 -7 66 -26 -49 37 -25 -22 60 -19 -56 37 3 -58 35 35 -54 8 4 -46 20 45 -47 -26 25 -23 -11 5
3528 5 -32 -11 9 -22 11 19 -22 -12 8 -19 20 60 -23 -24 2 -11 12 51 -13 -8 35 -30 -4 50 -6 -16 49 -13 -53 63 12 -64
3560 -64 32 23 -38 34 29 -86 -16 44 -31 -5 40 -38 -35 8 -29 -8 57 -14 -45 10 -17 -22 44 -6 -45 32 8 -34 -4 -4 -6 22 5
3593 5 7 15 -11 -18 23 2 15 61 3 -70 8 29 -14 38 34 -49 1 43 -37 6 50 -19 1 22 -35 -12 35 -30 -19 51 -16 -41 16
3626 16 -41 -55 34 32 -36 2 14 -58 -30 14 -12 19 12 -38 -12 -9 2 20 3 -38 19 21 -34 1 31 -12 8 40 -11 -7 24 -15 -8
3659 -8 38 -6 15 24 -43 -4 63 -14 -7 55 -13 -23 54 16 -45 40 38 -36 25 41 -22 7 15 -35 6 35 -35 -7 8 -33 6 36 -37
3692 -37 -12 41 -26 -13 22 -16 -10 19 -19 -12 22 -5 -22 -1 -17 3 35 -26 -24 40 -4 -26 33 10 -27 33 30 -38 26 36 -28 1
3724 1 31 -16 18 19 -33 3 44 -15 6 21 -32 -4 43 -21 -16 38 -1 -24 19 9 -5 15 1 -23 9 8 -13 10 -24 -14 19 15 -37
3757 -37 23 6 -44 17 6 -28 2 17 -36 -6 36 -16 3 18 -19 5 44 -11 -3 43 -19 -1 50 1 -3 44 -6 -37 38 22 -18
3788 -18 26 5 -9 19 25 -13 0 7 -9 22 5 -15 14 -8 -24 3 21 -24 -3 6 -45 -10 17 -17 -16 13 -26 -1 16 -32 6 29
3820 29 -19 -22 14 -15 -31 15 -14 -31 31 22 -44 5 5 -22 26 48 -13 0 10 -30 2 26 -2 33 17 -31 -2 25 -4 5 41 -15
3852 -15 -7 7 -6 -9 30 -4 -4 14 -16 -16 7 2 -13 30 14 -6 5 -25 -37 27 24 -13 25 2 -46 -9 24 -8 32 23 -32 -17 11 -18
3886 -18 17 36 -14 26 37 -21 -20 23 0 8 36 -6 -12 31 -20 -28 35 44 5 3 -18 -31 24 20 10 39 13 -25 -5 3 -9 40 21 -36
3920 -36 -1 6 -17 0 3 -29 1 28 -19 -16 -1 -26 -18 34 -6 -2 -2 -51 -23 35 14 1 24 -16 -42 13 11 -17 11 -3 -37 14 20 -12
3954 -12 5 13 -15 11 40 -9 -9 8 -27 15 44 13 -8 -10 -11 1 38 16 0 2 -10 -7 35 14 6 6 -30 -16 46 8 -10 -14 -23 -20 25 18
3990 18 -17 6 -14 -19 20 11 -14 5 -12 -44 9 36 -18 -12 -12 -28 3 49 -12 -28 0 -15 10 31 -2 -10 16 -8 -18 36 18 -9 0
4023 0 -18 -2 26 16 -16 0 8 6 11 7 -16 0 -9 19 18 18 -2 -22 1 -15 14 23 -26 -28 5 -17 7 24 -17 -14 13 -15 -11 18 -22 -17 2
4060 2 -5 -8 28 3 -40 12 8 -11 23 7 -29 5 32 2 21 32 -8 -6 20 6 15 30 -2 2 20 7 13 17 -12 4 32 14 -6 -11 -1
4095 -1 6 10 0 -1 12 -14 -21 14 -9 -3 8 -20 -35 19 14 -22 9 1 -25 18 30 -27 -8 0 -29 -3 27 -14 -23 12 -28 0 19 5 -16
4130 -16 2 -3 5 31 10 -16 7 6 11 23 10 6 3 7 10 27 23 5 1 3 12 26 11 -19 -9 -1 -19 24 17 -21 -9 5 -16 -1 23 -13 -12 16
4168 16 -14 5 35 -14 -24 8 -1 -2 27 -1 -28 9 2 0 18 14 -24 1 16 -2 20 15 -20 -16 26 17 16 15 -7 -4 18 19 15 20 -8 -3 12 8
4206 8 15 25 -4 -3 20 13 18 24 -10 -13 25 17 -12 29 -10 -24 9 5 -14 15 -3 -32 1 10 -21 5 4 -25 -10 15 -11 -9 7 -6 -10 19 -6
4243 -6 -10 29 -3 -12 5 15 -3 17 -3 -7 17 22 3 11 12 -9 17 4 -2 13 22 1 3 4 0 8 9 -3 22 14 -7 13 1 -9 10 33 -25 11
4281 11 21 -22 -15 10 -25 -10 25 -6 -16 9 -10 -20 11 -11 -17 14 3 -21 12 9 -10 -8 -7 -8 16 19 -8 -6 -4 -1 0 8 -2 13 -4 6
4317 6 15 23 12 4 7 -12 12 30 -2 -14 8 -3 3 33 -1 -12 13 -4 -3 18 8 -13 10 -13 -11 40 21 -28 -7 3 -14 10 16 -13 -10
4352 -10 6 -21 12 20 -21 -15 -10 2 3 30 -5 -20 -12 8 9 4 -7 -5 7 0 12 24 2 -12 10 9 29 37 13 -7 -2 -5 16 44 1 -21 10
4389 10 15 -2 17 4 -10 0 16 -14 2 14 -19 -20 9 2 -5 -2 -24 -35 7 22 2 8 -13 -32 -13 7 6 8 3 -18 -19 -5 3 5 -8 -19
4425 -19 2 12 -4 1 -13 -21 21 27 13 14 5 -26 3 36 19 15 -10 -10 -18 22 19 8 19 2 -4 23 8 10 16 8 -4 23 15 -21 -3 -9 -3 15
4463 15 34 -14 -35 -14 -19 5 33 14 -19 -14 -17 0 17 8 -7 0 -4 13 25 5 -9 -4 -2 16 27 -2 -17 2 12 23 42 7 -13 -4 -13
4498 -13 6 37 5 -4 -13 -10 -2 26 23 -7 1 13 -8 5 16 -4 -12 12 6 4 4 -26 -14 -6 7 16 7 -7 -40 -18 -7 13 23 -12 -24 -10 -3
4535 -3 -14 -1 -3 -6 -2 2 8 -6 -3 -19 -2 15 12 5 3 -16 -7 16 17 8 -2 -13 -9 22 19 16 16 3 -11 19 15 18 27 -5 -10 32 29 17 14 -2 -5 15
4577 15 28 0 4 0 -13 8 16 9 3 -17 -16 0 10 11 -5 -19 -29 2 25 6 -2 -10 -7 1 11 6 10 -1 -7 -4 24 5 5 11 -10 -4 35 19 -12
4616 -12 2 12 10 26 28 12 2 8 -2 17 22 -9 -8 -6 -14 7 29 4 -9 1 7 3 28 15 -3 6 -3 4 -3 -10 -10 4 -3 -1 23 13 -11 -3 5 -3
4656 -3 9 2 -8 2 -5 -9 -1 15 -8 0 8 -8 3 13 -5 1 7 5 13 15 0 8 19 17 14 15 8 1 15 19 9 20 21 -3 1 -3 12 15 14 -13 -4 12 -9
4699 -9 5 6 -9 -1 10 -6 6 2 -3 2 -1 -10 12 2 -22 3 9 10 12 7 -10 12 -7 -4 -8 18 0 5 8 -4 2 4 13 2 18 17 7 11 10 1 18 19
4741 19 -1 11 27 4 -1 0 6 8 12 2 3 13 5 -4 7 -1 1 -3 -3 -4 5 -7 1 -2 -7 -1 14 1 -9 -7 -1 -6 0 -1 -10 7 -4 -18 12 8 9 0 4 -11
4785 -11 5 10 2 0 11 1 6 21 -2 3 11 -1 4 6 12 -2 11 0 3 19 7 0 7 -1 3 16 -3 -4 1 7 -6 5 11 -11 1 4 -7 -6 -4 -9 -14 -6
4827 -6 -7 5 -3 -14 -10 2 1 9 5 -16 -21 -2 5 0 15 11 -14 1 -1 8 23 10 -8 21 28 20 13 4 -9 -5 21 2 14 11 6 1 19 -1 6 9 -5 3
4869 3 20 11 3 1 2 0 20 17 0 0 -6 -10 14 3 2 4 -7 -8 -2 7 10 3 -10 -22 21 6 -13 -4 -6 -18 8 16 -3 -8 7 -17 -1 29 6 5 -3 -16
4911 -16 8 24 16 3 4 10 4 20 7 -14 1 -6 -10 20 12 0 8 -4 -2 13 9 0 -12 -10 -9 2 8 -10 2 -8 -20 3 6 -9 -6 -4 -3 3 12 -6
4951 -6 -1 -1 -10 2 16 -9 -10 0 -8 5 14 2 -11 -2 -2 -11 14 19 -1 8 12 4 20 18 -3 -3 12 10 12 18 -1 -5 7 5 14 12 2 -13 16 2 25 17
4993 17 -15 -3 -6 8 17 13 -1 -14 -5 3 1 22 -1 -13 -5 -2 8 7 1 -18 0 11 10 14 12 -17 7 15 -4 8 8 -10 -3 3 -5 16 27 -4 -1 7
5033 7 9 10 13 10 -4 15 15 14 20 13 -2 29 15 4 9 9 -7 10 24 3 10 -2 -17 -10 11 -1 9 4 -10 -11 8 0 -18 3 -4 -4 14 6 2 -2 -7
5074 -7 -8 23 13 -6 3 -2 8 13 9 -1 -3 -6 2 13 2 -2 -1 12 0 15 10 3 2 9 8 13 19 -9 -3 14 10 12 20 1 -1 4 0 0 20 -7 -6 -4 -4 -3 9
5119 9 6 -4 -1 -4 -14 -6 -4 -14 8 2 -24 -5 -1 0 -10 9 -10 9 16 -8 -5 6 -11 5 3 -8 3 11 0 4 30 7 4 9 7 8 17 8 -2 4 -9
5160 -9 11 17 7 -3 0 16 1 -2 5 -11 3 -5 -3 11 9 2 -4 5 2 -10 -7 -10 -4 2 -15 -14 -4 -11 -9 -12 -13 -15 3 -2 -10 -3 -9 -18 1 -3 -15 9 8 3 5 5
5206 5 10 11 6 -2 7 11 11 5 14 23 -1 23 -9 -8 8 -1 -1 5 -2 3 13 7 -7 17 15 -9 12 3 0 8 -4 -4 -3 18 -1 5 -7 -10 -2 -3 1 9 -2 -10 -16 5
5252 5 11 0 4 -5 -1 8 3 -4 -6 -8 -10 11 4 0 11 7 5 9 10 1 27 7 2 13 8 5 6 7 9 9 12 1 14 23 0 3 12 -12 -3 3 -10 -12 15 -1 -10 9 -20
5299 -20 -19 2 -7 -3 -12 -10 -18 -20 -7 -12 -1 -12 -16 -14 -5 -16 7 3 -7 2 9 -3 -2 -4 -13 9 7 4 -9 -3 -23 -3 3 10 12 5 -20 1 17 11 5 16 -4
5342 -4 -2 15 4 -9 14 12 -6 18 13 -9 -11 -5 -14 4 19 7 -11 -12 -19 -8 -3 -6 -9 -6 -14 -6 0 -1 -12 -1 -17 6 8 -5 -4 -1 -1 9 21 -16 -1
5383 -1 13 6 6 27 12 9 9 2 -5 15 17 -10 -6 2 -3 17 22 -6 -4 1 -2 -6 20 -5 7 3 -7 -11 7 2 -7 4 7 -2 4 1 -16 -28 -2 -8 -19 4 -9
5426 -9 -5 -10 -5 -6 -4 -3 -6 -23 -15 2 -4 -2 -10 2 1 5 -5 -9 3 12 -5 3 15 9 9 21 -2 0 26 6 -10 23 9 3 6 6 -13 21 12 0 1 18 -7
5469 -7 -8 7 -6 0 3 -1 0 6 8 2 11 0 -4 2 2 -3 -8 -15 3 -2 -4 5 -5 -12 5 -5 -12 -5 6 -12 -13 12 -12 -8 16 -1 -12 16 3 -18 4 23
5511 23 -18 8 16 -14 -1 7 -7 6 37 -5 -13 14 -3 -9 11 15 -14 6 4 -11 2 10 -4 -6 -3 -8 1 3 -2 -13 -14 -4 2 3 -7 -2 -17 -17 4
5550 4 -5 -13 -6 -8 -19 10 8 -12 -3 3 -24 1 11 -6 -14 13 -3 7 8 3 -7 3 22 -4 12 13 4 0 8 3 3 9 -19 0 6 -5 16 6 -1 -1 -3
5591 -3 3 2 2 3 -2 -11 -18 5 -12 -18 -10 -18 -9 4 8 -1 -7 -4 -7 -13 5 -12 -10 4 -22 -10 18 -2 -13 9 -10 -10 3 -6 -30 -4 7 1 4 13 -11 -11 9
5634 9 -4 -12 19 -1 -15 9 18 -3 0 2 -6 13 6 -2 4 7 1 14 -1 -5 7 -10 -11 -4 -5 3 -2 -4 -3 -4 -11 -1 10 -17 -28 9 8 -18 11 7 -10 8
5676 8 8 -1 7 16 -2 1 12 6 4 22 15 -8 17 9 -7 10 7 11 -5 18 2 12 -1 -8 -5 16 16 11 9 1 4 3 -7 2 4 2 3 4 -2 9 -4 -13 -6 -17
5720 -17 -6 -4 -1 -24 -24 -4 -25 -3 10 -19 -5 -1 -18 -16 14 -13 -12 -5 -9 -5 5 10 -3 4 12 -7 -1 17 1 3 16 -1 -4 29 7 10 6 7 -1 8
5760 8 5 12 19 4 -6 6 11 12 11 6 -4 2 2 1 6 7 -7 9 -2 -3 -6 -2 -13 5 -8 -15 6 4 -10 -5 -9 -10 -3 -2 -10 -10 10 -13 -12 4 1 -8 5 -12
5804 -12 -2 12 1 0 14 10 -4 2 9 6 11 4 4 -6 9 -3 3 2 -4 4 4 1 -11 6 3 -2 -4 -8 0 2 -10 -8 8 -11 -18 -2 -1 -11 8 -9 -9 3
5846 3 -6 4 2 -4 -12 -5 11 -11 6 -1 -4 -10 7 -12 15 13 5 0 7 -11 2 28 2 6 29 17 -7 2 3 10 16 4 -1 16 10 -1 15 20 2 12 12
5887 12 -6 21 1 -11 -2 -3 -5 -2 -4 -7 -2 5 0 -9 -17 -11 2 2 -18 -2 8 4 1 -3 -17 0 13 2 1 17 -1 -5 -3 5 -16 1 2 -15 1 19 -2
5928 -2 8 7 19 9 12 1 1 6 -5 8 13 6 -3 1 -6 8 15 9 13 2 -1 -16 11 -3 -6 11 0 -6 -7 -13 -29 6 6 1 15 -8 -15 -6 -2 -11 2 -6 -18
5971 -18 1 -3 6 -4 14 0 5 3 0 2 -3 8 -1 19 -6 9 19 -1 -2 20 11 10 16 -1 0 11 26 0 15 8 -6 9 9 9 18 9 11 6 15 1 -7
6012 -7 1 -9 1 1 -13 -9 1 -17 -1 0 -10 -14 4 -18 -13 0 -7 -4 12 -7 -9 -3 0 -5 -2 2 -3 12 4 -14 12 14 2 0 20 16 14 16 3 18 25 6
6054 6 10 16 6 10 16 6 4 16 14 6 13 -1 8 5 -10 0 14 2 3 9 1 -2 -5 3 -3 -5 0 -12 -5 0 -23 1 0 -10 -2 0 -15 6 8 -1 -9 -4 -8 -13 9 -6
6100 -6 -2 9 -11 -9 30 3 1 17 12 -9 17 15 6 6 6 12 4 14 -4 -7 -4 -14 7 14 -5 7 1 -9 -7 9 -1 -6 5 -9 -3 13 -9 -4 4 -8
6140 -8 -5 11 -11 -12 -4 -3 1 3 2 -12 -5 -9 -6 7 11 -6 3 -9 -1 7 9 11 1 -4 6 13 22 -5 7 11 2 27 10 14 15 6 -2 6 17 12 -1 -4 -9 4 21
6185 21 14 -9 1 4 -2 13 3 -12 4 -12 -17 -6 -2 -19 -15 -7 0 1 -1 -18 -15 1 -14 10 6 -12 1 -1 -11 -2 1 2 0 -7 0 0 17 -2 -4 1 -5 19
6227 19 16 -3 -4 2 3 -1 22 16 3 11 -1 -1 11 18 -10 -7 10 -9 15 9 3 -8 -10 -4 -10 5 -12 -6 -3 -8 12 10 -5 -20 -6 -12 -5 15 -6 -3 3 -6
6269 -6 -2 -3 7 0 5 1 -7 14 4 -7 -11 -6 0 19 11 -9 10 5 3 12 14 -6 5 10 -15 19 16 1 2 0 -1 2 15 -6 -10 4 4 1 7 -2 -11 -4 0 -7 6
6314 6 7 -11 -9 10 -8 8 -5 -21 -3 -15 -12 -15 2 -16 -4 6 -3 7 -1 -7 13 0 -5 10 8 5 4 13 16 4 21 7 -1 19 4 -8 3 7
6352 7 -3 9 -3 -11 12 1 -1 4 15 5 2 2 7 0 3 -9 6 0 -1 9 -4 -8 -2 1 -11 -1 -10 -17 -10 -5 -1 -4 -5 -12 -14 -8 -13 5 -3 -12 -11 0 4 8 6 -5
6398 -5 -5 5 -12 -3 2 5 6 3 16 7 15 5 4 0 9 16 2 11 -7 -3 2 14 6 2 4 -8 -10 5 2 13 -3 -12 -1 -2 -4 -4 -6 -20 -5 -7 -2 -9 -4 -25 -23 -8
6444 -8 5 9 1 -28 0 2 -8 3 0 -13 -18 9 11 -9 -2 -11 -6 2 6 8 17 -8 -14 7 19 30 16 1 -10 3 15 12 4 12 -16 -14 1 4 9 14 -14
6485 -14 -13 14 12 -4 -11 -20 -9 -9 4 0 -5 -14 -28 -5 0 5 -1 -30 -11 1 -8 -1 -5 -12 -12 -4 1 19 15 7 0 -1 10 9 15 12 -12 -11 15 10 7 6 -5 -5 14
6530 14 21 15 8 -7 -12 9 25 2 10 6 0 5 10 13 1 3 -10 2 11 12 3 -5 -15 -2 0 -15 -5 -7 -17 -17 5 -4 0 0 -18 -2 -1 -1 9 -3 -18 -1
6572 -1 9 8 8 7 -8 -8 5 8 12 8 12 -1 7 20 10 22 12 9 4 13 7 14 7 2 -9 4 15 -1 7 -9 -11 13 3 -10 0 -14 1 -3 4 -7 -1
6613 -1 1 -6 -9 -13 -16 2 -16 -29 -15 1 -20 -5 6 -8 0 -4 -12 -12 0 5 -1 -1 -2 -6 13 12 -9 8 15 11 9 2 12 10 5 9 5 16 12 5 15 6 17 24
6657 24 7 -3 8 -6 5 11 -2 6 2 -1 0 7 9 -3 -10 -7 -5 12 -6 -14 -5 -11 -15 4 1 -9 3 2 -5 3 9 -17 -15 2 -2 1 9 -9 -16 -12 7 6 22
6700 22 8 -1 8 13 9 26 19 9 -2 -8 19 30 -2 -4 2 -3 14 29 0 -22 3 -14 1 14 10 -7 -9 -7 -13 3 17 -11 -23 -3 -11 5 10 -16
6738 -16 -3 -6 -7 11 9 -9 -17 -4 -3 -1 12 -2 -15 -9 -9 0 13 0 -19 -3 -3 6 16 13 -8 -8 -8 8 15 14 3 -6 13 14 16 21 -15 -6 -1 9 19
6779 19 22 3 -5 -4 -6 3 13 -10 -13 -6 -7 -6 13 -7 -31 -7 -3 -18 -7 -22 -29 -18 -11 -12 5 0 -19 -26 -10 -2 3 12 -13 -25 -7 4 0 8 -6 -12 -4
6820 -4 -4 -15 8 -7 1 -7 -5 10 20 -2 -6 -9 12 14 24 -10 -3 -3 2 2 19 -3 -15 -2 -1 -7 17 19 -12 -12 -10 -13 -4 -5 -20 -13 1 -11 -19 1 -8 -7
6862 -7 1 -8 -3 5 -6 -1 -5 -6 -1 5 3 -12 1 -7 4 6 8 -6 3 -13 0 15 8 16 4 -5 -2 13 6 8 4 -8 -10 -11 2 5 -2 11 -9 -4 19 -2 -7 -8 -14
6907 -14 2 10 -10 -11 6 -9 -24 5 -14 -19 -10 -7 -19 -22 0 -9 -8 -11 -16 -12 11 -4 0 -5 -12 2 7 2 10 -2 -6 -8 8 13 20 6 -3 10 16 12 19 3 -5
6950 -5 -1 15 -4 6 16 -8 -5 -1 12 -3 -7 -4 -27 11 25 5 4 -8 -16 -8 3 -8 1 10 -19 -6 8 1 4 -11 -19 -14 0 -9 -8 -7 -24 -8 -1 2
6990 2 -2 5 -13 -9 4 3 2 1 -13 -18 8 -6 8 21 3 -6 13 9 -8 7 3 -7 14 24 1 9 15 -21 -14 9 -13 6 -8 -12 -8 16 -2 6 2
7029 2 -11 -19 -6 0 -11 -18 -5 -25 -9 -5 -1 -6 -17 -8 -15 -1 -5 -3 -11 -11 -5 -6 -3 -2 -3 -9 -7 6 4 2 -8 -7 2 3 -3 19 6 -4 5 14 6 5 16 2 4 3
7075 3 1 0 0 5 -15 -4 -2 -5 5 -3 -9 -1 5 4 -8 3 -30 -13 -9 -3 -5 -20 -25 -13 -7 -3 -4 -6 0 -1 2 -4 -5 1 -5 -11 7 0 8 -13 -2 -18 -8 12 5 7
7121 7 2 -10 2 9 6 12 7 13 5 5 -5 8 -5 -12 2 7 10 9 6 -12 -9 8 7 -8 10 -4 -19 -2 7 -6 -9 -8 -30 -13 -1 -4 -4 -2 -24 -7 9
7162 9 -2 -4 -7 -7 -7 -4 -1 14 2 -1 2 3 6 0 10 -5 6 19 10 9 16 5 6 9 7 0 14 -2 1 0 22 5 11 3 -19 -2 7 -6 -3 5 4 -1 2 -4 -6 6
7208 6 -6 -11 -7 -7 -5 -1 -15 -27 4 -3 -15 -11 -8 -18 -9 -16 -11 5 -3 -14 -15 -2 -16 -1 -1 -4 -4 -3 -3 4 8 0 7 12 -6 -2 12 5 2 3 -1 5 17 -11 -3 -3
7254 -3 0 -7 9 13 -1 -5 -15 -13 4 12 -14 -10 -12 -10 -14 12 -2 -13 -9 -5 -12 -3 -16 -21 -12 -15 -8 10 1 -10 -8 -15 9 -1 0 -15 -17 -1 5 6 9 -8 0 0 1
7299 1 14 9 7 -10 1 -8 18 12 0 5 14 1 15 0 1 -5 -11 3 -4 4 -12 -17 -11 -8 -13 3 -10 -24 -27 -6 -5 -6 -11 -13 -21 -12 0 -6 3 -14 -15 -12 0 -3
7343 -3 -2 -12 -9 -9 6 4 2 -9 -11 3 8 14 7 3 8 1 4 13 22 9 -4 11 13 11 7 1 10 13 20 13 -4 0 -3 2 18 5 13 6 -18 -9 -1 0 2 -2 -7 -23 6 -3
7391 -3 -10 -6 -19 -6 -5 -6 -10 5 -7 -7 0 -3 -2 4 -2 -6 3 6 -6 5 -1 -5 17 -4 10 7 7 -10 9 13 2 5 14 -6 14 19 8 13 6 2 1 7 4 9 3 0
7437 0 2 -6 0 1 0 0 1 2 -1 6 -14 -11 6 -7 -22 -17 -9 -12 -10 -4 -1 -10 -6 -10 -3 -6 2 -7 -2 2 -2 15 12 -6 -7 13 5 6 10 -6 -8 19 6 19 26 23 13 4 6
7486 6 13 15 11 3 5 12 13 17 -11 -5 4 17 7 5 1 -8 -9 14 4 -2 13 -6 -4 -9 -1 11 0 -34 -8 7 0 9 -5 -5 -6 -6 -1 -7 7 -6 5 17 5
7529 5 14 6 -1 5 8 21 2 3 7 6 14 17 19 27 14 4 1 21 15 15 11 5 5 8 8 14 -4 -9 2 15 9 -5 6 10 9 12 8 -12 7 -2 -16 4 18 3 12
7574 12 0 -10 0 -4 0 -4 -10 -19 3 -3 -11 -6 8 -5 -3 2 4 -2 2 -5 11 10 4 -1 -9 5 14 7 4 17 5 -1 9 4 0 22 7 8 2 15 -2 -1 2 -3 5
7619 5 4 -3 -7 0 5 -10 5 2 -14 0 -7 -24 -8 6 2 -14 7 -3 -9 14 -8 -15 -1 8 -11 0 3 14 5 1 -5 -2 3 -3 4 -1 -1 5 11 11 8 9 7 8 10
7664 10 -2 21 8 -2 13 22 11 13 -3 -14 0 2 -1 10 0 -11 8 11 -11 -1 1 -10 -11 7 -13 -22 -9 -16 -12 -7 -7 -16 -2 -12 4 -11 0
7701 0 -3 -3 0 -3 -10 -4 0 8 4 -1 17 4 -2 -2 -3 8 10 8 -4 -4 0 1 9 23 14 -1 6 -3 -2 10 6 -5 12 1 4 1 -4 -5 11 12 2 -7 -3 2 4 0 -5 -4 2
7750 2 -11 -2 0 -13 -9 -17 2 -17 -3 -7 -13 -9 4 1 -1 4 -10 -4 17 -1 4 2 -6 9 4 -3 14 12 17 0 12 19 18 8 5 20 12 -3 3 3 1 3 7 -4
7794 -4 -2 6 7 2 -5 -11 -18 4 -1 -16 3 2 -11 -5 2 -6 -5 -7 -23 -25 -1 5 -5 -13 -13 -18 -1 -6 -5 5 -10 -6 -1 -10 11 0 2 -9 -5 14 1 -5 4 -1 10
7839 10 6 -2 1 13 8 15 16 14 3 13 -4 1 19 7 0 4 3 3 2 -7 -10 8 -5 1 13 0 -4 7 0 -6 -12 -4 2 7 0 -8 -2 -1 -5 -13 8 -7 -5 0 -11 -4
7885 -4 -5 -17 -4 9 9 2 6 -5 4 12 11 0 -11 5 4 3 5 1 6 8 15 16 8 3 5 -2 -3 -1 6 7 3 1 3 -1 1 -7 -7 -7 -10 12 -7 -5 1 -10 4 -6 0 -2 -5
7934 -5 -1 -10 -2 -6 -4 2 -10 -5 -1 -8 2 -6 5 5 -8 7 7 -12 3 12 6 12 3 -8 17 12 12 10 4 3 0 11 -2 18 35 7 4 -3 7 11 11 -2 -8 -7 -2
7979 -2 -1 1 -8 -3 5 2 -5 -8 -7 -8 2 0 -8 -14 -4 -11 -18 -7 -11 3 2 -5 -1 5 -2 -13 -5 4 -4 -3 -16 -1 4 -2 -3 1 8 10 7 1 -2 6 9 0 6 9 14 13 9 -4 11 9
8031 9 -1 10 7 7 6 5 -8 -1 18 -1 -1 -1 7 1 15 -5 -3 2 -5 -2 -2 -3 -5 -5 -4 -9 -1 -3 -7 -1 -1 -9 3 4 13 5 2 7 1 8 -2 10 18 -2 14 11 12 7 4
8080 4 7 20 10 11 1 12 15 -7 9 5 8 -7 -7 6 5 3 -1 6 5 -7 -9 -7 -8 -3 -6 -10 0 -12 8 -4 7 -12 -8 -13 -9 2 -5 -7 2 7 -7 -6 4
8123 4 -4 -2 -11 1 1 15 -9 -7 -4 5 11 2 2 6 20 4 7 11 10 13 12 0 21 12 5 -2 3 12 5 4 4 2 4 7 7 -1 -2 9 13 6 -1 4 -1 -2 8 0 -4 8 -10 -6
8173 -6 -8 2 -4 2 -7 -7 -4 13 3 5 3 -5 3 -3 -10 8 12 6
8191F
##END NTUPLES=NMR FID
##END=
