##TITLE=1H_LY-836.60
 CCl4, 8 sc, 
 7.6.2019
##JCAMPDX= 6.0         $$ Bruker NMR JCAMP-DX V2.0
##DATA TYPE= NMR FID
##DATA CLASS= NTUPLES
##ORIGIN= UXNMR, Bruker Analytische Messtechnik GmbH
##OWNER= root
$$ XWIN-NMR		Version 3.5
$$ Fri Jun  7 13:52:26 2019 Russian Standard Time (UT+4h)  she@DPX200
##.OBSERVE FREQUENCY= 200.13155
##.OBSERVE NUCLEUS= ^1H
##.DELAY= (6, 6)
##.ACQUISITION MODE= SIMULTANEOUS
##.ACQUISITION SCHEME= undefined
##.AVERAGES= 8
##.DIGITISER RES= 18
##SPECTROMETER/DATA SYSTEM= spect
##.PULSE SEQUENCE= zg30
##.SOLVENT NAME= CDCl3
##.SHIFT REFERENCE= (INTERNAL, CDCl3, 0, 15.7039)
##AUDIT TRAIL= $$ (NUMBER, WHEN, WHO, WHERE, WHAT)
$$ ##TITLE= Audit trail, XWIN-NMR		Version 3.5
$$ ##JCAMPDX= 5.01
$$ ##ORIGIN= Bruker BioSpin GmbH
$$ ##OWNER= she
$$ F:/spectra/data/she/nmr/H-F/1/audita.txt
$$ ##AUDIT TRAIL=  $$ (NUMBER, WHEN, WHO, WHERE, WHAT)
(   1,<2019-06-07 13:51:13.54 +0400>,<she>,<DPX200>,
      <created by zg, POWCHK disabled, PULCHK disabled
       configuration hash MD5:
       00 E9 B6 7A A2 85 ED C7 34 08 36 98 17 FE 4E 26
       data hash MD5: 16K
       06 75 1C 96 4E 70 1D 2D 5B 29 E5 68 E4 99 2A B4>)
$$ ##END=
$$ 
$$ hash MD5
$$ 74 9D 16 F2 AF 1E E4 05 AD 6A DC C9 40 C0 42 FC
##$RELAX= 
##$RELAX= 
##$RELAX= 
##$RELAX= 
##$RELAX= 
##$RELAX= 
$$ Bruker specific parameters
$$ --------------------------
##$DU= <F:/spectra>
##$EXPNO= 1
##$NAME= <H-F>
##$PROCNO= 1
##$TYPE= <nmr>
##$USER= <she>
##$AMP= (0..31)
100 100 100 100 100 100 100 100 100 100 100 100 100 100 100 100 100 100 
100 100 100 100 100 100 100 100 100 100 100 100 100 100 
##$AQSEQ= 0
##$AQ_mod= 1
##$AUNM= <au_zg>
##$AUTOPOS= <>
##$BF1= 200.13
##$BF2= 200.13
##$BF3= 200.13
##$BF4= 200.13
##$BF5= 200.13
##$BF6= 200.13
##$BF7= 200.13
##$BF8= 200.13
##$BYTORDA= 1
##$CFDGTYP= 0
##$CFRGTYP= 5
##$CHEMSTR= <none>
##$CNST= (0..31)
1 1 145 1 1 1 1 1 1 1 1 1 1 1 1 1 1 1 1 1 1 1 1 1 1 1 1 1 1 1 1 1 
##$CPDPRG= <>
##$CPDPRG1= <>
##$CPDPRG2= <>
##$CPDPRG3= <>
##$CPDPRG4= <mlev>
##$CPDPRG5= <mlev>
##$CPDPRG6= <mlev>
##$CPDPRG7= <mlev>
##$CPDPRG8= <mlev>
##$CPDPRGB= <>
##$CPDPRGT= <>
##$D= (0..31)
0 1.2 0 0 0 0 0 0 0 0 0 0.03 0 0 0 0 0 0 0 0 0 0 0 0 0 0 0 0 0 0 0 0 
##$DATE= 1559901073
##$DBL= (0..7)
120 120 120 120 120 120 120 120 
##$DBP= (0..7)
150 150 150 150 150 150 150 150 
##$DBP07= 0
##$DBPNAM0= <>
##$DBPNAM1= <>
##$DBPNAM2= <>
##$DBPNAM3= <>
##$DBPNAM4= <>
##$DBPNAM5= <>
##$DBPNAM6= <>
##$DBPNAM7= <>
##$DBPOAL= (0..7)
0.5 0.5 0.5 0.5 0.5 0.5 0.5 0.5 
##$DBPOFFS= (0..7)
0 0 0 0 0 0 0 0 
##$DE= 6
##$DECBNUC= <off>
##$DECIM= 24
##$DECNUC= <off>
##$DECSTAT= 4
##$DIGMOD= 1
##$DIGTYP= 9
##$DL= (0..7)
0 120 120 120 120 120 120 120 
##$DP= (0..7)
150 150 150 150 150 150 150 150 
##$DP07= 0
##$DPNAME0= <>
##$DPNAME1= <>
##$DPNAME2= <>
##$DPNAME3= <>
##$DPNAME4= <>
##$DPNAME5= <>
##$DPNAME6= <>
##$DPNAME7= <>
##$DPOAL= (0..7)
0.5 0.5 0.5 0.5 0.5 0.5 0.5 0.5 
##$DPOFFS= (0..7)
0 0 0 0 0 0 0 0 
##$DQDMODE= 0
##$DR= 18
##$DS= 0
##$DSLIST= <SSSSSSSSSSSSSSS>
##$DSPFIRM= 0
$$ [...]
##$SUBNAM2= <"">
##$SUBNAM3= <"">
##$SUBNAM4= <"">
##$SUBNAM5= <"">
##$SUBNAM6= <"">
##$SUBNAM7= <"">
##$SUBNAM8= <"">
##$SUBNAM9= <"">
##$SW= 24.9336996594482
##$SWIBOX= (0..15)
0 0 2 0 0 0 0 0 0 0 0 0 0 0 0 0 
##$SW_h= 4990.01996007984
##$TD= 16384
##$TD0= 1
##$TE= 0
##$TE2= 300
##$TE3= 300
##$TEG= 300
##$TL= (0..7)
0 120 120 120 120 120 120 120 
##$TP= (0..7)
150 150 150 150 150 150 150 150 
##$TP07= 0
##$TPNAME0= <>
##$TPNAME1= <>
##$TPNAME2= <>
##$TPNAME3= <>
##$TPNAME4= <>
##$TPNAME5= <>
##$TPNAME6= <>
##$TPNAME7= <>
##$TPOAL= (0..7)
0.5 0.5 0.5 0.5 0.5 0.5 0.5 0.5 
##$TPOFFS= (0..7)
0 0 0 0 0 0 0 0 
##$TUNHIN= 0
##$TUNHOUT= 0
##$TUNXOUT= 0
##$USERA1= <user>
##$USERA2= <user>
##$USERA3= <user>
##$USERA4= <user>
##$USERA5= <user>
##$V9= 5
##$VALIST= <valist>
##$VCLIST= <CCCCCCCCCCCCCCC>
##$VD= 0
##$VDLIST= <DDDDDDDDDDDDDDD>
##$VPLIST= <PPPPPPPPPPPPPPP>
##$VTLIST= <TTTTTTTTTTTTTTT>
##$WBST= 1024
##$WBSW= 4
##$XGAIN= (0..3)
0 0 0 0 
##$XL= 0
##$YL= 0
##$YMAX_a= 48548
##$YMIN_a= -60807
##$ZGOPTNS= <>
##$ZL1= 120
##$ZL2= 120
##$ZL3= 120
##$ZL4= 120
##$ABSF1= 10
##$ABSF2= 0
##$ABSG= 5
##$ABSL= 3
##$ALPHA= 0
##$AQORDER= 0
##$ASSFAC= 0
##$ASSFACI= 0
##$ASSFACX= 0
##$ASSWID= 0
##$AUNMP= <proc_1d>
##$AZFE= 0.1
##$AZFW= 0.1
##$BCFW= 1
##$BC_mod= 2
##$BYTORDP= 1
##$COROFFS= 0
##$CY= 11.3945322036743
##$DATMOD= 1
##$DC= 2
##$DFILT= <>
##$DTYPP= 0
##$F1P= 18.9103706918063
##$F2P= -1.10871071338519
##$FCOR= 0.5
##$FTSIZE= 0
##$FT_mod= 4
##$GAMMA= 1
##$GB= 0.15
##$INTBC= 1
##$INTSCL= 1
##$ISEN= 128
##$LB= 0.24
##$LEV0= 0
##$LPBIN= 0
##$MAXI= 10000
##$MC2= 0
##$MEAN= 0
##$ME_mod= 0
##$MI= 1.114404
##$NCOEF= 0
##$NC_proc= 0
##$NLEV= 6
##$NOISF1= 3.799351
##$NOISF2= 2.8
##$NSP= 1
##$NTH_PI= 0
##$NZP= 0
##$OFFSET= 15.70392
##$PC= 1
##$PHC0= -8575.573
##$PHC1= 13.40019
##$PH_mod= 1
##$PKNL= yes
##$PPARMOD= 0
##$PSCAL= 0
##$PSIGN= 0
##$REVERSE= no
##$SF= 200.130013532006
##$SI= 16384
##$SIGF1= 3
##$SIGF2= 2
##$SINO= 400
##$SIOLD= 16384
##$SREGLST= <1H.CDCl3>
##$SSB= 0
##$STSI= 0
##$STSR= 0
##$SW_p= 3612.71676300578
##$SYMM= 0
##$S_DEV= 0
##$TDeff= 0
##$TDoff= 0
##$TI= <>
##$TILT= no
##$TM1= 0
##$TM2= 0
##$TOPLEV= 0
##$USERP1= <user>
##$USERP2= <user>
##$USERP3= <user>
##$USERP4= <user>
##$USERP5= <user>
##$WDW= 1
##$XDIM= 8192
##$YMAX_p= 0
##$YMIN_p= 0
$$ End of Bruker specific parameters
$$ ---------------------------------
##NTUPLES= NMR FID
##VAR_NAME=  TIME,          FID/REAL,        FID/IMAG
##SYMBOL=    X,             R,               I
##VAR_TYPE=  INDEPENDENT,   DEPENDENT,       DEPENDENT
##VAR_FORM=  AFFN,          ASDF,            ASDF
##VAR_DIM=   8192,          8192,            8192
##UNITS=     SECONDS,       ARBITRARY UNITS, ARBITRARY UNITS
##FACTOR=    0.0002004,     1,               1
##FIRST=     0,             0,               0
##LAST=      1.6414764,     0,               0
##MIN=       0,             -60807,          0
##MAX=       1.6414764,     48548,           0
$$ Real data points
##PAGE= N=1
##DATA TABLE= (X++(R..R)), XYDATA
$$ [...]
916C4J211j967L15J505k100lK532j581r61K390j226j727K211l87j606K435J60
933A235k503J352O26k200J312J497j904N98J367k212l76J761q07P0J489j184p71
950f50R21r64j22J742n60m46J088j538j058K210j87j270J925j51k315J273P61
967F59j932J231J711k004l10J444j315m17J718n60p30J185m13j045P17J76l13
984a98N99k42n03N24j79k92O20m12l88R79l52q21J248n6j513Q63O64j225R39J083
1004A338j912m17J525p77m37J750l94j414P62N0j045J029J021r11m03K85m34l0
1022d14N92J11r0p6j41j09k70Q6P63l6o43L43L6q03M92P01p22J02Q45j032o96
1043i61J226J33p13P02M2j186L83Q96n93j04P45n08p64N02M53j53J25M5n30l21
$$ y = [34, 1245, -722, -407, 1098, -1002, -1005, 1527, -54, -1015, 1375, 149, -1578, 633, 246, -1360, 1075, 1235, -1268, 84, 710, -1490, -178, 1319, -585, 13, 1380, -832, -1208, 553, -254, -184, 1305, 121, -650, 271, -693, -815, 927, 367, -79, 1009, -529, -1587, 623, 436, -834, 1091, 940, -1375, -102, 659, -1273, -42, 1669, -335, -645, 799, -516, -933, 785, 225, -505, 680, 267, -778, -61, 115, -198, 401, 159, -344, 180, 1, -291, 329, -83, -471, 508, 156, -665, 583, 527, -986, -123, 541, -684, 255, 1338, -574, -991, 534, -243, -680, 1070, 676, -738, 24, 74, -971, 58, 1079, 168, -235, 50, -384, -414, 178, 289, 199, 123, -18, -127, -397, -311, 452, 416, -227, 116, 152, -651, -159, 542, -180, -78, 767, -265, -961, 265, 398, -315, 387, 429, -757, -374, 522, -71, -175, 570, 62, -702, -200, 253, 100, 225, 270, -260, -581]
1063e81M99N28k49l12K84j66n91M52O80m82j53M85o61m93J107K51r44L36M83q85
1083d12j1Q85m17l78Q05j57r45M02O12m08j08M83k51m96L00K90l81J04O79m19
1103A77q67N01N29n55K56O80r45n33J069j58p48J051L76j441P4R17o29nJ125o66
1123B08j047Q23L62p65M09O83o50m88M74K5l06M25M25o58m99O90J91o82L75O25
1143F20q17k54Q68m89n66J173N6j219M82O14q87J77Q60o46k80O58m10m69O38K13
1163C22k61ok35m8K89j16J40L03n69r2N31n70j10J149l92j001P62R4q76R18N46
1184G78j273K40Q14r70r9J091l74m94N27l03m02N63K16k67p0q3J56rm28N05M32
1205E50q69J49P38j113j4J625j001j061J762l36j716J620O41j977R91J264k171
$$ y = [-581, -82, 446, 197, -115, 169, 3, -588, -136, 544, 62, -91, 394, -267, -760, 347, 598, -346, -10, 473, -412, -423, 462, 45, -333, 472, 315, -630, -228, 384, -24, -132, 351, 100, -396, -96, 194, -187, -83, 596, 177, -690, -189, 340, -215, 41, 721, -224, -757, 312, 154, -594, 457, 833, -608, -534, 383, -246, -251, 874, 208, -839, -16, 346, -419, -10, 673, 23, -465, 9, 34, -272, 153, 578, -80, -579, 111, 302, -380, -5, 620, -197, -451, 417, -72, -638, 535, 591, -628, -146, 468, -419, -242, 618, -28, -308, 350, -60, -529, 109, 322, 61, 55, -180, -228, 61, -55, 85, 388, -181, -273, 258, -312, -422, 727, 335, -666, 96, 190, -686, 232, 778, -495, -255, 559, -411, -510, 581, 207, -287, 240, -63, -465, 98, 314, 47, -23, -106, 50, 41, -387, 118, 550, -319, -170, 568, -545, -559, 1066, 65, -996, 766, 430, -1286, 334, 975, -1002, -11, 1253, -918]
1222i18N8K035j243p17J648p49j103J371kj029R40K13r41K89J64k56N82j13n36
1241c07M71k70l99R28k08p50J036j64j320J072N54j263Q35N72j674N63J248j470
1259e46J63J424j349l33J429j150l72J800r40j015J588o65j042J836m25j492J841
1276G52j01k068J676P57k148J319J159k603O84K081k176j96K355j648j067K203
1292I79q47j334K051j28j726J107L21j108Q79L21r07N43l6o33P73j75n09J198
1310G69o20j286J685J7j715J759M42k542J507J441k825Q75K467k796l50K881k190
1327d81j091L408j454k278L061l59k737K581O63k866J814J197k979J056K012k346
1343g99K93J911k070k25K070j517n11K002j108r45J576q20p23J777o22j151J401
$$ y = [-918, -860, 1175, -68, -785, 863, 114, -989, 382, 380, -649, 291, 504, -437, -148, 16, -240, 342, 229, -307, 164, -106, -505, 423, 215, -535, 501, 337, -983, 89, 643, -620, 215, 787, -887, -324, 924, -546, -383, 1041, -308, -641, 788, -362, -734, 1066, 126, -889, 699, 34, -1008, 828, 403, -1089, 752, 651, -1417, 259, 1016, -1132, 187, 1346, -1257, -573, 1508, -668, -864, 1491, -157, -1224, 979, 132, -1202, 849, 721, -1005, 102, 423, -685, 194, 515, -392, 151, 115, -518, 255, 80, -429, 769, 149, -1137, 548, 565, -1150, 609, 1051, -1491, 16, 1457, -1368, -493, 1974, -822, -1172, 1709, -481, -1572, 1836, 382, -1896, 1165, 806, -1931, 650, 1313, -1553, 261, 1458, -1521, -465, 1547, -799, -506, 1405, -665, -890, 1180, -337, -848, 1154, 46, -899, 677, -143, -866, 911, 289, -862, 539]
1360E39m28j007J441k38j007J345l81j320J456kj224J561k08j890J796M64k305
1377a408J745J119k902J184J979l127N18L176k889j034L568j977k015L694p96
1392H35l006L153M82l534K125J699l182J047K167k787N1K523j915p88K265j026
1408A09j107J691m86r93J258j70q44O82j68j27P26q10j88J087j089k77J802j091
1426Er75K125j009j956K560L42k483J906Q71l059J253J977k704N23K628k496p76
1443a268K612j754j075L038j011k027K557l61k572K179Q29k429J587J285k728
1458a138M04J866j781p4J960j180p22J376q58p78J316j38n28P44l89m66O40n09
1476b55k65R73l40k43Q20r03o42J277n39o30J733l85j489J367k72j838J960J084
$$ y = [539, 111, -896, 545, 307, -700, 645, 264, -1056, 400, 398, -826, 735, 527, -1363, 433, 897, -1408, 337, 1456, -1446, -262, 1717, -1410, -892, 2284, -605, -1639, 1929, -48, -2063, 1631, 835, -2171, 982, 1464, -2070, 55, 1754, -1428, -381, 1786, -1001, -950, 1573, -342, -1130, 1135, 109, -998, 693, 207, -786, 472, 302, -542, 140, -28, -155, 571, -239, -427, 660, -429, -706, 1096, 5, -970, 1155, 146, -1810, 750, 1092, -1391, 515, 1386, -1673, -420, 1557, -1147, -624, 2004, -492, -1268, 1344, -410, -1485, 1553, 542, -1485, 1072, 711, -1861, 318, 1147, -1282, 305, 1590, -1138, -734, 1132, -649, -723, 1237, 57, -665, 711, -147, -925, 391, 253, -275, 469, 80, -386, 254, -255, -520, 453, 113, -130, 690, -213, -855, 422, -117, -747, 986, 601, -888, 479, 207, -1631, 329, 1413]
1494A413k299R57J369k686J21K454j751n08K745j359k104K108m4j882J910R20
1510A364k015O32Q79j854J60J552o14r3Q10r41n63O86k40jP84j93k95P3o13lO87
1531B02k33J01N53o82k53N82p46k15J335k47p28R14m31j205J049L75j026J057
1549D02P01j606k2Q46j008K96J417q67n25R96q34q12J256J3n70J064k11j337O61
1568a40L80r29P34Q31r11k5M51j018n5J152j94l00M98m29n80M13O6r5M95N3l93
1589Dp8k01K6L95j44n0M45l33l61M37l07l41R12M7q48N55K45j035L82P57q11J72
1611a32R49r43n66J018k60o01R18Kq23N88J80q88L67O15n28P2L86m98q0L87l29
1632a66PM78j72j84R4l07M2M62k06j20L26l10k07M11k05j68O00j86n81M27J08
$$ y = [1413, -886, 71, 1440, -1246, -1125, 1329, -422, -930, 1815, 456, -1648, 460, 416, -1466, 444, 1364, -651, -19, 860, -994, -834, 718, 104, 11, 821, -120, -683, 3, -237, -238, 546, 353, 58, 131, -482, -485, 202, -31, 70, 623, -59, -312, 270, -476, -691, 644, 397, -331, 583, 152, -1053, -4, 371, -655, 402, 1103, -503, -525, 321, -687, -391, 1026, 159, -366, 630, -204, -1016, 240, 253, -317, 747, 536, -801, -140, 240, -689, 45, 876, -35, -60, 391, -627, -682, 470, 276, -24, 474, 45, -535, -122, -56, -151, 344, 397, 4, -74, -275, -249, 146, 2, -48, 397, 64, -297, 140, -167, -508, 404, 451, -397, 158, 403, -632, -250, 507, -304, -132, 817, -126, -692, 326, 66, -535, 383, 385, -438, 150, 330, -558, -191, 424, -104, -32, 354, -144, -224, 163, -166, -159, 319, 147, -37, 57, -250, -208, 254, 48, -72, 254, -56, -263, 148, -57, -225, 375, 189, -392, 35, 143]
1653A43m24L99J58n71K60L41n58N6M64l38k2L09l90m8M75k79j40L99k76j65M13
1674B06k95k46O81j46n77M60O5n42N19K54p03K47M94o71l3O27l42j79M76l25k94
1695c24N18k8l75K51N9k13K10l9k04K21j0k02K03m2j13L08j90l54L96J15m11L19
1717I5J62n49K31L50n99R8O49m20k63M65l08k88O26q7m27M35M9n21J86K19k27
1738a24K71J07m64P5K21k41J74K08l27J11J64m38P7M74k51r7K72l66j37N50j82
1759G7l20M34l7m43L02R9k88L06J47m67K5K82j62O2J31k23K9J00k07J29J77j64
1781a1Q4J5m27K23M52m06o4M30m23k20N90k08l53O36l8p42L71L28m62K68L29n77
1803b05k6M47l13q0M38j54k09J54j95l4L93p6j65J06k03n8K97j19m7L39k41l14
$$ y = [143, -281, 118, 276, -295, -35, 306, -252, -196, 268, -70, -92, 217, -173, -221, 254, -25, -165, 234, -42, -207, 206, -89, -335, 346, 200, -377, 83, 148, -394, 125, 379, -324, -77, 417, -254, -287, 340, -2, -181, 295, -30, -324, 194, 166, -209, 42, 101, -112, 98, 59, -145, 76, 66, -136, 67, 25, -88, 220, 30, -324, 72, 187, -224, 95, 257, -292, -61, 289, -310, -212, 437, 17, -246, 219, -89, -377, 249, 162, -265, 170, 219, -302, -116, 103, -124, 147, 254, -210, -135, 86, -155, 19, 227, -100, 11, 175, -263, -186, 288, 37, -60, 212, -154, -291, 259, 77, -243, 191, 154, -289, 13, 112, -176, 130, 277, -190, -165, 117, -45, 17, 148, -75, -46, 54, -153, -24, 153, -11, 73, 88, -339, -116, 336, -70, -134, 296, -127, -347, 243, 35, -318, 318, 280, -462, -91, 237, -225, 43, 372, -205, -231, 216, -97, -177, 261, 107, -102, 52, -143, -177, 216, 140, -25, 81, -122, -180, 117, -2, -49, 290, 49, -265]
1825b65K58m5q0M77j17n72L44J08m42M15K97n25J21K43o06J23O90l32k26L42l59
1846a51j81N16j28j96L78j72l42K87o1r8N09k01n15L95M8m28N15J51o00K95K38
1867B59o74K31O19m30r7L36m84m7N81k53j62M25l56k36M37k23j01O78l62n74N39
1888A06o5m02O99Rp17M55J65p73M74N46o52J49L54q30J75Q10n89j00O67o23l26
1909d68P61l25k97Q44k88p29N32K8l75O19ro19M20k6n19N90J82n76N20l2r41O58
1931e0O23r15L53O42j154N5J075q58k04J246p20q20J052k48o62J128r3j077P53
1950A26J75r39P53M56r39M36L55j076M14Q56p98J07N91r35%Q97o76m7R04p38m24
1971e02Q13n30j90J149n87p79R67l29p40J212k5j038R10K9j282R50O77j127N45
$$ y = [-265, -7, -52, -132, 345, 228, -344, 0, 108, -334, 81, 378, -147, -26, 217, -389, -266, 424, 92, -134, 208, -151, -332, 184, 56, -140, 238, 66, -276, 11, -50, -148, 361, 160, -355, 40, 88, -340, 175, 326, -274, 21, 259, -415, -184, 435, 5, -92, 244, -240, -287, 294, 41, -121, 304, -52, -288, 149, -74, -175, 503, 141, -433, 106, 41, -361, 338, 347, -370, 85, 250, -523, -49, 497, -155, -6, 348, -482, -307, 503, -86, -186, 481, -142, -468, 293, -32, -329, 515, 227, -502, 30, 58, -317, 302, 293, -326, 94, 68, -451, 139, 321, -255, 265, 233, -708, -50, 573, -342, 11, 653, -501, -446, 629, -229, -433, 813, 93, -727, 325, 77, -585, 543, 450, -627, 126, 301, -638, 115, 571, -368, 68, 423, -653, -239, 617, -181, -74, 517, -418, -418, 479, -197, -244, 660, -78, -502, 311, -219, -409, 740, 153, -626, 341, 12, -728, 484, 459, -579, 331, 360, -922, 28, 705, -422, 123]
1990A23N13j394M44J051j130J97J095j263k58J269r35k77J587q47j060J367l40
2007A42j025J459M5j376R93K96j434Q29Q36j152L92O24j265K62J023r12P1Q81
2025F89r62j54Q79p56l0J120q23m99R69o58l40J327o22q20J240n04j012J478K0
2044E42j261J190K1j687J214R30j585O65R40j832K76J500j315rJ623j354q29J548
2062E77o75o31J699n40j315J261j50j177J314L19j242Q51K10j425P85Q04j086
2079d21N03O16j252K71Q02j018K92J013j047o8Q48j010M1J274r81l96J240q94
2097a87n64J491o29q81J480n05j320J603J79j507J210K76j854J147J128j721N58
2114i6J208j876j0J686j210k10J769j235j107J535l99q19J551k21j308R94l2j122
$$ y = [123, 636, -758, -314, 737, -393, -196, 899, -364, -622, 647, -288, -565, 1022, 175, -885, 482, 142, -883, 576, 621, -755, 238, 534, -900, -71, 765, -387, 5, 629, -636, -374, 649, -263, -192, 689, -273, -427, 452, -304, -334, 786, -37, -536, 433, -225, -565, 762, 140, -680, 560, 56, -956, 522, 542, -719, 471, 492, -1195, 19, 949, -636, 29, 969, -863, -587, 913, -402, -411, 1212, -142, -971, 577, -98, -729, 970, 430, -885, 376, 226, -951, 363, 682, -560, 291, 501, -924, -139, 665, -421, 82, 698, -554, -283, 519, -499, -207, 806, -241, -309, 539, -471, -430, 844, -137, -533, 707, -187, -751, 740, 111, -770, 710, 205, -1115, 488, 667, -840, 370, 646, -1208, -61, 1067, -654, -96, 1112, -764, -774, 912, -298, -508, 1261, 26, -1081, 454, 55, -764, 787, 566, -742, 252, 220, -902]
2132i02J081M60r76O17Q8j152P21N02q96O66M43j188M77M93j177O47R91j270J19
2151b56R76j309K9J473j126l99J548j024q98J686m81j103J594k93j591J496M45
2168G67j623J027O41j769P16J185j513K95J320j474l36J442q38l36J435q30r40
2185h31J185k71p28J167j01r02P70j68q62R42K58p72O11j1r73P59L16r30P40M51
2205F50j201M68N77j171N71J040j341qJ176j182k26J502q92o47J474o97j130J531
2223D94k7j206J165J02j459R52O81j318N83Q23j303J62R24r79J41J097r95l75
2241e38J000o08l16J090n11o20R20l56o79R33J6o94O76j20q35P66K75p74N54K26
2261D05r06M65M03q30N18N91j028J12P05q14J67R39r24k72J006o78m68J169m04
$$ y = [-902, 179, 639, -337, 280, 368, -784, -63, 439, -457, 209, 652, -536, -59, 434, -743, -96, 895, -375, -256, 720, -589, -560, 913, -213, -612, 936, -88, -986, 700, 219, -884, 710, 417, -1174, 322, 767, -856, 171, 812, -957, -241, 944, -569, -274, 1046, -428, -764, 678, -160, -496, 939, 109, -831, 354, 83, -645, 522, 421, -481, 289, 121, -741, 201, 459, -313, 298, 287, -686, 73, 389, -541, 199, 650, -551, -83, 494, -677, -106, 934, -407, -415, 761, -421, -647, 855, -37, -684, 790, 93, -1037, 494, 467, -739, 426, 528, -931, 21, 702, -616, -33, 790, -513, -351, 573, -406, -265, 832, -163, -538, 462, -146, -462, 628, 117, -503, 417, 61, -618, 315, 331, -363, 313, 193, -642, 124, 399, -375, 179, 405, -501, -36, 367, -463, 55, 646, -382, -270, 435, -379, -212, 727, -197, -469, 537, -141, -609, 560, 156]
2280A56p27J038k92r77J070K44j084O83M00j089M85O64r88K07Q54q53j53P54n57
2299a65j40P98m66l85O67l31l63O90j75l59N62k99n82P19J00m92N17q0p56N22
2319a8L15o19M83L57q55Q9M81n60K68O94p25k70O05l99j71P48l21m32O24k47n22
2340d75O73L7n73M92N8n75M82J93p27L09M35n19J92M03o83j2O06m28j16O19l19
2361G2l62M62j76k81N21o9m34L53Q4k97K34n3l99L84J94k94K38Pn36K02K88k99
2383a61L40L39o91j87M00k31J42O00m49m09M07k04k64N82M9m16K83l2m42L34K29
2404B19m22J49K70k71P8J45m14J2L86j02NJ89l27j53K43j23O4L96k06l06J66j03
2426a05r8M27p4l37K67O3l13J95P7l14K08K28k86R9J58l79l8K78o9J46K15m25
$$ y = [156, -571, 467, 175, -802, 268, 512, -572, 111, 511, -578, -93, 571, -417, -210, 644, -209, -362, 392, -165, -305, 493, 27, -358, 309, -22, -385, 305, 130, -229, 333, 34, -548, 171, 271, -221, 296, 216, -540, -18, 297, -322, 161, 518, -337, -248, 233, -327, -59, 635, -90, -360, 245, -154, -325, 423, 102, -330, 294, 47, -475, 198, 235, -338, 154, 212, -363, 119, 312, -415, -106, 329, -190, 2, 405, -278, -290, 316, -112, -228, 391, 72, -290, 172, -4, -285, 236, 167, -267, 86, 170, -127, 107, 54, -345, 39, 233, -61, 177, 184, -352, -150, 138, -161, 179, 518, -173, -360, 40, -191, -49, 551, 102, -307, 100, -104, -368, 214, 263, -153, 130, 98, -344, -10, 219, -203, -54, 216, -55, 23, 168, -246, -234, 152, 50, 55, 244, -83, -236, 7, -116, -52, 344, 138, -168, -2, -105, -203, 224, 150, -187, 80, 143, -170, 25, 102, -212, -4, 224, -62, 37, 195, -184, -222, 56, -13, 133, 348, -77]
2448g7k27K74l7L4L38j85k99J91p8j94L73J20l02P2K8k28J98J43k60N4J76j17
2470cJ3O1k23L2K15j25L7J68j96j05J30j19P0K79j65k00J48o0o9K69p6k19K32
2493I4K1k74J50J26k16J21J20k27O7J96k42o8K04n0LJ18j79r5J79l4o2J36m6p9
2517c7P7o3q4J73K4j32K6om5J20l8r0J12J2j11O9k7n5J77j8k21J05J21j60Q8J01
2543A18k15M3J95k36j0K97j46j54J74j01j02L06j7l00J23J31j78Q2J22j70m4J37
2565E5n9o0J35L8j25j07P8J15j2n0M4j23o6K55j6k23J39J11k99Q3K73k12o4K22
2589A32k06j12L73n4l04J45K4j19K30P7l00L7J17j51J01K04j67q7O3j37P6K84
2611B26r0k03Pm6O2K22q3j40L9n5m0J95J3j11N6j36r1K49R6j48k8p5q1K33J03
$$ y = [-77, -304, -30, -67, -33, 305, 120, -179, 12, -66, -260, 113, 233, -69, 3, 31, -197, 1, 144, -116, -62, 114, -3, 10, 71, -152, -120, 95, -30, 7, 175, -21, -126, 4, -115, -45, 234, 69, -131, 17, -43, -112, 157, 81, -138, 94, 115, -159, -9, 117, -99, 22, 142, -85, -18, 178, -64, -132, 72, 22, 25, 143, -36, -131, 48, 14, -48, 88, 42, -37, 40, -23, -107, 66, 90, -42, -16, -22, -67, 53, 15, -75, 37, 49, -62, 7, -20, -75, 102, 84, -137, -32, 89, -71, 17, 118, -97, -54, 141, -95, -105, 192, 46, -108, 66, -35, -137, 169, 152, -148, -25, 106, -72, 10, 132, -38, -82, 55, -4, -64, 71, 109, -16, -123, -45, 70, 58, 8, 52, -71, -137, 118, 102, -121, 18, 129, -170, -87, 186, -26, -90, 132, -74, -186, 187, 133, -171, -26, -2, -121, 109, 186, -114, -77, 40, -111, -10, 194, 27, -60, 3, -134, -58, 226, 136, -67, -60, -106, -44, 178, 95, -45, -6, -61, -101, 94, 107, -4, 52, -84, -175, 74, 170, 22, -6, -81, -162, 71, 174]
2636A74j86K5j7j66J88J38k09Q7O8l12P7L72k06j31K18k51j22M91k9m36K08R4
2658G5l18K57K84l52p2K15k27j1L79n0k66Kj5K1K22J1j63o8o3J04J75q9j7O5k25
2683a26o9L28j2j43J48j75k32L73J61l26O8Q2k89J60L06k80n8K27k62q4L74n4
2705A17k08J51j25j71L62R0k98L5L9j65K20J39k48L6O3k35J39K58j76m2Q4k72
2727b07K2M15q4k49J46j03j35L14O3k62R5M1k18J14J95r7j9j4j56J04J63j04l
2750B1j0j75J76J51k27MJ95k50l1L40j71j61K71j49k60M07J07l87J09R9k81K07
2772a5K83l35o6K46k47j2L45j43j58K06j88j60L80L6k53J10k0k26K69J28k56Q5
2794IQ7k42Q7J78j52Q0R3k78J8K64j58l1K14k36o8L14j59k10L14l0k20K03l6k12
$$ y = [174, -12, 13, -4, -170, 18, 156, -53, 34, 102, -210, -133, 239, 33, -98, 120, -131, -253, 238, 209, -227, -19, 75, -243, 14, 298, -54, -126, 89, -138, -149, 230, 180, -86, -84, -99, -78, 144, 155, -8, -76, -139, -35, 140, 51, 34, 99, -126, -195, 133, 121, -22, 126, -49, -281, 92, 253, -73, -5, 77, -212, -52, 254, -26, -84, 143, -119, -203, 171, 117, -91, 60, -65, -236, 126, 216, -82, -47, -8, -173, 47, 186, -62, -26, 37, -198, -59, 199, 23, -19, 65, -207, -185, 230, 146, -103, 43, -60, -195, 119, 182, -80, 15, 56, -162, -48, 147, 50, 31, 17, -139, -35, 128, 24, 21, 11, -164, 12, 163, -64, -60, 135, -115, -146, 194, 23, -138, 133, -16, -276, 131, 238, -149, -40, 59, -222, -15, 268, -67, -133, 113, -134, -146, 199, 56, -102, 104, -84, -244, 136, 172, -81, 29, 9, -217, 52, 180, -76, 9, 96, -146, -59, 119, -33, 47, 140, -138, -120, 144, -14, -45, 169, -67, -135, 179, 20, -190, 124, 94, -126, 77, 41, -171]
2818a71K47Qk26K13N7k86J77O7k80K48K13m71N4L60l45oM41l12k48M56j45l56
2840c05M30R6m01K00P8l29K50J93l30R3J63k71P4K03k58R9K49l14r1K72j41rK51
2863B02j88j42K03j39o4L06r2j44K01k56j97M85M0l86K81mm54L17L10m16J27K86
2885B76m63l2M09k05o2L01l24j30M32j61k32L25j43k40M32j6m14K90J06m38K35
2906e4L21l27OJ89l03K3L39j47j03J09j48O3K12k12o5K16k08qL63j92k11K17j98
2929a18j45N20M2l57J21j73k77M98K27l61J25K4n34K16M81l06N3L17n44j74N69
2950B04j14k61L38j35k51L46K5l43J31N5j53K85Q9k85O0k7k86L12L18k54j7J6
2972E3l63J34M10j65q1J51k41m5K80j57m5K20k06r1L91j39k63J96j55j67N58J11
$$ y = [-171, 76, 84, -142, 71, 128, -158, 19, 86, -194, 54, 267, -204, -150, 210, -135, -141, 300, -12, -260, 196, 51, -305, 125, 221, -180, 20, 98, -231, 19, 212, -118, -25, 138, -133, -59, 144, -114, -15, 234, -80, -171, 101, -40, -49, 202, 14, -128, 75, -64, -128, 178, 86, -58, 143, -113, -310, 175, 215, -171, 110, 106, -348, -31, 279, -137, -10, 276, -187, -219, 190, -15, -77, 224, -100, -230, 202, 41, -191, 134, -9, -249, 183, 167, -247, 43, 149, -289, -54, 267, -60, -54, 135, -168, -145, 194, 47, -56, 53, -95, -32, 180, -32, -97, 119, -89, -97, 266, 74, -137, 80, -118, -263, 257, 299, -58, 63, -110, -387, 111, 338, -23, 102, 126, -408, -192, 289, -17, 36, 353, -191, -365, 204, 90, -171, 167, 32, -219, 127, 152, -191, -60, -5, -158, 127, 216, -69, -9, -36, -322, -10, 308, 54, 37, 53, -310, -176, 234, 69, -12, 139, -102, -147, 133, -24, -69, 151, -55, -146, 245, 106, -157, 39, -116, -283, 275, 386]
2994C86m49L9o1l06M02L37k96L3L9m87J04M65j42RK12m51j48M81j33k17L36q4
3016F9k65L27J2l62J55R9j71K30J32k39k9o4j87L14K61k26oj5l39J82L48k38l
3039a5K08k96p8L19j41q4K45j87j21L56j01k53J92j11j68M55P1m34J27P6l58K45
3061e3L62k94pJ55l69m3M20r4r7J80k37j00K90j22j39K67o6j70K30p1k35K35K2
3084F4k13K11J02k41N6K6j75K12J35k56M9R6k32J44K18k87J9K69k85q0L46j41
3106C7j69K64j31j73L12Jk85J59M2j76K18J2k56J74J10k86J40J69k88Q8K01k81
3128a18jL17k17j43K63q7j14K11j12j67K28lj47J31m3j38K04mj57J47Nk15J42
3151a8Q4j35J49K7k97J03J91j67J04J27l15L7K77k62k6L59k38k05L46r2k42L29
$$ y = [386, -63, -24, -85, -391, 11, 348, 52, 85, 124, -363, -259, 206, 64, 73, 285, -166, -314, 167, 34, -183, 153, 69, -196, 131, 143, -219, -64, 35, -136, 94, 226, -13, -42, -106, -293, 21, 282, 56, 50, 35, -304, -122, 226, -12, -15, 193, -103, -181, 138, -3, -87, 158, -29, -150, 206, 105, -148, 44, -67, -235, 220, 291, -143, -16, 60, -298, -53, 309, 15, 8, 163, -206, -249, 171, 77, -20, 160, -77, -177, 113, -9, -148, 119, 53, -117, 113, 42, -193, 42, 64, -149, 62, 164, -77, -21, 5, -170, 42, 177, -79, -30, 66, -166, -22, 196, -91, -72, 197, -88, -168, 178, 37, -132, 132, 1, -172, 140, 141, -144, 15, 57, -119, 99, 111, -145, 29, 139, -147, -7, 162, -126, -38, 163, -118, -119, 198, -19, -162, 101, 14, -100, 111, -1, -168, 60, 57, -90, 41, -2, -140, 64, 60, -97, 50, 55, -160, -18, 66, -69, 80, 107, -190, -87, 104, -63, 41, 168, -147, -110, 167, -95, -121, 238, 0, -205, 141, 49, -193, 136]
3173A36k1l50K47J79k70N2J10k32J11J99j59JO4j92O3J43j21R8R6k94k1K56j17
3196b2k3K17k37j18K87o9j53K23q5j86K35lj88K07J0l24J83J95k01Q5P8l02O6
3219a25K82j63j1J40k24mK06j59K9K30k59j18L05j17j25L15j63l26L52J35l46
3240a46J68J31l41J14K60k23qJ86k15m9J86o0K9O5k16LK25j36OJ57k34n6K93j34
3264Ej35K81j25k37K61K6k17K57J1l89K24K20k90J04J86l42K7L21k15q7K78j49
3286A5j79K17kq8J50j00j52J63Mm3J47j49j41K69o2k12K80K1l23K08J46l32J33
3309c0K77l60n3L44j78j09K51j79j23K73n6j70J85n3j65J97j3j45K11l8k55J82
3331gP2j54J75Rk86J51J52k24R7J85k83M3K01k32nL29k06k09K75m8j68K43j6k39
$$ y = [136, 115, -235, 12, 191, -79, -27, 83, -149, -38, 161, 2, 3, 67, -125, -62, 81, -40, 58, 154, -140, -161, 95, -22, -45, 172, -65, -183, 104, 35, -118, 105, 20, -166, 69, 66, -122, 85, 95, -229, -46, 149, -52, 33, 111, -191, -125, 157, -6, -17, 123, -101, -105, 101, -58, -29, 201, -58, -176, 129, 12, -113, 202, 39, -287, 65, 200, -146, 22, 153, -188, -74, 186, -37, -45, 141, -74, -123, 63, 3, 32, 97, -119, -116, 109, -27, -21, 136, -98, -154, 139, 5, -130, 151, 26, -211, 50, 76, -141, 116, 127, -262, -38, 182, -108, -4, 182, -160, -133, 188, -27, -114, 164, 15, -164, 53, 51, -37, 113, 13, -139, 24, 28, -15, 132, -17, -158, 111, 49, -163, 117, 138, -185, 23, 169, -163, -30, 247, -113, -166, 178, 0, -109, 142, -37, -160, 113, 57, -113, 72, 19, -146, 51, 38, -107, 104, 66, -189, -7, 65, -89, 86, 95, -191, -40, 112, -112, -15, 170, -113, -70, 131, -101, -106, 223, 17, -192, 83, 35, -133, 110, 94, -145]
3355a45J60P0j83J03P5j43R6J4j60J52P2k17J25O9k21J60J46l11L4L00k38q1K76
3378A53j83j44L17r7k16K50J6k55J58O8j67J56N9k53P3J39j32O6O5j52M6R7j57
3401i3O5J55j65nJ06j69P1K26k01j03K21j20j11K40o5j78K16j4k23J56J18j95
3423f8P4O6j74R4J08j59J5J14j10L7O8j57N5J37j68J0J57j52l1J91j41j09K57
3446A14n0k24J71M2j56J38N8k11Q7R3j28L3J08j08J2N0j26P7J28j29qO8j11L7
3470c5J42j34m2J59j03q3J72o6o2J62r5j52J80K6j55J29L6j80J40O9k16P0J52
3493A14j38KJ01j31NJ19j06j7J34j00l6J03j05j7K07j22j36J73k5j27J49J1j59
3516a01J16N3j83P7J26j18RN4j11O1J07j25JQ4r4J8J21j46MJ58j51q9K21o3q6
$$ y = [-145, 15, 85, -98, 5, 80, -63, 33, 47, -113, 39, 111, -106, 19, 88, -133, 27, 173, -138, -104, 196, -42, -123, 153, -30, -174, 143, 46, -170, 80, 96, -159, -1, 67, -100, 56, 115, -138, -65, 74, -58, 8, 73, -79, -33, 64, -93, -28, 127, -38, -43, 63, -106, -35, 191, -10, -113, 108, -12, -123, 117, 52, -126, 90, 76, -147, 9, 127, -68, 6, 72, -102, -8, 100, -59, -44, 70, -40, -3, 65, -92, -37, 100, -68, -58, 99, -53, -84, 107, -34, -143, 114, 64, -160, 11, 53, -103, 35, 93, -118, -31, 62, -66, -33, 75, -33, -21, 29, -97, -20, 108, -21, -29, 39, -72, -35, 107, -27, -69, 90, -13, -96, 76, 10, -52, 110, 15, -137, 43, 69, -86, 43, 79, -101, 39, 108, -108, -38, 114, -24, -22, 79, -52, -47, 72, -34, -51, 83, -17, -53, 50, -55, -72, 135, 13, -123, 50, 25, -102, 47, 58, -101, 15, 68, -115, -38, 88, -30, -21, 33, -78, -17, 90, -35, -34, 50, -44, -26, 95, -51, -47, 111, -40, -129, 92, 29, -57]
3541e7J53p0j61J86L9j96J40P9j88Q8M9j84Q9J62j55l1J23j05m2J24p9QJ43j02
3565A3r8Q4m1pJ53q9j06J45o1j33J85Nj32J49Lk06J33J29j95K7J29j52M6J45j63
3590c7n7J90j14o5J72n8q6J37r2j21J81K8j33J04j7j34J26K5j36J11R8j65J2P6
3614D5j55P6J65j47m5J82j35j10J56j8n8J34m4j53P0L8m1P7k3n4P3m5r9J34L8
3639F1j32J08J0j83J14J49k17K5J73j37l5J48j12o6J94q5j31J84%j44J25kj66
3662a19J38R3j88M5J34j32j3R5q1pJ14n9o4N2k0KN6n3lQ1j03n7J32m5l6J19o3
3689A8j34J23O3j37O9M5j09M1M9j12O4R0j05J3O8j06K5J30j59j3J94r7j45J61
3713C6%j23J53Lj76R3J01j61N2J01j06J4O7j25J9J75j09o6J03p2l8J22m6q1J08
$$ y = [-57, 96, 26, -135, 51, 90, -106, 34, 113, -75, 13, 62, -122, -33, 129, -26, -57, 66, -39, -81, 43, -36, -28, 115, 13, -85, -1, -42, -49, 104, 15, -91, 54, -7, -140, 45, 50, -82, 67, 70, -136, -3, 126, -69, -42, 87, -65, -19, 126, -37, -94, 96, -18, -83, 89, 31, -55, 82, -10, -131, 50, 78, -55, 49, 32, -102, 24, 49, -87, 24, 122, -43, -31, 45, -110, -34, 131, -16, -61, 121, -14, -124, 32, 14, -44, 90, 46, -107, -37, 1, -40, 37, 14, -40, 33, -12, -111, 23, 61, -71, 37, 47, -136, -22, 127, -90, -65, 108, -29, -64, 84, -28, -94, 100, 15, -116, 68, 68, -76, 49, 47, -119, 19, 112, -76, -31, 103, -29, -42, 53, -28, -35, 79, 20, -44, 8, -12, -10, 46, -7, -10, 71, -32, -89, 43, -2, -38, 81, 18, -116, 7, 70, -67, 2, 47, -62, -21, 28, -84, -20, 70, -35, -22, 46, -60, -35, 95, -64, -77, 117, 20, -125, 36, 36, -87, 66, 69, -107, -14, 87, -74, -22, 79, -27, -13, 54, -71, -52, 123, 14, -52, 51, -21, -59, 63, 17, -64, 44]
3738D4mr4L2M5l6M8k5n6N8k4k1P3m9o8J32k1j44R2R6j25K5J02j44kJ39r6n5J51
3766G3n1q3Q5n1m3J57l9j50J07J4j17J17P7j43K5J15j62j2J75m4q4N1l6m7R9K0
3792E3o8J6pj9L6k2J0P1p7q1Q3K4l5P5k5j17N6N9p7M8N1r5L6J7r7N1J32j24j7
3821d3J18r2o8J22n7p2J87J0j93M6M7q1P4J04r8rK0q2KJ03J1J6j0j40LJ35l6l1
3849a4R0p6o8J03qp0O9K0j07L1P8k0qk6r0O7P0oJ5k8j10M6O2m5M6O4j13m5O5l4
3879d2K2J04p9p1J03j4r0Q5j6p7J57Jj38K2N1j27N6J58n1l7K4j33l4J63P3n3k8
3906B9m7o3P5L4j4L9k6p9O0pj0N2k7q4N3P8l7j9k8p1P3Q7l4j6oq5J0R1l5L0M7
3937G0j18m6Q9J7k6M9o2o8J19L3r7K2J0p6R6O1r5J0M1j16PJ59j4o8Qo6m2J36P3
$$ y = [44, 40, -54, -22, 23, -13, 35, 10, -46, 12, -12, -33, 40, -9, -77, 55, 34, -110, -18, 78, -47, -22, 80, -64, -66, 73, -23, -78, 73, 22, -61, 24, -27, -70, 87, 48, -102, 5, 19, -98, 19, 96, -47, -22, 93, -69, -81, 94, 50, -34, 17, -19, -66, 33, 53, -15, 1, -6, -25, 11, -11, -1, 70, -7, -88, -5, 19, -16, 59, 34, -83, -27, 32, -45, 3, 54, -41, -5, 12, -85, -34, 98, -26, -43, 75, -17, -85, 37, -20, -92, 95, 105, -88, -42, 5, -76, -2, 102, 4, -5, 15, -67, -65, 38, 49, 65, 55, -85, -82, 53, 17, -14, 76, 0, -68, 35, 27, -43, 26, 46, -61, -30, 48, 28, 20, -6, -96, -29, 41, 35, 50, 22, -88, -42, 20, -25, 21, 85, -28, -73, -8, -42, -20, 84, 5, -66, 37, 23, -67, 18, 2, -75, 82, 83, -55, -33, 18, -109, -53, 105, 54, 17, 41, -92, -126, 37, 110, 57, 29, -18, -81, -6, 28, 14, 53, 27, -52, 8, 1, -9, 43, 16, -68, -15, 63, 26, 7, -21, -92, -19, 68, 34, 18, 12, -73, -63, 28, -7, 23, 70, -48, -94, -5, 12, -14, 35, -27, -95, 24, 57, -40, -18, -8, -84, 12, 73, -22, -12, 29, -87, -80, 79, 65, -3, 5, -61, -103, 33, 106]
3966A06q7m0J2j4OM9J8k8l9j6K9RK7L8r2n7R9M2o1Nno5O6N1o0j4L8n9MP6m0JL5
3999C4q0l1J29jo0lk9l3J20L1j09PL5o1L5O9l1m4K2l9JP7J1n1l4KJ2P7k6l4j8
4030b2NK9J4k5J8nn9J4O9k7k1M8p9m4J63k3j32O8M7j11R5Q1j67j1J25q1l7J57
4058H9l6j33M9K9m7R7K9j06n1M6N4Lnk2jm9L3O9l6l3N3m5p1J29M5j39RN9n8N8
4088A9R2j37o1J04Jm3Q4l4p9N2Ll2R4j9r9K9K3j2R8j5j55M4P4p3Q8M9j97M7J08
4117E3j15J9J67j34j29J60j9o4J52k8j97O6J44r0lO0p9l1N7M0j1k2j5J8n0J6J47
4144A12n6j64R0O7j31J17J16k53k4K42j19r0K34r7k08J88O4j74J38R3k57RJ99
4167I6q0k5Q3j29m2J29Om1L1m1l2K2j6N3N4j10l6J00n4KJ35j13j51K05J5j53J28
$$ y = [106, 19, -21, -9, -23, -17, 32, 50, 22, -17, -33, -4, 5, 32, 70, -22, -79, 20, 62, 1, 6, 1, -64, 2, 53, -7, -21, 17, -42, -38, 38, -2, -1, 34, -46, -77, 52, 51, -9, -12, -41, -74, 46, 77, -32, -25, 10, -51, -16, 53, 22, -22, 0, -39, -38, 39, 50, -1, -35, -33, -21, 56, 30, -4, -22, -17, 12, 26, 1, 19, 14, -45, -31, 38, 11, -10, 38, -41, -85, 78, 55, -77, -9, 38, -73, 22, 103, -64, -75, 50, -31, -68, 89, 53, -80, -31, -2, -49, 48, 77, -29, -80, -34, 20, 23, 18, -4, -5, -54, -21, 48, 12, -21, 32, -13, -84, 45, 90, -49, -40, 19, -39, 19, 111, -26, -87, 17, 18, -25, 59, 25, -54, -2, 1, -31, 63, 44, -55, -26, -3, -15, 83, 68, -87, -43, 31, -42, 46, 95, -102, -55, 53, -62, -43, 124, -10, -139, 21, 2, -62, 90, 62, -135, -69, 75, -15, -18, 42, -37, -68, -11, 29, 18, -4, -19, -1, -51, -35, 112, 56, -108, -18, 49, -82, 35, 151, -102, -126, 116, -3, -93, 141, 44, -164, 24, 88, -86, 52, 145, -112, -103, 96, 16, -9, 74, -55, -97, 32, 38, -3, 28, -13, -45, -23, -39, 14, 68, -42, -78, 22, -32, -30, 105, -8, -159, 46, 61, -92, 36]
4194C6M5j90O9J43j41KJ38j32o8J39ll3M4p5l4R5k1J3K3r6JJ26j03l1J76j12j37
4221a26J84j0j52J96K1k78J23J82j91j4K00j66j04K20n2j59J72L0j75M9J10p2
4243a2oM5m9j7PM2J3q4L3R6r0p3J47l1j41J65M3k21J16J59k30oK24j41r4J98p8
4270A5j36J93nj63J09Q1j33J8O6p7M8L5p3KJ4j4O2k2p6P6K5j18O2J09j39JJ14
4297G4j39l4K18p2j49J29mj23J19O7j56M7O6r4lR2k2k3j6k0N2Lk6L6k2p7J09L1
4325F3j61Q1J12j63kJ81j23p8J83q5j45K13L0k03P1P8j30P0J40j38o6J11l3n7
4349e1R4lo0lpL0L0k6Lj3o6Q2P9j19k6R9p4l4J46n3j14J05Mj33J22Q4j31lN6p6
4379e8N1P6p4m7P5l1mM1m5j1O1m2MP0o2m9P1m3j7J41m7j44O4N7p4Q9N1j58J2J00
$$ y = [36, 81, -109, -40, 103, -38, -36, 102, -30, -98, 41, 38, 5, 49, -26, -60, 35, 14, 27, 50, -46, -45, 81, -22, -53, 123, 11, -126, 58, 48, -104, 92, 113, -165, -42, 140, -51, -65, 135, -31, -135, 85, 33, -126, 46, 76, -99, -50, 60, -12, -18, 27, -22, -39, -32, 10, 23, -61, -28, 68, -22, -95, 52, 21, -120, 45, 88, -133, -17, 142, -88, -94, 130, -11, -105, 93, 15, -121, 72, 67, -96, 13, 94, -39, -21, 45, -32, 16, 51, -22, -20, -6, -20, 42, 20, -56, 20, 45, -73, -11, 98, -41, -40, 74, -65, -99, 119, 47, -102, 27, 23, -100, 19, 86, -70, -23, 43, -51, -54, 38, 16, -7, -23, -43, 9, 12, -14, 22, 0, -77, 32, 63, -98, -17, 95, -68, -70, 111, -12, -90, 93, 8, -137, 76, 106, -97, -26, 52, -78, -8, 132, -6, -72, 39, 6, -51, 43, 40, -20, -23, -30, 0, 30, 4, 7, -6, -72, 10, 89, -30, -56, 43, -31, -65, 81, 28, -86, 19, 23, -110, 12, 96, -35, -38, 18, -58, -7, 69, -5, -52, 23, -8, -12, 29, -16, -27, 34, -8, -4, 66, 4, -45, 26, -17, -34, 107, 60, -84, -20, 37, -37, 52, 103, -55, -43, 57]
4409E7r8qJ12m3m9K9Lk1K9j2m0K4K3M2j4q8j2P0k9J4R5q5r5J11k3q3J57J8j62
4438g8L3O7p4L8R0j21j1J23l7o5M6l5l1P4L3l2J7m8o0L1N5L2L8o6r6M2M4j4O2
4467E7j0q0K2L8n2J9N7o8qO0om2K4n4l9J06K7qj9q8j6Q8K0j3N1p7q0N9K6l1J03
4498F6k6j25L6J11p3%N6r7rJ33j8j06N3j8m9P9N5m4j6k5n2N3O5J4k8o6l1P1J1
4527B0%K1l2n7O1J6o0M1J6r0K1J05m1k5K7q5k0J35K8q8j3lm7P3O6n9Nk9m4L4M4
4558B0pJ2l2p1P1N8n5KJ6p3K3J24p2n7O6m1m1Q4L5q2J9J2o1N3Q2n4n4NJL0L0l2
4590A1j1j3k7O5%m7M5pr3N2Q1n2m0P4q0j2J33m3j18O3L6p3P4M1q7j8M6n7K2R2
4620E7k7o9J5j7J8O1j2m5j3%K8K3m8L1L4o4oP6l8l4O7m1m7J07J3j20K1P0o9K9
$$ y = [57, -41, -49, 63, 20, -29, 0, 3, -18, 11, -1, -41, -17, 6, 48, 34, -54, -66, 4, -25, -11, 84, -1, -96, 15, -8, -91, 66, 84, -78, -45, 22, -52, -14, 76, -45, -56, 67, 30, -35, 11, -24, -55, 19, 52, 20, 37, -11, -71, -40, 15, 47, 85, 19, -77, -35, 9, -5, 57, 47, -33, -11, 27, -25, -6, 51, -17, -25, 35, 29, -13, 11, -43, -82, 24, 51, 43, 24, -64, -80, 8, 28, 15, 66, -11, -91, -32, -6, -37, 66, 40, -85, -49, 62, -11, -11, 45, -52, -61, 72, 54, -52, 1, -17, -66, 13, 68, 24, 8, -17, -69, -16, 49, 63, 35, -31, -62, 9, 20, 20, 41, 9, -48, 13, 29, -31, 10, 26, -64, -43, 62, 21, -4, 23, -62, -82, 53, 81, -7, -20, -23, -70, 3, 69, 10, 15, -14, -58, -24, 20, 13, 25, -7, -78, -7, 51, -4, -2, 14, -59, -36, 88, 16, -41, 25, -16, -57, 27, 62, -20, -1, 11, -50, 3, 85, 31, -23, -18, -17, 13, 43, 11, 0, -13, -40, 25, 25, -22, 23, 16, -77, -25, 56, 4, -36, 38, -42, -54, 79, 36, -82, -19, 17, -56, 18, 59, -28, -46, 0, -57, -35, 57, 30, -39, -24, -41, -23, 38, 26, -19, -32, -32, -4, 19, -29, 2, 36, -28, -34, 42, 4, -30, 37, -4, -51, 56, 69, -51, -30, 40, -29, 0]
4650@P2q0l7O4pl5O0j6m1K4j7oN9k1m5K4ljO6n6p8P7J2m4M5K8q6OM9o3L3Q7p6
4683fm0N0j9kO5l4n7O8Ko9L6QrM3j9m3J9L2n3K7J8j9M2j7q2N3N0n1K5K9j01J2
4715d2J08o8m3J09n2p6O5J7n6P4jq0NO9m2%N0m6lJ5m3J7L5j0kLm9L0M2m6J2L2
4747B4m2j3L8l1OP2m0q3P2J9n4O7Oq1L2M2o0OO8l5j8L5l8j7O8j7l5J9Pk8RJ6j9
4780eK5J3m4%NJ2K5rm4K3Lm3L9K3j7J2ro3K5P3l6k3K6l3rN1j4k9L8j8l9J4L8j6
4814fJ4nl4K4L1k3Rqj9K9Nm9J1M8k3j2M5m2k0M4l3PM5jo9J4QkL5J8o4k0L5QnK4
4850A9pk7j3RJ5J1J8k0n5j6P7J9n1J8kn1L9N5n3j5N9m5m5Q1J8p0K6L0n1L4N7p4
4882a0l9P4Ol2K8j5m0J9L5qrJ8j9l5JM8K2l3k0j2j7O8L6n4n3L7j1j6N0J4m8k4
$$ y = [0, 72, -8, -45, 19, 12, -23, 37, 21, -20, 4, -13, -19, 40, 19, -26, -2, -5, -6, 60, 4, -74, 3, 15, -29, 16, 44, -42, -36, 13, -50, -17, 70, -6, -46, 4, -15, -17, 48, 14, -43, 25, 27, -42, -6, 2, -7, 36, 17, -26, -7, 25, -28, -1, 17, -2, 40, 23, -59, -6, 44, -7, 18, 47, -54, -42, 66, -2, -45, 64, 12, -64, 1, 18, -38, 36, 35, -45, -40, 29, -13, -13, 37, -9, -12, 3, -40, -23, 12, 2, 0, 3, -46, -16, 26, -20, -8, 24, -18, -31, 7, -24, -18, 54, 14, -69, 3, 22, -32, 35, 41, -40, -8, 34, -26, -20, 48, 13, -5, 30, -8, -25, 43, 26, -9, 10, 17, -11, -2, 14, -5, 20, 33, -11, -11, -6, 6, 31, 22, -22, 1, 4, -39, 0, 23, 6, 18, 9, -54, -29, 44, 8, -15, 11, -22, -31, 20, 6, -23, 15, -3, -42, -28, 10, -6, 8, 3, -31, -7, 24, 1, 10, 2, -17, 12, 17, -32, -21, 27, 4, -8, 37, -5, -25, 19, -14, -7, 38, 37, -32, -18, -10, -12, 23, 41, -23, -43, -8, 0, -5, 19, 12, -15, -28, -19, -4, 7, 25, 5, -50, -66, 11, 30, -21, -3, -5, -56, -17, 38, -15, -30, 29, -16, -61, 20, 38, -32, -6, 24, -27, 7, 64, -10, -49, 25, 31, -1, 27, 12, -28, -9, 26, 18, 9, 27, 8, -27, -26, 22, 44, 11, -9, -21, -38, 30, 66, 12, -41, -4, -15, -31, 19, 33, -15, -39]
4914c9L7k8J7M8k4n1QL5mKrrj3K3J0j5j6L8Ko2L2N9m6m2N4oj7P1j4j07K9P2l3
4947BJ0L4n1m9P3rj9M3J3r2oP1K4l3J5j7n9L0O4j8n1K8Pn1K1P5n1l9N2k2m3P8
4979C0K2j02mR4n1j4O4m8n8Q2J0n9K6K6n2LM9prPl9j1M5K3Pl8l5K4L4j1J8nm6
5012b5PK0j1L8L1o5m7N8K0j9K7op4L9M9m7j3K8kk9K1J1k0%LmjRM4l9p8P0M9n8
5046a4jL6o9qJ11n5n1P8j7q9P1N8p1J4M2q1jJ10j8q8M7J7n0M7L2n7j4L1j6j0J8
5077BM7l4l6J9J4j3K0J5n4j4P6j8p3O0K3o3L1N1q5MP0o9j9R3j8n9J7kk3O0J4o0
5109b4KJ7j3J1J3pNqj6J2K0jrll2L2L6n0j3M5l3mN2k7l7N1rm5L9L7n0J7J3k4m
5144gL7k5l1L7lJ4k7j0J7J5m0K7J1m8L0J9o1J1Q4n2n1O4rl7O4Mq4L9N0o4PO9n9
$$ y = [-39, -2, -30, -13, 35, 11, -40, -32, 3, -1, 1, -8, -17, -30, -7, 3, -12, -28, 10, 12, -50, -18, 41, -5, -47, 7, 1, -16, 55, 41, -66, -37, 35, 2, 12, 46, -5, -54, 19, 10, -9, 34, 47, -45, -51, 20, 44, 11, 26, 9, -50, -20, 44, 26, -25, 3, 10, -41, -20, 55, 4, -35, 17, -5, -48, 30, 52, -50, -54, 40, -11, -25, 39, -9, -67, 15, 25, -34, -8, 18, -34, -31, 18, 11, 2, 9, -30, -41, 4, 27, 34, -4, -39, -15, 19, 8, 26, 21, -25, -18, 2, -9, 29, 60, -5, -52, 6, 26, 7, 34, 28, -46, -7, 42, -5, -18, 10, 8, -21, 0, 11, -9, -9, -6, -10, -11, -2, 42, 3, -75, -5, 44, -14, -15, 21, -48, -56, 55, 0, -51, 27, 10, -79, -8, 50, -21, -7, 35, -46, -47, 63, 45, -43, 4, 21, -29, 18, 50, -7, -21, 10, -6, -16, 2, 49, 15, -21, -2, 12, -1, 19, 34, -20, -34, 42, 24, -49, 11, 34, -29, 2, 53, -32, -28, 42, -27, -46, 47, 29, -30, -13, -15, -38, 22, 36, -24, -22, -5, -18, -7, 6, -1, 4, -4, -20, -8, 12, 11, 2, -1, -33, -1, 35, -15, -28, 17, -16, -20, 32, 5, -32, 19, 10, -35, 4, 41, -9, 8, 21, -3, -7, 30, 5, -26, 11, 8, 22, -5, -15, 2, 17, -23, 4, 15, -33, -3, 16, -45, -34, 50, -2, -53, 11, 2, -35, 29, 33, -51, -12, 38, -26, -19, 50, -9]
5177im6P3k3l0N5J5m8OL3l3QJ8j8kJ2mJj8L0J9m0k2N2nm9N1lm6L6L8r7L5O9o5
5211gj1M9k3l4N0j1n4M3K8o5K4K2k2OK2m4J2J8k3K3k4j1L9J0n8K8L9m2J6K4n9
5242c5QO7m7l9P7j2o2P0J6p9M5M4r6J4P6k1m5L9k8kL0Nl3%J6J4j1k7K1K7n0PM0
5275B9l3j9P2o2m1J14l6q1O5K2o6L0N8q9KP9p5l8J04j4n0N2l1n2O4K5n1J8J4r
5305AJnqL3j7k2L6j2k5M1k0n6N9M9o6J5K2m8lQ6n2l5N3l0l6M9J1l3L3j0l5L8%
5338A4k8J4oj8N6k0o1N2Jn4O0K6p0L4L4j06J5J07m5m5O9m6m9Q6J3q5M8N1o2nM0
5369B0l2NK6oj8J4J6k0l8J7O3j5m2L9j4m8O6J8q8M5O6j10%R7m3o3J00k6q4Q4J0
5400C9q0L0O8o9jN3m5k6N5l1k5M1Pk1plJ2lK4k1qk4L0K7o4J9O3m3j8M5j9l5M0
$$ y = [-9, -55, 18, -5, -35, 20, 35, -13, -7, 26, -7, 1, 19, 1, -1, 11, 7, 8, -10, 20, 39, -1, -23, 29, 24, -25, 26, 23, -23, 13, 51, -46, -11, 58, -7, -18, 31, 8, -26, 24, 13, -41, 2, 30, -35, -11, 11, -11, -5, 17, -27, -15, 3, -20, 3, -21, -32, 7, 17, -41, -13, 26, -16, 0, 24, -35, -27, 40, -7, -46, 31, 19, -43, 27, 43, -36, 9, 53, -43, -29, 47, 26, -19, 20, -8, -10, 20, 25, -8, -8, 8, 22, 11, -16, 5, 32, -18, -11, 29, -4, -23, 49, -13, -54, 60, 24, -57, 8, 30, -36, -6, 52, -37, -35, 44, -31, -69, 35, 21, -29, 23, -8, -60, 4, 29, -22, -4, 10, 1, 2, -3, -11, 22, 5, -17, 19, 7, -18, 23, 3, -53, 6, 55, -11, 4, 26, -22, -25, 61, 9, -26, 27, -3, -39, 10, 21, -12, 21, 11, -24, 14, 14, -14, 0, -6, -24, 32, 12, -49, 3, 4, -50, 10, 36, -34, 0, 34, -72, -57, 50, 5, -40, 29, -17, -66, 20, 33, -52, -4, 47, -15, -20, 20, -12, -7, 19, 13, -5, 9, 25, 5, -33, -16, 47, 32, -10, 29, 15, -33, 33, 51, -37, 8, 74, -36, -36, 61, 18, -45, 55, 29, -55, 29, 39, -41, -11, 57, -12, -13, 40, -5, -31, 24, -7, -32, 9, 16, -5, -12, -15, -3, -6, 18, -3, -11, -35, -5, 22, -42, -23, 40, -3, -21, 24, 5, -30, 10]
5433A0Pn4N6K1o0OL1l1M4Qn8MM6m3K1K3l8J6J9m9qP2m2k7O2l8l4P7k2o7M7M4o1
5466a8lL5l0%M9m8j2L3kk1J2LPJk4J5ooM8j5n4L7K8o7J4Q1p4k0Q5n6l9R8qq7M9
5501EN3q5M4M1q8KR3n7l2O5k1n5M8K0n5M0Pl8J1J7j6J3j9qK4mj8J4j2j6M2j5m8
5534d8P0po3N0K1m4L6J7q1J5N9l7nN2n7ML8l9j0P6l3m9M7%l0N8j1p3N0L2n1J2
5566aM3o1J5M3m2rN4l4l0M0qk0M3k2m9K8K6j9J3j5pK6k0nJ8j8rK2j5j7N2j4m8
5599d0L3K1l4K9J7p7K1O1m5j1O0n2k2P5k9l8O9qq1M8M8p5L4L1n9K6L7l2rL2k0
5630A0j4J8j1lK4j2j9kJ5jJ6k2JJ5j5j3J8rnL4k4l3M0jm4K9K0n0M1J5n6J6L8k5
5664ioK1k3pM9k4l2N8j6m3L5jj6M0lm5QL4l1J1L1l3jK1j7j5M3pk8%KJ7J6j2j9
$$ y = [10, 17, -37, 19, 40, -20, -14, 17, -14, 30, 38, -20, -16, 30, -13, 8, 31, -7, 9, 28, -21, -29, 43, 1, -26, 36, -2, -36, 41, 19, -48, -1, 43, -18, -21, 14, -16, -16, 33, -15, -27, 6, 4, -17, -5, -2, 5, 6, -18, -3, -9, -15, 33, 18, -36, 1, 29, -38, -24, 57, -17, -37, 48, -8, -47, 51, 43, -44, 5, 58, -27, 17, 58, -30, -28, 65, 8, -24, 41, 20, -35, 13, 33, -22, 18, 25, -13, -2, 15, -1, 12, -7, -15, 9, 5, -13, 1, -11, -27, 15, 0, -48, 22, 15, -48, 2, 23, -21, 15, 32, -49, -34, 25, -12, -17, 35, -22, -18, 20, -19, -29, 47, 14, -35, 12, 12, -18, 40, 29, -44, 6, 38, -13, -1, 42, -19, -4, 39, -3, -12, 42, 8, -22, 18, 10, -10, 33, 11, -38, -10, 16, -3, 10, -5, -12, 14, -6, -11, 7, -11, -20, 2, -13, -30, 22, 8, -40, -7, 14, -20, 9, 26, -51, -30, 31, -14, -25, 35, -17, -39, 36, 7, -31, 38, 30, -51, -3, 45, -30, 4, 35, -24, 2, 39, 7, -2, 30, 10, -4, 14, 3, 0, 24, 12, -7, -9, 6, 5, 21, -1, 0, 15, 0, -13, 5, -4, -9, 25, 1, -32, 8, 7, -37, -8, 12, -38, 3, 18, -38, -22, 16, -9, -15, 6, -17, -24, 25, 1, -31, 27, 11, -32, 3, 2, -14, 26, 23, -22, -14, 20, -11, 0, 31, -2, -3, 18, 1, -14, 29, 22, -6, -6, -4, 13, 29, 17, -2]
5699bPOqOpNKnk0K0JlJ2j1k7L0%l1K4J9j8mK5n9J7N5m1j8K7ok8M2nm0O0Jo7L8
5737cJ3j3NL2n2J4K9k6j9L7Mk0J4rk1L2Rk8OJ3kj3NJJ2j7qOj0mM2k5k8L2Rm6L8
5774IK1m5J8J1m5J0N0l7j9M0j9oK5k3mL0Km1K2J4k6J0Qk2NK9k2jJ8j3J5Mk2pL0
5809A9Ok6J5j4JK2j3j6K1Pk9PlKK0nl0QJ3J1qLj7LRk6J7Ok7J7Rk1K0L2m7pK7l0
5847b4rM4j3j6L9j0o1M0K6m3K2L9n5nM1ql6M8%k0NnoJ6J1j0J1j2JJ0l9J3M1k6
5881Ij0J1kj9K2rm0N3Rm3RL1k8lM0m2pM3j8l6K7J5j6J9k4j4K3KploJ2K4j9l8L6
5917Amj0K5Rm0K6J7o6J7O3j8l2L8l0k8M9Ll1K4K5m5oJ0JJ4%rj2J2%J2k1jL1k1
5952Ck5L4om0L3K7m7ON3n6j0M5j4j9K9nn3M4K2n2PM0jk6J3kj1MOJkJ8J5l5k7M7
$$ y = [-2, 5, 11, 3, 9, 2, 7, 9, 4, -16, 4, 5, 2, 14, 3, -24, 6, 6, -25, -1, 18, 0, -4, 21, -38, -21, 34, -7, -25, 2, -4, -32, 10, 5, -35, 25, 26, -41, -3, 10, -3, 2, 34, -18, -4, 25, -1, -20, 17, 21, 1, 15, 6, -15, 17, 26, -2, 4, 17, 15, 2, 7, 8, 20, 3, -5, 1, -9, -13, 29, 4, -24, 8, 17, -29, 9, 30, -15, 3, 14, -31, -21, 29, -8, -27, 13, -6, -12, 13, -10, -14, 16, 18, -23, -1, 13, -13, -3, 5, -17, -12, 17, -5, -6, 12, -1, 14, 18, -4, -11, 19, 25, -1, 14, 0, 1, 23, 10, -6, 15, 22, -7, 0, -3, -1, 19, 14, -16, -8, 5, 16, 8, 11, -6, -3, 6, -20, -3, 3, -24, -7, 2, -19, 1, 33, -14, -21, 6, -24, -33, 11, -2, -18, 21, 11, -50, -10, 16, -27, -5, 34, -21, -26, 15, 7, -29, 19, 19, -1, 4, -1, -7, 9, 20, 10, 21, 9, 10, 20, -19, -6, 35, 9, -1, 10, 8, -11, 11, 2, -38, 15, 24, -19, -10, 21, -7, -10, 30, -12, -19, 24, 6, -30, -3, 12, -4, 15, -9, -23, 0, 2, -5, -8, -14, -2, 22, 3, -35, 1, -3, -13, 12, 21, -19, 7, 24, -42, -25, 38, 20, -12, 26, -4, -32, 17, 20, -11, 13, 38, -7, -13, -3, -2, 12, 12, 3, -9, 3, 3, 15, -6, -7, 24, 3, -22, 12, 6, -34, -1, 26, -21, -15, 38, -18, -28, 17, 3, -16, 13, 8, -45, -1, 21, -31, -24, 16, 15, -11, 2, 0, -11, -7, -1, 0, -2, 16, 31, -4, -31, 16]
5988A6Lk8K3J2m1J2L0k9j0O5k9n1L4J9m6L4K8o4NL9k5j1L9j0k1J7q%nJ2pj1KJ0
6022Dnl1K5J9k4LJ5j8j4N1k5m4N0Om0L4L4o4J9M0m3j1M5ll8L6Nk1jMj0J5LKj5
6057Cj1J6K3j2l0M2j7k0L4nn1L7K6o7K1N3k6k3K5j2l1M9J3o1J7L0m6KL3j5JKj
6090aj4QJ0olNK6j8l3M7k6j9M2Po3L1M6n3k3Q3k4m3N6k7m7N4M5q1J8M1m7nM7j6
6124A7k4L3j4k8K2K6l2j1J4OKk3L0rl5J8M0l9j2M7l4l1L5J4k7K8J4p4L7M9n1j7
6156b9L1j2j2L3j2rQOpRknqOrL6j2nJ8l5j3M9J5n2L6km5J5M0k4lL6n8j5O4j0k6
6193cQRl2K0J2nj2jQj2NJ9Kl7JK7k5LL6m1k6O1No4M4J8o0J7N4n4qP1n8k8M9K8
6229C1m7QJ2m4L3L5l4k2L9kj9J7Qj1Jj8K0kJK3k2k5OK5kpJ7k8pK6j0lK9j5k7J7
$$ y = [16, 19, -9, 14, 26, -15, -3, 27, -2, -12, 53, 24, -27, 7, 26, -20, 14, 42, -22, -17, 22, -3, -14, 25, 15, -6, 11, 3, 3, -2, 10, 3, -8, -6, 4, -1, -32, -7, 12, -12, -9, 6, -12, -26, 25, 0, -44, 6, 12, -28, 6, 40, -24, -5, 35, -8, -19, 26, 23, -15, 21, 26, 5, 4, 8, -2, 13, 16, 18, 3, -8, 8, 31, 19, -11, 31, 14, -6, 28, 23, -28, 9, 35, -32, -11, 42, 16, -7, 18, 6, -25, 24, 37, -24, -7, 23, -23, -21, 12, -3, -2, 0, -1, -15, -7, 3, -3, -6, -1, 25, 7, -26, 21, -5, -24, 18, 25, -38, -7, 39, -14, -37, 46, 22, -21, 35, 8, -39, 15, 60, -21, -3, 38, -9, -14, 33, 17, -7, 26, 12, -16, 6, 32, 0, -11, 3, 9, 11, -12, 18, 9, -26, -8, 32, -7, -19, 28, -6, -37, -2, 12, -15, 13, 27, -47, -10, 39, -12, -29, 2, -10, -22, 11, -1, -10, -2, 4, -3, 6, 4, -1, -9, -3, -12, 24, 12, 7, 25, -10, -23, 26, 41, -11, 25, 23, -22, -7, 33, 9, 6, 42, -16, -31, 33, 23, -3, 5, 14, -18, 2, 14, 9, -3, -4, 4, -8, -3, 16, 18, -19, -18, 9, -16, -13, 23, -18, -44, 17, 22, -42, 2, 20, -40, -23, 31, -23, -31, 40, -18, -46, 3, 31, -16, -8, 4, -40, -7, 28, -6, -28, 11, 9, -10, 7, 15, 4, 5, -13, 7, 5, 6, 29, 7, -18, -12, 13, 11, 4, 21, -7, -14, 12, 2, -1, 28, 13, -14, 3]
6265CLrMJl8K3RKJKj1J3j5%K0Ql4K2jk2L4J3p1J6N4k4k1M0j5n1O1J7n3J9L5m1
6301fjL8j0k0Qj2j3L2J6k8oRPk6K1J6j6k2L0l0mJ7M0n2%J6l0J0M1l7j8L4Pm5L0
6336dL2m8J3J4m0JM2j4k7M4Jl2OJ6j9MJ6j5j7K5J1JopJ4jj0J2Jj9J6J0j6pK2j1
6372HrJ9qj0J2j4qJ5J9j8Nj5j3K7j0j0J3Mk7J3OjK1j3n2K7K2j3J0K8m7rM5k4j7
6407b4M1j4m8L7K2k1K0J4n4J0N1j6k3K0pk2K6QqjonkJ6J7rl6OJ7pJ2K1m9qM7q
6443A7k5K5kn6L5L5m6J8K5o6j1O4kk2K2k7l4O2K4m4K4j7l4J9J9PJ0j1l6J4K3K
6475A2J1j8l9L4K4k2K7J8p4J6K6j8J2L7m1l2L8J6k5L0j5m7M3J4j2J6pn1K2K6k5
6506dM1j6n5J0M2j3NLm8j1N2j1j5M3l0m7O6ol4N4j1n6K7L1k2K5%n5J3M0qOMl0
$$ y = [3, 6, -3, 1, 2, -36, -13, -4, -2, -1, 1, -10, 3, -12, -12, 8, 16, -18, 4, 3, -19, 15, 28, -43, -27, 27, 3, -18, 22, 7, -44, 17, 34, -19, 0, 35, -6, -7, 31, 21, 1, 9, -3, -16, 16, 32, 4, -2, 7, 14, -12, 9, 25, 9, -13, 17, -13, -17, 0, 40, -12, -12, 4, -26, -16, 25, -12, -30, 4, 11, -34, -4, 28, -20, -7, 7, -33, -32, 10, -4, -31, 13, 14, -18, -12, 4, -15, -11, 5, -10, -27, -2, 9, 10, 4, -3, 11, 10, 0, 12, 13, -6, 10, 20, 4, -3, 19, 8, -1, 18, 10, 0, 12, -2, -10, 5, 24, 6, 11, -4, -17, 10, 0, -10, 3, 7, -20, -7, -1, -2, 19, 6, -46, -19, 3, -10, 0, 28, -19, -28, 17, -7, -24, 17, 3, -45, -8, 14, -7, 13, 27, -27, -17, 34, 18, -5, 15, 8, -14, 12, 20, 12, 11, 5, 0, -2, 14, 31, 22, -14, -8, 9, 2, 14, 35, -14, -22, 25, 17, -8, 17, 15, -41, -6, 29, -17, 1, 26, -40, -51, 13, 11, -11, 11, -16, -50, 12, 36, -8, 16, -1, -35, -16, 3, 10, 20, 9, -27, -13, 10, 12, 23, 5, -34, 0, 24, 2, 29, 47, -27, -11, 15, -3, 9, 46, 5, -27, 11, 27, 2, 32, 17, -30, 13, 27, 15, 31, 24, -27, -5, 21, -4, 37, 21, -34, -24, 18, 5, 10, 13, -35, -46, 6, -5, -20, 23, -7, -54, 12, 6, -28, 26, 15, -41, -14, 17, -5, 20, 20, -35, -22, 18, 10, 16, 20, -10]
6540a0%K0k9L3J8k8j6L1k4K6K2m6k9N6Nn0N9j7m3M4J1n4M1J4n8J8L8l0JK3m3j2
6572b9N3j2j6K3k1k8M1k1jM0m5k4M8j3j2N2l5l7M2J6m6N6ko6N0K0n6K1N0m5j6
6603a3N7n1kM5k0k3K5lk1K1%k4L6j6l2L4Qk5K8Nn4M1J2n0J2L4l4J2J3j8j2L9l7
6636a3rL0k0OL0k9m2P0l1j7K8k1qL7kk5K5Pm1K0J8k9K9Rn7L1K3k4K2J7m1j8N9
6669C4l8KM5l1l6L2j4J1L8k1m0PK0j1K5ll6J0J5k4K8K1m2pJ4j6J9K0j9m0M1j5
6701a1kL9m0kMKoK3ok5K4k1OK7jl2J5PLJ7km7QK6oK2L1m5k6M4k7MM6l0l9J9J1
6738A0PJ7j0m4JK3rJ9J5l2jqj1L5J0k3j0Pj1J7J2l9J1QrJ8J2k3pJ5k8J4M2k3l1
6773b6K4j1RK8j9k9K0oNL6j0m1J2J1k5K6L9n0j2J1nJ3N3m1k2JPKK8kk6j5KJ6J2
$$ y = [-10, -10, 10, -19, 14, 32, 4, -12, 19, -5, 21, 43, -3, -32, 24, 29, -21, 38, 21, -22, 22, 33, -21, 20, 34, -24, -6, 32, 2, 3, 26, -17, -29, 24, 12, -4, 19, -2, -30, 11, -10, -11, 29, -16, -40, 8, -5, -17, 35, 0, -37, 5, 21, -25, 31, 29, -37, 13, 33, -23, -2, 48, 3, -13, 44, -7, -9, 36, 16, -7, 18, 15, -6, 15, 15, -9, 27, 11, -21, 13, 21, -4, 24, 29, -25, 16, 28, -22, -10, 24, -10, 2, 15, -3, -15, 24, -13, -22, 8, -12, -6, 24, -5, -47, 23, -8, -25, 3, -18, -26, 11, 9, -16, 9, 16, -25, -5, 13, -16, 13, 22, -35, -4, 19, -5, 17, 34, -7, -25, 34, -4, -2, 43, 12, -24, 8, -6, 5, 43, 22, -18, -11, 9, -2, 23, 20, -16, -6, 9, -15, 13, 34, -8, -15, -1, -17, 2, 22, 3, -37, 4, -11, -13, 26, -14, -16, -12, -10, -16, 7, 1, -24, 0, -21, -15, 12, 11, -21, -6, 1, 4, 21, 19, -28, -20, 6, 0, 22, 53, 8, -18, 26, -1, 3, 49, 19, -20, -1, 10, 17, 34, 24, -20, -19, 4, -5, 14, 29, -3, -4, -12, -23, 12, 22, -1, -11, -4, -15, 2, 14, -25, -14, -6, -15, 3, 15, -8, -15, 0, -28, -14, 28, 5, -26, -2, -13, -4, 24, 5, -24, -4, -10, -5, 31, 21, -20, -8, 3, -22, 4, 43, -7, -19, -8, -13, 0, 53, 12, -10, -9, -2, 0, 28, 26, 0, -15, -13, 3, 15]
6808A5lRj7l3J2L7mj1Kk0k1L8Ol3K7Qm8K1M3n1JJ9j6j0N3k5l3L2rkL4Jm4QJ7j1
6844hKK7j0k5oJ6J0Pnlj1oL3K2l9jPl2J3L8onj6j6nL6kmj0j9j0L0J0k3J3mk8J3
6882a7K0j4QLl8L6K1l8J6Rl6K1K7k2k1K5Pk4M2km2J9J6k8J6K3k7lMrJ3K1j5j8
6916g%%J3J5j3Nlj8J1K0j7%J6l4j2M8j1k6L4rl3L0Jl9L0K5n0mL8j7pL4k6k2K5
6951cJk4J3K2j3Lj6KJ8O%pkj9J1J7k3K9Ol2pK7%J2kk5NJ1kjJ6j1k0L6j2k4RRq
6990BNPj1j4J7k2RK1Nj8qj0K5J5j3j6Ok9kN4j9j7Qj2k4L2M4m4nJ1l3J7M7k2k2
7025a6Mj3%L0J9k1kj5%J4J4lnk4K3K0l0NJ0k1NM0j7l0L2j9k3K9L7l1k3K0m2J6
7059a7O1k2m1K9l5nM1K0m3j5OjJ4L4k0j8k4kL1J9Lj4j9nK0K4k4PKk6J2K1Ok6K4
$$ y = [15, 12, 21, 4, -29, -17, 20, 16, 5, 7, -13, -34, 4, 10, -23, 4, 12, -36, -15, 28, -23, -22, -3, -19, -29, 24, -1, -34, -2, -11, -13, 21, 22, -22, -14, 3, -8, -6, 21, 11, -14, -20, -4, 6, 13, 8, 5, -6, -12, 21, 43, 4, 3, 10, -22, -9, 29, 23, 18, 2, -14, -19, 17, 15, 11, 1, -18, -28, 2, 12, -11, 2, -2, -30, -17, 3, -11, -3, 0, -38, -2, 19, -19, -3, 6, -30, -9, 18, -4, -25, 0, 7, -17, 25, 23, -19, 0, 16, -12, 4, 27, 0, -3, 1, -8, 5, 26, 11, -7, -7, -7, 6, 21, 8, 13, 10, -8, 3, 23, 6, 6, 22, -12, -24, 24, 13, -13, 21, 12, -21, 9, 10, -29, 1, 26, -24, -28, 10, -7, -14, 20, -6, -28, -3, -2, -26, -13, 9, -4, -1, -17, -15, 3, 9, 9, 2, 0, -19, -8, 9, -14, 15, 21, -11, -18, 9, 9, 21, 19, -6, -1, 10, 8, 7, 23, 12, -8, 28, 16, -8, 1, 10, 2, 7, 14, 3, -11, 6, -16, -7, 14, 19, 1, -7, -17, 8, 23, 10, -6, 0, -29, -31, 23, 4, -13, -5, -17, -41, -9, 35, -9, -14, -3, -36, -19, 28, 6, -16, -12, -25, -25, 5, 24, 3, 1, -14, -14, 0, 14, 11, 6, -18, 5, 25, -5, 0, 10, -11, -6, 34, 17, -13, 19, 0, -23, 6, 43, 12, -11, 9, -33, -17, 44, 22, -19, 10, -25, -30, 11, 31, -12, -27, -21, -22, -8, 26, 6, -12, -36, -38, -7, 12, 15, 1, -18, -23, -3, 21, -3, 4, 6, -20, -8, 13, 19, -7, 17]
7094A7k2j4K9K9k4j8J3pJ0J8k4jj6J2NPNJj8j4K1J7k0Opm2L4L2k0j9J0j2j7M1
7128A2J2l9OJ6n4L4M7k7j6Kj4QL1Ml6LJ8j3oL1Qk8j3K2nnJ5nj7LL7l5NK1j1j2
7164aL3Jk5LJ1l0JL3j4k5J7jjQQk1oK0joLJrPj5PPj3K1ok8K3Lj8J1J0k1KK3j8
7204fmK1ql2K6J7k6J6J4k6%K0omkK2j6j4OJ5mlJ8k7lK5lj7JK5l2NL0j5k2K5ql4
7242b6L8Lk7LJ9j2oJ3j4j3K6Nk1KPJrJQNj6J3Lj9J1J5rk1L2ol2M0Lj6rK1k2NL6
7281C2j5l0J6JrJ7%j2LM%%pJ8j4qLK7k4j2K7k6j0M4j3m2L3J1m2K7L8o4OM5k0l0
7317b6M8j0l8J8jJ%J8k2j1J2KKkQMj7J2Rj5kK5j5l2L9J2l1J0J9l1NN0l2k1L1q
7353A1l2L5K1l9J9Nk4K0j2oJ5nj2Nlj7K0J9k9KJ8k6K5Nk5jK8j6j7J5Kj0J6qj0
$$ y = [17, -5, -19, 10, 39, 15, -3, 10, 3, 13, 31, 7, 6, -10, 2, 7, 14, 19, 20, 2, -12, 9, 26, 6, 12, 5, -37, -3, 29, 9, -10, 0, -12, -29, 12, 24, -15, -9, 7, -47, -13, 34, 7, -9, -7, -21, -13, 18, 22, -14, -11, 7, -6, -12, 19, 27, -1, -14, 8, 3, -2, 13, 8, -9, -6, 31, -4, 1, 22, 11, -1, 32, 33, 8, 11, 22, -8, -7, 26, 12, -13, 4, 3, 2, 10, 18, -3, -9, 11, 10, 4, 7, 8, -1, 6, -9, -2, 5, -8, 13, 7, -21, 2, 5, -13, -2, 8, -13, -11, 12, -6, -10, 11, 3, -29, -3, 14, -12, 4, 18, -8, -8, 12, 6, 2, 0, 22, 6, -8, -2, 13, 9, 6, 24, -3, -6, 19, 16, -1, 0, 25, -7, -2, 28, 13, -9, 16, 8, -26, 12, 15, -12, -9, 10, -2, -8, 5, -9, -22, 4, 9, -12, -10, -3, -2, -11, -10, -2, 3, -13, 0, 3, -16, -5, 10, 1, -20, 12, 6, -26, 14, 17, 1, -8, 13, -9, -4, 32, 17, -13, 3, 4, -5, 12, 12, 0, 3, 7, 7, 7, 0, 18, 4, -4, -1, 26, 2, -10, 17, -9, -19, 25, 12, -30, 3, 14, -28, -1, 37, -27, -21, 24, 4, -26, 22, 12, -26, -8, -9, -8, -8, 10, -12, -23, -11, -9, -7, -9, -1, 3, -14, -2, 7, -8, -10, 15, 0, -32, 7, 19, -12, -2, 17, -14, -9, 41, 9, -12, 19, 11, -21, 14, 35, -4, 15, 20, -4, 16, 4, -2, 13, 8, -4, 1, -2, -19, 1, 20, -9, -7, 11, -15, 10, 15, -10, -11, 17, 1, -16, -1, 1, -9, 7, -1, -11]
7388a1K0J4k1nmK1kqjpJ6j6L4k5pK0nl0M1J0m2OK6k9OM3l8k2L1J0l4K2J1l7NJ8
7424A0j0KJ8k2o%kJ5%j1J1lj3K3lk3J4Kj1LK1l3lK6j2j2M2j5l8L3pqK8mk5OK4
7461A7pNJ6k9KmmL3Jk9qK2j4J3K5n1oL9j3j3L5mk9J0Nk5K3Nl0QOqJ6lk2J6%KJ9
7500A9k6rJ2oj8L4J6n5K1J5k0NL0k1l2L8Qk3K4Lm1J3K8j4mK4j0j9KQJ2mjmj5J4
7536DJ2rj8J2J2l2K1J6j7jK1k6oL0j6k4K0mj3J7Ol6QL3j1oJ3pmnLMj%Rj4mOJ4
7575Gj2kK1j2j4K9j1j5J5LpjK5k0j4L1pmmQroMJ6j2rJ7rj4J1Nk6J0K5j7JJ3k5
7613ij5K9Oj7ONj9lK7k5QPJl1K4Mk1J6JQj7J2jNj0J1KmlJ0lRJ1k9nPJ4k0kK7o
7654A0JJ1k1QNJ3k8J3nnRj0j2K0j0KKqJ2Pj8rK6j9oO%oJJ3j1lR%qJ0jj1J6%k0
$$ y = [-11, 9, 23, 2, -3, -7, 14, 12, 4, 3, -4, 12, -4, 30, 5, -2, 18, 13, -17, 24, 34, -8, -2, 24, -5, 1, 44, 6, -16, 15, 25, -9, 13, 24, -13, -8, 10, 0, 2, 20, -2, -8, -8, -10, 5, 5, -6, 5, 2, -11, 12, 9, -14, 0, 2, -9, -6, 15, -18, -21, 5, -7, -19, 23, 8, -30, 3, -4, -12, 16, 12, -13, -7, 17, 10, 15, 31, 2, 4, 0, -4, 29, 30, 1, -7, 15, 1, 14, 39, -12, -18, 21, 8, -5, 30, 26, -3, 7, 12, -13, 10, 15, -15, -7, -1, -9, 7, 4, -18, -2, -2, 0, 19, -7, -16, -4, -10, -28, 6, 22, -33, -12, 3, -17, -12, 18, -3, -35, 3, 11, -12, 12, 15, -26, -13, 15, 1, -3, 21, 11, -8, -6, 2, 14, 10, 9, 5, -10, 4, 16, 7, -11, 1, 13, -19, 2, 18, 1, 0, 21, -5, -11, 19, 3, -21, -1, -5, -18, -1, 5, -31, -23, 10, -1, -7, 6, -1, -5, -10, -7, -3, -4, -4, 5, -9, -13, -7, 7, -5, -7, 14, 2, -12, 17, 6, -9, 6, 9, 2, 1, 26, 6, -8, 23, 16, 12, 8, 16, 7, 1, 5, 21, 9, 0, 17, 8, -6, 5, 10, -16, -6, 19, 2, 3, 16, -9, -24, 5, 11, -6, 0, 5, -14, -17, 10, -15, -7, 0, 1, -30, -6, -2, -23, -7, -6, 2, -15, -3, -4, 1, -9, 2, 4, 0, -3, 7, 4, 13, 24, -5, -10, -3, 11, -9, -11, 16, 10, 11, 22, 1, 9, 14, 27, -1, 12, 7, 2, 11, 1, -11, 9, -1, 1, 3, -5, 7, 14, -4, -13, 13, -6, -12, -6, -6, -12, -11, 2, -9, -12, -3, -3, -11, -1, -2, -13, 3, 3, -17]
7695a7J5J8k8lK5j5%J0j0mJ4nnkLJ2Kk3K5Knj1lJ0jJ4k6LK7j5oJ5rj1K6lm4K8
7733CJ1j9qJ8Jk6L4k4LJ1j6mK5k2nM2l5j1K2J1j8J5J4m2K6Pk4QJ2j3KRk6J9J4
7768A4j8JRj0J6%j9J7J4k7%K5j5j8L9l1j5M6j9k9L2Kk2L3qm4J4L5n1K8K2l5lL2
7802A5k7pL9l3j0J6Jj6K4j1k6L6qj7K8lk0J3Jk1K7K4m2J6J7l0PJ6l0QK5k1OK9
7836B6l2%K7k4j0L9j5k9L8j3j3L2k2l7N1Jk8K3Km1L0J2k9pL1k6j0K8k0oL9k9k5
7869c7L7mmJ1j2k3L6Qk1J9j3j7K4Mk7M0mm7L7K0k4kK5m3J4J9j6jK4k9KL0j2k4
7903a0K3Jl0K6nj9K5rj3J4J8l1J6Ll0J6K4l6OK9l1PK5k1j1J9k6pL2qk0L4j9j4
7937b2K8Ol1J7Pl9K2J6k2J6J4l1OL8k4nPk6J1L0ok4L2j3j6L9k5pK3j8pK0jk3M
$$ y = [-17, -2, 16, -12, -15, 10, -5, -5, 5, -5, -9, 5, 0, -5, -7, -4, 8, 10, -13, 12, 14, 9, -2, -5, 5, 4, 18, -8, -5, 22, 7, 1, 16, 7, -4, 22, 19, -25, 3, 14, -5, -13, 5, 6, -20, 14, -10, -7, 4, -12, -16, 9, -13, -18, 24, -11, -22, 0, 11, -7, 8, 22, -20, 6, 13, -11, -3, 9, -4, -2, 7, -19, 0, 14, -4, -3, 6, -4, 12, 12, -7, 10, 24, -3, -3, 22, 7, -11, 28, -3, -18, 28, 9, -20, 12, 14, -8, 25, 17, -27, -13, 22, -29, -1, 21, -14, -17, 15, -12, -19, 20, -13, -23, -7, -6, -22, 2, -9, -35, 1, -7, -24, 4, 1, -19, -6, -5, -26, 1, 25, -17, -1, 16, -14, -7, 9, -21, -13, 12, -9, -3, 26, -6, -6, 21, -3, -13, 26, 11, -18, 20, 7, -6, 26, 4, -33, 18, 19, -9, 14, 16, -25, 5, 17, -12, -19, 12, -14, -24, 4, -16, -22, 17, -12, -37, 0, -4, -8, 3, -9, -32, 4, 12, -9, 10, -3, -20, 4, 8, -19, 21, 17, -30, 7, 27, 3, 1, 26, -17, -3, 16, 0, -1, 23, -6, -4, 26, 14, -10, 13, 14, -16, 10, 5, -14, 11, 2, -11, 3, 21, -10, 6, 9, -21, -5, 19, -17, -11, 18, -13, -6, 19, -2, -13, 6, -20, -27, 5, -3, -23, 11, -8, -22, 6, 12, -19, -2, 5, -34, -12, 4, -18, -2, 12, -19, -13, 25, 1, -4, 3, -23, -12, 18, 12, -12, 20, 7, -9, 30, 5, -2, 21, 3, -4, 16, 15, -8, -4]
7972dK3l2J5J7k5J0Jk4J4K0l7PK2j0j0L6j8k5K9k0kJ6mk4L2kj1J8j2noJ7k7K5
8006DJ4l8J6Nj1OK4j9nJ4j1mK4j6j5K4j5%J0Rj2RrqKJ4j4RMj5J3Rj1j0Rj5nJ8
8044Dj0pOOj7K1lk1K4lmJNj0MJ7j6mJ9j7j5J3l%K9j5lnKJ2LrpMRmRj4MPkj9K6
8087A7Pj4%Kj5KJ7pJPpoJmNQj3JQllmlMQj5j4J5mJRrOoQj5pK8nj5MRlMJ1k6K0
8134EMqoNJ5k5PO%j5J4J5j4rJ3oMjjJQnnjJ8j4j3PMnQLon%j0MJ2nj1JnRMJ5oj9
8181a3PQlJoj%J3oJ
$$ y = [-4, 19, -13, 2, 19, -6, 4, 5, -19, -5, 15, -22, -15, 7, -3, -13, 23, 5, -20, 9, -11, -13, 3, -1, -25, 7, 5, -6, 12, 0, -5, -11, 6, -21, 4, 18, -20, -4, 1, -10, -4, 20, 1, -4, 10, -1, -5, 19, 3, -12, 12, -3, -3, 7, 16, 4, 13, 4, -4, -2, 12, -2, 7, 11, -4, 9, 18, 7, -3, 6, -9, -14, 4, -6, -13, -7, -1, -18, 3, 0, -21, 3, 0, -4, -3, 2, -8, -4, 13, -3, -7, 12, -5, -20, -7, -10, -10, 19, 4, 1, -4, -2, 10, 13, 4, -3, 1, 10, 6, 15, 1, 5, 12, 10, -9, 17, 24, 10, 10, 12, -3, -1, 16, 9, 10, 17, 10, 4, 5, 1, 6, 14, 1, 2, 10, 7, 4, 0, -3, 1, 9, -6, -20, -5, -9, -8, 1, -8, -2, -8, 0, -15, -22, 6, 1, -14, -10, -1, -4, 0, 11, -15, 5, 9, 1, -5, 0, 15, -10, -3, 3, 3, -12, 2, 17, 3, -6, 7, 1, 5, 4, 3, 4, 12, 7, 2, 1, 19, 5, -8, -1, 3, -2, 6, 9, 3, -2, -2, -12, -8, 4, -1, -12, -11, -16, -7, -3, 12, 6, -13, -6, 2, -1, 0, -6, -7, -7, 6, 0, 1]
8191A
$$ Imaginary data points
##PAGE= N=2
##DATA TABLE= (X++(I..I)), XYDATA
0@%%%%%%%%%%qJ6j6J6j6J7k5L2l3M1m9N7p0P9q9J04j20J37j54J72j96K22k47K75
34A45l08L46l86M29m77N30n87O49p18P95q81R77j083J202j341J502j687J908k176
53a161K504k925L485m264N433p411J1579l3746M1522L3532r1900N0861L7525q1372
67c6338J922P3913m0080j9197M5990k1108l3613L4075J471j4554J7512n920j6414
80a2341J7987l862j1752J7592j528j7539J3950N253j3094L430M019l164L181n175
94c043L012R689j8209k695K9282j5616k1693L3199m604l7443L3817K1981m4266
107a6589P549K8965l4782j196L9639j8895j5723K1779j8255j0275L1810q741j2289
120g003K5320k1810k5520M1517J415l4591L3870J0022n2387J7560L7926l7196
$$ y = [0, 0, 0, 0, 0, 0, 0, 0, 0, 0, 0, -8, 8, -8, 8, -8, 9, -16, 16, -17, 24, -25, 32, -38, 41, -48, 56, -64, 73, -81, 91, -105, 117, -130, 145, -163, 183, -203, 226, -251, 279, -308, 341, -377, 418, -463, 514, -569, 633, -708, 794, -893, 1015, -1161, 1343, -1582, 1903, -2361, 3072, -4339, 7240, -26506, 15016, 48548, -43352, 7509, 45034, -36338, -34416, 39497, -583, -19780, 26210, 5102, -28511, 5564, 7035, -7519, 9993, 4073, -12341, 5646, 1784, -9968, 7624, 6096, -11443, 2507, 7760, -5334, -1904, 2115, -1049, 2132, -3043, -31, 9658, -8551, -11246, 18036, 2420, -19273, 13926, 9322, -28121, 5696, 27677, -16589, -9040, 19925, -14857, -16053, 23586, 4691, -11032, 10747, -7508, -17783, 14027, 5286, -7003, 18317, -3493, -29013, 12504, 13919, -20672, 13198, 23220, -29167, -11607, 26319, -10877]
132a0877k888M0840k6004k5545L3411L78k3388J7131Q392j7074K123O499m337
145a339J37j63L095M463r833j156J0690r335k992J7162q404j1896J5658n555j3294
160a2762K1874R45k2637J5550N592k5836J7167K0628k9865L13K5489k4517q867
173a6926L4640j0100k3075K2780k72k4095J7508J3496j8906K447R045j2249J202
186d505R160n177J716K542q175L583L802q517O309P311j2263J144R548j0889j370
201e781J2989o517m646R933o745p159J1023o86n429Q521l662r550Q294J723o260
216c952Q453P39j1041M274L160o396P657M009j1075K615M404r207O035R197j2155
231c283m21J0678j1043l369J5808n882j0103J2509j083j2645R745N851j1596L118
$$ y = [-10877, -13765, 27075, 1071, -24474, 8937, 9315, -14073, 3058, 11450, -5624, -3501, 2998, -1339, -1202, -1365, 1730, 6193, -3640, -4796, 5894, -3441, -6433, 10729, 2325, -9571, 6087, 532, -12762, 9112, 10057, -12580, 2970, 8562, -17274, -107, 20521, -9344, -9031, 16458, -8059, -16926, 17714, 7614, -15461, 7319, 7047, -17048, 460, 13956, -4950, -2503, 6542, -5707, -4505, 4655, -522, 1194, 3736, -4439, -856, 2946, -5571, 738, 8049, -4214, -3070, 6478, -4411, -5781, 7208, 691, -3955, 5978, -767, -7926, 3097, 2411, -3018, 5503, 1841, -7709, 585, 2308, -3952, 4501, 5240, -5801, -1527, 1633, -4763, 2894, 6903, -4172, -1557, 2847, -6360, -325, 8872, -3283, -3704, 6974, -4069, -7438, 8370, 2488, -7615, 4894, 3811, -8834, 911, 6762, -4834, -1716]
245a716P748p816j721N994l058j358M251r46j761l46j449K268J461k102K603r8
261A954o368K437M783l837K103L927q321j867Q076k828j740P627n062p747P586
276G23J359n917P182K397j0534J361O249m810J291O220n604m030M760o58j487
291a498L806r14k650J369j027m50L137j192j775K573j323k232L466k11l507K850
307D22J956l327L91J417k422N85K727q23q19l0j464K30J401L71J299n98l480K37
325a927K123m08J712J513m179j702K989n83Q2L779j976m260J952P45j470L732
341B122J283n027n15K491j524J054L262k609k657J992j41r13K613M21k618j82
357i48O31l27J194P14j374n40L65M7O13J24q83J14M64l01K92K84p94k97M74L13
$$ y = [-1716, 6032, -1784, -3505, 2489, -569, -1927, 2324, 1378, -383, -729, -2178, 90, 1551, -551, 2052, 1954, -4414, -1977, 2806, -1031, 1072, 4999, -3322, -5189, 2887, 59, -1681, 5946, 884, -6863, 723, 2082, -3835, 3347, 5744, -4790, -3429, 2820, -1990, -699, 5521, -83, -4113, 647, -11, -1498, 2308, 1394, -1256, 113, -914, -1364, 1773, 581, -1194, 1379, 56, -2176, 1290, 1079, -2428, 422, 2378, -949, -558, 859, -1563, -978, 1749, 926, 107, 77, -1387, -1157, 244, 615, 1914, 1316, -2164, -1927, 196, -212, 1500, 3013, -1166, -2868, 121, -462, -380, 3399, 1423, -2837, -885, -140, -1610, 2122, 3405, -1622, -2137, 354, -1170, -116, 3146, 537, -2120, -128, -269, -1182, 1431, 1852, -766, -948, -317, -644, 550, 1264, -110, -650, -285, -238, 375, 499, -384, -270, 194, -107, 185, 469, -325, -622, -148, 165]
377A65N49M5j104o95J99Q38J425o3j898o02L82lJ543J393j874j540O14n08N00
396f34K907l63l046r3N54m89K251J654k864j668J405j92J16K339l54k690m7R67
414b47j85J040J206j638j914Q72J399m1jJ27j282p48J680R62j293j16N68j340
432i51mK331k59j902M41P7q12J837J272k326j142J112J7M63J450r34j830J70O19
451c71N04J023m5j318r87r7J305J512m90j207m82o28O03K079j19j673R2j49p63
470a211J520J325j397q12K67n64O33J554o01j286r3J79O49O48n52m86k6m07O77
489A7R81r19m81O14q90j0K044n43j842Q33J43q36J838O04k551KJ480r28M17J563
509A536j576j206J344j47l34J515l62j748L16N87J19Q54l40j240J84K67J45R92
$$ y = [165, 714, 759, -345, -1040, -841, -3, 1422, 1359, -539, -1141, -759, -762, 781, 2174, 300, -1240, -626, -1134, -634, 2273, 1910, -1136, -1229, -675, -1164, 1087, 2741, -123, -1791, -386, -578, -462, 1877, 1523, -1167, -1214, -247, -432, 608, 1814, 176, -1738, -866, 533, 492, 491, 618, -664, -1412, 268, 1230, -63, -179, 389, -951, -955, 1376, 1117, -785, -344, -267, -1079, 758, 2030, -296, -1438, -326, -309, 154, 1604, 670, -1160, -990, -371, 133, 1156, 1111, -207, -1194, -1291, 14, 1526, 1036, -171, -653, -1281, -678, 1401, 1282, -391, -299, -448, -1211, 309, 1634, 237, -575, -308, -872, -239, 1315, 714, -572, -665, -486, 163, 811, 259, -227, -253, -660, 17, 998, 79, -402, 212, -678, -688, 1356, 813, -1029, -196, -53, -889, 949, 1553, -998, -996, 484, -444, -27, 1536, -40, -1246, 98, -49, -383, 1132, 770, -978, -662, -75, 44, 898, 558, -682, -498, -231, -86, 906]
527I06m59j183P33M7q94J376O05j842K75R78j292O05J546j822p69J989n00r30
545f31J406p50j414J833N57j537P48L04j693P29J381q47R0M11j476k4J514j44
563D57k02R5j188J90J439n67l87P20j160m20J916k16j118R66o37j528J712J362
581A434j175o9k33j471J016J605o93q1L5j548N52J464j075J23J346j769p62K389
599A088n34j693J501r3j516J956J010k351l49Q09n65J081J232j330n97%j099J173
617b77J899j205n14O73j869j59L001m84k055J165K5j305J668P47j999n1P49m91
635d82J060P85j534l82M9r65J701K130j887j389Q56j050j26K718K9k074L03K30
653b8q11O58P57j67k32p93K57J454j073j233J736m53j626L005R41m241K46K862
$$ y = [906, 447, -736, -3, 44, -850, 526, 1131, -711, -436, 542, -750, -145, 1401, -421, -1190, 799, 299, -631, 775, 25, -1389, 444, 1001, -536, 212, 516, -1177, -448, 933, 86, 176, 587, -889, -913, 601, 457, 255, 350, -838, -648, 791, 224, -163, 557, -603, -1023, 893, 677, -441, 525, -112, -1640, 72, 1434, 259, 190, -43, -1514, -498, 1107, 414, 333, 368, -1180, -628, 836, -239, -116, 1230, -539, -1301, 1088, 554, -1139, 362, 269, -1247, 709, 1719, -632, -981, -172, -737, 344, 1576, 246, -351, -351, -1450, -277, 1622, 417, -97, 576, -1293, -1452, 1549, 1065, -990, 175, 200, -1105, 563, 1310, -689, -740, 9, -482, 578, 1363, -171, -553, -504, -1469, 232, 2362, 475, -914, -58, -1108, -1234, 1484, 1513, -561, -258, -28, -839, -181, 576, 409, 177, -616, -359, 1095, 22, -1211, 525, 72, -1554, 1451, 2392, -1849, -1603, 1259]
671A259k203o1L818j777l249K025M01j647K277J171k457l56N95n22J231M95j614
688f14M68O28j300R81J188k082l36J726p55j89J526q42j376K99J19J046R85j627
706a55l66J049j827J75L354j608k529K991p1l512K546K376l535j34K821j643j019
723a087K032o21j385P85N85M82k78j575Q70J030k181R57K911k791j775L392j068
740B83k587L636Q20l975J112K074k247M27J828j707k35J197j182L93J177j619
756f05K32J486j919p8K485j457j513J986k15j223J242p1p71P00n77L2J320j751
774f97l22L003k058k430M281j32m681L340K578n176R97M537m045j840M826j171
790A010l257K822P20k460R79Q28r64M11r8j80Q71j184m21K291j104j884K563M4
$$ y = [1259, -944, -1005, 2813, 1036, -2213, -188, 213, -1434, 843, 2014, -443, -799, -204, -726, 505, 1000, -614, -146, 482, -818, 163, 1351, -731, -1067, 659, -96, -285, 1241, 399, -977, -678, -559, 487, 1472, -155, -521, 528, -1299, -1124, 2230, 622, -1907, 1084, 1013, -2499, 47, 2423, -1112, -1246, 1575, -68, -1087, 945, 324, -1061, -276, 309, 791, 513, -1062, -192, 838, -1343, -386, 2525, -266, -2041, 1351, 283, -2304, 1332, 2152, -1823, -711, 1363, -884, -457, 1371, -336, -571, 626, -556, -163, 1014, -605, -373, 1113, -806, -884, 1601, 144, -1369, 617, 402, -821, 421, 350, -421, 279, -298, -266, 1054, -697, -1019, 1984, -74, -2504, 1777, 1645, -3036, 304, 2882, -2294, -1297, 3240, -805, -2645, 2181, 1010, -2247, 575, 1295, -1165, -186, 642, -322, 89, -9, -189, 682, -502, -923, 1368, 264, -1620, 943, 987]
808I87k642J856J038k415J219J245k384P16J476j971Q93J423k776P01K594k957
824i97m02L683k331k149L718p50k855L058N74l318J419J552j875P27O72j471R56
841B11J64j625J927N13k768J829J493l741J180L500l543j012M094j966k442L441
857A255m40k775K550Q08k430J066N88j620J039M45j107J445m9k120J305O53j814
874a201J694J083k660O94J558k314N20K091k038J80K085k581m71L006k041j225
890a620L576j342k600L274m13l550L018J835l499J066K105l057p9K573j524m46
906f83J990j152r41J024p04J15J282j232o2J502j549n68J932j267q44K580q36
923E87j940K142k00k279J933P90k072J568R27k767O24J714j930M66K086j791n43
$$ y = [987, -1655, 201, 1239, -1176, 43, 1288, -1096, -380, 1096, -875, 18, 1441, -1335, -634, 1960, -997, -1399, 2284, -47, -2196, 1522, 772, -2083, 975, 1549, -1769, -350, 1202, -673, 54, 726, -745, 211, 375, -1250, 677, 1190, -1578, 251, 1744, -1997, -817, 2683, -860, -1872, 2222, 256, -2186, 1255, 815, -1960, 590, 1398, -1032, 34, 622, -998, 41, 486, -621, 824, 775, -1345, -40, 613, -1201, 493, 1576, -1084, -390, 1168, -1146, -626, 1465, -573, -393, 1692, -889, -1360, 1646, -395, -1620, 1956, 614, -1986, 1288, 875, -2675, 343, 2178, -1321, -255, 1850, -1207, -1286, 1287, -237, -683, 1307, 155, -786, 238, -466, -351, 931, -301, -363, 1139, -410, -978, 954, -313, -1157, 1423, 587, -1353, 789, 589, -1690, 243, 1033, -1039, 529, 1456, -1311, -687, 1027, -903, -437, 1649, -142, -685]
940f85J714j607q79K246k05q98J273q02j342J190p4n15J583k30j326Q56o15j177
958a493K085N88j861J100N28k367P56J737j684L05J981j821j128J831n63r59J729
975G64r4j328R38P3j231O97O81n78K89J6o55M40J70m76M75k5n82P43O9j015Q27
996A98M27j490N01J221j096J21J219j576q39J891j72r92J391n7j775O19P75r07
1014e41O24J111j122p88O19o5q9O36N5l84j24j15k0%J23N52l2p97J54L58n84K51
1036a78Q74o48l66P94o01q27J227M85j039K80L72j019K06J148n21n23O80k72p88
1055g16N95O46l28j81N2l66j60N54M63l54m69K08P4m20L37P18n00m79M71k78m90
1076f23R62M34j106J2P25o64k28R75k11o60O23Q0r25L09Q37m17l66M48j08n23
$$ y = [-685, 1029, -578, -1457, 789, 584, -314, 959, 157, -1185, 5, -69, -584, 999, 769, -557, 299, -316, -1493, 592, 1180, -681, 419, 947, -1420, -664, 1073, -611, -306, 1675, -146, -1274, 557, -6, -965, 764, 670, -658, 280, 353, -878, -181, 500, -78, 211, 227, -428, 12, 182, -294, 181, 156, -426, 317, 386, -629, 198, 625, -865, -364, 857, -239, -118, 1101, -475, -1314, 577, 405, -587, 804, 747, -1028, -409, 366, -541, 83, 1194, 72, -716, -97, -162, -251, 385, 440, 56, -68, -183, -203, -203, -80, 472, 440, -357, -203, 155, -429, -178, 696, 48, -318, 476, -125, -952, 275, 760, -279, 1, 373, -646, -440, 708, 187, -336, 344, 72, -716, -121, 525, 197, 16, 68, -298, -458, 96, 559, 205, -264, -56, 18, -402, -65, 653, 153, -326, 145, -133, -623, 339, 773, -333, -321, 404, -260, -488, 487, 276, -384, 239, 319, -606, -297, 540, 123, -243, 205, 97, -426]
1096d26L18M14l22q6N16l10q13M90P75n32j50O13o38o74J084K44r34O26N67j370
1116f08j51J285l33m75R09l85j179Q13P37q05P1P36o08o30N93K76l72K32L58n92
1136a28m81O89L75o73P3O78o29n09Q97p3p61Q79L41j311K17R85p16k29R65m60
1156A29o38O96p7n78N97L44n04j05j8l6L29k1r1K35m05k59O13k12l49R20j26j214
1178g70O23O03q77M69P73j216j67J107o50m60J134j75q67M94P8n02N24L22m72
1197b9j12M2Q0J12k95K39M90p38k17Q82o33m33J473m84j482J440M13j860J054
1216e8J301j955J73J738j716o21K268p06j480J573m8j509J202N65j284N63O02
1233F08j072J16O04l24K76J00o84L32J67n11O77J61r62O49L37j300O77J077j302
$$ y = [-426, -108, 306, -16, -102, 414, 104, -709, -219, 556, 24, -126, 487, -151, -825, 259, 503, -431, 195, 762, -608, -759, 526, 193, -282, 627, 242, -937, -124, 613, -192, -121, 615, 7, -623, -30, 246, -126, 106, 464, -128, -609, 80, 455, -218, -145, 533, -96, -605, 292, 219, -542, 337, 678, -633, -416, 569, -147, -376, 589, 129, -509, 187, 110, -468, 129, 473, -31, -136, -154, -190, 139, 118, 27, 262, -143, -402, 211, -1, -350, 570, 444, -770, -147, 456, -421, 48, 821, -395, -562, 545, -105, -565, 569, 394, -473, 21, 99, -403, 121, 443, -29, -141, -99, -19, 93, -202, 37, 527, -211, -428, 454, -179, -612, 861, 377, -1105, 335, 748, -1112, -58, 1243, -712, -539, 1199, -517, -1138, 1130, 424, -1056, 517, 469, -1040, 162, 727, -557, 6, 608, -464, -348, 256, -68, 208, 308, -376, -44, 123, -388, 289, 450, -512, 137, 474, -826, -149, 928, -374]
1252c74J31J019j410%J625j097o07J608q57j003J563m29j021J653l06j582J386
1269B99J94j464J406L72j861J216P94k149R57J581k098K88J795k136k58K544j510
1286c0j231K437q24j857K120J12j905J616O08k091P28J092j243L90P71j059J70
1303a96M99p00M72L27p78P26kj406J242P88j872R02J220k360N39K211k327l47
1321a062K900k007j582L106r63k177L061j98l130K454J051l164J652J843k998
1336a214O48K192k640l0K740j894r25K341j348j156K291p05j402J964l94j643
1352a175J541M0j279J494L8j659J139L95j353J082M43j407Q82L78j536J036P80
1369H39j513Q54N97j942J079J352k252O63J917k551l3K707k315q29L452j852k320
$$ y = [-374, -243, 776, -634, -634, 991, -106, -713, 895, 38, -965, 598, 169, -852, 801, 495, -1087, 299, 493, -971, 435, 807, -1054, 162, 956, -1193, -236, 1345, -753, -465, 1330, -806, -1064, 1480, -30, -1261, 1176, 352, -1505, 615, 727, -1178, 438, 1046, -1045, -317, 775, -468, -78, 693, -366, -196, 303, -397, 75, 402, -376, 350, 348, -1058, 184, 972, -900, 2, 1222, -1138, -599, 1612, -715, -1062, 1838, -169, -1751, 1355, 392, -1785, 1276, 1078, -2052, 402, 1453, -1711, -59, 1784, -1214, -566, 1626, -1014, -1044, 1696, -198, -1123, 1218, -130, -1286, 1005, 300, -1102, 862, 468, -1175, 366, 406, -873, 621, 659, -1000, 139, 534, -819, 263, 706, -701, 181, 559, -977, 59, 839, -674, 180, 777, -1165, -86, 1266, -986, -323, 1594, -957, -990, 1717, -598, -1427, 2025, 173, -2147]
1386b147L496m88l041L096O67l651K150J884l660R43K831k922k87K902k146j116
1402a489K910j117j773K319k08j825J549K73j475J017L86j167N56L35n02N64l65
1419a2n89J064m28p90J596l72j611J720N0k242J926J329k763P96J814k727K12
1436a027K801k121q02K891j691j890K801n04j989K672Qk819J941Q83k791J421
1452b16J875k496M12J987k419m48K507j178r86K056o72j455J378j49j143J290
1468C43L31j017N21Rp38O04rm84Q88k5p52O27l70q59J239J53j040J221J37j838
1488a059Q97P20j707J249J649k341j58J966j995o71K853r54j597K386n00k681
1504a943J883J131k097J139J489k195j74J516j378k89J927m36q97P51n85p56R44
$$ y = [-2147, 1349, 861, -2180, 916, 1583, -2068, 82, 1966, -1694, -751, 2080, -842, -1129, 1773, -373, -1489, 1421, 304, -1469, 850, 642, -1183, 366, 639, -836, 181, 567, -600, -44, 291, -211, 353, -12, -601, 463, 35, -755, 841, 469, -1142, 578, 628, -1614, 312, 1641, -1122, -326, 1488, -1239, -1027, 1774, -347, -1149, 1742, 51, -1839, 962, 458, -1531, 1141, 1149, -1670, 271, 1154, -1637, -216, 1659, -837, -425, 1562, -857, -1305, 1202, 24, -962, 1094, 422, -1033, 345, 196, -947, 343, 674, -343, 178, 187, -551, 53, 44, -440, 448, 423, -329, 298, -72, -931, 308, 461, -579, 642, 779, -1059, -162, 558, -1149, 100, 1749, -592, -750, 1216, -779, -1450, 1403, 449, -1148, 1238, 738, -1943, -60, 1071, -1026, 113, 1602, -593, -767, 749, -629, -918, 1009, 573, -324, 427, -158, -914, 30]
1521C0K04l26O24j69o65J39k03l0P97q7l44M09m59n28P12k10m00J164Mj150N50
1542F2J46j168Q45R30j078L47Q83j497m24J339m94k26J342o42j118R59j95r54
1560i43J213M83j001N54J49j355M59R61p94K37R61r60n06P14n44k32J232n4p87
1579b13L27j24o10M96L85k53K83K8n36o6R7M0L95o3k60K87j60m76M10P8m06O72
1601C31K37r86K37N84q54P9J007o08l48R35o14q47J080J72q44O57L22r84L05N25
1621C86p84J32Q41m86l22M85l53k44N07j22j85M43j42l72J72p6m0M57j30l34K66
1642I9j16k96M16J7l15M26k1o33L27L88m85J83L33n59O6M93m60j48N94k35k73
1663a99L64k06k02M81j26l28L55p1l12L72n4l55N18M7o79L21L53n31K49M38o74
$$ y = [30, 234, -92, 532, 363, -302, -163, -366, -396, 401, 314, -30, 379, -80, -608, 104, -106, -506, 658, 662, -488, 62, 208, -960, -115, 815, -263, 84, 967, -530, -954, 385, -109, -335, 1007, 365, -753, 206, 11, -943, 270, 753, -248, 306, 455, -900, -441, 520, -274, -37, 924, -36, -542, 172, -372, -604, 628, 574, -213, 114, -10, -620, -124, 261, 8, 291, 319, -217, -283, -186, -146, 249, 186, -74, 213, 53, -423, -13, 65, -341, 331, 568, -418, -181, 403, -451, -372, 635, 27, -321, 614, 0, -847, 233, 405, -439, 218, 540, -444, -139, 386, -398, -266, 575, 89, -233, 252, -101, -345, 162, 40, -145, 298, 156, -216, -44, -120, -160, 297, 167, -167, 99, -17, -313, 103, 120, -195, 231, 210, -423, -96, 292, -193, -10, 323, -236, -170, 323, -137, -285, 309, 74, -199, 165, -41, -243, 238, 112, -216, 139, 68, -244, 128, 74, -281, 237, 284, -395, -74, 279, -252, -3, 435, -239]
1684b39lO23n00k54P00j79m25M53j07m11M68J39n00J82K17k64J09Q4k26J38J03
1705A08k21J10R6j84J91k6l69K84K92m35J10L10m83L3M97m52j17O95l06n19M74
1726H8j6l92N25J15o07K87K35n20J10M27k40L2J72m29qL81j64k7K61k86r1K83
1748A36k86m3N01j77l15K84j47k35M95mm72L25J43m84J93L07l26J26K08m21m3
1769b35M05j11j14J78j82p1J99j38K2K38j82o3J12k85J10M91l31k87M37j97l60
1790c64N63L4n23M47J70p64K37N92m64j8M12m52k07N62j59k65M19o7l60J76j3
1811d4r2L54k7l31R5k7r1K91j0j95K38j22l58K76J85k17L01l1n71K43L63m06J74
1834bM04n26j02M17l91o7P30k44n06L47q0k83M92O0m16K63Om14K69J77k11L08
$$ y = [-239, -242, 381, -119, -373, 327, 148, -277, 176, 69, -342, 126, 265, -235, -53, 164, -100, 9, 93, -133, 5, 108, -113, -3, 93, -91, 100, 74, -295, -11, 281, -154, -44, 266, -217, -184, 313, -139, -256, 439, 133, -386, 88, 72, -320, 205, 320, -287, 0, 235, -285, -175, 252, 12, 44, 216, -213, -221, 160, -4, -31, 230, -56, -147, 136, -150, -193, 308, 131, -184, 100, -47, -282, 213, 209, -263, 62, 205, -279, -86, 221, -105, 21, 229, -192, -235, 170, 59, -55, 123, -59, -130, 69, -69, -47, 191, 9, -54, 58, -227, -117, 374, 43, -244, 193, -4, -364, 199, 233, -290, 157, 327, -437, -200, 392, -72, -90, 322, -130, -337, 225, 66, -199, 220, 153, -207, -31, -44, -136, 218, 191, -140, -45, -72, -163, 128, 118, -77, 161, 39, -319, -43, 142, -75, 226, 195, -376, -133, 230, -176, -2, 402, -124, -226, 191, -200, -267, 463, 219, -287, 60, -20, -303, 189, 249, -167, 96, 102, -312, -43, 134, -77, 231]
1856B31m1n98L30L15m33K68L14o34O1M62n20J2P27l88m07M27k25k09O26j10m42
1877b34L81j20l95M76L1l10M93j49p05M90K89n13M52K19q11K39M99o82K04P36
1897E90o48k27N53n41r0R18l97n07O58l00n60P97On60O14jq69M50M27n01L61J89
1919C62p03K16L50n31L63M15o66J46L20q04L69Q87q49j76Q46q25l32J238m80o99
1939e53J137l12j141R91L20r17P50K93j225M58O95r31L51P71r55j7O90q28M6J090
1959G13o68m24P65n94l39J029l37n25Q68m08p48Q78l8n53R07j92j093Q55K53r29
1979e80Q72L90j265N10N81j205N18J101j146r3Q94j089k0J378q65m86J229q25
1997a01p78J421l29q53J364l23j452J197M15j290R85O02j580N03R07j354L67J243
$$ y = [231, 190, -408, -78, 237, -196, 72, 386, -248, -187, 275, -245, -233, 494, 106, -301, 126, -99, -308, 318, 208, -234, 147, 27, -368, 108, 139, -171, 322, 173, -532, -42, 247, -266, 186, 405, -406, -167, 332, -350, -146, 590, -58, -285, 268, -273, -363, 555, 158, -349, 309, 9, -551, 246, 252, -308, 306, 305, -564, -114, 313, -188, 173, 362, -341, -125, 225, -306, 57, 472, -194, -48, 272, -532, -163, 724, -125, -301, 545, -280, -612, 626, 146, -553, 584, 272, -869, 122, 442, -475, 275, 568, -657, -199, 496, -435, -84, 687, -268, -285, 405, -423, -377, 713, 45, -379, 386, -208, -547, 482, 145, -380, 488, 80, -668, 210, 172, -381, 526, 334, -759, 96, 349, -580, 292, 682, -583, -73, 508, -697, -179, 922, -224, -317, 577, -512, -532, 846, -19, -505, 724, -101, -879, 542, 213, -640, 724, 401, -1051, 146, 561, -729, 256, 858, -722, -219, 688, -666, -299, 944]
2015I44j117k40R77r34j95J281o39n24R85n97n88J054l24n02J050m69r22J011
2033B51q5p20J131j56j227J015K06j251J110N85j526O10P09j580O75J466j557
2050c44j42J358j394l59J875q65q25J597p73j355J621R0j186J344Kj687R87O42
2068E86j326Q56Q24j447K89P85j283L51J261j029j71R36j008j96J175p08k80J130
2086G45p64o22J057n04m55J282n61r34J226k83r86J327l7j335J175K29j555J161
2104A66Q37j735N68R73j683M89J663j570l42J597j352o72J995o34j032J605o17
2121B56j587J556L89j275J124K90j628O70P10j159O51Q81j147Q8N53r95L61R48
2139F86q92R2P44j069qR65q78O7J231j067n27J251q08n16J573o31j040J462l46
$$ y = [944, -173, -413, 564, -370, -565, 716, 77, -447, 538, -59, -647, 407, 83, -419, 631, 162, -760, 251, 166, -554, 577, 421, -806, 209, 415, -836, 274, 859, -667, -57, 652, -928, -253, 1213, -344, -486, 872, -522, -881, 994, 129, -696, 901, 128, -1227, 394, 484, -702, 642, 644, -1043, -56, 586, -740, 116, 940, -507, -218, 567, -716, -365, 896, -133, -304, 632, -376, -572, 603, -105, -385, 745, -19, -641, 416, -88, -543, 739, 178, -756, 470, 187, -799, 528, 491, -844, 331, 560, -995, 166, 1003, -732, -164, 809, -874, -385, 1278, -292, -634, 963, -389, -1061, 934, 300, -732, 873, 256, -1331, 225, 614, -661, 463, 753, -875, -205, 505, -654, -3, 878, -269, -181, 372, -623, -262, 686, -206, -114, 630, -439, -447, 518, -360, -293, 938, -129, -656, 595, -213, -729, 844, 213, -827, 635, 289]
2158B89j352J504K31j543J134M55j750R93J119j721L19J241j540M9J649j239n03
2175f65J546r97r08J642k60r75J254l18j320J125L58j033Q40L22j187M81M17q99
2193e77O29O36r80K11M22r15M36P60r44K21P76j116jJ008q82qJ239j059n99J352
2213F09o41p54J497l41j216J301l5j444J258O09j514O63P15j461M68J193j254
2230c47l3J165j071l43J251o43m26J154o49q04J080j22p07R59j36r55P85J44q63
2249e61P20M00r39L68L20q53N06O33q37J26N39q17J42P34p03M0P89q54k77R63
2269D39n05k92R75n99o91J064k08q11J041J1j041P75K47j109P56O84j192K46Q02
2288E92r96O4R73p97k43R96o11n40Q95k15m92P57j97o59O29J7n50N73R6n95M15
$$ y = [289, -1063, 441, 672, -871, 263, 718, -1032, -39, 1080, -641, -322, 919, -621, -572, 1077, -162, -665, 881, -116, -1024, 618, 358, -617, 637, 319, -1001, 124, 482, -551, 289, 611, -576, -95, 322, -577, 52, 688, -292, -81, 341, -574, -138, 622, -322, -101, 675, -441, -442, 566, -316, -324, 915, -144, -743, 609, -32, -786, 711, 370, -846, 455, 420, -1024, 234, 843, -671, -8, 707, -754, -286, 907, -347, -380, 785, -286, -629, 622, -21, -447, 707, 58, -746, 334, 212, -495, 464, 328, -627, 158, 302, -561, 159, 559, -380, -12, 308, -545, -39, 594, -243, -117, 422, -395, -253, 481, -222, -182, 607, -247, -524, 439, -66, -358, 617, 18, -673, 391, 183, -628, 413, 424, -617, 158, 405, -704, 52, 736, -456, -210, 592, -404, -340, 633, -164, -407, 589, -22, -562, 333, 118, -374, 383, 186, -473, 156, 173, -377, 196, 292, -303, 112]
2309A12L1o43N76L72o57K30K14p21L53O10o32R2N29p67j55P67l49j10O95n68n56
2330e77P45p5m02O50r2o45N11O3o21N20L16o79K63L33n92K29M21o58O4O45m52
2351c3j35N01m97k33P14k21l81N81j35n38M46Q3m21M16Q9n15K51K65l68R3J36
2372I8l69K84L27l89NJ62m39J28M81k57K0L15o02k79O03qj00M63l54n77M58J04
2394G4l28M41J77n59J25K07m24K23L80m01l2L84k58j43K48k75o2M71o1k29J51
2415A09k03j78L20M5r6K85j69m04K09J11j50L24J3m29J65K20l29Q0K24k75P6L04
2437B52k67r5K25k59q8L68jq2J50l27k77L99J34j21K21j36l86J97J42j97K53J82
2459B87l67l5J53j58R2K22k58m5K49j12r6J05j31j1K53q1j00J39j28j51J85Jk4
$$ y = [112, 143, -500, 76, 448, -209, 21, 235, -486, -133, 477, -155, -63, 466, -301, -456, 311, -38, -148, 547, -21, -577, 168, 93, -309, 341, 249, -396, 115, 178, -443, 77, 393, -286, -23, 310, -282, -53, 368, -290, -226, 419, -33, -168, 333, -164, -397, 317, 96, -285, 296, 161, -377, 69, 152, -269, 147, 236, -279, -28, 237, -131, -38, 98, -271, 13, 340, -49, -44, 118, -321, -193, 288, 31, 51, 366, -236, -515, 88, 80, -20, 443, 89, -488, -30, 74, -254, 187, 364, -195, -70, 137, -287, -64, 316, -85, -117, 267, 9, -134, 114, -161, -223, 248, 187, -42, 109, -94, -272, 48, 93, -3, 282, 113, -291, -82, 29, -121, 203, 216, -213, -48, 172, -157, -77, 147, -128, -52, 252, -15, -110, 115, -144, -232, 136, 135, 53, 203, -124, -401, -2, 132, 11, 232, 96, -290, -93, 49, -148, 105, 287, -80, -115, 38, -120, -28, 194, -64, -109, 140, 28, -68, 37, -94, -105, 148, 67, -33, 106, -22, -173, 12, 13, -11]
2482a1K25j38k94J85P7j18J87J8k85J68J27k83P3K13j91NJ78j84k2K06j87j25
2504a76K51J8j20Q5r7j40K16N9j44J04nj36Q0J6p8J30N9j68j4O3l8P8J4j15P0
2529A2P3j44M3N8r0J17L5k17N0J76j42J4J51j94l9K24j45j07K75n4k60J69L7j50
2553a08K19L0l07P7K14j49k4J61j55q6J70j3r4J09M4j58o2J11J16l7r1K1m3n2
2577a07K08M8k66O2J96k41k1L00j44j78K24o9j87L19L6l75J02J98j52J11J08k88
2599a16m1K52r3j3J98j80j79J52j9K4K25j04k61N2P0M0J60p2k06M0O2m4J63J0
2623A20j68J0j9n6K00J13k33p7L4l0K01R1k36m3R2j10J30J67k17l5J51k21J1L97
2647B72j69l05K42n2j86M08M7n06J11L01k79J06L06l34j93K99p3j13L24l7l54
$$ y = [-11, 214, 76, -218, -33, 44, -74, 113, 131, -154, 14, 141, -142, -69, 144, -47, -42, 136, -48, -70, 136, -51, -176, 75, 93, -27, 58, -39, -179, 37, 96, -48, 56, 51, -85, -5, 11, -67, 63, 122, -46, -60, 3, -35, 43, 57, -58, 12, 85, -59, -16, 42, -48, 69, 104, -113, -63, 113, -29, -15, 136, -58, -97, 127, -18, -125, 150, 96, -164, 5, 42, -108, 111, 141, -166, -89, 125, -24, -48, 113, -42, -128, 42, 29, -65, 44, 88, -70, -132, -21, 95, 58, -33, -12, -55, -107, 101, 149, -117, -55, 141, -100, -121, 179, 35, -143, 81, 12, -175, 144, 180, -195, -93, 105, -47, 64, 172, -116, -157, 95, 2, -11, 187, 7, -172, -20, -39, -15, 210, 106, -155, -103, -33, 7, 167, 95, -111, -71, -9, -53, 110, 120, -48, -38, -57, -113, 87, 200, -33, -110, -76, -106, 95, 186, -50, -93, -1, -111, 19, 186, -31, -66, 85, -136, -125, 272, 103, -202, 40, -12, -198, 210, 257, -249, -138, 163, -116, -10, 296, -38, -231, 68, -5, -118, 206, 169, -185]
2668a85L5J35L1J38l3k05o0O9Q8J34p4j27N3r1p1L14K8k68P2ok03K87K30l68p9
2693a56K15j89M6L44k42k02K72j09j70L66Ql20J05M1j67K76J26l62j2J66r9J12
2715D9J66k68n5J67j46L6K81j77j80J50j26k6L77o0l74J39N7j53K59J04l18J3
2737h5J45j72N6K44j36j21M1p2P5J83j30r4M9q4R3J75k08r0K37j43j18L23p2k74
2761a78K30Kk74K91K20m42KK69k15N5L22l14j77L06r1j23L22q9k76J68j1j70L08
2784A35J09l68K9J38j75J61K05k90l0J81j82KK35j38m8J40j98l8L02j18j56K08
2806A04j18j46K87m7k65K39J03k79J11J05k23J37J35k48Q3J71k72N3K11k47Q6
2827b0K82l99r5M55k14j94M25j60l89M30M2m22L20K12m48R4K35k88R7K79l17n8
$$ y = [-185, -150, -15, 16, 154, 121, -84, -144, -75, 13, 147, 73, -54, -1, -92, -163, 151, 179, -89, -17, -23, -226, 61, 291, -77, -156, 59, -130, -84, 260, 18, -184, 88, -21, -191, 175, 183, -137, -32, 9, -158, 118, 244, -118, -130, 36, -63, 49, 215, -53, -108, 59, -87, -51, 230, 53, -127, 23, -103, -129, 248, 188, -186, -47, 10, -143, 116, 220, -98, -85, 60, -112, -56, 188, 52, -69, -28, -100, -25, 158, 28, -66, -17, -101, -8, 167, -41, -131, 106, -37, -155, 168, 96, -178, 52, 54, -220, 71, 291, -151, -149, 120, -95, -40, 282, -32, -209, 97, 6, -117, 205, 116, -160, 8, -3, -173, 135, 244, -124, -95, 43, -132, 29, 234, -56, -86, 95, -87, -85, 150, 12, -36, 104, -94, -132, 170, 52, -104, 104, -14, -160, 127, 80, -185, 54, 157, -122, -11, 94, -129, 8, 143, -105, -22, 149, -123, -70, 141, -106, -20, 262, -137, -232, 223, 9, -185, 240, 80, -309, 121, 163, -259, 61, 273, -175, -81, 154, -134, -37, 242, -75, -133]
2849a33K84k23n1K85j77n5K68k36j90L30k1j65K28j10k30K37j2j55K72j6k76J56
2871A0n0k13M03J45m81J24J81l88J93M19l97r3L62l23j81M95q5k67K91j63k40
2892b58M18j4l41K46N8l21L16J32m76J77K71l81Q2M09l24j65K85j90p4L72j13
2913A09k36J45l7l0K00j48j66K47q0j04L05j35k99K19Qj89M12R9m95KJ27j98L76
2936A32L08m86r4J99l60J10N73k69k33L08l38k58O25L5m36K39N3l22K74J42l97
2957a95Q5K29j65J34J40l48j6J38j77K07L42l08k22J42j94P9M49j66k70J66j04
2978e4j08K91o0j87K11o9j77L27m6l67J85P3j77L86J44n69m6K03j65K67L82l92
3000E2k17J79k91N2N45j16k50J79k82j89N23Nl64K59O1l31K16J40l88J14K62j85
$$ y = [-133, 151, -72, -123, 162, -15, -70, 198, -38, -228, 102, 81, -84, 144, 34, -196, 41, 29, -126, 146, 130, -146, 10, -40, -253, 150, 295, -186, -62, 119, -269, -76, 343, -54, -147, 215, -108, -289, 206, 121, -146, 145, -18, -258, 160, 146, -195, 51, 109, -212, 104, 236, -240, -63, 208, -173, -91, 318, -6, -171, 114, -76, -150, 222, 109, -127, 18, -19, -49, 151, 3, -163, 84, 4, -100, 205, 70, -229, -10, -2, -191, 221, 320, -175, -173, -46, -244, 132, 440, -46, -140, 59, -301, -191, 382, 113, -120, 188, -150, -408, 217, 252, -184, 55, 108, -214, 60, 202, -195, -110, 119, -46, 88, 228, -120, -136, 2, -175, 32, 374, 66, -156, -14, -208, -129, 320, 154, -116, 50, -54, -162, 129, 69, -118, 93, 24, -153, 174, 128, -239, -54, 19, -158, 228, 372, -197, -243, -40, -205, 62, 444, 52, -165, 14, -277, -225, 320, 204, -46, 133, -149, -338, 185, 190, -174, 85, 146, -185, 31, 171, -217, -103, 159, -26]
3022b6P1J70k86q8J05q9K24K65l03j73R8j67J14L94k22k03K22j69j50L44k6k30
3044a25K24n7j99K95Kl50J48J18j96L15J35n16J1K78k40J17L79l03k03K32k22
3065a57o7M45m1k66J35q9j58K90K0k50K19M3k46J50O6k53J60J49k25R4J49k41
3087g3m0J59j22J26J61k73o2K03j55L2K57k38j19L10j60j94L33m0k80K29L1k51
3109a66K53Q1l16Q7J85k03J06J18k73P9K07k47RK48k28m7K55j97j06L38j41k37
3131a95K58L5k19J79pk11J93R5k11P6O6j54J24R3k11Q3J17k29P5J88j57K2R1k53
3155a52N4K73j56m3J53k28m3L15j55j77L48j22l10L19O2l04K23J15l63J34L00
3176B43k91p0J97j44QK30j38j28J31j06nK02j11k8J14k06p8L02k7j64J66j18j58
$$ y = [-26, 45, 215, -71, -159, -54, -143, 81, 346, 43, -130, -32, -199, -85, 309, 87, -116, 106, -63, -213, 131, 105, -125, 99, 42, -157, 138, 140, -210, -62, 56, -140, 175, 310, -206, -195, 83, -157, -40, 339, 36, -167, 65, -157, -224, 221, 180, -86, 49, -40, -198, 92, 112, -138, 81, 124, -122, 28, 94, -159, 1, 150, -75, 19, 168, -73, -113, 46, -76, 50, 211, -62, -124, 79, -76, -44, 213, -25, -144, 166, 6, -188, 145, 105, -175, 54, 85, -166, 87, 168, -148, -61, 124, -79, 27, 145, -128, -49, 158, -89, -80, 168, -60, -107, 148, -49, -155, 183, 42, -195, 63, 98, -121, 58, 51, -160, 33, 128, -83, -7, 59, -95, 29, 122, -89, -6, 111, -118, -43, 145, -12, 10, 101, -152, -98, 175, 19, -24, 129, -99, -142, 173, 18, -159, 189, 67, -243, 76, 138, -166, 57, 172, -191, -57, 243, -48, -118, 79, -65, -57, 173, 35, -93, 38, -68, -73, 129, 18, -10, 104, -102, -180, 122, 95, -69, 97, -21, -179]
3199a79K64L8k41J60N3k34J73J07k45J02J21k90J14K83k14p0J55k16%L20j24j69
3221i2J50j07p1K40p4j24K05j39j93L11J0k33K17k2l53K98K51l93K9K51k67k2
3243a28L41j98j43K16j13j24K31nr3O7j34m3K47o2j23J56j34j18K88l5k38K33
3265H8J0l05K24J45k73J40J23l44J17L17k66p1K65k47r5L80j49k30K77m0k49K07
3287B4J06j76P8Jj62J30R5j19Q4n5j63K19O8k86J82J38l38R3K88k96oL22k82j66
3311b21L94j01k24K40m7k00K54L6k68J55N5j96J30Q8j67J10N9k59J14J88j68O1
3333C3Q5k54N3K51k07j9K29k31q1K98j51j48L11r8k96K62R0k43J76O2k79J24J61
3356A28j88J8J38j34J4Q4j55Q8J23j93J3J60j75L7K00k39n7L12j52j89K75o0k17
$$ y = [-179, 85, 123, -118, 42, 95, -139, 34, 141, -104, -2, 119, -171, -57, 226, 12, -58, 97, -119, -119, 201, 77, -92, 58, -49, -120, 120, 46, -78, 127, -12, -205, 106, 116, -117, 100, 78, -275, 23, 274, -119, -90, 161, -106, -128, 213, 15, -128, 88, -25, -149, 82, 77, -16, 51, -83, -126, 121, 59, -64, 92, -42, -160, 128, 93, -145, 88, 98, -207, 17, 162, -111, 29, 152, -192, -75, 242, -24, -95, 170, -77, -172, 208, 59, -171, 106, 66, -183, 24, 130, -46, 32, 33, -129, 1, 96, -23, 61, 6, -157, 62, 130, -156, 26, 164, -174, -81, 207, -89, -95, 227, -55, -221, 173, 72, -152, 88, 41, -159, 95, 131, -137, 18, 73, -123, 7, 95, -72, 38, 97, -162, -48, 140, -28, 33, 118, -136, -83, 168, -39, -58, 171, -60, -141, 157, 6, -142, 169, 71, -225, 37, 127, -116, 60, 122, -157, -33, 128, -60, -42, 96, -38, -24, 60, -95, -7, 116, -77, -64, 96, -79, -42, 158, -81, -138, 174, 22, -167, 108, 48, -169]
3379a69K68K0k87J82J31k91R2K02j93K9J19k02mK27j18l5J13j23j5J35j04j4J63
3402A26j36q2J45r3JJ97j37j82K26kj82J97J9k37J70P3k35J01J85k06kJ29j51
3425g6L7J55j51m3J51q1m3J06j10JJ63j25p3J79q6j05J86n6j51K09K5k59J26J49
3449A28j92N1J21j85kJ84j17m5J50q9n8J10r0oJ46r8q6J21n3l2J40q7j13J68l2
3474C4j46J51K3j26J13kj84J55R4j96N2J18j72N6J44j76k4K02j14r5J40n2n9J36
3498G2n9p9J35m3j08J17l2o6J66o2j63J46N7j73J17P7j74O0J03j62K7J62j06p1
3522e9J03p7J0J24j07o6J19o3k3J40j07o4J50p8j42K07K5j60J04Lj80J45J18j99
3546g7O1J31j69j8J43j31mJ95j34r8J61o4r4J36Kp9J16l9j53R9L0l7J13m9j32
$$ y = [-169, 99, 119, -168, 14, 145, -146, -54, 148, -45, -16, 103, -99, -103, 124, 6, -29, 84, -39, -54, 81, -23, -37, 126, -10, -92, 53, -40, -39, 158, 21, -161, 65, 63, -119, 78, 97, -140, 30, 103, -132, -31, 154, -52, -54, 75, -76, -39, 116, -35, -78, 73, -8, -51, 55, -55, -54, 109, -16, -89, 90, 4, -101, 85, 29, -122, 87, 112, -147, -21, 128, -64, -13, 108, -77, -79, 105, -12, -57, 93, 4, -54, 56, -34, -40, 106, 8, -78, 43, -10, -42, 98, 11, -102, 66, 34, -112, 39, 62, -64, 49, 47, -137, 18, 112, -84, -32, 86, -86, -30, 114, -62, -86, 116, 2, -93, 47, -5, -64, 72, 13, -66, 69, 26, -82, 35, 3, -63, 103, 41, -122, 24, 81, -92, 25, 102, -72, -12, 91, -71, -44, 118, 12, -59, 44, -33, -23, 101, -6, -72, 47, -16, -39, 101, -6, -70, 80, 2, -140, 67, 92, -68, 36, 39, -141, 4, 122, -77, -16, 115, -54, -72, 71, -60, -64, 131, -3, -101, 60, -4, -98, 38, 40, -39, 77, 38, -115, -16, 14, -23, 90, 41, -91]
3571i1J18J0j44J46O9j58N8P1j93Q0J90j94m4J75j07m7J75j10j26J98l2j24J46
3594F6kj33R3Mj40J34J14j88L9N6j44R0R8j60P3J20j71l3J32r6kJ92j25j29J72
3619F0m2j53J70N0j19Q2Mj60P0R6n2L1Lr0O1J6j05J15O8j47M3O8j69O8J89j95
3645c8o2K14r7j10J76n1j54J80J5j88J45Q1j87O5Q9j72Q7J30j74l2J82j06q7J38
3669D4m8m8J26m5j10P5J3k6N2l0l7Q2n5q6J20J5p5P7nj52J04J05j48RJ19r9k7
3696e0R4q0J0J17j01n1J20p7l6J51q8r1J66l1j79J36P3j55J03P2k02O0J43j34
3720c0k0J49j00o5J03p5k2J64n7j33R7j0p1J21J4j35P2M5j08K3P6j9jj4o1N3L2
3747B8n6M2Rq2Q2M2j36K7J52j34l9J40r6n1J55n8j02J23Mj23P7J7n6J00Nj66O9
$$ y = [-91, 27, 37, -107, 39, 108, -50, 8, 79, -114, -34, 156, -38, -82, 93, -14, -61, 114, 4, -122, 76, 44, -80, 66, 64, -69, 24, 28, -112, 22, 136, -52, -13, 43, -101, -11, 87, -73, 0, 120, -51, -84, 48, -48, -50, 142, 17, -112, 60, 18, -135, 35, 85, -34, 48, 52, -108, -38, 58, 6, 37, 40, -50, 11, 27, -78, 37, 105, -42, 1, 69, -100, -32, 157, -38, -100, 114, 17, -93, 83, 32, -122, 58, 73, -115, 30, 111, -76, -11, 78, -94, -7, 123, -51, -83, 99, -7, -94, 44, -4, -52, 74, 29, -81, -6, 7, -19, 33, 3, -34, 48, -7, -93, 27, 42, -33, 44, 39, -113, -9, 96, -52, -43, 76, -23, -50, 44, -36, -26, 91, -10, -61, 59, -18, -54, 97, 9, -82, 84, 53, -126, 10, 83, -72, 31, 103, -99, -39, 104, -30, -50, 99, -1, -66, 37, -38, -60, 104, 47, -86, 11, 1, -70, 51, 65, -70, 2, 47, -61, -38, 38, 19, 18, 4, -57, -4, 28, -28, 14, 23, -59, 23, 65, -71, -44, 108, -26, -65, 75, -21, -72, 83, 25, -77, 46, 50, -73, 4, 21, -35, 65, 70, -96, -27]
3774b7J02j21M2J14j51pJ27j17m6J79k4j53P2K2o6Q8L7j14QL0k1K6J5k3N1m3q9
3801h9Q3P4p5K9J1j07M3Q3o0j1P7p5j1N0n9J8J26q0r0J22m6r9J30Qj05J15L7j87
3829h8J4J21n6K7R0r6o4M8m5J8R9j3m2Jr5JJ52j6q3N1k0r6J15L3j08M8N4j03J6
3858c7Q7l5l2pm2N8R2n5l2j7o4M4J04m9j0P3j03o0R3Rj7P9o5q6R2K4r5M4M2o6
3888c1Q4L7j50k5J14n8J1J34m0j27L8n4j7J50P4j16o1k4k5J12N3o4Mk0o7N0N5
3915C7l4QLp7L4J02m0p8J6k5M4R7m7p0J5m2OR4Nm7M2q4n5J18N4p9J5j9o0Q5O5
3946H3j21%N3m4M4O8r5l4P0n8j2J43j4j18Jrk1J22O1j36m7L5RJ7M7j1n4k5QM5
3976GJ1JLo4l8R5N7q4k4J7l1N2O2q0k4N8n4PQ4k5n1K8l3m0J22J3j00QK1m3R9L2
$$ y = [-27, 75, -46, -4, 110, -41, -48, 79, -38, -84, 95, 71, -82, -10, 12, -54, 34, 71, -43, -35, -5, -26, 0, 15, -8, 43, 0, -89, -6, 68, -7, 22, 33, -74, -31, 52, -8, -19, 58, -17, -28, 22, -37, -19, 107, 27, -63, 59, 13, -86, 44, 52, -53, 62, 99, -88, -74, 47, -9, 18, 108, 12, -52, -4, -49, -31, 68, 55, 13, 14, -81, -80, 72, 56, -27, 24, 4, -92, 23, 56, -52, -4, 50, -53, -37, 50, 15, -17, -24, -66, -8, 84, 29, -3, -20, -84, -40, 64, 15, 5, 78, -25, -85, 8, 17, 0, 79, 14, -72, 20, 44, -51, -7, 35, -31, 53, 90, -60, -85, 29, -29, -18, 116, 76, -51, -13, -67, -84, 66, 140, 24, -37, -61, -86, 26, 79, 15, 19, -1, -68, -18, 37, 3, 11, 14, -63, -29, 73, 33, -45, -29, -54, -10, 87, 40, -30, -15, -57, -51, 43, 48, 1, 43, -41, -96, 22, 76, -3, 12, -7, -67, 18, 83, -38, -38, 15, -29, 15, 83, -12, -46, 24, -34, -46, 97, 83, -35, -34, -43, -64, 58, 119, -17, -64, -29, -20, -3, 44, 33, -21, -46, -38, 7, 18, 19, 22, -42, -80, 15, 72, -12, -36, -19, -50, 2, 64, -16, -40, 18, -36, -29, 55, 30, -21, 7, -26, -66, 56, 69, -31, -23, -2, -45, 54, 86]
4008H6j08j8O4k7j1P9k9o1J4Nj7P3Mp7j2J0L3L6k5n2qM0PK8l3Pnl8PP2l0m2M6
4041A8m1m0J14K0j57M9Q1r4M9R7j54m7J70m1r7J39j5j50N5Q4m7M0M4j14o3R9N8
4068E7k3l1j4Pj0J5M7l0n2M5Op5Q1P3j43k9J21m5%P2q6r5J30L5q6O1k0q1P3L6
4098C9o3O7J1j19J6P3j8M8rj45M5J27o2LM7j40j1J67p4m3J55r6j58J52P0j09Q2
4125E5J6j82M1J83q5o0P2m9m7P9L0l2k7j1J6pj9J06l3j82Q5J43j21K1J16j91o7
4152a50K72n1j80J74Qk32J27J66j96M9J39k34k9K53m6j28Q8n6p1J31L9r7L0j4
4176hk7K5J5NN0r6n2J30k2n3J17o7j58J71Q6j80M4J10j68J3J79j07o5J51q2j05
4202i4J55J3p6J4k6l9R1Rn8L0n8j2J32o0q5J44n3j71J66P9j97J15R6k44K8K63
$$ y = [86, -22, -40, 24, -3, -14, 65, 36, -25, -11, -6, -23, 50, 54, -23, -35, -25, 8, 44, 19, -33, -41, -1, 6, 34, 1, 8, 3, -35, -28, 44, 14, -28, 18, -23, -63, 51, 71, -86, -37, 44, -50, -1, 96, -58, -105, 65, 24, -73, 66, 51, -99, -44, 40, -7, 33, 77, -37, -100, -1, 57, 34, 3, -11, -4, -14, 1, 48, 18, -34, 11, 17, -58, 23, 96, -47, -76, 45, 0, 0, 72, -14, -109, 21, 56, -30, 31, 11, -70, 3, 39, -24, 43, 54, -65, -49, 24, 6, 54, 45, -100, -55, 72, 10, 13, 60, -80, -91, 76, 2, -41, 114, 18, -140, 12, 82, -27, 55, 71, -111, -70, 113, 28, -32, 40, -9, -56, 23, 53, 21, -6, -17, -1, -8, -27, 79, 46, -136, -51, 92, -29, -8, 108, -83, -150, 122, 71, -109, 65, 73, -159, -32, 134, -62, -13, 126, -108, -137, 116, 70, -58, 30, -26, -97, 34, 73, -24, 6, -8, -35, -10, 5, 10, 60, -36, -88, 42, 20, -33, 84, 17, -141, 30, 116, -64, -20, 90, -78, -65, 114, 7, -58, 93, 11, -94, 61, 74, -2, 12, -14, -53, 38, 47, -11, 19, -39, -51, 81, 21, -64, 80, 27, -144, 22, 101, -96, 19, 115, -129, -101, 162]
4228A62j79j01K21q4j47J95L0k22J34R2j69MJ42o3m6M8k6j4K5J7J3o0%R8o5r1
4254h6J32L5j61P0J08j84M9J88k02p1K32n8j69J81Jj90J47P9j99P0J28j45j7J04
4278D2n1j4O9p0k9O6k8J4K9q1J8P9j04J9J32j07o0J37q2p7J88l2j90J23Q0j35
4304f4O1J04j39oR3n7m3J16k0n7nmM6K6n3jJ5o6Q3N3j31jJ47j11p0J89p1j30J47
4333E1Qj78J54R7k19J7J60j15j8J41j06j04J37Nq2P7lo5J2J5L1J9k9j9Nm1N6P6
4361H2j03p1J26k3q3J29mj49Q3O7j10M6J24j35n4J08l7j4Q5o4o6O4K0k9L6m6k2
4388d0Q2k8l5P0o0o5R2jl4Q9k0j69O6J12p6L7N9j31l0J29n4m7J24l6q7L9L0m0
4416b4K8J0m6L7L5ol1p5NR5Ql5N4o0j02J09M0q0R4L5j65J0J23n3j8R3r1n0J16
$$ y = [162, -17, -118, 103, 19, -128, 67, 97, -125, 9, 101, -68, -64, 78, 15, -31, 17, -9, -23, 2, 19, 32, -28, -28, 70, 5, -86, 46, 81, -80, -10, 98, -86, -37, 151, -51, -122, 110, 52, -117, 64, 65, -125, 22, 101, -98, -28, 100, -45, -62, 42, -9, -23, 46, -24, -53, 13, -15, -1, 28, -53, -35, 44, -60, -41, 91, -16, -76, 61, -21, -98, 90, 58, -132, -9, 71, -64, -3, 101, -38, -44, 49, -8, -51, 65, 45, -12, -17, -21, 25, 51, -2, -3, 12, -54, 29, 82, -49, -50, 97, -14, -84, 105, 34, -96, 51, 59, -119, 35, 132, -87, -70, 90, -25, -43, 98, -8, -112, 25, 30, -52, 25, 22, -43, -31, -16, 15, 34, 5, -14, -9, -50, 6, 82, -21, -92, 34, 11, -72, 57, 53, -96, -13, 54, -56, -10, 114, -21, -75, 33, -4, -18, 67, 3, -63, 1, 21, -8, 28, -18, -40, 42, 14, -21, 49, -11, -76, 16, 15, -19, 70, 50, -119, -53, 59, -17, 20, 79, -52, -82, 47, -7, -54, 70, 34, -53, -14, 16, -24, 4, 14, -32, 5, 40, 34, 3, -72, -67, 28, 36, 1, 55, -5, -107, 2, 42, -38, 56, 91, -74, -64, 59, 6, -12, 81, -10, -60, 56]
4445E6pj03M3J6m1O9K9q0J3j2m0L3Q2nj8n0q7O4Q5k6Mj2p4J7O3m7lP5n3l6Q4j6
4477B3n3K5j6k2Q3L4o4m8k2jR7L5n6Rm4o4Q2N1n2M0J0j29L2J25n3o5P6n8l2J34
4507G7j7j28L0N5n0O3M4o4l6oj5M3P7j9n9n4PN4L6l1lrm4N2M3o7LN0p3JJ13o0
4539A3p5N2j7j9J16K5j40j7M3j6O1N0p1l1J6k1L4M3k1k0j6m7N9P6p1m0M3n3J8
4568b6J05m8r6P6Lo7P8M7j07pM3k3J8O7n1p4K3M1K2J7m6k7OrL9K8m2kK5p0M0Q5
4600F8n0o9N2j7m3J26l0j24N8P8p2K9P1j03l5R7l2k6R4l5r3J6M5QL8k2n1KJ1J7
4630HJ8l1LL1l8k5P7j7p2O9J0p1P2K5j20J3R2m9lO1p1n3R3qm7M9J1o5K0J9j4L8
4662B5k3o3K9M7l4M5j7o5N7L4n1J8N5q1j4O5l5j7R9n9p9P4J9m5N9j1n8L2L4p5
$$ y = [56, 49, -54, -11, 5, -36, 33, 62, -18, -5, -17, -57, -24, 58, 53, 35, -15, -102, -38, 47, 21, 25, 13, -61, -44, 19, -28, -31, 44, -9, -45, 39, 23, -30, -5, -21, -43, 40, 74, 10, -38, -60, -61, 36, 71, 15, 24, -20, -84, -2, 49, -3, 37, 47, -82, -50, 75, 22, -43, 33, -25, -57, 77, 60, -68, -38, 17, -33, 30, 74, 10, -26, -32, -47, -4, 73, 54, -5, -59, -52, 2, 38, 7, 4, -5, -49, 3, 46, -21, -18, 32, -41, -40, 73, 13, -62, -10, -27, -46, 70, 95, -45, -62, -19, -35, 26, 76, 5, -26, -10, -31, 3, 46, 25, 5, -11, -58, 1, 77, 6, -34, 9, -44, -26, 79, 31, -65, 11, 14, -53, 25, 72, -35, -42, 1, -22, -4, 63, 12, -62, -39, 2, 24, 41, -5, -32, -26, -35, 4, 32, -10, -12, 13, -57, -17, 68, 18, -51, 1, -16, -59, 67, 37, -87, -29, 49, -23, 6, 77, -26, -61, 36, 4, -22, 72, 37, -56, -40, 5, 13, 51, 29, -22, -20, -9, 8, 26, -5, -2, 29, -9, -34, 43, 26, -46, 23, 33, -38, 34, 59, -61, -48, 44, -5, -8, 53, -18, -71, 22, 14, -33, 16, 27, -38, -18, 1, -13, 25, 2, -61, -32, 15, -19, 26, 9, -56, 1, 35, -16, 2, 57, -24, -38, 27, -8, -25, 74, 15, -64, 10, 29, -16, 43, 32, -26, 6, 40, -35]
4692c5K6M2k3J2On9K0K6l5K7K4n2J9J1o4L2J01p7rM2n2l0J01l6p2J02j9j04O6
4721a0N1o3L5L3j02PR3l3k4L6k7nJ8k3J1M4k7j8Mk0K4M2l3k9L6on8O3ml4O7j5
4753C3r5M9N5n3K3L5p7NP4n9j8O8k9n4M7j4j7M9K0p5K1K4m3J7J5NoJ3o1J7L0m
4785eL2j3m0QRk3L7L7l9j2Rl7J5Q1k7o0L8nl8O3Nm9L2Ln0J3O5l4oOm3J1O0l9j4
4820a0J4rQK0l7oO6l3m6L9pk8M5jk8L8J3q9J3M7j1J5J7o8j7L9L1k3RQl6oJ7L1
4854A5Rj7om1J3M3K4m9j6L2l7J6N9k8n6O8j8o0O7L0n6k1N7l1j2O0m7m7N2M0m6
4885cjJ1l8J6M1Lm8K5ql5L2M4No4j3PJ6J9L4n3l6L0K4l6L4M1p5j2L7mPM4l5o3
4919e4K9L4J0rj1ojK7OKl7K7Lk4OM4m4l8M2K2k0K4%q9L0P7k9l0K6l2m2O6L7m7
$$ y = [-35, -9, 33, 10, 22, 28, -31, -11, 15, -20, 7, 31, -21, -2, 9, -55, -23, 78, 1, -8, 34, -18, -48, 53, 17, -55, 47, 28, -76, -10, 41, -22, 13, 46, -56, -49, 44, 11, -13, 23, -4, -9, 9, -14, -3, 41, 14, -4, 0, -20, 4, 46, 13, -16, 20, 14, -44, 19, 15, -19, 48, 33, -62, -13, 42, -11, 12, 47, -30, -25, 49, -10, -28, 40, 11, -43, 4, -10, -27, 22, 42, -33, -12, 12, -31, -14, 1, 6, 0, 13, -48, -31, -1, -5, 27, 14, -26, -18, -9, -32, 5, 42, 3, -9, 0, -37, -22, 59, 32, -28, 10, 5, -33, 30, 35, -14, 18, 21, -29, -16, 49, 15, 9, 15, -28, -17, 43, 4, -10, 4, -5, 3, 23, -14, -20, 46, 13, -33, 6, -1, -29, 16, 15, -13, 25, 38, -51, -38, 9, -2, 13, 30, -38, -55, -16, 15, -8, 1, 9, -27, -33, -16, 15, 24, 7, 1, -40, -27, 16, 40, -9, -25, 7, -30, -14, 45, 17, -39, 29, 11, -49, 18, 48, -8, -29, 28, -3, -15, 45, -2, -49, 3, 43, -3, -4, 7, -31, -15, 26, 29, -19, 6, -2, -37, -5, 39, 44, -20, -33, -26, -10, 9, 43, -10, -46, -16, 8, -28, 6, 47, -28, -40, -3, -7, 0, 44, 9, -54, -25, 9, 19, 10, -1, -7, -8, 19, 25, 27, -10, 17, 20, -4, 2, 46, 2, -36, 6, 28, 8, 32, 32, -57, -27, 50, 21, -9, 17, -15, -57, 9, 46, -1]
4953aJL6q1j4Q1J9l5j5j2j7L3N7j8p5L1L6n2LP6m1o1N9J3o6N2N5j01k2J06k2n9
4984c4O8k5m6N2M6p7LL7m6rO4Jl2kkqL9J6j9m0k5M0L1qk6Nl8J0N8k9NK7m3o1P0
5019BL9m7J1nn9K5O7l6k8L9nj3MRjj2j0K4OqK9l6n3O4M7n6k2M7m6rR6k4q0N6L0
5054D5j02N0P2o3k5N1m2j9Q6Jr7J6N2m4K4L9m5l9M2J5l5L1L2m3m5K3M1j2k1L8
5084B6m8j0P1k8p2O1M0o1PN5p1j1O7k6l3P6lp9J7L2k3L0L0p4j0O5j7mK2j2j5R
5116A1k7K8J5j6j9Qk1K4L8m5k2M4qj9L8j3m8L4L6o3PN8m2k5M2j7qL1k4l0K3J5
5148EPk3j0K8Kl2K8Nk6kM7m5j4P3k6o9N3K7n2M3K2r1K9P1o1j9Q2l4n6O7ln1M6
5181B1K3q3J3N2j8k2L4k2qJ1J0roJ7J9m5qN1qn6L7K2m9J3M9n9j1P2k9n3N6Lm8
$$ y = [-1, 0, 36, -45, -59, 22, 41, 6, -9, -21, -38, -5, 52, 34, -41, -10, 26, -26, -23, 53, 12, -49, 10, 23, -43, 9, 64, -37, -59, 47, 25, -34, 34, 9, -37, 15, 61, -16, -13, 24, -22, -31, 33, 34, 2, 0, -2, -10, 29, 45, 26, -14, -39, 1, 32, 24, -2, 3, -35, -25, 33, 4, 9, 36, -7, -68, 2, 41, -6, 5, 0, -59, -34, 33, -3, -31, 8, 3, -10, -6, 3, 2, -10, -20, 4, 10, 2, 31, -5, -58, 6, 53, -3, -25, 22, -24, -33, 63, 39, -41, 15, 45, -57, -7, 65, 2, -23, 28, -14, -33, 53, 54, -43, -27, 25, -19, 5, 44, -1, -40, 2, 17, -18, 13, 45, 2, -43, -20, 21, 9, -12, 26, -22, -32, 39, 11, -61, 0, 40, -21, -14, 41, -30, -41, 26, 0, -33, 43, 40, -39, -22, 10, -13, 17, 47, -27, -37, 28, 11, 7, 29, 17, 2, 11, -16, 12, 27, 11, -8, 0, -21, 3, 41, -4, -26, 18, 10, -9, 29, 16, -32, 2, 38, -25, -18, 40, -2, -27, 15, -2, -10, 21, -3, -33, -10, 5, 12, -11, -21, 7, 9, -23, 5, 10, -16, -18, 29, -16, -30, 43, 17, -52, 1, 28, -24, 19, 41, -50, -21, 50, -11, -30, 52, 18, -38, 29, 26, -25, 21, 44, -39, -26, 26, 8, -14, 20, -2, -10, 1, 11, 2, -4, 13, 32, -13, -21, 30, 22, -34, 3, 25, -24, -11, 38, -21, -32, 40, 11, -42, 14, 17, -31]
5214c1M5Po4L8L8n2j0N0k3rL7l7j4M2pj1PrJ5J0l2j2N9k8j4L1k9k2P2l6n9P6J8
5247D6q4N4K2p5K6N6n9l5R9k1o9N5qk0K1Rk6oJ9Pqk2J9L3m7j3N0l2k8O2k5m7P2
5280B5Rp7K2O9q1K8N8p6qO6l7o3J07jo3L3Nn6N6M3o5jL2k6O%oJ7Pk6RJ5m0L9o
5315A4m6M1N3o7l4O0k8k1Q3m8n2N4J2p0N8K2m0J2jl4K6L2l5J2J4l9M3mn9L1L4
5346B3m5K9L6p0KN4m9j5J02k3q5N7rn6O8L6q5L0N8o2k6N4rk6L6rk6J4J1j8k0J2
5378a1O1l0n1K4J2m8N8M4q6%Q4q3m8J21j1r0P3K2j00N9O3j04RQ1m9l4O1l2l7P2
5408C0pm7M6Ol2j5K0OJ7oj1mj6L1J9l8oM0k4m3O2j2m1N6Po7L9K7o3J3M0k2%K0
5442B5m4%L8j7kJ3l7kN0m4k2P7j8o4O1%o0N7Qp5M4N4n4j8O1l8k0M9j5m5L9J3k3
$$ y = [-31, 14, 21, -43, -5, 33, -19, -29, 21, -2, -11, 26, -11, -25, 17, 10, -1, 6, -3, 12, 22, -10, -22, 37, 9, -5, 26, -3, -25, 47, 11, -48, 28, 46, -38, 16, 38, -37, -11, 45, -14, -49, 50, 29, -40, 15, 7, -13, 8, 17, -9, -15, 4, 11, 3, -19, 0, 33, -14, -27, 23, -9, -37, 25, 0, -47, 25, 34, -43, -21, 48, -33, -5, 53, -23, -31, 35, -2, -65, 42, 41, -22, 11, 16, -40, 16, 59, -6, -7, 25, -1, 5, 5, -1, 16, 23, -3, 6, 21, -19, 20, 14, -32, 9, 62, -5, -39, 21, -7, -28, 55, 7, -45, 9, 21, -49, 9, 31, -9, 3, 2, -32, -6, 26, -9, 3, 17, -22, 21, 17, -42, -11, 23, -22, 7, 43, -27, -25, 29, -20, -35, 67, 44, -41, 16, 7, -49, 19, 55, -30, 0, 58, -4, -30, 24, 15, -11, 25, 16, -10, 4, 15, -3, -23, -11, 50, 20, -31, -7, 5, -43, 15, 59, -27, -27, 57, -26, -74, 47, 36, -54, 19, 41, -59, 0, 63, -41, -32, 49, 0, -34, 27, -5, -42, 30, 23, -24, 22, 28, -4, -19, 1, 7, 24, 18, 7, 3, -13, 18, 37, -1, -7, 33, 9, -34, 28, 16, -25, 31, 38, -29, 10, 37, -26, -13, 27, 5, 5, 25, -19, -19, 19, 2, 0, 13, -24, -26, 24, -20, -42, 35, 17, -47, 14, 14, -46, 11, 19, -56, -12, 42, -12, -30, 31, -7, -27, 22, 7, -38, 1, 14, -9]
5475iMJ8Lk0rJJ6PQPn8K5M0n0jP5m4n9Q8l5m3O8J2j00M5N8o1j2O9o5j0P8l0o9
5509e3O7kn5M5J5m3K0K3m9NM6j5lpj0K7j0j3RJk0L8Km3K5K2m1J1M3m5QK9n2j0
5543c5Q6l6l4M8m4k0O2rm0M8nn5M3J5m3M0J0p7K7N6l3k1M3l3j5O2l7l3N6j6n5
5574d5M3K3l5K7j0l6K2K8l0RplJ7J2l3K2J0k4K6k0j2L8Pn7K2M7n3PK5m3RO6m8
5607Dm4Q7l4n9O7J8n9M8Rp8L0O7o2J9J6m8jL7j6k9M7ol2K5oj9K7mk9OJ4%J3k1
5641a3j2K2Rj7K0pk2K7ol3L4J3l2J7K3l7J1L3o0PO8m4k1L6nl8N2nm5N4Mn3K0M2
5675D2m9J4Jl2NN2k8k1K9j9j2K2ll0M5lk4QOlJ2rj6K2Ol7J4J5rJ2j3k4K1Rj6M
5711iK4l2K6J2m3J2M1k5j9K0l0J2N4m2l5M9Kl5L7Nm3L3K7o4J9L9k7mK3m0kL2p
$$ y = [-9, -5, 13, 16, -4, -13, -12, 4, 11, 19, 26, -32, -7, 33, -17, -18, 57, 13, -46, 42, 7, -36, 32, 44, -56, -11, 47, -14, -26, 43, -22, -32, 46, 16, -53, 14, 12, -43, 2, 17, -26, -6, 17, -32, -27, 19, 4, 1, -6, -16, 11, 1, -12, -3, -2, -22, 16, 18, -25, 0, 22, -19, -8, 35, -10, -2, 27, -25, -35, 51, 15, -19, 29, -15, -35, 27, 18, -22, 26, 21, -34, 9, 24, -19, 21, 31, -46, -19, 37, 4, -17, 26, -7, -22, 40, 3, -30, 26, 10, -45, -2, 21, -14, 13, 3, -33, -11, 17, -13, -4, -11, -14, 3, 15, -18, 4, 14, -10, 16, -4, -16, 22, 29, -28, -6, 41, -12, -5, 20, -23, -14, 52, 4, -40, 47, 13, -46, 21, 39, -20, 28, 37, -41, -11, 56, -6, 13, 29, -19, -20, 17, 1, -28, 19, 13, -19, 6, 0, -19, 8, 4, -25, -19, -5, -5, 8, -13, -25, -3, 6, -11, 9, 2, -20, 7, 1, -32, 2, 15, -17, 0, 23, -14, -3, 30, -30, -23, 45, 1, -20, 16, 11, -27, 25, 20, -25, 29, 33, -20, 0, 42, -7, 7, 8, -24, -19, 33, 5, -16, 13, -6, -18, 4, 1, -29, 16, 13, -11, -3, 3, 0, 12, 3, -13, 9, 15, -22, -8, 7, -2, 10, -3, -27, -6, 3, -13, -9, 15, -17, 9, 21, -22, -10, 31, 6, -13, 7, -23, -11, 43, 1, -34, 15, 17, -18, 19, 24, -19, 14, 41, -23, -4, 35, 8, 4, 27, -13, -15, 17, 10]
5744A0k9M9ql6%J0j6J6Pk5J2J2JoLmJ2k5JNQlJ5j6m1L9K5l3J7J6l0kL7m8kN9k5
5781El0K6Mj8L4j0k9J9L0m7ML6j5%J4l1KK1%j9K3j2kJ4k8QJ8Km1L4k5KK7nk7K7
5817A1j0j6J0RrJ3J2l3pL2j1j1rLK3Jj9MJ5qj2J6l0K3L3l5k4M0ok7K6J4m1L5K1
5852C3n9K2M1l8JL3l5k2M5j6k2L5Kl5NPjjRkj2lmJ7j5NK2j0l1L9j6k1L2Kl1K2
5888bL3m2j5L7rk4M2j1k1L0j1l2K4J9rQj4rJ4Mj3J1Qj6K8k9k7L2K4l6K1Pl9PM0
5923C0n8%P5l0m5K5%l3L9K1m1NK1l0j3K8J0kplOmJJ3j9lK3Pm1J4J5k3K3K3n6J8
5959a1M3m2l9P5ml5J7J8n7J6M8l3j8N3ml7K9Jj9KRpPPk0j2j7M6J1l3JK5l7oN6
5994C3l3k4N6ro8K7L3m3L4J9m4j7P0l1m2M8J5k9%LJrK6k3ONKPl5K5Pok7L5lk4
$$ y = [10, -19, 30, 22, -14, -14, -4, -20, -4, 3, -22, -10, 2, 3, -3, 0, -4, 8, -17, -16, -11, -3, -6, 9, -7, -48, -9, 16, -17, 0, 16, -14, -16, 21, -27, -29, 30, 5, -25, 1, 5, -13, 21, 11, -18, 1, 31, -16, -12, 24, 9, 9, 23, -8, -6, 15, 15, -4, 19, 7, 5, 19, -9, -1, 17, 19, -22, 12, -13, -11, 16, 11, -16, 11, 1, -15, -5, 4, -5, 8, 20, -13, -20, 12, 1, -10, -19, -16, 7, 8, -11, -7, 8, 0, -12, 4, -26, -3, 30, -5, -29, 11, 5, -22, 4, 18, -23, 12, 33, -26, -4, 37, -1, 0, 33, -2, -24, 21, 5, -17, 18, 20, -15, -10, -3, -4, -5, 4, 2, -10, -13, -17, 0, -15, -10, 12, 2, -29, 10, -6, -27, 5, 7, -24, -2, 31, -11, -26, 11, 2, -22, 20, 9, -12, 18, 7, -25, -1, 18, 9, 17, 3, -6, 8, 12, -1, 10, 18, 2, 30, 1, -26, 6, 30, -6, 15, 22, -17, -10, 30, -28, -28, 47, 17, -28, -3, -3, -36, 3, 24, -17, -12, 9, -21, -34, -6, 4, 2, -5, -8, -2, -6, -5, 8, -11, -14, 9, 16, -25, -11, 4, -19, 4, 27, -29, -11, 32, -10, -49, 26, 22, -13, 4, 22, -35, -19, 29, -4, -22, 31, 27, -10, 19, 20, 1, 3, 12, 5, 12, 19, -1, -13, -30, 16, 27, -6, -5, 20, -17, -23, 33, 0, -24, 32, 23, -45, -18, 15, -28, 6, 25, -19, -36, 34, 3, -39, 9, 24, -5, -5, -2, -1, -10, 16, -7, -1, 4, 6, 13, -22, 3, 10, 4, -23, 12, 9, -15]
6030a5M3ln1K9J8l8oO6m4k0N4l8k6M9J0m6J6J8k3mK5j1oOlj6qL6J4l7j0K1Mk6
6064b2K6Pk8LM8n8KO0k9n4N3qm0N1J8n3QN2m6k0N4j8j1JPj7J4L2k6oKK0ql1K8
6099A1J5m5J8L1n2OM9l6l2O8j6n8M9Lo0M6N2o8k3N6j8k1L3J0m7L4Pm1K8J7j2j3
6131iOmJ1roJ3k3RM9m6j3L9k2m0N0L2n3NK7m8OP6m1k9L1j1j3J8J0k7K1Nj9Pkq
6167hKpJ4J8Nl5J3j4j5L1J6m2NL3n2J9N2l1j3J1j6k6N6J2m9QJ5j7KK7j0j8J1O
6201Cj6RJ7Ll1PK2Jj0Pk1j1M2J4n9K6L0m6JO2n3j0N1j9o0N7K8o4J4K7k4qM2j6
6235A5l2J4RoJ4oj1j3mK5Kj2J6k3k4K1L0j8mRj9pL8qk4L1j8l1J9M6k7Mlj4PK0
6271A6pj3J8okKk3K4nk2K6%j9J9J9m2%M5j4m6L4jm5N8K0n0J0M1l5l1M0Qm2K1O
$$ y = [-15, 28, 25, -26, 3, 21, -17, -23, 43, -1, -21, 33, -5, -31, 18, 28, -18, -2, 16, -7, -11, 14, 3, -3, 3, 0, -16, -24, 12, 26, -11, -21, 0, 4, -22, 4, 11, -17, -14, 34, -24, -22, 38, 9, -45, 8, 0, -40, 11, 29, -24, -16, 36, -10, -30, 24, 6, -5, -4, 3, -14, 0, 32, 6, 0, 2, 22, 14, -17, 11, 26, -19, -1, 30, -22, -16, 33, -3, -35, 33, 17, -41, 8, 11, -49, -3, 49, -19, -42, 14, -4, -25, 8, 18, -29, 5, 12, -29, -1, 16, 4, -9, -3, -7, 4, -5, -11, 2, -21, -12, 37, -9, -22, 17, -5, -45, 5, 37, -16, -11, 16, -32, -26, 50, 9, -20, 11, 0, -13, 5, 15, -12, 9, 14, -5, 2, 0, -8, -6, -13, 1, 19, 24, -11, 2, -12, -27, 4, 20, -22, -17, 16, -36, -17, 35, 4, -9, 2, -14, -40, 16, 28, -21, -13, 2, -15, -13, 14, 4, -14, -3, 3, -13, -4, 13, 16, -15, -8, 14, 15, 5, 12, -9, -20, 22, 36, -23, 3, 33, -13, -12, 50, -3, -13, 38, 19, -41, 16, 44, -20, -6, 21, -3, -11, 31, 15, -17, -3, 6, 0, 14, 8, -3, -16, -20, 5, 7, -5, 11, -12, -36, -15, 15, -3, -7, 2, -17, -24, 14, 6, -18, 13, -5, -36, -17, 29, 2, 6, 3, -11, -4, 16, 9, -4, 14, 8, 6, 8, -15, 9, 4, -18, 8, 8, -11, 8, 27, -15, -15, 30, 16, -30, 4, 3, -42, 16, 36, -14, -4, 37, 2, -29, 11, 19, -23, -2, 4]
6306Dk8J1L1k2k2PL3k5NJ6lj1Pmj8K5J7l4lK2j1rL2qm6N3J2n8K9M1n3NK5k8l1
6341c9O5pm5M5ll3OK6j2LrNj2J8lnrjJ4lKj1J2j4MJ5j4rK3j3j5K1J4k6JKj7K4
6379@Mj7kJ1j0J5%qQoj6J9J4k0J8j0l1J6M7j3k5K0k7j1N2ql8M4jn4K6M5l2kK3
6414C1n4kN2ol7J2J4k3J6J9k6%MpnL0nml2MK8nnJ2l7j4N2Pl7J6Qm5L2L4l1KK4
6451B2m6qO4rm0J8%k2M3J8m0j0J9k4mM5ok1ooRL3kkk3k5K1L4l0jK1m9j3N2jk7
6487a6L7k1n2N4K4k8LLn0L5M6m2qK3l3J4L6j4j2J4m1QM0qqJ2m3j1P4j9l0L4k3
6520bm3N3K0l8K4J3p0L8N1k8Orl9LO2j1k9J0j9mK6j4LL2m4k1M1j1j5N0m2m2P7
6553B8J2n5K0Ro5M6L6n2kL9l3j1L8mk5M3l7k4N9kj9OLl4K5J9k3J0Qm5M4kj5L4
$$ y = [4, -24, -13, 18, -4, -26, -19, 14, -11, -6, 10, 7, -4, 3, -1, -19, 6, 23, -11, -14, 8, -3, -12, 20, 12, -34, 19, 31, -27, 2, 43, -10, -5, 20, -8, -39, 26, 19, -26, 19, 16, -17, -11, 15, 3, 6, -3, 2, -10, 8, 5, 0, -9, -10, 4, 1, 3, -8, 4, -10, -6, 9, -5, -14, 9, -4, -19, 2, 16, -10, -9, -7, -24, 0, 4, -13, -15, -4, -14, 1, 1, -7, 1, -5, -21, -2, 12, -8, 10, 0, -31, -15, 32, 19, -6, 14, -13, -24, 28, 20, -18, 26, 25, -29, -3, 42, 10, 8, 31, -23, -25, 27, 21, -16, -4, 10, -13, 3, 22, -4, -4, 0, -7, -12, 18, 13, 9, -23, -19, 9, 4, -1, 11, -26, -40, 12, 19, -18, -2, 6, -39, -7, 27, -4, -2, 22, -24, -32, 32, 23, -17, 1, 1, -21, 22, 40, 0, -10, 9, -15, -19, 26, 20, -1, -7, -13, -4, 29, 27, 25, 2, -23, -2, 32, 2, 1, 22, -27, -40, 12, 11, -16, 21, 0, -52, 2, 26, -2, 1, 4, -46, -11, 35, -7, -15, 8, -25, -11, 25, 11, -1, 13, -28, -20, 20, 12, 4, 16, -27, -38, 36, 17, -13, 21, -2, -45, 8, 28, -10, 14, 27, -43, -5, 46, 18, 24, 15, -24, -21, 41, 30, 1, 11, -8, -12, 14, 0, 3, 35, -9, -30, 11, 0, -15, 35, -7, -49, 28, 40, -15, 5, 14, -51, -5, 31, -21, -23, 16, -17, -28, 10, 6, -19, 24, -13, -37, 22, 20, 1, 7, 10, -24, 1, 20, -3, 7, 15, -30, 14, 12, -3, 31]
6587C1j3n7M0L3m0K6J6o4L2M3n0jL8l9j4L3j6j8L4Mm2K7J6k6J2Pk1K4nl9K4K7
6619B2n0K3K3n5K1M2m6kM6l0j0L4k4j1M0k3j7K7Jm0L8km5M4J7l3QOrJ8Lk2lL9
$$ y = [31, 18, -39, 1, 34, -6, 20, 36, -28, 4, 47, -3, -4, 34, -5, -19, 14, -2, -20, 14, 18, -24, 3, 19, -7, 5, 12, -9, 15, 10, -29, -5, 22, -28, -5, 18, -37, -16, 26, -20, -22, 24, -6, -16, 18, -6, -17, 23, 0, -17, 10, 11, -29, 9, 7, -38, 6, 23, -10, -2, 4, -5, 13, 16, -6, -9, 30]
$$ [...]
8191b
##END NTUPLES=NMR FID
##END=
