##TITLE=1H_LY-836.40
 CCl4, 8 sc, 
 7.6.2019
##JCAMPDX= 6.0         $$ Bruker NMR JCAMP-DX V2.0
##DATA TYPE= NMR FID
##DATA CLASS= NTUPLES
##ORIGIN= UXNMR, Bruker Analytische Messtechnik GmbH
##OWNER= root
$$ XWIN-NMR		Version 3.5
$$ Fri Jun  7 13:44:22 2019 Russian Standard Time (UT+4h)  she@DPX200
##.OBSERVE FREQUENCY= 200.13155
##.OBSERVE NUCLEUS= ^1H
##.DELAY= (6, 6)
##.ACQUISITION MODE= SIMULTANEOUS
##.ACQUISITION SCHEME= undefined
##.AVERAGES= 8
##.DIGITISER RES= 18
##SPECTROMETER/DATA SYSTEM= spect
##.PULSE SEQUENCE= zg30
##.SOLVENT NAME= CDCl3
##.SHIFT REFERENCE= (INTERNAL, CDCl3, 0, 15.7039)
##AUDIT TRAIL= $$ (NUMBER, WHEN, WHO, WHERE, WHAT)
$$ ##TITLE= Audit trail, XWIN-NMR		Version 3.5
$$ ##JCAMPDX= 5.01
$$ ##ORIGIN= Bruker BioSpin GmbH
$$ ##OWNER= she
$$ F:/spectra/data/she/nmr/H-F/1/audita.txt
$$ ##AUDIT TRAIL=  $$ (NUMBER, WHEN, WHO, WHERE, WHAT)
(   1,<2019-06-07 13:43:12.01 +0400>,<she>,<DPX200>,
      <created by zg, POWCHK disabled, PULCHK disabled
       configuration hash MD5:
       00 E9 B6 7A A2 85 ED C7 34 08 36 98 17 FE 4E 26
       data hash MD5: 16K
       82 F8 72 D9 24 86 0A 6C BC B7 25 D1 AA 83 1F EB>)
$$ ##END=
$$ 
$$ hash MD5
$$ E8 5D 96 6B 58 3D B2 1F 00 9B 9B 98 85 D9 B7 BB
##$RELAX= 
##$RELAX= 
##$RELAX= 
##$RELAX= 
##$RELAX= 
##$RELAX= 
$$ Bruker specific parameters
$$ --------------------------
##$DU= <F:/spectra>
##$EXPNO= 1
##$NAME= <H-F>
##$PROCNO= 1
##$TYPE= <nmr>
##$USER= <she>
##$AMP= (0..31)
100 100 100 100 100 100 100 100 100 100 100 100 100 100 100 100 100 100 
100 100 100 100 100 100 100 100 100 100 100 100 100 100 
##$AQSEQ= 0
##$AQ_mod= 1
##$AUNM= <au_zg>
##$AUTOPOS= <>
##$BF1= 200.13
##$BF2= 200.13
##$BF3= 200.13
##$BF4= 200.13
##$BF5= 200.13
##$BF6= 200.13
##$BF7= 200.13
##$BF8= 200.13
##$BYTORDA= 1
##$CFDGTYP= 0
##$CFRGTYP= 5
##$CHEMSTR= <none>
##$CNST= (0..31)
1 1 145 1 1 1 1 1 1 1 1 1 1 1 1 1 1 1 1 1 1 1 1 1 1 1 1 1 1 1 1 1 
##$CPDPRG= <>
##$CPDPRG1= <>
##$CPDPRG2= <>
##$CPDPRG3= <>
##$CPDPRG4= <mlev>
##$CPDPRG5= <mlev>
##$CPDPRG6= <mlev>
##$CPDPRG7= <mlev>
##$CPDPRG8= <mlev>
##$CPDPRGB= <>
##$CPDPRGT= <>
##$D= (0..31)
0 1.2 0 0 0 0 0 0 0 0 0 0.03 0 0 0 0 0 0 0 0 0 0 0 0 0 0 0 0 0 0 0 0 
##$DATE= 1559900591
##$DBL= (0..7)
120 120 120 120 120 120 120 120 
##$DBP= (0..7)
150 150 150 150 150 150 150 150 
##$DBP07= 0
##$DBPNAM0= <>
##$DBPNAM1= <>
##$DBPNAM2= <>
##$DBPNAM3= <>
##$DBPNAM4= <>
##$DBPNAM5= <>
##$DBPNAM6= <>
##$DBPNAM7= <>
##$DBPOAL= (0..7)
0.5 0.5 0.5 0.5 0.5 0.5 0.5 0.5 
##$DBPOFFS= (0..7)
0 0 0 0 0 0 0 0 
##$DE= 6
##$DECBNUC= <off>
##$DECIM= 24
##$DECNUC= <off>
##$DECSTAT= 4
##$DIGMOD= 1
##$DIGTYP= 9
##$DL= (0..7)
0 120 120 120 120 120 120 120 
##$DP= (0..7)
150 150 150 150 150 150 150 150 
##$DP07= 0
##$DPNAME0= <>
##$DPNAME1= <>
##$DPNAME2= <>
##$DPNAME3= <>
##$DPNAME4= <>
##$DPNAME5= <>
##$DPNAME6= <>
##$DPNAME7= <>
##$DPOAL= (0..7)
0.5 0.5 0.5 0.5 0.5 0.5 0.5 0.5 
##$DPOFFS= (0..7)
0 0 0 0 0 0 0 0 
##$DQDMODE= 0
##$DR= 18
##$DS= 0
##$DSLIST= <SSSSSSSSSSSSSSS>
##$DSPFIRM= 0
$$ [...]
##$SUBNAM2= <"">
##$SUBNAM3= <"">
##$SUBNAM4= <"">
##$SUBNAM5= <"">
##$SUBNAM6= <"">
##$SUBNAM7= <"">
##$SUBNAM8= <"">
##$SUBNAM9= <"">
##$SW= 24.9336996594482
##$SWIBOX= (0..15)
0 0 2 0 0 0 0 0 0 0 0 0 0 0 0 0 
##$SW_h= 4990.01996007984
##$TD= 16384
##$TD0= 1
##$TE= 0
##$TE2= 300
##$TE3= 300
##$TEG= 300
##$TL= (0..7)
0 120 120 120 120 120 120 120 
##$TP= (0..7)
150 150 150 150 150 150 150 150 
##$TP07= 0
##$TPNAME0= <>
##$TPNAME1= <>
##$TPNAME2= <>
##$TPNAME3= <>
##$TPNAME4= <>
##$TPNAME5= <>
##$TPNAME6= <>
##$TPNAME7= <>
##$TPOAL= (0..7)
0.5 0.5 0.5 0.5 0.5 0.5 0.5 0.5 
##$TPOFFS= (0..7)
0 0 0 0 0 0 0 0 
##$TUNHIN= 0
##$TUNHOUT= 0
##$TUNXOUT= 0
##$USERA1= <user>
##$USERA2= <user>
##$USERA3= <user>
##$USERA4= <user>
##$USERA5= <user>
##$V9= 5
##$VALIST= <valist>
##$VCLIST= <CCCCCCCCCCCCCCC>
##$VD= 0
##$VDLIST= <DDDDDDDDDDDDDDD>
##$VPLIST= <PPPPPPPPPPPPPPP>
##$VTLIST= <TTTTTTTTTTTTTTT>
##$WBST= 1024
##$WBSW= 4
##$XGAIN= (0..3)
0 0 0 0 
##$XL= 0
##$YL= 0
##$YMAX_a= 59132
##$YMIN_a= -74054
##$ZGOPTNS= <>
##$ZL1= 120
##$ZL2= 120
##$ZL3= 120
##$ZL4= 120
##$ABSF1= 10
##$ABSF2= 0
##$ABSG= 5
##$ABSL= 3
##$ALPHA= 0
##$AQORDER= 0
##$ASSFAC= 0
##$ASSFACI= 0
##$ASSFACX= 0
##$ASSWID= 0
##$AUNMP= <proc_1d>
##$AZFE= 0.1
##$AZFW= 0.1
##$BCFW= 1
##$BC_mod= 2
##$BYTORDP= 1
##$COROFFS= 0
##$CY= 11.3945322036743
##$DATMOD= 1
##$DC= 2
##$DFILT= <>
##$DTYPP= 0
##$F1P= 18.9103706918063
##$F2P= -1.10871071338519
##$FCOR= 0.5
##$FTSIZE= 0
##$FT_mod= 4
##$GAMMA= 1
##$GB= 0.15
##$INTBC= 1
##$INTSCL= 1
##$ISEN= 128
##$LB= 0.24
##$LEV0= 0
##$LPBIN= 0
##$MAXI= 10000
##$MC2= 0
##$MEAN= 0
##$ME_mod= 0
##$MI= 1.114404
##$NCOEF= 0
##$NC_proc= 0
##$NLEV= 6
##$NOISF1= 3.799351
##$NOISF2= 2.8
##$NSP= 1
##$NTH_PI= 0
##$NZP= 0
##$OFFSET= 15.70392
##$PC= 1
##$PHC0= -8574.694
##$PHC1= 11.60019
##$PH_mod= 1
##$PKNL= yes
##$PPARMOD= 0
##$PSCAL= 0
##$PSIGN= 0
##$REVERSE= no
##$SF= 200.130013532006
##$SI= 16384
##$SIGF1= 3
##$SIGF2= 2
##$SINO= 400
##$SIOLD= 16384
##$SREGLST= <1H.CDCl3>
##$SSB= 0
##$STSI= 0
##$STSR= 0
##$SW_p= 3612.71676300578
##$SYMM= 0
##$S_DEV= 0
##$TDeff= 0
##$TDoff= 0
##$TI= <>
##$TILT= no
##$TM1= 0
##$TM2= 0
##$TOPLEV= 0
##$USERP1= <user>
##$USERP2= <user>
##$USERP3= <user>
##$USERP4= <user>
##$USERP5= <user>
##$WDW= 1
##$XDIM= 8192
##$YMAX_p= 0
##$YMIN_p= 0
$$ End of Bruker specific parameters
$$ ---------------------------------
##NTUPLES= NMR FID
##VAR_NAME=  TIME,          FID/REAL,        FID/IMAG
##SYMBOL=    X,             R,               I
##VAR_TYPE=  INDEPENDENT,   DEPENDENT,       DEPENDENT
##VAR_FORM=  AFFN,          ASDF,            ASDF
##VAR_DIM=   8192,          8192,            8192
##UNITS=     SECONDS,       ARBITRARY UNITS, ARBITRARY UNITS
##FACTOR=    0.0002004,     1,               1
##FIRST=     0,             0,               0
##LAST=      1.6414764,     0,               0
##MIN=       0,             -74054,          0
##MAX=       1.6414764,     59132,           0
$$ Real data points
##PAGE= N=1
##DATA TABLE= (X++(R..R)), XYDATA
$$ [...]
1110I21n21q75R07m01j285J352J078j487m1J143j208o44J628J9j078P93K22j365
1128h42K71J236m04n87N59Op31J73P19k86m39O27J43j107K05J125o25n58J105
1147E90k83j203R92N26j284N80J120j325m63J175m36m61J127k61j003N99J53n78
1165d35N61L02m58J25k20m55P11K63n02M09j45r25P20N75r60M69Q04j284k44J178
1185D89o12k91J214n73j052Q98K16p18N33L33n91P0O3k30K70J9O4L41p53k68J166
1206E88n58q58J570j06j808J385P52k283J062K059k452n18K587j567j432K817
1222A238m12k334K004O14k589J166J736j866l4J383j356l69J490m79n46P45l66
1239B5l77L74k57L11N18q29N2N30j017M10J304j364l09J651j286r50K159n97j500
$$ y = [921, 400, -475, 432, 31, -1254, 98, 1176, -311, -352, 791, -417, -1061, 567, 586, -492, 301, 523, -842, -571, 665, 261, -326, 233, 239, -492, -319, 400, 114, -325, 302, 445, -662, -457, 668, 43, -515, 590, 307, -896, 96, 622, -662, -82, 1038, -287, -750, 425, -11, -472, 655, 394, -609, -10, 143, -435, 126, 428, -30, 95, -125, -580, 131, 394, -108, 301, 156, -769, -49, 526, -434, 35, 839, -445, -689, 489, -123, -414, 800, 227, -825, 73, 289, -429, 104, 437, -154, -84, -21, -251, 19, 38, 102, 443, -310, -578, 588, 30, -828, 742, 636, -1172, 213, 965, -1318, -256, 1803, -649, -1167, 1420, -147, -1579, 1238, 826, -1508, 496, 1110, -1479, -313, 1423, -443, -477, 906, -450, -819, 671, 192, -354, 391, 25, -352, 22, -235, 76, 594, -235, -183, 347, -670, -260, 1044, -320, -629, 1022, -264, -1214, 945, 348, -1152]
1258a152K111k94k334J932Q91k407J305J375k539O08J882k307J46K458j998p96
1274a119K430j611j128K888j029k042K682k79k685K341R01k801J608J483l036
1289a397N59K449k106l63K265j537j047J929o17r51J481k51r35O78l90j18J048
1306F97q13k41J190j341l81K113j354j149K815j098k598L104L15l389K724J487
1322B081m313J609L198m091L7M278l276j783M439j901k932M370k28l947L048J140
1338A729l848J947K210l318P11K432k790k84K583j561n58J987j405q64J775q50
1354a04n98J653q78p40J366j051n92K003q45j097J809r64j342K396n30j921K474
1371A039j69k818K434Q41l225K250J791m130J173L268l852j20M280l230j881M727
$$ y = [-1152, 959, 665, -1669, 263, 1154, -1253, 52, 1427, -1112, -504, 1378, -929, -783, 1675, -323, -1119, 1311, -300, -1428, 1460, 431, -1611, 1071, 792, -1893, 448, 1349, -1452, 156, 1639, -1397, -838, 1611, -495, -858, 1407, -130, -1177, 752, 135, -816, 665, 414, -521, 157, -233, -351, 697, -116, -357, 833, -508, -889, 1224, -130, -1279, 1536, 438, -2160, 944, 1259, -2130, 594, 2081, -2232, -623, 2575, -1516, -1479, 2799, -477, -2260, 2179, 278, -2654, 1716, 1488, -2459, 589, 1729, -2119, -172, 2038, -1280, -569, 1863, -927, -1211, 1372, -189, -747, 1240, -165, -1029, 746, -104, -702, 951, 73, -667, 699, -352, -944, 1059, 214, -883, 926, -38, -1380, 1016, 486, -1435, 1039, 870, -1948, 486, 1327, -1898, 352, 2143, -1987, -814, 2454, -1398, -1518, 2762, -468, -2349, 2378]
1387B378j975l390M669L6m411L340J542m616J977K961m042L96L597l046j168L418
1403A666j591j717K894n86k128J917L26j632R50L53r01N87p5l20Q29p60l91J416
1421H37j242p63K690r24k358K698jl310K733J833l929J378K897m146l14M248k629
1438c02j537M272j865l205L809j70l609L386J461l970J648J987l880P43L392k642
1454d82n75L138k086j932K670n06j580K394J81k125R03K97j296R59N78p58P75
1471E55m5j162O09k7q03J369K52j268J112O6k035J029R99j634J395J465k752L2
1489h43K034k443j66L501j692j716L096j432l224L349J061l238K268J935l921
1504a431J78K687k611l48L648j240k002K006p74k126K026R59j357J079M78j969
$$ y = [2378, 403, -2987, 1682, 1718, -2693, 647, 2189, -2427, -450, 2511, -1531, -1135, 2462, -584, -1752, 1666, 75, -1642, 1252, 666, -1462, 455, 781, -851, 99, 452, -449, 138, 63, -257, 572, -188, -579, 837, -405, -1168, 1522, 598, -1760, 938, 937, -2373, 360, 2193, -1736, -358, 2539, -1607, -1921, 2327, -302, -1839, 2433, 568, -2637, 1172, 1002, -2607, 779, 2240, -1730, -82, 1905, -1975, -1232, 2160, -482, -1057, 2081, -5, -1937, 733, 227, -1353, 1041, 1222, -903, 0, 297, -999, -40, 538, -220, 555, 510, -652, -43, -70, -873, 496, 748, -520, 592, 658, -1377, -348, 651, -983, 412, 1877, -875, -843, 1191, -1252, -1418, 2083, 391, -1325, 1771, 339, -2885, 464, 1525, -1713, 555, 2490, -1431, -1253, 1434, -1177, -1525, 2123, 883, -1119, 887, 113, -2013, 13, 972, -385, 694, 1172, -797]
1520g97q2P69l84O94P91o77k28j68o91M23L59j83R95M7j424M23L18j413R34J546
1540A252j395Q1J461j994j130K280l78j053K235k06k445J186N86j998J306J852
1556A640j758p5J236j896m72K019o61n88J851o54j659J033j28j118J631Q30j401
1573a70K99L67j505K06J227l94K25P30j027o98N60j46J29P85k39k88K29o45k36
1592e91O66j64J10P64o78n90P94n21o57J309J19r57R39nj675P92J106j285L73
1611a51J339j402n85J414q19p99J716p0j362R89K62j349O29P38j015L68R27r48
1629a18l25O57m50j14P83k80k60M07m20l10N12q8%M95n10m02O47k42l80P83j29
1650B56p08P35K6r65O61N80r52K52O50q54J4Q32p03k29R27m40n02O65k48m21Q16
$$ y = [-797, -879, -110, -494, 200, 991, 314, 86, -82, -773, -350, 9, -174, 821, 868, -556, -133, 185, -1228, -294, 1252, -143, -62, 1399, -595, -1725, 555, 177, -876, 1359, 1153, -1292, -106, 480, -1518, -212, 1640, -118, -193, 1043, -853, -1325, 694, 33, -555, 1296, 642, -1017, 16, -112, -1230, 401, 1231, -170, 129, 496, -1009, -803, 424, 30, 255, 985, -42, -740, -180, -326, -197, 588, 349, 61, 290, -355, -591, 75, -89, 21, 785, 107, -483, 311, -210, -867, 442, 561, -396, 543, 538, -1137, -345, 761, -524, -151, 1188, -214, -799, 615, -204, -1003, 713, 643, -719, 270, 532, -817, -188, 550, -465, -97, 830, -118, -443, 214, -236, -350, 433, 153, -107, 300, -120, -430, 82, -6, -6, 489, -21, -423, 224, -18, -398, 385, 256, -452, 283, 309, -656, 5, 585, -367, -115, 535, -319, -305, 527, -176, -405, 522, 82, -420, 245, -3, -424, 392]
1671C92j39p03O22Kp02O63K53p76N22L23j025K86Q19p23k5P66p21l12R11m16n02
1692d85Q47o8o82N12P0n93M62K60n85K40L21m30J00J56l89K93K71m76J66K87n20
1713b43J58L88o00J41P19o51k74P73m62m66Q82j65o92Q43R5j029M69M79p25L52
1733hN99q08p3O26n63j65P77k46l02M46l96l44O40l7l39M43j36m57M19j3m25N58
1755A96J79o68K42K39n37L18M62o38K9N61n33j78O19k46k13M51k88l57M97J6k69
1776a18L02j69k83M25j41l11N63l1n76M23O3o21O06M18r11J57O73p74p0Q88n11
1797Bl72Q03l85o66Q02J66o65M49J24o85L43L79n09J82L81m70r4K70k24J72L37
1818C40l76j01J88k85J82L55l88P7L43o28j16P42l07k00P14m90p27Q46J17p49
$$ y = [392, 253, -450, 172, 174, -528, 135, 388, -388, 134, 457, -568, -282, 537, -186, -211, 555, -166, -478, 433, 17, -485, 362, 294, -388, 124, 194, -399, 63, 323, -262, -22, 299, -131, -31, 125, -264, 29, 300, -176, -10, 277, -243, -85, 303, -297, -156, 563, -88, -362, 411, -51, -517, 365, 200, -492, 351, 446, -583, -114, 365, -360, -8, 591, -217, -290, 336, -227, -392, 385, 139, -163, 283, -113, -457, 183, 146, -193, 250, 114, -343, 76, 63, -362, 196, 375, -293, -51, 188, -349, -31, 431, -207, -178, 383, -150, -328, 291, 45, -168, 283, -5, -362, 135, 151, -118, 184, 15, -268, 157, 16, -295, 268, 237, -339, 84, 147, -474, 132, 550, -361, -204, 469, -305, -375, 513, 2, -370, 433, 48, -618, 184, 350, -315, 134, 258, -427, -84, 295, -214, -32, 349, -121, -215, 55, -169, 3, 340, -36, -137, 51, -234, -52, 303, -85, -8, 335, -293, -409, 333, 26, -174, 540, 50, -677, 169, 286, -463]
1838d63O92L48r70K10N10p34K39Q22o45l11N18m00j28O60k83k29M96l91m10O30
1858A61r2k87O42k73p21O47J51o20N51K92q12K86L31p16L69O69p08n8M81o80P4
1879c13Q66n96k63Q09n80n61R50j63n26Q90k13j018P39L08p69O58L49j011L37
1898a07M88r47M11R18r14j07P36q96j15J201n51n54R46m32q01R30K8o12P91q5
1918C28r42N66K27n81P21J32r93O11K64j067P28Q26j253K69R07j423L1J629j031
1937e1o31J529q07j114J588j53j190J413J45j716Q86P30j345P59R47j528J33J090
1955F85j199%J384q47m58J004q39m80J331l47n96R12n74p38J130k55o85J296l00
1974D24j345J100J57j248J348N26j851P42R32j707N83J548j592j17J504j573m64
$$ y = [-463, 229, 577, -393, -183, 327, -407, -168, 654, 9, -302, 216, -184, -312, 348, 65, -164, 332, -59, -469, 161, 69, -218, 424, 151, -570, 77, 228, -392, 159, 451, -361, -75, 256, -460, -91, 578, -130, -188, 293, -387, -313, 553, -43, -306, 503, -77, -638, 312, 149, -377, 513, 300, -718, 21, 329, -440, 218, 567, -444, -107, 381, -566, -155, 763, -151, -258, 478, -418, -533, 668, 117, -437, 509, 77, -724, 206, 234, -378, 413, 328, -614, -48, 179, -402, 319, 451, -542, 69, 333, -734, -6, 820, -433, -164, 743, -680, -649, 980, -51, -682, 847, 40, -1074, 514, 361, -829, 584, 729, -987, -101, 629, -716, 43, 990, -538, -405, 685, -514, -514, 870, 23, -435, 569, -270, -750, 581, 234, -362, 550, -24, -762, 368, 113, -572, 724, 424, -921, 179, 336, -912, 436, 962, -889, -147, 785, -922, -339, 1209, -383, -500, 1004, -569, -1033]
1991a033K073q83r66J746q33j442J933l6j620J686L10k135J083R41j800R24J405
2008A353j968LJ534j482j93J833j054o59J480r68r65J670k31r43J279m06j274
2025i91J276N8j108J301J53j504R12L23j388J246P84j861O32J004j814O55J683
2042A361j892j28J904j833o44K567j069j405K225q44k005K381M33k246J645P07
2058A157k588J013J554j992O43J781k090m24J801j320l45K028r91r99J521p92
2074d3j146J690r9r50J339m06j486J232J81j136J403K88j652R34L22j693J258
2091C6J170j858N44J130k057L97J979j794l11K134j668r98K493r46j557K330n57
2108D67k169K288N87k407J498Q61k637J073J889k143K98J933k136o47K159j107
$$ y = [-1033, 1040, 157, -809, 937, 104, -1338, 595, 559, -1061, 625, 935, -1200, -117, 824, -976, -52, 1353, -615, -612, 922, -560, -753, 1080, 26, -633, 847, -121, -1086, 584, 353, -590, 689, 283, -991, 285, 343, -765, 536, 689, -815, 97, 420, -968, 278, 1062, -799, -167, 837, -977, -322, 1361, -531, -659, 1245, -588, -1232, 1335, 266, -1139, 1086, 242, -1763, 618, 1051, -1195, 450, 1157, -1431, -418, 1136, -856, -213, 1568, -522, -946, 855, -465, -810, 1218, 227, -772, 749, -43, -1189, 501, 402, -548, 791, 385, -1101, 131, 312, -824, 579, 867, -785, 149, 471, -1222, 36, 1206, -652, -108, 1022, -1035, -638, 1341, -453, -764, 1370, -298, -1296, 1197, 251, -1306, 1024, 467, -1702, 586, 1173, -1234, 264, 1125, -1512, -439, 1450, -693, -395, 1538, -598, -1245, 914, -193]
2124a93o09K131r56j494J542l40j139J637P4j216J090j96j429J120L99j022J219
2141F18J67j665Q93M38j601J233J196j859N07J102k190L22K242j681m38K169j695
2158b42j249K534p60j631K442k69k453J943P65k373J424J208k560O99J943k052
2174f31k3J995j740p28K087r63q84J946o90j474J431p6j106J432P8j365R37J37
2192C63j272J016M97j118Q50L35j561P47P95j396P67J062j688K67J257j726N9
2209g46K054j389p09J909j277j237K323m00j737K014M3k332J530R76k073J079
2225B8J350k272J59J817j545k05J860j279q44J683p66r37J699k75j270J155r1
2242B67j170J228L19j276P89L73j281O69O69j070N36O88j331K24R38r72K22J037
$$ y = [-193, -802, 1329, 373, -1121, 421, 81, -1058, 579, 653, -563, 527, 331, -1098, 22, 421, -601, 618, 785, -880, 13, 451, -1150, 83, 1279, -580, -73, 1029, -1161, -839, 1403, -278, -716, 1453, -242, -1491, 1043, 283, -1348, 1094, 825, -1628, 315, 1080, -1293, 131, 1339, -1221, -522, 1421, -631, -654, 1341, -399, -1127, 960, -3, -887, 1059, 369, -1105, 326, 250, -856, 576, 654, -711, 226, 363, -909, 107, 604, -514, 336, 671, -890, -143, 652, -744, 23, 1085, -603, -336, 921, -805, -746, 1308, -81, -790, 1119, -158, -1395, 928, 528, -1209, 805, 848, -1484, 46, 1022, -1051, 28, 1378, -894, -735, 1082, -463, -668, 1192, -87, -931, 752, -14, -951, 748, 473, -797, 358, 267, -903, 325, 644, -632, 157, 530, -751, -82, 587, -483, 53, 741, -590, -366, 572, -400, -178, 859]
2260H59j203k01J255r95l69J527p45q74J391n40j107J600J1j494J184L57j633
2277i77R91Q69j631N78J224j633m4J525j199l84J631r12r19J516m04j176J324
2294C79J94j221Q36K84j237O81P22r64K87N25r60K14P09o89K10O47r49j49Q41
2313C60n55O0R32q85n87R92l87m33J202k93j046Q51o6r73J102N37j249L98N29
2332D89j151L93J020j000p6J026q36m03J019n57n23J084k40p07Q82j57r93P36
2350FK95o95P40L00j193K17O28o86L16P62q28k03O63n44j78Q47l52m53N89j96
2370C5k93O30k75o26N44J10k98O41j31q76L51K21m96P43N20r44p6K95o97L54J058
2391G90n96m10N65n83l95R50j31n39P31l6p99M81K16p09L42M82m59K27L69p70
$$ y = [859, -344, -545, 710, -285, -654, 873, 128, -746, 645, 105, -1002, 598, 609, -885, 299, 656, -977, 14, 883, -748, -170, 1054, -579, -623, 902, -297, -681, 950, 38, -881, 635, 231, -945, 379, 573, -648, 188, 472, -765, -84, 638, -326, -39, 486, -474, -260, 449, -240, -30, 617, -332, -481, 360, -195, -135, 797, -88, -675, 317, -70, -503, 699, 406, -640, 211, 145, -828, 274, 811, -438, -40, 489, -662, -269, 751, -249, -325, 701, -135, -538, 481, -76, -599, 485, 245, -462, 420, 263, -730, 6, 301, -394, 346, 646, -547, -330, 298, -388, -72, 690, -138, -341, 322, -222, -400, 447, 95, -358, 231, 35, -258, 372, 97, -529, 15, 125, -173, 468, 337, -539, -188, 33, -463, 280, 800, -144, -220, 75, -622, -268, 790, 194, -216, 349, -234, -629, 321, 190, -349, 382, 346, -453, 28, 244, -465, -123, 359, -100, 127, 496, -274]
2411b74k32M83j15K35N23n30l95K37k74N0P16j11l86K54l72l29O91J00m81L48
2431A38P0m94L77J87o23J27M36l23J65M09n48k61L37k41J07P01k51n14J64k38
2451b75j65P20J10m49J96o4n17L32L28l17J99J84m76O0L35l23p1L21j91O6L33
2472C36l38k91K68q2l2M29j23k92J89j97k30M70J38k90J83p5m11L18K64m10J44
2493c2L04m07mL68l41j13M44j95k31L98l8l54K00%j93L02J27l07L2P1j81J18J39
2516A07j28P3O4k22J3J25r0J25P9k68O5J63k27O0K22j91m3K25k73r6M17j03k48
2539a51K31q7k41L54N4l27K07Q6l70J87K49k95P6K27l88l7M74j76k30K64j34k00
2561b27L38Q8l18P9J10j79L0J96lj04r1oO4L2J08N4k98j04L32l3j70K68p2l85
$$ y = [-274, -506, -23, -138, 97, 620, 90, -305, -68, -342, -292, 424, 313, -73, 181, -191, -520, 171, 271, -210, 138, 208, -286, 91, 278, -345, -218, 218, -105, 60, 469, -79, -340, -3, -244, -137, 564, 313, -201, -37, -275, -440, 280, 390, -59, 137, 73, -444, -112, 216, -101, 98, 282, -194, -134, 201, -122, -193, 128, -63, 3, 336, -2, -293, -25, -107, -139, 290, 167, -125, 64, -133, -363, 107, 245, -45, 138, 63, -348, -30, 234, -176, -32, 272, -135, -139, 229, -112, -225, 219, 24, -207, 191, 153, -201, -1, -1, -194, 108, 235, -72, -40, 31, -150, -32, 107, -21, 52, 116, -106, -93, 32, -58, 67, 146, -122, -57, 106, -121, -61, 161, -30, -73, 152, -121, -217, 200, 97, -151, 80, -7, -248, 106, 160, -167, 40, 126, -244, -57, 192, -103, -27, 200, -188, -225, 249, 73, -157, 107, -27, -227, 111, 199, -119, -40, 70, -109, -79, 117, 114, 10, -81, -87, -23, 9, 117, 171, -127, -231, 101, 68, -102, 166, 94, -291]
2585b91K81K23l51J52K54n37m4N83j72k02L27l12l87N85K12m19J79N2n04J63M63
2606B55j86m3J67l82j61L85J42n9j4k38j06K15J01N8Mk59p6K13j9M0K36k59k92
2629b78K30Q2k5K46j44m11J88J95q6J88k9m08J15K44k09K18K02n05j13M22j62
2650d0J1M48m44m86N28J81l21L66lo82J96M98l04R4L17n02l09M72R2n9K14k35
2672C2m01J93K71K4O6j47k34N7O5J18K20j79k41R2o1J6M36q5n11J58J55k42L49
2695A51K65o26p7M76k94k3N54l43n00M45L1k60M93M1o88J18L59k16K10K25n29
2716a88j12L64j44Q1L43l61k83K98p7JM68k26m98K31R3j30L78O0n42O2K53j99
2738a28J59K77l39j56J87j01J12K78k55j89J26r0J26K94l12k08K96j53p6M65j59
$$ y = [-291, -10, 213, -138, 14, 268, -269, -313, 270, 98, -104, 223, -89, -476, 109, 321, -98, 81, 133, -371, -208, 255, 69, 26, 193, -189, -350, 35, 177, 118, 104, -134, -240, -25, 76, 134, 138, -121, -197, 16, -3, 37, 273, 14, -278, -48, 34, 9, 255, 111, -300, -112, 83, -3, 185, 156, -252, -137, 107, -102, 116, 318, -187, -300, 122, -40, -29, 419, -25, -511, 17, 198, -123, 243, 240, -442, -246, 252, -52, 42, 359, -143, -452, 20, 112, 53, 267, 32, -369, -176, 95, 119, 185, 38, -196, -139, -74, 44, 264, 85, -156, -64, -125, -109, 327, 242, -269, -111, 44, -198, 151, 416, -210, -287, 189, -105, -128, 426, 83, -417, 28, 59, -201, 292, 333, -355, -237, 122, -94, 116, 341, -188, -300, 64, -80, 1, 344, -17, -300, -2, -79, -78, 390, 164, -334, -103, -10, -140, 238, 298, -244, -182, 71, -128, 31, 308, -31, -187, 0, -101, 11, 289, 34, -155, -29, -119, 7, 301, -11, -219, 77, -76, -152, 313, 154]
2759A54m53L45J9l82N03K67p08O3L81m32J88N70n59l42N53j99k57O34p9o19L51
2780bJ10m48M19L53n99m0L26k96P6M19l11k16K76j16q4K73j04j27J93j78p2L41
2802A93j46k19L04j15k45M21j1m80K99K21m08K12K32m76J10L37l76N4M16m20j22
2823b19M47l38j05O11l20n10O23j7n63N61J82p24L16M27o70J00N90m52j60M88
2843B67l45k00N05j65k93M31j23l68L76k0k89M06N3n02J84J79k73K65J76l95M7
2864h4J14k72K90K71m17R2J40n63K55P14n25k51N72m93l75Q89n5o58N33Q5p39
2885d77M27M43n78J36L38n51J62N18n35j42M57l56k6O75l89n15N07j08l83O55
2905B58J89o26Q1Q9l34L76L26l63l0nk55L67K38m70R0J97m35K68N49n23k50L61
$$ y = [154, -299, 46, 65, -317, 186, 453, -255, -192, 189, -243, -55, 515, -44, -386, 167, -32, -289, 345, 266, -353, -2, 108, -340, 79, 432, -167, -207, 119, -177, -101, 318, 7, -209, 67, -49, -133, 140, 36, -91, 102, -76, -148, 193, 47, -172, 132, 17, -228, 193, 182, -298, 1, 222, -186, 26, 258, -218, -108, 229, -147, -93, 323, -97, -219, 228, -110, -215, 396, 76, -434, 189, 172, -391, 170, 352, -372, -56, 371, -299, -199, 391, -61, -221, 267, -78, -278, 227, 62, -231, 200, 77, -291, 85, 65, -224, 182, 235, -267, -83, 96, -177, 88, 264, -131, -84, 30, -242, 48, 319, -98, -6, 134, -429, -174, 540, 15, -236, 336, -157, -532, 357, 302, -356, 177, 262, -477, -50, 393, -185, -49, 289, -262, -100, 418, -117, -259, 198, -158, -184, 491, 102, -413, 94, -14, -397, 258, 447, -179, -98, -9, -343, 33, 359, -4, -34, -39, -294, 73, 311, -159, -69, 128, -307, -39, 510, -13, -263, 98]
2927I8l95mQ51j68n54J77l11k50R02J63n86K58j61p40O22O06o08J65L93q20r0
2948d52Q66l41l95N47j63l17N61o0n77J57Q7q2N14P7m94k9j40k81O38M61m42r0
2970D5o6n35K94O31k26j11J39m13kM70k46j27L40l43r4O84k02n37L11j84l52Q74
2992C50L41p27o7L4n72M64P57l47j21J03o77l5P14j00p3L90m92m05O44n1m83M58
3014A05R2m23M07J94o07k5K27j93L01L99l30j94r5l71L45N86k11q7N6n77k5O54
3036B28j38j63L90k88l92M66Kl36L58k9m00M66J88n41J25J14m91M08O00n28j79
3057a40L42n15j08P31p9k98L41k62m65M49J66k80K95ql97K65J05l95K09K38l31
3078a37J86K45m53l8L10k76M8M30k25j87J63k69j3M69j62k01L05k83k39N14o3
$$ y = [98, -297, -301, 550, 382, -172, 5, -306, -556, 346, 509, -77, 181, 20, -720, -98, 508, -100, 65, 458, -362, -452, 414, 73, -322, 225, 62, -255, 306, 246, -331, -174, -87, -169, 345, 422, -72, -101, -241, -522, 116, 577, 135, 45, -21, -556, -262, 369, 143, 32, 171, -242, -244, 226, -20, -147, 193, -150, -244, 440, 238, -299, 12, -172, -524, 350, 691, -36, -103, -69, -641, -177, 580, 233, 112, 215, -462, -497, 217, 117, 44, 434, -58, -463, 181, 130, -353, 105, 197, -226, 181, 375, -232, -257, -30, -223, 78, 477, 147, -47, -142, -513, -168, 418, 207, 120, 176, -401, -426, 228, 90, -73, 317, 29, -363, 103, 105, -231, 127, 98, -302, 164, 352, -189, -64, 50, -441, -33, 567, 39, -140, 202, -313, -421, 310, 231, -67, 274, 12, -453, -4, 162, -118, 177, 169, -228, 37, 142, -253, -44, 194, -137, 49, 294, -159, -197, 113, -163, -115, 315, 90, -97, 66, -203, -216, 253, 91, -110, 195, -88, -327, 187, 124]
3099A24m05M65L3n68L40K98n16J57L69m76M2M46l67j64M07k20j15M01k46k73M34
3120A66q3l02L82k5m01L31J02l80K79J80m38P9K78k65J10K01l65kL19k22nK64
3142B03l03j07L71j74j15L56j92l25L09K4j73L45r3m07K42J05k35L15R3m99K21
3163c9K51m77J96M52n28j15N48l13k13N24k33m80M98J65l68K42L9m63K09K80k07
3184c2J33Q7l58PK13j31J76J94l78r1K40j50Q0K62l30r4L18j98o1L75k77k66M13
3207A32o9k76M53j7o12K64L11l39K12K69n30p8M10j76pL10k66j89K66j62j9M03
3229B90k56k94L59r1k10M73r0n55L45K21l84K43K62n05J3L34k51N8L46l32k09
3250b33K89j23qL60k73k58L08p4j25L48j00l27K55j7k28L78K5m04K01P4l52L87
$$ y = [124, -281, 184, 217, -351, -11, 287, -229, -72, 297, -179, -137, 309, -58, -222, 185, -35, -150, 251, 5, -268, 166, 83, -219, 163, 138, -263, 68, 170, -210, 69, 249, -189, -110, 168, -97, 13, 214, -151, -153, 166, -56, -61, 203, -100, -207, 164, -10, -125, 231, 39, -286, 23, 47, -126, 219, 126, -281, -39, 66, -169, 146, 239, -260, -39, 212, -265, -69, 383, -145, -260, 288, -25, -238, 286, 53, -427, 71, 236, -132, 110, 149, -314, -105, 175, -32, 101, 188, -170, -163, 50, -81, 95, 289, -89, -180, 60, -90, -10, 252, -78, -172, 146, -52, -113, 262, -15, -281, 132, 63, -213, 240, 223, -389, -125, 186, -153, 59, 328, -202, -280, 130, -46, -53, 257, -9, -198, 68, -94, -113, 290, 34, -260, 99, 8, -202, 271, 181, -374, -29, 192, -192, 51, 313, -192, -179, 155, -96, -38, 308, -24, -233, 56, -67, -75, 285, 12, -246, 62, -12, -137, 211, 111, -216, 39, 22, -206, 172, 197, -207, -6, 68, -284, 103]
3272A03K51o01R8M05m59L2N77m20l34N42j39l81N22O0n12J95J66k74K39J52l48
3293a26M9J03j62K30R0l44J52J54l76J77L73l99p4L72l48r2N47k44l71M17p1l25
3315b68M73K1m93K78J40m14K76L16m44qK51l13O9M09k60j66K22k00l7L43j84j29
3337a18K85k49j54M28j17k97L99r0m43M26K14n14J71K84m42J08L95l62j01L45
3357A68k12j12L20j30j50K36j58j26L38q9k22K39j02k13L87j2l82K60Q9l83K69
3378A5K62m37J03L06m62J0N29k91k28L82k22k65M73j9l47K47O2l26J76J72k19
3399g9J00P5k47J11J48j87J30N1k71J38J95l17P5K81l05l2L44k67j51M07j56k82
3421b39L74j9l24K75M1l11K48J62l42Q3J74k48J01J96k43J6K13k67j5L11j95q7
$$ y = [103, 354, -247, -149, 256, -203, -171, 406, -14, -348, 194, 55, -326, 196, 256, -256, -61, 105, -169, 70, 222, -126, -77, 26, -136, 94, 184, -160, -8, 146, -230, -53, 320, -79, -153, 219, -129, -221, 326, 82, -289, 128, 57, -268, 205, 226, -267, 11, 151, -263, 13, 329, -115, -123, 128, -185, -116, 293, 33, -133, 89, -111, -148, 195, 11, -118, 167, -82, -236, 192, 75, -222, 177, 87, -356, 70, 284, -230, -59, 225, -217, -109, 286, -76, -177, 168, -44, -156, 164, 34, -116, 120, -38, -164, 174, 85, -137, 102, 0, -213, 174, 162, -220, 40, 129, -254, 15, 277, -160, -57, 249, -213, -203, 326, 35, -193, 189, -33, -298, 175, 156, -191, 56, 118, -208, -32, 140, -79, 21, 96, -151, -40, 108, -79, 51, 102, -169, -31, 164, -153, -78, 203, -102, -134, 210, -57, -208, 199, 43, -239, 135, 116, -208, 67, 108, -203, 45, 207, -135, -52, 122, -126, -25, 171, -72, -56, 157, -110, -125, 186, -9, -96]
3443i6K84k34j80L79o3k50K64j4l14K60J06k92J39J94l06K2K15j81K4J93k25l6
3465a11K27j34p0J93j22n9J60j23o8K20j06r8K01j23j45K94r0k61L26M6l55K16
3487A8J50l56J37L16l53o1L36k15j46L09q8j55K19q3k00K13J1j16J65m6j98J92
3509D9K5k32J84J23k46O8J31k19O1J84j77l1J72j34lJ42j47l7K18j46r8K31r1
3532B7j65K21o5j91K64L2k46J45Q3k49J37J25k38J23J80k94J1K25k25JL15j97
3554A9j73L09j19k86K96J04k32J58O1k88O6J58j13O5J01j59QL8j60J28J67j76
3576b8NJ30k12j3K48j54p7K54j23j63K16q8j50K60k5k44K33P8l00J27J41k71J01
3599e5K63k59n1K57j93j13K50r2q7K19r3j85J74m6j21K22J7j90J63jl06J66K08
$$ y = [-96, 188, -46, -226, 153, 90, -160, 104, 90, -224, 36, 142, -150, -11, 183, -123, -101, 114, -67, -43, 150, -75, -111, 116, -18, -88, 105, -17, -76, 84, -39, -107, 113, 7, -91, 110, -13, -158, 136, 46, -215, 111, 157, -198, 18, 168, -188, -51, 265, -88, -149, 187, -28, -174, 135, 47, -108, 111, 28, -172, 41, 52, -64, 101, 55, -143, 49, 74, -158, 26, 149, -97, -29, 102, -117, -56, 128, -49, -80, 92, -42, -45, 97, -50, -87, 131, -15, -113, 118, 27, -138, 83, 18, -173, 91, 123, -123, 22, 105, -144, -7, 118, -120, 3, 183, -111, -100, 125, -100, -99, 216, 19, -154, 155, 36, -250, 46, 150, -82, 76, 137, -151, -85, 73, -40, 25, 126, -33, -25, 13, -147, -19, 148, -28, -23, 107, -105, -118, 130, -24, -101, 153, 30, -133, 83, -5, -155, 105, 80, -164, 69, 147, -153, -26, 115, -156, -55, 208, -51, -102, 155, -38, -151, 99, 7, -80, 139, 46, -139, 35, -11, -132, 90, 107, -83, 80, 79, -227, -61, 147]
3622A47j91P3J35k48m6J85j02j5K02r5r7Q3j34j5K38r0j09J94j18j82K43nk07
3645a54K52O4l31J20J54k25R7J71k48K8K25k28n5K73j48j39K75r8k11L05J8l15
3667a70J55J24k05Q7J52j95qJ15j04OJ08n0K6M1j90M7J63j48NJ80j58r0K06r8
3691aj45K30J1k06J41K3j88J70M8j98J38R8k54O5J95k25M7K51k56j32K93q9j68
3714a52K57qk47J62N0j97J44J30j84K9N9j59J07J28j61NJ38j72k7J87r8m3J29
3737G7o6j22J36qm2P4p0l6J35p2j11J74k4j65K00Rk57J41J64k54M7K33k01p9J98
3762H1j27p2K53q4j69J37l4j23K04K0j93J38M1k73J36K11j77qJ44k02o7K59m4
3785E1j06J07n7p7R4jk0O8p4p1J26k8n8J47p0j83J56Q5j57J05N1j74N5R9j40N8
$$ y = [147, -44, 29, 164, -84, -130, 55, -47, -62, 140, 45, -52, 31, -103, -118, 120, 30, -79, 115, -3, -185, 58, 53, -154, 98, 162, -169, -49, 105, -120, -23, 148, -100, -72, 153, -75, -130, 143, -5, -144, 131, 33, -178, 127, 145, -170, -15, 109, -96, -9, 143, -52, -60, 55, -49, -43, 65, 15, 41, 82, -108, -61, 102, -46, -41, 139, -19, -109, 97, -1, -146, 84, 95, -111, 30, 53, -135, 35, 83, -115, 23, 121, -133, -68, 127, -98, -51, 200, -56, -188, 105, 16, -152, 105, 97, -150, 12, 62, -135, 9, 139, -45, -16, 43, -116, -9, 119, -42, -37, 101, -71, -98, 89, -9, -52, 77, 11, -111, 25, 17, -25, 49, -21, -57, 78, 6, -105, 69, 45, -120, 80, 89, -168, -27, 137, -117, -70, 163, -38, -117, 81, -46, -118, 135, 51, -118, 19, -15, -138, 66, 86, -107, 31, 72, -201, -65, 146, -31, -39, 105, -97, -164, 95, 51, -55, 52, -5, -82, 12, 11, -9, 59, -15, -86, 40, 12, -46, 101, 31, -152, 4, 89, -68, 37, 88, -86, -31, 68, -72, -14]
3811a4J37j98J6J62j62l3K20j72j18L28n1k66J78J4k51K16K22k13n2Q7j93l7K48
3834F8M2k6rj75q2J54J7P4R7j77j20J34k7o2J88oj94R3O1j19R1K0j59O8J55q3
3860B3K4J8k18L6J99o1NJ35j91j43J64Qk8J68p4j97R4O4q5J01k1j49J51R9j60
3885c8M6M5k49P2K83r0o3J20k16k09K65J79q3O2q3k55N0J86K5L8J9j62l0M7LQ7
3911D9L3j41jR0j5J0K5j57OJ82k0PM1k05r0K03K1l3J58j06k46J06J37q4J00O3
3937A33k57nK07n5n0R3j15o9J63K0q3P6j09j27J82Q0p0P5q7k13R8K04m5pK9j67
3963i9l9J40M1j1J8p2o6N5L7M7Rj37k0J30j9NN0j21p7J54M6p3O7n6j42J14R9r5
3991a5Q0Lk10M9K01q1k7R5j71q8K40K9j56P1J0j58R7J39q8k6J0p8J2J03K4m7o2
$$ y = [-14, 123, -75, -59, 103, -59, -92, 128, -44, -162, 166, 115, -151, 27, 41, -210, 6, 228, 15, -37, 50, -143, -180, 68, 110, 84, 75, -100, -182, -28, -11, 63, 160, -17, -137, -3, -30, -92, 96, 90, -104, -11, 50, -69, 22, 42, -117, -49, 106, 23, 47, 65, -153, -117, 82, 21, 26, 161, -30, -173, -9, -1, -29, 139, 65, -132, -38, 26, -59, 42, 21, -128, 23, 122, -38, 8, 53, -196, -124, 159, 69, 6, 126, -90, -299, -34, 145, 62, 124, 41, -214, -164, 22, 47, 85, 104, -58, -88, -41, -38, 49, 82, -59, -60, 30, 15, 25, 50, -107, -101, 81, 61, 68, 109, -96, -186, 17, 38, 5, 163, 57, -189, -83, 54, -30, 70, 133, -124, -129, 78, 23, -27, 66, -49, -118, 45, 65, -18, 58, -51, -178, 4, 84, 14, 89, 2, -211, -113, 91, 46, 39, 68, -99, -138, 2, 43, 32, 50, -22, -88, -33, 4, 51, 60, -77, -97, 33, 14, 19, 69, -52, -129, 25, 71, -2, 65, 9, -133, -19, 80, -15, 65, 68, -142, -93, 108, 27, 0, 95, -76, -164, 76, 105, -51, 20, 30, -128, -31, 108, 20, -6, 4, -74, -62, 41, 65, 18, -44]
4018d4n5O5R5k7l4j2q4L5J31k8k6j0q5KJ16J2k0Qj17k7J67J3q4O1o9j26J87R1
4046A35j92M9O6j83O5K26j13j10Q1r2p3K56M2j87Pjq6J17J30j17p0L1l2K6Q0o
4072D9n9n8JJ04L2m8j5p9q0J76J18j40l5M6j60N6K59q1j56J01q2j43K85J00k26
4097c5nM2j42J16K14j62j14P8o3K6J63m0j36K8m5J5J68k0j08J4q8j1K22J4j93
4122f2N2mj09J58J37k00n0Q8j01L6J95p6j31J4k8N1J39l8r4l7q2J01J88j09q3
4147d5P7j43m9L04pk31J31j0k54K37K47l11l3J88k23j7L71j44k64K15nk03K29
4170F0J28k60pJ12r1K5J72j03j09OK1R7J7q6K6l9q5J55R9k04K2J34k25J0L23j35
4196F3j94K00r6j71K98P0l06J00J08j94Q5J87j51o7J17j18mJ74p5o4O8j14L1J72
$$ y = [-44, -99, -34, 61, 34, 0, -12, -96, -61, 70, 42, 16, 6, -79, -77, 39, 51, 31, 39, -78, -105, 62, 75, -9, 52, -17, -143, 44, 135, -57, -8, 58, -125, -60, 166, 53, -57, 24, -68, -141, 115, 157, -30, -23, -24, -110, 7, 137, 20, -50, -19, -51, -25, 55, 49, -10, -68, -67, 37, 69, 21, 6, -73, -153, 23, 141, 1, -34, 12, -148, -92, 167, 86, -70, 31, -51, -194, 91, 191, -35, -40, 2, -140, -24, 190, 28, -86, -8, -71, -45, 118, 78, -58, -30, -75, -60, 108, 88, -20, -6, -94, -105, 117, 131, -62, -10, -14, -123, 35, 172, -28, -78, 10, -91, -55, 140, 64, -67, -53, -81, -30, 109, 71, -23, -60, -142, -41, 147, 38, -45, 32, -111, -160, 144, 137, -94, 37, 27, -227, 10, 257, -54, -87, 101, -122, -139, 232, 88, -176, 39, 34, -169, 60, 188, -72, -79, 33, -58, -33, 139, 36, -73, -67, -46, 51, 68, -18, 8, -31, -116, 39, 138, -66, -44, 90, -135, -125, 198, 63, -131, 69, -27, -198, 100, 170, -136, -36, 72, -122, -37, 150, -1, -68, 49, -69, -73, 101, 26, -38, 30, -84, -53, 119]
4220A19j38n1J75j49r0K54n4k30K27K8k60J73J74k66MK08k03l8K55j05j50J49
4242C2J0j16R8J6p5K8kk0M6l5J0P5j27n7K24q5j42K17m1k43K25J02k90J20K14
4267A84l00m3L20j61j53L10j08k74K59J06k69J17J45k28K0J55q3m0J03p5l1L4
4289a2%N9pj12P5M8j26P3J28j95k8K09j42q2K23n8k07J76M8j66J21P0j91L1J40
4314G5r6OQ5j29%J00n6J1O8j11rR8q4J3J60j78q9K09n9j07K10n6k60K00J10k13
4340a02Q9J79k51n8K41r2r0J91o1j68J24Q0q6j2K9m1J4L3J8J0j08lJ23o3k2J46
4366A20q6j72J41N5j39J49O2k59L9K09j48m4J75j20j06J92Mj57J12J0j67J21J15
4389A06q9j7Lj16N5J30k8%k3j13K8R6n0M4O9j42m3J57o5o1J22o8r7J71M1j35j4
$$ y = [119, -19, -70, 105, -44, -134, 120, 66, -164, 63, 91, -169, 4, 178, -88, -84, 124, -79, -117, 138, 33, -117, 32, 42, -74, 24, 40, -35, -7, -9, -29, 17, -18, -8, 67, -60, -117, 107, 22, -120, 97, 56, -187, 38, 140, -150, -30, 184, -116, -159, 161, 0, -153, 157, 49, -225, 34, 140, -129, -12, 133, -95, -75, 80, -3, -43, 60, -15, -46, -12, -12, 47, 40, -72, 3, 51, -75, -2, 126, -69, -97, 112, -30, -112, 111, 53, -154, 22, 70, -96, 25, 95, -96, -65, 75, -21, -15, 70, -59, -59, 41, -15, -4, 64, -47, -56, 42, -42, -29, 131, -47, -136, 73, 14, -93, 117, 61, -199, 1, 111, -102, -13, 166, -85, -143, 98, 6, -84, 107, 46, -122, 2, 82, -4, -16, 13, -28, -14, 19, 37, 47, -61, -64, 59, -4, -26, 120, 34, -138, 3, 58, -81, 68, 130, -129, -90, 119, -29, -73, 102, -18, -124, 68, 72, -85, 27, 37, -130, -9, 106, 17, 0, 3, -113, -58, 72, 44, 44, 21, -92, -64, 32, -18, 26, 95, -47, -90, 67, 2, -59, 63, -5, -102, 69, 110, -25, -39]
4416c9J4m0Q7R2n1m4n9p1P5R2lM4m9j73N7J21o4K8P5j56m1K01p6j31J47k6j32
4443a22J98N9j85NM1j37J02K13q7j34K3q4j0J94L6r2k5l3l8P0K7J3Kr1J5Q9j7
4470C2n6K9p3k8J89N1j44l2k3r2J34J84r3p2nj26J8J92J2l8j7j07m5J43L5q7M7
4497B8m5n2J21K5j27OL7o3R3J36j26r9J7o0M4J96j1j40j5m0j5J32P7r0n0j2j3
4524d6M5M5ql3p1J5J14%o0Ln4n8J52R8j27l5J1j05O1J92n1j24M9o0n8J51Q7j28
4552Em2J5l6N9P7o6m4PpN2N2o7m3K2n0O5J03o9o9Rn4M3J35k8j22J6%k7J11N4j23
4583b2j3K3m7O4Q3o2n5j6J0L0P3k9n0j0l0O6O3q0k9M1n7KJ42m5j18O8j2p9J48
4612E9O2j54l8R1o8K2J42q0j16O7K5m5N5K2o9nJ8PL1j6l9J0rK4P7m3r4L5K7m0
$$ y = [-39, -25, -65, 22, 114, 63, 19, -40, -111, -36, 56, 53, 97, 48, -125, -68, 53, -11, 17, 92, -64, -105, 96, 20, -111, 36, 10, -122, 76, 135, -50, -45, -4, -141, -39, 174, 87, -47, -24, -108, -118, 76, 112, 20, -5, -38, -76, -6, 21, 34, 36, -55, -40, 49, 32, -24, 5, -68, -96, 93, 144, 0, -32, -55, -147, -13, 171, 78, 6, 1, -125, -107, 85, 97, 59, 42, -65, -110, 33, 68, -19, 28, -17, -69, 52, 77, -50, -44, -7, -70, 23, 159, 33, -66, -49, -109, -65, 131, 120, -20, -35, -75, -90, 42, 119, 29, -21, -33, -46, -1, 44, 36, 3, -68, -53, 61, 61, 1, 4, -50, -108, 44, 142, 15, -20, -9, -114, -53, 139, 88, -36, 13, -47, -105, 46, 133, 5, -37, -22, -58, 1, 78, 12, -32, -25, -32, 20, 72, 5, -38, -16, -66, -1, 102, 33, -36, -27, -81, -38, 97, 69, -53, -37, -37, -64, 47, 101, -22, -35, -12, -59, 5, 88, 26, -29, -45, -35, -5, 68, 39, -11, -21, -51, 15, 78, -2, -31, 10, -47, -45, 97, 52, -66, 2, -10, -89, 59, 121, -33, -71, 20, -48, -26, 116, 36, -80, -13, 12, -33, 22, 44, -25, -30, -12, -5, 26, 10, -29, -19, -28, -4, 73, 30, -64, -29, -2, -42]
4642d2R6L6j38pP8q4K5J38p6j01R3l4l9J13J2j16L7M6m4K0L2p7RM5k9L4J5o2m
4671b4L0l8O3M6r5l5O9m4J6P7n6o2R2k7n8P0J1r6M5O3o4K2M3r4k4Q2oj2M3n4l7
4702e4L9J1J0L1l8k6K6l7j1J08l3q5Q0rq1R7M1j16L8P2j04jR0n2k7Q3m4o6Q3j4
4732A1m9O8mn3N1l0m1M5L2m9J3J1n7N3K7n7M1K9r0L4N0o4J1P8o3n7Q8k6n9R4q
4763B9p6O0Mp3L8Q4p9j3M4n7LP9l4j9K6l2k4L9OJ4J5n3k9O3kj3M3l1n9N8ln0P1
4796B9J5q5K2N5q2L1O8o9j1O7m3m5O2k6l0Q6j5o9L0J0l2L7M6o6jJ5m8L4N1ol1
4827aj7m3M3N4j8j3Kn8OP9j9j6L5m3o1O8L6l5K5ro8L4O0k5k3J4l3J6L0qj6jj7
4860b2K2L3l0kMn4K2Q7k6o5K3k9j7R1J3p0NJ4n1K9R1m5m5K7m0k3R6K5p5nj6j7
$$ y = [-42, 54, 90, -48, -55, 23, -61, -36, 102, 26, -75, 18, -16, -55, 58, 70, -46, -9, 37, -7, 13, 45, -32, -23, 22, -7, 27, 42, -20, -24, 6, -32, 31, 77, -18, -53, 16, -28, -12, 65, 9, -53, 39, 12, -46, 24, 35, -61, -16, 47, -17, 5, 48, -46, -70, 12, 6, -6, 37, -17, -54, -15, -4, 6, 37, -1, -27, -1, -38, -49, 59, 26, -59, 21, 12, -69, 28, 69, -47, -9, 63, -41, -42, 48, -4, -31, 52, 8, -58, 25, 11, -38, 30, 26, -27, 24, -6, -47, -2, 30, -19, -6, 5, -52, 1, 28, -29, 12, 41, -49, -15, 35, -29, -18, 60, -3, -60, 28, 2, -57, 37, 29, -47, 13, 17, -56, -18, 66, -13, -26, 18, -39, -36, 43, 9, -10, 16, -16, -40, -1, 5, 19, 34, -19, -48, 15, 13, 0, 43, 12, -47, 11, 8, -42, 29, 44, -41, -19, 36, -46, -15, 53, -16, -27, 40, -3, -48, 14, -12, -42, 44, 29, -40, -10, 0, -32, 5, 51, -15, -16, -1, -49, -15, 36, 30, -1, -18, -61, -18, 36, 18, 5, 7, -51, -45, 34, 15, -1, 34, -9, -70, -2, 34, -1, 24, 15, -53, -19, 41, 16, -7, 7, -26, -10, 20, 12, -4, -5, -22, 0, 33, 3, 1, 5, -49, -27, 60, 34, -31, -8, -37, -54, 37, 50, -20, -15, -1, -52, -23, 68, 23, -22, 5, -35, -58, 38, 63, -12, -17, -33, -50]
4892e0N8L1km5j6RK9j9K5J2o7j0P4Jl3L2k3p3P9O4j01%M3m2KQ8l4q0N1%m2N6M9
4925F6o8m5K0ML4M4l1n7k3J2P1lqLm6l5N6N4m5Ppo5J3J06j4p1L3j0m4O5L3o2j3
4958b6L6k5MM1ll0j6OM2Rl8mk3MO3K3p3j4L4l9PJ11o0o7N1k7n5J28L2j08k2M9
4990A0n8L6Q3o1o3L4L3m0L4K9m4l6K7L1kLkl7k1M9L9m2k6M5m9rQ0j8o1L9L8o8
5022b7K7N8p1k6N7rl3R0k7r7K3N3j7L6Ko9oJ9QM5J5m6j3oj9O6J6o3j3L0l2NP5
5055E1m5l9N1Kn8N9Lp6K3N3k6%M9o4k7M1J6j1Rok7QJ2K0j2k5K8Ol0L2M7r0k9P3
5089A8k1j0P4l1j02O2M7o6L5O3r3l0Q2j9n2R4j7q9L6M9l4KK6k9j7L0K6m3qJ1k
5120hNJ3lj3j8K9J2k9M7jp3JM9pk4N2l2m0M8J6n1M4J5o5J9L6k0QK9m8l0M6J6k3
$$ y = [-50, 8, 39, 37, -8, -24, -15, 14, -5, 20, 32, -35, -45, 29, 30, -3, 29, 6, -67, 12, 76, -25, -25, 18, -24, -22, 66, 32, -48, 3, 3, -39, 17, 66, -2, -47, -27, -23, 11, 55, 24, -33, -56, -44, 27, 24, 16, 19, -27, -62, -6, 48, 3, 10, 3, -62, -49, 57, 43, -28, 5, -5, -49, 16, 49, -13, -26, 10, -15, -11, 30, 27, -3, -19, -13, 29, 38, 0, -4, -27, -23, 40, 63, -10, -24, 10, -29, -22, 89, 29, -38, 13, -14, -69, 59, 91, -17, -39, 10, -48, -12, 71, 10, -53, -19, 14, -26, 8, 37, -7, -43, -16, 15, 13, 16, 14, -23, -44, 5, 44, 2, -24, 21, -28, -37, 43, 25, -36, 3, 41, -27, 0, 58, -13, -39, 18, 9, -24, 66, 39, -58, -35, 18, 1, 37, 39, -30, -36, -17, -9, 36, 51, 5, -8, -14, -33, 33, 49, -14, -27, 3, -29, -24, 51, 6, -33, 18, 20, -38, 21, 24, -52, -29, 24, -2, -2, 47, -17, -44, -3, 13, 2, 11, 5, -22, -14, -2, 18, 6, -19, 9, 15, -15, 17, 64, -26, -55, 18, -3, -13, 61, 30, -72, -10, 37, -29, 6, 69, -24, -54, 28, 9, -43, 51, 34, -55, -19, 30, -4, -2, 24, -5, -22, 8, 34, -9, -17, -6, -8, -3, 10, 7, -6, -24, 5, 17, -12, 35, 34, -39, -38, 11, 4, -20, 32, 0, -40, 8, 24, -27, 17, 32, -33, -14, 22, 2, 10, 39, -9, -39, 7, 23, 0]
5154@J8k6pK0lQOj6j4L4j5k2M8nn0J2K8l9J1N0o2MN9l7l9M3Pl4L3J1l7%J4k0r
5189b9L5kjj0qK5Kj2K3j4k8K4J1l4J8K6n1QM1l9pO2l8m7O2J0p5O1K0n5J2L7m6
5222a9jN3k0l8L8%j6NMj0j2J3jPk3K4J0k2j5N5l1k9L4J7o2M5K5o3J5M0l7j6M4
5255A4j2k4M1j5l3M9Ml0PPj6MJ7j8JK1k5J6%j9K2ql7M0K9n3J4K8n4NP8k4p2P0
5289B7j6p2O9L9p3K4M3p1k4R0j8m4L9qk1J0J5l4QJ1J1kj6J0Kl1QM8k1j8K3m8j8
5322e8Q2J1o6N7No9K7N2p6J5P6p0k4N1j0l5M4jl6K5K7m0oJ3LK8j4rOj3j4OL2l3
5356a4K9K3o2nM5j7l4O0j9k9K8mn2L5J5oJ5Kk6Okj6M3lk8K8j9l6N4K0o6L4L9o2
5390b4pO0m4k4R6m5n5P1Nr4O9L5o3J8N2p6j7P8k0l5K8J5m0OJ0lj6K0K7l7j3N9
$$ y = [0, 18, -8, -15, 5, 2, 10, 16, 0, -14, 20, 5, -17, 31, 26, -24, -12, 16, -23, -12, 38, -24, -20, 39, 2, -37, 6, 13, -21, 12, 23, -14, -14, 0, -20, -29, 6, 4, 3, -7, -15, 10, 12, 0, 23, 9, -19, 5, 16, -18, 0, 26, -25, -17, 24, -15, -22, 40, 2, -45, 17, 27, -48, 13, 33, -22, -10, 27, -19, -20, 33, 13, -25, 13, 13, -3, 2, 6, -4, -16, -3, -4, 3, -20, 4, 14, -8, -23, 32, 1, -28, 6, 23, -39, 6, 31, -32, -17, 23, -14, -30, 14, 2, -22, 19, 4, -29, 20, 24, -6, 1, 8, -8, -4, 13, -5, -4, 17, -8, 8, 8, -11, 11, 3, -34, 6, 35, -18, -4, 24, -30, -25, 53, 29, -43, 27, 11, -61, 8, 47, -26, -2, 41, -30, -54, 36, 18, -26, 13, 5, -16, -6, 9, -25, -17, -6, 5, 3, -13, -3, -1, -32, -24, 24, 3, -15, 8, -40, -58, 24, 35, -31, 26, 31, -38, -11, 41, -35, -20, 56, -14, -38, 13, 3, -32, 12, 11, -25, 0, 27, -13, -19, -6, -3, 25, 11, 2, 8, -5, -19, -13, 19, -14, 15, 38, -24, -29, 16, -1, -35, 25, 6, -23, 5, 1, -51, -16, -1, -7, 8, 10, -16, -10, -12, -28, 15, 12, -16, 12, -7, -43, 11, 31, -35, -1, 38, -24, -31, 29, -15, -39, 57, 12, -43, 28, 33, -61, 8, 43, -20, -2, 50, -26, -43, 35, 15, -20, 8, 23, -17, -11, -1, -4, -20, 0, 27, -10, -23, 36]
5422C6k8m4K8L1m6J4N4o7l8Q4j9o2P7J9r2M3N3q3L1P3q2k2P4k8m6O5k6l5M9J2
5452B5n0K5J2j7J2J0k8K1J5l2PJ4k6L1pk8J0J4noK9k6j4Rj2J3K2l3QJ5k4MM8l8
5486bk5N2l9j6N4j7o0P2J0p4M6L1o9J7O7o1j0N7l6n9Q3Qo2M2J7o1J0M1l0J3J5
5517A4lk9J4J4mj1PppLM1l0l0M4km6L7L2n8PM5n9%R3o6m0N4po3Q3Rp5L4N0o5K
5553a9M9m3j1M5k9j5M2k2k3L3Jk0J5Jk2MJ9j2J2Kj6jJ4k0K6J1l1J5kk4M2Mm2P
5587a0J8k8K9Nk6mL6l1jM1k2l2N6l9j9N0No4L0L1o2K8L9l9rO1n4k0N7j4l7L6j1
5620@l2K5K4l8K1Oj7JQkKJRj6J1lOoj0J8J0k9RJ1k9K3K2m2J1K7k7l0O4ql6M2k2
5657Dm3N2K4o9L5J3m1J1N3n3j6O3l0m5N2J5m2J5kk5K8J8l9J5K0k7JQ%jJ3qj4P
$$ y = [36, 8, -36, -8, 23, -23, -9, 45, -22, -60, 24, 5, -57, 20, 39, -53, -10, 43, -40, -9, 64, -18, -40, 34, 6, -40, 25, -1, -36, 13, 25, -25, 0, 12, -5, 7, 17, -11, 10, 25, -7, 0, 14, -12, 19, 12, -16, -6, 8, 3, -3, 26, 0, -14, -5, -17, -4, 18, -15, -7, 8, -16, -12, 36, -2, -27, 25, -14, -30, 24, 7, -53, 19, 29, -45, 1, 32, -37, -20, 47, -14, -24, 33, -3, -62, 21, 29, -33, 9, 26, -35, -25, 16, -14, -1, 14, 11, -18, -4, 10, 6, -5, 2, -5, -12, -9, 32, 2, -28, 16, 14, -32, 5, 37, -21, -14, 31, -28, -28, 65, -1, -41, 13, 6, -57, 26, 35, -40, -6, 44, -21, -19, 30, -13, -24, 21, -8, -23, 19, -3, -26, 7, 8, -12, 3, 4, -18, -14, 5, -7, 5, 7, -9, -10, 4, -16, 10, 21, -10, 5, 3, -21, 21, 25, -17, -10, 8, -20, 9, 14, -12, -16, 20, -11, -12, 29, 7, -25, 31, -8, -27, 23, 28, -36, -6, 25, -37, -9, 30, -9, -18, 43, -11, -31, 26, 12, -25, 11, 0, -32, -7, 17, -21, 0, 6, -11, -10, -2, -4, -2, -1, 8, -8, 3, 0, 6, 0, -10, 8, 18, -11, -2, 9, -20, 3, 25, -17, -6, 21, -6, -36, 28, 20, -16, 26, 4, -39, 13, 37, -32, 3, 16, -25, -14, 39, -14, -30, 33, 3, -42, 10, 25, -17, -2, -4, -29, -1, 17, -22, -7, 13, -14, -13, -5, -5, -6, 7, -1, -15, -8]
5691hJ4%kj6J9Kj9MJ2k6K3K7m1kJ7Lk9M0oj7K5k0k2L6K1m3OK6m0NN2m4j3L5j0
5726Il8M2%j9J7Kn0K9K0l1KL3k9KJ9k9KK8pLj9J0MRrNloKJ3j0RPj9KJ8k8J5Ql
5766A0k3K0mj9K4J6l2RJ7l6QL7k4j9L8j8k1K3Pk4J4L1m0j1L3k5OK0k8nK3onRJ
5801Fk0J2qJRpOLopJ3j1OJ2mk1J5Rj4L0qk9J5J2k3PJ7j6jJ4j2nJ6Jk4K2j2LJ6
5840A7j4j2J1Qj3J2rj6K9J2l3mK2j2kK2k2j2J7nj8K7Qj5Qqk2J0K7j4oLkoOpJ4
5877AJj7J8KqRRk4K2J8l0k1L1j6j1M5j4k9L3ll4K2J7j4lJ7k8jL1k3j1K8Kk8Ro
5913foJ5j0%J5Mj5Ook2L5Oj7J0j5k0K5J9k3OK0l2k7L8llJ6Kk7K6J1k7PQJ0kj5
5950CPrpjJ6Kj3J8nl2RK7j6NK1l1j2L5j2k2K6Pl5J9J4l3RK4j6%K0kl2RJ0j1J6
$$ y = [-8, 6, 6, 4, -12, 7, 9, -10, -6, 6, -20, 3, 30, -11, -13, 4, 7, -22, 18, 12, -5, 20, 0, -22, 14, 35, -8, -2, 24, -16, -11, 41, -3, -16, 19, 9, -29, 13, 13, -6, 11, 13, -37, -8, 12, -19, -17, 16, -13, -11, 8, -21, -19, 9, 2, 5, -14, -4, 0, 9, 0, 5, 2, -4, -2, 11, 1, 10, 17, -2, 0, 18, -10, 5, 13, 10, -13, 7, 3, -16, 8, 24, -8, 1, 18, -18, -10, 27, 3, -16, 22, 4, -17, 6, 13, -11, 3, 34, -6, -17, 16, -9, -3, 17, -11, -16, 7, 1, -4, 5, 6, -14, -2, -10, -9, 0, -7, -1, 2, -4, -11, 2, -9, -3, 9, 5, -16, -1, 8, -6, 24, 16, -13, 2, 14, -9, -2, 15, -1, -2, 12, 0, -5, 11, 12, -12, 10, -2, 1, 17, 3, -9, 2, 10, -3, 9, 0, -16, 13, 25, -8, -12, 10, -2, -4, 18, -4, -16, 1, -4, -22, 5, 13, -2, 6, -2, -24, -14, 13, -1, -7, -4, -6, -12, -6, -13, 1, 2, -15, 3, 5, -3, 6, 15, -9, 13, 31, 1, -20, 11, -5, -16, 29, 15, -14, 19, 16, -18, 4, 21, 7, 4, 21, -7, -8, 23, 0, -11, 17, 19, -9, 0, -6, -12, 3, -7, -7, 8, 12, -3, 3, -3, -25, 10, 16, -1, 9, -6, -26, -1, 18, -5, 1, 21, -11, -38, 0, -3, -6, 10, 12, -15, 11, 22, -5, 2, 10, 20, 18, 3, 10, 1, -6, -7, 9, 11, -2, 16, 11, -21, -12, 15, -1, 4, 25, -6, -18, 17, 5, -17, 9, 16, -19, 0, 14, -19, -10, 14, -2, -2, 18, 16, -16, -7, 3, -8, 8]
5987HrQrj7POj4K1J5k3j3L4k5j1M5j6k4K9J1l9MJ7oj0L6k4k3K7J0l5K0J6j7kJ
6022bMNqKMk1J8Qk0jL5j5l4M3j5k1K7J9l0qK9k0j2K0%k4K7Kl4NL8k2rQJ0j0J4
6059A2j6Rjmlj3J3J0Ol3K1K1j8j2K4l6RL8k4k4L6Lm5K8K2l4K1J2l5JJ6Kj8K0j1
6094cQkooOlJ0Jk4J2Ok0j9M9%k1K5k4l1L5K1k9OM0m3qL6j6j5L3Km7K2L7l1j1J7
6131GrkRMLj9JK8k2J6J8l6j5K0J3j6J4J3m4oN4k3j3K5j3l3L5Kj7J9Ml4JK6Qk1
6167cMpj8K7K2k1j7OlJ1JJ2kk8OJ6j1NK4j9m3M6Nk0J7J5m6OL8k1LPj6mJ0J3Pj3
6205Ij2j0K3j6K0Rl8PJ9j2%K9l9j1L3lk1K9On1%N8l5nK3k8qL7nk5J1L0l1qK8n
6241HJnj3pQK1ok7J2J5j5pK9j4oJ7j5j4L6J7l9j3K6pkJ9k1k0K3J1j9J4kj8kRJ1
$$ y = [8, -1, 7, -2, -19, -12, -6, -20, 1, 16, -7, -20, 14, -11, -22, 23, 7, -17, 12, 23, -16, -12, 5, -1, -11, 25, 1, -22, 5, 15, -20, 0, 16, -1, -3, -2, 2, 7, -1, 1, 5, -16, 2, 10, -10, -11, 24, 9, -25, 18, 3, -18, 9, 28, -2, -10, 19, -1, -13, 7, 7, -17, 10, 12, -22, -17, 21, -1, -10, -2, 8, -2, 12, -4, 5, 4, 0, -3, -16, -3, 7, 13, -20, 1, 22, 4, -8, 16, -20, -11, 27, 3, -21, 15, 18, -27, 1, 23, -11, 10, 22, -13, -12, 4, 6, -12, 8, -3, 5, 3, -3, -9, -3, -6, 4, 5, -19, -7, -1, -21, -40, 9, 9, -12, 13, -11, -42, -7, 14, -15, -9, 31, -12, -20, 16, 0, -15, 18, 20, -27, -5, 32, 1, -10, 7, -2, -4, 5, 9, 12, -7, -6, 22, 0, 16, 34, -2, -17, 3, 16, 0, 14, 27, -17, -23, 31, 8, -5, 20, 7, -26, 9, 11, -6, 13, 17, -17, -16, 10, 18, -3, 1, -6, -24, 3, 25, 4, -13, -7, -10, 1, 2, 14, 12, -16, -10, 6, -5, 0, 24, 5, -38, 8, 13, -7, 10, 25, -21, -15, 23, 2, 5, 12, -4, -8, 2, 15, 22, 9, -3, -13, 10, -6, 14, 23, -15, -8, 11, -1, -1, 28, -11, -22, 11, 8, -13, 16, 22, -29, -29, 29, -6, -11, 12, -16, -24, 13, 8, -17, -6, 24, -7, -15, 13, 8, 9, 4, -9, -16, -8, 13, 7, -20, -8, 7, -8, -15, 14, 0, -6, 11, -4, -18, 18, 35, -4, -17, 9, 2, 0, 19, -2, -22, 1, 12, -7, 7, 5, -13, -15, -6, 5]
6278Ej0K0k7NkMRmkj0J7j6J4Nj1qjmjK7mjj5%mQOj6jJ2KMQnqQrJ4noQoj3K4Jm1
6324b9K9J4k5OK2j3pK9Kn1L2J9l1pL0l2jJ7Jl6K6J3k2J5qmrJ8Ok3J5J5k4PMlJ
6361djJ7k0pJ5jk4L1Pk9%J3j1K8Nl0j7L0Nk3K7Mpj5J6k1PK7k0j5LJ7%Qj2j1MQ
6399DOLj2qJ3k5OK9oj8kj9NK7Mk3JKOnJ7%j1qoJ4QJ2k0j9mK9J1prmpPK3mj2j1
6441a3%rK2K7j8j9Rj6LM5j9k6J7Kj0K1J9l4pmmJ4K0jk4j5J1%J4J0k1k1J5KK1n
6477Fj2klNJ6Kj7kj1j6N0kl9jK8k7L1K8l3j7J3jj6L8jk8jjJK0J5j5k1PrK8J0j9
6515DLOl5K4LJ0lnk9NM2rj6Rk8kM3ol2J1J1l4K2L6m0LJ3l3QL0j5%JqNJ4jk6J4
6554ej2OL1k0nNk0mK7J3j4rJ2l2J9L5k6jQj4qK9j6pJ4roJ6Qk6K4k5%K5jk8K5l
$$ y = [5, -5, 15, -12, -7, -9, -5, 4, 0, -2, -12, 5, -11, 3, 8, -3, -11, -12, -16, -17, 10, 6, 5, -10, -10, -14, -6, 0, -16, -17, -5, -3, 1, 9, 4, -4, 4, -5, 9, 4, -2, 6, 0, -13, 11, 12, -29, 0, 14, -11, -5, 17, 4, -3, 26, 28, -23, 9, 28, -3, -10, 20, -12, -13, 4, 5, -31, -5, 8, -14, 1, -7, -11, -20, -2, 4, -19, -4, 11, -13, -6, -2, -5, -4, -5, 12, -8, -15, 0, -1, -25, 6, 13, -16, -16, -3, -14, 14, 19, -11, -28, 2, 7, -16, 11, 15, 8, -7, 9, -12, -5, 22, 2, -13, -10, 7, 7, 15, 3, -8, -4, 4, 10, 13, 1, -7, 6, -19, -13, 16, 10, -8, -10, -29, -24, 3, 7, -16, -15, -13, -7, -12, 5, 5, -6, -14, -20, -6, 2, 14, -6, -25, -29, 0, 11, 4, -5, -9, -16, -9, 14, 10, -2, -13, -13, -22, 0, 27, 9, -10, -1, -17, -14, 31, 12, -14, 3, 5, -5, 16, 35, 1, -6, -10, -14, 0, 20, 19, -5, -20, -9, -9, 5, 15, -6, -27, -12, -10, 11, 6, -6, -8, -11, -6, 10, 12, -5, -7, -18, -34, 16, 14, -25, -26, 2, -25, 6, 34, 1, -16, -3, -4, -20, 18, 17, -11, -12, -13, -12, 8, 23, 8, -13, -6, -15, 13, 23, 4, 7, 13, -22, 2, 5, 15, 12, 7, -22, -17, 25, 16, 0, 9, -19, -21, 22, 16, -16, -5, 6, -28, -6, 30, -10, -7, 6, -27, -19, 11, -4, -4, -3, -11, -6, 8, 7, -19, -5, -17, -11, 20, 0, -5, 0, -20, -24, 3, 16, 2, -7, 5, -27, -8, 27, 1, 0, 8, -6, -14, 15, -1, -8, 6, -3, -9, 7, 15, -11, 13, -12, -12, 13, 12, -16, 9, 6]
6592Fk8K9nk1K8Rm5K2K5l2KJ8k0j4L3j9k3M7j6k0L2%l0L0J4m7J1J9pQkk1J4J8
6626A5l2PK6k7KJ3k9J0L6j8j0J8j1rK3Kl3K2J2m0K1J0k6J4J0m1J7L7l1J9oj9J4
6659dJ8k1OMk7rL5j3lK9k2k6L7Mj8J1Kk8K6K3l2MJ5k9MK6j4OJj5JJ6Qk3J5j0j4
6696a7K4J7k6J9k1j2J8LMJ8j7m5K0L7k6J9j0l3KL2lLJ5k8k2K9j3J1K9j8m4J3J9
6729cRJ2j3k8jK4j2J8J1k4j2J0JQK5k7j9J3LK5ok1jMOMJ9k3k2J2K2j8K6lm2J1
6765a2jJ8J6Lm5k4L3KK5Ol3j8K8j0PJ5j2l0J1J4lK6%l1oJ1rJ9J3l1j1J7LJ2K1
6800B4k5j7RmK3J5k0j9kLK4J3j4k2K0j3RRj3nK0k1lL1J2k8k6MkK8K0j8l5K4j4
6835a3KL5km0K2j0k6L3J5k9pkJ8lJ2j2kj2J5oJ1mMk2j1M4Kj8KJk0J2M2k5j7K2
$$ y = [6, -22, 7, 2, -19, 9, 18, -27, -5, 20, -12, -10, 8, -12, -26, 7, -12, -35, 12, -4, -24, 8, 8, -22, 8, 22, -25, -14, 5, -2, 6, 4, -17, -3, 15, -17, -10, 16, -11, -9, 4, -25, -15, 21, 3, -7, 11, 0, -9, 14, 16, -17, 5, 17, -23, -2, 8, -18, -4, 6, -35, -18, 19, -12, 7, 1, -18, -4, 14, -7, -1, 3, -24, -33, 2, -11, -14, 15, -7, -33, 4, 8, -10, 1, 3, -25, 1, 24, -8, -4, 11, -18, -14, 12, -2, 4, 5, -10, -9, 7, 15, -8, 7, -3, -17, 7, 24, -2, 17, -4, -16, 2, 5, 9, 27, 10, -35, -15, 22, -4, 15, 5, -28, -26, 6, 3, 6, 21, -7, -29, 0, -13, -2, 27, 9, -35, -22, -3, 6, 18, 5, -23, -24, 0, -12, 6, 17, -7, -19, -9, -8, 0, 25, -2, -21, -8, -5, 20, 14, -7, -8, -4, 2, 6, 25, 2, -20, -8, 14, -4, 22, 19, -23, -12, -13, 5, 21, 24, -21, -45, -12, -10, 15, 21, -12, -30, -2, -12, -5, 10, -2, -32, -21, -7, -10, 16, 16, -15, -21, -10, -19, 0, 13, -18, -29, -12, -9, 3, 24, -1, -18, -9, -13, 10, 25, 5, -14, -16, -13, 11, 24, 10, -12, 8, -5, 4, 13, 0, -5, 15, -6, -9, 22, 34, 6, -20, -16, -18, 10, 30, 12, -23, 1, -13, -11, 24, 22, -18, 4, -6, -32, 1, 16, -13, -20, -22, -4, -7, 5, -7, -9, -21, -6, -12, -1, -5, -1, -23, -34, 10, 12, -6, -4, -3, -23, -11, 31, 6, -11, 11]
6871A1j7mK5rk2J9kj1J6K3l7rJ9kJ4Qj6k0J0nJ3J7j9j3J5j5lL3lj4nppK4Pl0R
6908g%LJ1pqPJ4k1oK6j7NK0k0mJ4j2nPlJ1Qk0j2K9Lj6KJ8l9K0J7k0PK9k7j3J6
6946A0Lk0K6lk7RK7j1pJj7J0LJQopqLNJ4k1k6J6J8nLQk7J2K7poJ0k0oJ6J3k7K0
6986A2j1k3J0L5Lj2Ml5ML7Jk1J0j4nJ2kPJ4k4j4J1OJ1pJk7K7J9j9nQl0J0J7Pj0
7023GPj9j6K8Pj1j2rmK1J5lj0j2qPJ3J8qol1J7J7OMj3l6QN7k0nOj8l2M5K0k0L
7061A3Lm7J1M8rj6J1k6mK0J9j6okj0J7J2lj0k1kQJ1J3rj9rK7RMlj9j4OK5j8K0
7098A4rk1j8M4jj2J9j6k7K3K6j8Rj6nPORkj0%pRlK2j7olK0Lj0kj8j6L7nj6NK4
7137A9k9oK7j5QRpk9L2Mj7j5J1J0qRQj3j2J2Rj6J1krj6K6%j0K0lm1K6J2qrL7k2
$$ y = [11, -6, -10, 15, 6, -16, 3, 1, -10, 6, 29, -8, -17, 2, 0, 14, 22, 6, -14, -4, -9, 4, 21, 2, -11, 4, -11, -14, 19, 16, 2, -3, -10, -17, 7, 14, -16, -7, -7, -4, 7, 0, -8, -1, 13, -8, -14, 12, -5, 0, 20, 0, -4, 10, -2, -7, 0, -3, 8, 16, -4, -16, 13, 16, 0, 2, 20, -19, 1, 18, -2, 5, 34, 7, -6, 10, 13, -7, 19, 16, -11, -2, 25, 14, 7, 8, -9, 1, 4, 5, 13, 7, 0, -8, -5, 0, 14, -7, -33, -17, 1, -4, -1, 7, -20, -8, 19, 12, 6, 16, -4, -10, 6, 19, -8, 12, 1, -22, -12, 23, 26, 14, 18, -17, -13, 24, 25, 4, 14, 0, -5, 7, 5, 12, 26, 2, -12, -1, 5, 16, 9, 10, -17, 10, 29, 10, 5, 13, -17, -7, 10, 17, 7, 14, -5, -21, 7, 14, 3, -9, -18, -22, -1, 14, 11, 1, -11, -19, -12, 1, 19, 11, 5, -26, -9, 8, 14, 18, 5, -31, -23, 34, 14, 9, 15, -3, -35, 10, 30, 10, 13, 16, -31, -20, 28, 19, 3, 14, -12, -16, 4, 23, 7, 1, -1, -11, 6, 18, 15, 5, -16, -18, -10, 1, 14, 5, -14, -23, 4, 13, 17, 14, -5, -19, -13, 12, -6, 14, 5, -16, -34, 10, 9, -3, 16, 0, -27, -4, 22, 4, 13, -3, -8, -1, 5, 14, 12, 2, 2, -5, 4, 1, 23, 6, 0, -3, 17, 20, 10, 8, -10, -26, 11, 6, -10, -5, 19, -10, -16, 11, -4, 4, 13, 6, -23, 9, 13, -4, -19, -8, 2, -6, 3, 11, -2, -14, -2, 7, -9, 2, 0, -9, -25, 1, 1, -9, 11, 8, -33, -7, 5, -3, -12, 25, 3]
7175Cl0N3k5j5L1mk4qL3mj1K1lj8J1%rLJ3Kj3pJ1Lj6%J0jlRj2j2J8Kk2J3%mRp
7215ckmJ9j3lJ6j0Ljjj3J4kLj2J3k%j2J3NKomlj3L2Pk7%J9j7kJ7j7J1nJ0l9L5
7255HK0l1RQj4mJ1jj7J5Oj3k0J9J8k6%J1KqMopPL0l1j1K6Jk8K5j1j5J8J8j7mK3
7293A5j5lRKj4J3pnJ3j0jQj2J5J1j5j2RnkK4j0j5J4Pj7QK1k5qJ3j5J2OOk2%P%
7332@nJlnLQMj2lJ0j9jL4j4j9J2Kj9L1J2k9qL1pk1M0j1j7Qmk8K9J9k9nJ3JJ2j
7371A0mqj2KK7j4PK2l2j7K6K7l1Rql5K3J9Lj2Kj8oK3Lk8K5rj4J5N%mj4kJ8Rpo
7410fJk5L2J2k3kK7l6JL8j2j1KPk3K6K7m1KQrJ0K4qj0j5%NJ0JLk1l0L5J5j1Nj
7448Gl8NM2j0mJ4ql7K5J9l4J8Mj4j0L7k4qLrNK4j6KkpMJ3OmMk6PL4k1j0J8j4j8
$$ y = [3, -27, 26, 1, -14, 17, 13, -11, -19, 14, 10, -1, 20, 17, -1, 10, 10, 1, 4, 17, 19, 6, -1, 10, 13, -3, -3, 7, 6, 3, 12, 0, -12, 6, 8, -14, -1, -1, -5, 4, -3, -5, -9, 10, -3, -6, 10, 0, 3, 2, 1, -12, 2, 0, 3, -9, 4, 2, 2, -10, 3, 8, 10, 4, 0, -3, -16, 16, 23, -4, -4, 15, -2, -4, 13, -4, 7, 2, 12, -27, 8, 28, -3, 6, 14, 0, -4, 7, 6, -11, 4, 10, -3, -23, -4, 14, -12, -12, -1, 1, -7, -3, -9, -16, -9, 21, -10, -21, 5, 6, -22, 3, -8, -23, -5, 13, -4, -8, 15, 0, -3, 6, 8, -6, 7, 0, -5, 8, -2, -3, 5, -7, 8, 19, 4, -8, 1, -4, -6, 18, 8, -7, 7, 14, -3, 5, 26, 1, -7, 6, -9, 3, 9, 15, -7, -7, 0, 0, -5, -4, -7, -12, -9, -1, 3, -9, -12, -2, -21, -22, 12, -2, -21, -9, -7, -26, 5, 17, -12, -20, 11, 4, -17, 23, 12, -5, 3, -1, -29, 0, 19, -10, -15, -2, -1, 11, 10, 6, -2, -14, -12, 15, 1, 8, 30, -2, -19, 7, 34, 3, 12, 4, -31, -8, 11, 14, 2, 4, -14, -20, 3, 6, -22, 3, -6, -20, -5, 0, 0, -4, -18, -20, -2, 7, 0, -6, -5, -30, 2, 14, -9, -11, 16, -20, -19, 19, 7, -4, -2, 5, -18, 8, 35, -6, -4, 4, -5, 5, 29, 21, 11, -4, -4, 1, 11, 12, 15, -6, -36, -1, 14, 3, 8, 7, -31, -26, 16, 6, 2, 16, 8, -29, -4, 15, -19, -1, 3, -11, -21, 16, -8, -16, -13, -22, -17, 7, -9, -7, -9, -16, -12, 1, 7, 3, 7, -19, -12, 22, 1, -9, 9, -5, -23]
7487b3M2Jl5RJ8k9J7K9l7oK8k3j0K8lj1Rj3%J6oQj6MOOqkJ0j0k7K6lmL%qNJ4k1
7527a6jPLJRmj9J5oMnJ3KrmmL3k0rJ8j9mM0mk6J4J3m5J9K9k3qJ4ok1M1kl7K8l
7567HLmnj6KJJ8j1nK3qj4mJ7%j1J0kl0L7kj4JOnmK6k2rJ8J6l0J7J5k9mK0pnJ1
7607Hj0NkKNJ4k6J0kKQJ0k5lR%oRJ4l5JL8j9jRrk0K3jNj8KKj0%PJ1j4j1Qj6K3
7649cNl3J8OoJ4Krk1J7J9k6J9K0k8k3L8j3oJ9kk7RL4j8j0J6knJ1qj0J8%j4lJ5
7686A3Klk0RjJoJ5j7NQkoPNj8%lJ1kNj6KpJ5LmrJ6Mj9NJ0qPRk4KK8j6j6K4Lk0
7730hJ8lj5J5K1l8mL5j8pJ4jj1MJk2J9Nj9J9OjrNrQkKMqj1J4Nk2J6Ol0J5K3l1
7770a4jK7j4j7L0j4j0K1j6j0J4J7l3J4Pk0J7K1j1pQj2rL1l0J4J8k2j5L4rj1J4
$$ y = [-23, 19, 20, -15, -6, 12, -17, 0, 29, -8, -14, 14, -9, -19, 9, 6, -5, 4, -9, -9, 7, 1, 9, -7, -3, 3, 9, 1, -1, 9, -1, -28, -2, -5, -9, -6, -6, -14, -9, 5, -16, -17, -10, -7, -6, 3, -1, -20, -5, -11, -7, -12, 1, 3, -6, -10, -14, 19, -1, -10, 8, -11, -15, 25, 21, -5, 9, 22, -23, -4, 25, 2, -6, 8, 2, -19, 22, 20, -17, 11, 8, 11, 7, 2, -14, -12, -11, 7, -4, -9, 14, 6, -8, -12, 5, 5, -6, 4, 2, -28, 9, 7, -7, -6, 0, -5, -9, 17, -5, -14, 4, 20, -10, 7, 22, -7, -11, 9, 2, -3, 8, -2, 3, 1, 3, 8, 22, -4, 6, 4, 6, 14, 24, -1, -4, 5, 5, -1, 8, 22, -13, -12, 26, 7, 6, 15, 6, -14, 9, 8, 13, -5, -3, -1, -11, -11, -4, 7, -7, -18, -10, -26, -3, 2, -31, -13, -7, -13, 1, 3, -6, -27, -10, 9, -17, 2, 22, -6, -29, 9, -4, -10, 9, 7, -20, -11, 23, 5, -5, 11, 9, 4, 15, 7, -3, 15, 15, 1, -2, 13, 15, 12, -8, 1, 0, 1, -5, 10, -7, -2, 6, 4, -2, 5, 10, -8, -8, -11, 0, -2, 3, -13, -11, -18, -3, 0, -4, -13, 3, 7, -12, -7, 3, -5, 2, 11, -13, -11, 17, 1, -15, 9, 12, -8, 10, 7, -8, 7, 28, -10, -14, 21, 3, -4, 10, 9, -2, 2, 3, -19, 0, 5, -14, 5, 11, 10, 1, 6, -3, 5, 3, 5, 9, 1, -10, 4, 9, -13, 3, 9, -21, -6, 17, -14, -15, 12, -2, -19, 11, -3, -13, 8, -8, -18, -4, 13, -20, -6, 1, -19, -2, 19, 8, 1, 9, -3, -12, 19, -11, 3, 21, -1, -16, 18, 9, -2, 12]
7803A2rj5K3J6k8LJ4j1oJ1rJ5j0j1J1Rj6lJ0l1J7K5l4J5Pl1ML1j1k9N2k4k4K6
7837aJ4k7J9Ll8J2M5l1k2L0j7pL7pj3K0j0k9K8Kj3K4j8j7J5J3k0PMk5J9Lj1J4
7871CJ8l3jK4j2NKpk7M2j0j3K3j6j8K5Kl1K9j7j5J4K7l1RJ8l9JM1l4%K0k1J0K1
7906Ij7j6L3j8qL5nj6kjj3J6K8j6oKk1J3L2k5j2J9oj8M3l0j3K9k6mK9Ok8KJ1k4
7942a8L5Kl7J7Jj7J8Qk5J2J1k9J0K2k3OOk3lM0k0j8K3pjK8pk3J4J5m3L5Oj4J3
7977A4J0k9J0K4l1j2K0j4PL0l1jK7l1oL3j2j3K3j6j5J7Mj8J3%j8J1J3j6lK6k6
8010a0j1K3j0qJ9j3j9M2j1pJj5J0J3J0l8J9J4k2rL4k7J7Nj2ONLj1J5j1KOjj5K
8046dQ%PkKk%j3QJ1j9RJrJ5Lk0oK0kj3J0j2lJ9jk1J6J1k0NrKJ6j6LNj1MJqqK3
$$ y = [12, 3, -12, 11, 27, -1, 2, 16, 5, -1, 10, 1, 16, 6, -5, 6, 15, -1, -4, 6, -25, -8, 17, -17, -2, 5, -26, -22, 9, -2, -31, 21, -3, -27, -1, 13, -14, 5, 8, -30, -18, 27, -4, -26, 4, -13, -20, 17, 10, -3, 17, 7, -22, 6, 8, -5, 19, 1, -16, -1, 12, -8, -1, 3, -22, -3, 0, -11, 3, 21, -12, -13, 11, -1, 4, 6, -1, -28, 14, 4, -9, 14, -2, -20, 5, 7, -24, 5, -12, -27, -13, 14, -17, -8, 10, -29, -28, 13, -21, -21, -1, -22, -12, 9, -8, -24, 9, -9, -17, 18, 13, -3, -5, -6, -19, -3, 25, 9, 3, 5, -16, -3, 29, 4, -8, 11, 5, -13, 30, 0, -13, 16, -10, -14, 15, 21, -7, -5, 6, -18, 17, 19, -18, -1, 0, -17, 1, 9, -16, -4, 7, -22, -12, 10, -13, -7, -1, -24, -27, 13, -7, -25, -2, -9, -10, 18, 11, -12, 2, 17, -26, 9, 15, 1, 14, 24, -5, 5, 29, -2, -14, 6, -8, -1, 29, -2, -3, 24, -7, -13, 20, 8, -5, 18, 2, -13, 4, 8, -10, 3, 3, -15, -4, 9, -7, -10, 16, -10, -21, 2, -8, -16, 3, -10, -29, 13, 2, -5, -4, -19, -9, 4, 14, -24, -5, 9, -13, -22, 12, -15, 2, 7, -5, 1, 6, 9, -2, 13, 2, 4, 10, 9, -6, -4, 4, 4, 11, 9, 11, 9, 9, -4, 4, 15, -4, 5, 6, -3, 12, 15, -5, -11, 9, 7, -6, 4, -8, -11, 8, 7, -14, 2, 13, -7, -2, -11, -9, 7, -9, -6, -1, -12, -8, -7, -15, -23, 0]
8089@Kj7J0J5j0PknLJ9k0jOjklPoPNj1nJ1KpJ3lj4RJ0j6%J0kNj7LmJ1j0lPnlJ7
8134A2k0LJ3qr%KKOj4RjjQj3J6lLk0J3Jo%NJj0J5mrJ1K2l2POoj0J3J6k1JNKlJ4
8178A6Mj5J1qj2kJ7j9J0j1J2j6Q
$$ y = [0, 2, -15, -5, 10, 0, 7, 5, 0, 3, 22, 2, 1, 7, 6, 4, 1, 8, 2, 9, 14, 3, -2, 9, 11, 4, 17, 14, 0, 9, 19, 3, 3, 13, 11, 16, -1, 2, -2, 9, -1, -4, 3, -2, -5, 12, -8, -5, 8, 0, -9, -9, -7, -5, 1, -13, -4, -5, -6, 2, -11, 5, 2, 5, -15, -2, -1, -7, -7, -2, -1, -11, 4, 0, -9, 2, 24, -8, -1, 5, -1, -11, 2, 18, -3, -2, 3, 5, 2, 16, 20, 5, 16, 8, -4, -6, 11, -8, 2, -9, 3, -13, -5]
8191e
$$ Imaginary data points
##PAGE= N=2
##DATA TABLE= (X++(I..I)), XYDATA
0@%%%%%%%%%Kj0J6j6J6j7K5l2L3m1M9n7P2q2R1j06J22j39J62j85K08k34K62k96
33a57L32l70M14m62N14n71O31p00P77q59R50j052J166j294J438j603J796k019
51a069K282k601K995l499M168n100O502q876J3887m0648M8636M2455j08160N7305
65H277M5857r5890l270R0105m1593k7204N2688k0117m2538L7790N639j8358J8694
78A0080m636k0674K1711o54j7672J7650K325k2559J3757J3045j3456k387K961
91e09j754M197o329M850J6075k4179j3501L9913q650l6146L8499R821n6452K6238
105g927M6681m9119r669M6205l4079k3289N2985m892l1453K6093j0989k9476L6419
118G490P408k6336K9915m990n1298L3533L1830m7267J6838M3091n6211j8824O0090
$$ y = [0, 0, 0, 0, 0, 0, 0, 0, 0, 0, 2, -8, 8, -8, 8, -9, 16, -16, 17, -24, 25, -32, 40, -42, 49, -57, 65, -74, 88, -97, 111, -123, 139, -157, 175, -195, 219, -243, 271, -300, 331, -369, 408, -451, 499, -553, 613, -681, 757, -846, 950, -1069, 1213, -1388, 1607, -1892, 2276, -2824, 3678, -5198, 8689, -31959, 16677, 59132, -49028, 8277, 54134, -41756, -45026, 45079, 3486, -23718, 28970, 8853, -33685, 4105, 9744, -8614, 10080, 5444, -15230, 6481, 5827, -11845, 5805, 8130, -14429, -672, 12373, -1083, -3470, -509, -2263, 1934, -4395, 455, 16530, -7649, -21150, 18763, 10113, -26033, 12466, 22287, -34165, -7927, 38754, -10365, -20034, 26171, -7908, -31197, 21788, 16896, -14557, 11536, 547, -28929, 7490, 14898, -11438, 18477, 13487, -37811, -4278, 27552, -19715, -2877, 40214, -15997, -34821, 25269]
131B5269j8669l4754M7587K610m8358K0251K4787k7935N42K1035j0839p358P535
144A703k68j542l970M20J1854n557j0136J3103l626j5626J8345O523k0456J1774
158B541O702k6274J4053K2543k8232J688K6809l1493r723M4810j5555l0404L7078
171A4543j853m2618L0022K6104l8607M697K8229k9910r318L3039q040j5786J6819
184G321m234j3609J1726J500n829Q805m209p493R818l720p981J3239k12j1940
198f818R875K130j3430O889O350q883O337M344j2895K985O595q987O776R332j4725
213d125j568J0899j0388j18J6488q570r524J0446n790o132J5819j909j1419R965
227D074l079j2340J5423M646j7032R748Q345k0315M771J8494j5666n628J8936
$$ y = [25269, 6600, -28154, 19433, 22043, -26315, -6064, 18723, -9212, -8670, 12365, 1526, -5832, 1703, 1435, -107, -4077, -3657, 8197, 2640, -7496, 5607, 1981, -13645, 4700, 11223, -9233, 2541, 9243, -17031, -2978, 19565, -8667, -6979, 19830, -11663, -21386, 23424, 7869, -22535, 14543, 12690, -29928, 94, 26198, -12409, -7712, 20517, -9393, -18711, 14328, 6288, -9498, 7321, 3087, -10522, 1204, 2704, -3125, 5680, 1471, -6022, 3796, 76, -7905, 5334, 5122, -6818, 3057, 5187, -8243, -1354, 4996, -3887, 2450, 6794, -6101, -3116, 3479, -5508, 1268, 10600, -4125, -5693, 5206, -5182, -5300, 11188, 2618, -6906, 3540, -2250, -8382, 7437, 5528, -5891, 4074, 995, -11345, 4078, 8724, -8308, 1440, 9785, -10530, -5759, 12735, -2931, -8559, 10377]
240A0377q824j2771J6422R76j4950Q480P480j0111R74N661n815j068M724J00N5
255A710j473k787K038l04q90O331r84q066K850K090m670P008M706j0813m57O136
271B425p170K375J1938q204p675R218l946o952J3533K591j3402L656M951r303
285e965L913R907p386m158N776l438k213O449r10l257K454k089j582M664j226
300I39l084L664q46l365M440O32n537J975L303k788Q27K298l400j584K144N48
316A66J194Q26k277j213n29m62L965K423l972j394P10k882K239N807k609l375
332a383K004k862k020O828J610m911J121l80m920M068N712m102j797K519l877
347b390j199O222J27l762J648n43l376K813L329k141j085L20j479N99K320l38
$$ y = [10377, 1553, -11218, 5204, 6180, -8770, -290, 7190, -2921, -1947, 3714, -2101, -3169, 1555, 1655, 1710, 237, -2550, -512, -816, -1706, 4625, 3641, -4425, -1575, 515, -4155, 2853, 7559, -3254, -3711, 2425, -4745, -2370, 9568, 1364, -6311, 2907, -1039, -7991, 5542, 8133, -5269, -1613, 3338, -5965, -2052, 7855, 469, -3689, 2087, -1351, -3564, 2885, 1975, -1282, 1172, -917, -2499, 2165, 939, -2145, 1519, 673, -2692, 1748, 2380, -3157, -1182, 2121, -667, 160, 2458, -942, -2526, -382, 166, 1360, 2186, -91, -1304, -1833, -2295, 1670, 4093, 121, -1273, -563, -3445, -1206, 4601, 1992, -1383, 621, -2241, -4261, 2567, 4177, -734, 387, 7, -4913, -845, 4867, 765, -1032, 1487, -2390, -3589, 2633, 2760, -1002, 646, 103, -3273, -460, 2869, 728, -357, -37, -1516, -917, 1403, 1065]
363A065j153l32n07O55J179l60m99l39q13O92J575j08q44r23j006J015K164J78
381A639r13j340j774R30K858L49o96l85k595j114L356J808q90K42j920l347K203
398a589L911o46o80j40l338o81M290J191j714L57j323k798J938L465n80j336l28
415aj661m48K906J721j776j718L0Q2M39J859M25k490j188J530M03P7J666r62l273
434b379P33K683k19O7M67k809j362L168J533j133N9j070k233J229K733K19p02
451I84j069j819mK138J675J9j882k072M09J529R18J070o86k865k89J961K76N74
469H67J076k249k145J806J410j87P41q80k313O67J912J57o9n52j404K50J121K96
487E04N17m87j832L15J308j27P57K47k620l63K537q7m52J139j912j843K693J089
$$ y = [1065, -88, -420, -927, -272, 907, 547, 48, -291, -1104, -412, 1163, 1055, 211, -712, -1718, -703, 1461, 1639, 726, -614, -2388, -1458, 1400, 1749, 1053, 668, -1927, -3041, 315, 2123, 1233, 1475, -445, -3792, -1589, 2322, 1676, 996, 856, -2482, -3163, 1127, 2318, 604, 961, -362, -3160, -1222, 2243, 1663, 327, -1, -1662, -2110, 796, 2517, 741, -977, -947, -865, -426, 1433, 1858, -632, -1820, -290, 113, 190, 1856, 894, -2379, -1646, 1037, 818, 885, 1352, -1457, -2819, 349, 1882, 749, 808, -262, -2495, -1266, 1467, 1686, 984, -85, -1904, -1908, 230, 1905, 1924, 42, -2030, -1621, -92, 826, 1896, 1210, -1655, -1944, 17, 293, 867, 1943, -306, -2451, -645, 765, 578, 1319, 439, -1874, -1207, 705, 862, 793, 241, -1163, -913, 208, 504, 1021, 534, -1298, -983, 325, 198, 955, 1202, -1418, -1781, 756, 669, 217, 1356, -556, -2399, 294, 1383]
505A383j622J025o2k826R99K574j001k80P58k166o24K666M20r97P0j063o00J619
523B73N35l83J97j263o77J636J20n40J246j046k018J978J159j756Q60N54k483
540a608J060K496k121q28J850j508n30K987q44k297J556k75j675K616J263k662
556e20r7O02j467J439K124j782j087O64q04P10J718j354q38Q98j067K56K470j136
574G29k023J107l92o25K969L97l140j66N66p27K097J488k242o30K76j388J514
591a90K182j967m86J377k168k9L496j661k739K552L43j789K587L08l985M57K227
608E15p40J376J263l076j138J088o84K026K698k984k067J721j330r8M172j070
624A672l834J927J033k163J939J357l232k18J992m62R90Q65k846r75J383k29J977
$$ y = [1383, -239, 786, 724, -2102, -1103, 1471, 470, 190, 948, -1218, -1842, 824, 1244, 247, 317, -746, -1346, 273, 808, 425, 622, -641, -1318, 318, 438, -102, 1144, 98, -1920, 58, 1217, -539, 321, 875, -1608, -548, 1948, -173, -1001, 849, -659, -1189, 1798, 954, -1343, 213, -62, -1737, 879, 2142, -520, -617, -15, -1482, -43, 2081, 299, -788, -124, -928, -218, 1500, 146, -692, 206, -861, -605, 1865, 729, -1294, -187, -579, -1204, 1765, 2162, -978, -1144, -578, -1305, 792, 2280, 38, -592, -316, -1704, -190, 1992, 25, -461, 916, -1252, -1281, 2215, 554, -2185, 367, 710, -1079, 1508, 1816, -2169, -1712, 515, -225, 1151, 2414, -662, -1800, -712, -1396, 630, 3328, 344, -1723, -2, -1332, -1430, 2742, 1672, -2162, -235, 798, -1365, 574, 1931, -1301, -1519, 473, 11, 1001, 1866, -980, -1955, -572, -801, 1176]
641A176K284l498k560K078k88k18L569k50l615K49P59p82J564R02j338r7m93k63
659h21K411q32l208K318J567k958K432K761n711j644N318j371j927N147j010o097
675c625J867K677k016K076K071l704j138J657p46J256J557k609k24K003j908J6
691g90K913k197k291K760M32j213J753n43k566N56P96P87J892j807k171K124r36
708e01k094M578J068n435J575L251m612K06N492l064l493M149L43k969J859N50
724I03k159Q44P09k8J277j860j618K893q66k401M491P15n890J750L639m180M39
741a342M912l414k928L877n19k251K694r2k045J631n85j270K778p07k728K758
757G69M15l301K531J853l909M97K868k134m72J895j179p2P10j618J498J229l478
$$ y = [1176, 3460, -38, -2598, -520, -808, -1026, 2543, 2293, -1322, -1073, -314, -1096, 468, 1370, 32, -65, -558, -821, 1590, 758, -2450, -132, 1435, -1523, 909, 3670, -2041, -3685, 1633, 262, -1665, 3482, 2472, -3625, -1758, 919, -1097, 979, 3050, -654, -1792, -135, -881, 375, 1932, -677, -901, 1102, -806, -790, 2123, -74, -2365, 395, 827, -386, 1367, 824, -1742, -1186, -390, 397, 2289, 482, -1689, 435, -501, -2595, 1983, 3051, -2384, -809, 2442, -2170, -1964, 3528, 464, -3029, 1120, 1463, -1506, 353, 903, -1256, -412, 297, 269, 1546, -314, -1932, 961, 95, -2306, 2185, 2900, -2990, -1240, 2399, -1781, -1342, 3570, 156, -2772, 1105, 586, -1665, 1029, 937, -1108, 523, -62, -1332, 1446, 739, -1989, 769, 1184, -2117, 414, 2267, -1642, -1145, 1723, -411, -883, 1012, -167, -239, 471, -1147, 351, 1580, -1898]
774a898J472L348m797m38O255l862m436O917R8o845M478L576o592Q42N320l944
790e06j870M214j154k162J869k66m06J103j487K71J857k440k58L319k288j810
806b014L899j071l267L138O44k878K125N21k803K094P44k995K542J279m330K078
822b94L039m937O58N211m326k545N624j467l832M298L91m199K218J595k513J278
838A99P54j897J446k48k244L124P25m171K479K387n036J170M685m379j503N409
854B900k228l477M084j68l364K816Q99k586J672K78k485J655O63j824K348M90
870A673l561J457J704k980J366K647k916j13K261k756k03L082k035m80L057k639
886d36j527L904k102k800M947m7m496L476J307n388K087L913l942kL947l025k092
$$ y = [-1898, -426, 2922, -1875, -2313, 3942, 80, -4356, 2561, 2659, -4186, 292, 3868, -2724, -1882, 3438, -506, -2376, 1838, 684, -1478, 391, 125, -281, 822, -665, -394, 1463, -977, -1235, 2084, -204, -2014, 1885, 814, -2453, 685, 1329, -1549, 576, 1097, -1706, 388, 1132, -1863, 679, 1958, -2372, -294, 2745, -2192, -1534, 3677, -649, -3194, 2430, 963, -2869, 1429, 1820, -2379, -161, 1434, -1079, 199, 953, -944, 502, 254, -1990, 1134, 1859, -2312, 167, 2554, -2482, -1312, 3373, -1006, -2509, 2900, 672, -2805, 1279, 1111, -2253, 563, 1462, -1124, 548, 826, -1659, -4, 659, -1165, 1183, 1673, -1888, -431, 1273, -1707, -341, 2306, -610, -723, 1538, -1218, -1421, 1661, -374, -854, 2203, -436, -1963, 1941, -161, -2961, 1986, 1939, -2557, 919, 2226, -3162, -1075, 2838, -1104, -1106, 2841, -184, -2276]
903b276L074q34j186K620n83j591J344q95r51K052p11r23K522r92k416K275rk477
921a957K477J143k808J467J269l324O77K407k215N18K602k663r69K687j955j398
937b042L489l67k092K220n04k900J822J216j685J493J012k235P7M13j456J521
953a8J620j692L87P11k604L70K434j688o4K780j968k143K409m46j832K685O69
970A610k564J101Q58k486N52J968j119J14J218j572p27J262l74j78J079m83m89
987b30N06o80q1J033o28l34J018p30l99J536q92j509J657K69j462J606P28k469
1005a061L24J456j653K73K437j181j578J206m22j056J701O74j335K31L94j052
1021f42%Q03K4J09R0m13j42j52q0O20M4l55O29j41j299M30R43o79L66R29j378
$$ y = [-2276, 798, -36, -1222, 1398, 815, -776, 568, -327, -1278, 774, 63, -860, 1662, 670, -1746, 529, 520, -1957, 520, 1663, -1145, 322, 1591, -1733, -1056, 1351, -864, -346, 2256, -407, -1376, 1311, -644, -2042, 1447, 1080, -1012, 1208, 704, -2196, -374, 842, -843, 650, 1662, -573, -496, -83, -1539, -18, 1602, -90, 297, 1008, -1596, -1226, 1208, -480, -544, 2236, 268, -1875, 534, 88, -1744, 941, 1610, -954, 147, 1005, -1481, -929, 1039, -80, 34, 1252, -320, -1047, 215, -159, -337, 742, 259, -230, 276, -404, -485, 548, -80, -414, 604, -126, -525, 1011, 119, -1390, 267, 536, -926, 680, 1408, -1061, -737, 719, -934, -661, 1776, 595, -983, 223, -199, -1255, 446, 1120, -215, 16, 410, -642, -642, 161, 185, 294, 384, -29, -171, -323, -403, 217, 261, -94, 535, 394, -905, -475, 468, -211, 155, 1084, -294]
1042b94p48J394k05p75J349J54j662K96Q19p03L49J034r45r09P04L09k44L85R6
1061D04n45k76J37L21J67n5J58k16p91L01R38l87l87O77m00q30Q96L58r40M96
1081B6P52j069l58J004k77n25Q12Q0q48K67M37o10p4Q02P0o49r5K42j99k3P38
1102E03M9r54R8O09p26n7J410l51j303O92K49j147R76J293j502o47J336o35q91
1121i98J560L43j435L74O30j141Q8J398l61r42M59K59o43J08P67k01o05M20K86
1140C66q89L7J193m05r10Q88J36j232O89R48j177RJ259j062q30J365J1q46Q53
1159D03N9j178M94O06o25K83M73o26j04J53l37N33M48p00M5K09p43M69Q73q89
1179a54j02R38r62n78J334j52p82R81j80j265Q21O76q54K32N50o84j04L46j92
$$ y = [-294, -1042, 352, 147, -628, 721, 875, -787, -491, 328, -375, -26, 1008, 63, -846, -142, 167, -77, 308, 404, -141, -417, -280, 41, 208, 153, 311, 95, -696, -395, 543, 156, -231, 446, 46, -784, 112, 470, -470, 26, 778, -291, -649, 355, 78, -447, 365, 445, -403, -136, 301, -309, -383, 419, 489, -160, -255, -13, -212, -235, 503, 552, -402, -304, 305, -421, -478, 932, 581, -722, -30, 219, -928, 48, 1341, -161, -808, 528, -107, -998, 562, 905, -530, -156, 474, -667, -579, 819, 458, -484, -25, 234, -409, -301, 466, 265, -340, 80, 366, -523, -486, 707, 302, -608, 280, 416, -816, -127, 821, -356, -347, 912, -150, -980, 385, 396, -450, 403, 462, -716, -222, 384, -241, 42, 515, -111, -215, -62, -399, 134, 582, -118, -73, 136, -607, -138, 735, -154, -256, 682, -280, -858, 476, 324, -458, 523, 343, -922, -101, 575, -279, -47, 503, -181, -285, 61, -131]
1198a31J70J58j69J65m01l85J031n6j120J101M51j853P56J428j929J37K335j872
1216a84j436K695n27k140K366N37k784J291J562k465L57K332j687r30J762p94
1232d5q97J604j12j092P02lo13M98L3n9M80o56l45P97n29j16J303r35r50J633
1252F98n07j439J906K25k006J443O46k424J200J795k356K39K054k150m25K467
1268A366j594r40K629j204j810K440m43j954K480R6k733J993R78k930J453J967
1284A794k817L87K319k559m72K996j474j484K377p29j774J937J97j560J220L02
1300F60j383O07K71m78Q72l59q09J120n48r29J902m31j866K227J00k960K239J646
1318A881l532J259K692l839K6M107l064j721M534j823l287M190o4l978L434J439
$$ y = [-131, 39, 197, 28, 193, -208, -593, 438, 382, -738, 363, 814, -1039, -283, 1145, -784, -647, 1688, -184, -1620, 1075, 548, -1592, 774, 1311, -1473, -182, 1380, -1085, -728, 1604, -83, -1013, 749, -45, -942, 662, 550, -542, 160, 157, -456, 42, 75, 16, 496, -160, -505, 292, -237, -353, 950, 15, -935, 698, 191, -1248, 658, 883, -1123, 320, 966, -1458, -258, 1537, -819, -580, 1474, -676, -1101, 1366, -228, -1168, 1461, 257, -1553, 887, 444, -1510, 970, 1066, -1667, 326, 1304, -1626, -173, 1794, -1023, -636, 1683, -876, -1348, 1648, 174, -1310, 1067, 338, -1436, 501, 698, -862, 358, 660, -723, -116, 155, -323, 549, 190, -619, 501, -47, -976, 926, 495, -1371, 856, 956, -2004, 235, 1881, -1651, -392, 2300, -1539, -1513, 2594, -470, -2191, 2343, 520, -2767, 1423, 1359, -2619, 815, 2254]
1334B254m542J803K742l764N23L293k917p90L106j955j418K966p56j690J996n57
1350B94j591J830j3j317J442k01j392J291j52j125J730j03j771J449Q1j760J876
1367E68N16k413J595J012k939J411K070l080P05K771l457m26M041k656j885M439
1383B272j693l391M315j5m407L614J870m931J779L225m352K81M129l277j361M131
1399B189j942k557L557k85k754K494N38k743J439J256j967M79J046j096K38M52
1415C44o07N38j88p96J221l27j250K092Lk814J865J364l218J449K841l610l07
1432a400L655k997j718M603j206l141L725k51m108L087J699l970J980K736m056
1447a362O4L196l011n89M014j833k163L094r59k734K675P78k238J653Q44k538
$$ y = [2254, -2288, -485, 2257, -1507, -984, 2309, -608, -1398, 1708, -247, -1665, 1301, 545, -1145, 851, 294, -1297, 533, 520, -797, 645, 444, -948, 343, 191, -934, 796, 693, -1078, 371, 452, -1308, 568, 1084, -1329, 266, 1278, -1661, -250, 1820, -1260, -555, 2216, -1241, -1667, 2374, -282, -2167, 2272, 579, -2812, 1503, 1488, -2919, 695, 2565, -2366, -587, 2638, -1714, -1433, 2696, -581, -1942, 2189, 247, -2310, 1247, 962, -1792, 702, 1240, -1503, -64, 1192, -775, -296, 750, -346, -108, 344, -263, 275, 87, -709, 512, 185, -1065, 1027, 1030, -1784, 81, 1445, -1773, -324, 2517, -1093, -1400, 2255, -742, -2460, 2143, 937, -2204, 1521, 1270, -2838, 249, 1948, -2022, -42, 2694, -1362, -1298, 1898, -1113, -1702, 2312, 479, -1684, 1410, 451, -2283, 392, 1170, -1068, 585, 1429, -1109]
1463a109M16J271j227N17J089j005R8L61j175L73P06p48Q19O29j517L75P19j773
1481a181N62J777j393J57J698k339r14K634j258j122L295p84k952K471J24l396
1497b621K642K419l504O48K691l466r64L606j437j517L455n82l153J701N77k192
1513a697J710J731j842N4Q52j794k46J574j25R2O61q96o25K51l08M05P29k96K98
1532E28J01j415R4R85q95L84J697j253r28J475j180j398K409N01j744J395L75
1549A131k656P15J680j647M98K124j734j107J542j050q59K226m7j384J337j56
1565F13j981R11Q82j101J052J077j726l54Q89j020K0J597l03n49N59q11q11R18
1583a38L34j66O03k48o76K13k33k47P96J18l11M94m79q07P70Q5p42J034M85j280
$$ y = [-1109, -693, 578, -649, -132, 957, -48, 50, 411, -764, -391, 315, -433, 386, 1015, -502, -127, 592, -1181, -619, 1158, -235, -78, 1620, -719, -1633, 1001, -257, -1379, 1916, 1132, -1820, 651, 775, -2621, 21, 2440, -1064, -416, 2275, -1191, -2155, 1451, 14, -1503, 1952, 1370, -1783, -82, 495, -1697, 13, 1744, -98, -44, 808, -986, -1232, 342, 217, 309, 970, 74, -551, -300, -608, -203, 526, 230, 528, 629, -786, -692, 293, -602, -218, 1479, 226, -702, 773, -407, -1805, 604, 1105, -639, 756, 1131, -1525, -810, 870, -777, -279, 1845, 111, -996, 546, -504, -1363, 863, 816, -568, 769, 613, -1368, -457, 425, -676, 376, 1453, -273, -627, 262, -758, -738, 859, 556, 7, 566, -245, -1056, -138, 196, 30, 633, 385, -291, -78, -311, -558, 238, 356, 45, 539, 60, -747, 23, 108, -634, 400, 885, -395]
1603c95L64M93j428M51J540j054m00J377r79j100J531r9j159J401L82j688N49
1620b14Q37j279K45J172q84j93J040p75o89Q91q7l75P26j13o02L59j05l89N69
1639A34J38l15L40k90n41O29J38n54N67J36q16M40L92r02L47Q37q67j63Q58o43
1659a35l41R33l78n72Q80j26p88O12J40n97N95J49q30M09L91p33L69N35p81J18
1679a50N85q42j8J036n49m55P91l95n97Q94m2p46O71K40q48L37L86o13K42M67
1699C94n81J3M90l87j38L56k59N7L83m12q7M22l84q3N24l92j63P35m27n64P63
1720B60r5o73P51J56q60N45M28j039K02Q39o23o9P08o53l67P72k70l99P58o4o15
1741c08L77p3m32N90J97n45K62J02n25L06K78m62L31L16o93K3N06m33O5N73n62
$$ y = [-395, -31, 462, -966, -515, 1025, -29, -429, 948, -31, -1131, 400, 301, -858, 543, 925, -763, -214, 623, -656, -411, 761, -123, -316, 724, -51, -740, 151, 64, -311, 415, 302, -300, 59, -46, -435, 134, 272, -43, 297, 7, -534, 95, 233, -321, 246, 382, -434, 6, 398, -504, -157, 680, -187, -350, 508, -135, -476, 457, 79, -493, 387, 261, -527, 85, 225, -372, 223, 372, -458, -49, 342, -391, -22, 513, -268, -150, 435, -407, -425, 611, 62, -393, 398, 3, -594, 300, 258, -488, 183, 423, -425, -88, 298, -315, -73, 394, -187, -174, 316, -71, -209, 147, -112, -55, 328, -84, -171, 251, -133, -216, 308, -84, -247, 488, 61, -503, 260, 165, -508, 243, 399, -461, 84, 512, -527, -325, 514, -109, -178, 530, -123, -490, 282, 12, -387, 371, 307, -308, 69, -4, -436, 154, 351, -194, 68, 170, -355, -49, 229, -233, 98, 414, -279, -256, 250, -183, -118, 455, -107]
1762a07k38O52l18l74O40k9m81M05o4m41M53J99m32J81M3l46L28J00m02L78J66
1783C13o53K30L88n69K76N97q32j61Q47m97l92R11k45o86O95j7p95O73M48p97
1803b66J52M04o07J17N92m60r9M67l79k34M15p9m1L24l38k58L25j05J2L75k98
1824A9k11M04l84k67P88o3n46N31j41q16P42M80q45L05N81r27q6Q14m95j15Q36
1845F04m96o27O14n3l38O20r0n12M21r6n17N98J85n19M06rp54M86N14o91K23M97
1867D66p65k0O36n25K0P82o00m28O49l26k38Q74l43o62P58j74p45Q72K30q27N69
1888B03J68j060N30P34q12J97O17r46k3Q43o95k5J022p33n81Q73m13m54J166k14
1908C97r92Q00N3r45P71M76q54M03K80r93L80O63o37K84M07r90K42P11r17K61
$$ y = [-107, -345, 307, -11, -385, 255, 226, -255, 150, 86, -355, 98, 297, -135, 46, 89, -257, 71, 171, -231, 147, 313, -340, -110, 278, -291, -15, 582, -250, -411, 436, -61, -453, 458, 213, -473, 222, 205, -590, 83, 531, -266, -114, 290, -317, -200, 392, -68, -167, 300, -79, -313, 102, 23, -18, 306, -32, -290, 35, -70, -58, 317, 19, -192, 212, -172, -439, 349, 286, -260, 271, 130, -686, 56, 536, -309, -4, 577, -350, -436, 378, -117, -232, 604, 108, -519, 95, 42, -296, 324, 234, -278, 143, 47, -470, 128, 313, -206, 200, 191, -563, -77, 437, -254, -31, 466, -299, -319, 317, -208, -188, 594, -6, -434, 215, -111, -349, 525, 182, -480, 278, 104, -641, 231, 461, -366, 203, 371, -689, -159, 575, -237, -40, 577, -369, -392, 451, -244, -269, 753, 20, -561, 312, -101, -555, 611, 397, -595, 205, 258, -687, 84, 560, -294, 109, 389, -604, -224, 439, -198, 86, 493, -497, -255, 456, -461, -200]
1928b00J084j096l52J188r28m74J693n59j240J367j27j425J333N42j531Q58P23
1945H56j742M19J341j196M7J246j294m51J429p25n81J455m91j042J006k08q10
1962g41J226Q1j087P22%r66R80L01j000Q30K18j486P47Q80j283O58R78j775O9
1981f48J535j306j84J787j194r50J683p87j066K033k22j695J409P1j753J533Q03
1998A049j944R49J039k115L97J715j547J0J748j618p77J914q10r06J849n06j396
2015i49J383j81j328J501L94j451Q41K56j440R65P71j323O76P15j605M11J059
2032F95j278M99J227j709j33J603j338k14J952j408j030K078r13j397K435k19
2048H50k194J761L08k307J786J362k548O58J570k333J88K304j626m94K052j555
$$ y = [-200, 884, -212, -564, 624, -304, -778, 915, 356, -884, 483, 356, -1069, 264, 806, -725, 133, 856, -886, -467, 874, -322, -275, 971, -323, -774, 655, -70, -651, 804, 313, -729, 277, 69, -741, 485, 566, -521, 201, 201, -765, 215, 516, -484, 346, 564, -922, -175, 705, -578, 80, 1058, -717, -648, 887, -419, -603, 1184, -10, -960, 723, -64, -1130, 903, 681, -1014, 395, 466, -1287, 246, 1049, -895, 54, 1093, -1022, -625, 1090, -457, -447, 1301, -317, -1094, 820, 10, -896, 953, 447, -949, 434, 253, -1075, 426, 820, -631, 210, 466, -974, -9, 762, -561, 115, 830, -775, -364, 695, -583, -84, 1143, -566, -699, 904, -434, -648, 1304, -104, -1134, 944, 31, -1366, 1069, 850, -1344, 417, 725, -1582, 204, 1566, -982, -324, 1246, -1087, -899, 1405, -221, -715, 1337, -218]
2064b18j217K160m64j141J866l87j714J388Q4j456J438O06j502P78K86j618R43
2081a68R64j292O96P74j745L18J121j431N41J600j724l95J641j424m32K269j179
2098A34j292K158p22j754K280N4k230J789N47k466J594J509k597M87J771k265
2114a003J38K516j760q86K202j397j387K406k47j493J797k45k043J389O37j458
2130h34J184O55j631N42N31j418Q02J071j210M57O68j672L46J223j348M55J596
2147A417j733m62J622j468m12K476j073j489K068p11j900K342L20k277J720P43
2163A183k698J216J773k368L69J964k189k80K491j516j081K201r58j467K117j37
2179F20j613J597O7j907J189P85j398Q75O44j590M61Q27j222N32J023j217J78
$$ y = [-218, -1435, 725, 261, -880, 986, 599, -1115, 273, 357, -1099, 339, 945, -557, 221, 507, -1111, -168, 796, -496, 200, 974, -771, -453, 668, -763, -222, 1378, -346, -741, 900, -524, -956, 1313, 134, -1158, 1000, 278, -1476, 804, 858, -1372, 417, 964, -1502, 92, 1601, -996, -509, 1262, -1003, -865, 1651, -109, -995, 1207, -190, -1577, 829, 582, -911, 886, 641, -1402, -13, 624, -834, 350, 1005, -626, -84, 447, -971, -169, 902, -308, 149, 817, -855, -509, 714, -634, -179, 1417, -316, -778, 844, -624, -1036, 1440, 367, -1122, 946, 235, -1665, 677, 997, -1280, 440, 1183, -1515, -299, 1474, -894, -525, 1439, -750, -1030, 1461, -55, -1136, 1065, 107, -1360, 757, 620, -993, 604, 671, -1236, -47, 738, -660, 215, 859, -731, -270, 557, -665, -133, 890, -327, -149]
2196a49Q12j371K31J353j180j4J363j381n10J647j043o67K094p78j541J776l15
2213C27j709J991M84k218J278R42k374Q24J835j970N9J862j862o55K261r34j089
2230i48J889o29j512J656L9j432J384L41j664Q01O44j297P77Q45j431K57R09j174
2248e45J97J115r72q0R64j061k51J289o63m10J115p87p03J348m11q88J397k05
2266D49j348J178J71j354J203O16j709O22R98j541L52J397j440j67J562j228p00
2283i39J744o38j034J554k91j414J325K89j465R69P25j414L65Q07j125K46J072
2300G76r34k21Q25p12j67R53m99k94P52o59m59J025k05m44Q26n44q70J036J53
2319C38p65Q88O6j288O03N70r70O43Q49j304j04R47q41o2J239p66o06J094m24
$$ y = [-149, 663, -708, -477, 876, -304, -318, 1045, -336, -846, 801, -242, -909, 1185, 407, -1134, 642, 327, -1382, 609, 1093, -1125, 153, 1095, -1279, -455, 1380, -590, -531, 1331, -531, -1186, 1075, 141, -948, 941, 312, -1200, 456, 495, -937, 447, 788, -876, -75, 569, -728, 49, 894, -537, -280, 629, -545, -348, 767, -205, -285, 679, -382, -633, 656, -7, -417, 698, -89, -792, 556, 145, -743, 654, 449, -899, 279, 450, -904, 299, 915, -794, -172, 826, -715, -363, 1034, -406, -573, 989, -239, -939, 805, 167, -867, 687, 396, -1018, 307, 596, -869, 100, 825, -589, -224, 583, -542, -296, 776, -158, -379, 446, -266, -433, 520, 21, -273, 479, -180, -639, 386, 181, -263, 563, 19, -851, 185, 338, -427, 461, 527, -761, -158, 412, -558, 85, 934, -370, -474, 473, -368, -430, 809, 43, -563, 531, 107]
2338A07q08J023o2q41R31J44j021O06L00j041N17P33p72K29N25j095l6J007m71
2357b5j58Q06o64n61Q12j90m32P86j02p06N22J17n02M67J6o98M80M33m69K68Q4
2378B84q77K51O50m08K90N37r68l76O88l12Q3R94n34q33N91j34m94Q86J53p86
2398c15M46K45q69K99N39o28J15O72m64j51M01n76k95P22J06j29L24m60n47M20
2418a45J05p1N83j11o53J93ol17O11K55o21J21K90m79J52L84n30k1O15k50j76
2439g1M00m36l80N12L6r6N41k39p13K15J74j66N55J74o60J8J90m18K54M85l40
2460C5p2K67l91r7M49k07k00L83p3j43K54k07l65L23J52j60L06p7m22J48P0k23
2482b50L93K20m38NJ17l42K16M11l91o7L72l00j78M26k05k51M39l6l59L22Q1m16
$$ y = [107, -701, 322, 260, -581, 350, 494, -527, 79, 379, -662, -145, 588, -184, 45, 570, -525, -561, 446, -25, -183, 623, -41, -602, 210, 20, -412, 374, 272, -434, 88, 205, -297, 170, 186, -512, -32, 401, -68, 200, 284, -593, -342, 308, -100, 190, 727, -241, -617, 71, -241, -158, 836, 302, -531, 60, -74, -568, 318, 471, -315, 131, 376, -493, -194, 345, -283, -168, 504, 40, -111, 290, -286, -581, 141, 247, 118, 442, -18, -565, -145, -40, -111, 472, 361, -292, -99, -105, -422, 189, 444, -177, -56, 234, -245, -93, 291, -239, -260, 355, 105, -71, 329, -107, -487, 25, 61, -35, 506, 267, -446, -231, -57, -223, 332, 506, -154, -136, 54, -364, -110, 375, 35, -37, 230, -161, -258, 191, -16, -216, 167, 94, -49, 205, -2, -367, -44, 108, -52, 254, 177, -245, -97, -27, -250, 143, 363, -75, -70, 47, -295, -79, 332, -59, -126, 246, -54, -232, 194, -11, -262, 177, 141, -218, 104, 185, -231]
2504b31J61J93k37J87J96l55o3K20j28L2J88j36m5J01j84j6K10n7mR1k25k7K36
2527A07j37n3K45j35j76K52j32j69L71jl73J78R5k62K50J61l92J05K28l17N0L58
2549B53k63j00K62k61j23M78q6l83K34O0k56K52J70l63j1K30j38k5K17m3j59m3
2571i8L4R7M5MJ9k25r6L43N4k76J59M8l52J84L46l45n7L24l56j50N96o7m39K61
2595E3p2l75N05L35n46l8K28l55Q1N31j90k79J61j91j60M42J67k38j01j09n7K59
2617E1J49j13m7j80n2K57M8r8J30j70k84K67K34j40Q4r7l55K10L37j45j4K1l43
2640b50Q9L60j65j5K19l95j84N20j3k25L02k46n05N28L68m65J19J32n62J16O57
2661C85k59k28L03l30l33N39K38k91O9j15l60K56L86p9j13r2k12J11K00L9Q5j60
$$ y = [-231, -70, 123, -114, 73, 269, -86, -149, 71, -57, -25, 163, 27, -18, 83, -101, -117, 93, 36, 32, 123, -102, -129, 107, -30, -83, 162, 27, -149, 103, -29, -198, 173, 172, -201, -23, 72, -190, 60, 221, -171, -66, 162, -155, -105, 253, -10, -110, 152, -109, -232, 246, 160, -223, 11, 71, -185, 67, 237, -126, -137, 93, -45, -70, 147, 104, -55, -98, -64, 33, 78, 82, 101, -124, -220, 123, 177, -99, 60, 108, -244, -60, 286, -59, -116, 208, -148, -298, 298, 231, -208, 53, -19, -394, 111, 446, -100, -138, 90, -265, -184, 347, 157, -122, 39, -152, -312, 130, 297, 59, -42, -151, -208, 51, 200, 87, 40, -140, -192, 65, 113, 15, 145, -25, -309, -42, 192, 52, 136, 39, -316, -106, 231, 86, 72, 93, -250, -161, 199, 34, 19, 238, -157, -341, 179, 166, -59, 243, -3, -508, 20, 388, -77, 42, 174, -388, -272, 385, 126, -102, 201, -129, -462, 77, 315, 24, 93, -22, -382, -126, 260, 181, 68, -24, -236, -125, 75, 114, 199, 39]
2683C9k88J46J28m3K64l6n43J32L78k04J01K72n43j97O12j13k58M60j83n92M23
2704d5L10l73K45J56o51L7N77j59q2K11m05j88M87J6j59K52k50l58L64J27j52
2725d0L04j32n58K60L49j98J57J02n30LM43j41l2K60k92k39K86M2k9K19k13k79
2747b58K19Q1k2K31k47k88L14N7j88L15k7n25K67K67l85K73L33o53j21N91k37
2768cj05N31m09n23O13Q3m19M47R3p04K30M05m32K00M08n63k28N21j42j14L96
2789B85k32l52L24M9k04K50l1k41J79k2j63L05k6l33K52P1l08K88J24m93J89L79
2811B90l89ML32l67p0M53k66j56M29k67l04M93j12l13N28j17o31N17K64o27L07
2832bM24p24O2O39n39j72O99l08m17N14j14l75M80K3m33L30P6m47K81J99l61K36
$$ y = [39, -249, -103, 25, -18, 246, 210, -333, -201, 177, -27, 74, 346, -197, -394, 218, 105, -153, 307, 124, -468, -45, 265, -108, 137, 293, -358, -321, 256, 97, 15, 226, -179, -367, 120, 136, -23, 229, -21, -379, -15, 112, -40, 264, 132, -426, -166, 183, -15, 142, 244, -286, -283, 160, 19, -13, 247, -45, -284, 2, 44, 15, 234, 21, -258, -39, 42, 20, 251, 4, -284, 30, 87, -101, 214, 187, -338, -71, 196, -189, 84, 417, -236, -357, 234, -3, -108, 423, 14, -509, 104, 187, -232, 215, 308, -396, -166, 239, -193, 7, 415, -148, -376, 145, 3, -111, 285, 53, -299, 25, 74, -130, 120, 89, -152, 27, 5, -158, 147, 121, -212, 40, 111, -197, 91, 215, -278, -89, 290, -99, -95, 237, -130, -200, 253, -13, -169, 260, -7, -311, 182, 70, -243, 285, 168, -463, 54, 318, -309, -2, 422, -302, -240, 399, -140, -312, 387, 79, -338, 176, 62, -313, 167, 190, -243, 87, 163, -284, -3, 196, -165, 71]
2854G1J86n32P9M01k51M6K39l68q2K89j71J15L11m02j41L09l19N9P12m13n60N73
2876A51j27m87P48K08q55K98L95o99J83O63n51j54N00l94r3N80l82l71N72j23
2896F2k67N76k13o74M80K56m67M24K92p24n2L80k14J68L87m29k11J92j30J98L13
2917C47m80r2L75k70M7N39m72m48M91n1j69O86j00q18J65J43j92O94K56q50NK10
2939A6n43M66P78o51k76N12n56k68R37j19o61M89R9m71L92J04o39J47M03j33K51
2960B77N6n96o9K12j15M68M26o22l37J58k40K35O92k77m41J89j92r2N05j16l34
2981b13L37j08k49N48p0o89K80K38l16N58L82r07k77M13k52L00P67m66n23K04
3001d3l19p4Q37k6m36K60k48m56O03K16n77K84L10m79J50L15n88j02M83p7P5L19
$$ y = [71, 257, -275, -196, 205, -46, 0, 239, -129, -211, 78, -93, 22, 333, -69, -210, 99, -220, -161, 551, 138, -422, 151, 24, -463, 285, 493, -362, -64, 331, -368, -185, 478, -73, -227, 273, -121, -214, 366, -16, -387, 185, 62, -205, 371, 158, -516, -36, 220, -247, 177, 469, -255, -307, 73, -141, 27, 414, -15, -226, -34, -164, 34, 347, -133, -225, 150, -120, -73, 466, -6, -454, 37, -14, -183, 503, 403, -415, -250, -107, -299, 395, 651, -199, -194, 16, -527, -61, 717, 66, -210, 302, -254, -522, 415, 296, -365, 124, 223, -248, 144, 248, -391, -244, 159, 26, 277, 333, -263, -332, -120, -235, 233, 659, 37, -300, -142, -382, -147, 545, 268, -173, 16, -176, -268, 237, 121, -213, 124, 16, -233, 315, 245, -444, -164, 74, -242, 316, 698, -209, -486, -73, -325, -25, 742, 276, -247, -43, -362, -436, 401, 375, -61, 199, -49, -505, 98, 314, -263, 21, 331, -148, 2, 317, -271, -373, 110, 33, 108, 427]
3023D27m05l52J25p0K63N60k90m08J13k86n1P05k1m48K62q0m43M14K29m30K01
3044A5J89m15K54L19n74l8L74l10J73N87n33m50M59j70k31P18L1n92K26j0m43
3065d21M13L77m05N9J58m13J44K91l78P2L69l06k7L07l85j41M23j25j09L86j80
3086A09l65K17m3q9M41r1l68K35m7l07M33J23n15L06K28n61J63M65m56p0M76l47
3108f3j60N05k47l36M50n1k83L41o3l82L80R8l92K63J38m34J86K92l81Q0L13l99
3130a45l9L87j85j07K73k73j10L78j22j75K71j75k13L81k9k67K84m7l85K73K12
3151A87k57J58N3m35J81K95k63J27J80m64N3M35l61m4N02l79l13N88j01m28M46
3172A60Jn40M05L37m72M1K16l79J04M25k44p7J60l06m9L48p3j3J79l18j70L49
$$ y = [427, 22, -330, -205, -275, -12, 548, 258, -150, -37, -323, -374, 331, 310, -138, 124, 44, -399, 15, 244, -186, 15, 204, -211, 43, 362, -212, -250, 124, -186, -13, 574, 41, -409, 50, -120, -351, 367, 398, -194, 32, 22, -421, -8, 369, -36, 23, 181, -232, -88, 203, -175, -103, 266, -40, -67, 240, -145, -286, 137, 12, -97, 289, 109, -256, -39, -82, -171, 270, 179, -189, 46, -1, -308, 125, 248, -267, 39, 267, -294, -131, 334, -122, -192, 284, -63, -223, 282, 35, -301, 149, 98, -185, 156, 93, -289, 91, 189, -203, 60, 198, -236, -50, 242, -139, -59, 254, -145, -184, 203, 18, -89, 184, -89, -199, 179, 57, -118, 153, -22, -235, 146, 117, -150, 134, 87, -298, -25, 187, -70, 88, 141, -294, -113, 182, -81, 46, 226, -238, -185, 250, -111, -155, 347, -32, -345, 243, 142, -286, 160, 161, -379, 26, 363, -109, -68, 148, -231, -127, 298, 54, -23, 137, -169, -218, 130, 57, 44, 223, -95, -265, 84]
3194H4k1r2K22k28k01L57m5k26L12j04l70L93J37l89K66J42n96J59N29l43m6L28
3216B68m35j92N38n2k24K82j72k84L05K2j42K96j46l73L35J22l12L17O9n67K22
3237a23M31l83J2L50m17j43M76j31j63L32k28l05L53N0j68K63j44l50L14J03k28
3258i9K25J4l88K05J77k66K23J39m43R2K81l05J71L12n21r8N33k91j82N59k58
3279H0n00N28Q4m81L59K24n50P6L70k48N4K20l28n7K52j10O0J54l28J4K95k84
3301a16J8M04l26k36M15j40k54M96q7n08L54J80m03K97J86n46J39L62l80O3M10
3322C28l97j84L94j87r1M23k05l29K71qj46L04q8k57K40m8k58L73M8m15K80J12
3344A60m48K80L51n09j1M24l33r4M50k46k87M03o6k55K95j6k61K15Lk20K98Rl20
$$ y = [84, 63, -29, 193, -35, -236, 121, 76, -150, 162, 58, -312, 81, 218, -171, 95, 237, -359, -200, 329, -14, -60, 268, -167, -359, 179, 127, -97, 185, 13, -271, 34, 56, -86, 210, 64, -309, 26, 148, -164, 153, 222, -345, -123, 308, -75, -63, 287, -130, -273, 203, 72, -91, 241, 13, -292, 61, 111, -57, 206, 62, -288, 26, 129, -99, 126, 140, -248, -43, 134, -132, 91, 230, -213, -121, 160, -145, 26, 338, -183, -281, 252, -39, -221, 338, 80, -420, 108, 192, -289, 70, 294, -256, -180, 190, -58, -4, 216, -112, -169, 83, -27, 33, 187, -141, -127, 168, -116, -98, 306, -20, -256, 159, 19, -235, 261, 174, -334, 20, 200, -203, 94, 280, -266, -127, 235, -145, -82, 328, -69, -253, 141, -46, -137, 286, 81, -248, 23, 15, -131, 173, 85, -172, 68, 20, -238, 135, 183, -232, 48, 160, -288, -8, 343, -166, -177, 247, -86, -180, 270, 24, -263, 140, 74, -181, 114, 98, -163, 52, 55, -165, 133, 142, -178]
3367a78J79R2k67K87J17m48J47K76l66J01L77l97j06M16l14j51N44j85m18L66
3387G2kl45L79J53m57J37K22l38J00K75k35k7J60k14L4K32j71j9J50k34M2K75
3409A89k43p8L23k08j71L62j28k79L75ll84L01J45l78J45K05l03R7K67l27m9K95
3431A53j91l1K59k13r8K57j64j16L17r4k14K43p4k53L31P4l56J85J31l35J47K38
3453A96k95J9K65k82o0K85j25j01K15j49j25K48n4j58K03m1j37J58m6j35J91j2
3475F0j76J83mk21K33N0l07K12J65l54P3K86l06nL53k47k13L76r9k52L10Rk61
3498a35J75L0k31J70J28j94Q0L9j90J21J33k20P5K01k50l6J97j40m3K28j37j19
3520a18J84o2j06J68o4j10J92n5j73K13Rk22J76N9k45J86J41k84M2J78j89K0K02
$$ y = [-178, 1, 93, -174, 113, 230, -218, -71, 205, -161, -60, 317, -80, -186, 230, -84, -235, 309, 124, -294, 72, 70, -275, 104, 257, -200, -63, 159, -179, -79, 196, -39, -66, 94, -120, -86, 146, -25, -44, 106, -128, -86, 189, -54, -132, 191, -17, -188, 174, 46, -233, 142, 139, -245, 56, 201, -177, -32, 173, -130, -33, 234, -93, -142, 153, -38, -69, 190, -23, -121, 136, -28, -144, 173, 79, -135, 108, 34, -219, 112, 186, -170, 15, 146, -189, -42, 196, -99, -80, 185, -97, -157, 128, 3, -98, 117, -32, -157, 91, 37, -121, 82, 41, -96, 62, 16, -119, 72, 60, -116, 67, 63, -158, 75, 125, -182, 30, 195, -159, -86, 200, -106, -111, 242, -5, -218, 158, 59, -193, 117, 126, -135, 40, 70, -161, 9, 137, -57, 23, 62, -128, -7, 126, -94, -19, 182, -68, -104, 93, -47, -90, 138, 1, -118, 66, 4, -102, 66, 2, -108, 84, 29, -144, 69, 78, -144, 32, 91, -154, 32, 173, -111, -69, 109, -80, -60, 142]
3543A42j91j1K31k09j18K85j17j33L09r0k91K63L2l17K27K12k76K2J47k52J6K53
3565A34r2n7J25j33o3J03q7N3J92j73j00J52j24n2K42o8j63K02k2k42J85N4k03
3588a37J77R8k72J17J65k86L6K53k37mK97k27j52K71p2j90K47J9j72J64k4k30
3610a59J49Q2j53J59P5k40Q1R2k60R8K82j69j03J81j73j15K57l1j06J78n9j80
3632a14J05k0n3K06k9k01J52j5k03K06R8k44J38J45k96K2K47k03k3K37j88r8K67
3655A36j27j79K81n8k26K52J9k73K33J04l36R1K33j80k3K01j72q4J59l7o7J30
3677G7m4m7O3j34QK01r2r5J66q5j58K08Kj89J79P9k55P1J10j57P8J44k00K6J74
3702A30k19k3K52j52p6K48j61k30L11K9k45J81Q0k69Q7J53j73N3J90j93n8J32
$$ y = [142, -49, -60, 171, -38, -156, 129, 12, -121, 188, 98, -193, 70, 102, -215, 12, 224, -52, -30, 117, -135, -119, 134, 42, -15, 110, -23, -86, 17, -70, -17, 175, 2, -98, 54, -70, -122, 120, 52, -111, 91, 69, -173, 12, 66, -137, 40, 138, -134, -17, 148, -138, -102, 151, -86, -90, 207, -20, -172, 99, 27, -163, 84, 103, -69, 95, 71, -159, -10, 72, -81, 78, 153, -87, -6, 86, -174, -76, 206, 37, -66, 115, -58, -173, 84, 53, -53, 125, 66, -114, -9, -29, -82, 124, 95, -106, 46, 31, -172, 34, 132, -112, 26, 171, -125, -103, 144, -59, -82, 155, -33, -131, 136, 9, -170, 111, 53, -173, 79, 98, -175, 58, 162, -174, -83, 150, -30, -53, 148, -24, -108, 51, 14, -53, 77, 33, -14, 49, -85, -77, 124, 32, -63, 103, 18, -140, 68, 70, -119, 60, 139, -116, -45, 65, -92, -14, 130, -70, -44, 130, -89, -112, 140, -12, -88, 160, -1, -231, 80, 109, -136, 45, 125, -144, -57, 96, -77, -24, 166, -27, -85, 47]
3724D7j00L1J65j40r3J80j08q5J96j8j33J25k5j50J24O0j00N4rp8J16nj49J45
3748E0M2j89J11R7k32O3K18k14n4K54j32j77K24k2j55K11jk41J25P4j45J46Q0
3771A33k39P8J08k09O3K53j82r5J71j22j04K45Oj77O8L3j10R8L6o8N5l3r5J17
3795C0L5j11Q6lj72J33J44j66JJ05j37oJ59r6k6J47j49o1J80q9j21K28p6j82K60
3820A13L4l24J08J55j99J04K48k33j66J63q8l4K51M1j57l0j13m1K08O1l9K9j36
3843d5j34J73O2j03J30K8k15M9J31j03J8Q3j38L1J56r5n8L9j30K5K42l8j15Q5
3867G8j15j45K02R2j10R8l7k07Q9J42j18M5L1j41J06J33j89m8J33j59J8K96p6
3890A18k08J10r9j73K81K21j87o7k6j85Q8K54po1j9j31l2J33K3K6K6j24l4J26
$$ y = [47, -53, -22, 143, 3, -90, 90, -18, -103, 93, 75, -58, 67, 42, -108, 16, 76, -24, 30, 21, -57, 59, 54, -95, 50, 92, -97, 14, 111, -121, -58, 160, -54, -108, 146, 14, -163, 61, 39, -116, 95, 94, -147, -22, 52, -93, 53, 133, -106, -28, 80, -129, -66, 187, 5, -90, 81, -41, -145, 100, 106, -71, -3, 30, -80, 18, 54, -14, 41, 8, -87, 30, 65, -46, 40, 37, -135, -2, 142, -24, -23, 82, -55, -61, 98, 2, -24, 123, -26, -87, 93, 4, -117, 111, 35, -147, 113, 147, -177, -69, 86, -113, -9, 239, 6, -160, 3, -85, -119, 132, 173, 16, -14, -127, -168, 40, 101, 62, 91, -45, -179, -6, 56, -47, 83, 111, -104, -55, 76, -27, -9, 74, -64, -33, 123, 28, -30, 9, -121, -96, 146, 108, -7, 78, -37, -182, 20, 112, 2, 100, 63, -144, -55, 87, -31, 14, 45, -96, 10, 143, -46, -94, 39, -120, -102, 194, 118, -90, 20, -79, -252, 29, 250, 63, -4, -30, -215, -127, 127, 120, 59, 40, -91, -123, 10, 33, 59, 85, -39, -73, 53]
3914E3j8m2K7r0kJ81nj09L0j02p8K21P4j06N1m6k44J24K38j05k5Q5k11n4K57l5
3940F9j15Q6p1p4J74L3j32K0k0r6J47J34j38k0k7j54J10K43q2j17K5q1l2J80N3
3965A15r5j8n0l0P9M8nrj03k2J40J1p1M0o1j01J81O9j36J4J5j26R6J45j15j4M6
3992D3j59J3K47o8j38R0o9j03K39N5k15J7P1j19M8J79q6j09M7l4NJ06%r7k3j3
4018g3O7R9q1n4Qj1K9J06l3q6J2k5k0J28K3r9Mn2l0J70L1j51L2Qq6J21J29j95
4046b9m0J30j12KK28j11j92J04J4o9J78N8k40l2J07m1P9J04j44r0P8OJ1N7k8q0
4072e2j4L4Q2K9j02l1Ll3J48R6j88q5J01n9J4K24p3k33J01L4j28K06J32k70n6
4097a20J39q8O7J95j52j90J34L4l6J45m3j72N3K4mJ50m7j58J9K7k3J75Ok40J8
$$ y = [53, 35, -7, 20, -70, -72, 109, 104, -5, 25, -77, -155, 66, 140, 34, 85, 39, -205, -81, 157, 52, 27, 112, -99, -153, 104, 69, -46, 40, -31, -105, 69, 102, -30, -10, -30, -126, 21, 155, 17, -3, -30, -184, -74, 169, 87, -30, -5, -86, -118, 62, 115, 20, 2, -48, -78, 1, 49, 44, 35, -68, -90, 50, 61, -10, 30, -31, -132, 49, 118, -18, -4, 11, -115, -19, 126, 11, -3, 43, -116, -103, 144, 76, -62, 28, -41, -144, 95, 150, -65, -48, 23, -96, -48, 131, 45, -64, -17, -51, -46, 60, 60, -37, -60, -73, -6, 93, 12, -42, -34, -45, -16, 90, 57, -29, -17, -42, -62, 66, 89, -10, -6, -58, -88, 82, 113, -38, -6, 2, -84, 37, 166, -29, -69, 61, -51, -49, 179, 68, -124, -20, -6, -75, 103, 161, -79, -111, -4, -45, 34, 138, -6, -96, -18, -12, -1, 56, 28, -52, -66, -32, 50, 79, -23, -54, -51, -84, 64, 160, -28, -113, -12, -71, -57, 167, 94, -139, -38, -4, -132, 74, 206, -64, -120, 19, -69, -2, 193, 41, -149, -15, 19, -17, 128, 85, -87, -34, -10, -14, 136, 89, -69, -50, -23, -46, 129, 135, -105, -87]
4122h7J13r1J15J15k07r3J43j3j2J44o4j82N5M8L8Q8o1j29pJ9Q2J51j10j60J00
4147ek3q3K45M1k94M8J25k05J50K59k88j66K68r0j02L13o4l45J86J49k23J34J60
4170A90k46p9K04n6k7J25q9j37O6O8M7Lr7lK1o2J22J06k13m1J75j50l5K86r2k66
4196a80J77O6k08K20J27l28KK28j60lK23j64j22J63n5n6J54k9j46J00k9l8J62
4219A04p7j31J53j9j42K06J2k46J47J33k72R1K51k45q5K55j23j32K50l4k33J39
4241BR0j46N9P5j10PK5j9M2ll5N4q1p6J92kj97J33N7k23J32J98k77JK78k37j32
4268a93L53q3k47K63J4l12J98J90k81K6K09j85n8J93n4r1J02k4p4O9JK1%j01L3
4293c1J01r9NJ48j59q9K25n7j59J96J9k38J32J36j76J6J46j81l6J99r4n3R3p0
$$ y = [-87, 26, -65, 50, 165, -42, -135, 8, -5, -17, 127, 63, -119, -64, -16, 22, 110, 49, -80, -87, -68, 14, 165, 55, -105, -5, -28, -111, 134, 175, -119, -71, 54, -151, -1, 258, -30, -196, 72, -18, -120, 193, 129, -216, -30, 119, -104, 30, 190, -56, -135, 69, 13, -14, 111, 22, -115, -49, 19, 66, 69, -28, -31, -10, -72, 50, 156, -57, -98, 77, -73, -108, 178, 86, -180, -3, 63, -145, 75, 202, -126, -124, 104, -56, -59, 164, 0, -122, 41, -14, -70, 84, 55, -91, 9, -20, -58, 104, 27, -104, 49, 30, -112, 94, 106, -140, 7, 140, -132, -41, 210, -35, -120, 135, 12, -120, 130, 96, -137, 2, 92, -54, 5, 80, -30, -23, 2, -17, 25, 22, -13, 41, -40, -116, 76, 74, -123, 10, 67, -156, -24, 174, -103, -102, 176, -61, -193, 160, 77, -170, 93, 107, -205, -7, 183, -98, -72, 137, -48, -106, 87, 33, -58, 44, 20, -54, 15, 16, 37, 37, -64, -31, 70, -29, -24, 124, -35, -124, 101, 44, -115, 81, 100, -138, -6, 130, -46, -30, 116, -65, -101, 98, 4, -49, 44, -26]
4317b6m1J19k7n9R2q1o0J46n3n4J20q4j50K14L1j77J56J9k47J23J99k09j3K19
4341A57j97j27K67k2j74J53J6j99R6J42j16k9M5qoL2pKo9j2J04kr3J16k4j93J31
4368a7J45j64K7J30k18k9K62r6j40J75n8j52J74N5j92O2Q0j44P6J41j20o0M6n7
4392g4L3J50n4o7j3o9L4J41m6l5O5r5o6J61pj06Q8J2j18J03Q3j80j7P9l0M9R4
4419A15q7r1Qj2P7Q3l5l3l7j16O4J61m9n8P5j08o3J97k7j75J11N2j28J20Q0j93
4445f9m2J37p7L2J83r0k00N3MJ1J67K0j46o6L1J2N4M0j8k1m1j0R2j1r8M6Nl7J42
4474A03L7j97m1O5k3J03J46j37j45L1m5M3J78Lj24j6m8j8J31M4j14kL2m2P0N2
4500H6j42k5R9k9N1R2j38j31Q4K7K4J38l0k00k2O9QJ16M7j24p8L5L4L1M2m1l4
$$ y = [-26, -67, 52, 25, -34, 58, -23, -83, 63, 10, -44, 76, -8, -158, 56, 87, -90, 66, 85, -162, -39, 160, -49, -62, 157, -40, -167, 100, 78, -96, 57, 73, -126, -30, 112, -4, -33, 12, 4, -2, 30, 23, 25, -44, -56, 48, 46, -47, 69, 45, -148, -17, 128, -36, -9, 121, -97, -126, 136, 40, -100, 75, 17, -135, 39, 94, -98, -36, 44, -100, -24, 117, -3, -63, -17, -74, -41, 109, 55, -12, -25, -94, -60, 81, 35, 0, 65, -30, -96, 65, 58, -48, 40, 52, -66, 37, 120, -60, -77, 2, -28, 21, 115, 28, -63, -55, -67, 10, 93, 58, 25, -12, -128, -64, 97, 48, -10, 65, -43, -106, 91, 64, -111, 0, 52, -76, 44, 124, -69, -111, 26, -51, -19, 164, 74, -126, -73, -69, -58, 109, 129, -17, -83, -52, -40, 14, 54, 36, 15, -26, -36, 56, 45, -53, -7, -2, -39, 103, 140, -57, -98, -33, -56, 47, 193, 56, -89, -58, -103, -60, 118, 121, -3, -19, -67, -85, 46, 90, -24, -26, 6, -36, 34, 86, -56, -81, 18, -11, 40, 132, -6, -137, -53, -26, -2, 136, 106, -94, -116, -47, -39, 77, 124, 0, -78, -43, -9, 22, 64, 23, -11]
4527a1k1K0R1Kj07nMj1J31O9j74q4Q2l5L8J60n6j65K8K9m5J19Q9j63o3P3k8M9
4555A6N9q7o9M9L8K1L9p9n8M7J0L8O7p6q7K7J5J8J13l0j45J1N6j7Q2L4j24l5O4
4584cjK6N2o7o9K6L3K7M3m5o0J2J0M3O5r6n2O2Ll0J07l9j41O4O6o7N2R5j58o5
4614a07J29j0k8R2n3j21P3O3o2M6K3p1k3M3OK6j3m3PL0jM8l9r1M2O1l7N3L8j36
4644e5k5J17n3lJ17o8j21P2M3o1P9K1j25K3R7m6j2L4n4qO9qj8J3m5k3O0k4K4L8
4674E8q5m4R4j5l8P0l1q8R2K3r5N7L3q9K4R9p8k2N6o2k9J01J5n4J9l4l1O1K4j9
4704A2K4l9l7N4Ml8Q2j2j16P3K9p7L8P2r3j4J11q9l9J06k5o1O9j8o1N7L3o1L5
4733A9K6p3J5K1m5N5K0n6KL1m1K1M7n2LM6p5oQ0l5k7P1n7o8R6Oo8O0L4r9L5O0
$$ y = [-11, -32, -12, 79, 81, -26, -31, -27, -38, 93, 162, -12, -96, -14, -49, -11, 149, 93, -72, -44, -15, -60, 59, 148, -15, -78, -5, -33, 16, 75, -12, -81, -32, 6, 27, 66, -13, -71, -24, -14, 24, 91, 15, -72, -45, -30, -12, 101, 71, -74, -63, -7, -24, 58, 92, -32, -67, -3, -4, 22, 74, 7, -62, -36, -3, 24, 67, 22, -38, -26, -16, 27, 92, -4, -56, 6, 9, -21, 86, 47, -94, -30, 36, -31, 21, 116, -42, -107, 22, 12, -16, 76, 23, -98, -25, 38, -24, 22, 45, -26, -49, -6, 0, 26, 13, -30, -23, 7, 6, 54, 15, -76, -34, 27, -10, 43, 81, -55, -80, 37, -16, -19, 98, 30, -91, -19, 24, -37, 42, 63, -62, -39, 58, 12, 0, 34, -20, -28, 41, 33, 15, 28, -17, -40, 20, -4, 20, 58, -27, -71, 23, 8, -30, 40, 9, -79, 13, 36, -59, -2, 31, -58, -34, 65, -13, -35, 21, -41, -70, 31, 46, -8, 11, -23, -54, 7, 31, 12, 36, -3, -40, 14, 18, -20, 62, 50, -66, 7, 36, -41, -3, 69, -24, -38, 73, -16, -55, 51, 26, -35, 34, 16, -45, 12, 45, -16, 19, 45, -28, -13, 8, -37, 18, 38, -18, -16, 15, -26, -5, 42, -10, -7, 39, -36, -42, 38, 3, -24, 47, -10, -78, 18, 24, -44, 16, 50, -49, -14, 46]
4765D6q1K7Q7p9m2O8l1k2Q0k7n5L7k0j3M6J3k4J2m0j4N8J3l4K6k2o1O7J9n4L0
4795A0M5r5NP4m8MN8n4l7O3j1o3N2J6n2N3J0p4J2N5m9K2N3o9j1L5l5K2N6k6l7
4826a6qKK0O9k7l8J0l9NP5j2n8L6qo8P0O2o0j8J2m4K3O5l3l5K2llK3ql0K4l4K1
4860cL3l0p%j4j1R2k3o9K0JrN3K3j03MM9l2LQ7o0o4K7%KP4J4q7j9L5QL5J5l4m1
4895c1J6K2K0pj2J5m1j6P3On8K4Ln5N2O3q4l5N9rl5P6j4r3M0L8l4L5K9o7m5M5
4927b0L4LK3l5o4K0M1M1rm0rj3pM0N1m8l4K7m3%J01pr8K5L1m3M7M1o7l1N3kj6
4960hL7Qm8pK0K5Ql2qj3J8M9J1r2lN4k5QO3m1q8N5J8m6P3M2j08m8R1j7j0P5l8
4993B3r7N0N0m0K6L2p5j5N0jRjj2l1OM0M1n0l8N3k8k8P1oo4J3P3p5J4Q2o8n4P0
$$ y = [46, -35, -8, 79, 0, -42, 26, -5, -27, 53, 26, -29, 8, -12, -25, 21, 34, 10, 22, -18, -32, 26, 39, 5, 31, 9, -52, 15, 34, -20, 10, 55, -40, -35, 39, -9, -5, 53, -1, -38, 25, 14, -49, 3, 19, -33, 20, 30, -44, -32, 23, -26, -4, 49, -20, -31, 4, -31, -9, 47, 21, -16, -24, -22, -2, 67, 40, 2, 12, -27, -22, 53, 41, -17, 19, 11, -57, 13, 75, 15, -3, 9, -35, -12, 53, 20, -15, 7, 4, 1, 24, 16, -14, 10, -24, -3, 30, 0, -7, -7, -21, -32, 60, 37, -32, -12, -11, -20, 33, 56, -47, -43, 6, -26, -23, 64, 4, -60, -33, -33, -31, 43, 57, -30, -49, -14, -6, 29, 44, 10, -31, -15, 7, 27, 20, 8, 23, -18, -34, 39, 45, -13, 11, 14, -41, 11, 74, -10, -45, 14, 5, -30, 46, 32, -61, -21, 17, -17, 18, 47, -20, -65, -20, 14, 17, 40, 5, -59, -39, 2, 43, 34, -6, -15, -28, -35, 5, 56, 8, -26, 1, -42, -42, 59, 52, -46, -21, 10, -33, 14, 55, -12, -43, 10, 8, -8, 29, 37, -11, -18, 2, 27, 35, 3, -5, -18, 0, 49, 60, -32, -35, 19, -6, 2, 65, 24, -64, -9, 9, -37, 36, 78, -30, -78, 13, -4, -14, 61, 23, -74, -24, 26, -14, 12, 44, -31, -46, 4, 3, 12, 11, -1, -32, -26, 14, 55, 5, -33, 20, -8, -36, 35, 29, -35, -22, 51, -24, -10, 72, 4, -50, 20]
5026B0K6n1M3np6K8P1j8j8Rn5j5N0J7jOl2k7J7QK1K2m4l5M3j8j3N5m2m3N7K1n2
5059c1L5K4p2RN6pl1M3k5l5M6L6l1k4J2k9K2J3K8k3l2J0K6k9K1L0o1l6P8J0m2
5090iM7oj10M6R8o1k6P6p1o5J10Op0O2K8j12L1O4l3k3M3k8j9L2kl4jJ7J8j4MN
5122Ck0j5K0L0l4K4Qm4j3Q3j5l6J9j4m4N5M6n8J5J3m2mO1l0j5M2m2j0M0J5m2R
5154EpoJ2Lj3L0rl9L5jk6M2Jn5J3N0n2lM5l2l1P0j7n9M5J0l7K3J6k3j1J7j2J0
5188fK8j0j2j4kK1J0j7J4ok5K6K5l5PK6l0k6O2k0l3M7j5o0O0L0o7K0M8n0j7N2
5220C1k8k8N1rm1L0Lj2mK3j9LJ7j6ljJ0Qj4j2K1J6n7K3K4m0J2L9m2j9N7k2k7N1
5254B5j6m3L8J0l5K6J7l0mL2k2JJ4mrJ1mLKk6NK3l1J6M4o0jN1m7k8Q6k7p7O5K1
$$ y = [20, 46, -5, 38, 33, -43, -15, 56, 38, 20, 29, -26, -41, 9, 26, 25, 31, -1, -28, -11, -3, 18, 40, -4, -39, 4, -14, -27, 28, -14, -57, 0, 21, -31, 4, 28, -44, -35, 21, 14, -17, 26, 1, -34, 12, 48, 17, -7, 5, -24, -2, 11, 39, 16, -16, -6, 20, -9, 12, 42, -19, -55, 23, 33, -9, 38, 32, -78, -32, 66, 5, -21, 55, -16, -81, 29, 35, -35, 27, 55, -57, -26, 38, 5, -18, 25, -3, -22, 10, 8, -26, -27, -10, 8, -6, -2, 3, -17, -32, -12, 18, -16, 8, 16, -28, -41, 42, 27, -9, 10, -4, -48, 7, 53, -5, 10, 23, -19, -23, 38, 8, -7, 35, -7, -17, 23, 38, -4, 5, -2, -8, 4, 7, -6, 24, 15, -24, 11, 10, -16, 26, 27, -28, -15, 35, -17, -20, 25, -7, -38, 32, 15, -44, 1, 11, -26, -3, 13, -10, -21, -4, -16, -6, 22, 12, 0, -14, -16, 5, 15, -2, 12, 6, -19, 7, 32, -3, 4, 30, 0, -26, 36, 16, -17, 30, 15, -45, 15, 45, -22, -2, 46, -4, -21, 31, 3, -25, 26, 17, -24, 6, 9, -3, -7, 16, -3, 0, 17, 1, -2, -3, 7, 15, 1, -11, 10, 26, -31, -8, 16, -24, -12, 27, -15, -34, 23, 1, -26, 25, 9, -34, 4, 14, -21, 5, 22, -8, -12, 20, -2, -1, 13, 9, 0, 11, 7, 10, 12, -14, -9, 14, -17, -1, 43, -17, -18, 33, -14, -42, 44, 17, -60, 5, 26]
5289B6o4K0O9p7oO0m4l8O9Kn6K7K6l4KK2k0J8Pnj2j3%J0j1J0M7k3l4K1j2k8O3
5322B2L2p1MN3o5QQ0n5k3P4m2o1O9jn5M1J8m9K7L0n0j0M8l3J2J4l0oJ4k6QL9k2
5355fqK4l6k4Q2m0k5N8ql9J9J5m9K1N0l5JLk6NJ4j1K6J5n0K8rk6L1M3n9MM9m8
5389a1k6P2k3m7P4j1p0L8N1q6L3O4o2j1O8n1n2R1rn2K0K3m3J3K0j1k8K4J7j8k1
5420b4M1j0n9L5M1l3k0O6l4n9Q2J1q3N1M4q6OP1o5JQ1o1l8P1Oo3N8Mo1M6K1n4
5452a4qM9k8j1K1j2kK8k3MJ3mj0J2k8RK8k2jmj1rM1j9j5L1j9k0J9Jk2M7l7l0N4
5487Hj1l2L5On1M8K7p8K2N8n8JP0l7m8P1k3o6Q1J8o4J4L3m9PM6k8j4L2j0j9LK9
5520B1k1JOkMj2K6j6l6M5Pm4K3L1m8j8O2l3k8P3k8p8P1J5m8K6L7p7J0M9m2k3Q0
$$ y = [26, -38, -18, 51, -26, -32, 28, -16, -54, 15, 17, -39, -12, 14, -20, -18, 4, -16, 2, 9, 4, -8, -21, -21, -11, -22, -12, 35, 12, -22, -1, -13, -41, 22, 54, -17, -13, 40, -25, -17, 63, 8, -15, 59, 17, -44, 25, 24, -31, 10, 28, -21, 6, 36, -14, -24, 24, -9, 3, 17, -13, -19, -5, -31, -23, 16, -6, -14, 10, -26, -50, 32, -8, -33, 25, 17, -22, -3, 12, -37, -16, 34, -1, 0, 3, -23, -18, -4, -15, 11, 26, -24, 4, -5, -31, 0, 43, -16, -12, 37, -11, -37, 35, 12, -35, 39, 28, -42, -4, 47, -39, -6, 58, -4, -15, 53, 2, -50, 41, 32, -20, 0, 23, -20, -7, 13, 2, -26, -2, 15, -3, -24, 17, 7, -52, -17, 24, -9, -29, 37, 3, -56, 26, 37, -46, 5, 49, -37, -31, 40, -25, -24, 57, -4, -42, 29, 35, -28, 30, 34, -27, 19, 40, -14, -22, 27, -1, -12, 9, -3, -5, 23, 0, 4, 17, 13, 3, 15, -13, -4, 24, 2, 1, -3, -14, -23, 18, -1, -16, 15, -4, -24, -5, -4, -26, 21, -16, -46, 8, -3, -35, 0, 6, -45, 3, 30, -48, -26, 32, -26, -25, 45, 8, -40, 31, 8, -58, 23, 41, -23, -9, 24, -25, -18, 28, 0, -14, 18, 8, -11, -8, 21, 0, 1, 7, 5, 9, -3, 23, 7, -29, 16, 23, -21, 2, 33, -15, -33, 29, -4, -32, 41, 13, -65, 6, 21, -27, -1, 36, -41, -31, 18, -24, -47, 33]
5553C3k7m1N3k3k2M0J1n2K6J9k6J7lk1K2J2k0J0Qj5J2omJ7Kj3j1J2j8J6K0l4j0
5586a6M1k8KK2k4nL3k5k7N2rm7L0Qm8O9Oo7L3L5n4PN0l6l1M5k0l2N6km1J7Qk3
5620b1K1L2l2k7M6k0j6K2oKJ2orJ3Qj6QrJ4Pj9LNj4NJ7nl1L9j7k5M6km2K0Kn2
5657d7M6L8m4k5N4l4k0N9l2k7L5%m0M3J6m0OJ8l6K3K1k4qK3k1mK5mKpJ5j7nOJ3
5692HolJ2jqoK0j3QJ1j1l6M7rj9K0mk4K5Pn3K8L6m4rM5l0j0M0j9k1L3j4l1K9O
5728Dk9L2Ok6j2M0j4j3J8j3k1K4%j4K7Nk0MOmPlj2lJ1jJ4j8J5J4j2j3J4Kj5J7
5764A7jk1J9Pk4J2L8m9LK4l4lM0j5m1K8Qk5J8J4l7J9J5k9nL8j3k2K3j5j9L4kj3
5798a1RRj4KlOJ0kknj2RJ6j3oL2k5j7J6Jj1K9qj8NK9j2j1NplJ4J4l9K5Mk5J3M
$$ y = [33, 6, -35, 18, -5, -27, 13, 24, -28, -2, 17, -9, 8, 5, -16, 6, 18, -2, 8, 16, 1, 13, 7, 3, 20, 22, 9, -2, 10, -8, 8, 28, -6, -16, 25, -3, -1, 21, -3, -8, 25, 0, -27, 25, 16, -31, -1, 7, -41, 28, 34, -33, 0, 35, -19, -12, 38, 2, -29, 16, -4, -36, 20, 18, -23, -6, 2, -21, 0, 32, 0, -27, 19, -1, -17, 5, -1, 1, 13, 7, -2, 11, 19, 3, 11, 2, 16, 23, 4, 7, 12, -2, 3, 20, 15, -16, 23, 6, -19, 27, 25, -17, 3, 5, -47, -1, 37, -7, -32, 22, -12, -32, 27, -5, -32, 3, 3, -37, 6, 22, -18, -12, 6, -30, -7, 14, -10, -18, 5, -16, -20, 5, 1, 3, -4, 11, -6, -11, -5, 8, 2, -1, 11, 10, 2, -4, 16, 3, 11, 22, 11, -25, 22, 13, -6, 14, 10, -14, 11, 18, -35, -7, 29, -15, -24, 21, -9, -19, 21, 2, -19, 14, 0, -31, -2, 4, -25, 7, 13, -13, -25, 15, 1, -12, 6, -7, -28, -4, -4, -18, 9, 14, -6, -2, 4, 0, 7, 4, -8, -11, 0, -1, 13, -5, 10, 24, 12, -1, 13, 15, 0, 17, 16, -5, 14, 21, -3, 9, 47, -2, 1, 25, -9, -12, 28, 13, -28, 0, 8, -17, 1, 15, -22, -3, 12, -17, -22, 16, 3, -19, 4, -11, -30, 4, 2, -11, -2, 7, -7, -5, -8, -2, 8, 6, 4, -1, -13, -4, 12, -1, -7, 25, 0, -17, -1, 0, -11, 18, 10, -8, -3, 26, 14, 3, 8, 1, -2, 12, 26, -13, 12, 16, -9, 4, 8]
5837Hj2J3Kj9K0Jj4J3pj0POj7lK7k2j9K6Jk8K8Lk2K0Lj3nJ6k2RK0pj1Qj1J1oJ0
5875DRnroJ9k2J5J0j5%K9k3k5L1mj5L6j9k0J8Ok6ML3k6k3L0qk1M3rj5Qkj2MPr
5913hqJ6omJ3j8%J1NPJ6l6QRj2PK6j8j5K3j4l3L9J0k6K6Qk3nK6k9J6jRJj7Qj9
5951hKJ7lJ3l2J2Kl5L0K5j7j4J9j7j8L2Rm5L7J3l4j5L0j8MJ6Jk0J2Qk4LRJ2j%
5987Ej1jpJ7qqRJ9k7j4K8J1j6K4ll8K4K4m0JM5k7j4L5k7j8J9K7l7K4J2k4pRj1
6022eNJ3onj8K1J3j5j2K6j5k8K0J6l0J4J6k6oK4j1j8L8Km2K5K5m3J1K3j7k3K7
6055aKj0MJ1pjJ2j0%LJMpNK5k8nJ5k0%K9j9l1J7K6l3J4J7j1j9L4k2qJ9kk4QNJ4
6094Gj4NJpjJ2Kkk1K6j7j4L8Ml5J3Lk6K3L6m4kL2j8k8M5Qn2M0Om0J8K6j8j8K7
$$ y = [8, -4, 9, 11, -8, 12, 13, -1, 12, 5, -5, 2, 8, -9, -12, 15, -7, -26, 0, 1, -27, 1, 4, -18, 2, 5, -8, -13, 3, -19, -10, 10, 3, -8, 0, -11, 0, -6, 4, 13, 8, -1, -7, 12, -10, 5, 15, 0, 0, 29, 6, -19, 12, 8, -7, 29, 10, -10, 8, 14, -12, -8, 25, -1, -24, 6, -2, -23, 20, 11, -4, 4, 2, -10, -6, 1, -8, -16, 0, -6, -10, 3, -15, -15, -4, 1, 8, 24, -12, -4, 5, -7, 0, 26, 8, -7, 16, 2, -31, 8, 18, -8, 18, 26, 3, -2, 24, -5, 11, 10, 19, 20, 3, 11, -8, -6, 11, 8, 21, -11, 1, 3, -32, -2, 23, 6, -8, 11, -6, -24, 8, 17, -28, 9, 22, -12, -27, 3, -15, -11, 5, 6, -14, -2, 6, -18, -15, -6, 6, 5, 5, -6, -7, -14, 3, -5, -13, -4, 15, -12, -26, 2, 13, -3, 21, 18, -20, 4, 28, -12, -11, 34, 7, -7, 28, 1, -17, 2, 29, -8, 16, 28, 4, -3, 6, -5, 0, 13, 7, 2, -16, 5, 18, 3, -9, 17, 2, -26, -6, 10, -20, -6, 10, -16, -22, 2, -9, -27, 11, 13, -29, -4, 21, -22, -11, 12, -5, -28, -1, 1, -9, -5, 6, -1, -2, 10, 0, 0, 3, 4, 8, 1, 6, 31, 3, -2, 13, -7, -7, 22, 3, -28, -11, 15, -18, -4, 13, 2, -17, 17, -5, -13, 6, 4, -20, -12, -7, 7, -7, -2, -1, -8, -9, 3, 5, 3, -18, 8, -9, -23, 15, 19, -16, -3, 0, -26, -3, 33, -11, -13, 19, 1, -27, 18, 26, -26, 14, 20, -20, -2, 24, 6, -12, 15]
6130A5jj9K0pj5NRJ7k3pJ5nl4M2J5l4MJ1l5pO0j5m1K9Om5L3K6l1JL0m5PM5nl7
6166a6J8mqJ2Qrj3jK1rj%Oj0j8L1RpJ6nl7K6J9k8MJ2l7J4K5qj7K3j8nJ3J7kj4
6204GrnJ8Okj4j4OJ8Lk2J9rk9K7J4l0PL8n0j0O1k0j3J0j8j7M1pk0J7Qj6j3M0l
6240A9j5lJj5J9K1k0j0PNrJ3J0rl6J8J4ooL8l3k3L2j1jJ6qk5J3K9j4j6Qj2%K4
6276A5j1o%qj1J6lJ4Kj4j2J7kj3J2jj3J7mj4K1Ok0JK3j4J2o%j1L0pj1lMKJLJm
6316ImJ0j1j3K3Rj0k4K7Jk7K8j0k4K6Rl7NM0k6j5K9j8KJ9qm1K8J3qj6J2pjRMk4
6353b1J1J9k0rK3KqlJ3Mk4L4j7rJ9Nk5KJ7j7J2J1k3j6K4J9l3J7J1j5j1O%%K2j6
6389Dk1J0J4pPMj6%klJ2Rj7JrJ1J3Jk4j4J2QJ0Kj6j6K6NmPjj5JJ0M%K2l6%J1K
$$ y = [15, 14, -5, 15, 8, -7, -2, 7, 24, 1, -6, 9, 4, -30, 12, 27, -7, -3, 8, -27, -34, 26, 11, -30, -1, 5, -40, -7, 19, -12, -11, 19, -26, -19, 26, 21, -16, 2, -2, -10, 2, 10, 1, -12, -13, 8, -1, -2, -2, 4, -6, -24, 7, 16, 9, 25, 20, -17, 9, 28, 0, 4, 16, -21, -7, 18, 10, -7, 16, -2, -7, 6, 23, 21, 7, -2, -7, 11, 17, 15, 1, -13, -7, 11, 14, -8, 11, 2, -27, 0, 14, -16, -9, 29, -21, -31, 30, 10, -3, 7, -11, -28, 13, 6, -14, 3, 11, -5, -18, 22, 19, 4, 1, 2, -13, 6, 27, 7, -3, 4, 9, 0, 13, 23, 14, -22, -4, 10, 4, -2, 36, 3, -20, 12, 1, 0, 16, 8, -17, -4, 25, 11, -5, 3, -9, -9, 15, 4, -2, -2, -10, -21, -5, -8, 6, 8, -6, -18, -1, -3, -16, -4, -5, -18, -1, -5, -19, 2, 8, -12, -11, 12, -2, 10, 4, 4, -7, 23, 16, 5, 2, 6, 8, 9, 12, 13, 9, 5, 15, 4, -9, 14, 23, 13, -11, 16, 17, -10, 18, 8, -16, 10, 19, -18, -13, 27, 1, -14, 15, -3, -1, 18, 10, -31, -3, 10, 2, -14, -2, -9, -10, -1, 3, -21, -10, 9, -11, -20, 3, 5, -3, -6, 7, 11, -13, 21, 4, -5, 14, 19, -6, -4, 13, -4, 8, 19, -4, -20, 4, 23, -10, 7, 18, 3, -8, -2, -2, -2, 20, 4, -17, -7, 7, 0, 7, 11, -5, -5, -7, -10, 2, 11, -6, -5, -14, -3, 10, 11, -13, -27, -15, -7, 3, 5, -11, -27, -1, 4, 0, 7, 6, -9, -8, 2, 6, 6, 28, -8, -8, 3, 5]
6430EOqnqK4MRoj4j3K6j8jM1l6j9J2%MK3j5l3MJ5j9K1J8k3k0K2n%L6k1l8J4J5
$$ y = [5, 11, 3, -2, -10, 14, 18, 27, 21, 7, -6, 20, 2, 1, 42, 6, -13, -1, -1, 3, 26, 11, -22, -18, -3, -22, -1, 17, -6, -26, -4, -9, -9, 27, 6, -32, -18, -3]
$$ [...]
8191F
##END NTUPLES=NMR FID
##END=
