##TITLE=1H_LY-836.24
 CCl4, 8 sc, 
 6.6.2019
##JCAMPDX= 6.0         $$ Bruker NMR JCAMP-DX V2.0
##DATA TYPE= NMR FID
##DATA CLASS= NTUPLES
##ORIGIN= UXNMR, Bruker Analytische Messtechnik GmbH
##OWNER= root
$$ XWIN-NMR		Version 3.5
$$ Thu Jun  6 16:34:43 2019 Russian Standard Time (UT+4h)  she@DPX200
##.OBSERVE FREQUENCY= 200.13155
##.OBSERVE NUCLEUS= ^1H
##.DELAY= (6, 6)
##.ACQUISITION MODE= SIMULTANEOUS
##.ACQUISITION SCHEME= undefined
##.AVERAGES= 8
##.DIGITISER RES= 18
##SPECTROMETER/DATA SYSTEM= spect
##.PULSE SEQUENCE= zg30
##.SOLVENT NAME= CDCl3
##.SHIFT REFERENCE= (INTERNAL, CDCl3, 0, 15.7039)
##AUDIT TRAIL= $$ (NUMBER, WHEN, WHO, WHERE, WHAT)
$$ ##TITLE= Audit trail, XWIN-NMR		Version 3.5
$$ ##JCAMPDX= 5.01
$$ ##ORIGIN= Bruker BioSpin GmbH
$$ ##OWNER= she
$$ F:/spectra/data/she/nmr/H-F/1/audita.txt
$$ ##AUDIT TRAIL=  $$ (NUMBER, WHEN, WHO, WHERE, WHAT)
(   1,<2019-06-06 16:33:39.92 +0400>,<she>,<DPX200>,
      <created by zg, POWCHK disabled, PULCHK disabled
       configuration hash MD5:
       00 E9 B6 7A A2 85 ED C7 34 08 36 98 17 FE 4E 26
       data hash MD5: 16K
       08 0A 70 6F CE 92 40 D1 CF 4C 4C 04 E5 69 27 D3>)
$$ ##END=
$$ 
$$ hash MD5
$$ C0 43 89 CD 90 3E E2 5D BD 49 2E 3C D8 8C A5 D8
##$RELAX= 
##$RELAX= 
##$RELAX= 
##$RELAX= 
##$RELAX= 
##$RELAX= 
$$ Bruker specific parameters
$$ --------------------------
##$DU= <F:/spectra>
##$EXPNO= 1
##$NAME= <H-F>
##$PROCNO= 1
##$TYPE= <nmr>
##$USER= <she>
##$AMP= (0..31)
100 100 100 100 100 100 100 100 100 100 100 100 100 100 100 100 100 100 
100 100 100 100 100 100 100 100 100 100 100 100 100 100 
##$AQSEQ= 0
##$AQ_mod= 1
##$AUNM= <au_zg>
##$AUTOPOS= <>
##$BF1= 200.13
##$BF2= 200.13
##$BF3= 200.13
##$BF4= 200.13
##$BF5= 200.13
##$BF6= 200.13
##$BF7= 200.13
##$BF8= 200.13
##$BYTORDA= 1
##$CFDGTYP= 0
##$CFRGTYP= 5
##$CHEMSTR= <none>
##$CNST= (0..31)
1 1 145 1 1 1 1 1 1 1 1 1 1 1 1 1 1 1 1 1 1 1 1 1 1 1 1 1 1 1 1 1 
##$CPDPRG= <>
##$CPDPRG1= <>
##$CPDPRG2= <>
##$CPDPRG3= <>
##$CPDPRG4= <mlev>
##$CPDPRG5= <mlev>
##$CPDPRG6= <mlev>
##$CPDPRG7= <mlev>
##$CPDPRG8= <mlev>
##$CPDPRGB= <>
##$CPDPRGT= <>
##$D= (0..31)
0 1.2 0 0 0 0 0 0 0 0 0 0.03 0 0 0 0 0 0 0 0 0 0 0 0 0 0 0 0 0 0 0 0 
##$DATE= 1559824419
##$DBL= (0..7)
120 120 120 120 120 120 120 120 
##$DBP= (0..7)
150 150 150 150 150 150 150 150 
##$DBP07= 0
##$DBPNAM0= <>
##$DBPNAM1= <>
##$DBPNAM2= <>
##$DBPNAM3= <>
##$DBPNAM4= <>
##$DBPNAM5= <>
##$DBPNAM6= <>
##$DBPNAM7= <>
##$DBPOAL= (0..7)
0.5 0.5 0.5 0.5 0.5 0.5 0.5 0.5 
##$DBPOFFS= (0..7)
0 0 0 0 0 0 0 0 
##$DE= 6
##$DECBNUC= <off>
##$DECIM= 24
##$DECNUC= <off>
##$DECSTAT= 4
##$DIGMOD= 1
##$DIGTYP= 9
##$DL= (0..7)
0 120 120 120 120 120 120 120 
##$DP= (0..7)
150 150 150 150 150 150 150 150 
##$DP07= 0
##$DPNAME0= <>
##$DPNAME1= <>
##$DPNAME2= <>
##$DPNAME3= <>
##$DPNAME4= <>
##$DPNAME5= <>
##$DPNAME6= <>
##$DPNAME7= <>
##$DPOAL= (0..7)
0.5 0.5 0.5 0.5 0.5 0.5 0.5 0.5 
##$DPOFFS= (0..7)
0 0 0 0 0 0 0 0 
##$DQDMODE= 0
##$DR= 18
##$DS= 0
##$DSLIST= <SSSSSSSSSSSSSSS>
##$DSPFIRM= 0
$$ [...]
##$SUBNAM2= <"">
##$SUBNAM3= <"">
##$SUBNAM4= <"">
##$SUBNAM5= <"">
##$SUBNAM6= <"">
##$SUBNAM7= <"">
##$SUBNAM8= <"">
##$SUBNAM9= <"">
##$SW= 24.9336996594482
##$SWIBOX= (0..15)
0 0 2 0 0 0 0 0 0 0 0 0 0 0 0 0 
##$SW_h= 4990.01996007984
##$TD= 16384
##$TD0= 1
##$TE= 0
##$TE2= 300
##$TE3= 300
##$TEG= 300
##$TL= (0..7)
0 120 120 120 120 120 120 120 
##$TP= (0..7)
150 150 150 150 150 150 150 150 
##$TP07= 0
##$TPNAME0= <>
##$TPNAME1= <>
##$TPNAME2= <>
##$TPNAME3= <>
##$TPNAME4= <>
##$TPNAME5= <>
##$TPNAME6= <>
##$TPNAME7= <>
##$TPOAL= (0..7)
0.5 0.5 0.5 0.5 0.5 0.5 0.5 0.5 
##$TPOFFS= (0..7)
0 0 0 0 0 0 0 0 
##$TUNHIN= 0
##$TUNHOUT= 0
##$TUNXOUT= 0
##$USERA1= <user>
##$USERA2= <user>
##$USERA3= <user>
##$USERA4= <user>
##$USERA5= <user>
##$V9= 5
##$VALIST= <valist>
##$VCLIST= <CCCCCCCCCCCCCCC>
##$VD= 0
##$VDLIST= <DDDDDDDDDDDDDDD>
##$VPLIST= <PPPPPPPPPPPPPPP>
##$VTLIST= <TTTTTTTTTTTTTTT>
##$WBST= 1024
##$WBSW= 4
##$XGAIN= (0..3)
0 0 0 0 
##$XL= 0
##$YL= 0
##$YMAX_a= 32142
##$YMIN_a= -42576
##$ZGOPTNS= <>
##$ZL1= 120
##$ZL2= 120
##$ZL3= 120
##$ZL4= 120
##$ABSF1= 10
##$ABSF2= 0
##$ABSG= 5
##$ABSL= 3
##$ALPHA= 0
##$AQORDER= 0
##$ASSFAC= 0
##$ASSFACI= 0
##$ASSFACX= 0
##$ASSWID= 0
##$AUNMP= <proc_1d>
##$AZFE= 0.1
##$AZFW= 0.1
##$BCFW= 1
##$BC_mod= 2
##$BYTORDP= 1
##$COROFFS= 0
##$CY= 11.3945322036743
##$DATMOD= 1
##$DC= 2
##$DFILT= <>
##$DTYPP= 0
##$F1P= 18.9103706918063
##$F2P= -1.10871071338519
##$FCOR= 0.5
##$FTSIZE= 0
##$FT_mod= 4
##$GAMMA= 1
##$GB= 0.15
##$INTBC= 1
##$INTSCL= 1
##$ISEN= 128
##$LB= 0.24
##$LEV0= 0
##$LPBIN= 0
##$MAXI= 10000
##$MC2= 0
##$MEAN= 0
##$ME_mod= 0
##$MI= 1.114404
##$NCOEF= 0
##$NC_proc= 0
##$NLEV= 6
##$NOISF1= 3.799351
##$NOISF2= 2.8
##$NSP= 1
##$NTH_PI= 0
##$NZP= 0
##$OFFSET= 15.70392
##$PC= 1
##$PHC0= -8575.63
##$PHC1= 13.20019
##$PH_mod= 1
##$PKNL= yes
##$PPARMOD= 0
##$PSCAL= 0
##$PSIGN= 0
##$REVERSE= no
##$SF= 200.130013532006
##$SI= 16384
##$SIGF1= 3
##$SIGF2= 2
##$SINO= 400
##$SIOLD= 16384
##$SREGLST= <1H.CDCl3>
##$SSB= 0
##$STSI= 0
##$STSR= 0
##$SW_p= 3612.71676300578
##$SYMM= 0
##$S_DEV= 0
##$TDeff= 0
##$TDoff= 0
##$TI= <>
##$TILT= no
##$TM1= 0
##$TM2= 0
##$TOPLEV= 0
##$USERP1= <user>
##$USERP2= <user>
##$USERP3= <user>
##$USERP4= <user>
##$USERP5= <user>
##$WDW= 1
##$XDIM= 8192
##$YMAX_p= 0
##$YMIN_p= 0
$$ End of Bruker specific parameters
$$ ---------------------------------
##NTUPLES= NMR FID
##VAR_NAME=  TIME,          FID/REAL,        FID/IMAG
##SYMBOL=    X,             R,               I
##VAR_TYPE=  INDEPENDENT,   DEPENDENT,       DEPENDENT
##VAR_FORM=  AFFN,          ASDF,            ASDF
##VAR_DIM=   8192,          8192,            8192
##UNITS=     SECONDS,       ARBITRARY UNITS, ARBITRARY UNITS
##FACTOR=    0.0002004,     1,               1
##FIRST=     0,             0,               0
##LAST=      1.6414764,     0,               0
##MIN=       0,             -42576,          0
##MAX=       1.6414764,     32142,           0
$$ Real data points
##PAGE= N=1
##DATA TABLE= (X++(R..R)), XYDATA
0 0 0 0 0 0 0 0 0 0 0 0 0 0 0 0 0 0 0 0 -5 8 -8 8 -8 8 -8 8 -13 16 -16 16 -18 23 -24 24 -31 32 -37 40 -45 48 -55
41 -55 61 -66 74 -81 90 -101 113 -129 145 -166 192 -225 270 -329 417 -556 798 -1307 2726 -13752
61 -13752 -42576 24277 9193 -28467 26736 19325 -36476 -478 18539 -15788 4609 18172
73 18172 -14019 -6661 7552 -4997 3437 5846 -9062 1767 5715 -6758 2669 4384 -9095
86 -9095 357 8144 -1308 -2359 -779 -916 384 -2338 5053 6249 -12344 -2832 14585 -8147 -6896
101 -6896 17270 -8688 -15856 21362 3844 -19665 10537 3522 -17874 12882 12955 -14589 1030
114 1030 1675 -12912 10995 11019 -10378 4523 -1860 -18599 13854 15159 -16427 5006 9378 -23517
128 -23517 2210 23419 -12603 -6231 16516 -11635 -11413 17012 780 -10620 7128 1865 -7171
141 -7171 2320 2614 -2111 -554 1104 2928 -1875 -4762 3741 1136 -4136 5667 1093 -8456 3716
156 3716 2839 -5976 7051 2414 -12066 4932 6180 -9884 7072 7313 -16896 1858 14197 -11428
170 -11428 -438 14386 -13354 -8157 16277 -3403 -7562 12182 -3925 -11925 8891 3690 -5695
183 -5695 4769 -253 -6294 3156 1151 -1571 3873 -1806 -3007 3497 -2228 -2002 5561 -1390 -3369
198 -3369 3928 -1565 -3321 3695 -67 -1019 3100 -2857 -2673 3131 -1160 763 4428 -4817 -3344 4747
214 4747 -1907 -682 6264 -3511 -5058 4044 -1190 -944 6314 -2744 -5059 3737 -1611 -1277 6961 -2937
230 -2937 -5543 5767 -1442 -4866 7661 297 -7796 4946 2277 -6941 4054 4163 -6722 913
244 913 4944 -4068 -1133 3326 -1788 -454 2524 -1062 -1666 32 591 1518 -173 -946 361 -1745
260 -1745 -506 3592 108 -2015 710 -2194 -1253 4863 608 -3133 1062 -1862 -2377 5360 1458 -4241
276 -4241 1594 -432 -4426 4260 3991 -4308 -192 1238 -3970 1837 4763 -2707 -1840 1443 -1872 322
292 322 2886 -1177 -916 736 -1536 457 1979 -1315 -337 1030 -1527 408 1991 -1819 -1104 1906
308 1906 -77 -487 794 -1112 -1012 1292 930 2 -462 -1086 -282 360 746 1634 -524 -2579 -134 955
326 955 381 1985 5 -3356 -359 1670 -122 1493 1019 -3076 -1156 1645 -155 1169 1831 -2754
342 -2754 -2166 1849 525 317 1641 -1809 -2411 1564 1038 -377 1087 -492 -2056 411 1184 165
358 165 532 -446 -1508 173 1105 376 -10 -722 -711 611 696 -74 -179 -477 -305 568 541 7 -385 -779
378 -779 -161 843 781 153 -902 -1469 289 1619 522 -208 -733 -1609 122 1947 480 -408 -268 -1639
396 -1639 -690 2127 1197 -688 -549 -1383 -929 2115 1704 -1099 -1003 -553 -671 1220 1711 -602 -1259 -390
414 -390 -295 595 1556 116 -1549 -924 470 916 751 -7 -1168 -1015 811 1259 -129 -423 -302 -806 299
433 299 1479 78 -960 -354 -449 213 1636 320 -1586 -770 278 652 1162 41 -1515 -814 455
450 455 854 852 -82 -1113 -839 7 1021 1295 -326 -1448 -671 156 999 1345 -558 -1725 -197 589 438
469 438 929 -131 -1487 -364 669 410 646 47 -1261 -607 740 847 343 -584 -967 -10 661 587 183
488 183 -783 -719 509 400 71 507 -578 -1102 620 786 -152 275 -504 -1296 783 1353 -490 -393 -145
507 -145 -837 565 1268 -529 -638 121 -512 149 1102 -77 -702 -344 -287 516 883 -239 -676 -439 -131
526 -131 889 589 -783 -295 97 -471 597 792 -793 -241 398 -678 301 1079 -822 -635 760 -178
544 -178 2 690 -949 -591 1261 116 -492 411 -664 -605 1180 315 -538 387 -487 -857 838 666 -279
563 -279 0 -597 -444 959 313 -557 0 -372 -49 1116 -163 -1020 231 -102 -243 1246 302 -1210
581 -1210 -348 -141 -48 1362 553 -1119 -646 -314 209 1312 46 -920 284 -277 -601 1167 159 -1218
599 -1218 707 485 -951 726 376 -1718 167 1466 -44 155 -224 -1693 32 1440 350 441 -313
616 -313 -1767 67 1088 -170 827 530 -2010 -432 1547 -264 -180 694 -1078 -406 1578 -12 -1063
633 -1063 -125 -249 420 1201 -91 -639 -598 -1079 643 1898 8 -619 -415 -1552 5 2214 422 -912
651 -912 -207 -707 -265 925 211 -64 27 -672 361 715 -1056 -78 909 -1052 442 2132 -1653 -2026
669 -2026 1506 138 -416 2256 -322 -2847 441 1044 -504 1204 723 -1649 -618 287 150 1023 22
686 22 -1037 259 35 -295 985 -343 -1397 999 935 -817 209 -50 -1213 334 990 223 281 -838
704 -838 -1169 599 345 225 1355 -1002 -2020 1366 699 -1315 1262 710 -2118 379 1416 -1251 -47
721 -47 1110 -864 -237 899 -186 -245 -406 -406 1254 325 -1089 675 -194 -1648 1604 1397 -1991 298
739 298 1265 -2007 -36 2252 -861 -880 980 -717 -444 1209 -218 -506 254 -399 401 488 -1016 299
757 299 750 -1203 231 1251 -1072 -320 972 -824 -116 1100 -609 -362 401 -562 559 476 -1340
774 -1340 687 1004 -1862 459 1741 -2004 -184 2310 -1799 -1048 2665 -905 -1871 2048 143 -1666
790 -1666 1139 373 -1166 595 368 -524 209 -173 133 494 -949 101 1268 -1097 -499 1447 -859
807 -859 -705 1568 -585 -1014 1336 -299 -956 1067 -161 -561 882 -757 -508 1477 -670 -874 1457
824 1457 -685 -1047 1866 -351 -1608 1532 128 -1612 1227 606 -1287 500 108 -806 984 171
840 171 -795 652 -517 -691 1550 -340 -1252 1639 -188 -1866 1563 625 -1776 1139 817 -1828 632
857 632 1044 -1493 174 1067 -606 185 173 -972 373 419 -437 827 -5 -1208 562 99 -889 1290
875 1290 560 -1485 323 253 -1030 958 573 -1175 745 324 -1530 689 631 -1211 1063 805 -1865
892 -1865 425 985 -1723 461 1756 -1201 -268 924 -1452 -250 1668 -364 -384 661 -803 -393
908 -393 616 -330 375 744 -851 -124 414 -842 353 931 -861 213 900 -1240 -401 959 -541
925 -541 251 1136 -960 -568 712 -795 -98 1339 -315 -326 521 -1093 -467 1255 -118 -209 834 -674
943 -674 -809 482 -308 79 1196 -258 -699 93 -680 6 1151 -178 -169 587 -1051 -744 1081 22
961 22 -80 1021 -742 -1117 871 25 -588 1070 195 -919 314 -74 -712 736 519 -532 167 62
979 62 -535 128 161 -113 451 65 -447 1 -98 -57 434 -161 -197 514 -252 -491 384 -166 -284 819 -24 -684
1001 -684 481 -139 -887 646 663 -452 225 -51 -1068 233 916 -213 3 266 -672 -358 412 122
1019 122 203 300 -400 -462 35 174 306 77 -192 55 -87 -293 204 186 -93 297 -25 -576 189 368 -328
1040 -328 141 362 -439 -117 284 -279 81 562 -329 -488 288 110 -61 262 -121 -364 104 165 -16 90
1060 90 37 -160 -232 -46 381 249 -254 -185 -76 -179 359 398 -429 -169 294 -328 -127 600 -34 -389 202 -135
1082 -135 -319 513 280 -522 -41 275 -212 -44 261 -63 -105 157 -74 -251 146 348 -129 -234 193 1
1102 1 -301 220 257 -281 99 167 -577 -25 742 -147 -360 290 -263 -349 615 151 -483 277 57 -650 195 593
1124 593 -213 -162 93 -331 -50 487 45 -330 19 100 -186 -33 308 40 -269 21 35 -209 255 340 -445
1145 -445 -190 413 -155 -227 388 -48 -258 303 -74 -350 363 214 -304 32 52 -153 130 40 -77 173 -70
1166 -70 -204 84 -49 94 367 -319 -361 385 -25 -248 441 -50 -489 315 31 -440 477 323 -627 -49 275
1187 275 -256 180 310 -373 -158 237 -82 -110 146 100 -110 -243 39 188 -104 103 153 -475 5 567 -426
1208 -426 -232 731 -322 -514 698 -187 -583 900 -7 -1002 653 381 -900 470 523 -844 228 517
1226 517 -798 143 788 -520 -245 392 -324 3 431 -267 -107 193 -251 15 170 -106 230 -76 -482
1245 -482 241 228 -264 277 -14 -534 348 137 -511 437 248 -613 221 139 -502 535 242 -767 344 284
1265 284 -677 451 317 -780 492 337 -1016 474 682 -933 304 584 -1075 352 898 -1102 85
1282 85 1043 -1012 -201 1069 -744 -218 1079 -764 -579 1071 -305 -539 772 -244 -522 572 -121
1299 -121 -353 507 -32 -318 71 -139 201 221 -413 170 178 -574 400 351 -815 460 513 -1189 316 993
1319 993 -1047 98 977 -1252 -41 1395 -1072 -373 1417 -929 -642 1395 -666 -612 1443 -680
1335 -680 -993 1364 -255 -896 1206 -241 -991 1074 -111 -976 1066 166 -1005 676 62 -776 777
1352 777 180 -777 527 122 -647 443 123 -370 476 -176 -526 500 -11 -256 458 -389 -312 664 -410
1371 -410 -282 846 -493 -463 886 -617 -411 1337 -638 -949 1354 -380 -1060 1490 -215 -1405 1453
1388 1453 102 -1700 1308 626 -1689 883 765 -1592 697 994 -1546 335 1166 -1167 23 962
1404 962 -952 -21 911 -778 -128 837 -512 -262 449 -338 24 384 -305 70 116 -368 217 -2 -252
1423 -252 695 -94 -878 557 67 -727 971 274 -1199 640 296 -1372 811 1012 -1199 298 618
1440 618 -1451 338 1195 -1082 187 1099 -1295 -274 1094 -921 49 1414 -993 -615 1130 -778
1456 -778 -569 1395 -279 -633 965 -548 -1000 961 257 -508 644 -22 -728 224 -7 -212 546 201
1474 201 -198 -71 -440 -68 373 -145 268 457 -621 -262 159 -588 443 1032 -647 -280 462 -1023 -177
1493 -177 1272 -388 -189 1021 -1115 -1065 1280 -40 -556 1340 -269 -1431 738 61 -982 1169
1509 1169 769 -1083 117 134 -1013 460 893 -403 174 270 -907 -262 436 67 449 322 -572 -305
1527 -305 -56 -180 365 380 6 132 -340 -588 188 194 78 564 -84 -577 119 -267 -460 842 488 -440 182
1548 182 -300 -915 516 614 -364 494 231 -1104 -108 425 -350 596 687 -872 -308 338 -625 129 920 -273
1568 -273 -129 345 -822 -402 827 81 -87 532 -404 -631 273 -15 -39 681 97 -513 -139 -133 -17 398
1588 398 168 -29 13 -257 -163 42 -32 332 282 -386 -90 124 -403 75 469 -230 72 357 -666 -337 620
1609 620 -97 -123 569 -354 -526 444 -140 -361 683 134 -573 162 -9 -395 408 209 -367 224 105 -457
1629 -457 55 184 -88 264 69 -396 50 101 -181 222 139 -182 93 -86 -311 275 239 -193 75 -36 -248
1650 -248 234 109 -266 195 123 -306 88 133 -181 191 76 -351 134 191 -230 85 80 -227 171 76 -352 169
1672 169 224 -302 74 104 -321 182 238 -379 81 314 -390 -70 311 -239 11 318 -357 -155 388 -141 -169
1693 -169 258 -80 -95 219 -152 -131 230 -49 -106 135 -15 9 73 -217 11 262 -82 -17 88 -247 33 247
1715 247 -194 16 328 -239 -195 212 -152 20 379 -229 -254 282 -118 -192 304 16 -152 171 -213 -254 309
1736 309 89 -150 131 -113 -187 186 -53 -111 289 -41 -267 120 -43 -81 307 -88 -284 238 45 -235 208
1757 208 58 -209 173 11 -250 236 164 -249 22 72 -94 160 76 -182 61 49 -137 77 42 -21 122 -140
1779 -140 -201 207 57 -99 151 -132 -215 262 -35 -246 309 47 -408 143 84 -244 283 132 -485 62 266
1800 266 -265 59 222 -251 -52 137 -241 64 291 -147 -127 20 -105 120 151 -139 19 43 -208 50 115
1821 115 -50 170 5 -359 58 196 -92 151 86 -287 57 116 -224 196 275 -288 -74 80 -195 192 274
1842 274 -293 -65 183 -232 24 252 -149 12 105 -316 15 323 -105 -29 66 -288 66 255 -251 25 248
1863 248 -311 -95 244 -156 63 281 -345 -179 310 -90 -27 243 -185 -103 153 -189 29 332 -144 -111 89
1884 89 -255 113 387 -273 -89 276 -329 -79 418 -167 -49 344 -399 -262 488 -59 -158 308 -256 -268 374
1905 374 -100 -176 396 -127 -351 205 -57 -84 385 -144 -339 207 -55 -111 284 -83 -156 181 -258 -126 432
1926 432 -87 -131 234 -363 -154 559 -207 -246 498 -287 -408 522 -77 -299 572 -194 -628 507 151 -388
1946 -388 431 6 -542 366 105 -403 443 159 -509 195 43 -331 461 138 -512 210 84 -389 317 163
1966 163 -339 242 -30 -485 346 238 -306 233 -64 -464 377 118 -368 385 18 -560 279 82 -358 532
1986 532 55 -733 289 190 -446 499 174 -669 318 148 -641 516 414 -691 212 203 -688 470 561 -752
2006 -752 146 430 -724 167 617 -557 99 479 -700 -26 644 -367 -52 405 -488 -33 442 -354 25
2025 25 392 -399 -44 281 -338 230 358 -541 31 314 -439 243 380 -596 132 333 -695 249 654 -613
2045 -613 11 376 -804 201 860 -628 -73 593 -820 -139 886 -426 -62 715 -810 -429 890
2062 890 -237 -160 734 -575 -487 711 -295 -242 836 -282 -505 497 -274 -245 733 -207 -413 509 -207
2081 -207 -345 476 -171 -208 518 -281 -323 472 -233 -185 475 -340 -140 590 -421 -270 606 -409 -252 700
2101 700 -410 -254 766 -564 -541 867 -196 -373 860 -461 -780 824 -119 -536 1014 -81 -982
2118 -982 516 -31 -573 1008 251 -947 332 83 -680 667 434 -580 302 32 -715 411 420 -341
2136 -341 303 17 -511 322 99 -360 444 78 -411 329 -134 -425 600 17 -480 539 -62 -583 546
2155 546 -20 -577 697 44 -779 592 145 -764 569 161 -809 652 359 -939 366 360 -843 454
2173 454 591 -804 234 407 -944 208 812 -518 61 384 -791 28 706 -386 47 468 -596
2190 -596 -160 415 -257 205 440 -526 -121 284 -294 191 325 -431 127 229 -530 183 407 -453 187 253
2210 253 -639 234 475 -608 171 505 -678 79 539 -656 106 671 -726 -138 706 -517 -105 665
2228 665 -588 -248 706 -442 -266 727 -364 -387 544 -303 -225 689 -261 -441 489 -169 -273 553 -134 -342
2248 -342 427 -184 -322 499 1 -249 268 -217 -220 464 -78 -202 341 -226 -223 383 -151 -101 475 -314 -360 460
2270 460 -127 -184 487 -302 -400 541 -146 -350 588 -110 -493 422 -91 -396 603 -8 -611 386 94 -454 407
2291 407 100 -521 334 141 -499 288 240 -415 167 119 -384 251 189 -355 186 161 -335 118 96 -252 318 177
2313 177 -403 67 115 -235 298 206 -320 108 31 -355 288 338 -241 50 -38 -408 289 340 -296 99 108 -404 139
2336 139 256 -315 137 209 -436 74 336 -318 -26 206 -309 134 374 -379 -170 238 -207 78 382 -257
2356 -257 -176 181 -260 -46 446 -59 -170 98 -226 -41 313 -94 -103 208 -88 -90 86 -214 -2 303 -57 -26
2378 -26 129 -320 -149 273 20 157 270 -421 -376 242 69 140 346 -274 -349 161 -67 -14 419 -49 -277 87
2400 87 -125 -110 318 -49 -223 244 31 -208 74 -141 -168 355 141 -198 31 -145 -263 215 212 6 125 -196
2422 -196 -377 119 209 46 153 -102 -249 112 44 -113 167 81 -110 123 -30 -192 114 15 -90 251 115
2443 115 -230 -80 -105 -66 385 223 -236 -82 -80 -180 254 239 -118 22 -57 -309 98 254 -66 -1 -8 -171 80
2466 80 107 -173 0 111 -24 57 -9 -191 3 55 -49 146 98 -179 -82 -33 -71 226 168 -203 -78 20 -80 117
2490 117 114 -126 35 80 -176 -1 152 -84 25 89 -120 30 93 -175 -24 194 -12 -2 29 -168 3 177
2512 177 -38 -24 91 -92 -69 73 -29 27 99 -112 -100 81 23 -22 7 -66 0 47 -42 -19 19 -7 41 -41 -111 94
2538 94 64 -121 37 52 -121 61 82 -153 69 148 -198 -47 198 -44 -13 120 -155 -48 225 -35 -124 109
2560 109 -16 -74 131 31 -99 73 -21 -105 113 141 -44 -100 -61 29 102 52 -36 -101 -70 72 51 -58 44 -4 -170
2585 -170 27 121 -36 4 10 -180 35 218 -87 -127 9 -68 68 175 -112 -125 52 -73 24 214 -66 -150 12
2608 12 -96 41 309 -54 -257 29 16 33 232 -20 -247 42 90 -34 130 63 -188 -61 73 78 139 3 -182
2631 -182 -109 101 189 67 -121 -120 -8 20 142 105 -152 -86 25 -91 111 230 -199 -212 115 6 44 231 -215
2654 -215 -306 228 122 -113 154 -47 -317 145 188 -107 81 17 -299 25 293 24 -44 -76 -201 51 251 51
2676 51 -77 -116 -112 82 135 45 26 -119 -186 88 174 32 16 -151 -199 164 209 -42 -38 -95 -142 148 149 -94 -1 -58 -170
2703 -170 103 173 -74 -8 -74 -216 179 237 -182 -95 17 -155 160 225 -218 -105 103 -157 41 276 -122 -187
2725 -187 73 -106 40 335 -98 -293 59 39 20 223 -59 -225 44 49 -12 155 35 -153 -51 22 78 150 -28
2748 -28 -132 -27 6 137 124 -147 -87 108 -65 20 178 -135 -105 158 -106 -50 260 -126 -273 188 61 -113
2770 -113 178 -83 -276 190 126 -185 95 -7 -228 135 102 -127 134 -8 -306 104 220 -111 61 3 -287
2791 -287 91 258 -125 -16 86 -183 -2 165 -43 22 64 -179 -27 149 4 54 -4 -178 65 135 -104 44
2813 44 75 -136 31 74 -127 98 98 -183 22 85 -130 105 95 -225 106 178 -302 19 241 -205 14 224 -305
2836 -305 -101 348 -172 -164 278 -110 -200 208 -50 -109 228 -73 -203 146 22 -54 156 -75 -107 166 -60 -108
2858 -108 215 14 -108 85 -85 -83 203 42 -86 78 -87 -61 123 -41 49 188 -204 -179 197 -25 0 270
2880 270 -194 -256 238 -24 -144 253 -43 -256 147 -13 -133 260 -43 -302 176 62 -146 193 -91 -344
2900 -344 238 163 -249 146 62 -368 76 226 -113 107 80 -303 -51 174 7 61 -9 -148 90 49 -135 97
2922 97 27 -95 204 36 -238 69 17 -152 280 215 -199 -56 -125 -193 364 305 -198 -43 -119 -315 288 327 -188
2945 -188 62 30 -428 79 384 -152 -32 120 -253 28 279 -228 -137 148 -48 114 162 -309 -147 108 -84
2966 -84 201 330 -245 -265 16 -109 177 412 -141 -273 5 -88 85 242 -67 -26 69 -158 24 119 -175 66
2988 66 238 -104 64 122 -415 -151 366 104 107 117 -443 -299 284 138 155 222 -329 -333 122 -20 141 382 -228
3011 -228 -330 179 -34 -70 259 -119 -209 266 28 -254 40 -57 -81 250 100 -97 -35 -250 -147 303 195 8
3033 8 25 -316 -221 310 138 -58 126 -134 -221 166 43 -64 185 -35 -137 169 -34 -162 114 -64 -13 377
3055 377 -10 -348 40 -30 -71 384 96 -357 -14 -17 -186 275 242 -195 -53 -81 -173 217 157 -187 13 -7 -145
3078 -145 139 35 -218 111 95 -175 82 53 -216 33 100 -68 131 50 -242 -10 93 -32 151 8 -243
3099 -243 88 96 -156 136 87 -202 95 112 -167 109 127 -226 27 167 -105 55 59 -210 107 189 -170 13 106
3122 106 -202 73 190 -206 3 168 -210 -54 223 -103 -56 126 -141 -55 177 -77 -98 81 -57 -3 52 -119
3144 -119 28 114 -106 -13 61 -137 44 134 -123 43 115 -206 -42 188 -60 34 90 -241 -36 241 -81 -19 181
3167 181 -159 -75 211 -120 -65 227 -115 -153 207 -24 -128 105 -69 -56 198 -14 -169 30 -51 8 178 -65
3189 -65 -121 80 -111 -72 224 -7 -121 79 -128 -97 228 7 -186 47 -5 -58 128 -37 -129 83 -12 -34 129
3212 129 -54 -110 73 -53 -5 226 -64 -199 87 7 -10 221 -70 -207 142 16 -92 187 -22 -195 136
3233 136 4 -143 207 17 -278 105 138 -121 89 24 -246 69 187 -79 -2 21 -129 21 73 -21 78 -41
3255 -41 -156 69 48 -24 124 -103 -224 151 105 -154 86 8 -200 122 120 -162 70 61 -228 43 148 -104 22
3278 22 46 -185 89 187 -124 -34 58 -110 75 142 -116 -3 71 -109 52 143 -67 17 4 -154 94 170 -129 -9
3302 -9 60 -163 71 172 -183 -19 139 -159 -38 171 -93 -51 93 -111 -16 146 -81 -73 66 -59 40 87 -156
3325 -156 -24 121 -102 15 131 -119 -25 126 -137 -3 215 -112 -124 128 -65 -16 175 -102 -104 163 -28 -76
3347 -76 136 -22 -86 87 -27 -40 150 -15 -101 50 -8 24 102 -81 -52 90 -60 -18 123 -84 -33 125 -108
3370 -108 -61 203 -57 -146 119 -49 -110 153 -49 -145 128 19 -147 76 11 -103 81 -3 -107 97 25 -113
3392 -113 48 25 -50 86 -52 -112 112 24 -94 63 -7 -105 94 11 -90 106 32 -138 53 59 -37 99 -18 -132
3416 -132 70 75 -62 54 -1 -95 56 18 -51 91 27 -122 32 17 -42 99 -25 -145 80 50 -101 54 14 -130
3440 -130 85 36 -141 76 74 -157 16 100 -87 36 47 -129 21 112 -62 -49 53 -47 33 50 -77 15 36 -72
3464 -72 28 54 -56 35 17 -122 77 130 -89 -16 20 -83 61 97 -110 -11 52 -96 15 73 -58 24 15 -145 44
3489 44 128 -88 -28 48 -102 35 101 -127 -32 106 -102 -22 82 -90 -18 52 -106 -20 117 -99 -82 70 -67 -8
3513 -8 118 -93 -87 100 -20 -59 54 -32 -31 58 -46 -1 66 -53 -15 57 -24 57 72 -141 -42 143 -21 10 78 -113
3539 -113 -61 113 -56 -24 155 -69 -138 83 -33 -9 149 -64 -127 126 -20 -109 77 -7 -78 90 -27 -124 55
3562 55 -3 -78 44 10 -55 31 -84 -68 117 33 -66 39 -67 -71 114 4 -102 84 28 -106 46 18 -76 57 8
3587 8 -57 76 8 -85 31 -18 -10 160 -19 -149 62 11 -75 139 66 -130 40 -5 -141 117 137 -97 -7 22 -109
3612 -109 63 67 -114 51 81 -128 -19 49 -100 40 111 -110 -42 78 -104 -64 87 19 -2 -4 -96 -15 34 -6 40
3637 40 -34 -78 66 29 -117 70 104 -128 25 101 -96 28 109 -118 2 164 -48 -50 51 -78 37 128 -72
3660 -72 -8 89 -112 -36 120 -52 -12 116 -114 -87 155 -18 -87 95 -1 -86 62 -43 -73 84 15 -63 15 -46 -40
3685 -40 74 -46 -50 102 -31 -107 49 -3 -25 74 -25 -99 43 14 -28 27 -32 -4 52 -71 5 125 -52 -62 98 -57
3711 -57 -59 157 -28 -128 141 25 -152 73 57 -88 82 37 -121 47 78 -55 50 38 -91 43 15 -85 83
3734 83 80 -122 -2 59 -54 52 68 -104 -23 58 -22 -21 33 -28 7 -19 -50 72 28 -59 20 -11 -76 99 41 -121 50
3761 50 78 -98 12 60 -60 42 68 -102 12 83 -68 25 68 -62 23 57 -130 36 138 -80 -39 74 -74
3784 -74 -15 146 -49 -79 82 -24 -60 77 16 -39 -17 -59 2 91 -12 -36 -30 -95 11 101 -39 -32 48 -91 -69 79
3810 79 11 7 52 -107 -77 65 -6 -14 72 -44 -36 48 -80 -26 133 -6 -52 66 -67 -71 104 2 -42 113 14 -129
3836 -129 21 22 -4 108 10 -91 44 3 -59 85 31 -36 51 -20 -99 70 53 -76 28 48 -31 38 -19 -83 20 59
3862 59 -1 29 -32 -84 6 -23 1 133 19 -130 -56 -53 -13 149 53 -118 -1 -27 -107 56 76 -44 21 -18 -127 35
3888 35 80 -48 37 67 -40 34 -7 -125 39 128 3 -3 -3 -110 -16 80 7 59 35 -114 -63 45 31 76 43 -111 -54
3915 -54 73 -3 -9 51 -38 -7 64 -28 -33 -6 -60 -6 75 22 7 -68 -120 4 119 18 -8 -48 -139 10 110 -3 8 29
3943 29 -110 -40 77 11 16 40 -86 -34 121 -3 -59 19 -26 10 118 -34 -97 45 -7 -4 109 13 -81 -31 -16 24 105
3970 105 37 -89 -69 -20 65 94 -25 -73 -20 -13 24 45 -31 -63 -13 -28 25 93 -33 -82 -13 -13 57 82 -84 -88 48 -3 23
3999 23 83 -77 -87 53 -14 -21 107 -33 -127 48 54 -17 80 -17 -134 52 105 -32 -1 -3 -57 33 62 -17 -5 4 -30 16
4027 16 47 36 -2 -76 -33 75 50 -5 -5 -94 -30 132 13 -46 34 -58 -86 91 38 -66 56 -29 -115 90 80 -88 -3
4054 -3 12 -62 57 46 -104 8 56 -41 24 7 -82 8 48 -38 55 35 -97 -23 26 -12 79 32 -107 2 99 -18 17
4081 17 37 -78 9 92 -29 -3 58 -54 -29 67 25 7 -18 -72 9 51 10 25 -59 -77 82 36 -98 48 24 -122 39
4108 39 91 -114 4 90 -136 -12 169 -102 -115 103 -46 -20 147 -71 -148 75 32 -44 92 -9 -99 28 32 -8
4132 -8 56 3 -63 -25 24 78 48 -83 -39 41 -9 67 71 -102 -23 112 -48 5 132 -87 -102 113 -3 -27 112 -68
4158 -68 -148 115 61 -70 28 -43 -70 76 27 -48 19 -47 -60 70 7 -27 50 -89 -102 138 32 -97 34 -67 -97
4183 -97 153 46 -170 36 29 -121 82 104 -120 -6 30 -82 57 120 -67 -79 13 10 40 43 -38 -22 -17 18 71 -18 -29
4210 -29 81 -40 -57 150 15 -128 79 15 -109 137 63 -197 53 119 -116 35 87 -143 -9 130 -100 -31
4232 -31 98 -87 -78 82 -19 -27 43 -71 -44 61 13 0 -4 -49 29 38 -50 45 42 -85 16 42 -67 47 92 -122 -19
4259 -19 123 -60 -18 95 -65 -30 91 -39 -46 111 -4 -54 27 -24 7 57 -48 -18 44 -40 10 47 -73 5 68 -111
4285 -111 -20 127 -58 -63 65 -78 -43 132 -65 -105 113 -14 -97 72 -3 -99 51 29 -71 45 22 -68 -20 30
4309 30 21 21 -49 -32 26 17 42 22 -97 -17 92 -36 6 115 -66 -77 99 0 -21 111 -53 -134 110 69 -59 41
4335 41 -16 -97 75 71 -68 21 -5 -79 33 61 -19 20 -38 -78 58 61 -24 2 -57 -41 77 15 -69 30 -25 -66 76 13
4363 13 -85 26 4 -92 73 60 -91 -55 5 -3 83 41 -90 -49 -6 24 77 14 -58 -8 -35 -41 107 48 -84 18 -4 -59
4391 -59 96 43 -127 21 91 -47 23 17 -124 -2 104 -21 -10 30 -108 -62 75 55 24 -3 -120 -58 48 41 16
4416 16 -36 -76 8 25 -35 7 -3 -45 39 30 -55 6 -15 -98 64 136 -41 -54 -35 -102 51 152 -2 -54 -19 -71 0 96
4444 96 12 1 14 -66 -5 71 -24 -6 45 -11 32 69 -107 -93 73 38 24 57 -81 -107 32 41 15 87 -24 -133 -28
4471 -28 17 39 48 -26 -72 -22 5 24 -20 -64 -5 42 -15 -24 -6 -78 -8 84 10 11 18 -148 -77 120 61 -15 18 -108 -102 117 57
4502 57 -41 46 -13 -74 32 38 -35 26 26 -29 45 39 -65 -41 -14 46 105 19 -91 -52 -14 35 117 24 -94 -24 -33 -30 103 62
4532 62 -81 -43 -16 -14 66 28 -92 -41 36 17 13 -30 -57 4 32 17 44 -19 -80 4 22 37 93 -31 -137 20 69 -2 61
4561 61 -14 -116 33 94 -29 4 56 -93 -4 98 -11 -14 29 -85 -19 119 40 -53 -42 -34 22 77 4 -45 -42 -15 35 49
4589 49 -19 -5 -58 -80 51 71 -23 -18 -32 -86 62 101 -66 -51 21 -45 1 68 -45 -49 42 -19 -18 54 -17 -70 10 10 23 51
4619 51 -63 -53 33 33 48 33 -73 -38 55 -2 18 68 -47 -72 25 14 19 65 -38 -88 49 42 -31 12 -30 -50 51 22 -35
4648 -35 6 -26 -30 34 28 -3 6 -50 -60 30 25 -12 1 -56 -36 56 -16 -44 48 -12 -41 56 -32 -70 61 7 -80 62 32 -100 -16
4679 -16 34 -25 54 46 -91 -36 48 25 34 35 -35 -11 -5 -9 42 44 -22 -9 -18 -34 56 36 -49 -4 14 -28 30 12 -47 28 19 -71 7 42
4713 42 -40 8 9 -53 14 45 -71 -1 51 -41 -18 27 -25 7 49 -49 -41 29 -9 2 21 -22 -14 21 -34 -7 54 7 -14 5 -35
4744 -35 11 66 -7 3 28 -17 -6 38 -4 16 44 -36 -19 51 14 6 35 -50 -27 44 -20 -4 54 -25 -43 13 -14 0 60 -30 -77
4775 -77 3 1 -1 27 -27 -33 9 -32 -29 36 3 -32 9 -19 -27 35 -14 -53 20 12 -28 0 -12 -6 39 8 -51 0 4 -15 19 9 -21 9
4809 9 -4 -5 45 33 -10 -21 -28 15 68 13 -22 2 -5 -1 61 -2 -25 26 -16 -43 59 53 -53 -11 -4 -45 55 55 -65 -49 28 -29
4841 -29 -7 27 -30 -23 6 -24 -16 11 -16 -23 -16 2 14 -12 -33 7 20 16 28 -51 -47 42 20 -7 19 -6 -58 22 40 -4 30 16 -78
4874 -78 2 81 12 -11 -14 -66 -5 53 25 -14 -21 -14 -11 23 20 19 -31 -42 8 15 -3 -10 -26 -59 26 32 -53 -34 6 -34 1 33 -36 -32 26
4909 26 -14 -18 44 -11 -60 -6 18 29 18 -29 -58 -16 42 45 -10 -45 -15 -8 -5 60 26 -51 -23 10 -25 70 67 -87 -50 43 2 19
4941 19 60 -62 -50 55 10 -35 44 -5 -50 10 31 -15 0 -5 -35 7 33 -7 -49 -43 8 43 1 -17 -25 -49 5 43 -21 -28 5
4972 5 -52 -29 70 11 -41 -17 -53 -27 89 31 -64 -9 8 8 48 42 -30 -12 -2 4 40 33 -11 -35 -22 19 67 11 -29 3 -19 10
5004 10 78 -12 -59 49 16 -51 51 11 -74 11 38 -37 9 21 -85 -30 91 15 -18 -11 -47 -17 33 18 -7 -11 -20 -19 -1 28
5034 28 26 -34 -39 25 14 18 12 -50 -59 59 44 -32 22 1 -55 41 67 -31 30 37 -65 -4 83 5 -16 34 -26 -6 71 0 -38 29
5066 29 27 3 13 -14 -31 11 3 8 13 -16 -17 -16 -7 40 36 -56 -53 9 -4 24 31 -58 -34 25 -23 -24 30 -9 -40 8 -8 -12 16 -21 -38 27
5102 27 25 17 -6 -38 -4 42 7 -5 18 -19 -9 30 -11 18 58 -21 -29 64 9 -25 38 -8 -49 67 29 -52 16 36 -20 17 22 -50
5134 -50 -2 15 -30 7 50 -22 -42 -17 -4 0 15 -23 -27 -18 9 10 -26 -18 10 -26 -23 35 -8 -37 25 -17 -40 54 21 -63 3 42 -25
5167 -25 9 38 -52 8 63 -33 -21 43 -1 -31 43 7 -6 18 -20 -14 19 12 -9 -16 -18 14 15 -25 -5 9 -29 -2 7 -29 25 23 -53 -20
5201 -20 41 -15 -24 19 -31 -32 46 -21 -49 36 -5 -37 16 -5 -32 14 -6 -33 7 20 -8 -13 -10 7 13 -10 2 19 -9 7 38 -21 -3
5234 -3 62 -15 -29 74 21 -38 40 -4 -37 61 20 -60 11 37 -30 -1 24 -29 16 21 -17 -5 31 -10 -16 -6 1 13 5 -38 -1 -16
5266 -16 -2 16 -25 -35 20 -17 -55 33 16 -46 15 -12 -61 37 33 -62 8 51 -37 -12 28 -23 -1 38 0 4 30 3 -3 1 21 20 16
5299 16 -34 4 15 3 35 15 -40 15 26 -43 19 55 -30 -1 35 -36 -6 27 -40 -20 65 -1 -33 2 -31 -17 53 -1 -27 -8
5329 -8 -18 -23 11 13 19 -7 -53 -5 -2 -8 29 3 -58 16 37 -53 8 58 -18 14 64 -41 -22 55 -11 -29 83 23 -63 12 -7 -7 65
5362 65 36 -45 0 28 -10 17 21 12 10 -2 -3 16 6 18 9 -27 12 32 -44 -31 37 -9 11 42 -44 -41 42 -18 -27 51 -14 -56 9 -19
5396 -19 -15 46 16 -60 17 7 -25 4 -16 -28 43 8 -26 18 11 -13 23 16 -11 36 -5 -41 39 46 4 7 -4 -32 40 41 -17 5 26
5429 26 -5 2 -1 0 15 4 -15 5 -1 -5 8 -26 2 43 -14 -41 32 -23 -29 52 -17 -59 47 -3 -60 53 25 -61 26 15 -57 29
5461 29 43 -72 -18 43 -12 -16 33 -33 -6 47 -16 -25 29 10 -16 0 11 11 12 -5 21 8 13 32 -18 -17 54 10 -22 29 1 -38 31
5494 31 9 -42 50 24 -60 1 35 -43 10 22 -55 23 37 -60 -28 31 -29 2 28 -56 -18 27 -34 -13 37 -28 -20 -2 -33 3 44
5525 44 -20 -33 12 7 -8 16 -15 3 30 -7 -4 17 4 7 19 -11 28 28 -27 1 33 2 37 24 -44 14 38 -10 15 33 -47 -7
5557 -7 37 -47 -4 60 -38 -44 51 -29 -28 44 -25 -46 51 0 -55 4 -8 -46 27 -1 -44 3 3 -38 15 32 -11 -4 -15 -21 13 17 -1 -9
5591 -9 2 9 7 -8 5 25 -27 -5 38 -11 0 33 -21 -10 68 -7 -34 32 -7 -5 50 -7 -35 29 6 -39 43 17 -27 30 7 -30
5623 -30 33 21 -55 -2 23 -17 4 3 -51 7 26 -13 -9 16 -23 -12 9 -14 18 16 -29 -20 10 10 14 -8 -13 16 -1 -3 23 3 -2 17 -3
5658 -3 -18 36 15 -18 20 18 -2 48 7 -27 35 41 -35 16 25 -24 17 24 -36 1 37 -39 -14 47 -18 -9 25 -33 -12 48 -15 -45 14
5691 14 -18 -17 8 -10 -25 13 -17 -30 7 7 -9 -12 -21 -12 15 3 0 -10 -15 10 -1 -22 24 19 -21 -10 18 -8 17 33 -30 -1 46 -30
5725 -30 -1 38 -3 12 30 -25 -11 49 -12 -33 40 8 -16 40 -3 -28 27 -4 -44 23 18 -16 4 -6 -16 21 3 -35 4 1 -17
5756 -17 -2 -24 -18 5 -5 -20 -8 -6 -3 11 -23 -6 14 -12 -3 9 5 -8 13 -13 -29 35 9 -30 21 1 -3 21 13 -21 23 17 -21 2
5790 2 21 3 26 -7 -27 25 14 -32 3 9 -35 10 13 -35 11 27 -28 6 17 -27 -13 6 -33 -3 20 -39 -24 15 -15 -9 0 -24 -3
5823 -3 10 -15 -12 4 -9 -9 -5 -6 36 7 -28 -9 8 -8 34 -2 -28 6 25 -17 13 27 -4 19 35 -25 8 42 -19 -26 19 -23 -7
5856 -7 22 -4 -8 27 -5 -25 10 3 9 17 -4 -11 14 -9 -28 10 -8 1 -1 -38 -10 16 -16 -33 18 -8 -22 11 -18 -28 24 -1 -18 12
5890 12 5 -31 0 -2 -2 33 0 -28 -4 -13 22 19 -2 13 22 -13 -6 28 3 9 42 -16 -18 34 -2 -16 44 6 -16 27 -3 -41 39 39 -36
5925 -36 1 18 -20 0 28 4 14 18 -28 -19 11 5 5 -5 -8 -6 8 -8 3 -20 4 17 -9 -21 25 4 -40 22 18 -5 26 -2 -49 17
5959 17 45 -7 -2 24 -19 -7 28 15 9 41 -4 -21 24 21 9 16 4 13 4 -13 4 12 10 13 2 -39 9 7 -26 6 29 -23 -22 2 -37 -15
5995 -15 35 -18 -32 5 -22 -15 12 -12 -28 13 -4 -33 -5 11 -13 -12 -10 -3 -2 -8 -13 11 -8 21 12 -15 -2 28 -17 1 41 -4 1 36 -13
6030 -13 -29 45 11 -35 21 14 -14 4 11 -9 10 18 -18 -7 11 12 -3 -4 -1 5 -8 3 4 -13 7 17 -35 -19 31 -14 -30 21 -15 -34
6064 -34 26 -4 -36 34 10 -57 13 20 -19 21 11 -39 -9 25 -6 -4 32 1 -7 15 6 22 31 19 -14 -6 12 23 6 7 37 11 -14 14
6098 14 10 -8 23 17 -27 23 41 -36 -18 39 -16 11 30 -26 -8 21 -9 -14 31 -8 -18 -8 -15 1 13 -6 -9 -6 -6 18 10 -17 3 25
6132 25 -27 -4 16 -15 11 25 -16 6 40 -14 -28 28 17 5 48 -5 -25 27 21 5 30 21 -16 -6 5 13 17 4 -5 -6 0 27 3 -38
6166 -38 10 23 -18 11 13 -35 -16 32 -28 -17 35 -29 -46 22 -1 -25 29 -18 -45 26 18 -37 -11 3 -24 2 12 -10 -1 11 -17 6
6198 6 25 16 -10 -24 0 26 4 -8 7 -19 9 41 -4 -5 22 -9 -16 45 33 1 6 -2 -19 38 23 -9 10 -2 -4 24 18 -13 8 3 -14
6233 -14 11 0 0 -1 -17 -19 21 -1 -36 -6 -3 -18 28 -9 -46 3 4 -16 13 16 -28 -15 14 -1 18 17 -24 -29 9 21 11 13 -7 -4 5 14
6269 14 7 -6 16 10 -11 5 38 -3 -27 10 9 4 46 -2 -46 22 29 -12 10 16 -33 -5 9 -40 7 15 -35 -35 13 -11 -10 10 -27 -19 10
6304 10 -18 -17 7 1 -5 0 -5 -9 -9 -13 1 -5 1 14 -2 -10 12 13 -17 -4 4 -9 13 24 -15 -9 25 -10 -10 6 -4 16 3 -10 10 18 4 -2 10
6343 10 -3 6 19 -22 7 23 -16 -12 8 -7 9 24 -19 -23 14 -11 -13 15 -13 -32 12 -11 -26 11 4 -44 -6 -4 -13 2 -11 -21 -3 15
6377 15 -1 -6 13 -4 -8 -7 17 15 -8 -3 -7 -6 25 29 -21 -9 34 -7 -5 37 1 -12 29 15 -25 27 17 -29 17 31 11 23 14 -37 -3
6412 -3 44 11 -8 -8 -23 -2 16 -1 -2 -1 -23 -13 12 -1 -6 -6 -30 -3 14 -6 -8 -15 -26 19 18 -13 9 -3 -24 0 30 5 1 -1 -17 7
6448 7 49 18 -13 -8 -3 25 36 8 -6 -4 0 11 32 11 3 1 -19 27 53 -3 -29 5 -21 19 45 -13 -42 10 -7 -20 31 4 -38 -1
6482 -1 -9 -14 33 14 -33 -30 2 4 31 -11 -46 -9 -8 0 8 -20 -32 -2 -8 2 41 -18 -37 -5 7 32 58 -15 -40 24 14 -9 37 12 -31
6517 -31 15 27 -7 32 14 -38 3 40 9 15 -1 -32 9 27 1 2 -19 -18 22 15 -6 15 -7 -43 9 19 -3 14 -18 -48 13 20 -16
6550 -16 11 -12 -44 20 35 -26 6 7 -38 4 27 2 -2 -2 -28 26 40 -9 3 5 -8 24 38 -1 9 15 -9 7 39 -5 9 13 -14
6583 -14 10 47 -8 -3 29 -10 16 32 -31 -7 19 -15 6 14 -33 -15 -6 -32 -1 22 -15 -23 5 -9 5 19 -29 -19 9 -37 -15 15
6615 15 -9 -11 13 -27 -8 34 -14 -11 9 -2 -11 27 -2 -12 22 0 -11 13 18 3 13 -8 3 27 13 -1 23 7 2 17 -11 7 28
6648 28 8 -11 23 1 -7 12 -12 -9 25 2 -23 -3 -23 -15 10 -13 -21 5 -19 -33 15 -2 -22 4 -23 -38 34 3 -27 -1 -22 -14 16
6681 16 -4 -29 2 -18 -27 20 15 -13 10 -8 -28 44 36 -20 -7 -15 -3 34 30 -19 4 -1 -2 32 20 5 1 -26 -10 21 11 -26 -9 -13 -19
6716 -19 29 7 -33 -11 -9 -10 20 6 -21 2 -20 -27 16 8 -48 -11 -15 -2 24 -2 -46 -4 10 2 29 -1 -34 -12 6 -3 31 14 -41 -16
6750 -16 18 13 31 10 -44 -6 21 10 23 13 -19 -16 2 31 22 1 -15 -10 2 21 28 -6 -43 2 11 1 20 -12 -35 0 17 -9 13
6783 13 9 -36 -11 8 -9 10 -2 -41 -11 19 -17 -22 -17 -31 -3 12 -15 -23 -3 -18 -10 22 10 4 -19 -22 8 21 16 5 -17 -15 18 29 1
6818 1 5 13 -18 8 37 3 -4 13 -15 11 44 10 -10 -3 -6 14 35 5 -19 -4 -4 8 16 -6 -6 11 -24 -7 32 -16 1 2 -20 -13 21 -17
6854 -17 -20 17 -6 -19 13 -1 -23 17 -4 -9 15 8 -20 0 7 15 19 -2 -9 1 9 25 21 -10 15 15 9 28 48 10 3 10 2 14 40 -17 -16 22
6892 22 6 -13 23 -13 -28 19 -15 -22 31 18 -19 -19 -8 -19 8 12 -25 -13 -1 0 -6 6 -3 -7 -13 -21 -6 1 -19 -17 -21 -9 22 -8 -31 2
6928 2 1 -4 12 -8 -21 5 10 -12 17 15 -18 6 23 8 20 2 -24 0 23 13 -4 -2 -17 -2 12 3 17 8 -28 -9 0 -8 21 5 -29
6963 -29 -12 18 -11 4 -1 -28 -17 3 -7 -11 11 -15 -25 -4 -4 -21 12 -3 -29 -7 -4 -13 -17 -23 -6 -3 -16 10 -10 -9 -5 -6 9 20 16 -11
6999 -11 9 19 4 14 13 -17 8 34 -4 -9 6 5 -19 14 14 -1 12 -3 -18 27 26 -1 -2 -8 -19 12 8 4 -6 -12 -17 -13 5 -8 7 -27
7035 -27 -28 9 17 -5 -8 -21 -8 10 1 -7 -2 -1 -12 -3 21 0 -7 -5 -16 6 18 11 -14 -15 5 22 1 5 9 -3 -8 8 0 11 22 -15 -11 17 16
7074 16 -4 4 -19 -4 11 5 -7 -6 8 -5 8 12 -9 -22 -8 -12 -12 13 -13 -45 -21 -2 -4 -2 -20 -30 -17 7 14 -9 -16 7 -18 -17 16 -3
7110 -3 -28 -5 -3 -12 43 24 -20 -8 10 9 21 10 -12 -17 27 18 20 29 4 -22 10 9 14 18 -15 -13 1 13 9 4 -7 -6 15 -3 -1 10 -12 -6 5
7149 5 1 5 1 -24 -27 7 2 -16 -2 -10 -26 10 8 -1 9 -14 -20 -5 15 15 -11 1 -10 9 8 5 -9 0 9 19 1 -6 18 -1 6 17 6 -3 20
7188 20 8 -8 25 21 -13 9 23 -10 6 8 -24 -4 26 -1 -13 24 -1 -6 1 -6 -7 4 0 -12 -15 1 -2 -16 -10 -5 -10 -12 1 -9 -11 4 2 -12
7226 -12 0 8 -8 -17 -5 -20 -10 15 -7 -7 2 -4 -10 6 22 13 14 -1 6 15 24 -1 -9 -4 15 3 -2 6 11 -9 -9 11 -8 -3 25 -19 -33 19 8
7265 8 -30 -9 -7 -17 10 7 -30 -8 -5 -18 -1 7 -7 -16 5 -16 8 5 -17 -31 -22 13 5 -11 -13 -14 -8 9 19 -4 -12 7 -19 -7 32 14 -14
7302 -14 5 4 4 27 23 -23 9 25 -4 11 10 -4 7 9 1 23 -1 -20 -4 -2 9 34 -5 -33 -7 8 -11 8 4 -25 -5 -3 -20 -12 0
7337 0 -34 -9 1 3 -9 -1 -22 -3 12 -1 3 -22 -13 13 8 -4 4 -9 -17 15 7 14 14 -1 -19 26 29 -1 0 12 -9 13 50 -12 1 29 0
7374 0 4 21 0 -6 7 -10 6 34 10 -18 -6 -1 10 15 -22 -1 8 -5 7 8 -11 -7 -14 -21 14 10 -20 -1 -7 -3 4 16 -24 -26 12 6 -5 7
7412 7 -9 -10 17 -3 2 14 1 -1 6 10 11 24 0 17 28 11 15 16 2 3 29 8 -10 22 12 2 19 15 2 7 0 -3 31 6 -5 -5 -14 4
7450 4 6 -21 -9 -18 -14 1 2 -18 -8 9 -18 -9 14 -15 -22 -2 -10 -9 18 -14 -25 -1 14 -11 15 -4 -27 7 19 -1 7 11 -10 -4 8 9 3
7487 3 0 -5 11 15 12 8 -13 5 26 6 3 10 -3 -3 18 10 -4 0 -18 -12 16 24 -8 -8 -21 -6 8 6 -4 -9 -7 -13 3 -9 -14 -5 -11 -14 9 4 -12 -21
7529 -21 -10 6 5 -9 -35 -3 6 5 -5 -3 -15 -3 2 12 5 9 -6 -10 -3 13 15 6 7 -7 3 16 9 -5 -14 2 7 0 17 4 -12 4 -7 -17
7567 -17 15 0 -25 -1 7 -17 -7 9 -30 -11 1 -5 -26 -2 -13 -7 -12 -8 14 -12 -8 -5 5 -9 -10 -15 -10 5 6 -6 -11 -8 -4 3 10 7 10 -1 -5 4
7607 4 24 6 1 -9 0 3 28 0 -2 13 11 15 -2 6 7 10 -1 8 2 10 -8 -5 -18 4 10 -14 -16 -3 -15 -10 6 -16 -14 11 -8 -21 6 1 -18 -6
7647 -6 -9 -13 -16 -13 -15 -4 -5 5 -12 -27 -7 4 10 0 4 -15 -5 1 -20 7 25 0 -1 19 -2 23 13 0 9 18 7 -5 29 12 -1 3 -10
7684 -10 -4 19 6 -8 -9 1 -12 -5 -13 -19 -1 2 -21 -1 1 -5 -10 -8 -13 5 -10 -9 0 -3 -18 -5 -15 -15 15 6 -22 -11 4 -1 2 7 -8 -9 0 -10 2
7725 2 7 8 6 -9 -8 13 3 -8 15 8 -14 5 15 -5 12 21 -5 14 26 -2 -2 9 -14 -2 22 -26 -14 18 -4 -7 5 -4 -5 -5 -15 -16 2
7762 2 -11 -14 -9 -27 7 2 -8 -19 4 -12 -4 -2 -19 -14 14 1 -19 7 -9 1 9 -7 7 24 2 2 19 8 5 28 -8 -1 23 3 7 0 10
7799 10 -8 14 0 8 23 -1 -11 14 7 -7 10 -18 -20 14 9 -16 -8 -1 -7 -2 -9 -17 5 -12 -19 1 1 -10 -7 -7 -13 4 -14 -19 -12 -15 -5 -3 -13 -15
7839 -15 8 1 -9 20 13 -17 0 -11 5 29 11 -20 11 18 -8 16 14 -12 11 23 1 17 10 -9 13 4 -9 18 5 -11 -3 20 -5 1
7873 1 2 -16 11 9 -11 -17 5 -18 -5 19 -12 -7 -7 -33 -11 13 -2 -13 -15 -21 1 7 -14 -13 11 -7 5 -1 -14 0 16 -14 -6 25 -1 6 11
7910 11 -4 7 34 -3 4 25 -3 4 31 2 5 22 -4 -2 19 -10 -8 2 2 -9 4 -15 -9 5 7 -1 8 -21 -8 26 -1 -9 6 -9 -20 6
7946 6 -11 0 -4 -15 -29 1 4 -8 -4 -23 -7 21 -15 -14 5 8 -15 1 -4 -20 5 -18 -10 10 9 -3 13 -7 1 21 13 2 13 7 1 5 9 -9
7984 -9 12 0 -6 8 14 -6 -2 -2 -2 15 -2 -13 -8 8 4 0 -5 -17 -11 1 -18 3 14 -16 -9 -10 -17 1 -2 -24 -4 4 -5 -10 4 0 -4 -7 -7 11 7 5
8026 5 9 -11 1 20 2 0 11 15 1 11 -3 -2 10 28 -2 8 25 8 11 -3 5 -13 -2 -3 0 4 11 7 8 5 -4 17 -4 -4 2 -11 -10 -6 -21 -9
8066 -9 -5 -13 -12 -3 -4 -16 4 -19 -12 1 -19 -16 3 -5 -12 0 -1 8 7 -5 1 6 -2 1 -6 -2 9 5 -11 -8 4 17 8 7 1 5 13 -2 1 9 4 -6 -8 0 -1 9
8112 9 10 -2 14 10 11 -4 -4 -6 8 -4 -9 -10 -6 -2 -7 -5 -6 5 -7 -13 -15 -8 -5 -4 2 -10 1 3 1 9 11 -6 5 -5 3 3 1 6 -1 22 9 2 -10 3 0
8157 0 3 9 -5 8 21 3 15 9 8 -4 -10 8 -2 4 -1 -10 2 10 11 -9 3 0 -8 -17 5 -16 -6 1 -14 -15 -2 -9 -4 -9
8191i
$$ Imaginary data points
##PAGE= N=2
##DATA TABLE= (X++(I..I)), XYDATA
0 0 0 0 0 0 0 0 0 0 0 0 0 0 -8 8 -8 8 -8 13 -16 16 -17 24 -25 32 -33 40 -48 54 -58 66 -76 86 -97 106 -121
35 -121 135 -150 167 -183 203 -224 248 -276 305 -338 377 -417 465 -519 581 -655 742 -849 985
54 985 -1156 1391 -1723 2238 -3154 5229 -18960 11996 32142 -30480 12576 24058 -34527 -11506
68 -11506 30690 -9615 -5425 18521 -11064 -13931 12611 -486 -1524 6675 -7047 -2677 8623
81 8623 -5360 -1545 6188 -6417 -1913 9701 -1538 -5312 248 41 1130 14 1736 4832 -8900
96 -8900 -5714 14493 -2142 -12096 13660 -428 -18106 16232 10803 -22701 3696 12743 -15543
109 -15543 5794 16977 -16038 -6523 9204 -8117 5760 14073 -12621 -4278 5052 -12958 8647
122 8647 19554 -16539 -6259 13847 -15848 -3783 26202 -7921 -16087 15642 -3725 -15043
134 -15043 16176 6294 -14779 4021 5946 -8114 928 5017 -2556 -953 1484 1394 -1247 -4324
148 -4324 2828 3706 -4293 2275 3038 -7987 1349 6644 -5468 2112 4963 -10715 1138 10520 -8126
163 -8126 115 9647 -13137 -3245 17338 -7084 -8146 14055 -7271 -12321 16520 2565 -12957
176 -12957 8658 1485 -13310 7554 8427 -8069 1081 2627 -6569 2315 4217 -2811 1854 -145
190 -145 -4250 3041 589 -3127 4509 395 -5122 2944 884 -4075 3247 1839 -2829 1882 -1117
205 -1117 -3416 3634 1002 -1500 3176 -3092 -4534 5423 1002 -3020 4576 -1703 -6470 4328 2256
220 2256 -2789 4339 -1072 -6610 3683 2054 -2881 4898 -817 -7195 4704 2420 -5847 5095
234 5095 2885 -8616 2516 5496 -6536 1133 6082 -5997 -1636 6272 -2959 -3088 4140 -571
248 -571 -1921 2432 -634 -2212 798 1094 888 -275 -1579 236 -271 -475 2998 382 -3268 297
264 297 26 -1085 3981 1096 -4573 169 784 -1906 4098 2241 -5406 -86 2118 -3271 2704 4700
280 4700 -4807 -2397 3007 -2112 507 4910 -2590 -3621 2264 -168 -514 2831 -913 -2158 1097
295 1097 -456 -169 2062 -1012 -1314 1347 -698 -405 1981 -1198 -1641 2087 483 -1330 510 -409
311 -409 -938 1444 1027 -752 -744 -713 90 992 590 600 -723 -2385 208 2082 337 540 -234 -3028 -244
330 -244 2878 229 -76 591 -2628 -1249 2701 668 -244 1070 -2244 -2230 2581 1546 -798 638 -1256
347 -1256 -2283 1882 1948 -1000 52 -170 -1813 564 1825 -133 -314 -367 -1177 368 1450 110 -572
364 -572 -587 -438 745 799 -367 -472 -219 -91 615 469 -350 -511 -410 144 952 493 -461 -932 -856 690
384 690 1751 155 -1069 -740 -782 488 2039 249 -1349 -494 -687 -173 2150 1068 -1603 -1025 -417
401 -417 -176 1983 1487 -1758 -1542 231 193 1057 1356 -1021 -1688 65 542 634 1048 -319 -1733 -576
419 -576 1092 1046 184 -548 -1081 -547 1078 1275 -470 -960 -143 -192 351 1265 -118 -1381 -242 295 341
438 341 1164 37 -1798 -570 1038 818 534 -336 -1517 -473 1123 954 259 -534 -1155 -407 683 1071
456 1071 728 -742 -1569 -197 941 965 688 -861 -1733 169 1304 419 226 -332 -1391 -134 1226
473 1226 466 24 -218 -1092 -348 1137 800 -200 -780 -762 311 940 331 -234 -736 -550 698 662 -236
492 -236 29 -360 -891 661 1079 -431 -329 -188 -875 714 1471 -690 -978 187 -255 408 1195 -611
510 -611 -1054 346 65 73 925 -165 -1021 -121 231 494 704 -427 -882 -75 289 732 457 -913 -514 489
530 489 -90 287 750 -760 -618 668 -226 -63 1002 -602 -950 878 222 -448 503 -506 -699 1229
548 1229 375 -987 172 -105 -584 1051 531 -981 17 3 -699 791 848 -645 -345 -165 -285 859
566 859 451 -837 -145 127 -50 822 -39 -1187 231 566 -224 773 279 -1428 -354 644 190 890 328
585 328 -1438 -668 455 474 972 -4 -1277 71 347 -497 830 477 -1307 298 939 -936 104 740
603 740 -1308 -32 1798 -177 -770 -128 -1061 193 1835 182 -595 -395 -1316 185 1696 -57 -162
620 -162 377 -1597 -566 1971 125 -907 577 -513 -626 1453 150 -1438 17 454 321 880 -338
637 -338 -1120 -261 -172 742 1734 -353 -1508 -297 -521 283 2166 281 -1710 -395 6 -59 1019 317
655 317 -546 -49 -385 81 793 -748 -448 1177 -445 -318 1665 -1161 -2300 1746 1285 -988 1157
672 1157 -56 -2883 431 2165 -452 195 618 -1716 -723 1103 404 483 11 -1208 86 614 -356
689 -356 525 53 -1298 748 1288 -1024 -411 380 -793 316 1284 -126 -397 -597 -883 848 983 -210
707 -210 525 -644 -1914 1241 1564 -1385 316 1093 -1894 -190 1922 -903 -727 1322 -507 -705 988
724 988 -92 -627 14 -118 876 497 -1330 97 545 -1251 970 1723 -1942 -670 1744 -1265 -664
741 -664 2371 -498 -1695 1041 11 -768 1143 66 -942 343 16 36 572 -769 -169 1016 -793
758 -793 -302 1368 -731 -861 1162 -290 -574 1109 -333 -825 651 -156 35 683 -1047 16 1346
775 1346 -1364 -358 2011 -1307 -1097 2360 -876 -1830 2443 59 -2445 1661 1035 -2032 622 1056
791 1056 -1319 226 808 -689 12 191 -162 436 -544 -291 1238 -608 -1007 1408 -182 -1199 1365
808 1365 60 -1442 1093 375 -1287 848 436 -976 635 -78 -838 1273 -47 -1353 1183 143
824 143 -1410 1413 421 -1928 1053 964 -1739 669 1191 -1449 19 792 -778 552 575 -1068 280
841 280 202 -815 1162 281 -1599 1047 608 -1953 964 1411 -1841 294 1420 -1673 -76 1582 -1200
858 -1200 -404 1432 -538 -480 459 -722 150 875 -494 221 257 -1205 303 813 -801 679 817 -1581
876 -1581 -154 977 -773 440 984 -1214 57 810 -1308 205 1297 -1045 228 1136 -1669 -255
892 -255 1600 -1142 -231 1948 -949 -1151 1160 -681 -606 1800 -69 -1129 565 -330 -609 885 52
909 52 -128 634 -738 -564 725 -390 -16 1061 -664 -456 940 -854 -731 1267 -58 -375 950
926 950 -734 -1020 945 -108 -396 1265 -139 -991 435 -451 -544 1384 256 -811 516 -347 -962
943 -962 696 330 -192 877 -244 -1138 207 14 -30 1108 -45 -792 377 -534 -744 1252 488 -639
961 -639 536 -406 -1255 899 677 -751 620 404 -1164 57 459 -563 512 714 -723 -210 294
978 294 -443 87 438 -145 179 94 -543 -42 192 -28 337 -19 -365 364 -19 -603 367 215 -361 561 147
999 147 -879 234 329 -729 472 883 -628 -279 193 -734 178 1149 -214 -504 214 -436 -342 650 283
1018 283 -85 95 -394 -435 259 345 190 -8 -289 -42 57 -186 179 302 -150 51 33 -492 101 533 -274
1039 -274 -108 374 -336 -273 407 -78 -119 469 -236 -562 342 319 -170 89 -56 -342 148 291 -59 -33 -10 -160
1061 -160 -105 75 331 184 -360 -250 124 10 240 339 -418 -334 377 -61 -203 524 56 -561 136 144 -260 376
1083 376 341 -560 -166 421 -98 -144 281 -23 -201 112 5 -208 124 306 -145 -312 143 123 -249 129 306
1104 306 -269 -111 235 -346 -103 736 -54 -605 220 46 -351 502 286 -598 59 276 -490 104 690 -228
1124 -228 -391 168 -99 -43 465 56 -420 -15 207 -72 -31 253 54 -293 -39 173 -104 113 298 -353 -285
1145 -285 461 23 -339 309 99 -356 194 94 -359 253 306 -365 -75 183 -122 72 122 -125 65 13 -216
1166 -216 111 106 3 232 -210 -409 384 219 -338 266 109 -547 205 308 -390 248 431 -620 -196 504
1186 504 -111 -27 319 -317 -257 340 27 -145 157 83 -132 -169 47 253 -55 -76 157 -296 -105 575 -196 -445
1208 -445 627 -33 -700 554 209 -714 584 324 -1044 352 763 -860 58 784 -746 -156 753 -584
1226 -584 -195 872 -396 -562 527 -65 -199 444 -167 -300 269 -110 -83 268 -86 13 27 -412 176 434
1246 434 -288 37 162 -469 214 407 -473 164 430 -599 -6 464 -397 227 438 -729 54 608 -566
1265 -566 95 588 -702 76 656 -836 73 969 -795 -215 858 -787 -152 1140 -779 -462 1192
1282 1192 -637 -698 1173 -306 -721 1020 -324 -907 1036 124 -866 630 126 -740 496 217 -514
1299 -514 388 143 -464 119 80 54 263 -331 -67 361 -405 96 573 -665 11 769 -879 -135 1234 -739
1319 -739 -519 1148 -734 -568 1499 -560 -984 1388 -311 -1147 1333 -12 -1140 1183 -51 -1359
1335 -1359 1163 410 -1263 842 349 -1256 748 491 -1161 688 615 -1172 309 583 -819 430
1351 430 526 -903 211 507 -675 218 436 -492 216 122 -586 417 307 -451 304 -57 -485 609 -3
1370 -3 -551 717 -98 -769 781 -43 -760 1076 -92 -1299 1100 364 -1346 1041 495 -1633 919
1387 919 860 -1742 676 1283 -1672 157 1379 -1404 -22 1452 -1255 -348 1496 -870 -597 1196
1403 1196 -570 -529 1066 -447 -550 911 -265 -604 573 -86 -230 435 -235 -191 267 -273 73 272
1421 272 -290 362 116 -907 339 586 -689 493 590 -1222 168 865 -1089 301 1361 -1117 -418
1438 -418 1008 -979 -139 1525 -769 -570 1201 -859 -760 1382 -333 -569 1316 -590 -1177 1189 -98
1455 -98 -915 1267 152 -1144 677 15 -1096 890 710 -794 251 210 -811 161 423 -210 375 224
1473 224 -473 -139 -150 -25 516 17 -68 326 -529 -449 478 -133 176 945 -603 -795 583 -414 -330 1368
1493 1368 -63 -848 728 -554 -1167 1351 631 -973 775 103 -1586 539 845 -881 669 960
1509 960 -1302 -392 631 -622 254 1112 -487 -407 315 -669 -281 806 216 48 131 -644 -400 290 69
1528 69 288 364 -222 -188 -230 -439 321 518 -34 200 -106 -718 81 207 -274 669 566 -741 -228 71 -597
1549 -597 492 937 -455 -89 284 -926 -185 906 -81 134 590 -868 -611 663 -151 -56 914 -225
1567 -225 -635 292 -408 -399 963 297 -481 229 -238 -694 394 373 -117 410 48 -707 -142 195 70 365
1587 365 121 -250 -110 -178 -119 212 109 157 186 -399 -255 274 -160 0 535 -144 -254 296 -415 -388 739
1608 739 168 -378 371 -156 -646 441 240 -416 480 263 -717 18 298 -306 270 365 -434 -6 240 -395
1628 -395 5 383 -88 63 98 -386 -11 271 -124 105 193 -245 -35 50 -236 218 310 -259 -88 97 -212
1649 -212 142 218 -279 40 223 -297 -5 261 -160 37 156 -308 39 315 -204 -30 197 -204 37 177
1669 177 -270 53 328 -269 -82 241 -222 44 325 -310 -87 393 -270 -198 414 -98 -148 329 -204 -263 407
1690 407 9 -297 238 22 -190 181 -48 -205 216 48 -178 111 29 -86 79 -118 -40 279 -46 -154 89
1711 89 -136 -44 293 -102 -122 282 -159 -293 260 34 -106 296 -146 -360 278 84 -246 271 111 -268 92
1732 92 -30 -228 305 206 -258 38 12 -181 177 82 -175 201 35 -314 106 130 -108 203 11 -349 172 191
1754 191 -255 103 166 -251 57 135 -227 119 230 -258 -73 161 -73 70 102 -193 3 125 -107 27 122
1775 122 -65 24 -58 -171 204 148 -168 56 -15 -211 222 127 -277 193 164 -390 61 282 -215 108 217 -420
1797 -420 -32 411 -178 -88 295 -196 -146 224 -113 -19 303 -135 -227 112 3 60 156 -143 -82 102 -148 7
1819 7 207 -47 23 31 -310 31 324 -75 -18 112 -263 -23 236 -151 60 279 -277 -199 216 -61 65 277
1841 277 -277 -198 254 -86 -60 306 -94 -156 158 -172 -45 374 -62 -193 131 -144 -5 329 -154 -130 280
1862 280 -180 -191 333 -13 -101 242 -224 -250 375 49 -168 185 -103 -191 208 -39 -68 312 -100 -241 155 -93
1884 -93 12 374 -212 -260 296 -143 -208 436 -38 -282 281 -188 -329 495 118 -354 205 -68 -321 373 104
1905 104 -311 276 18 -430 208 170 -147 255 -53 -422 212 170 -181 220 15 -286 147 -42 -183 397 42
1926 42 -330 186 -124 -217 521 -11 -468 365 -21 -504 469 198 -464 354 51 -682 394 436 -497 169 213
1947 213 -558 198 366 -420 207 304 -551 23 324 -299 235 266 -553 42 336 -340 163 345 -401 53 180
1968 180 -423 229 420 -378 8 132 -396 263 355 -420 160 238 -553 155 399 -357 248 244 -712 130 527
1989 527 -408 180 360 -672 59 485 -539 221 600 -696 -133 513 -516 143 713 -685 -243 658
2007 658 -500 -148 769 -422 -307 584 -460 -291 770 -195 -377 441 -267 -250 554 -186 -234 439 -252
2026 -252 -246 405 -171 -34 402 -429 -185 503 -260 -38 488 -484 -171 539 -440 -48 775 -481 -385 564 -444
2047 -444 -97 955 -455 -529 674 -417 -385 990 -164 -547 631 -422 -645 970 118 -577 575
2064 575 -245 -718 749 107 -528 649 -33 -771 447 135 -433 598 21 -658 407 90 -494 427
2082 427 107 -404 405 -40 -485 439 48 -374 415 -76 -361 520 -136 -492 589 -75 -483 649 -74
2101 -74 -560 645 -162 -742 816 210 -701 596 -50 -933 732 414 -744 648 236 -1150 340 550
2119 550 -602 615 455 -1114 41 569 -563 383 630 -736 -76 329 -601 244 659 -421 -39 194
2137 194 -504 169 370 -395 210 265 -508 134 161 -446 420 275 -616 292 242 -660 350 349 -632 415 376
2158 376 -840 309 525 -765 243 558 -765 270 666 -888 1 742 -673 82 811 -727 -211
2175 -211 676 -658 -83 990 -419 -424 508 -509 -207 875 -226 -346 469 -402 -350 596 -47 -107 406
2194 406 -418 -315 461 -114 -55 378 -375 -152 376 -379 -29 547 -360 -145 396 -470 -22 652 -482 -196
2214 -196 632 -481 -233 685 -395 -257 742 -466 -453 804 -206 -445 670 -288 -526 734 -99 -538
2232 -538 668 -87 -623 529 61 -435 570 -35 -653 444 144 -428 422 74 -502 322 66 -413 394
2251 394 170 -442 154 6 -282 394 73 -379 233 -13 -335 351 56 -288 355 -124 -472 460 144 -359
2271 -359 362 -52 -511 461 152 -488 416 139 -617 316 243 -470 393 231 -687 223 381 -467 198 310
2291 310 -528 134 366 -455 87 417 -408 -21 295 -316 96 334 -345 2 285 -312 -17 271 -212 120
2311 120 235 -422 -60 295 -179 106 253 -366 -77 203 -258 158 390 -285 -170 113 -281 175 444 -323
2331 -323 -134 217 -299 21 401 -245 -67 299 -328 -82 439 -224 -186 326 -159 -40 394 -290 -315 353 -17
2352 -17 -85 351 -186 -321 247 -44 -121 415 -24 -359 106 -37 -101 314 -14 -242 190 -23 -185 103 -53
2373 -53 -41 315 -36 -214 89 -181 -140 365 120 -71 130 -338 -361 386 259 -45 157 -248 -409 237 179 -72
2395 -72 294 -35 -388 73 82 -119 261 40 -285 168 125 -271 21 57 -110 290 185 -308 -79 22 -155 238
2417 238 286 -118 -49 -134 -285 177 343 -26 -14 -85 -251 112 172 -114 91 118 -177 25 33 -175 85 152 -100
2440 -100 137 97 -294 -126 83 16 298 164 -355 -190 75 -37 211 274 -197 -130 32 -178 101 322 -59
2461 -59 -124 49 -105 48 169 -110 -44 175 -15 -32 19 -140 15 157 -17 48 90 -193 -107 107 34 145 132
2484 132 -232 -144 120 5 57 131 -142 -57 119 -123 -33 179 -55 -57 98 -77 -43 112 -108 -57 192 7 -99
2507 -99 21 -91 -19 192 -20 -112 64 -48 -79 105 19 -23 88 -72 -119 103 76 -47 8 -13 -18 46 -24 -33 38 3
2533 3 20 -4 -84 63 105 -119 -17 97 -94 11 120 -116 -20 170 -146 -94 206 -5 -114 92 -69 -96 218
2556 218 3 -193 81 51 -101 95 60 -127 21 47 -97 81 132 -90 -117 -12 50 95 15 -87 -100 -30 100
2579 100 73 -51 8 25 -129 27 176 -35 -68 33 -106 8 210 -75 -185 67 34 35 135 -97 -177 96 39
2602 39 -18 161 -55 -189 40 20 8 214 -46 -308 38 145 12 121 -26 -266 39 186 -29 32 45 -187
2624 -187 -62 146 81 35 -61 -177 -63 148 148 -8 -182 -124 70 82 91 51 -174 -119 118 9 41 180 -159 -253
2648 -253 160 121 -39 130 -146 -292 240 247 -189 17 29 -256 114 285 -135 -53 59 -223 15 335 -1 -182
2670 -182 -55 -97 64 263 -16 -199 -84 -26 107 155 -28 -67 -83 -116 113 204 -36 -97 -99 -118 175 232 -108 -130
2694 -130 -24 -56 139 181 -130 -83 24 -87 110 209 -110 -112 3 -107 127 252 -192 -171 104 -23 73 213 -196
2717 -196 -202 177 -22 -31 253 -97 -275 108 52 -30 229 -90 -346 82 183 -14 108 -52 -273 66 150 -37
2739 -37 65 19 -183 -49 102 71 84 -67 -177 -5 70 89 65 -149 -123 146 6 -46 143 -75 -175 173 30
2762 30 -123 208 -28 -301 168 177 -171 80 18 -248 167 223 -208 -14 88 -192 83 193 -153 7 70 -245
2784 -245 57 292 -127 -85 64 -197 54 308 -125 -140 106 -118 -48 211 -22 -88 55 -121 -42 186 13 -65
2806 -65 -7 -149 28 170 -89 -49 101 -111 -42 130 -86 6 136 -153 -45 137 -98 9 131 -184 3 226
2828 226 -234 -88 302 -123 -134 247 -186 -181 348 -46 -290 253 13 -268 185 84 -182 164 7 -255 144
2849 144 109 -125 104 -11 -173 146 27 -146 160 69 -186 41 18 -104 170 62 -172 24 -7 -93 135 31
2871 31 -62 116 -138 -209 222 76 -107 159 -104 -292 240 140 -199 165 55 -294 108 150 -158 153 54 -310
2893 -310 129 207 -193 77 57 -283 195 297 -277 -9 159 -284 29 347 -110 -62 109 -228 -79 283 18
2914 18 -54 12 -130 41 112 -120 33 104 -112 83 67 -259 3 151 -118 143 199 -287 -171 46 -65 287
2936 287 285 -325 -208 39 -136 253 385 -264 -160 105 -272 37 460 -131 -215 165 -134 -72 296 -146 -216 236
2958 236 60 -20 117 -233 -172 248 64 51 221 -265 -343 151 94 125 306 -196 -407 57 82 74 195 -81 -163
2981 -163 58 -86 -46 154 -95 -39 233 -90 -116 112 -261 -142 456 154 -166 -8 -339 -223 440 260 -66
3002 -66 49 -303 -344 264 199 20 225 -215 -413 208 151 -117 193 -3 -272 197 132 -289 11 100 -69 203
3024 203 111 -233 -81 -80 -68 323 196 -183 -102 -191 -152 363 222 -188 2 -66 -209 160 151 -121 107 11 -195 110
3048 110 51 -200 90 76 -82 247 -7 -413 40 192 -46 245 103 -418 -82 177 -71 187 245 -266 -185
3069 -185 52 -68 175 205 -224 -78 83 -105 90 118 -180 44 177 -162 6 121 -166 -17 176 -66 11
3090 11 65 -221 -23 195 -13 30 25 -238 35 200 -144 21 141 -199 -24 162 -143 -5 167 -180 -50 212
3112 212 -104 -72 95 -146 15 220 -157 -94 142 -123 -14 209 -148 -94 200 -127 -125 253 -39 -171 124 -30
3134 -30 -92 197 -28 -157 87 18 -66 70 -64 -22 137 -67 -74 92 -57 -19 162 -88 -51 141 -135 -84 233
3157 233 8 -97 84 -157 -83 262 -33 -146 155 -84 -149 218 -8 -161 189 -20 -211 170 56 -184 82
3178 82 54 -96 160 25 -219 34 62 -21 137 -38 -176 81 -8 -83 201 23 -213 40 -2 -101 211 77 -227
3201 -227 28 85 -60 80 7 -149 82 77 -71 64 -13 -152 71 36 -50 148 -43 -250 83 126 -42 127 -29
3224 -29 -243 116 128 -125 105 34 -217 87 130 -155 106 82 -281 31 230 -120 -23 80 -190 24 233 -87
3246 -87 -105 56 -68 20 117 -29 16 -10 -139 68 119 -52 49 -27 -191 155 186 -172 -2 86 -160 74 184
3269 184 -165 -29 123 -160 -15 204 -89 -71 87 -128 24 209 -129 -125 102 -42 0 141 -90 -86 106 -64
3291 -64 -1 152 -85 -80 30 -111 60 189 -132 -105 109 -82 7 193 -141 -102 171 -79 -108 189 -42 -131 105
3314 105 -44 -53 144 -49 -137 93 0 -13 95 -91 -55 159 -38 -61 130 -82 -99 152 -41 -61 200 -60 -177
3337 -177 140 38 -88 130 -43 -156 150 50 -128 97 21 -143 75 41 -76 104 11 -134 36 49 -14 64
3359 64 -63 -92 103 0 -71 103 -21 -90 120 -41 -92 177 -1 -185 103 54 -122 118 46 -180 102 105 -159
3382 -159 39 97 -101 34 61 -102 67 73 -129 20 73 -48 33 -4 -126 88 81 -105 27 34 -103 60 67 -112
3406 -112 60 52 -144 22 107 -63 17 7 -123 56 115 -77 -14 41 -93 20 65 -72 42 48 -119 17 82 -41
3430 -41 33 15 -135 46 115 -106 14 59 -110 45 100 -124 24 123 -124 -28 134 -65 -28 83 -94 -21 150
3453 150 -62 -81 59 -3 1 64 -66 -33 74 -42 9 71 -57 -6 37 -100 35 148 -88 -71 52 -45 26 106 -103
3478 -103 -53 88 -68 -16 103 -42 -39 48 -91 -2 146 -72 -68 73 -47 9 116 -96 -60 132 -40 -69 96 -43
3502 -43 -49 95 -43 -42 131 -47 -110 92 17 -33 93 -51 -107 117 34 -79 39 7 -47 59 -11 -39 59 -26 -47 66
3528 66 0 -16 55 -107 -56 154 1 -74 63 -81 -98 143 5 -81 105 -34 -159 84 57 -52 95 -20 -150
3551 -150 98 60 -116 51 55 -83 58 20 -112 45 85 -71 35 38 -69 -3 3 -58 111 68 -98 1 -6 -62 111
3576 111 60 -119 42 65 -97 25 84 -58 12 44 -56 45 33 -98 8 43 -18 92 -26 -172 41 99 -77
3599 -77 82 74 -163 -21 65 -107 76 153 -136 -85 62 -70 20 114 -89 -15 101 -99 -46 107 -32 7 132 -84
3623 -84 -77 102 -34 -59 116 46 -58 -7 -56 -17 78 20 -1 -4 -72 36 62 -89 34 123 -113 -45 116 -63 -52 120
3649 120 -73 -54 146 -28 -115 66 -8 -14 116 -51 -64 87 -51 -62 144 -6 -81 102 -59 -111 147 62 -122
3672 -122 65 47 -106 38 15 -75 73 52 -78 9 5 -26 83 2 -67 88 5 -116 56 58 -37 30 -8 -99 48 69
3698 69 -34 5 -3 -21 53 -38 -34 111 -5 -101 81 8 -89 107 16 -152 84 76 -162 28 107 -95 17 49 -132 19
3724 19 121 -73 -22 51 -89 -1 70 -71 44 91 -126 -42 110 -32 -17 72 -78 -41 98 3 -38 36 -16 -13 9 -24
3750 -24 51 43 -62 5 41 -53 66 59 -110 8 101 -71 -40 104 -35 -12 70 -82 -27 104 -37 -33 72 -47 -20 57
3776 57 -69 -6 165 -61 -94 86 -11 -47 117 -21 -120 79 28 -77 61 42 -83 -14 -11 3 102 11 -75 -7 -18 22
3802 22 110 -19 -80 48 -47 -66 117 58 -29 19 -56 -87 99 53 -24 38 -34 -59 33 -20 -35 127 9 -112 31 -12
3828 -12 -83 96 55 -90 64 13 -145 -2 76 -1 59 11 -123 17 55 -43 56 58 -77 0 8 -78 59 70 -72 0
3854 0 62 -38 -11 13 -62 23 96 0 -10 -23 -72 34 44 12 82 6 -143 -37 54 21 114 56 -154 -41 45 -41 65
3881 65 103 -54 -32 6 -92 23 112 -49 -28 59 -47 -45 29 -63 24 144 -21 -79 -17 -70 0 122 21 -19 14 -111
3907 -111 -52 100 49 15 8 -116 -60 97 16 -34 30 -11 -15 54 -13 -39 34 -7 -2 80 12 -48 -52 -55 62 150 6 -70 -42 -70
3937 -70 23 144 -4 -46 19 -71 -41 112 43 -34 22 -63 -22 110 14 -92 23 14 -4 78 -35 -119 44 59 -13 76 2
3964 2 -104 -23 39 29 74 7 -112 -48 52 75 56 -46 -85 10 46 32 45 -28 -54 15 26 20 58 -36 -91 3 47 39 44 -79
3994 -79 -97 75 46 -13 46 -43 -83 75 46 -34 61 -3 -125 51 93 -38 8 -6 -114 28 128 -45 -58 20 -39 16
4020 16 74 -24 -60 10 -12 7 38 5 -47 -62 -13 92 42 -43 -26 -52 -9 113 33 -98 10 8 -65 83 87 -65 9 29
4048 29 -90 61 117 -84 -39 53 -19 33 62 -77 -1 108 -16 -13 32 -57 -13 80 -15 -2 60 -75 -35 68 10 29 27
4075 27 -110 -10 110 -21 -33 34 -53 -11 93 -27 -56 47 -32 -51 70 24 -37 -39 -49 14 68 7 -19 -30 -67 71
4101 71 87 -90 2 73 -91 12 128 -97 -44 120 -85 -57 167 -44 -150 111 30 -60 110 -23 -150 88 90
4124 90 -80 39 12 -110 21 79 -21 18 0 -81 -13 41 36 12 -90 -44 68 5 -1 41 -101 -61 125 -21 -68 97
4150 97 -43 -138 111 66 -83 66 -13 -136 105 107 -107 -11 21 -60 61 67 -67 4 11 -57 65 36 -71 30 -23 -70
4176 -70 124 62 -133 -1 26 -73 109 84 -168 -11 95 -92 36 129 -109 -63 78 -54 5 127 -73 -101 33
4199 33 35 19 19 -46 -40 23 3 48 -25 -75 42 -19 -81 110 45 -143 37 86 -107 73 96 -177 -11 166 -104 -39 116
4226 116 -104 -65 146 -50 -88 117 -22 -99 93 35 -53 26 -27 -38 89 29 -33 2 -35 17 41 -43 21 70 -76 -13
4252 -13 86 -47 1 97 -103 -54 129 -11 -60 87 -25 -63 81 -3 -79 89 -2 -94 24 4 -23 36 -37 -50 43 -23
4278 -23 -17 54 -55 -30 87 -63 -51 128 -29 -95 82 1 -75 115 -21 -138 100 69 -107 44 55 -92 39 66
4302 66 -67 2 51 -54 -11 56 17 -13 -37 -34 58 41 1 12 -73 -33 107 -17 -54 79 -44 -115 91 50 -79 67
4328 67 -19 -141 71 98 -103 -22 21 -85 57 82 -89 -22 45 -51 25 77 -34 -27 -14 -39 61 88 -38 -44 -24 -26 79
4355 79 51 -84 2 10 -47 54 55 -87 5 42 -43 42 73 -97 -69 59 25 46 28 -106 -52 64 37 51 3 -89 -22 7
4383 7 -16 95 47 -111 -23 51 -28 49 51 -125 -20 125 -42 -42 40 -79 -6 121 -14 -55 -3 -57 -48 105 68 -23 -33
4410 -33 -73 -44 89 52 -21 -31 -38 24 49 -18 -5 17 -32 26 42 -55 -30 25 -40 37 119 -51 -111 -6 -19 50 153 -39
4438 -39 -120 11 -17 -1 99 8 -51 9 -45 -22 72 1 -41 43 -5 -8 42 -65 -88 108 71 -27 14 -66 -104 73 85 -6
4466 -6 27 -39 -119 0 84 44 38 -40 -72 9 48 24 13 -29 4 58 -7 -35 15 -41 -1 95 25 -47 -7 -74 -53 147 80 -69
4496 -69 -25 -64 -66 113 78 -78 -11 6 -69 34 62 -46 -7 34 -42 13 26 -75 -46 37 45 67 -19 -107 -43 42 46 69 -14
4525 -14 -120 -33 26 -2 73 50 -108 -60 21 24 57 35 -92 -25 55 28 1 -18 -50 21 58 -1 5 -32 -81 21 68 2 32
4554 32 -28 -128 27 105 -6 -1 -4 -108 26 120 -35 -49 30 -67 -20 85 -8 -66 6 -41 -18 99 19 -90 -33 13 18
4581 18 58 -12 -64 -19 9 39 46 -25 -25 -23 -40 60 83 -48 -55 -4 -45 38 100 -72 -88 52 -9 -13 78 -23 -77 51 3 -38
4611 -38 45 2 -63 21 37 9 19 -57 -42 59 48 1 -6 -75 -47 68 27 -18 32 -45 -81 42 30 -6 36 -35 -79 43 65
4640 65 -36 -9 -13 -35 48 39 -49 -14 1 -31 31 26 -20 -10 -28 -37 43 52 -18 -9 -33 -27 63 4 -49 45 14 -51 28 6 -78 39 42
4673 42 -81 8 58 -87 -20 78 -18 1 38 -73 -50 72 22 -7 13 -42 -30 19 11 17 28 -30 -34 0 -7 38 28 -65 -13 31
4703 31 -23 8 28 -41 4 27 -59 6 50 -38 -17 34 -30 -4 47 -45 -25 62 -29 -40 45 -5 -19 39 -42 -51 47 16 -22 26 -15
4734 -15 -31 22 -20 -12 44 0 -35 -2 -3 -5 40 -16 -50 20 2 -25 34 -1 -17 11 -41 -38 44 21 -18 1 -34 -31 47 8 -32 32 -6
4767 -6 -57 23 17 -5 40 -23 -65 24 34 4 30 -11 -40 21 14 -19 41 16 -34 16 6 -15 32 7 -51 9 40 -30 -11 12 -25 25
4799 25 5 -47 2 31 -2 7 5 -31 -19 -1 -20 24 20 -37 -41 5 5 37 -4 -61 3 11 18 40 3 -58 10 15 -29 48 45 -46 -35 30 -10
4834 -10 35 57 -58 -42 45 20 -26 27 -6 -17 23 6 -12 15 14 -7 1 14 19 -20 -38 22 31 8 -3 -29 -41 42 37 -26 -13 1
4866 1 -39 20 62 -7 -11 -5 -57 -16 94 13 -51 -33 -20 7 59 17 -40 -11 -5 3 32 9 -11 -25 -39 24 50 0 -15 -5 -25 22
4898 22 65 -41 -38 36 6 -13 36 -5 -42 26 22 -23 36 -12 -50 0 37 32 16 -23 -42 14 50 41 -25 -51 -10 11 11 46 13 -49
4930 -49 -21 31 -6 32 45 -73 -65 64 30 -11 37 -32 -59 71 42 -42 15 14 -53 15 50 -13 -10 -2 -6 25 50 8 -26 -20 27 60
4962 60 11 -30 0 -24 29 51 -10 -25 20 -10 -13 74 29 -52 -22 5 -9 72 28 -70 -23 32 4 38 30 -52 -25 21 13 25 21 -22
4994 -22 -27 -7 17 51 0 -50 7 5 -2 18 -7 -57 32 29 -48 20 29 -62 6 54 -27 -9 22 -53 -19 98 23 -49 -5 -15 -3 62
5026 62 24 -37 -21 6 3 21 7 3 -13 -24 26 41 13 14 -16 -33 62 66 -41 -8 18 -26 26 79 -29 -33 36 -40 -25 90 9
5057 9 -60 19 3 -12 55 17 -56 33 33 -27 13 0 -16 25 3 -6 14 -6 -17 23 21 24 31 -47 -36 36 36 9 18 -30 -33 48 19 -25 28
5092 28 9 -32 17 24 -4 25 -2 -45 26 39 -6 -2 -14 -8 46 17 -15 3 -16 -2 25 5 -2 42 -17 -46 48 20 -36 13 14 -36 34
5125 34 37 -63 -4 67 -22 6 35 -39 -20 40 -12 -18 41 -8 -43 25 34 15 5 -13 -9 10 8 24 -4 -10 22 7 -24 29 21 -47 11
5158 11 12 -26 45 47 -55 -11 62 -27 -23 32 -18 -9 57 -18 -37 51 7 -24 25 18 -10 5 -2 -21 24 16 -15 -9 -6 14 28 -15 -13 12 -8
5193 -8 11 32 -18 -11 31 -24 -29 37 0 -27 20 -7 -17 44 8 -53 21 31 -29 6 15 -18 -2 20 -27 9 38 -5 -26 -9 6 16
5225 16 -15 -4 26 -2 -18 25 -11 -19 49 -17 -57 44 22 -50 25 24 -39 39 32 -66 -15 47 -26 -17 24 -14 -6 31 -21 -9 25 -6
5257 -6 -32 7 22 31 -8 -23 11 5 7 28 -3 -22 27 10 -33 36 51 -50 4 26 -39 25 46 -43 -12 62 -17 -20 43 -3 -19 36
5289 36 -18 -39 14 -2 -32 16 7 10 -5 -35 -6 29 -5 1 18 -42 4 26 -49 -1 50 -33 -24 41 -19 -23 43 -15 -28 57 14 -45 -3
5322 -3 1 8 50 9 -33 -8 -3 2 23 20 9 -14 -42 2 27 1 14 13 -50 1 53 -39 -16 61 -13 -31 54 -29 -54 52 11 -42 52
5355 52 8 -75 -5 34 -6 39 27 -65 -26 38 3 -10 29 -1 -14 -7 -8 13 5 16 15 -13 12 27 -27 -31 45 -2 -6 24 -27 -37 60
5388 60 16 -39 28 -4 -55 9 27 -22 42 17 -59 10 37 -6 4 17 -25 14 2 -57 14 6 -20 15 18 -22 4 0 -40 25 49 -30
5420 -30 -10 2 -33 23 38 -28 -11 17 -28 -14 17 4 2 -6 -16 1 8 -3 10 -23 -5 34 4 -37 24 2 -34 48 -5 -56 55
5451 55 39 -51 29 60 -50 5 56 -40 18 66 -37 -28 71 -7 -32 40 -15 -33 40 -3 -24 31 4 -5 1 10 -2 -10 -12 -10 9 -6 14
5484 14 -16 -29 36 18 -43 10 14 -46 16 31 -52 15 49 -68 -13 48 -23 -17 39 -39 2 54 -36 -35 44 -4 -6 31 -27 -28 47 -13
5516 -13 -26 42 -6 -43 17 2 -2 48 -12 -42 13 13 -13 19 -6 -15 28 -16 -25 -5 -13 -20 4 -4 -5 14 -21 -13 18 1 0 5 -43 -10 42 -16
5552 -16 -4 30 -27 -22 46 -12 -19 50 -23 -49 52 12 -51 40 -10 -30 52 8 -73 4 20 -25 27 28 -43 12 14 -27 6 47 -10 -15
5584 -15 -15 -4 16 13 -9 -12 -18 -2 8 -15 -7 11 -16 -22 28 7 -26 19 -28 -17 42 2 -60 7 4 -29 30 -5 -50 30 18 -55 0 29
5618 29 -38 -9 26 -33 6 18 -60 -15 42 -6 -8 10 -36 6 37 -18 -14 22 -18 -24 14 0 7 14 -41 -25 22 11 11 -9 -28 3 18
5651 18 -5 6 2 -21 11 -4 -25 19 22 -35 -1 18 -15 0 10 -40 13 18 -54 -15 35 -29 -10 30 -35 -24 40 -19 -32 48 -2 -23
5683 -23 15 -23 -19 45 -6 -49 13 13 -18 9 -4 -9 1 4 -13 14 9 -7 -20 0 -6 7 -4 -13 2 -15 11 11 -2 -1 22 -16 -21 19 -17
5718 -17 -1 13 -37 -20 34 -21 -29 19 -17 -31 28 -23 -34 38 7 -43 13 -2 -40 17 14 -36 25 9 -50 -2 24 -20 8 5 -21 5
5750 5 14 -17 -10 11 -5 -5 0 8 17 22 -15 -11 20 2 4 -25 -26 17 -2 -25 7 8 -12 1 -11 -28 20 13 -31 2 2 -14 15 1 -21 18 20 -26
5788 -26 2 19 -21 -6 -10 -23 13 27 -29 -2 21 -24 -5 7 -35 -3 35 -31 -28 22 -12 -19 8 -12 -5 18 -24 -30 24 4 -16 -3 -3
5821 -3 -2 24 -15 -21 -5 -6 1 2 -6 0 12 -15 -11 7 -5 19 9 -40 -6 39 -5 -11 31 -28 -18 26 -22 -6 36 -5 -42 20 9 -14 17
5856 17 -5 -4 22 12 -25 12 0 -9 14 -2 -12 13 -17 -19 19 9 4 17 -9 -30 24 4 -23 18 9 -22 19 -5 -16 23 20 -23 0
5889 0 19 -21 -2 5 -3 17 -10 -32 -30 9 7 21 -8 -8 9 -14 -18 21 -1 -14 7 -33 -43 33 7 -35 22 15 -42 -7 7 -32 17 39
5923 39 -42 -23 30 -18 -9 23 1 -1 16 -14 -29 15 9 5 2 -9 12 2 1 6 4 4 18 -16 -21 16 14 -23 21 33 -7 4 4 -38 8 51
5959 51 -21 -27 21 -22 -20 27 7 -5 20 -15 -27 -1 3 15 -1 15 -8 6 -12 -7 7 3 11 3 -37 -9 34 -18 -5 45 -12 -23 30 -17
5993 -17 0 47 1 -40 20 1 -16 9 8 -6 14 4 -18 7 27 -3 3 -1 -2 12 -23 -14 1 -8 9 16 -19 -3 34 -6 -27 30 1 -22
6027 -22 23 -7 -39 38 17 -46 2 26 -26 -9 28 -15 9 34 -17 -17 24 11 -1 1 17 1 -1 6 15 4 9 21 -16 -12 43 1 -23 20
6061 20 17 -20 24 20 -25 26 27 -45 -1 53 -20 -8 17 -25 -14 30 2 -23 29 11 -26 8 8 14 19 -1 -13 7 1 5 2 -9 25 4 -29
6096 -29 11 16 -28 6 20 -29 10 43 -26 -27 21 -9 -10 25 -13 -8 20 0 -13 22 8 -12 -6 6 21 10 1 -21 10 1 19 20 -28 7
6130 7 14 -8 -8 23 -15 -3 33 -1 -15 34 -15 -33 33 36 -5 -1 -14 -29 27 25 -15 -10 7 -17 -9 4 15 6 -5 -15 -6 3 10 -8 -34 1
6166 1 24 -18 -15 20 -21 -19 30 1 -14 34 -12 -19 41 32 -22 11 2 -34 25 39 -23 -19 26 -6 6 16 -15 -2 0 -3 0 9 -5 -3 -17 4
6202 4 25 9 -17 -12 -8 0 23 -4 -23 13 -3 -17 34 28 -26 5 -2 -8 45 13 -30 -31 1 2 5 8 -15 -6 -5 -10 12 12 -13 12 -7 -9 29 5
6240 5 -26 8 2 -6 11 -1 -30 2 31 -9 2 18 -24 -4 17 10 8 24 -17 -23 19 14 0 -17 -10 -16 12 -2 3 -18 -3 7 -12 10 24
6275 24 5 -34 9 12 0 18 5 -47 9 31 -14 6 21 -33 -11 24 -18 -6 42 -17 -33 30 2 -10 10 -8 -22 22 7 -30 -6
6306 -6 17 -8 6 -4 -2 7 -4 -9 -8 5 5 7 -19 -1 28 -14 -11 1 -6 -1 4 -10 -11 25 -7 -13 4 8 -19 3 -16 -6 16 2 -7 5 -4 1 17
6345 17 -15 -7 22 -11 -18 18 4 18 21 -17 -20 37 2 -27 14 7 -21 9 4 -11 17 26 -27 -6 22 -2 3 15 -7 -5 26 7 -16 4 10
6380 10 -10 -4 14 10 -10 -9 4 -12 -1 10 -24 -23 26 10 -3 14 -5 -18 23 13 -20 13 13 -47 -13 33 -7 -15 -7 -21 -4 45 4 -25
6414 -25 3 -2 -1 21 6 -14 -1 -13 10 13 18 -2 -14 -16 3 38 3 -17 -6 -12 21 19 -12 -3 3 -33 0 47 -7 -19 -8 -16 12 49 1
6449 1 -38 -9 10 12 22 5 -16 2 13 -2 21 -3 -25 7 -26 16 35 -18 -36 5 1 6 23 -4 -33 14 16 -7 23 4 -38 -3 10
6482 10 3 32 5 -51 -18 33 21 -2 -11 -27 -8 20 6 14 -23 -24 4 9 10 30 -21 -55 4 7 -10 16 -35 -45 24 35 -22 3 2 -47
6516 -47 7 38 -7 15 20 -34 -10 46 -4 -16 -6 -28 1 28 -8 -13 -12 -17 24 26 -8 2 -9 -29 16 34 -5 -8 -14 -27 16 46 -8 -18
6550 -18 11 -20 5 47 -11 -9 16 -13 -8 39 -1 -11 4 -9 6 29 -7 -34 7 -3 8 15 -20 -14 11 -11 8 26 1 -26 13 -15
6582 -15 -1 23 -11 -32 21 2 -3 18 -17 -34 32 3 -13 22 -5 -4 4 7 5 16 -14 -27 10 10 4 15 -24 -25 21 -11 -13 36 -7 -14 30
6617 30 -12 -3 32 -3 -18 16 0 -17 37 -3 -22 29 8 -23 29 7 -17 15 -8 -11 22 16 -11 9 -1 -15 11 1 -16 18 -1 -20
6649 -20 12 15 -6 12 -13 -18 34 17 -9 -9 12 -15 18 7 -10 21 12 -19 22 29 -14 8 4 -8 32 19 -19 -13 8 -1 23 5 -36 10
6683 10 1 -18 22 32 -19 0 0 -8 31 37 -33 -20 6 6 26 14 -26 -9 1 -8 11 11 -19 -19 -11 -1 33 11 -33 -19 7 -1 24 15 -43 -5
6719 -5 9 1 15 3 -22 -7 3 2 26 21 -23 -17 14 -1 14 -2 -43 -2 27 9 8 5 -41 -4 18 -3 17 10 -44 -21 35 29 6 14 -45
6754 -45 -8 43 18 -9 -3 -20 -9 25 15 3 -1 -28 -1 20 16 14 -30 -35 -1 34 5 2 -8 -35 24 33 -13 8 10 -29 -11 33 -4 0 14
6789 14 -14 -2 43 -3 -16 -2 -2 -2 30 -4 -36 4 3 3 21 14 -13 -15 -13 9 22 3 -17 -24 -11 21 26 -4 -10 -9 -17 10 22 -15 -5 2 -12
6826 -12 0 24 7 -18 0 10 21 38 -5 -9 8 8 3 21 15 -6 3 -15 5 34 -1 -20 -7 -7 4 20 0 -7 32 7 2 19 2 -10
6860 -10 13 2 -4 7 11 -22 -7 12 6 6 -5 -18 5 24 17 0 -13 -9 14 -3 3 22 -1 -20 5 -16 -4 40 -15 -35 19 5 -2 22
6894 22 -2 -26 0 6 -19 9 13 -26 -15 12 -4 3 4 -22 -3 12 6 1 8 -8 -5 -5 5 8 7 -7 -4 -5 3 11 0 -31 6 9 -4 7 8 -18 13
6933 13 16 -20 7 15 -13 2 16 -1 8 -10 -19 2 22 4 -8 -4 -4 9 33 -3 7 11 -21 -3 14 8 7 11 -28 -12 16 15 -2 -1 -26 -4
6969 -4 16 11 -2 23 9 -20 13 22 -4 15 -2 -13 8 23 8 -8 -1 -6 -5 -12 3 12 -10 -4 9 -3 8 4 -16 -11 27 2 -14 4 -19 -15
7005 -15 18 -10 -20 17 7 -29 5 -2 -16 5 5 -12 26 18 -21 -10 -16 3 15 21 -7 -23 -2 -8 11 16 13 -8 -12 -1 6 22 7 0 -2 -9 22
7042 22 16 -4 7 13 -14 7 17 0 -4 1 -19 19 29 2 -19 -10 9 14 5 -8 -9 0 -8 6 9 -16 2 -13 -25 24 20 -17 -12 6 -14 5 23
7079 23 -36 -16 32 -4 -2 9 -15 -21 4 -1 -4 22 -2 -21 -15 22 13 8 -16 -19 -3 10 16 -6 -23 -5 -19 -11 11 7 -15 -5 -4 -4 14 12 -37
7116 -37 -26 15 0 -6 2 -16 -27 17 4 9 14 -6 -21 4 21 9 -4 -9 -16 10 22 -2 -10 -17 4 8 -6 0 -5 -7 -3 17 17 4 5 -9 -6 18
7154 18 30 -1 -3 3 -2 15 20 1 -15 18 6 1 14 3 -8 -13 -7 2 23 2 -4 -4 13 13 5 -3 15 2 -16 14 2 -2 12 -2 -21 15 15 -20
7192 -20 -2 21 -11 -13 7 -19 -5 27 -1 -13 11 3 -1 -6 1 -2 7 3 -11 5 7 17 -7 -6 15 1 2 2 7 6 3 9 -18 5 26 -2 -11 0 -3
7231 -3 1 20 1 -12 8 9 -11 9 16 5 -1 -4 -8 13 18 -2 -11 -6 8 8 -20 5 9 -11 -11 29 13 -6 21 -10 -13 32 17 -21 3 4 -15 21
7269 21 17 -13 12 13 -4 0 17 -4 -12 0 17 9 11 -8 -15 0 15 7 -9 -8 10 -1 1 16 2 -16 -1 2 0 24 8 -20 -9 5 -10 7
7305 7 13 -28 -1 29 -3 2 2 -16 -1 15 1 10 6 -27 -4 15 12 7 -24 -28 5 24 4 -16 -6 -9 -3 19 -1 -9 5 -8 -4 16 12 -4 -9 -16
7343 -16 4 26 13 -2 -1 -2 11 8 -8 -1 0 -16 5 20 -2 4 6 -13 12 30 -14 -24 -1 -11 10 24 -20 -6 20 -4 -20 20 -2 -12
7377 -12 -2 -10 -5 17 -11 -22 -22 5 15 11 -16 -16 10 -6 1 4 -9 -6 4 -11 4 18 5 -24 23 -6 -8 -3 -12 -15 23 8 -8 3 -12 -5 17
7414 17 3 6 8 2 -15 5 6 -6 9 -11 -6 8 -2 1 2 8 3 24 -3 -28 14 13 7 13 4 -13 9 0 -13 11 20 -14 -11 10 9 11 -3 -10 11 -1
7454 -1 0 8 -16 -11 7 -9 2 12 -12 -15 7 7 -10 20 -7 -20 12 25 -1 2 -8 -16 14 4 -13 -2 0 -6 -5 18 3 -7 -9 -3 10 2 -3 -11
7492 -11 -6 6 17 7 -13 4 -10 0 0 -1 -11 -12 -5 -7 7 8 -8 -6 -4 1 12 -1 -17 2 9 0 1 9 -11 -4 6 -5 9 10 -12 -2 -2 1 7 5
7532 5 -20 -15 24 0 -9 2 -11 3 5 9 -4 5 -11 -6 -6 11 32 -11 -6 5 -1 3 16 -7 -8 4 12 -1 15 10 -7 15 4 -15 3 18 -22
7569 -22 2 30 2 2 12 -6 -13 17 0 -2 1 -7 -3 6 14 8 0 5 8 6 -5 7 -15 -3 16 5 -11 -2 -4 1 7 3 -13 6 4 -4 10 19 2 -7 -1 -6
7611 -6 6 12 -3 2 8 0 10 -5 -5 9 -4 1 5 5 1 -6 1 7 13 23 -7 -2 14 -8 6 11 11 4 24 1 -11 -1 10 -3 -8 2 -12 1 17 6
7651 6 14 11 2 6 -3 0 9 1 10 11 -11 -2 21 -10 -4 2 -10 -17 5 24 6 12 -5 -12 4 -6 0 6 11 -13 7 7 -1 3 8 -3 4 16 9 13 11 -3 16 8 10
7696 10 13 18 7 3 4 -11 13 11 -8 -8 18 1 15 18 -1 14 8 0 0 12 18 8 7 1 11 12 -8 7 18 -3 8 -11 -6 13 24 -10 -6 12
7734 12 -5 10 13 -1 5 22 -18 2 19 -2 -7 14 10 14 16 -13 3 21 13 11 16 9 -11 17 -12 -15 16 8 4 26 -1 3 22 -5 -2 5 7 6 17
7773 17 -2 2 19 8 4 23 1 -7 6 13 0 24 -4 -2 16 3 -9 -1 1 -7 13 -5 -13 2 4 -11 6 9 -7 3 -2 -18 16 5 -11 9
7809 9 -1 0 24 20 -22 6 21 -11 12 11 -22 -8 10 -15 5 11 -5 7 0 -19 14 -2 -20 3 -4 3 3 11 -9 5 19 -11 11 12 -2 8
7845 8 6 -1 17 9 -20 -5 22 3 5 5 -2 12 23 -10 -7 9 0 -5 14 -13 9 19 -26 -10 30 10 8 13 3 15 16 -5 -5 23 -12 3 27
7882 27 -8 -3 18 -16 -11 26 3 -5 10 -5 -4 29 -5 -11 10 0 8 15 -3 -4 -3 -10 -5 13 -17 -7 7 -5 -10 16 -10 -25 15 4 -8 17
7918 17 1 -4 17 -14 -13 20 16 -11 18 -2 6 18 4 -17 22 14 2 2 -9 1 21 11 -16 20 12 -9 10 10 -7 17 -5 -7 23 16 3
7953 3 19 -1 -2 17 13 -14 11 1 -13 10 2 -2 9 7 -21 -7 5 3 3 4 -7 -8 11 -13 -2 15 5 7 7 -16 0 -1 -11 2 0 -8 -3 -4 2
7992 2 18 1 -11 -8 4 1 14 7 -2 -2 0 3 -10 7 -9 2 4 -3 12 6 -13 -7 6 12 2 7 7 -2 12 -1 -3 8 -2 -6 -4 -8 -2 2 -2 4 7 -6 3
8035 3 -1 5 12 14 1 -2 7 -1 -2 -4 10 -5 2 -6 -3 13 -8 -11 -7 -5 19 0 -3 1 11 5 -9 4 -9 3 11 -6 -9 23 6 -7 3 -8 -11 6 -7
8076 -7 -7 -5 1 -9 8 13 -2 9 -12 -15 -5 0 -6 -5 26 17 1 -2 0 4 10 1 -17 -14 2 -3 -15 -11 -12 -3 -11 -3 -14 -12 0 2 -16 0 2 -7 -4 0 -7 -11 1
8121 1 -1 -3 -4 -5 -11 -9 21 -3 2 -3 8 12 4 10 -2 -4 12 3 1 7 4 -14 -2 3 -5 18 5 -12 -4 6 -2 -5 1 10 3 2 2 7 5 7 6 -5 6 7 -5 -11 5
8168 5 -1 -15 15 -7 -24 1 8 -10 6 2 -5 -2 2 -7 4 -1 -6 -16 8 6 -14 -9 -2
8191b
##END NTUPLES=NMR FID
##END=
