##TITLE=1H_LY-836.1
 CCl4 8 sc, 
 6.6.2019
##JCAMPDX= 6.0         $$ Bruker NMR JCAMP-DX V2.0
##DATA TYPE= NMR FID
##DATA CLASS= NTUPLES
##ORIGIN= UXNMR, Bruker Analytische Messtechnik GmbH
##OWNER= root
$$ XWIN-NMR		Version 3.5
$$ Thu Jun  6 14:16:00 2019 Russian Standard Time (UT+4h)  she@DPX200
##.OBSERVE FREQUENCY= 200.13155
##.OBSERVE NUCLEUS= ^1H
##.DELAY= (6, 6)
##.ACQUISITION MODE= SIMULTANEOUS
##.ACQUISITION SCHEME= undefined
##.AVERAGES= 8
##.DIGITISER RES= 18
##SPECTROMETER/DATA SYSTEM= spect
##.PULSE SEQUENCE= zg30
##.SOLVENT NAME= CDCl3
##.SHIFT REFERENCE= (INTERNAL, CDCl3, 0, 15.7039)
##AUDIT TRAIL= $$ (NUMBER, WHEN, WHO, WHERE, WHAT)
$$ ##TITLE= Audit trail, XWIN-NMR		Version 3.5
$$ ##JCAMPDX= 5.01
$$ ##ORIGIN= Bruker BioSpin GmbH
$$ ##OWNER= she
$$ F:/spectra/data/she/nmr/H-F/1/audita.txt
$$ ##AUDIT TRAIL=  $$ (NUMBER, WHEN, WHO, WHERE, WHAT)
(   1,<2019-06-06 14:14:37.28 +0400>,<she>,<DPX200>,
      <created by zg, POWCHK disabled, PULCHK disabled
       configuration hash MD5:
       00 E9 B6 7A A2 85 ED C7 34 08 36 98 17 FE 4E 26
       data hash MD5: 16K
       0A 9A A4 32 79 F9 14 D3 FE DB 50 9F 78 FD FF 1D>)
$$ ##END=
$$ 
$$ hash MD5
$$ 5A B9 F1 83 58 FD 7D 93 6E 8C 47 39 CF 36 0C 4A
##$RELAX= 
##$RELAX= 
##$RELAX= 
##$RELAX= 
##$RELAX= 
##$RELAX= 
$$ Bruker specific parameters
$$ --------------------------
##$DU= <F:/spectra>
##$EXPNO= 1
##$NAME= <H-F>
##$PROCNO= 1
##$TYPE= <nmr>
##$USER= <she>
##$AMP= (0..31)
100 100 100 100 100 100 100 100 100 100 100 100 100 100 100 100 100 100 
100 100 100 100 100 100 100 100 100 100 100 100 100 100 
##$AQSEQ= 0
##$AQ_mod= 1
##$AUNM= <au_zg>
##$AUTOPOS= <>
##$BF1= 200.13
##$BF2= 200.13
##$BF3= 200.13
##$BF4= 200.13
##$BF5= 200.13
##$BF6= 200.13
##$BF7= 200.13
##$BF8= 200.13
##$BYTORDA= 1
##$CFDGTYP= 0
##$CFRGTYP= 5
##$CHEMSTR= <none>
##$CNST= (0..31)
1 1 145 1 1 1 1 1 1 1 1 1 1 1 1 1 1 1 1 1 1 1 1 1 1 1 1 1 1 1 1 1 
##$CPDPRG= <>
##$CPDPRG1= <>
##$CPDPRG2= <>
##$CPDPRG3= <>
##$CPDPRG4= <mlev>
##$CPDPRG5= <mlev>
##$CPDPRG6= <mlev>
##$CPDPRG7= <mlev>
##$CPDPRG8= <mlev>
##$CPDPRGB= <>
##$CPDPRGT= <>
##$D= (0..31)
0 1.2 0 0 0 0 0 0 0 0 0 0.03 0 0 0 0 0 0 0 0 0 0 0 0 0 0 0 0 0 0 0 0 
##$DATE= 1559816076
##$DBL= (0..7)
120 120 120 120 120 120 120 120 
##$DBP= (0..7)
150 150 150 150 150 150 150 150 
##$DBP07= 0
##$DBPNAM0= <>
##$DBPNAM1= <>
##$DBPNAM2= <>
##$DBPNAM3= <>
##$DBPNAM4= <>
##$DBPNAM5= <>
##$DBPNAM6= <>
##$DBPNAM7= <>
##$DBPOAL= (0..7)
0.5 0.5 0.5 0.5 0.5 0.5 0.5 0.5 
##$DBPOFFS= (0..7)
0 0 0 0 0 0 0 0 
##$DE= 6
##$DECBNUC= <off>
##$DECIM= 24
##$DECNUC= <off>
##$DECSTAT= 4
##$DIGMOD= 1
##$DIGTYP= 9
##$DL= (0..7)
0 120 120 120 120 120 120 120 
##$DP= (0..7)
150 150 150 150 150 150 150 150 
##$DP07= 0
##$DPNAME0= <>
##$DPNAME1= <>
##$DPNAME2= <>
##$DPNAME3= <>
##$DPNAME4= <>
##$DPNAME5= <>
##$DPNAME6= <>
##$DPNAME7= <>
##$DPOAL= (0..7)
0.5 0.5 0.5 0.5 0.5 0.5 0.5 0.5 
##$DPOFFS= (0..7)
0 0 0 0 0 0 0 0 
##$DQDMODE= 0
##$DR= 18
##$DS= 0
##$DSLIST= <SSSSSSSSSSSSSSS>
##$DSPFIRM= 0
$$ [...]
##$SUBNAM2= <"">
##$SUBNAM3= <"">
##$SUBNAM4= <"">
##$SUBNAM5= <"">
##$SUBNAM6= <"">
##$SUBNAM7= <"">
##$SUBNAM8= <"">
##$SUBNAM9= <"">
##$SW= 24.9336996594482
##$SWIBOX= (0..15)
0 0 2 0 0 0 0 0 0 0 0 0 0 0 0 0 
##$SW_h= 4990.01996007984
##$TD= 16384
##$TD0= 1
##$TE= 0
##$TE2= 300
##$TE3= 300
##$TEG= 300
##$TL= (0..7)
0 120 120 120 120 120 120 120 
##$TP= (0..7)
150 150 150 150 150 150 150 150 
##$TP07= 0
##$TPNAME0= <>
##$TPNAME1= <>
##$TPNAME2= <>
##$TPNAME3= <>
##$TPNAME4= <>
##$TPNAME5= <>
##$TPNAME6= <>
##$TPNAME7= <>
##$TPOAL= (0..7)
0.5 0.5 0.5 0.5 0.5 0.5 0.5 0.5 
##$TPOFFS= (0..7)
0 0 0 0 0 0 0 0 
##$TUNHIN= 0
##$TUNHOUT= 0
##$TUNXOUT= 0
##$USERA1= <user>
##$USERA2= <user>
##$USERA3= <user>
##$USERA4= <user>
##$USERA5= <user>
##$V9= 5
##$VALIST= <valist>
##$VCLIST= <CCCCCCCCCCCCCCC>
##$VD= 0
##$VDLIST= <DDDDDDDDDDDDDDD>
##$VPLIST= <PPPPPPPPPPPPPPP>
##$VTLIST= <TTTTTTTTTTTTTTT>
##$WBST= 1024
##$WBSW= 4
##$XGAIN= (0..3)
0 0 0 0 
##$XL= 0
##$YL= 0
##$YMAX_a= 43433
##$YMIN_a= -56030
##$ZGOPTNS= <>
##$ZL1= 120
##$ZL2= 120
##$ZL3= 120
##$ZL4= 120
##$ABSF1= 10
##$ABSF2= 0
##$ABSG= 5
##$ABSL= 3
##$ALPHA= 0
##$AQORDER= 0
##$ASSFAC= 0
##$ASSFACI= 0
##$ASSFACX= 0
##$ASSWID= 0
##$AUNMP= <proc_1d>
##$AZFE= 0.1
##$AZFW= 0.1
##$BCFW= 1
##$BC_mod= 2
##$BYTORDP= 1
##$COROFFS= 0
##$CY= 11.3945322036743
##$DATMOD= 1
##$DC= 2
##$DFILT= <>
##$DTYPP= 0
##$F1P= 18.9103706918063
##$F2P= -1.10871071338519
##$FCOR= 0.5
##$FTSIZE= 0
##$FT_mod= 4
##$GAMMA= 1
##$GB= 0.15
##$INTBC= 1
##$INTSCL= 1
##$ISEN= 128
##$LB= 0.24
##$LEV0= 0
##$LPBIN= 0
##$MAXI= 10000
##$MC2= 0
##$MEAN= 0
##$ME_mod= 0
##$MI= 1.114404
##$NCOEF= 0
##$NC_proc= 0
##$NLEV= 6
##$NOISF1= 3.799351
##$NOISF2= 2.8
##$NSP= 1
##$NTH_PI= 0
##$NZP= 0
##$OFFSET= 15.70392
##$PC= 1
##$PHC0= -8573.268
##$PHC1= 11.20019
##$PH_mod= 1
##$PKNL= yes
##$PPARMOD= 0
##$PSCAL= 0
##$PSIGN= 0
##$REVERSE= no
##$SF= 200.130013532006
##$SI= 16384
##$SIGF1= 3
##$SIGF2= 2
##$SINO= 400
##$SIOLD= 16384
##$SREGLST= <1H.CDCl3>
##$SSB= 0
##$STSI= 0
##$STSR= 0
##$SW_p= 3612.71676300578
##$SYMM= 0
##$S_DEV= 0
##$TDeff= 0
##$TDoff= 0
##$TI= <>
##$TILT= no
##$TM1= 0
##$TM2= 0
##$TOPLEV= 0
##$USERP1= <user>
##$USERP2= <user>
##$USERP3= <user>
##$USERP4= <user>
##$USERP5= <user>
##$WDW= 1
##$XDIM= 8192
##$YMAX_p= 0
##$YMIN_p= 0
$$ End of Bruker specific parameters
$$ ---------------------------------
##NTUPLES= NMR FID
##VAR_NAME=  TIME,          FID/REAL,        FID/IMAG
##SYMBOL=    X,             R,               I
##VAR_TYPE=  INDEPENDENT,   DEPENDENT,       DEPENDENT
##VAR_FORM=  AFFN,          ASDF,            ASDF
##VAR_DIM=   8192,          8192,            8192
##UNITS=     SECONDS,       ARBITRARY UNITS, ARBITRARY UNITS
##FACTOR=    0.0002004,     1,               1
##FIRST=     0,             0,               0
##LAST=      1.6414764,     0,               0
##MIN=       0,             -56030,          0
##MAX=       1.6414764,     43433,           0
$$ Real data points
##PAGE= N=1
##DATA TABLE= (X++(R..R)), XYDATA
$$ [...]
1006f44J49P03j188P98J508j166l99O77j192k18J636j60n35N11p38n02J016j01
1024A55m73O94j39n16N01k58n06O58O4l76O17j09p19K45l2j49R28J7r37J63N6
1045a16l53Q02K51q91K78K57p74M63P12p65m7M59o49K24Q65p60m74P00k35q7P35
1066E95n71n97P49j07m05P69p4q05M06J24m52O90K27r68R4N46l10J48L01n61r1
1087b92M48j21q5K09j53r4j3k0L05J0l79J28P2j82M53j1p61L42N08n49J94M61
1109D70q41k3Q42n83j51R86o69q15R69N1n93Q32j12j145O88O46q48K20N91p76
1129b61r1O90l92j76N77k90m51M23K08k41j6k7n9R0J46K7k96m7L67j54k60M59
1151B26m4n10L73J33n13N07K79r44K55P58p01KO86q27j37J081o04n56J035l66
$$ y = [-644, -495, 208, -980, -182, 1326, 160, -239, 438, -754, -972, 664, 504, -31, 480, -258, -760, 256, 155, -318, 376, 237, -279, 222, -36, -542, 116, 180, -196, 421, 312, -407, -162, -194, -343, 585, 602, -335, -172, -116, -469, 333, 584, -307, -29, 228, -546, -83, 629, -136, -183, 276, -373, -149, 716, -44, -518, 182, -53, -140, 595, 24, -573, 176, 69, -336, 433, 359, -446, -40, 84, -368, 322, 549, -419, -325, 221, -89, 59, 360, -201, -292, 156, 35, -50, 159, 6, -88, -101, -121, 184, 194, -185, -57, 15, -167, 286, 275, -486, -144, 364, -185, 9, 470, -371, -394, 448, -135, -286, 700, 31, -784, 185, 236, -357, 475, 363, -782, -94, 552, -296, -76, 515, -261, -352, 338, -54, -230, 347, 57, -394, 29, 237, -4, -20, -47, -106, -16, 130, 157, -139, -186, 181, 27, -233, 226, 182, -328, 45, 178, -335, 172, 451, -493, -238, 520, -181, -179, 507, -320, -457, 624, 20, -536, 499, 133]
1171A33q20R81L7q21Q09Q6j155O93P16r44J31O17q05M3Q23n50l32O90k04n09M34
1192E3J78k99N3J02j93o3L40J25n44J2O36m12l87P90k59p45R87L3j214R75O48
1213H16j616N11J246j453J0J514j405n50J986q80j290J777j95j549J491L34j741
1230i94J060Q33j715M85J289j241j93J065q12k96J108l82o97O14J10n05J85K93
1248B07j20k00R6J67l69M8P21n73o32J102j24j081J091K38j475J077P81j936P01
1267b81J522j951K2J999j712n84K322j435j338K625o20k086K215J72k336J805
1283C39Q78k510J103J568k270K44J907j599m38J722j050p65J585l61j077Q83J85
1300C44o96L36K77l38o2J91J45l76j19Q26m01r22J173K03j490J148P00k106R50
$$ y = [133, -687, 294, 331, -490, 319, 405, -750, -57, 659, -285, -154, 463, -342, -299, 524, -26, -358, 332, 128, -381, 53, 231, -68, -15, 87, -106, -169, 171, 296, -248, -236, 400, -12, -399, 391, 132, -613, 374, 407, -807, 168, 816, -800, -289, 957, -496, -486, 1028, -377, -927, 1059, 179, -1111, 666, 471, -1078, 413, 747, -994, 66, 899, -816, -331, 958, -283, -476, 589, -223, -519, 589, 207, -490, 124, 234, -271, -86, 207, 87, -113, -17, 150, -219, -171, 550, -23, -655, 447, 323, -758, 333, 571, -904, 173, 954, -982, -281, 1241, -710, -688, 1311, -401, -985, 1337, -98, -1436, 1189, 569, -1517, 698, 870, -1466, 339, 1217, -1293, -190, 1378, -892, -648, 1259, -340, -778, 944, -106, -871, 714, 353, -724, 159, 344, -352, -16, 261, -77, -139, 52, 197, -179, -298, 528, 127, -795, 378, 581, -909, 239, 939, -1167, -217]
1319b17J703k421J12K517k201q96K999j534j746L162q19k734K913M33l094K147
1335C24J241l170J398J940k996M81K546k360m73K499j610j049K314q58j406J908
1351G29q9j572R73M23q93M67L59n22n1J38J90r5m08O52J84j228O53R26j487M25
1371b26J379j904l6K235j775r02K666j349j707K924p49k491K995J94l336K475
1387C93J393l624J543K306l440O30L040l077p30L337j888j433L036j039k045K397
1403G99k11k027J908N56j850Q44N53j310O04O90q16K26L81l84o7k14J40N83n24
1422a19J03Q10j296k98J617j168n37K491j147k074K340l01k297K784P49l238J780
1439A99J379l528J190K760k849K57K775k987r27L232j794j285L456j050k397K378
$$ y = [-217, 1486, -935, -823, 1694, -507, -1403, 1596, 62, -1684, 1478, 659, -2075, 838, 1271, -1823, 324, 1565, -1605, -207, 1733, -1263, -782, 1764, -596, -1069, 1430, -180, -1229, 1085, 227, -1179, 729, 640, -932, 41, 464, -429, 38, 397, -125, -176, -38, 152, 57, -351, 301, 485, -743, -90, 836, -651, -226, 1153, -751, -787, 1448, -327, -1229, 1437, 88, -1619, 1305, 556, -1935, 1060, 1254, -2082, 393, 1786, -1838, -295, 2011, -1429, -799, 2241, -836, -1566, 1771, -117, -1550, 1486, 447, -1598, 799, 588, -1439, 469, 1025, -825, 19, 572, -738, -134, 556, -260, -34, 347, -37, -104, -318, -178, 405, -119, -16, 794, -502, -800, 817, -351, -888, 1603, 456, -1618, 722, 421, -1876, 908, 1657, -1581, 199, 1578, -1950, -760, 2000, -849, -592, 2183, -804, -1731, 1501, -293, -1578, 1878, 828, -1569, 809]
1455H09n66k369K730R55k423J225P02k498O20J593j071M72J065j393o12N60k30
1472d31L87N11j36K80o07r03O99l3k64J674k14j756R43j36j760J923J319j940
1490d44J028O68l182P37K585k032M14K640k799j400K812j635j221L793o02k742
1506a380K197l75k877K417J478k207J451J019l091M8J778j142P46J812j640r60
1522g26P60r70J0J696K7l55O5j072l73O07P4P52M89q74K2k08j360R40J417r15
1542FN65P72k352l09J821j184K46K584j614j796J708j013j185K962J08k141J655
1559H33j95k670J681J368j803J368J197k748K8J597j670L96K271j255q02J090
1575F86j432p23K001Q9n82Q49p71j120P00R0J1J028k31p07J07o16n1J076k96q3
$$ y = [809, 243, -2126, 604, 1559, -864, 361, 1063, -1435, -815, 778, -293, 179, 1244, -149, -761, -201, -431, -44, 467, 331, 611, 4, -899, -200, -233, -497, 1177, 963, -793, 150, 14, -1746, 177, 1496, -444, 584, 1252, -1930, -1193, 1392, -640, -226, 2414, -385, -1785, 1027, -608, -1829, 1964, 1362, -1380, 817, 442, -2435, -18, 1460, -747, 704, 1723, -1368, -1320, 458, -684, 62, 1874, 234, -726, 34, -936, -926, 770, 797, 442, 507, -565, -938, -331, -257, 495, 984, 110, 132, -76, -1436, -496, 921, 6, 571, 1343, -1009, -1318, 503, -681, -435, 2149, 535, -1261, 447, -566, -1751, 1211, 1319, -822, 833, 638, -2032, -351, 1017, -786, 582, 1779, -969, -941, 656, -1014, -618, 1653, 398, -404, 686, -746, -1469, 532, 621, 39, 888, 117, -1003, -303, -213, -202, 826, 595, -112, -5, -621, -672, 404, 108, 25]
1595B5Q57r35p34R29n45k49J753n00j270J134m85j350J702M92j412J210K27k205
1613a356Q92J310j490O53J288j822j28J459j376k13J834q79p52J304q04q66J392
1630D46k50p89J222j72j129P15Lo31J015Q7r00M99Jo76O89J62o01O18n8q72O89
1651F8K52p48O55J36r34O73L97j103N70O29j052L96O75j149K82R69j065qJ081
1670G24r73k63J110p77k99J243p35p85J176k88p07J100k38r45R46k2r55Q84L09
1689E05r33N34K34r23N95M63q73L57N21p60J87L83p10L42O06o99M8M85o88Q7N84
1710C45n77J70O39q02j62O94n30rQ06o46k93Q35n76m51R36k76m66Q54m08p11R18
1731B90r5p53Q61J04q65O08R6q99P31M74r15L70M24q86L19N69p67K48O71q14q7
$$ y = [25, 882, -53, -787, 142, -403, -652, 1101, 601, -669, 465, -20, -1370, 332, 824, -588, 622, 849, -1356, -464, 846, -644, 9, 1297, -525, -653, 806, -570, -783, 1051, 172, -580, 724, -80, -946, 446, 196, -593, 629, 457, -672, 43, 46, -585, 430, 517, -383, 116, 117, -559, 130, 292, -309, 309, 251, -621, 68, 320, -428, 227, 363, -571, 102, 499, -604, -34, 595, -457, -61, 614, -535, -253, 716, -349, -357, 724, -249, -512, 598, -179, -478, 765, 30, -755, 421, 133, -574, 526, 288, -657, 289, 267, -688, 196, 505, -428, 106, 340, -583, 12, 475, -398, -41, 480, -280, -93, 290, -420, -78, 528, -171, -123, 362, -326, -239, 345, -232, -62, 577, -225, -387, 307, -223, -232, 574, -72, -365, 470, -106, -557, 379, 103, -363, 491, 83, -628, 290, 195, -558, 303, 407, -458, 150, 246, -653, 78, 552, -363, 7, 431, -455, -136, 433, -334, -86, 585, -229, -316]
1752c16O63n19l3O43n39j72O56m43k92O20k54k00N09l84k51N90k61k94N12k30
1772Ek43N36l25l39O67k09m43O12j76m64P03j58o95P87J03q32N72K42q37N58M08
1793D72r66M02O47r00J25P23p35J2P14o89j87Q29m28l51O37l01l07N83k83l35
1813c38O01j25l77L86j48k39M60j79k80M94j91l50M36j67k46O35k47n42O00n2
1833A31n40O36K1o54O16Q1q42N68M36p75L06M21q03K68O03p77Q0P10o34j04N92
1854C40n12p4O64m78k74O60l02l06N32k95k05N75k94l53N62j80l12M83k51k96
1874c16O38k41m60O29j49m71O37j18n90P35j4q11O47K28p67N45K88r09M64N35
1894E00r11K48O82p71M6O20o87K6P56o03k37O71m11k09N95l65j96N87l68k77N40
$$ y = [-316, 347, -172, -205, 438, -101, -273, 383, -60, -352, 268, 14, -186, 323, -61, -312, 278, 17, -277, 235, 5, -238, 298, -27, -366, 301, 92, -351, 261, 85, -379, 324, 166, -529, 258, 361, -471, 101, 343, -494, 64, 472, -494, -92, 555, -345, -220, 503, -232, -220, 494, -195, -382, 447, 19, -332, 305, 4, -303, 280, -3, -338, 263, 138, -239, 147, -1, -240, 220, 41, -239, 255, 64, -286, 150, -17, -263, 372, 125, -417, 183, 131, -409, 227, 248, -406, 210, 291, -551, 17, 453, -322, -16, 405, -398, -130, 473, -304, -224, 486, -148, -252, 340, -172, -246, 418, -60, -334, 326, 24, -282, 250, -45, -250, 325, 31, -322, 240, 60, -252, 231, -20, -316, 322, 81, -379, 250, 101, -370, 267, 149, -441, 294, 280, -531, 116, 344, -423, 122, 410, -499, -35, 500, -411, -163, 519, -252, -206, 414, -273, -247, 509, -94, -331, 340, -71, -280, 315, -50, -246, 341, -27, -304, 236]
1915B36k55j37M62m19j67O22m00k33O63m08l05P65m69m89J024l09p93R65j10q76
1935f33R63R4j150Q87M28j251N93P14j149L80P84j136J44J018r25j91J013o95
1953a12l08R01n62l76Q99l42n10O55k03l52N90k38l38N65k58l11N29k61j81O10
1973C97n10l23Q46m01m17Q79m46o08J067l05q82J187n5j217J027K16j227J038
1991B66M75j561P10R11j450M33J118j388O8J279j258k22J489r24o07J307o15p11
2009f80J236l88q61J097o7q77P37K2p01O74Q4o30N52Nn89M93l5l66O86k51o47
2030e06P61j20o39R07j55r12J054M1j237J013L78j400R21O88j523O93R44j757
2048h49L70J525j401n3J470j510m90J822r19p08J743p45j272J435k16j050J484
$$ y = [236, -19, -156, 306, -113, -280, 342, -58, -291, 372, -36, -341, 424, -45, -534, 490, 181, -612, 353, 243, -633, 330, 424, -726, 161, 589, -662, -69, 645, -504, -124, 660, -476, -332, 686, -239, -430, 583, -112, -420, 481, -81, -457, 442, 100, -410, 245, 42, -310, 280, 42, -296, 269, 11, -300, 229, -32, -213, 397, -113, -436, 410, 9, -408, 471, 25, -583, 484, 179, -703, 484, 429, -788, 239, 455, -772, 266, 741, -820, -110, 801, -649, -216, 902, -486, -418, 861, -397, -619, 870, -54, -661, 646, 31, -680, 556, 168, -693, 404, 337, -540, 197, 219, -482, 192, 276, -354, 198, 203, -386, 107, 72, -294, 392, 141, -506, 255, 135, -504, 403, 248, -664, 390, 431, -806, 207, 585, -815, 106, 794, -729, -36, 908, -849, -479, 1046, -355, -408, 1062, -448, -938, 884, -35, -743, 1000, 255, -1017, 418, 202, -848, 636]
2065F36nj401R23K64j146P90M59r64O19L39j009L68L84o67N28L16o61L96Qq55
2085f78O30M33o44O54O0j258P08N54j106Q07P57j515L69R64j518L69J537j510
2103c87j94J688j349o63J759j010q58K080n53j506J532k78j551J692M73j551J048
2120C72L30j836P72J111j094M78P13j406O6R33q09J76Q64p25q5M50p17J48N94
2139C35n55K86M85q16J47L73r65N66J012j061Q8P52j388J19J500j083k02J532
2157A125j330q75J790o57r18J845n82j542J699Mj742J478M99j722J146P92j931
2174i21O11J161j563L90J437j336k40J112j120j91J463n96n79Q31n78m81Q95k13
2192H2k84O52m44l64N56l51m7O69n99j57Q19o89l08R52o60l00J250p39p92J322
$$ y = [636, 631, -770, 153, 417, -729, 61, 520, -444, 175, 514, -495, -127, 257, -410, 118, 434, -227, 169, 177, -678, -48, 385, -259, 395, 455, -803, -95, 459, -647, 160, 917, -598, -229, 735, -783, -414, 1123, -387, -581, 1107, -242, -905, 854, -156, -1014, 1066, 513, -993, 539, 261, -1290, 402, 875, -676, 372, 702, -1134, -362, 749, -345, 133, 846, -560, -494, 439, -370, -194, 670, -55, -140, 310, -407, -259, 335, -220, 66, 551, -265, -118, 255, -710, -144, 868, -193, -105, 647, -741, -622, 878, -205, -407, 1125, -205, -1080, 710, 53, -865, 980, 398, -1144, 555, 559, -1183, 295, 794, -928, 218, 1010, -921, -310, 851, -712, -322, 1115, -221, -461, 651, -469, -660, 803, 207, -372, 459, -119, -600, 295, 82, -202, 450, 6, -358, 198, -153, -200, 469, -130, -287, 532, -157, -465, 487, -173, -473, 777, 38, -754, 568]
2212E68m72r81J493j56j327J323P5j634J301P11j716P93R05j713N39J320j573
2229e44M0J472j289l48J471q87n63J370p05p55J294l01q63R57j35p75Q63k2p66
2248d86O84O1o50M91Q1m76N31p8n48N73l4m89O35j47o38P89o4q43Q92J64j065
2269f17P38L39j147P78O59j367L99R39j216K13J123j208j27J277j016l90J417
2286G94p43p73J259m43p90J267k09j125R78J71r38P50K68r89N41L79q14M30M04
2305D17p28K22L63n16L39K37p18K26M33m42L37K10q06K12M64n22L83M98q98j7
2325c06N41o49L30Q62r11k89P97o41j47J074o41n52J036l89p21J000j84q84R31
2344B57J73q34P15M1j151O00O87o24M06K71j156J50P69m68K72N74q55k57N40l53
$$ y = [568, 96, -885, 608, 452, -875, 448, 523, -1111, 190, 901, -815, -22, 883, -830, -291, 1029, -544, -504, 968, -321, -669, 802, -85, -648, 722, 17, -738, 556, 255, -608, 349, 214, -561, 302, 280, -486, 198, 259, -391, 100, 181, -295, 236, 158, -390, 183, 149, -340, 295, 148, -490, 299, 235, -608, 284, 448, -617, 121, 460, -687, 91, 750, -617, -218, 721, -495, -282, 841, -367, -494, 783, -233, -623, 794, 51, -722, 537, 94, -696, 571, 362, -763, 215, 386, -552, 198, 466, -523, 18, 397, -417, 13, 417, -311, -89, 274, -242, 97, 334, -384, -158, 275, -167, 170, 380, -426, -214, 250, -272, 111, 609, -289, -306, 235, -414, -84, 778, -133, -422, 375, -266, -413, 661, 20, -532, 504, 115, -606, 394, 210, -674, 257, 430, -404, 311, 352, -799, -199, 488, -136, 270, 541, -615, -465, 304, -164, 108, 682, -173, -430, 110, -243]
2364b43J37O61n48k64M66l08q7L93m14k9O75k96k22L03n93j59Q40q5j46N06p46
2385a59p03Q18J98j37P01m59j014N75K58m30P48J53r42L42K75p09M41M98p63K20
2405h9O56o49j18L54o32J42R88k96l95J93o00j85Q88P6j60K84o14n18N76J88j8
2426G1M36l92n56M65j0k71M58n9l68M77j6n59L04Pm06O31L19n40O0j17o38N95
2448a09P04m31j1K8p60J75P31k72N2L50o49k33N56j69n1M26l58k18M95j83l48
2469b75L15j16o4N17j73m17K07j38j89N82Q4l71J71k25m02N64K56l52K09j01m88
2490d06M04K52m63K83K34n27J62L02m51J03L88m37K2N09l98k34L84k23n1M86k43
2511I6l23L14r9j99L61l2k39K42j08k46K87L9j64J59o7j72K30o0j76K60k2j91
$$ y = [-243, -106, 555, 7, -257, 209, -99, -186, 207, -207, -236, 439, 143, -79, 224, -369, -528, 312, 227, 81, 587, -159, -862, -44, 154, 17, 718, 259, -755, -180, 78, -352, 396, 549, -393, -51, 224, -485, -44, 454, -309, -89, 567, -82, -200, 154, -478, -336, 652, 356, -39, 154, -446, -631, 257, 333, 173, 457, -157, -675, -99, 89, 71, 507, 115, -441, 24, 14, -257, 201, 142, -226, 251, 235, -324, -20, -13, -419, 212, 531, -9, 51, -66, -704, -109, 595, 164, 153, 181, -579, -404, 327, 55, 107, 457, -192, -425, 131, -38, -89, 337, -21, -239, 256, 73, -275, 40, -76, -140, 377, 204, -213, -6, -144, -333, 249, 333, -38, 133, -92, -494, 70, 326, -26, 183, 82, -406, -2, 250, -213, 70, 304, -223, -61, 241, -210, -107, 281, -156, -134, 375, -23, -257, 127, -96, -147, 339, 96, -227, 87, -12, -211, 150, 118, -121, 121, 13, -233, 54, 93, -71, 88, 21, -151, 79, 19, -157, 103, 81, -110]
2533a10J86j07j83M00l4l70K92Ql33L65J21m73K60K04n24K38M15m82K3L35m38
2554b07N5N64m44k67M82j83j99N04k07m07L63J2k60L74Q7m52N5J19q2K59R4l62
2576a02p8R8O1J91l0j91J4r1K5L02o9k18J07j42q7M88l9m75J65N6k08M81J40o81
2600b83Q8L11l63L10M48o21j99L90k80R5O65m65n43M40j1j02N29j93o27L09K03
2621A01k10L37N7n54M4K61n3K23P3m54j53K41J84J89j03l57m2Q3J59L07j53l63
2643a83P0k5j8N01j1o00R3J51j97N01K06q02j8M67k76K01M92o96l44O24j54j07
2665a25O56m22o91N11K09k25M64j01p98K69M82j92J46O8n56j6M36k9P7N7l97j51
2687c28K75J68J59j14l90j7J94J04K75j57m71J39J83j25L72Q5o67O2L68k78L15
$$ y = [-110, 76, -31, -214, 186, 152, -218, 74, 82, -251, 114, 235, -238, 22, 226, -298, -60, 355, -127, -104, 231, -207, -152, 412, -32, -299, 183, 0, -199, 305, 98, -309, 54, 66, -194, 180, 267, -185, -130, -11, -93, 166, 260, -102, -180, -82, -21, 170, 140, -51, -37, -128, -103, 199, 130, -88, 19, -123, -210, 278, 239, -236, -71, -15, -223, 258, 398, -283, -195, 116, -247, 63, 511, -110, -309, 81, -199, -104, 561, 96, -447, -7, -18, -120, 409, 216, -411, -102, 101, -109, 228, 285, -269, -225, 36, -17, 206, 279, -175, -328, -87, 97, 286, 183, -174, -216, -133, 26, 333, 180, -183, -113, -138, -156, 345, 334, -266, -173, -22, -219, 282, 488, -314, -332, 135, -141, 60, 552, -144, -488, 136, -18, -125, 531, 109, -582, -71, 138, -87, 377, 276, -522, -253, 229, 37, 183, 251, -305, -321, 115, 86, 163, 220, -177, -328, -53, 115, 274, 160, -230, -247, -53, 51, 326, 169, -302, -163, 20, -105, 267, 352, -315, -253, 115, -163, 152]
2708A52L72q07j90O79k03l7N51o08m99P48J5l84N97j85p94N15L90m54L59J20q38
2729e01J96O41k76j6K21n51o6N65p9j22J72k95j96L47J08lMk97q8K24R9J37r9
2752A25m04J26K75j87K10J59n87K9N13l54M0N58o49m14Q24j14l77O09k88p36P47
2773A05K78o57M10J82q18L85N40o02J70M10p58NP79l90j86M66m57k84P08q4l93
2794a91L00m3l29L14J14j90Q7j04r3J89k2K0J13l41j9M04j84j45L47k92k20N17
2816B32j72k98M85j74m42N44mm92N29J1p10N89L33q35L35N28q19J50P47p55j48
2837c66Q47m83m17P50k35m55N75q2m28M54jm22L61L5l18L08l2l44L45J18l74J53
2859a1R3k25K39N2k51J19m0j57L51m4k48L12k42m31O64K30o65L43J64p83M21O62
$$ y = [152, 524, -283, -473, 206, 3, -34, 517, -91, -590, 158, 173, -211, 386, 201, -593, -78, 312, -142, 217, 337, -501, -305, 336, 60, 44, 265, -286, -352, 213, 134, 12, 184, -111, -307, 40, 148, 145, 149, -148, -236, -12, 87, 224, 125, -279, -153, 122, -65, 145, 304, -283, -254, 259, -95, -55, 503, -146, -560, 264, 150, -227, 382, 94, -642, 105, 383, -274, 136, 318, -500, -115, 425, -177, -7, 403, -355, -350, 429, 39, -147, 319, -138, -422, 286, 202, -191, 109, 66, -263, 51, 165, -25, 62, -42, -135, 54, 32, 52, 165, -176, -195, 209, 25, -120, 227, -65, -285, 232, 60, -238, 247, 73, -369, 175, 171, -321, 208, 219, -491, 98, 431, -404, -69, 459, -360, -210, 537, -218, -366, 481, -2, -419, 331, 96, -359, 216, 134, -294, 160, 159, -263, 98, 133, -185, 123, 91, -253, 92, 210, -164, -11, 82, -143, 96, 148, -103, 16, -24, -181, 170, 126, -122, 190, -52, -483, 181, 411, -254, 89, 253, -530, -109, 553]
2881E53p09MN37o35r2P50l99k48N30m22k09P83l15n11N24j95l27Q61q3q69L94
2902g8J56m81N77M23p08j16J81k70K95M50k98j73r0j72M11J47m05J78R6l92L90
2923A21K60o51M3L61l34L12M93o75l37K77j86M27O83o96m57L19m38J88J058m40
2943C28o76N30l32m92J006J50q80L56K27n32M21K32p39J38M71j45K56Lp99L3M50
2964Fq5N04K84r38l64L95l8M22N73o05n37J77l5K29M20l60j30K23l36J18M33n90
2986b34j50O88j89j51N84o63p69Q04L80j66M96l90j018L60M51m8O04m2r48O2K49
3007i0k64O43L25q83N4M81m86P8M68n63p2P27j90l11J67m07j18O30J20oL7p35
3029c95k52O37J26J34L67o84n68N53J10j45N37j83n54L32M2k91L92m4m33M85J40
$$ y = [553, -156, -152, 385, -250, -342, 408, 9, -239, 291, -131, -340, 443, 128, -383, 141, -54, -381, 480, 397, -472, -78, 78, -403, 174, 597, -111, -227, -46, -316, -21, 429, 131, -42, -132, -304, 107, 254, -151, 27, 123, -269, 121, 381, -270, -227, 134, -200, 112, 605, -70, -407, -130, -316, 111, 794, 98, -359, -40, -478, -290, 768, 328, -348, 182, -150, -642, 364, 514, -366, -10, 217, -315, 106, 338, -401, -263, 208, 63, 319, 322, -477, -444, 6, -79, 425, 709, -229, -593, -198, -236, 186, 759, 154, -383, -206, -241, -12, 408, 48, -82, 141, -195, -77, 356, -234, -384, 304, 115, -36, 548, -115, -884, -80, 300, 134, 630, 240, -778, -418, 33, -15, 589, 547, -401, -339, -90, -354, 289, 614, -269, -215, 266, -220, -142, 326, -237, -309, 418, 228, -83, 84, -323, -441, 189, 309, 303, 340, -395, -647, -10, 116, 250, 617, -67, -635, -82, 28, -117, 420, 237, -317, 15, 57, -234, 158, 114, -319, 166, 306]
3050C06m61K60j16o17O59N75o07O5J18p71K28Q27l11j01K84o11k30O43k0q0K64
3071C04m13j92M77j79j74L98k40j88N08j93m07L59o2k59M77P4l96J17j30k17M84
3092A48J16l24J77j44l44N19R7m88L72J14o01L26L60n57J54L83n15Q0M83m59j18
3113b21M35l01j8M36m20j85M90k28j76M92k75l47N01r0l50M62k3m82L03J43k62
3134a16K22L2l60K20J28k10J50k1k42L06O3l44K30M6l74K85K55l71J21J21m68
3155c27K03M41k98nJ41m50J21M94l59m5L78m49j33N76k55k86N11k32l79O03jn37
3177b88K83P1l00M21J49n07N4J21k19L15K07l68K3L5k97L01L32l33m8Q1k64J85
3199d6L08k85o7J39j75J36K19l14l0J94k62J52L94l85j75K55k43L8N84k95m22
$$ y = [306, -155, 105, -11, -628, 31, 606, -1, 64, 182, -589, -361, 466, 155, 54, 338, -273, -503, 140, 120, 40, 304, -109, -301, 176, -3, -177, 221, -19, -207, 301, 108, -299, 60, -2, -261, 216, 290, -106, 11, -119, -336, 148, 264, -60, 117, -27, -371, 148, 245, -243, 129, 243, -358, -32, 328, -229, -75, 308, -207, -127, 356, -103, -221, 214, -87, -105, 331, -89, -274, 216, -12, -188, 304, 29, -318, 183, 93, -257, 205, 182, -300, 3, 146, -116, 106, 138, -222, -2, 126, -84, 66, 45, -197, 109, 172, -172, 58, 104, -270, 15, 270, -101, 20, 141, -327, -124, 317, 19, 14, 155, -295, -174, 320, -39, -84, 294, -155, -288, 288, 33, -253, 258, 26, -353, 250, 249, -288, -5, 66, -234, 187, 336, -171, -117, 4, -215, 100, 307, -61, -38, -3, -300, 1, 333, 0, -48, 33, -231, -46, 262, -23, -90, 49, -126, 10, 229, -85, -115, 79, -183, -31, 363, -22, -197, 58, -185, -147, 437, 142, -280]
3220b80L04q9j44N13q9m44K56j8k56M38P7m62J85P6l01L64K12n52L3L23k50J46
3242D2K77m30j18L07j25N6K41k64j61J53p6J32K43l02j72K17j13R0L01l19k14
3263b35K95r2p2L63k00k74K46o8j05M01j21m00K64N2k09L72on03K23K30l02J91
3285E0K07m25J0K83j97R9K30l45j13K54p8P6J81l27r3K89j39LK67k54j63K69j25
3308d1n7L14j71k51K49j1q7K46j73k66L21J0k07K90q3l37K77P9k60K71R4m17J06
3331a04K02j94J60J54l89M5K71k15O2K04l08j6K80k18k9L14k35j97K97m9j06K31
3353A60j60k04K45J7q5J45j17j37J94m1j11K64j14k40K35k5j54K92m2l71K52J29
3375A32k61J96Q5l49J86J89l29J46K29l83M0L06k74K3L11l43j40M12j46j52K78
$$ y = [-280, 24, -65, -209, 304, 215, -229, 27, 9, -247, 191, 268, -194, -9, 67, -234, 130, 342, -210, -177, 146, -104, 42, 319, -111, -229, 78, -47, 9, 250, -14, -175, -22, -98, 34, 277, -25, -197, 20, -93, -3, 298, -21, -235, 60, -32, -104, 259, 59, -215, 31, -37, -142, 259, 138, -262, 2, 54, -155, 217, 211, -292, -69, 161, -141, 50, 257, -168, -158, 125, -72, 27, 257, -88, -201, 53, -25, 51, 232, -95, -188, 101, -38, -35, 232, -22, -185, 84, -41, -98, 216, 45, -206, 43, 32, -55, 191, 18, -248, 73, 83, -124, 166, 83, -254, 23, 102, -158, 113, 207, -210, -104, 98, -96, 64, 218, -171, -126, 145, -70, -8, 196, -112, -128, 152, -66, -95, 219, -16, -213, 84, 35, -71, 160, 0, -204, 41, 58, -27, 118, 1, -136, 58, 17, -94, 170, 56, -184, 51, 26, -128, 164, 122, -249, 3, 132, -129, 67, 152, -197, -11, 178, -151, -5, 224, -159, -119, 187, -87, -64, 247, -96, -236, 176, 30, -122, 156]
3396A56j59k01L11m2j89K24l2k28J84K0j17J85n4k38J96O4j47J52m4j98J80O3
3418H6j91J64K6k16J44N3j87K18L7l24J54J65k49J52J35l57J22K84l24L9K94l06
3440h1o9L41k28j09L75k23k55L90m8k51K82n7k89K85Q4k90J69J01k60J23J08j74
3462g6J03P9k27P4J51j31O7K9j99J14J15j53Q1N9j83R8Q7k00J57J13k94P1K16
3485A51k59R1K27l42rL77k75j20L51k06j75L80j36k41L36q9k99L23N1k67K35q
3507I6l44K73J65l29J24J70l10R3K31k60L4K15j95p5K03q0l7N8j05O2J33j55J7
3530a6N4j77J24J93k26MK04k68l8K86j30m7K24k51j15L09j28j32L16j61k19L70
3552A76j13l51M01P1m11L07J54m44J39K48l47J13L32k83j23J80j65O1K35j64n5
$$ y = [156, -3, -204, 107, 65, -124, 100, 68, -160, 24, 44, -73, 112, 58, -180, 16, 80, -67, 85, 41, -157, 23, 86, -105, 59, 85, -131, 13, 66, -121, 97, 134, -190, -36, 129, -120, 32, 167, -190, -68, 216, -108, -69, 225, -81, -150, 191, -37, -146, 229, 6, -249, 141, 93, -158, 124, 67, -222, 63, 147, -143, 26, 127, -133, -10, 98, -76, 27, 106, -121, -47, 104, -27, 40, 69, -130, -16, 99, -54, 27, 86, -97, 1, 88, -112, 45, 158, -136, -65, 151, -108, -17, 210, -132, -141, 236, -39, -159, 192, -14, -189, 191, 55, -186, 150, 61, -238, 85, 136, -131, 104, 96, -248, 25, 190, -139, -15, 155, -155, -62, 169, -91, -57, 158, -37, -112, 91, 11, -26, 32, -73, -11, 122, -33, -16, 38, -139, -15, 178, -48, -44, 160, -108, -146, 140, 10, -37, 187, -64, -179, 130, 2, -130, 186, 25, -194, 176, 63, -288, 113, 184, -227, 80, 234, -210, -71, 177, -170, -57, 275, -8, -131, 49, -116, -55, 180, 16, -39]
3573c9J33j84l4K31j12k3J95j97j02K14p3r9J40l1k7J16j66o2J66j15L9K61k45
3596a4j34K90k17j68M53k4l49K50j0l45L00J67l37J58J62l19P6J62k70J64K41
3617B36l33L6K62l42m1L64j87q7L17k11k74L05K0j45J84k2j52P0m5m8J79o1m3
3640a8J41j81q2K79j34j73K94j3k47J90rk51K60P5k34J64J3k27J97L9k57K81J14
3663B21m21J34K82l78P6L52l44q7L90k45k02L35m6j79K23r0j40J86o5j04K04o2
3685D0j41J96j14j50K79rk48J80N1j99J44N5j85J37L4j55J24Kj44J74j7k36K57
3708G5R5l59J68K07l35J12K62l48j9L52k34j01K79j61j30K51j47n6K51j62j46
3729a46K32r2j15K82j24k37K82K6k51J86O9k34J14Q1j56J15M0j67J00L2j09J82
$$ y = [-39, 94, -90, -124, 107, -5, -28, 167, -30, -132, 82, 9, -90, 50, 19, -8, 108, -58, -120, 46, -69, -30, 231, -14, -148, 142, -75, -243, 210, 186, -163, 87, 77, -268, 32, 199, -138, 20, 182, -137, -61, 101, -169, -5, 236, -97, -61, 201, -141, -182, 182, -5, -92, 225, 14, -260, 45, 65, -80, 104, 82, -70, 0, -45, -93, 86, 25, -18, 123, -58, -140, 139, 5, -168, 126, 113, -134, 56, 47, -204, 56, 131, -103, 61, 74, -153, 44, 83, -174, 107, 221, -200, -66, 216, -162, -86, 266, -78, -165, 225, -20, -222, 113, 67, -112, 111, 21, -119, 67, 2, -102, 102, 40, -101, 95, -19, -169, 110, 101, -147, 33, 84, -115, 29, 84, -101, 36, 70, -85, 39, 41, -103, 71, 54, -182, 75, 170, -189, -21, 186, -149, -37, 225, -123, -142, 210, -24, -125, 154, -7, -137, 114, -33, -89, 162, 0, -146, 86, -6, -121, 161, 37, -200, 82, 108, -143, 43, 112, -122, -8, 73, -83, 32, 72, -95, 5, 37, -72, 110]
3751A10m4k62K19J14k71J56J32l09R4K36k66K8K46k43p0K35j22j9J92k34o7K74
3773A29j38q4K64j79j76L10o8k14K74Jk93J75J02j89J24M6j93J01J00j29P1k7
3795Gj57J95N6j91J74M0l08R9K09j85J02J40l08k8K32j17L9J65k20l3J86j97M
3818i6K62j94r1K74j59j49K83j49k00L34N9k57J14l0k25K28J55j38N6m1k29J12
3840h1J35p0J72k1l17R4J54j38J14J04k28K3J61j67LJ27j33M7J59j15k2L8k40
3863b01M5L41p1p9J03l22j17L95K2j15J85j65k80K18R2r0J98p5k68J83P8j83J38
3886C2K9k19K22J61k93j5Q3j90J62K94j68j24K6k31O1L37lp0n8k53L8K76k5k7
3910D5O6j96n5K24o4r4J45j16n8K35l7j51M1j23KL19Jk37L3j27p7L61R7k59M6
$$ y = [110, 66, -196, 23, 137, -134, 22, 154, -155, -61, 175, -91, -63, 183, -60, -130, 105, -17, -36, 156, -78, -145, 129, -9, -93, 171, -8, -184, 126, 58, -156, 118, 119, -174, 1, 103, -86, 38, 84, -109, -8, 92, -37, 34, 7, -150, 45, 101, -90, 84, 124, -184, -85, 124, -61, 41, 181, -127, -155, 77, -40, -1, 164, -56, -89, 97, -100, -96, 166, -28, -119, 155, -4, -153, 130, -19, -219, 115, 174, -83, 31, 1, -224, 4, 159, 21, 77, 36, -193, -81, 54, -16, 156, 135, -182, -88, 66, -72, 42, 146, -82, -59, 102, -65, -62, 65, -68, -21, 138, 23, 1, 39, -201, -156, 185, 114, 35, 138, -184, -301, 94, 116, 1, 186, 21, -259, -41, 51, -39, 159, 84, -184, -1, 77, -106, 32, 61, -158, 64, 225, -68, -83, 0, -190, -28, 266, 98, -26, 0, -231, -170, 167, 164, 94, 36, -217, -179, 97, 72, 45, 111, -85, -140, 84, 20, -74, 71, -45, -103, 132, 95, -56, -15, -138, -136, 183, 184, -53, -20, -147, -224, 137, 234, -25, 21]
3935B1m8k46K51K57k13k6M0k23J34K51k01r4J25j21Q5K20k32j40J79q5K4K79j37
3958A00k36O5nJ1K58j9k61k9K6M5K03m6j70K3l5PK04m3j83P9k5o4K31J8k78M6
3984g8P2m8J92K1l03M2J24r7J60R8l01j4J95j33P6K32k79j60K34j5l3K00j88k23
4008b26K22P6q1J15q5j77J45O6p6J05m1j99J17J25o9N0n0j76R8J62m3lp6j27J29
4033a9R4o2Q5n7k19J38J32j25J06L5k71P1K51j52n6J23j93MK96j16j77J46q7p7
4057a30K81k5k12R8n9j23K66J09k54lL2j04J74J33k11n6P5n2R8P9j29l6K5l0J18
4082F4O5j61n2M0k7J55J07k33q6J11m6J36J08k11q9J04o5Q5J98k05j38J49n7O
4106d2K63j76k71K10P9j00J88n7l18J56J72j32J19L9k94K8K13o9P4O3k80m4K25
$$ y = [21, -27, -273, -22, 235, 22, -4, 36, -187, -53, 198, -3, -97, 28, -93, -8, 212, -20, -160, 19, -66, -42, 237, 100, -136, -71, -76, -65, 193, 174, -87, -116, -90, -45, 158, 112, -58, -35, -70, -63, 141, 98, -85, -6, -31, -95, 136, 154, -124, -78, -6, -54, 138, 159, -144, -102, 22, -75, 85, 183, -118, -132, 63, -70, 6, 238, -41, -201, 33, 18, -15, 185, -3, -226, -4, 72, -9, 106, 21, -156, -11, 55, -21, 84, 43, -156, -39, 86, 17, 67, 17, -159, -61, 101, 58, 55, -21, -148, -19, 75, 13, 98, 41, -178, -40, 92, -33, 73, 108, -163, -92, 159, 7, -49, 74, -119, -115, 181, 65, -112, 34, -53, -130, 151, 126, -86, 12, -47, -170, 96, 205, -49, -52, -20, -124, 50, 183, -28, -84, -9, -61, 37, 116, -13, -49, -24, -54, 64, 129, -32, -84, -44, -71, 84, 191, -42, -128, -17, -63, 73, 181, -30, -119, -15, -80, 5, 203, -2, -140, 9, -48, -42, 221, 45, -226, -16, 63, -37, 151, 94, -224, -68, 104, -28, 91, 130, -164, -136, 77, 8, 82, 145, -135, -179, 46]
4129D6K9j3L0j93n2J86N1k3j9j22k2J08L5O3pk18k8J93KM2M6k60o6K83op0J19
4156A34j62k03K94O1j50J46r9k55K11J94j59M0k3k43J49K65j57n0M7j66M0K45
4178A59r6q7O4j34l0K43j9j15L3j22j4K40j5j34K6p7lJ76pj05K8o2m4J75pp6M5
4205D2j22m3K12J8j43N1m8j17K40M7k32J04L6j90J50J61k19L1J11k17O3K54j96
4228gr5J61j08m5K49j01j69J52oj15J35L0j27M4on2Q7L1q4J9k0j2J09n1p2Q9j5
4255B1r5J23Qj26J22Jj69J37O1j36O6N8j72R2J27j93M1J44j67j0J83j29k9J59
4279A17j45q9K19m2j09J14o9r1J59k0j05J02l2j03J22K5j00R9l0j50J34R0j05
4302iJ4J3j26J08Q6q0nMr0Q2N2p3P3j1j72J11J08j02N1L5k10Q2J98j47m9J24j35
$$ y = [46, 75, 62, 92, -101, -153, 33, 84, 61, 42, -80, -102, 6, 41, 104, 97, -121, -149, 44, 46, 88, 134, -126, -192, 91, 85, 15, 134, -28, -231, 63, 124, -26, 120, 21, -234, -23, 171, 12, 52, 29, -214, -65, 200, 43, -7, 40, -126, -86, 159, 63, -24, 40, -94, -124, 119, 100, -15, 18, -104, -118, 122, 107, -27, -1, -78, -81, 95, 88, -17, 11, -51, -95, 80, 73, -3, 42, -80, -123, 89, 107, -36, 15, -33, -150, 90, 137, -95, 9, 45, -145, 5, 166, -53, -22, 89, -128, -65, 189, -7, -102, 59, -49, -94, 155, 54, -115, 37, 31, -84, 51, 81, -46, -2, -8, -60, 27, 58, -26, -7, -27, -39, 70, 19, -53, 36, 21, -74, 49, 57, -69, 53, 54, -115, 22, 83, -53, 13, 71, -101, -9, 118, -75, -34, 110, -57, -67, 116, -13, -42, 117, -28, -117, 102, 60, -49, 65, -4, -95, 64, 44, -61, 41, 9, -94, 28, 53, -47, 52, 22, -128, 6, 96, -9, 5, 18, -108, 0, 86, 6, 1, 5, -85, -3, 49, -24, 49, 38, -134, -23, 85, -17, 34, 69, -141, -59, 139, -8, -57, 67, -68]
4329f8k7K16q3r9J19j03q2K27J2j74P8l7j07J96Q8k03OM2q4J09Q3j33nM1p2N7
4355cQ3p9nj4m9J31N2j58j8N0n7J32R5k06m8R4p5O8J62j24r7O8p8K8K04j20j26
4382i0J17m7l3J49q4j52J74N2j24R9k2j95J11J15o4Q7Jk35pJ67PP2J7k10k8J30
4408Gk0L5O8j10l4Q9l3j1M7q3jJ11oj0m2j57L8K10Ok4k8j94l6K34L2o0J12j60
4436b0j63J72O9q4J14l7j71J30J07j86J1O4q6J44J26k05r1N4n3J04K13j09j40
4459c7l7q2O8K45Pj46m5p6M6J24Lq5L5l3RQ1p5r4N9LP1J36j07j81nJ5J05K22p8
4488A48k34k2NPK44K8k23NJ3j03J65J30k05k9J06o5N2R4k01r1K10N4k0M6j82j38
4514b06J61J10L4N7j29k10O5J16O9P6q8j68J8Q4M9N2o9j21Q5M6qL3p6j12J10R3
$$ y = [-68, -95, 121, 38, -61, 58, -45, -127, 100, 112, -62, 16, -21, -128, 68, 156, -47, -41, 1, -83, 26, 109, -24, -29, 12, -60, -3, 80, 1, -4, -18, -67, 64, 116, -42, -60, -10, -67, 65, 160, -46, -94, 0, -75, -7, 155, 31, -66, 2, -76, -48, 156, 36, -90, 27, -20, -53, 96, 12, -140, 34, 86, -38, 61, 39, -156, -45, 70, 6, 93, 94, -141, -148, 19, 26, 98, 115, -95, -123, 7, -13, 22, 90, -20, -54, 35, 2, -9, 38, -45, -46, 65, 59, 49, 7, -150, -112, 98, 104, 80, 52, -142, -178, 56, 88, 28, 140, -20, -183, -11, 58, -26, 88, 51, -120, 10, 117, -69, -58, 6, -80, 64, 190, -15, -106, -52, -105, -1, 212, 103, -37, -74, -156, -88, 157, 164, 18, -27, -103, -57, 67, 70, -15, 20, -13, -4, 77, 2, -92, -33, -30, 41, 177, 70, -111, -116, -101, 4, 226, 148, -86, -108, -103, -96, 148, 176, -47, -42, -29, -132, 33, 163, -42, -71, 35, -30, 22, 116, -85, -176, 34, 88, 68, 114, -68, -206, -45, 65, 99, 156, 27, -183, -118, -2, 67, 143, 55, -113, -95, -11, 38, 90, 21, -100, -15, 31, 23, 56, -20, -132, -22, 71]
4540G1rN2j10k04J18J74rL2p1k31N8K03j9J7Kj82j9J77jl3O8j62o1K01K6o9K0
4567C9j14o7K02N6j22j2l4n2J35R2r8m0l7o0J07J23n3p1p1k4J04J18p0n6n2l2
4593h9J07R1r1j3j9q3R9J18j05m0L8r5O0J77j29j24Q7l5K0J54p3j48O2%j1J56
4619A14Kj76J0Pm0J50M9j62qK1j8R4K6j17PO5l6L0L2q6JN7l5O7K2j30k7O8J6O9
4649G2K8j29o3Q7MK2P0q1p0P7l7qJ20o9q8R4rm5Q8n9j09J26O1r7M4j5j11P2J10
4678H5r0J6O0j38lJ20l0RL1j00k2R3l6oM0n2NO9n2k5M8l1k0P8l0k7M1p7jJ08k8
4709C5m3M5n0n0J34k7q5P2Kr5Q4L3j02Q5J1j23P7O4j10L5M9p5L1P4r7NP6p4j1
4738c0Q2o7nO8n0m3Q0k4m9P6m1l0P6m0n0Q1ln3M6j2m7Q3j6r2P7Pn9O5J0r2O6K4
$$ y = [71, 62, 114, 4, -200, -82, 92, 83, 115, 44, -187, -129, 74, 55, 72, 74, -108, -127, 50, 49, 16, 84, -78, -139, 62, 88, 19, 39, -75, -142, 60, 116, -6, -18, -52, -104, 31, 123, 25, -15, -52, -112, -5, 118, 65, -6, -77, -101, 3, 121, 51, -5, -57, -89, 18, 109, 18, 5, -14, -97, 2, 120, 15, -25, 13, -82, -22, 155, 26, -98, -11, -46, -26, 128, 55, -93, -31, -31, -42, 114, 116, -60, -50, -43, -83, 67, 116, -46, -54, -33, -51, 43, 69, -48, -41, 24, -12, 18, 50, -36, -35, 22, -13, 54, 76, -54, -81, -13, 3, 72, 100, -29, -92, -5, -1, 21, 91, 10, -60, 17, -20, -28, 92, 23, -65, 29, 20, -25, 63, 4, -105, 21, 82, -15, 29, 14, -97, -25, 85, -5, 11, 71, -67, -70, 50, 20, 29, 60, -40, -62, 31, -5, -11, 29, -23, -18, 51, -1, -26, 22, -9, -29, 49, 19, -8, 33, -44, -45, 63, 35, -8, 37, -13, -63, 71, 44, -41, 31, 33, -62, 22, 55, -47, 38, 49, -74, 3, 67, -43, -8, 41, -34, -3, 71, -26, -21, 55, -19, -30, 52, -15, -20, 48, -2, -45, 35, 11, -38, 38, -3, -33, 43, 3, -47, 34, 31, -22, 24, 12, -35, 48, 32, -60, 17, 24, -35, 30, 40, -52, 14, 38]
4770C8r3O9L0p8L5M6q3M4O7j16L0O7n7J0M4q9lR6o0k2P4p1k2P5j8k4Q4q7p2R6
4800A0K7l6N1m3r3J03K7o3L7j1o3O1M5o5L7Qr7N3O3n7K6J0j11P0Q8p4oK2q7L8
4830c0J07q6KM5q7J3J06l7m3M0q2rJ45k3q0K9l5k8J25j3r6M2j8l8R0M2r5Lj6m3
4860g0J27K4r5j3J8n7J21K6j14kL6n0P1P3j04l1M2m5N3R4j01n5L8j6L7R6j02q1
4888h0O9ORQ6q0q2N9lKJ00n6j17N6L3oR9n3j38N4P2k5N5j5j16K0Q4l4M2L0j30
4918e9j6R3LL2Qj22k0R1K3LPj08lR4kkL9j02l6R8R%L2j01o4J34L8o9M4q1p1J25
4950A7P0r0L1k1j03R4P5n4J7l5r3O7R7k9l7j6o0N6R4o9k2J3o4M5R6m6l9L2q7J1
4980e0J48n1p0K6o3K1J18j1r9J1jk1J15k5p2J8k1j2Q1L4j06J9k2j2J09K1j23%
$$ y = [38, -55, 14, 44, -34, 1, 47, -36, 8, 75, -41, -11, 56, -1, 9, 53, -36, -39, 57, -3, -25, 49, -22, -44, 31, 13, -11, 73, -14, -86, 10, 37, 1, 52, 9, -84, 19, 46, -17, 20, 9, -54, 7, 52, -13, 24, 32, -65, -12, 51, -6, 20, 30, -81, -11, 77, 3, -3, 19, -68, -30, 77, -9, -7, 38, -49, -36, 70, 33, -10, 30, -52, -61, 84, 61, -19, 10, -25, -53, 72, 59, -37, 5, -13, -51, 39, 81, -14, -11, -27, -70, 57, 81, -14, -27, -9, -66, 55, 81, -33, -35, 1, -49, 22, 95, -9, -40, 2, -43, 10, 104, 3, -52, -14, -30, 7, 103, 1, -80, -11, -5, 4, 90, 10, -72, -13, -16, -14, 86, 30, -87, -31, 2, -4, 95, 42, -96, -42, 30, 5, 60, 45, -71, -51, 33, -1, 41, 71, -59, -75, 18, 21, 53, 61, -61, -81, 10, 33, 36, 43, -65, -68, 26, 24, 22, 61, -41, -77, 21, 30, 30, 62, -39, -103, 31, 69, 0, 44, -37, -108, 17, 87, -3, 28, 7, -96, -2, 73, 19, 36, 1, -92, -25, 72, 43, 6, -10, -70, -14, 80, 11, -11, 2, -62, -17, 79, 33, -6, 26, -61, -50, 98, 47, -23, 3, -60, -39, 79, 68, -31, -20, -21, -42, 73, 48, -24, -6, -27, -39, 42, 76, -30, -11, -33, -45, 64, 85, -38, -38]
5008c8K3qQ3K2j26PL8m2O1R0j11m1M4m8M5R6r3m7N2j8K2M9n7p5Q3Kj4N6m5p3O6
5039CPmO8m4j08N2L9mO2k9j16M5O1m6M8K0j05K5O1m8L2K2q7LQ4k1jJ3j00K3Q6
5070D1rk6J6p0KP4j3JL3p1m1R1ok8O7o6o2R1Pn7L4j1m3P3L6r1RM2o5N6N3p3nK0
5104Iq1N2R1n5l5K0l9L0O5m9j6K1l5JO3m2k2M2m7lP5j5o1K1j1PQ9l0q5M8Kl4O9
5137D5lp4M2jm7O8K7p0nK1k8M0M0p4mN0l2J0M8o9pN7m0mO0n0l8N1j3j6O4m1p4
5170f7Q1Jj8L6k1n4M6J7m4M2Kl8J0NqL5J1p9K6M5l7K9Kn0L3L8n9MN4o1NM1n4J9
5204hM8n8l5Q6k3l1N2l6k6M6Kn3N9Qm4K1Rm2N1kn3L4J9l4K5Jn4M1K3m4K0L2l7
5237cJK8n0L0L8o3JM1l0lN1o1rO5l6j3M8j4m1L3j8LM5j4n1K0RnM7k4n1M3Kn7O2
$$ y = [-38, -15, -23, 60, 82, -44, -37, 1, -41, 20, 110, -1, -42, 2, -46, -1, 95, 2, -45, 7, -11, 11, 60, 3, -72, 11, 13, -1, 55, 10, -63, 3, 10, 6, 74, 30, -78, -26, 13, 9, 71, 42, -74, -29, 32, -14, 34, 54, -51, -26, 35, -13, 19, 41, -46, -43, 41, 20, 19, 32, -68, -45, 41, 32, 6, 22, -48, -46, 28, 15, 16, 49, -22, -63, 28, 22, -6, 61, -5, -67, 24, 31, -26, 8, -3, -46, 27, 63, -28, -19, 23, -42, 14, 67, -6, -11, 9, -72, -20, 71, 16, -19, 1, -38, -8, 57, 8, -8, 13, -22, -21, 42, 0, -22, 20, -27, -30, 45, 30, -31, -10, -21, -14, 75, 45, -40, 8, 10, -24, 45, 42, -32, 10, 9, -38, 30, 57, -13, -18, 3, -25, 15, 55, -19, -23, 27, -5, 5, 53, -16, -23, 34, -6, -10, 50, 0, -38, 13, 0, -16, 48, 7, -67, 14, 15, -3, 33, 12, -42, 4, 21, -23, 19, 21, -17, -7, -2, -10, 25, 36, -43, -17, 28, -9, 20, 22, -28, 5, 43, -16, -12, 42, -19, -14, 27, -27, -8, 40, -18, -53, 33, 10, -21, 31, -5, -31, 15, 17, -36, 23, 31, -13, 8, 17, -25, 26, 24, -29, 5, 24, -10, 15, 16, -38, 3, 26, -18, 2, 34, -3, -2, 26, -24, 6, 44, -19, -18, 23, -7, -10, 41, -20, -29, 36, 0, -13, 35, 21, -20, 13, -5, -2, 43, 29, -22, -2, 7, 2, 49, 25, -26, 17, 19, -38, 24]
5272B4J8o3K8K2n1L7L2n8mN3l0J3J7o9pO7j6l1O5m7m6N4jQL9k8o1K2K2j1L6l3
5304Al0K7J8l6K0Nk4M9j6l2M0k3m8N3L8l4K9j9r2M8O3m1K5Ro1lL7l5L7N5o3k2
5336b5O7m4k5Q1n5k6P6j6p7L9Jl5P5J2n9J8no2N4M1k1Ooo6K7N7k3MJ1l4QJ4l1
5369a9J9J8j5K2qm5K7J2n7O7N8q9pL1p2M1J04p1m5O9n9n0J15k0o8Q0k3r0R2J1
5399B8o7L4L5n0L3K1q5K2N9j9mL8o4j0L0rJ8K5k4qk2j5N8km6K3J9l9L0J0n9M5
5431EM9p9J9N8q0%P5m6k6R7q4n6J03j7m7O5j2r2Q9K6j01O6N5j04L0O2q2J3N5o0
5461a9j0P3l3l4L0j8qM2km4J8mJ5J3j4Mpl8M2K6m5L5kp3L6P5p9RO7q0qR6o2n4
5495e3J09m3q5J09Oj06P7K4j01P4O9j27NQ1o0NP9p3m4O7j9k3P3k4m4K0jrL1Kk0
$$ y = [24, 42, -21, 7, 29, -22, 15, 47, -11, -15, 38, 8, 21, 38, -31, -38, 29, 13, -18, 47, 0, -46, 8, 7, 15, 54, 26, -35, -13, 9, -2, 34, 1, -29, -2, 16, -20, 0, 5, -19, 30, 14, -18, 22, -1, -49, 4, 42, 8, 37, 18, -74, -26, 37, -4, 21, 30, -31, -34, 3, -32, 5, 60, -3, -25, 42, -2, -27, 54, -1, -27, 49, 33, -44, -5, -4, -39, 36, 48, -11, 7, 2, -60, -6, 35, 14, 20, 14, -52, -25, 32, 9, 13, 24, -10, -2, 12, -19, 0, 18, 3, 25, 17, -28, -1, 11, -46, 21, 79, -10, -17, 14, -58, -17, 87, 16, -29, 40, -19, -69, 46, 26, -42, 38, 15, -75, 17, 28, -39, -5, 30, -20, 13, 34, -51, -29, 30, 11, 7, 45, -19, -29, 1, -8, 10, 35, 11, 3, -19, -34, 24, 22, -24, -1, 18, -21, 9, 19, -40, 5, 54, -25, -6, 52, -28, -28, 47, 1, -25, 72, -12, -68, 35, 18, -29, 36, 24, -68, 21, 47, -54, 12, 67, -37, -7, 55, -27, -14, 41, -19, -29, 44, 11, -23, 7, -11, -19, 23, 21, -23, -5, -9, 6, 19, 5, 9, 2, -36, 6, 32, -13, 22, 20, -53, -17, 58, -21, -12, 55, -25, -33, 63, 1, -53, 56, 13, -72, 37, 43, -63, 14, 38, -63, 11, 80, -47, -42, 39, -21, -16, 63, -10, -54, 13, -6, -29, 44, 20, -24, -4, -5, -14, 17, 19, -1]
5526alkJ7Nm9K7J9l3M6J7o4J1K7n6J9R7p1n5O2l4k8J16m7q8P8Mq3R6K9j05N2M4
5558D7j00M8Q2j11mP5l7l6Q4p7m0Q8ll9L0Km2K2J4j6K6Pm2nK2J1K1l9j5K7l1L2
5590AK9m7KM6n4qQ6m4n4O4k3k8P4j5j11P7M5p9N8L8j04K3P3p9J2Q5q9l0Q2l0k9
5621b9P2l1r2J05Pm7K9%m3L3J9k4MJ6k9kK3RKk2j5K5kKK1n4qM8j1l2O1k0n1P7
5655D1j6o0O1J8r8N3N5q4L2M9r2J6Q4p4l4R7m4m9Q8k5m2P1k7p2O5J7m9K1J5m9
5685c2L3K3l3nK4k6MJ4pJ6nj5%J3LJ2k2j9M2j5k5L2Mm0L5J7o5M1L9o3MN8o1PN2
5720D0n2l0Q9n5k5M8k2l4P5j3n8O5Kp6M5L3n0K6Pm8L1M2l7k1M2j8mK2j5j3PJ4
5752A7k3KNOmqOOj3PNk7L7ql1K1L2m5JM4m5PN9n8j7O0k0m9O0k2l8O2k2m2L8L0
$$ y = [-1, -4, -6, 11, 16, -33, -6, 13, -20, 26, 43, -21, -10, 17, -39, -20, 77, 6, -49, 13, -21, -49, 67, 20, -68, 10, 14, -69, 27, 56, -49, 3, 47, -53, -5, 77, -34, -38, 37, 0, -36, 48, -29, -69, 19, 16, -23, 7, 9, -33, -11, 3, -13, 13, 20, -22, -27, -5, 6, 27, -12, -27, 0, -31, 1, 30, -17, -15, 31, -23, -31, 55, 11, -43, 21, -2, -30, 44, 29, -82, -5, 40, -39, 19, 57, -47, -24, 49, -30, -18, 67, -22, -52, 30, 0, -29, 43, 12, -80, 25, 32, -15, 14, 14, -29, 4, 23, -1, 3, 19, -10, -12, 11, 20, 22, 0, -15, 10, 8, 10, 31, -23, -31, 17, 6, -26, 35, 15, -36, 41, 25, -35, 26, 44, -54, -1, 54, -30, 2, 51, -41, -25, 59, -15, -49, 48, 4, -45, 43, 18, -24, 47, 20, -52, 13, 30, -19, 2, 17, -32, 1, 24, -9, -14, 10, -16, -12, 2, -5, 11, 6, -9, -9, 4, 7, 19, -3, -22, 20, 5, -20, 12, 16, -24, 11, 28, -37, 4, 43, -20, -16, 42, -19, -12, 40, -12, -42, 47, -8, -33, 15, -7, -41, 34, 21, -37, 28, 30, -46, -1, 32, -18, 8, 15, -33, -2, 40, 3, -18, 24, 6, 2, 24, 9, -4, 3, 17, -6, -4, 1, 7, 3, -5, 1, 7, -6, 1, 6, -21, 16, 8, -23, -2, 30, -15, -14, 30, -15, -8, 51, -7, -24, 36, 16, -33, 27, 5, -33, 29, 7, -35, 3, 33]
5788C3o0K2K9n4K5M4p5J8L5l8JM6k9j4K8j3j9M6k2k4J6RmJ3lk0J3Nk1K0Mk1J3
5821Cjj5K1pj2J8j9J0J6j3l3L7Rk5L9k0k5J9J8n7N0K4n1J3J8l1RL3l9pM8j9l1
5854b0M0k2j6M3nm9K6Ml9L5L5m2J7Pn5K1L7j5J4Mk2%Lj5J1J7j7Pj7j3L2Rk7J5
5888CJ1j9oJj8K8L2k6kOl8NM5k6NL2m6k6L7Jk2M3lm4N1no0L2L2l8K7Rn5PK7l1
5924c1L3M0m6j8Rj3KO1j6k2J4k5j4L4rJL2k4l3J8lJK0j2mK8k8k2K5lRL5mo2K5
5959bkk8M8Ql0J6pl7K7M4l9j5M2k9qL1m7J3M7l2j5L1l0j0L0j4NL5k2m2K5J3k1
5992a5M7k2l4K3Pk8M0mk7K6j5l1L0K1m0K8J1k8J0Mk8K5K2k6OJ3m2K2K3k7NL3m2
6025a3pK3j3JK2j7k0M8k4j8M4k2j6L1j1m0M1jj8J3Ok4K2lk2K5J9l9jK5k0L3j9
$$ y = [33, -27, -5, 24, -30, -5, 39, -36, -18, 17, -21, -20, 26, -3, -17, 11, -2, -21, 25, 3, -21, -5, 4, 0, 13, 10, -10, 3, 8, -13, 7, 11, -10, 3, 2, -13, 8, 1, -11, 7, -12, -2, 14, 1, -32, 5, 14, -11, 28, 8, -17, 2, 20, -37, 13, 37, -14, -1, 17, -14, -5, 28, -11, -18, 30, 11, -20, 20, -2, -18, 25, 20, -29, -3, 1, -38, -3, 32, -10, 7, 14, -41, -20, 17, 2, 16, 20, -2, -2, 1, -14, -3, 14, -3, 4, -13, -26, 6, 15, -12, 3, 14, -5, -11, -10, -28, 0, 32, 6, 4, 10, -28, -23, 22, -4, 1, 33, -13, -39, -2, -1, -23, 20, 17, -27, 24, 19, -41, -9, 23, -15, 12, 21, -34, -27, 0, -31, 2, 42, -4, -22, -13, -26, -24, 37, 21, -1, 13, -12, -26, 8, -1, 0, 32, 8, -25, -7, -10, -9, 11, -1, -5, 23, -5, -27, -2, -5, 4, 39, 35, -27, -2, -4, -32, 16, 24, -6, 10, 3, -34, -7, 37, -2, -17, 25, -4, -12, 19, -28, -15, 32, 0, -15, 16, -14, -24, 6, -8, -3, 32, 10, -32, -7, 6, -15, 32, 10, -24, -1, 6, -22, 18, 14, -13, 13, -2, -33, -3, 18, -22, 6, 17, -11, -1, 3, -25, 0, 22, -4, 2, 15, -27, -5, 18, -9, -4, 29, -13, -20, 3, -10, -9, 13, -4, -24, 24, 0, -18, 26, 4, -12, 19, 8, -32, 9, 8, -10, 3, 9, -15, 7, 4, -18, 7, 26, -13, -14, 11, -9, 24, 5]
6058Ek4K2J5l7QK8l1K6J4n0QL9l5oM6m1ML9m7j5N9j5k3K2j7k9M6lk7K8Pm0K1M
6092Aj4L1pl4L7mk8L5j7k9M5Kl7J0J3l3J5M8l6J0Nl8%N9k1QRn3mM8j3j4K4j9k0
6127b1K2jj3L3k8j7N4j3j5K2l4rM6Nl9J3j2l8M7J4qJ0j9l7K0L7j6L%l1K7L1l9
6160fmJ3l1K3K1j9rJ5l0J9M0k3k4K5m2J0P4k0m8Rkj0L5Kl2Pml4M2L2k5j5oj9M9
6195A3K6l6j4j3PK1K1k5rpk4M2J5j9J1j7l9M5M3m3m%k4K7L8l9j6J8j9kN1j0m4
6228b6L1k0qO8k1n2K0lJK7J2m8NJ4j7L6mj8Jkj0K0L2m4lJ7j7J9K9n1MLj1K9Qk1
6264@KprJ4J8j8rQj6J8L9m7j4L5k4LL5j6k6K6j7k6O4k0k5J3%k2L6K3n5NL3l0J1
6299BJ0k6KJ1rOJ7qqOj2J2Jj5oJ2NJ7j0k4J3J3k7PL3k2j2K4k4pM5k1l0N1j7j8
$$ y = [5, -19, 3, 18, -19, -11, 17, -14, 12, 26, -24, -16, 23, -12, -18, 28, -13, -9, 30, -17, -32, 27, 12, -11, 11, -6, -35, 11, 8, -19, 9, 16, -24, -3, 1, -13, 18, 11, -23, 14, 10, -18, 17, 0, -29, 16, 18, -19, -9, 4, -29, -14, 34, -2, 8, 13, -25, -25, 34, 13, 21, 30, -23, -27, 21, 8, -6, 18, -1, -21, 1, 0, -13, 20, -8, -25, 29, 16, 1, 23, -11, -20, 26, 31, -8, 5, -7, -45, 2, 16, 8, 18, -1, -38, -18, 19, 3, 6, 6, -25, 2, 33, -6, -10, 3, -28, -5, 16, -3, -12, 3, -27, -8, 32, 9, -15, 10, -32, -22, 52, 32, -16, -7, -9, -19, 16, 18, -14, -7, -11, -45, -3, 29, 4, -11, -17, -36, 13, 39, 3, -11, -24, -17, 4, 25, 0, -9, -16, -40, 2, 17, -2, 9, -8, -47, -2, 41, -2, -6, -6, -30, -3, 35, -4, -20, -2, -21, -23, 28, 18, -26, 5, -15, -23, 45, 24, -28, -8, -11, -10, 17, 29, -19, -14, 0, -17, 19, 15, -3, -2, -4, -14, 6, 38, -6, -9, 8, -9, 10, 39, -12, -8, -5, -16, 13, 21, 0, 2, -5, -14, 0, 18, 0, -9, -1, -17, 1, 40, -7, -21, 14, -10, -7, 28, 12, -14, 12, -5, -31, 33, 13, -12, 1, 1, -21, 15, 38, -17, -12, 21, -9, 2, 12, -14, -12, -1, -10, -4, 13, 5, -3, 3, -9, 3, 4, -11, -17, -5, 0, 17, 7, -17, -4, 9, -18, -11, 22, 0, -12, 12, -12, -19, 26, 5, -25, 26, 9, -9]
6335iL3j1k7L5om5L7J1k5mK6k8J9J2k3J1K5k4j0MjMJ2j9mJ5Qj7Rk8RK7j3j%Jq
6372eJ6j1QJ6k5k3K6oOK0k5k9L2J2l0L2ol7K2J4oJ1On4KN0kmJ1n4MM2j5jJ7l6
6408b2MK4KmJ0k7j5L0J1J1kl6j9L3PM%k6oK8LMJ5m5k0L6RRJ0l4m3L0L8%Kk7l3
6445c9K5L2KKmm3j2N3Kmpl1rO4J0k7j5k5LL9J4k0%k9kL2K1j0j9l0jK8L4j3l0j0
6481a9j2L4L7k6rj2k3J4M1j0qj9l4L9M4jk8k5j8L1M0k6j4Jj7%L8K6l7pk7JM9K5
6515D8l8k4j5PM1J1l6j5POK0J2j5j8Kj6M0K0j0m4j2RJ8L8k0k6%j0K2K6k0j4Nk0
6549b1PM4kk5%nkL0ml5pJ5PK0lk2j4J0Q%K4k3j0mpL9Rl3j4K0lNM%k9K6k0K7Kj9
6589ej3K0j0RK0j3k4MJ8j5L1j3l7K1J1l1K8Rj9J0jj3K2jj5mL3k7MJ9l8QL1k6j8
$$ y = [-9, 24, 13, -14, 21, 15, -30, 7, 18, -7, -11, 15, -13, 6, 18, -5, 6, 31, 7, -3, 1, 0, 4, 16, -3, -7, 8, 16, -1, 8, -20, -11, 16, 3, 2, 2, 3, -5, 11, 0, 8, 24, -1, -24, 2, -4, 2, 22, -3, -32, 0, 12, -18, 14, 8, -29, -7, 7, 1, 12, 18, -36, -34, 16, 14, 10, 21, -33, -29, 13, -2, -3, 14, -22, -18, 6, 8, 4, 14, -13, -28, 2, 13, 24, 22, -14, -33, 0, 7, 11, 11, -15, -21, 7, 10, 14, 29, -16, -36, 0, 9, 18, 28, -6, -49, -19, 19, 19, 21, -6, -39, -14, 18, 20, 22, 18, -25, -37, 16, 18, 14, 7, -24, -33, 31, 41, 14, -1, -26, -23, 16, 30, 10, 10, -19, -21, 11, 32, 22, 3, -27, -28, 0, 34, 21, -9, -19, -31, 3, 40, 14, 5, -7, -30, -16, 25, 15, 7, -12, -46, -7, 37, 36, 8, -17, -35, -4, 36, 10, -4, -3, -20, -20, 18, 44, 7, 0, -27, -26, 23, 48, 10, -14, -29, -22, 19, 30, -6, -21, -14, -8, 12, 24, 9, -9, -7, -23, 17, 37, 27, -17, -29, -20, -2, 36, 16, -10, -10, -20, 2, 28, 8, -6, -1, -21, -14, 30, 28, 3, 3, -2, -4, 26, 22, -13, -20, -5, 2, 22, 19, -3, -17, -7, 1, 1, 25, 2, -8, -12, -19, 20, 29, -4, -18, 2, -1, 4, 8, 8, -21, 5, -15, 12, 14, -5, -18, 2, -8, 1, 21, 8, -16, -12, 6, -9, 22, 9, -28, -7, 4, -27, 1, 10, -9, 1, 0, -13, 9, 8, -7, -11, 22, -5, -1, 18, -20, -12, 19, -7, -25]
6624b5K9%nJ0j1nJ8j2lNkjJ5kj8K1j4j1jJ8mMnj3J7J2k5K1j4j3J5J3k0J5Ll1J8
6661aJ0j4L4k8k6jL2Mk0K5j8k2M3k0jL1k0m2L9PnJ8k4m6L9K5rlj7j4J9J4lKpk0
6697a9nL7J0Ll7k1K9J8m%j1l3J8K0jJ0%m8K2K8Jmj5l1oO3Kj7Ql9j6N6JqLl7k6
6734d9M9K3Lj6k5k2L6K7jk1mk5J7L7j3j5jk0K2J5jlrl7L2K0Jmk6j8K1L0j6J1p
6769A1m5J9L6Ppln2jN8%j0%l9j4M9J7l1J3j6k6M8J3k5%ol1L1M7j8l1nj7L1K9l
6804B9m1mj2J5K2K0j4k5j6K1K5qJ1l5l0L0L8j9j2Ok8J6L9k0nll8J7N2J7l2j7k9
6837c0nM4K5l1ljk4L1K6l5Kqj4K2K9mk8Oj9L1Pprj6j5L5J1j3jj5j1J9K9j1nk1
6873ik3K0L9j1k2Kk0K5L0k6k4K1j4pL4ok1jPj9M5Qm2J2jj4K6Lk9MJ3oLK5j4k1
$$ y = [-25, 4, 4, -1, 9, -2, -7, 11, -1, -4, 1, -1, -2, 13, 11, -7, 14, 0, -11, -12, 6, 2, 6, 1, -12, 5, 17, -8, 13, -1, -14, 1, 14, -6, 9, 12, -19, -1, 9, -5, 29, 1, -25, -26, 6, 10, -10, 15, -3, -25, 18, -2, -3, 28, 8, -34, 5, 12, 7, 25, 1, -45, -6, 19, 10, 7, -10, -24, -5, 9, 6, 8, 1, -19, -24, 13, 23, 26, -11, -32, -3, 15, 11, 11, 0, -33, -15, 5, 4, 14, 14, -34, -12, 16, 17, 13, -2, -33, -39, 24, 26, 9, 17, -22, -38, 18, 19, 11, 14, -23, -49, 0, 23, 26, 10, -15, -37, -1, 26, 25, 4, 0, -25, -8, 29, 16, 1, 0, -20, 2, 17, 16, 13, 4, -33, -1, 19, 20, 16, -10, -28, -7, 23, 7, 18, 11, -34, -15, 21, 28, 21, 18, -34, -35, 23, 23, 13, 13, -26, -40, 9, 26, -5, 8, -8, -34, 14, 27, 2, 2, -4, -35, -4, 43, 25, -6, -11, -28, 3, 32, 29, -12, -16, -28, -13, 9, 29, 15, -10, -26, -5, 20, 12, 23, -12, -42, -12, 26, 7, -5, 1, -27, -11, 28, 8, 3, 0, -38, -21, 31, 48, 16, -1, -30, -35, 9, 34, 3, 0, -1, -25, 6, 32, -3, -1, -9, -23, -1, 28, 24, -4, 2, -17, 14, 21, 14, 5, -11, -26, 9, 20, 7, 6, -9, -20, -1, 28, 17, 12, -9, -32, -12, 27, 16, -6, -4, -24, 1, 31, 5, -19, 2, -12, -19, 15, 9, -12, -13, -6, -25, 20, 28, -14, -2, -3, -17, 9, 12, -17, -13, 0, -6, -3, 22, 8, -13]
6909a3J2pkK4jl0J7j2J6l%j5LQJ4J2l3NJ8k6QJ5j1j2L0j0j9L1k2j4L7j8j0K7k2
6944cj1K5j2k7K2K9l2KK3k4%J8j8kL9k6pjOj3L2mk8J9j2J2RmKj1omL2j4j2J2k5
6981a4J8J5k5rJ6mJ0J3k2k0J0J0pL5nl8NJ1rJ9J6m8jQJ0%L5l6j2K9j4J6J4k0l6
7016c0L5LLJ9l0l9K3K0J3J2k4k2j1J6K7J2j2k1j7J3K1K9k6l4NJ0LK3j4m0J5J7
7048ajJ5J0n4OK5J0J1pl4j3K9J4JJ6l9l0L7J1kJ3l3j1J5K9mPj1m8L4K8qj2ok3
7083b6J8K5Qj2j0l3MK7J2J0k0k3pM0J0Jk4m2J8L5JLj6j8QK4ojOl2nL9KpKj8k1
7120b8L5Pmj8j0j1K8L0l2OJj9RK1Mj1l0KJM2jk6mk0J2K6Oj5Jj1mL0j0Nmk8J8J4
7158A2jj4j2PKJ7jj9nJ5kKQj8Qpj3K8lqj0K2j7J6Rk0j5K4k4J8K2k6lK1j0j9K3
$$ y = [-13, -1, -8, -10, 14, 13, -17, 0, -12, 4, 1, 1, -14, -11, -3, 11, 23, -10, -5, 13, -13, -5, 10, -1, -13, 17, 7, -12, 19, -3, -17, 20, 2, -8, 19, -3, -14, 11, -1, -28, -6, 23, -9, -7, 16, -8, -8, 10, -8, -10, 29, 3, -4, -5, 1, -12, 20, 16, -12, 7, -5, 7, 16, 12, 14, 3, -3, -7, 25, 11, -1, 11, -14, 4, 19, -6, -15, 1, -3, 7, 20, -2, -22, -12, -2, -9, 26, 21, -17, -12, -1, -10, 9, 25, -23, -24, -16, -6, -6, 29, -7, -19, 10, -4, 12, 26, 6, -30, 5, 8, 11, 30, 0, -39, -16, 4, 17, 29, 5, -17, -28, -12, 15, 27, 15, -6, -23, -10, 11, 40, 14, -20, -15, -5, -2, 21, 7, -33, -18, -1, -2, 13, 23, -31, -25, 0, 10, 21, 14, -20, -33, -4, 10, 11, 27, -12, -42, -5, 6, 4, 17, -16, -27, -12, 17, 13, 20, 9, -39, -5, 23, 15, 3, -3, -26, -8, 17, 25, 13, 3, -30, -26, 1, 13, 23, 3, -20, -27, 13, 23, 24, 0, -42, -24, 11, 12, 15, -1, -19, -11, 13, 7, 6, 12, -20, -25, 14, 16, 9, 11, -7, -28, 7, 14, 10, -8, -18, -29, -1, 29, -3, 3, 4, -15, -6, 15, 19, 8, -22, -20, -19, 23, 22, -4, -8, -28, -16, 10, 16, 1, 2, -9, -13, 17, 7, 12, 8, -20, -2, 12, 11, -3, -15, -8, -6, 11, 10, -9, -14, 1, -1, 1, 9, -9, -1, -8, -21, 7, 4, -4, -14, 8, -9, 7, 16, -4, -19, 5, -19, -1, 21, -5, -8, 13, 3, -16, 7]
7195Gj2lkNoRlqJ5kkj4QNRoj3PJ1opPrJ6j3%J3J2l4J1%rJ8Oj3jK0j5mJ4j5j3K6
7238IPk9K6Lj9lJ0j0J3pj5J2J0jj0Pk5J9J5qlKmj0LJ9pkrj0J9J4j0Ol6K1OJqJ8
7278A4qqkkK1oj4j0K5mpJ6k4j2K7ppJ4Kj7J2JnJ1pk0LK8mj3Lj3LK0jj9J4j2MJ1
7318GkmlKrNQlJj1J0OKj7MPj3J9mj5K8j4j1J4%rMOk6J9J5k2K0lj8J1JjoK1k5k
7360hJ9j9OJ7j9pK1lj5L3k0kKmJPj2pkJ2oJ4j8jJ2MkQjk7J3KNJ4j8%kj1J4QKk3
7402a3LJ0rMJ8k0nKjQK1k7j9K8jJ8lk6lJ1ORprk1J9QkJ6oj6PkNJ7j3k0OJ2oJ6
7443A5k2qJ4P%kJ4k4j1J5NQJ4l8mL1Kj2Ok1kJ7MkQj1nK%Rokj7RK0j1J3k9KRQl
7485Bj1nmJ0J7qkq%KMjJ7qj7J3Oj3J6j1j3PJ7lj2Pk4J5J9Kk0Kj2PJ9%j7JKKPn
$$ y = [7, -5, -8, -10, -5, -11, -2, -5, -13, 2, 0, -2, -16, -8, -3, 6, 0, -13, -6, 5, -1, -8, -1, -10, 6, -7, -7, 6, 18, -16, -5, -5, -14, 4, 10, -3, -4, 16, 1, -3, 11, -4, -17, 9, 16, -13, 13, 16, -3, -6, 4, -6, 7, 0, -15, -3, 7, 6, -4, 3, -22, -3, 12, 4, 1, 3, -1, -11, -8, 11, 4, 2, -7, -17, 2, 16, 6, 12, -24, -3, 3, 4, -4, 14, 6, -2, -4, -6, 15, 9, -5, -15, 10, 6, -1, 15, -9, -21, 6, -1, -8, 6, 8, -9, 3, 4, -1, 10, 3, -17, -14, 14, 10, -3, 0, -13, -10, 10, 9, -10, 4, -8, -4, 7, 5, 1, -2, 0, -9, -4, 4, 1, 2, -9, 1, 7, 9, -8, -4, 3, -10, 9, 5, -10, 18, 4, -7, 7, 7, -2, 2, 8, -18, 1, 16, -6, 14, 11, -7, 4, 5, 4, -2, 19, -6, -8, 11, -8, -2, 15, -4, -11, 10, 7, -8, 25, 5, 3, 5, 1, 2, 9, -3, -10, -12, 0, -6, 8, -10, -11, 1, 5, 3, 11, 10, -17, -4, -2, 3, 17, -1, -1, -3, -14, 0, 8, 10, -13, -10, 0, -9, -5, 13, -7, -12, -10, -11, -3, 18, -9, -28, 0, -1, 17, 14, -12, -15, -4, 2, 11, 4, -5, -26, -7, 1, -1, 15, 9, -7, 0, -2, 3, 20, 7, -13, -7, 5, -1, 15, -7, -15, -1, 6, 6, 4, 18, -6, -17, -2, 3, 11, 25, -13, -17, 14, 16, 4, 10, -11, -13, 4, 8, 6, 14, 3, -2, 0, 0, 9, 3, 1, -16, -7, 13, 2, 15, -14, -12, -3, 5, 2, -9, -14, -18, -8, 9, 1, -1, -9, -9, -7, -3, -4, 13, 5, -12, 1, 7, -6, 10, -1, -14, -7, 10, 7, -5, 2, -22, -7, 12, 14, -6, -4, -16, -9, 10, 10, -7, -6, -4, -2, 5, 0]
7527@jLmnJ4KJKk3MPjLPj5jMLj2K0nqK4j0rKJqK1nj1pPj2J5J4k6MO%j1K1%qKj2
7573gKJ3kk0K2kNoj0jPJ0mmlLoRpPq%nJ2j0K3k7LJ9j4qJ1KoRNj8NRj1%MLMKk5
7619a5LJ4Oj7J6rj1K4j4Pj4ORqLoKnlJ3lOJj9J4J5k0lNj1J7kJ0oJ0j6KKPk0Rp
7661hjK0J0k2MLpNJ5j5j6K1pj2J3Kk5J4lJ0lPj0rJ9j2JJ3Mj1OmNoPjqj%KqQKk
7705@J1j9PkRj5J7j0JNLj5nK5oj4J4nrJ2j3KJ3J0j4j1J0kKJ5l1MK2j1qK0j1nJ
7744cpRJ1pLj2K7j3LolKpJ6pkNnj6J2lj1QLJ5L%k2ORLj6J9%k3QK0l1J5J5l4J9
7786CJ5j9MmJKJ0j2k0J9ooJ6j4NJ3Jj1Rmj0RLoJ1NrrRMLnj1KLkR%pnlONQj3JJ
7833ARlLj7J0J2j9J0Rj5lPj4RK1k3lJ2lpJ0Lk0J1Ojj0QrKkOrJ2j3LK4j2kJ1j6
$$ y = [0, -1, 2, -2, -7, 7, 9, 10, 12, -11, -7, 0, -1, 2, 9, -6, -7, -3, 0, -12, 8, 3, -5, 19, 9, 0, 2, 3, -5, 16, 11, 0, -7, 0, -12, 3, 17, -9, -5, 1, 1, -10, 11, 11, 3, 5, -7, -5, 8, 6, -14, 8, 6, 11, 5, -5, -6, 1, 11, 7, 3, 0, 3, -3, 6, -1, 6, -2, -2, -7, 5, -5, 18, -9, -6, 13, -1, -9, 2, 4, -2, 7, 12, -6, -1, 8, -3, -3, 1, 4, 8, 10, -15, -12, 2, 8, -9, 7, -2, -13, 11, -3, 4, -10, -4, 5, -3, 0, -6, -4, -9, -12, 1, -2, 4, 5, -14, 0, 15, -5, -8, -3, -14, 3, 1, 11, 5, 15, -1, 1, 3, 10, -10, -1, -8, -9, 11, 21, -1, 3, 6, -1, 4, 19, 4, -12, 9, 2, -10, 3, 5, -20, -6, -9, 1, -2, 5, -5, -14, 5, -7, -6, 7, 11, 0, 6, 2, 7, 1, 8, 7, -1, -2, -2, 0, -8, 0, 2, 0, 11, -8, -1, -3, 6, -9, 8, -2, -1, 4, 7, -8, -13, 12, 6, -8, 6, 1, -8, 4, -9, -7, 6, 16, 2, -9, 1, -1, 1, 16, -15, -11, 11, 0, -8, 12, 1, -4, -3, -10, -1, 10, 3, 6, -6, 21, 8, 11, 5, 2, 4, -3, 13, 6, 4, 9, 4, -12, 0, -3, -14, -6, -3, 12, 15, 15, -7, -1, 8, 11, -5, 14, 14, -9, -1, 19, -12, 3, 18, -16, 3, 18, -1, 3, -1, 0, 2, 12, 0, -20, -1, -7, -13, 3, -11, -6, 7, 8, -3, 6, 2, -8, 1, 4, -2, 9, 14, 5, -4, 5, 9, 12, 7, -4, -2, 1, -1, 8, 8, 1, -4, -7, -1, 4, 12, -1, 0, 1, 10, 7, 10, -7, 3, 15, -4, 6, 15, 0, -3, 4, -10, -1, 20, -3, -6, 6, 3, -4, 6, 9, -11, 0, 6, 5, -5, 3, -6, -4, -6, 0, -9, 3, -10, -7, 17, 5, 3, 14, -2]
7874bqJ7Kj8J4pOkqJ1prPJ3qJ2j5r%J7JjJj5ROnrRNj1J0Jj3PJ0j9OJ9k1kK0j7
7917cRjj0nPlNJ6j1nQk0PK0j2%Nlj0NrQMj1JK8j9lNj4MJ3jmJ6j8mQKlj2PMNOk4
7963a2JJ3oJJ6k3MRj4J5J6k0oJ2mpJ0j0OJnJOpj0RJ1k2L2ok0J1Mj1QnpJJ4k3J1
8004fRj2jRnJ9%k3QlPj4J7k0QlJ9j4PoRmMnKJ0j4%J9j4mknK9j4nqjpJ9mpJ1Lj9
8049a1J7qJNkk6J4L0j9rj0PJ5nqJ0%nNPj4J3nlpJ6jpKrJJ2JoJmNnNnJ6nj3MJ1
8094A1j1Nnj2J5%lLj4RMnlJ0pOKnOnqJ7mp%j3OJ7j8PjLqmMKK2j3nOJ3j0JJj1Q
8140FlmjJJ0qjnNNlrJ3J3qopJ1rJ8j0Kj1KJj5J6J1j4Ok2K1Qj2%J1jj2Oj0k0J7
8182hJ3j3%J0Oj5Llk
$$ y = [-2, -10, 7, 9, -9, 5, -2, 4, 2, -6, 5, -2, -11, -4, 9, 1, 13, -2, -11, -11, 6, 7, 6, 7, -8, 1, 7, 2, -7, 2, 7, -4, 6, 7, -6, 1, 11, -8, -2, 17, -4, -6, 14, -3, 6, 5, -5, -10, -3, -6, -1, 15, 4, -1, 7, -13, -6, 14, 2, 2, 7, 4, -6, -1, -10, -2, 2, -9, -8, 20, 1, -2, 3, -11, -7, 6, 5, 1, 17, -1, -5, 3, 5, 2, -10, -3, 1, 6, 12, -12, -11, 2, -4, -3, 13, -10, -6, 3, -11, 4, 20, 0, -6, 6, 2, -5, 5, -5, 1, 2, -3, -2, 4, -3, -13, -4, 7, -15, 17, 11, -9, 2, 6, -5, 3, -2, -9, -8, 6, -17, -6, 3, -9, -10, -1, -6, 13, 13, -10, -2, -5, 2, -12, 5, -15, -7, -10, 9, -5, 2, -4, 5, 1, 5, 0, 2, 12, -2, -2, 17, 3, -1, -3, -8, 21, 7, 2, -6, -7, -14, 5, 1, -6, 5, 8, -11, 6, -2, -1, 4, 2, -24, -10, 20, 1, -8, -18, -11, 4, -1, -9, 1, 1, -4, 1, 8, -6, 7, 2, -1, -8, 8, 7, 0, 2, -7, -6, 6, 7, 1, 2, -2, 3, -2, 3, -2, 14, 9, -4, 0, 11, 0, 5, 0, -12, 3, 3, 0, 3, -11, -2, 2, -3, -6, 4, -3, 3, 5, 0, 6, 1, -7, 10, 6, -1, -1, -14, -8, 9, -9, -2, -3, 0, -8, -12, -8, -6, 16, 3, -2, 4, 17, 7, 8, 9, -2, 6, 3, -1, -2, -1, 9, 1, 0, -5, 0, 5, 2, -7, 6, 19, 11, 5, -2, 9, 0, 18, 8, 10, -1, 1, 2, -13, 3, 14, 0, 6, -16, 5, 13, 1, 1, 12, 11, -1, 5, -5, -25, -8, 5, -8, -8, 2, 8, -7, -4, -7, -9]
8191i
$$ Imaginary data points
##PAGE= N=2
##DATA TABLE= (X++(I..I)), XYDATA
0@%%%%%%%%%%jRj6J6j6J6k4L2l2M0m8N6o5P3q5R4j06J22j38J58j82K03k27K56
34A35k86L18l54L95m39M87n38N95o59P30q10Q96r94J105j231J380j551J752j998
53a067K300k687L201l917M996o820J0681l1416L5620L2542p6487M5144K0931p2428
67c9407J5010O1772m1254p463L3447k9815j3444L7140j2798j1323J7075j5805
79f865m967L0992j2596k0238J6020m367j3127K5442J0960k3807j1424R580M230
92a67l962R654J6106k3895k5652L2093J1855l3237K2260K2258n0874L323N2271
105C2033l2966k3696M5404j8199l0579M7029J65m1067K4128L152k8609L5539J1928
118B4262m0822J6962Q757l9344L1904L4674m9776Q8L6937m0730p144N5572k1502
$$ y = [0, 0, 0, 0, 0, 0, 0, 0, 0, 0, 0, -1, 8, -8, 8, -8, 8, -16, 16, -16, 24, -24, 32, -33, 40, -45, 49, -57, 65, -73, 85, -97, 106, -121, 135, -151, 167, -187, 208, -231, 256, -282, 313, -346, 384, -426, 470, -524, 581, -650, 730, -821, 931, -1067, 1233, -1454, 1747, -2170, 2826, -3994, 6687, -24729, 10891, 43433, -33054, 12090, 33021, -39407, -24397, 37375, -3879, -11342, 22105, -7710, -21154, 15986, 3188, -8135, 8940, -6865, -11832, 19160, 6564, -13674, 2346, -2021, -15148, 10294, 21254, -2553, -13977, -4397, -167, -4129, 5525, 21631, -2264, -27916, 4177, 16032, -17205, 5055, 27313, -23561, -20238, 32033, -933, -24629, 20775, 2576, -28003, 19026, 19191, -21876, 2252, 5404, -23205, 12334, 24262, -16560, 402, 9159, -30185, 1719, 36393, -13383, -13295, 23642, -17088, -24232, 31340, 9838]
131I838l5375L6138j57l2042K4804J5257k8031K09J6620m780l700K459j062l365
145c187l424R750Q747j3970m710R470p881R50J5842r022q190Q515r624J371J9714
160A4351j5347r846K2972j4553j4882L5087p846l4968L1334J1294l8926K1839
172E09K4963m2404J722L6357k4788r515L1407j7299j9428K5755j408j4033J5734
185G572m584j4033J4903o8j0885J3318k021j5031J3092N379j4496O447P142j1933
199e198J378R647l924m704N91K631K028m522K231O122j1647k589J7646o577j2615
214i502J5954k130j7917J6381Q899j9311O227Q966j6737O276J4196j4816j52J0680
228G014j4095K577J6690j5107m971J7613j2194q232K2165o549j7829J6659K644
$$ y = [9838, -25537, 10601, 10444, -21598, 3206, 18463, -9568, -9359, 7261, 2481, -1219, 1240, 178, -3187, -6611, 3139, 11886, -2084, -6794, 2676, -5205, -4255, 11587, 2565, -5625, 2890, -6734, -5363, 14351, -996, -10842, 12130, -2423, -17305, 17782, 9936, -25032, 6302, 17596, -21330, 509, 25472, -16932, -15210, 21147, -3641, -13156, 18251, 952, -18476, 7279, 5871, -8162, 7572, 2988, -11045, 3858, 3790, -7095, 6223, 4202, -10829, 2263, 7642, -6854, -407, 6735, -5198, -3820, 5827, 1903, -2801, -2210, 421, 2449, -2073, 158, 6280, -5367, -7956, 9690, 3113, -9502, 6452, 4322, -13595, 2786, 11685, -7626, -1399, 7567, -9170, -2894, 11302, -3514, -3666, 7014, -7081, -4504, 12186, -2921, -7892, 9721, -2473, -10705, 11460, 4911, -12918, 3741, 6385]
241F385j6428J2610Q116j7958J405J1469o611l03O630o053l837L962J315J834
255B536m89m054J032Q2j340N727K72o970J365J756j790N468K8p526K716J518m067
272c736P974J882j2202L672O543r539N143J0940j3845n002J3125n505m401J3335
286H384n419j2363R930L117p501P141J288j0563L885N257n072L733K495q759J186
301c261O210l541J227L588p034j983O898j14k101J952k411k961K714K900L15j844
317E54k345L94K47O74M316j076o486J326L318k069L138K562p227j394N455j823
333d36N14M775n412m354N495j58j378N494l228o952M963K917l502L817M65p657
349d637J824N670k788M16K767n351k137N246Q12j054J246k970k836L247K623l63
$$ y = [6385, -10043, 2567, 10683, -7275, -5870, 5599, -1012, -1315, 5315, -738, -4575, -613, 702, 2536, 2047, -2007, -975, -893, -2233, 3494, 3766, -3204, -1839, -83, -1873, 3595, 3623, -3903, -1187, 331, -3736, 4238, 6120, -6082, -2410, 4133, -5406, -263, 10677, -3168, -8170, 4955, -550, -4951, 8384, 2965, -9398, 532, 3649, -3852, 3289, 4577, -5986, -2101, 3156, -1916, 1817, 4312, -4447, -3261, 2949, -592, 635, 4223, -2811, -4794, 2104, 1990, -111, 1841, -570, -3531, -817, 2083, 2398, 554, -1791, -1397, -1150, -476, 3840, 2764, -3722, -2396, 922, -1147, 1991, 4553, -2674, -4068, 1387, -436, 78, 4853, -559, -4913, 582, 424, -954, 4540, 1312, -5640, -677, 2240, -1262, 2555, 3020, -4637, -2813, 2857, 69, 485, 3252, -2099, -4236, 1010, 1822, 768, 2014, -956, -3792, -545, 2078, 1715]
365A715n63k143j728J754K277P36p78k297j178J004J766J960n79l534r27J674
381h41J143K171K75m531j516L000P49R43J788l723l400L015J838%K118k247m823
398d041J872L518j8R45j081m610N40M190M69k74k85l435j032L597J859n23p61
415I30k574j557K646K974J6j962k378o84J944K527P39j971k762j74J849J648J258
432B469j045l435p95K430J695R65n63l611j436L061K043Q3l79k797j935K655K436
449A841j20l71k106k344J848K976L26o83k077k349J634L182L47r90j780k013J294
466a385K929L01q89j272j950O40K802P46q20j402j961O22K842P63r91j394j799
483b218P71K821K97j097o71j673J13K820N81j284m47j505m18K937J093j778o78
$$ y = [1715, 1152, -991, -2719, -965, 1312, 2048, 1270, -1027, -2205, -1201, 565, 2525, 1946, -1588, -2515, -841, 302, 2473, 2748, -1783, -3299, -299, 450, 1393, 3181, -542, -3942, -927, 911, 911, 3029, 782, -4041, -2169, 1349, 1331, 2276, 1195, -3415, -2875, 1315, 1784, 1510, 1225, -2210, -3242, 355, 2214, 1691, 930, -1644, -3201, -555, 2419, 2435, 473, -1905, -2589, -645, 1882, 2621, 650, -2112, -2286, -437, 1211, 2469, 1424, -2011, -2806, -376, 1319, 2284, 1721, -1890, -3326, -265, 1778, 1861, 1482, -1315, -3250, -595, 1841, 1721, 1350, -756, -3100, -1252, 1724, 2050, 1367, -710, -3059, -1425, 1757, 2104, 1114, -666, -2679, -1385, 1544, 1845, 956, -316, -2266, -1626, 1176, 1922, 1102, -300, -2261, -1639, 1203, 1966, 975, -419, -2218, -1447, 1374, 1671, 574, -97, -1770, -1657, 1163, 1744, 460, 13, -1492, -1910, 1027, 2120, 342, -336]
500c36r31m93K765J243k248o35k4q40J983J695k029j006M49p80J203K080j482
517F14j738K59O6J204J453j503j448L40n3J280J416j875j168J045o87M58K365
534B028j505k060J437j11l90K298r90k644J646R67r33J516p59k835J938J729j608
551b76J256K71l663R06L081j393K50J362l349r30L565Mj062Q78j678q72K488J06
569I44j090L99j246j44K613l83j432N64j607p02L619Q42k218k73j402r86L324
586H22J517j607k96j694j186L180P15j879J624j015l090L598J907m165Q69J859
602A159l331K193M102m500k510K816j132R19M297k683l622J361r93O91M898j474
618B191l703J404j427j177N320K53m830J474J249k388K341J452l795o4K380j13
$$ y = [-336, -1267, -1760, 1005, 2248, 0, -635, -659, -1499, 484, 2179, 150, -856, -407, -1187, 16, 2096, 614, -1124, -865, -799, 405, 1858, 355, -1093, -753, -806, 474, 1890, 15, -1153, -108, -795, -337, 2028, 523, -1537, -100, -211, -601, 1697, 707, -1937, -291, 676, -257, 1259, 500, -2335, -397, 1332, -276, 980, 1251, -2412, -1506, 1575, 182, 432, 1794, -1555, -2485, 1080, 1084, 22, 900, -778, -1650, 838, 944, -146, 253, -993, -1137, 1476, 1093, -339, 225, -1382, -2084, 1535, 2377, 159, -114, -1516, -2502, 822, 2339, 732, 436, -1258, -2444, 736, 1451, -428, 1196, 181, -2909, 689, 2596, -1569, -700, 1159, -2172, 21, 4123, -377, -2887, -71, -1203, -284, 4013, 1330, -2292, -931, -1924, -1233, 3665, 2191, -1512, -108, -1535, -2712, 2608, 2861, -1969, -495, 754, -1634, 707, 2159, -1636, -1700, 680, 567]
634E67R16l41k900j6Q21P08L651m94n295R0J559j101L835K525n398j715K493j452
652a547J347L338k928j606J885j684Q98K878l854j082M327j931p79M359m334m646
668e359O238J618l540L756n49o907K316M414j884J530J093m838m50K598l72J990
684A654N12m152R91K441k722J226K329m199P6M482k029j555K135k444j240L578
700A083M76m23J7l513l8L596j175O50K751n021k211N704j291k787N103j334n410
717c823M042J945l979K139J192l642K081K009k766J081J1l101L523K067m382J794
733A91J941n497J675N439m000j220M049l606k119N002m76k495J951j037j139K368
749A027j053o11K197k430p53L934k245k308M256j513l592M588O41m293K325J067
$$ y = [567, 1483, 1142, -1758, -1774, -953, -245, 3406, 2912, -2383, -2293, -734, -1835, 2000, 4525, -873, -2588, -95, -1547, -200, 3138, 210, -1396, 489, -1195, -297, 2581, -1273, -2355, 1972, 41, -738, 3621, -713, -5359, 879, 2497, -1043, 2713, 2164, -4743, -2427, 1987, 103, 1633, 2726, -2112, -2562, 36, -336, 1654, 2166, -1986, -995, 1446, -1276, -50, 2279, -1920, -1844, 2638, 609, -946, 1189, -1255, -2495, 1083, 1559, 1136, 1153, -2360, -2398, 1198, 23, 673, 3424, -1597, -3808, 1896, 605, -2182, 2921, 1587, -3823, 219, 2164, -1815, 324, 1516, -2126, -45, 1964, -802, 279, 290, -2811, 712, 2779, -1603, 191, 2132, -3365, -1690, 3749, -251, -1471, 2578, -1028, -3147, 1855, 1379, -1116, 835, -202, -1341, 1027, -26, -637, 1560, -870, -1623, 2311, 66, -2242, 2014, 501, -3091, 1497, 2138, -2155, 170, 1237]
765A237l178K219J356k785J469K89k487K814M25l702L274J275n342K772L786n527
781b105N75M835m525j237N293k646k644M048r82k265K571p84j131K324j664r93
797a330L008j972j452L892j854k920M282l96l884L439J081l839J848J431k633
812a299J531R49k402J455M28k194K529L29l681K775J753m523J981L254m663K18
828a560M176l344q74L982k574j962L330r63r89K420k025j196K910j827r33L869
844B440k152k709L971j017l290M235N47m386K435J762l443J212J741k499R93J559
860A399j985O24M22k133J786J281k395J615J160l871P61K980k259L82K534k970
876f69j050K612j360l20K403j571o39J803k243m49L110j863j054L586j828k725
$$ y = [1237, -1941, 278, 1634, -1151, 318, 607, -1880, 934, 1359, -2343, 931, 2206, -3136, -364, 3422, -2105, -1530, 3305, -1220, -2457, 2836, 190, -2454, 1594, 612, -1653, 918, 134, -997, 1327, -337, -1330, 1678, -294, -1746, 2146, 292, -2628, 1654, 1258, -2626, 813, 1894, -1945, -97, 1334, -1299, 232, 1181, -1221, 234, 662, -1532, 997, 1326, -2355, 420, 2173, -2350, -369, 2885, -1778, -1560, 2616, -728, -1602, 2380, -194, -2156, 1174, 211, -778, 1642, -383, -1579, 1331, -496, -1429, 2440, 288, -2421, 1550, 533, -2757, 1478, 2025, -2361, 74, 1836, -1607, -395, 1346, -1153, -160, 1399, -586, 38, 460, -1673, 113, 1394, -1001, 614, 1774, -2097, -1336, 1644, -615, -233, 2301, -669, -1719, 893, -467, -787, 1616, 45, -594, 1209, -1034, -1483, 1627, -236, -1290, 2296, 468, -2257]
892b257L243p19k821L867J074l709J297Q44k980J637K164j865P17P38k685M81
908i74J474j378J405J433k740J25J643k358J65K779j284n49J691j900j276J942
924A98k60j16J688j050j083Q11j354q9K656o29j088J547j479j783K340J32j341
941i00K252J12k628P42L55j363J876J108j719N96L4k257J093J569j238J122R73
958A727k834j71J917j380J49K314j300j132J320j157r63K001J84p53R87o58j328
975a077Q06l4k51J606k2j346K26m19o55J543N18r31N09k07j245O57M83n01R69
994F29J17j307N73L02j261P45R01j019O99P69j951k46J452o84J31J530j152j117
1012h89R71m50m41J669K5j227L29j57n91J023K53p92M56J46p29L64J38n57N62
$$ y = [-2257, 986, 267, -2554, 1313, 2387, -1322, -25, 819, -2161, -524, 1640, -225, 492, 1230, -1455, -974, 500, -878, 527, 1960, -780, -655, 988, -1370, -1205, 1574, 290, -259, 1432, -468, -1744, 198, -62, -178, 1510, 460, -623, 188, -1166, -1255, 1401, 772, -316, 1231, -248, -2031, 309, 441, -900, 1352, 1464, -1164, -422, -67, -1430, 446, 1554, -165, 431, 465, -1792, -699, 870, -368, 754, 1727, -1107, -1278, 639, -741, -592, 1722, 422, -710, 610, -547, -1510, 491, 675, -78, 909, 251, -1077, -271, -305, -556, 1050, 1028, -318, -92, -511, -1166, 377, 895, -36, 473, 266, -979, -322, 161, -340, 629, 746, -561, 12, 314, -947, -202, 699, -320, 379, 1148, -803, -1049, 403, -281, -150, 1380, 228, -889, 82, -368, -809, 860, 885, -342, -13, -170, -761, 262, 515, -277, 179, 325, -404, -40, 98, -459, 103]
1031A03L50n94K69J18p60K04M45j99N20Q4j088O0N76k59M31L65r60k9O37n76J26
1052a77Q50p09m13O81l31j43Q54n59p34Q12J31m28N33k76p46P18K87o20M85J59
1072C74q77K74N30m69L07L62r02q3Q21k14j91L17m15k03N66l5k55J78q7j44R8
1093d8L5J57K9l86M8K75j68J91R5o47J74P09m68j99N55n58k86R47k86n54Q27k78
1115A64r94R16M88q55M33K31j087M48R79q25k16P68n67l54Q04j85m37N16q6n38
1135c97L99L25l46j02Q5k9Q9R8m6k18m7L34l4l33L03J49n38K12L85m94J78M41
1157D14p74l5R48n30m16P54m29m69J059k48r09Q87J01j008P48M68r92M17M93j064
1177e85L38J029q97k96Q11n05k96Q83l27o16O73J3o11L77L44l91o1J87j18q1K70
$$ y = [103, 453, -141, 128, 246, -514, -310, 135, -64, 456, 540, -548, -488, 88, -171, 260, 625, -335, -364, 273, -303, -177, 673, -36, -449, 232, -99, -242, 612, 53, -681, 131, 262, -166, 367, 91, -655, 63, 350, -270, 215, 374, -503, -229, 301, -168, 139, 501, -401, -484, 337, 123, -68, 249, -166, -369, 197, 162, -93, 85, -2, -146, -48, -13, 144, 173, -213, -165, 110, -58, 133, 228, -419, -245, 464, -4, -203, 352, -206, -492, 455, 169, -385, 442, 164, -830, 86, 574, -281, 152, 383, -704, -256, 723, -102, -318, 450, -117, -471, 333, 148, -289, 227, 141, -397, 2, 327, -19, -121, -36, -65, 24, 122, 76, -142, -189, 145, 111, -222, 81, 230, -308, -96, 289, -205, -27, 414, -360, -395, 553, 23, -393, 361, -68, -537, 522, 274, -635, 252, 353, -655, 93, 561, -431, -14, 479, -585, -247, 782, -115, -411, 400, -105, -401, 482, 155, -461, 212, 225, -386, -9, 335, -56, -117, 70, -48, -129, 141]
1198A41R7m41p6O10j94n62O29J05q65O49M72j183M66J012j382r7J559j040p00
1217h00J615p47j155J860j74j789J451N96j832R36J027j746M04J369j505j71J624
1234I63r59p96J292l78p37J079p9r79N71L77n71R7L62j58k29P2J93j99q3N77k88
1255A27p56Q55L05j177O32P64j408M20J264j633q7J899j432q42K180r38j440K212
1273I45m56k011K213M06k591J554J230k481R12J742k378J57K218j862o93K271
1289A176j045j232J812l60j331J463J65j454P29O33q50J49M69l80j23K45R7k36
1307g3j77O02q0r71Q04O66j453M68J239j763Q4K103j789r42K693j220j899K840
1325A132l11k619K568N17l231K026J742l278R46K364k928J01K791k415p73L037
$$ y = [141, 238, -203, -279, 331, 137, -425, 204, 309, -556, 93, 565, -618, -152, 860, -522, -619, 940, -100, -800, 815, 68, -1087, 773, 599, -1190, 261, 857, -975, -39, 988, -758, -354, 1015, -490, -661, 963, 4, -792, 500, 122, -615, 464, 385, -594, -23, 354, -217, -120, 242, 84, -145, -73, 120, -79, -162, 415, 127, -629, 226, 531, -646, -14, 750, -658, -238, 1026, -607, -694, 1205, -227, -1069, 1111, 173, -1267, 945, 489, -1522, 691, 1097, -1494, 60, 1290, -1191, -279, 1463, -915, -758, 1460, -402, -1095, 1176, 131, -1101, 711, 351, -980, 483, 648, -806, -77, 556, -294, -145, 324, -56, -179, 66, 163, -73, -250, 352, 272, -699, 105, 771, -682, -214, 1025, -738, -654, 1449, -340, -1282, 1411, 191, -1708, 1132, 821, -1798, 770, 1287, -1944, 82, 1824, -1454, -508, 1856, -1072, -971, 1820, -595, -1368, 1669]
1341A669j605j620K684o79j933K188O5k009J541O44j876O54J023j045J15O35n96
1358a45j51L44P8m3l12L11L78j008J90J224j119l51J586j221q41K262q70j776
1376a464K425k13k439K325N79k978K025J503l481J234K598l348R3L257k736r20
1392a540L542k055k035L507o35k577K696J59k804J933R79k408J217J373k095K10
1408e33J289j247J29J102q33j76O18m22j86J31N7N00l18l58P14p18o90J631l64
1427C26j194J946l26k553J859J047k489J702J687l336M64K537k884o5L505k201
1443B5j411L043j830k055L463m34k418K923L4l305J875R99k564J921J827k864
1459g71J18J618k106R3K324r39n44J089j181q81J111J91K4N20m09k25k54p29P40
$$ y = [1669, 64, -1556, 1128, 449, -1484, 704, 769, -1240, 301, 945, -931, -277, 746, -299, -184, 451, -145, -296, 48, 126, 83, -229, 82, 460, -548, -358, 866, -253, -604, 982, -239, -1080, 1182, 312, -1464, 961, 748, -1691, 634, 1213, -1765, 260, 1763, -1718, -484, 2114, -1234, -1141, 2116, -620, -1540, 2002, -53, -2088, 1419, 784, -1793, 903, 1062, -1742, 191, 1170, -1238, -21, 1352, -743, -533, 756, -491, -362, 740, -93, -269, 349, -73, -259, -128, -71, 429, 111, -247, 467, -251, -941, 690, 326, -868, 1078, 752, -1801, 58, 1105, -1384, 318, 2005, -1331, -867, 1670, -1214, -1279, 2226, 25, -1386, 1657, -173, -2228, 1235, 801, -1617, 1306, 1340, -1965, -90, 909, -1655, 266, 2093, -771, -653, 965, -1141, -1048, 1276, 337, -207, 882, -299, -1180, -69, 122, 146, 666, 257, 32, -222, -951, -211]
1478b11O48m92R08K1j990N23R37j395J202J782k161l21J392k309M5L295j409j228
1496g63K493j850k329L104k3k098L014K96l690J464J260k761J684K463k544o4
1512c44J645k620m60K774n95m56J601j492j598J306Jk79J624m6j210l7n39k37
1530i62J087L31J09K52j028m07L90p30P00J697r94o08Q51j667o39K407l35q36
1548c82K045j107k536J776M90j488K291P46k893P33J008k384J110K351j874j6
1564a30J571k399o58K442q77n44K206j004j774J232l70r28K015M53j422L75k28
1581d0j149Q98P27l25N89j97j085J83K8o9J048o5o67N59n19r50J056J97o04J274
1601H89j43j734Q30M40j338J281J071j733L34Q63j916L82J986j271l41J522j439
$$ y = [-211, 437, -55, 853, 874, -1116, -593, 344, -1051, 151, 1933, -228, -549, 843, -1466, -1421, 1874, 465, -763, 1730, -120, -2449, 655, 632, -1466, 1548, 1844, -1846, -382, 878, -1883, -199, 2264, -280, -344, 1301, -1319, -1779, 995, 400, -56, 1545, 53, -1545, -239, -238, -517, 1107, 1061, -149, -186, -725, -962, 125, 456, 565, 817, -211, -618, -228, -958, -258, 1439, 445, -163, 688, -979, -1618, 789, 454, -382, 1663, 556, -1980, -204, 286, -1202, 1089, 1835, -1058, -325, 683, -1701, -591, 1760, -114, -130, 1441, -958, -1616, 826, -51, -595, 1611, 607, -1167, 65, -305, -1233, 782, 1235, -187, 188, -40, -1189, -291, 436, 111, 700, 503, -582, -399, -371, -440, 608, 543, -124, 435, -84, -1034, 22, 219, -385, 889, 746, -988, -158, 282, -1056, 225, 1296, -437, -103, 760, -1156, -774, 1212, -59, -400, 1122, -317]
1618c17q18J832o73q80J811l98j455J182n6j201J285L57j225Q32L00j353N19O31
1636C73p28N95M06j105K07N04o72M15N08p38K38L11q76M29O64q07K19N17r06K79
1656a67P50r92R5R84q94j47R58q58k14J187p62n48J205n47p47J166k71p92J115
1675E21k41j141J074K79j023P83K43j171O50N44j069N21P26j061J41O51q20J95
1693a98P96q01n4P49o47k03O74m95m2P63n94l20O57m39j99P44l79k36O71n45m74
1714e72Q52j92l81P38l52o27Q20j70p00Q81R2q02O28L6q96P19L91r20N31M71r80
1735d33K82N40q32L62P53r23m9P26p00o5Q36n78j84P83n97m30Q27k54l71O71l17
1756D7m58O70j57n28O11J8m71M52j15m44N45K0n05M48K8m49M38l0m94N48Q0o47
$$ y = [-317, -1135, 697, 24, -856, 955, 557, -898, 284, 228, -973, 312, 669, -556, 276, 576, -777, -258, 373, -355, 240, 646, -459, -252, 252, -420, -5, 503, -235, 3, 314, -562, -133, 531, -276, -57, 460, -446, -167, 583, -409, -314, 670, -224, -371, 587, -271, -485, 702, -60, -608, 597, 50, -697, 469, 198, -594, 521, 280, -861, 213, 492, -531, 252, 495, -676, -26, 518, -551, -30, 696, -365, -224, 427, -393, -198, 598, -203, -257, 492, -155, -358, 316, -179, -221, 542, -52, -372, 285, -154, -353, 391, 12, -224, 447, -98, -572, 280, 88, -293, 445, 93, -534, 286, 116, -584, 297, 389, -413, 215, 251, -645, 74, 465, -455, 76, 547, -433, -151, 389, -443, -81, 672, -251, -300, 426, -274, -339, 497, -81, -265, 518, -79, -509, 318, 64, -307, 364, 47, -411, 259, 102, -426, 185, 203, -268, 184, 69, -375, 170, 190, -315, 133, 161, -288, 150, 120, -374, 174, 254, -393]
1778c93M79J50o15N02J91p87N10M44q87K72N93p95J87O89q50j3Q91p01k99Q87
1798D55m75l81Q09l99n02Q59j31o71O22J3n64N27K4n43N06J18n55L05J12l57L54
1819A26L4m28L83M0m56L34J21m01M40K3o63M52K93o35L86L23p26L06M14p90K58
1840a66P11p43o1O50o25p5P89n75k85Q16l98m54O93k27m08O98k32n24O40m3n32
1861c51M89Nm34M97m6n36N02J00n20L98N4m69M99L1o10M66K04o21M19K10o87M79
1883G9L26q62L53O07p82J45N90p99P9Q10p55j46Q75n79l66P89m11l33Q16l44n63
1904d71P20j27m73N79j06m41N51j21m87N23J8l82M02j52l86N92j08m88N93q1n73
1925d18O56n3o93Q06R7r93O68M04j027O08N44j171M19Q72j172Q9J086r67j91J079
$$ y = [-393, 86, 236, -379, 123, 314, -473, 37, 481, -406, -134, 459, -336, -149, 540, -310, -323, 568, -133, -432, 455, -20, -401, 408, 9, -493, 366, 235, -436, 186, 199, -365, 162, 186, -357, 149, 267, -288, 17, 129, -228, 126, 160, -268, 115, 155, -301, 33, 154, -247, 193, 216, -447, 5, 298, -337, 49, 372, -354, -48, 366, -424, -166, 545, -198, -259, 391, -234, -309, 480, -95, -380, 436, 38, -416, 277, 50, -358, 340, 108, -416, 224, 181, -351, 138, 143, -291, 206, 160, -376, 126, 226, -294, 104, 158, -311, 188, 219, -391, 75, 279, -342, 77, 287, -400, 79, 405, -457, -104, 503, -279, -134, 456, -343, -264, 546, -209, -355, 520, -59, -425, 364, -47, -380, 436, 92, -471, 249, 122, -351, 228, 122, -319, 232, 111, -376, 147, 165, -217, 185, 33, -353, 239, 131, -357, 236, 155, -418, 238, 185, -508, 298, 395, -598, 70, 474, -553, 55, 599, -572, -153, 719, -453, -364, 722, -245, -436, 643]
1945F43q38l67J204o00o71J081k91p17Q82j38p34Q29K2q01N87J46n74M75O1n40
1965c41M66M3m92M66K3m33M91j54n39P52k1p15P08Mq60Q45K07j086Q13M60j333
1986f96N88Q07j260M53R65j437R8J388j195k58J431j022n91J478p49q16J535m03
2004C16j164J239j2j119J034J60j158Q53M11j105M80M74q39M51M26p80K93L48
2022C08o61K97L19n13M16R3p69N34L32p93N69L25j055O35N64j265N36R06j338
2041e60K93J174j361l0J382j352l07J833r76q92J583q29j075J859k21j381J451
2058E91n7j685J242N86j370R71N62j636N24R12j153L43Q91j001R7P06r31J9Q09
2077D20n82R5N81p23J7M01p22L82P66p37J06L85j087L26J070r80J31J038j307
$$ y = [643, -195, -562, 642, 42, -629, 452, 161, -556, 326, 188, -546, 283, 305, -496, 91, 237, -337, 138, 199, -341, 125, 168, -324, 142, 165, -268, 223, 69, -470, 282, 261, -454, 254, 258, -602, 243, 450, -636, 177, 637, -696, -108, 699, -561, -108, 857, -580, -482, 906, -289, -547, 884, -138, -729, 749, 0, -816, 719, 316, -848, 391, 379, -740, 294, 454, -704, 149, 560, -545, -65, 409, -430, 21, 447, -333, -40, 308, -353, -56, 263, -250, 166, 259, -510, 24, 356, -437, 132, 457, -598, 37, 601, -664, -128, 778, -560, -267, 907, -454, -484, 898, -454, -761, 1072, 96, -796, 787, -42, -1117, 742, 521, -860, 591, 534, -1151, 91, 677, -693, 278, 840, -796, -272, 640, -513, -170, 721, -280, -183, 523, -408, -389, 420, -162, -67, 514, -209, -192, 209, -513, -131, 635, -102, 4, 389, -698, -372, 698, -282, -151, 887, -420]
2096d20k56J387j027l24J711j011r86J740o49j311J747j67j443J723J48k034J158
2113a4O75j670J139J118j814L00R84j612L01J670j047l26R92j123l68J333m85
2130E3l62R40n44n77O78l79j62P93l92j98N95o58k27P10n87J07J117r10n54R78
2150D21q13l66J647n99r72J414o50j344J736J52j476J395J94j920J240Q63j886
2167i64Q31J255j777L49J379j732p7J710j198l75J655j004r47J337m70o85J478
2184G65k64j145P99n1p25Q90J29o76N16j26o06N91J7l51O10l00n26P94k72o52
2204e83R33j67p23J057k00j189J127K12j272J080M89j579P81P90j625O73J305
2221A109j658L1J441j381k09J708j182o91J676p59r81J537l16j131J253q3j167
$$ y = [-420, -676, 711, -316, -640, 1071, 60, -926, 814, 165, -1146, 601, 434, -1009, 714, 862, -1172, -14, 661, -1009, 130, 1248, -566, -266, 718, -894, -593, 1077, 30, -296, 696, -427, -795, 538, 53, -309, 631, 87, -490, 188, -191, -353, 440, 48, -150, 445, -213, -440, 270, -317, -210, 907, -3, -557, 421, -392, -758, 889, 290, -682, 732, 82, -1262, 474, 626, -850, 545, 739, -1181, 59, 922, -964, -133, 1122, -655, -306, 1073, -659, -736, 974, -224, -599, 1056, 52, -895, 442, -28, -713, 765, 501, -644, 155, 104, -621, 269, 398, -278, 238, 112, -494, 97, 114, -237, 373, 73, -453, 341, 69, -583, 350, 183, -540, 517, 317, -872, 255, 467, -805, 275, 764, -815, -34, 756, -869, -196, 1109, -549, -518, 923, -458, -667, 1041, -141, -832, 844, 85, -896, 641, 325, -806, 447, 364, -803]
2238h03J108K34j195P27L73r59N82L94q98M01M55p71K79L94n54K70K22o26L73
2257FL03o08L67K20p43N05L53r04N12N67j083K96Q08j049K31R95j171j56J284
2276G33q84m04J284p71p11J391m92r23J347k01j205J106J96j145R50L17j346O91
2294f7P07j082L57O56r85J75P60p65N9O54o55q1O22m27j9M31o19kO72l86p4L68
2316B99o47qP48m09o4N77p25l19Q09l17j07Q51p03o81R34j66n17R70k73r15R39
2337B76P1r76P70K99j041O46N93j006K81M83j030L34J047o78j71M54q93m7J094
2356E06l09k64N68o79m74P93m1k00N82l95n35N55l4l06M06j61k59O22j61n39L36
2377A1j89k43Q37O6n93K65l44o60R06N45n24K56k22r90N79P49n28K89L19r72O8
$$ y = [-803, 305, 539, -656, 71, 444, -515, 67, 461, -437, -36, 419, -352, -73, 321, -233, 37, 259, -367, 6, 309, -299, 68, 288, -455, 50, 403, -501, 11, 578, -505, -209, 599, -450, -219, 776, -395, -551, 733, -151, -555, 729, -42, -753, 638, 146, -777, 570, 369, -836, 270, 466, -679, 271, 588, -758, -67, 640, -442, -85, 571, -414, -239, 521, -244, -185, 469, -186, -267, 355, -72, -91, 340, -279, -281, 391, 5, -69, 299, -348, -356, 392, -17, -81, 496, -229, -548, 261, -56, -163, 688, -15, -696, 238, 72, -445, 525, 252, -663, 276, 347, -629, 141, 440, -601, 45, 638, -368, -87, 396, -634, -300, 747, 69, -102, 352, -541, -588, 506, 197, -67, 501, -178, -652, 141, 100, -100, 482, 87, -448, 107, 73, -233, 173, 12, -247, 375, 214, -325, 11, -178, -421, 416, 482, -111, 154, -190, -850, 56, 601, 77, 333, 111, -879, -300, 449, -79, 210, 529, -443, -375]
2398c75O75n68J01P11o53j60P62n23m46N86k57q4Q99k65p97K58j45j82Q85J78
2418F00o05P6k97m66P23M35l38J45k38n84M76K97l86K86J46m84K81J76o09J87
2438a79L46l50L29M02o84j78K46l68M20P72n59m38K08m32J16Q70k27l93L27m22
2458a94l38O91N3l35L51j65l85M54Km47L13J35k19L62q6n57K22J78k00M24J38
2479C97n58L9N8k98M70L73n17k5J21l97K69M16m41J4L74m57n1M65l51j09M91k95
2501a2k10N17k52l96M31J1k42L98r9m87L27J06k72K68R9l36J52N2k73K31J70k72
2523h9P4N9j93J83N6k31J96Q5k86J38N6k12K74R1m30J82K22l51J94K55m60O8L69
2546B50m24L2N17m14k28M67k59j51N57k79m54M96N0l63L86k4n02L04K48l43K07
$$ y = [-375, 300, -268, -167, 544, -109, -269, 493, -30, -476, 110, -147, -231, 668, 403, -394, -136, -281, -463, 422, 600, -5, 71, -226, -692, 31, 466, 128, 273, 35, -549, -73, 224, -162, 124, 270, -214, 67, 243, -366, -179, 167, -183, 146, 548, -136, -314, -68, -436, -16, 756, 197, -241, -33, -465, -349, 521, 294, -99, 228, -194, -532, 159, 212, -123, 228, 63, -322, 132, 134, -313, 0, 135, -84, 278, 192, -365, -143, 35, -165, 259, 397, -161, -122, -64, -362, 108, 481, -36, -61, 60, -337, -68, 348, -93, -79, 295, -162, -213, 252, -99, -208, 283, -12, -222, 295, 43, -353, 78, 89, -153, 245, 146, -341, -14, 92, -180, 88, 187, -149, 3, 55, -218, 13, 183, -89, -15, 44, -149, 34, 90, -141, 55, 140, -146, -8, 48, -164, 110, 201, -229, -47, 175, -176, 18, 273, -187, -119, 250, -174, -142, 375, -39, -267, 200, -59, -210, 347, 68, -386, 110, 160, -203, 183, 159, -343, -39, 209, -134, 73]
2567G3J79m68j4L34q3Q7Q4l49r7K46R0O8n0k29OQ0KK06k2l10J00O6j26L42M2n39
2593b82R4L24k01K20J88o51l2N48k31J4M47n40l77N72j1j64N14l17o68M90K83
2614B20k86L13n4o55K84M54k80R2J35n18J1M53n2j0M3l77j22M06J73l0j59l05
2636b64K9K48J27J07j62m03J22K21m7K87J2o27M4M35j41J90K10p23j42P21j34
2657A10j40M25n13m61P24J24m05M52j83p57N28N03m12J58M1p11K24P37k98j62
2677a6J59m33k7N59j4j80K8k86j04L91J85q5j59l06M3L46P7K5j24m35J40L86j31
2700C9R8J08n86k6N94j62l5L38o30l02Q13Nl62M08l37n95P72K81o12L12R8p88
2722e69L96O77n29l7L13o70O9Q36k80l58K67l14j41O26j0l76J30j31j97L95J58
$$ y = [73, 252, -216, -230, 104, 21, 108, 192, -157, -254, -8, 82, 150, 100, -129, -123, -43, -41, 165, 143, -167, -67, -1, -127, 215, 257, -282, -188, 136, -65, 155, 343, -308, -340, 208, -23, -9, 438, -102, -479, 93, 82, -82, 432, 115, -553, -63, 220, -66, 247, 193, -462, -178, 276, -4, 88, 223, -295, -284, 169, 117, 107, 150, -227, -349, 57, 230, 200, 41, -264, -235, 13, 140, 247, 85, -318, -196, 25, -22, 265, 277, -350, -306, 129, -12, 178, 388, -335, -477, 244, 110, -30, 395, -118, -579, 145, 269, -136, 316, 133, -624, -96, 407, -5, 153, 194, -517, -293, 444, 146, -16, 143, -290, -317, 242, 228, 48, 76, -210, -314, 77, 262, 177, 18, -288, -245, 101, 178, 203, 79, -356, -216, 170, 39, 137, 245, -341, -367, 227, 65, 30, 368, -262, -564, 249, 254, -108, 300, -37, -632, 140, 421, -191, 121, 219, -569, -173, 504, -25, -62, 251, -419, -350, 486, 206, -152, 115, -199, -340, 286, 276, -100, 30, -101, -298, 97, 255]
2743B55j97n6j76m3L07R8p2r4l16J13M01j70n2J89m34r5O34j79k92M84l56n50
2765f01Q08J91o70L81O4p59N79N65p66Q0M40o97J38P63n37k07N45n14k13Q48k14
2786B24n33M58j49l91O34R9n99K20J68l51K31K26k73j4L6j09J82M9j05P1j94p8
2808a98M01p5l18L05q9l14M52J4m47L61Q5n34L96K64n82K74L00o88L00N95p76
2829b74j2P55o29k22Q65m99m90Q76j83o95O89R6o57M43J92n53L24K18m90K18K71
2850B43m06J51J78l77K25K45m13L3K65k33Q2J91l02M7J17j51K20P6l56J67M4m16
2872c70M90L87p31M6M37o21J61Q09o33l68O86l68l46P88j80n56N21r6m09O69o8
2893B48p23M84J79m68N80J13r60K75N59m59K54M92p51k95M83q2J18L93l56l63
$$ y = [255, 58, 2, -174, -217, 90, 188, 116, 22, -294, -181, 220, 50, -2, 187, -247, -342, 292, 113, -179, 305, -51, -601, 207, 398, -272, 109, 173, -586, -7, 558, -208, -128, 312, -385, -247, 516, -21, -228, 317, -197, -410, 438, 224, -309, 149, 0, -391, 243, 342, -257, -37, 131, -220, 11, 237, -36, -50, -14, -123, 59, 108, 3, 74, -120, -198, 203, 128, -190, 115, 26, -288, 164, 178, -269, 92, 177, -357, 39, 303, -279, -5, 295, -393, -93, 502, -274, -286, 469, -160, -382, 483, -16, -506, 370, 187, -508, 181, 277, -380, 63, 255, -298, 26, 244, -246, -28, 243, -163, -12, 166, -211, 14, 259, -154, -121, 144, -89, -7, 184, -118, -71, 46, -105, 115, 191, -165, 2, 46, -370, 120, 507, -224, -178, 259, -362, -201, 608, -25, -393, 293, -75, -421, 367, 187, -369, 152, 56, -353, 316, 248, -475, 9, 188, -280, 300, 413, -547, -272, 287, -172, 82, 574, -177, -472, 11, -71, 47, 440, 84, -279]
2913b79J36j4K81J97m51PK80l27J56L72n67j41N86j92m1M37n71m70N56R6R6N08
2935F55o70o69N49P0o3Q42l50r92M90J96n29P71L54j033J04N73m94J15M10o30
2955c01pO68j89j25P8o12M2P46n7J5J79q34l76P68K06O3L47o36o55M49K75N7L22
2978D23l44l38K98j16p9M39l54l13P10j4n02L75k66p30Q57O48n37K4j61q72M45
2999d07Q72k01R2k5r24M1O96j59K43L55q71k10P48k81k16N57l39k88P07j03n89
3020c02J75n1r5O14J07l74q5m28j65Q21K56k83J06n00n57P27L98l61K58n3o46
3041d38L10L36l60K21J47m53K89L03n54M5K20m52M40O52p11l14L87m65R2R23k98
3062C20n16K79l06k88P38J25m07J88k14k93M98L3l68L41k6l27M03k8n10L14K01
$$ y = [-279, -143, -157, 124, 321, -130, -123, 157, -170, -14, 358, -209, -350, 236, 44, 3, 440, -131, -601, -45, 51, 147, 655, -15, -684, -135, -65, -128, 714, 364, -628, -138, 58, -471, 300, 654, -379, -275, 298, -196, -81, 329, -301, -308, 360, 171, 46, 124, -488, -446, 300, 243, 258, 437, -397, -773, -5, 201, 264, 611, -25, -680, -231, 44, 101, 423, 79, -259, 39, -77, -156, 283, -71, -384, 326, 312, -190, 185, -81, -811, 46, 694, 157, 181, 20, -852, -407, 465, 264, 356, 331, -593, -552, 144, -15, 228, 583, -288, -498, 250, -31, -247, 310, -29, -317, 390, 287, -302, -127, -178, -273, 341, 448, 74, -11, -439, -604, 217, 473, 190, 296, -204, -761, -34, 364, 3, 261, 208, -438, -128, 208, -152, 69, 216, -237, 52, 355, -199, -154, 66, -386, 54, 706, -5, -319, 68, -397, -305, 618, 320, -196, 83, -223, -511, 227, 352, -55, 133, -81, -374, 124, 157, -211, 130, 104, -223, 180, 152, -358, -44, 157]
3083A57l30L25J55n12L5J73j88L37K01m49NJ07l01L52K93n38J20L02n03J04N26
3104C71m70j12N31l88j61N47l22l16N05j02k59M01k24l45N24l8l55L79n6m60M25
3125G5J52m69L00J64n12J85L45l13M1J89l45J01K72k52K7J27k29J68J82l67P7
3146h2K44l41J34L57l83p9K73l06L7N15k81k70K67k57j7N38k62k96L94k25k90
3167c30N80p7m64M22L6m96M50K04o20J60L20l06J89K57n42m5L57j51J19K43m03
3188i7j20K32j54J43L53l48k30K26j15N3L21k57k14K51o5rK21k56j38K99j28k0
3210e2L62l07l36L81l3j22M57k03n62L51J77k46L37M3n27J71K36k91K68J85m99
3231b10M6L12k61J52K78n19q0M81j56r7K85l29k13M19Kj47K22k00k41K51M6j0
$$ y = [157, -173, 152, 307, -205, -170, 3, -185, 152, 353, -96, -91, 16, -285, 67, 360, -178, -58, 244, -259, -155, 371, -99, -211, 320, -68, -229, 318, -4, -320, 185, 83, -176, 225, 1, -344, 180, 142, -213, 166, 110, -350, 75, 227, -242, 58, 222, -290, -105, 240, -73, -32, 157, -188, -87, 185, -67, -40, 87, -142, 26, 208, -159, -82, 162, -179, -45, 312, -71, -150, 123, -183, -146, 369, 88, -182, 85, -172, -189, 349, 87, -209, 185, -40, -330, 250, 173, -291, 131, 167, -329, 121, 325, -295, -135, 185, -121, 68, 325, -217, -262, 95, -56, 63, 306, -97, -217, 15, -139, 4, 357, 9, -221, 5, -110, -57, 264, 7, -207, 44, -21, -30, 191, -65, -203, 96, -32, -52, 310, 3, -333, 48, 15, -107, 350, 147, -415, -64, 113, -133, 204, 247, -280, -109, 127, -164, 104, 289, -210, -164, 148, -113, 39, 317, -202, -282, 199, 43, -54, 231, -98, -311, 108, 110, -37, 185, -15, -256, -5, 41, 31]
3253C1J87k57k44K96K9n9K32k31k87L33O4j95K70o8l81K63J15k04K63Mm52K06
3275h5K80k89J80J04m66J31L90k91pK76l49r8L91j12q8K29k69j87L58Jj03J55
3297A51k41j52L42k0j42K26j53k48K91K6j77K34o6l02K20J31j89J57m0l05K67
3318A0J66k77J49N5l53J95K67l01R2J88m06L0L80j86m4K10l16n7L71j40j26K57
3340A64k23j42L38q9j80L03j18k84K99N2j98J74n3k44K24J15j76P8j8j74J87N2
3362H7j75J80nk79J81J42k27J65P1l72J61K76k81M5J89l14M5L04k68l4L03l04
3384a10r1L91j68j61L18k00k53M20J3l18K17Kk67K60Q9k61J48O9k61J48J25j75
3406f5R8M6k42J46J61j78M6N6k19J52J36j97N4J12k27O2J71j83Q5J16k84N6K83
$$ y = [31, 218, -39, -283, 13, 42, -17, 215, -16, -303, 30, 94, -101, 169, 101, -280, -17, 98, -106, 157, 161, -291, -85, 195, -94, 86, 190, -276, -145, 245, -46, -53, 223, -126, -224, 167, 55, -33, 196, -73, -260, 98, 99, -4, 151, -90, -242, 100, 80, -62, 164, 11, -237, 54, 80, -97, 137, 71, -231, -11, 120, -69, 88, 48, -257, 10, 176, -101, 48, 103, -250, -55, 212, -89, 3, 191, -215, -185, 195, 9, -35, 175, -141, -198, 173, 33, -93, 164, -59, -201, 137, 48, -132, 171, 53, -231, 68, 120, -78, 96, 43, -201, 23, 138, -38, 40, 22, -152, 35, 87, -88, 92, 87, -192, -11, 131, -96, 69, 140, -232, -71, 205, -76, -31, 158, -156, -111, 193, -75, -109, 194, -110, -201, 190, 22, -139, 179, -21, -274, 146, 159, -159, 58, 60, -207, 53, 142, -119, 29, 98, -163, -15, 110, -65, 33, 79, -163, -17, 144, -34, 12, 68, -151, 1, 137, -60, -6, 106, -121, -59, 112, -71, 14, 130, -154, -98, 185]
3429A85k37k0K26k82j8L60k35j36L20j89j97L58p9k51L55r2l47L59J06l57J86
3450A5J17l33K08J94l19N3K09k48K0K19j81J3J23j87LK22j31m7J18j58L8J85j48
3473a5k8J30j55J6J53j67L7J85k58k7K78j83p0K74k27j25L86j45k77L37l0k99
3495b10L20K5l46K56Q1l49K34J94l37R9J32k96J59K74l28j2K67k66l0K96j76j19
3517a32K48j08j62K22k7j13J04o0jJ34j15o2J20j23L7K14j88j00K24j51j30L07
3539A38n3j84K13j30j91L03K2k66K56k0l03K98M2l83K88K24m47J17L09m04j4L94
3561B09k73m8L45k36k42K80l3o0K27j29j71J64p8r6K71o1j51J87r9j92K30K7j72
3584a01J35M1j13Q6q8r8K02j9o9J82j56k23K90k3k47L63R5m54J51J82l38J94K76
$$ y = [185, -52, -72, 154, -128, -146, 214, -21, -157, 163, -26, -223, 135, 56, -195, 160, 68, -279, 80, 186, -171, 15, 132, -201, 7, 201, -118, -65, 144, -104, -84, 135, -46, -33, 90, -97, -94, 128, -3, -50, 68, -90, -52, 133, -15, -43, 87, -68, -52, 101, -66, -29, 156, -102, -129, 149, -34, -104, 170, -57, -182, 204, 59, -218, 119, 89, -210, 110, 135, -211, 45, 126, -223, 11, 205, -132, -33, 99, -197, -38, 236, -92, -104, 163, -103, -133, 163, -13, -132, 116, 8, -154, 68, 41, -72, 32, -28, -29, 105, -10, -72, 48, -75, -38, 176, -12, -112, 112, -39, -169, 138, 85, -99, 114, -16, -207, 96, 118, -148, 108, 88, -215, 83, 125, -258, 30, 254, -193, -76, 233, -171, -185, 209, -64, -112, 233, -3, -245, 35, 2, -58, 169, 40, -131, 33, -45, -141, 130, 69, -82, 105, 6, -186, 44, 71, -101, 34, 75, -38, 48, -40, -138, 64, 45, -24, 158, 2, -221, 69, 46, -201, 162, 257, -197, -46, 136, -202, -8, 268]
3607B68l42j5K73k94k6K76j89j0K92k81j29L41k18j59M05r8k44K83r2l38K99J73
3629A75k48R3O0j91M7O7n5J23lj33J02o1j30K48j3k35K08R5l11J45J14k45J64
3652A6J64k67N2J29k24Q0J91k45J01K25l89ML89k70j05L83k27k37M09j09l06L19
3674H3O9k78J62N0k29J57N0j73J55L3j96J38J7j93K28P2k95R9J76k16O0J49j92
3697g4L5J31j66M0J02j56R9R0k39J42J70l18M8L11k80n1L13k52j41L83j14k53
3719a80K88m2k24K24j2j61K10n0k33K36M0k12K05Ol04K38J41k94R0J69k37M3J62
3742A03j58L2J13j69N2J04j34P8N7k35J26K11k69K3K14k57j7L03j89j27K79j50
3764a0j77K96m9j42J81j38j41K98k5k17K11n1k25K57N2k70J92J06l14J14K02j98
$$ y = [268, -74, -89, 184, -110, -136, 140, -49, -59, 233, -48, -177, 164, -54, -213, 192, 94, -150, 133, 41, -297, 2, 175, -73, 20, 80, -111, -64, 3, -52, 71, 68, -65, 37, -24, -154, 94, 81, -154, 54, 149, -162, -17, 97, -148, 16, 180, -87, -35, 94, -130, -50, 141, -104, -3, 222, -167, -163, 226, -44, -149, 234, 7, -230, 179, 70, -236, 83, 152, -126, 36, 86, -143, 14, 64, -109, 46, 79, -117, 21, 38, -155, 73, 145, -150, -51, 125, -91, -31, 118, -74, -39, 92, -74, -34, 68, -88, 11, 101, -138, 4, 174, -144, -96, 215, -65, -116, 197, -55, -196, 187, 73, -180, 108, 66, -158, 66, 54, -107, 103, 53, -180, 56, 96, -116, 89, 95, -209, 29, 170, -124, -34, 135, -102, -59, 103, -55, -23, 90, -79, -27, 77, -57, 21, 78, -157, -31, 180, -89, -66, 148, -109, -126, 177, -12, -139, 140, -10, -187, 109, 60, -82, 99, -39, -180, 118, 93, -124, 87, 36, -189, 68, 120, -150, 42, 148, -166, -52, 150, -48]
3786d8K7J20j90N8J60j53%O3j39J28J19k04M3J17k62M7K85j68l9J66k49q5L26
3809A22o4j05J70j61j26K32o8j22K57r0k21K78m1k51K47J7k65K59J58l43L1J18
3831C2j79J51K17k00o9M3j61R0K20q9J8J1k71K9K89r3l9J33j81o8K25j33p9J80
3855G6o7n3J70j04j35J06j05jL43p0k39P7j48j08M12Q2k80Q1o2k49K28K04j59
3878aO9%k55J22J88j92L7J27j94J11J96k91q5K01r2N3K89k24k32R7m5M1L21l9
3902B02k44l6j01N4L00l0j66O1j08p4K41pj68J23k2j23J92K4k49O2M1k0K31%l23
3927a40mQ9o7K71J06l48m1J13j68J79K89k68j53J26j10O3K78j97j93K00l7j7J92
3950A63j74j98K18M0p4J93q1l14J30J33l4J74l4l13J0J60M0J13n6k21M1P6k4J44
$$ y = [-48, -21, 99, -91, -33, 127, -26, -26, 37, -102, 26, 145, -59, -16, 101, -161, -114, 171, 3, -36, 130, -119, -204, 122, 58, -47, 123, -38, -164, 68, 0, -122, 135, 45, -176, 102, 61, -190, 57, 74, -191, 68, 226, -117, -86, 32, -147, 4, 221, 21, -48, -5, -166, -76, 144, 55, 73, 84, -187, -158, 131, 38, -1, 132, -49, -117, 108, -25, -104, 76, 9, -44, 126, 22, -113, -7, -112, -113, 230, 160, -79, -2, -150, -258, 154, 236, -44, 37, -25, -274, -46, 158, -1, 68, 68, -187, -65, 123, -69, -32, 95, -99, 12, 208, -83, -168, 33, -59, -6, 283, 59, -173, -76, -121, -80, 241, 202, -42, -78, -179, -125, 175, 145, -21, 40, -68, -142, 99, 92, -76, 47, 25, -98, 94, 118, -131, -69, -28, -48, 183, 183, -140, -144, -55, -122, 149, 255, -93, -134, -21, -189, -10, 279, 11, -142, -16, -126, -63, 215, 18, -175, 25, -12, -29, 163, -11, -209, 9, 49, -25, 168, 87, -227, -97, 36, 2, 176, 142, -171, -161, -1, 39, 152, 96, -125, -84, -8, -32, 112]
3974A12pk39P1J14r1J34M3k84K4J86m7O7K5k69NK43n8NJ07k51p8K67m8o7K01j99
4000c4k31L09O6j43J24q9k42K28J64j75K6Pj64J17J55j37L8J6j73Q8J91j11l8
4023hPj23Q4J85r3q2k0o0J05J34q7l0qj51J02J87j33l2R1k05PL11j29j65J45o9
4049c7p6K68p6k61J58M1j16K11J8k74O5R5j21J84J11k87n2J63o7R2J32k21r1J53
4073A2j5K8O3j34m4R3j4N9O7j79n9J18MQ3P2k13j27J83M0J8R4k00j29J87J7oJ35
4100A53j50j96J97N3r7J87r9l06K18J84j46N6J0k82J11K76j44k9O8k22pK83k9
4123H9r1N5j79n9K68L7j21Jj13l8K17N3j07k0r1lJ52K9l1k4j58jK27K8r8K3j66
4150a21p3L10N5k12O6o8j59K51J41k30M1K1k23J68K59k06q9P6j65R9K89j68j94
$$ y = [112, 105, -134, -63, 51, -40, 94, 137, -147, -123, 63, 16, 83, 108, -161, -156, 87, 29, 34, 141, -110, -188, 79, 31, -36, 165, -34, -265, 44, 110, -33, 91, 2, -240, -12, 152, -23, 3, 10, -154, -37, 118, -19, 19, 35, -138, -50, 141, 30, -8, -1, -124, -40, 145, 52, -30, -50, -110, -5, 129, 42, 12, 4, -147, -45, 142, 9, -23, 68, -137, -130, 181, 52, -113, 32, -37, -113, 155, 79, -182, -24, 17, -99, 112, 130, -144, -79, 16, -105, 79, 190, -97, -149, 14, -53, 39, 171, -50, -141, 12, -3, 25, 88, -46, -90, 3, -11, 48, 115, -64, -123, -5, -1, 82, 154, -59, -186, -3, 37, 55, 149, -51, -180, 7, 24, 18, 153, 3, -193, 4, 57, -40, 147, 48, -258, -40, 144, -2, 54, 64, -218, -107, 169, 25, -4, 64, -158, -165, 118, 89, -2, 53, -126, -185, 83, 120, -1, 0, -113, -151, 66, 119, 12, -8, -99, -102, 50, 79, 48, 24, -134, -135, 92, 120, 22, 45, -121, -194, 116, 171, -41, 25, -43, -202, 49, 190, -40, 1, 22, -201, -33, 226, 20, -69, 7, -158, -59, 230, 62, -132]
4173a32J22o8%K52r4j91R9m9l6K21j8j85L0j6j7J92J9k08J5K3j6J47Pj57KL1l6
4200f3J31K3j32J8j9m7J93J9j90K2N1j13J65J09k58J3J44j56P6K05k26q0J78j10
4224d7l9K67j55j89J87Pj18J90l4k21J28Q0j37Q5P2j58L3P1q5P5M8r7JJ6k2Q3
4250D1oj22R2L0j14Q5O1j43O4P0j65Q8J29j65NJ19j37K6J66j60n8J88j07q1K04
4275A10q5j16J63o7j34K03J5j75R3L0j19J23M7j55O4L7j14Q7P7j30M0L8j35R4
4299iJ28j26m3N5p8N5J14q7n6M1n0M3R4r6JL4j40O7J73j14o5R5j19jK32j11j48
4326a11J47m6q6J98j6k02J22J5j33J78O2k16J9P8q5J36J02k25l7J13n0M9R3j10
4350eo6P9l4K7P8q5m4L9j7O4N9j60l2J16j7K2R1j82r5J81j1oJ28j10j54J00J9
$$ y = [-132, -10, -78, -78, 174, 80, -111, -12, -61, -97, 124, 106, -79, -49, -65, -82, 110, 129, -79, -64, -41, -57, 90, 97, -60, -58, -27, -63, 68, 91, -41, -23, -42, -89, 104, 123, -67, -45, 6, -107, 58, 167, -91, -78, 66, -90, -14, 191, -35, -115, 63, -47, -86, 181, 26, -163, 24, 31, -87, 103, 69, -152, -24, 56, -81, 4, 76, -82, -49, 22, -63, 12, 60, -37, -36, -20, -42, 41, 35, -87, 5, 35, -79, 6, 67, -76, -12, 58, -107, -19, 110, -55, -50, 69, -68, -42, 124, -36, -94, 94, -13, -94, 110, 25, -91, 72, 5, -129, 74, 89, -86, 7, 37, -82, 41, 88, -67, -3, 34, -80, 7, 84, -46, -6, 32, -103, -9, 119, -7, -50, 5, -73, -18, 96, 9, -47, -6, -56, -13, 81, -15, -14, 20, -120, -53, 120, 6, -59, 36, -83, -84, 148, 37, -111, 36, -10, -96, 102, 86, -116, 6, 21, -112, 66, 128, -88, -69, 9, -76, 60, 162, -63, -100, 13, -37, 12, 105, -5, -71, 8, -26, 1, 79, -6, -50, -11, -28, 36, 95, -65, -97, 19, 2, 24, 115, -67, -162, 19, 8, 2, 130, 20, -134, -34, -15]
4377a5rJ59q7j81J13N2q6J24k2j80J40J13j51K6L7j55P5J70p4l4L3j82MK20Qm0
4403E8pj53l8J95J1n5N5r1m8J04ko8N1l5j3J02j2r5op2N3K08l1j33j3r4k3K67
4431A15L3j56L4o2j58J78J44j41K1L0j63J03J32j75k6J31m6M3J07j93j32J53L1
4454CM3J39j35k11N1L4Q0J99n7k26j7J6N3J37k5j13J0J4j4O2m7q4P6N1nP2r1j93
4482a78O8J02Q1J24j12k65J4J37L3J43J3k65l0J18m6Q6J37k05q3J71l4l0R9j43
4506f5q5K25O4j27J4j11j05J89J68p2l3j14j43J17J82J2j0j13j55P4J59J3k2p4
4530a2r0Q0R2m7lm2q3J08J10p5l0m4j42J21K15n7p7n2j55P6K39l3j06J3j16j1
4556a21J95J2r6K2p4o2J94O2j74Kkm9J71P0j84n0N9l1J16Q9j51p6L1jP8J08j09
$$ y = [-15, -24, 135, 48, -133, -20, 32, -54, 70, 48, -132, 8, 121, -30, -4, 33, -122, -47, 123, 49, 15, 48, -134, -130, 90, 98, 58, 51, -102, -140, 55, 66, 11, 66, -25, -73, 31, 29, -39, 12, -23, -36, 66, 54, -41, -47, -119, -66, 142, 111, -22, -35, -129, -152, 115, 148, -8, 26, -36, -194, -16, 128, -13, 8, 38, -125, -22, 110, -65, -91, 40, -6, 37, 144, -49, -181, -28, 3, 46, 185, 50, -161, -110, -76, 4, 203, 146, -80, -97, -81, -28, 109, 84, -29, -19, -5, -19, 43, -4, -88, -12, 39, 34, 106, 15, -178, -110, -8, 73, 197, 85, -180, -166, -29, 4, 147, 160, -105, -135, -17, -63, 23, 160, -45, -128, 43, 9, -21, 78, -65, -150, 75, 139, 12, 26, -85, -190, -1, 167, 95, 62, -52, -195, -78, 104, 116, 106, -7, -162, -88, 71, 84, 62, -12, -102, -22, 70, 23, 20, -22, -105, 3, 113, 38, 8, -36, -178, -57, 158, 101, 24, -28, -183, -107, 132, 99, -7, 6, -110, -121, 74, 86, -10, 12, -62, -124, 70, 132, -42, -40, -42, -91, 80, 150, -34, -84, -25, -56, 60, 149, -2, -78, -47, -48, 30, 138, 29]
4583B9r3j9J9J05Q1r6q8J4LQ7Q1j21o3L1l5P9J06r8q8N3l5K1J50r6j62R5N9l1
4611a2J02n6j68P0R1l4P8Rj85MQ0NP1N3j78m1J04kL7L4j22j2R2k0j1L3o8j7R8
4640C5j9LK3j04l1J12L6%Qj22n7J25M4l2L5o0q8Q5K7m2P0k5r3P7L8q2O6nj16R9
4670GR6j23pM0q7M8J24r5k7N2r1k3J47k5m4K8n9l6J07Lp2M6j1k2O2k7n8N5Rl2
4700a5M9qo9M6k5j6R7rr2M3qm9J11Mj08N5L8j08O4O1r6J1Q4j08J6J07r6k4O6m4
4730b3pR2q0m6J13l6n6P6l0o5R6k4o8Q1Kp9N6J0n6O6Lq6P4J1o7M1J3m7O3Pr7M7
4762a6N8o1J3L9p5M0M7p6K5N7o9rP2o1MO4q3j7J07m7m6O0n1l8J24l1o6N8k2p5
4792g5J05J2o9N3k1j02R3P7r7K0kp0P5O2r4J9M0p2L7O3q2KL3o6L3R3p0k7K1n5
$$ y = [29, -64, -83, -64, 41, 122, 26, -62, -48, -45, 42, 123, 2, -61, -30, -65, 14, 120, 22, -66, -13, -48, -27, 123, 27, -135, -40, 19, -12, 90, 34, -134, -64, 27, -7, 71, 80, -105, -101, -21, -16, 55, 108, -70, -111, -7, -9, 28, 62, -60, -72, 20, 0, -11, 22, -46, -63, 35, 16, 19, 42, -62, -93, 19, 55, 55, 63, -59, -116, 9, 53, 21, 56, -4, -92, -7, 20, -22, 48, 23, -70, 7, 45, -37, 29, 24, -92, 7, 103, -20, -27, 13, -74, -26, 98, 3, -24, 28, -63, -86, 61, 36, -8, 20, -39, -75, 32, 35, -37, 9, -2, -24, 38, 11, -47, 8, 17, -15, 34, 26, -43, 3, -22, -38, 59, 50, -42, 1, -7, -56, 55, 59, -49, 6, 44, -64, 0, 61, -35, -24, 60, -48, -32, 75, -21, -45, 21, -23, -30, 62, -18, -64, 49, 13, -43, 33, 3, -62, 34, 10, -58, 23, 25, -54, 2, 12, -44, 22, 25, -61, 13, 24, -43, -2, 11, -36, 27, 34, -63, -16, 42, -19, -6, 33, -42, -2, 45, -31, -6, 51, -18, -27, 45, -16, -12, 52, -31, -48, 59, 12, -34, 26, -25, -63, 61, 30, -36, 22, 0, -75, 30, 42, -27, 26, 5, -97, -4, 73, -24, -4, -6, -76, -1, 61, -33, -14, 26, -46, -9, 54, -28, -26, 7, -59, -26, 67, -3, -30, -9, -64]
4822f4N6J03r3m3L5k0J8Q9n7q2P8m0k2J07j7q8L7j6k0J08pj24K7K4k4Q7Oj32K8
4851d6N9n9Q1L4j00j9K8k0R3K7j25k3N7k0M9O1j34k6Q9j9J0O4q9n1P9j4K3P3q7
4880eq7P5L0KN4q3q4R1N1k9L7n6p8P5L9k8N3l6j15N8R2l5L4j5j35N0J05l1moq8
4911f9RJ13j4k8K4j06JJ20j0l2J2q7j6J24J0m6Jp3oJ12Mn2K2n0l3J09K1p5L4n5
4941c6o0J45N0j18Loo0J03Q4j28oJ9n3O5J07q6n8K7o2N2J22p8o3K9n5O2R1o6p0
4970d6M6k4KJ03n8p8L5k4QJ05j0j15K3J0qJ14k3j27J3N3j7O4%j06PM7l1Q5Qr5
5000c9j2N2k1O1K0j42KR1j7M4K4j18j1R2l6K1P6j01n3N6RQP7o6r8Q5J3j2M2n4
5030gn6O9N0p4L9j7o9N2M9k3K5m4q8N0R6l2Qj7r5M7Q9n2JK8p9LR1l8k5L9o6JQ7
$$ y = [-64, -8, 95, 2, -41, -6, -26, -8, 81, 24, -58, 20, -20, -42, 65, 48, -40, -3, -19, -39, 69, 62, -62, -35, -11, -35, 52, 58, -74, -46, 13, -46, 35, 69, -31, -50, -22, -42, 51, 78, -47, -70, -13, -33, 16, 77, -57, -83, 6, -13, -3, 61, -28, -79, 0, -14, 9, 82, -5, -92, -17, 13, 15, 69, -14, -98, -7, 44, 15, 52, -4, -82, -7, 32, 4, 57, 21, -94, -36, 56, 21, 55, 40, -95, -45, 60, 29, 25, 19, -69, -60, 53, 39, 11, 35, -71, -70, 50, 40, 8, 20, -67, -83, 41, 51, 5, 6, -67, -73, 39, 43, -9, 13, -37, -70, 39, 60, -15, 19, -36, -96, 49, 99, -19, -16, -22, -82, 21, 105, -23, -29, -10, -63, 2, 109, 23, -35, -8, -70, -18, 104, 26, -37, -8, -63, -1, 90, 24, -46, 0, -24, -22, 81, 23, -55, -20, -44, -36, 69, 59, -56, -33, -23, -31, 83, 60, -67, -54, -1, -18, 46, 46, -60, -53, -6, -37, 48, 56, -39, -51, 1, -20, 41, 61, -81, -79, 12, -5, 39, 63, -55, -66, 26, -10, 11, 87, -14, -67, -11, -2, 6, 83, 17, -81, 4, 17, 5, 47, -7, -63, 6, 56, -18, 21, 4, -65, -13, 36, 13, 38, -6, -94, -44, 52, 20, 28, 11, -84, -37, 52, 0, 1, 29, -50, -47, 44, 6, -19, 20, -46, -45, 42]
5063D2j3l9Mm7J5J08j8p4L1n0rJ00qo1M3l2n9R3J5m4K9l0n9R7K6j01K1L8n3N4
5093A9L7r9NM6l2K4O7o7m4L6l8L4P5n1o3K0%K5N8n5l9L6nj9N3pn1L7ok6Q0j5r1
5126e6M0L3l3N3jr4L9M7l7L3L0q3J0M3n0M7L6p9j5M9j5J3L1o1k7P4k0k8M9n4j0
5157c6P6l8k5N8l7o3P2Lk8M0j0p5N9N0n4J5nm2L6L6m6PK6o4K1M0l5L3J4o4J1N5
5189C0l5j1K9l3PN8n9oN4m1k8O1k0k9P0m9m9Q0J6o6L8j7l2M1J4m4K8K1n0J6J8
5220A2m0L4L0o6JN7k9nL0m7J7L7l9j5M2l3j3K8k0kM9n3l4P1j5k3L5k1k6O1qm9
5252c4M9ln3L2J1j4L5j6n3L6K3j3J9Pn7L4J9n1M4J9o7J5M8m6KO6q0lP9l4l3L8
5284A9m0k8Q7qo3M6k1n0O3K7m5M3k8n4L3M1j9Qk0k6K6K7m0K4J6l1K0J8o1L2J5
$$ y = [42, 29, -10, -6, -53, -38, 70, 52, -22, 9, -41, -50, 50, 42, -19, 24, -8, -67, 26, 41, -3, 26, -4, -63, 34, 60, -41, -20, 18, -35, 19, 56, -43, -38, 8, -24, 0, 67, 0, -44, -8, -46, -12, 63, 12, -51, -31, -31, -6, 52, -3, -42, -6, -11, -30, 23, 16, -35, 2, -4, -30, 50, 35, -56, -16, 17, -16, 37, 36, -58, -19, 28, -9, 24, 54, -29, -19, 24, -26, 21, 57, -22, -37, 12, -3, 10, 41, -20, -47, 27, 7, -21, 28, -26, -36, 40, 2, -23, 35, -2, -65, 7, 10, -18, 22, 12, -63, -4, 46, -8, 7, 2, -40, -4, 32, -14, -7, 19, -45, -24, 16, -19, 14, 28, -36, -25, 30, -5, -16, 13, -20, -13, 45, -14, -20, 34, -7, -35, 26, 6, -23, 47, -2, -51, 29, 45, -21, 17, 0, -32, 9, 23, -21, 7, 28, -22, -6, 12, -28, 6, 36, -30, -29, 28, -1, -6, 24, -23, -6, 31, -8, -23, 19, -14, -27, 1, -19, -21, 28, -25, -59, 12, -3, -26, 9, -12, -38, 23, 15, -34, 15, 12, -41, -9, 2, -12, 23, 7, -46, -10, 13, 0, 19, 26, -31, 3, 22, -29, 15, 34, -33, -18, 30, -16, -14, 52, -28, -31, 48, 14, -19, 19, -21, -49, 38, 30, -33, 13, -8, -58, 5, 32, -13, 30, 2, -52, -19, 22, 3, 11, -9, -35, -9, 18, -22, 2, 18, -13, 7, 25, -36, -4, 11]
5315A1m2K2N8l7j5Qo8M5Q0l4k6L5p3j7Q6k5jN2o7m0O6j0m1P6k7m9P5j7q9M5L1
5346A2k7M3L2r9jL9m4M2O4n2k9J2l9J2Q2k5k9J3k6j0M1k1J2K2k7%K2n9K4L4n2
5377c4N2N1q5l1N1l4J9J14p6r3R9l1n9R2J5q5M7J9q4M3P3q7J3P4q2nO6n7j8R4
5407F1m2l7K1j6l7M7J8j0Rk1l7K1MK7J8n0J2L0l4mN8o2OP1o2l8Q0l0n1Q7l3m7
5439d1Q4m2o2Q6L4r4M7J8q9N8O8r3PQ0q6lQ8n9k7O8l4m2P1j4n2M2ok2M1j2l6J1
5471a1K3mkoj2J4k3J2M7m8jK3o2L3Q9p6l6O3l6m8J02k6p8R1Nj06Q7N7j21K4Q4
5502E8q2J8Q9j19k5J06l5k3O4n0n4P8%n3O2no0J4K6j4K1J0m1kJ7QJj8OJ5k1J6
5534GJ3m7j0M5j8j8Q2m5p1O5J0n4Q6qj18O9N8q6M4N8j09J7Q3r2%J11q4n4J03k9
$$ y = [11, -31, -9, 49, 12, -3, 5, -63, -18, 62, 28, 2, 37, -36, -53, 33, 8, 7, 59, -8, -48, 18, 8, -33, 43, 16, -33, 42, 25, -64, -19, 12, -15, 28, 60, -39, -40, -1, -45, -3, 61, 9, -20, -8, -47, -35, 47, 22, -7, 6, -20, -30, 11, -10, 2, 24, -3, -3, 19, -40, -16, 18, -34, 18, 69, -16, -47, 4, -30, -11, 103, 27, -66, 33, 2, -57, 35, 50, -35, 12, 31, -53, -10, 63, -24, -11, 63, -19, -24, 42, -15, -33, 61, 19, -18, 3, -13, -50, -3, 15, 5, 14, -7, -44, -23, -19, 8, 26, -24, -12, 18, -16, -20, 38, -24, -18, 53, -9, -47, 33, 3, -48, 39, 6, -41, 43, 1, -61, 25, 59, -35, 12, 30, -59, -1, 67, -26, -19, 61, -25, -28, 60, 1, -26, 42, 8, -34, 37, 23, -29, 13, 7, -15, 26, 14, -22, -11, 12, 8, 6, 0, -12, 2, -21, -9, 38, -10, -11, 12, -50, -17, 72, -4, -40, 23, -13, -61, 41, 15, -63, 28, 33, -73, 14, 71, -50, -26, 58, -24, -6, 83, -36, -61, 45, 10, -13, 51, 1, -53, 25, 25, -28, 34, 29, -31, -17, 9, -5, 16, 26, -15, -17, 0, 8, 9, -9, -3, 12, -9, 7, 20, -27, -37, 8, -10, -28, 54, 9, -62, 3, 13, -41, 45, 37, -81, -12, 46, -40, 4, 62, -47, -30, 53, -39, -39, 72, -12, -66, 37, 8]
5564Hl1N3k9o1Q0L6q3L5Rm2J8L9k7J7Km2KJ8K3Pl6j7K9oj2M0m1k1M9k3l0O8k2
5597A0n9O5J5n6M9K8j14M1Q6q1nP4q8pR8n6l7Q3l5p5Q6%n6N7np0N7K7m5LL6m6
5629b0J5M0l8OJ5j7k0K9llLj8K5Pj9K5k9l1O3j6m6N3Lo8M9K4o8M3K5p2J4P9p1
5662b1lN6o8j3J06m7o6R1j6o4O7J7p3M5Ro5L8N0n7JL5m1nN5m0j4L7j6pJ2JJlq
5696fmK7k4K0j0k5L9J6l7J1J3k2ML1n2J7L1m2j7O9m6k0M7k0m1O9qo9Q0k5n1O6
5728B1Lo5M2L6p6K5M7n8KN3n0mN2l6k7M7j3k4L4j8rK7Lk3J2J2j6%j1J2PnjJ7k0
5763dJ5Nk9KL9k2k2M3k0k8O4l5m1N3Qo8O2Mn3L7J5o1L2M3n7OL4m2KM1m1j7O5j5
5797A5l3K7ml2L0nk5L4J4m5K4J9j7J7j6j4J0J9k2LJ6j1Qnj1J3Ok0K8j6lK3k4k2
$$ y = [8, -23, 30, 1, -60, 20, 56, -27, 8, 17, -25, -7, 32, 5, 22, 24, -18, -16, 2, 25, 32, -4, -21, 8, 2, -10, 30, -11, -32, 17, -6, -36, 32, 10, -49, 16, 31, -25, 24, 52, -62, -21, 65, -16, -21, 53, -35, -42, 56, 0, -37, 46, 11, -64, 22, 22, -34, 23, 18, -52, 5, 32, -13, -10, 26, -20, -5, 35, -3, 3, 18, 1, -19, 10, 7, 4, 7, -11, 14, 21, 2, 27, -2, -33, 30, 14, -32, 21, 24, -44, 5, 29, -39, 4, 29, -43, -29, 50, -21, -24, 32, -36, -49, 57, 10, -56, 35, 19, -45, 22, 39, -34, 11, 20, -45, -7, 43, -14, -13, 22, -19, -24, 31, -9, -23, 14, -2, -9, 3, 4, 5, 2, -6, -10, 17, -7, 13, 3, -22, 17, 33, -4, 7, 20, -2, 2, 33, -19, -2, 29, -13, -30, 39, -7, -27, 20, 0, -41, 28, 20, -49, 31, 6, -45, 21, 24, -41, 1, 37, -39, -14, 33, -25, -23, 30, -20, -24, 28, -8, -35, 12, -1, -25, 9, -9, -18, 9, 12, -11, 1, 13, -3, -3, -14, -2, 5, 0, -1, 16, -4, 11, 16, -13, -11, 28, 6, -16, 27, 7, -21, 43, 8, -33, 20, 28, -40, 22, 26, -27, 10, 25, -36, -4, 39, -18, -12, 22, -20, -18, 23, -18, -35, 30, 15, -18, 9, 5, -27, 3, -2, -27, 7, 21, -24, 0, 19, 2, 19, 3, -11, -1, 18, -4, -1, 15, 4, 12, 7, -4, 9, 15, -5, 23, 7, 4, 27, 3, -19]
5831a9L5%k7L3j2l1K0K2l8J2M1m5j8M4l2j2N8k9l9N6j2n0M4Ol3M9pn1L0K3m3J4
5863a1L7l9J1Qk7LM9k2kLl3J0J9m%J2oj0%oJ3J2k0J0L4m1j7J0rJ2L4k1l4M4k7
5898hk0N6k0j2K1k2m6L7L9l8J6Mm4K6K0o4M6M0l0j2K9n5RL7j7jN4m2l8K4j0NN2
5931C6k0n1K0Nj5K0K0jJ0nm4K5J4j3J1Mj1Qk2k7L9Rj0J8Ko6M5Kl5M3L4n9nK3l6
5966c2J9M1l8rL2j5k4L7l3KL6qm3K5Kk1K1J3k3L4k1l8L1K0pJ9rm7K7J6k9J8M7
5999D3n4J0Pm3L7L5m5J1L1l2lJ5l4K6L7l7j3K2j6qK0qj1L8k6l7M8Lj6K5k6k9N3
6032B3rm4N1rm0L7Km9M1J1l2J1K0k3LJ5m3K8K4n4J8K1lJQk7RL0k9lL0k7mM3l4
6067dj1L8rk8L6ol0K6j2j8L6J2l8RKj4K6J5l8J0J1m8K1K8j5QNl7J9L0m5J7Mk5
$$ y = [-19, 16, 16, -11, 22, 10, -21, -1, 21, -17, -5, 36, -9, -27, 17, -15, -27, 31, 2, -37, 19, 7, -43, 1, 7, -26, 23, 16, -35, -5, 18, -25, -11, 26, -13, -2, 6, -21, -18, 31, 9, 7, 10, -23, -13, 6, 2, 2, 14, 8, -2, -2, -8, 5, 17, -3, 7, 41, 0, -17, -7, -16, -4, 30, 9, -25, 19, -8, -28, 28, 8, -4, 17, -5, -51, -14, 25, -13, 3, 7, -37, -11, 9, -55, -9, 31, 1, -11, 18, -37, -28, 9, -8, -9, 45, 3, -35, -11, -21, -16, 36, 16, -35, -15, -10, -25, -5, 15, 14, 24, 19, -25, 0, 14, 1, 12, 16, 5, 13, -9, -36, 3, 12, 2, 20, 22, -44, 1, 3, -32, 11, 45, -14, -19, 4, -32, -13, 28, -10, -19, 13, -2, -26, 11, -22, -20, 16, 8, -35, -10, -8, -29, -8, 5, -18, 16, -5, -43, -12, 8, 1, 20, 11, -36, -9, 7, -22, -4, 43, -11, -1, 6, -37, 0, 35, -10, 1, 32, 0, -3, 12, -22, 4, 41, 4, -9, 13, -3, -11, 9, 1, -10, 28, 2, -35, 13, 16, 0, 25, -1, -30, 23, 14, -30, 21, 12, -28, 9, 11, -38, 3, 14, -18, -7, 13, -10, -7, 8, -35, -7, 17, -37, -19, 2, -1, 0, 8, -19, -10, 20, -9, -12, 18, -9, -13, 30, -4, -15, 23, 14, -14, 22, 16, -14, 12, 0, -18, 18, 30, -8, 1, 3, -11, 15, 30, -8, 2, 13, -35, -14, 14, -1, 7, 12, -25, -6, 24, -21, -4, 0, -25]
6101b5K4K3m0j1N0m0J4M5m6j4L5m1j5Q4k5l2K3l4kL9J0l5K6jk4L2Ll3L1k3k1L7
6133A4Jl3J4Nj0L3Pm4kK0k8L7K2l7qJ6k4K0L2k6j9J1l4K9K2l6PLK%K7k0k7L7l1
6168b0J0M1j3m8K0Lj5O3j0n2J3J0k1M8J1n3J5Qj8L1J5l7j7J9j0K7K1l8j6J4jN
6200EJ9k0nLk0K9K0l7j5K6k9L6L9m2m3J9NNL9l7l9M4j1%L2Jn0J1J0oL2Nn5LJ8
$$ y = [-25, -1, 22, -18, -29, 21, -19, -5, 40, -6, -20, 15, -26, -41, 43, 18, -14, 9, -25, -27, 12, 22, -13, 13, 12, -12, 20, 23, -10, 21, -2, -23, 14, 15, -18, -4, 1, -9, 24, 31, -13, -15, 5, -23, 14, 36, -1, -9, 7, -17, 3, 35, 9, -10, 1, -33, -4, 18, -18, -11, -8, -6, -6, 21, 1, -26, 11, -20, -10, 31, 18, -30, -10, -7, -22, 41, 31, -21, -8, 2, -19, 29, 40, -13, 2, 10, -8, 23, 38, 1, -16, 3, -7, 20, 41, 3, -13, 1, 0, 5, 24, 4, -1, 2, -18, 11, 31, -6, -21, 5, -24, 12, 51, 9, -34, -15, -10, -5, 34, -3, -42, 2, -9, -9, 23, 24, -26, -15, -5, -11, 21, 26, -29, -26, -8]
$$ [...]
8191h
##END NTUPLES=NMR FID
##END=
