##TITLE=1H_LY-835.60
 CCl4 8 sc, 
 6.6.2019
##JCAMPDX= 6.0         $$ Bruker NMR JCAMP-DX V2.0
##DATA TYPE= NMR FID
##DATA CLASS= NTUPLES
##ORIGIN= UXNMR, Bruker Analytische Messtechnik GmbH
##OWNER= root
$$ XWIN-NMR		Version 3.5
$$ Thu Jun  6 14:24:42 2019 Russian Standard Time (UT+4h)  she@DPX200
##.OBSERVE FREQUENCY= 200.13155
##.OBSERVE NUCLEUS= ^1H
##.DELAY= (6, 6)
##.ACQUISITION MODE= SIMULTANEOUS
##.ACQUISITION SCHEME= undefined
##.AVERAGES= 8
##.DIGITISER RES= 18
##SPECTROMETER/DATA SYSTEM= spect
##.PULSE SEQUENCE= zg30
##.SOLVENT NAME= CDCl3
##.SHIFT REFERENCE= (INTERNAL, CDCl3, 0, 15.7039)
##AUDIT TRAIL= $$ (NUMBER, WHEN, WHO, WHERE, WHAT)
$$ ##TITLE= Audit trail, XWIN-NMR		Version 3.5
$$ ##JCAMPDX= 5.01
$$ ##ORIGIN= Bruker BioSpin GmbH
$$ ##OWNER= she
$$ F:/spectra/data/she/nmr/H-F/1/audita.txt
$$ ##AUDIT TRAIL=  $$ (NUMBER, WHEN, WHO, WHERE, WHAT)
(   1,<2019-06-06 14:23:31.76 +0400>,<she>,<DPX200>,
      <created by zg, POWCHK disabled, PULCHK disabled
       configuration hash MD5:
       00 E9 B6 7A A2 85 ED C7 34 08 36 98 17 FE 4E 26
       data hash MD5: 16K
       90 4B 3D 28 45 B0 55 13 14 CF CD 45 9A 8B E0 F1>)
$$ ##END=
$$ 
$$ hash MD5
$$ 44 D3 9E 98 41 7E 21 13 3B EF AC AF 31 16 53 15
##$RELAX= 
##$RELAX= 
##$RELAX= 
##$RELAX= 
##$RELAX= 
##$RELAX= 
$$ Bruker specific parameters
$$ --------------------------
##$DU= <F:/spectra>
##$EXPNO= 1
##$NAME= <H-F>
##$PROCNO= 1
##$TYPE= <nmr>
##$USER= <she>
##$AMP= (0..31)
100 100 100 100 100 100 100 100 100 100 100 100 100 100 100 100 100 100 
100 100 100 100 100 100 100 100 100 100 100 100 100 100 
##$AQSEQ= 0
##$AQ_mod= 1
##$AUNM= <au_zg>
##$AUTOPOS= <>
##$BF1= 200.13
##$BF2= 200.13
##$BF3= 200.13
##$BF4= 200.13
##$BF5= 200.13
##$BF6= 200.13
##$BF7= 200.13
##$BF8= 200.13
##$BYTORDA= 1
##$CFDGTYP= 0
##$CFRGTYP= 5
##$CHEMSTR= <none>
##$CNST= (0..31)
1 1 145 1 1 1 1 1 1 1 1 1 1 1 1 1 1 1 1 1 1 1 1 1 1 1 1 1 1 1 1 1 
##$CPDPRG= <>
##$CPDPRG1= <>
##$CPDPRG2= <>
##$CPDPRG3= <>
##$CPDPRG4= <mlev>
##$CPDPRG5= <mlev>
##$CPDPRG6= <mlev>
##$CPDPRG7= <mlev>
##$CPDPRG8= <mlev>
##$CPDPRGB= <>
##$CPDPRGT= <>
##$D= (0..31)
0 1.2 0 0 0 0 0 0 0 0 0 0.03 0 0 0 0 0 0 0 0 0 0 0 0 0 0 0 0 0 0 0 0 
##$DATE= 1559816611
##$DBL= (0..7)
120 120 120 120 120 120 120 120 
##$DBP= (0..7)
150 150 150 150 150 150 150 150 
##$DBP07= 0
##$DBPNAM0= <>
##$DBPNAM1= <>
##$DBPNAM2= <>
##$DBPNAM3= <>
##$DBPNAM4= <>
##$DBPNAM5= <>
##$DBPNAM6= <>
##$DBPNAM7= <>
##$DBPOAL= (0..7)
0.5 0.5 0.5 0.5 0.5 0.5 0.5 0.5 
##$DBPOFFS= (0..7)
0 0 0 0 0 0 0 0 
##$DE= 6
##$DECBNUC= <off>
##$DECIM= 24
##$DECNUC= <off>
##$DECSTAT= 4
##$DIGMOD= 1
##$DIGTYP= 9
##$DL= (0..7)
0 120 120 120 120 120 120 120 
##$DP= (0..7)
150 150 150 150 150 150 150 150 
##$DP07= 0
##$DPNAME0= <>
##$DPNAME1= <>
##$DPNAME2= <>
##$DPNAME3= <>
##$DPNAME4= <>
##$DPNAME5= <>
##$DPNAME6= <>
##$DPNAME7= <>
##$DPOAL= (0..7)
0.5 0.5 0.5 0.5 0.5 0.5 0.5 0.5 
##$DPOFFS= (0..7)
0 0 0 0 0 0 0 0 
##$DQDMODE= 0
##$DR= 18
##$DS= 0
##$DSLIST= <SSSSSSSSSSSSSSS>
##$DSPFIRM= 0
$$ [...]
##$SUBNAM2= <"">
##$SUBNAM3= <"">
##$SUBNAM4= <"">
##$SUBNAM5= <"">
##$SUBNAM6= <"">
##$SUBNAM7= <"">
##$SUBNAM8= <"">
##$SUBNAM9= <"">
##$SW= 24.9336996594482
##$SWIBOX= (0..15)
0 0 2 0 0 0 0 0 0 0 0 0 0 0 0 0 
##$SW_h= 4990.01996007984
##$TD= 16384
##$TD0= 1
##$TE= 0
##$TE2= 300
##$TE3= 300
##$TEG= 300
##$TL= (0..7)
0 120 120 120 120 120 120 120 
##$TP= (0..7)
150 150 150 150 150 150 150 150 
##$TP07= 0
##$TPNAME0= <>
##$TPNAME1= <>
##$TPNAME2= <>
##$TPNAME3= <>
##$TPNAME4= <>
##$TPNAME5= <>
##$TPNAME6= <>
##$TPNAME7= <>
##$TPOAL= (0..7)
0.5 0.5 0.5 0.5 0.5 0.5 0.5 0.5 
##$TPOFFS= (0..7)
0 0 0 0 0 0 0 0 
##$TUNHIN= 0
##$TUNHOUT= 0
##$TUNXOUT= 0
##$USERA1= <user>
##$USERA2= <user>
##$USERA3= <user>
##$USERA4= <user>
##$USERA5= <user>
##$V9= 5
##$VALIST= <valist>
##$VCLIST= <CCCCCCCCCCCCCCC>
##$VD= 0
##$VDLIST= <DDDDDDDDDDDDDDD>
##$VPLIST= <PPPPPPPPPPPPPPP>
##$VTLIST= <TTTTTTTTTTTTTTT>
##$WBST= 1024
##$WBSW= 4
##$XGAIN= (0..3)
0 0 0 0 
##$XL= 0
##$YL= 0
##$YMAX_a= 51654
##$YMIN_a= -66224
##$ZGOPTNS= <>
##$ZL1= 120
##$ZL2= 120
##$ZL3= 120
##$ZL4= 120
##$ABSF1= 10
##$ABSF2= 0
##$ABSG= 5
##$ABSL= 3
##$ALPHA= 0
##$AQORDER= 0
##$ASSFAC= 0
##$ASSFACI= 0
##$ASSFACX= 0
##$ASSWID= 0
##$AUNMP= <proc_1d>
##$AZFE= 0.1
##$AZFW= 0.1
##$BCFW= 1
##$BC_mod= 2
##$BYTORDP= 1
##$COROFFS= 0
##$CY= 11.3945322036743
##$DATMOD= 1
##$DC= 2
##$DFILT= <>
##$DTYPP= 0
##$F1P= 18.9103706918063
##$F2P= -1.10871071338519
##$FCOR= 0.5
##$FTSIZE= 0
##$FT_mod= 4
##$GAMMA= 1
##$GB= 0.15
##$INTBC= 1
##$INTSCL= 1
##$ISEN= 128
##$LB= 0.24
##$LEV0= 0
##$LPBIN= 0
##$MAXI= 10000
##$MC2= 0
##$MEAN= 0
##$ME_mod= 0
##$MI= 1.114404
##$NCOEF= 0
##$NC_proc= 0
##$NLEV= 6
##$NOISF1= 3.799351
##$NOISF2= 2.8
##$NSP= 1
##$NTH_PI= 0
##$NZP= 0
##$OFFSET= 15.70392
##$PC= 1
##$PHC0= -8574.247
##$PHC1= 12.40019
##$PH_mod= 1
##$PKNL= yes
##$PPARMOD= 0
##$PSCAL= 0
##$PSIGN= 0
##$REVERSE= no
##$SF= 200.130013532006
##$SI= 16384
##$SIGF1= 3
##$SIGF2= 2
##$SINO= 400
##$SIOLD= 16384
##$SREGLST= <1H.CDCl3>
##$SSB= 0
##$STSI= 0
##$STSR= 0
##$SW_p= 3612.71676300578
##$SYMM= 0
##$S_DEV= 0
##$TDeff= 0
##$TDoff= 0
##$TI= <>
##$TILT= no
##$TM1= 0
##$TM2= 0
##$TOPLEV= 0
##$USERP1= <user>
##$USERP2= <user>
##$USERP3= <user>
##$USERP4= <user>
##$USERP5= <user>
##$WDW= 1
##$XDIM= 8192
##$YMAX_p= 0
##$YMIN_p= 0
$$ End of Bruker specific parameters
$$ ---------------------------------
##NTUPLES= NMR FID
##VAR_NAME=  TIME,          FID/REAL,        FID/IMAG
##SYMBOL=    X,             R,               I
##VAR_TYPE=  INDEPENDENT,   DEPENDENT,       DEPENDENT
##VAR_FORM=  AFFN,          ASDF,            ASDF
##VAR_DIM=   8192,          8192,            8192
##UNITS=     SECONDS,       ARBITRARY UNITS, ARBITRARY UNITS
##FACTOR=    0.0002004,     1,               1
##FIRST=     0,             0,               0
##LAST=      1.6414764,     0,               0
##MIN=       0,             -66224,          0
##MAX=       1.6414764,     51654,           0
$$ Real data points
##PAGE= N=1
##DATA TABLE= (X++(R..R)), XYDATA
$$ [...]
694a666K998j191k50J819k204j543J663L54J325Q29l249m43J938j855J384L661
710C570l893k343M161j594k465M764k40m528K500J609k830J451R71k532J100J192
726H93j094J300r35k630K961R87l115K778J313n332J299M141l428o8L892l500
742e38k235L959m28j700J995r36j227J749q35l03J922k016p94L031j683j595L448
759A814j318l002L305O59k813J719M57k199J588M57j503J732o71j931K979n07
775G66l270L856P84n289L024L310n422Q82M648m433j230N033k356k660L676n17
791H02k236K013k87r89J577j164n07K096j791p07L064j963j918L659r00k962L155
808I42M22l000J944O02k269J806M97k131J712lk188K696K25l490K746J470m314
$$ plain form
694 -1666 1332 141 -109 1710 -494 -2037 -374 -20 1305 2134 -1115 -1558 380 -1475 -91 3570
710 3570 -323 -2666 1495 -99 -2564 2200 1960 -2568 -68 1541 -1289 162 1133 -1399 -299 893
726 893 -201 1099 164 -2466 495 1482 -1633 1145 2458 -2874 -1575 2566 -862 -930 2962 -538
742 -538 -2773 1186 758 -942 1053 117 -1110 639 -196 -499 1423 -593 -1387 1644 -39 -1634 1814
759 1814 496 -2506 799 1458 -1355 364 821 -1378 210 667 -836 896 225 -1706 1273 766
775 766 -2504 1352 2136 -3153 -129 3181 -2241 -1359 3289 -1144 -2374 2659 303 -2357 1319 802
791 802 -1434 579 292 -697 880 -284 -791 1305 -486 -1193 1871 -92 -2010 1649 749 -2213 942
808 942 1364 -1636 308 910 -1359 447 944 -1187 525 522 -1666 1030 1255 -2235 511 1981 -2333
825b333J970L074m229J85L578l124o36L712k121j697K470j078n01K156j715n33
841h22K178k349m15L585k197j770L804j801k994M267Q8l904K837J295l445J532
857a11J456k717J036J586j770Q04N15k093J160Q02j866J933J140l218N89J708
873I54k272J046K344k505l13J818k062L9K212j679J74J971k650l60K845k351p99
890a588L800j723k218L316j331l134L620J027l017J884P88l229J033J653j638
905g57J141J150k117J42O20j398J341J167j877P99J041k449K95J776j532N24J917
922A783j988o65J466j429j03K143r18m07J337j918r16K314o23p05K201j010j887
939a325J638m10j470K276O69j718P21k22j699J279Q21q61J273L6k094O09M79j180
$$ plain form
825 -2333 -363 2711 -1518 -1333 2245 -879 -1515 2197 76 -1621 849 -229 -730 1426 -289 -822
841 -822 1356 -993 -1408 2177 -20 -1790 2014 213 -2781 1486 1574 -2330 507 1802 -1643 -111
857 -111 1345 -1372 -336 1250 -520 284 799 -1294 -134 668 -1198 735 1875 -1343 -754 954
873 954 -1318 -272 2072 -433 -746 1072 -990 -951 1261 -418 -244 1727 -923 -1283 1562 -789 -1588
890 -1588 2212 489 -1729 1587 256 -2878 742 1769 -1248 636 1424 -1805 -772 881 -757
905 -757 384 1534 -583 -441 179 -1219 122 1289 -588 211 1252 -1197 -902 874 -658 -134 1783
922 1783 -205 -870 596 -833 -936 1207 289 -118 1219 -699 -1615 699 76 -629 1572 562 -1325
939 -1325 313 -97 -1567 709 1378 -340 381 159 -1540 -261 560 -301 972 1008 -1086 -477 2 -1178
957a178J767J127k290K44J050j994M00K104j192k34J488j643j026J704k96n18
973d87J492m19j129O82m80o64J430L35p15L79n43p59R07J49l90Q14k31q20N69
992A20k26n66J127n9r92J109J43j453O71M12j225J131J208j671k58R82j219k3
1010g89J778n16p44P98q09q84J291M77n73K86k04o55M07J71k10M02L6k86J33l21
1030b12j94O05r1k71O09k13o90M36m4l73R35K04j153J74M47n62M44O51q54j87
1050c39O06m99p5Q69l23n86K90o7k0N69j76n52J32M8R4L89k78k84L05k82j99P28
1072C50k6n58L14r5n02P08L89q86P1N30m87j4N57m00k41N54j54m11L40J62l02
1093a01PJ89Nj30o7Q2m2L8L92k23o46M08M02m94K71M27q62j10Q51m79k35J063
$$ plain form
957 -1178 589 1716 -574 -330 720 -1274 -874 1230 38 -196 1292 -351 -1377 327 31 -487
973 -487 1005 586 -543 139 -341 -1005 425 760 45 424 -119 -878 29 178 -212 602 371 -449 120
992 120 -106 -672 455 396 -596 513 656 -797 -126 286 -939 192 1400 -271 -529 453 -766 -789
1010 -789 989 473 -271 527 -282 -1166 125 602 29 315 111 -544 -137 34 -176 226 262 -24 109 -212
1030 -212 -406 199 108 -163 446 233 -457 -21 -65 -438 497 701 -452 -278 169 -393 51 702 -152 -339
1050 -339 267 -232 -307 562 239 -347 -57 -124 -144 425 249 -303 -171 -123 -29 360 82 -202 103 -179 -378 350
1072 350 324 -234 80 -15 -517 191 580 -306 -235 295 -192 -206 351 -49 -290 264 110 -301 39 201 -101
1093 -101 -94 95 100 -30 -97 -15 -57 -19 373 150 -496 -88 314 -180 91 518 -344 -454 397 -82 -317 746
1115G46n02j084Q37L42o98O56L04j195J96Q88o31j41Q10m12o08N19R4l04L28J64
1135C09m98j11M26P5l31K7K91k28j64L98j66l54N43Q1p10L65M50o74J00N77n44
1156a38j7N53o16j99Q49k86l76M57l32k55P02j91m35N87k07n74O19O4m49O00j24
1177B32q77O32M61o92K91L42p90J81O19n82J8N98m47l49M14Or3J88j01j85jJ41
1199FJ77k96j08N88l09n85P71M6q60Q38L18j393P21R96j573J69J559j346m81J725
1219I63j060r68J989l95j675J507L33j666J074P85j551M91R66j324P8J209p30
1236B6l67O42m34j94O25j71k28J62j22M3l2j42N04q3o19M89M5o53Q31J76j205
1257g07P68O17j425N59J065j453K79J281j602q1J829j371o35J917j074j034K025
$$ plain form
1115 746 244 -840 -3 339 -359 297 601 -594 -398 490 -141 -282 528 116 -492 27 121 -183 145 309
1135 309 -189 -300 126 201 -130 -103 188 -40 -204 194 28 -326 217 298 -412 -47 403 -271 -171 406 -138
1156 -138 -155 398 -218 -417 432 146 -230 227 -105 -360 342 151 -284 303 96 -478 141 205 -244 356 232
1177 232 -645 -13 448 -244 47 389 -401 -220 399 -183 -165 433 -14 -363 51 57 -36 152 51 -134 -135 6
1199 6 183 -113 -221 367 58 -527 244 290 -570 268 586 -807 -86 910 -663 -494 1065 -281 -762 963
1219 963 -97 -1065 924 529 -1146 361 694 -972 102 887 -664 -173 793 -531 -453 756 26
1236 26 -341 301 -133 -327 298 127 -101 61 -61 -18 -50 -192 312 229 -390 99 144 -509 322 498 -707
1257 -707 61 678 -747 -188 877 -576 -297 984 -618 -699 1130 -241 -876 1041 -33 -1067 958
1274I58p49j474K136j90k020J725M64k039J446Q58k221Q90J402j969K46J710j470
1291b97l47J468j021n24J456m82q42Q12p1m55M15j2r3P7k67K54Rn13Q23J40j391
1312h61Q69Q42j698O66J413k076J33K196k046o74K843j546j694K863p68k240K832
1329A054M5k966K264J023l040J491J738k788P28K058k547NK443j793o94K141j187
1346b5j025J830o01j055J524k10j104P80L6m68O33j92l27M18m19K0N98o89J96
1365h0Q21j262k4J426j158k73J645j431p17K241j128j379K510p14k117K523n4
1382H29k641K500P97l330J810J862l327Q89K558k969pL002k459j099L129j403
1398A41j649K686o26j967K081mj944J578O26j685P54O10j160M68N04p03K60L07
$$ plain form
1274 958 209 -1265 871 681 -1339 386 850 -1189 257 1115 -1106 -216 1186 -783 -537 1173 -297
1291 -297 -644 824 -197 -721 735 253 -589 223 152 -303 112 100 7 84 -183 71 80 -433 390 530 -861
1312 -861 8 850 -848 -182 1231 -845 -712 1484 -562 -1236 1607 61 -1633 1230 462 -1778 1054
1329 1054 1099 -1867 397 1420 -1620 -129 1609 -1179 -451 1607 -940 -935 1508 -285 -979 1162 -25
1346 -25 -1050 780 179 -876 648 438 -666 114 150 -318 315 123 -204 214 -205 -185 413 -276 -80
1365 -80 741 -521 -545 881 -277 -550 1095 -336 -1053 1188 60 -1319 1191 477 -1640 883 829
1382 829 -1812 688 1485 -1845 -35 1827 -1500 -611 1947 -1022 -1029 1973 -486 -1585 1544 141
1398 141 -1508 1178 552 -1415 666 662 -1282 296 922 -763 -9 601 -559 -91 413 -290 -30 277
1416B77k83J44m09n1P86o24j63J276j061q53J721q23j222K512k49k486J920M69
1434H81k683J943J617k925R41J977l099J02K909k097m88K794k022j505K781j123
1450Cj682K959k14k343J856k4k355J889J212j999Q66R85k058J02J298q28L28J017
1468A012r65m28L30m16L21M19k19N42j78j099M89J18o82J357M40j543O77K83j947
1487a489J089J597j563O44J243k676j80K425j591k96K843j693j910K372r21j904
1503b010L061M76k619J560N38k834J147J834j701P10J550k222p27J457p26Q0J687
1520A261o96q95M70p33l58J169K78m6J48q10l50L17k57N75P39o44O7J87j465K12
1540h31J478p09J25J323j535j041J510p15n73K340l02j934J149k35j664J829R98
$$ plain form
1416 277 -6 138 -271 -322 464 -160 -323 953 -108 -961 760 -63 -1285 1227 978 -1508 412 881
1434 881 -1802 141 1758 -1167 -226 1751 -1348 -1246 1663 -434 -922 1872 -150 -1655 1126 3
1450 3 -1679 1280 1066 -1277 579 555 -1800 89 1301 -698 168 1153 -905 -803 495 -333 -5 1012
1468 1012 47 -381 -51 -467 -146 273 54 596 418 -681 -192 -74 -756 601 1041 -502 175 458 -1489
1487 -1489 -400 1197 -366 278 1521 -1155 -1335 1090 -501 -797 2046 353 -1557 815 -106 -2010
1503 -2010 1051 1527 -1092 468 1006 -1828 -681 1153 -548 162 1712 -510 -1237 220 -506 -426 1261
1520 1261 565 -330 140 -593 -951 218 496 450 598 -212 -562 -245 -502 73 812 168 235 422 -1043 -831
1540 -831 647 -62 63 1386 -149 -1190 320 -395 -968 1372 1070 -864 285 50 -1614 215 1213
1557A213j709R32O21k287M09J504j223N28J546j709o49J323j115l61J928l40q66
1574b55Q89q17j097J309M08n35P41j70j065K57J06j65Q37J59n58P6m02l20P32
1593A30n8k04Q32l91q61O36k38n91J302J35j165P97R9j490Q59R47j156N99Q56
1612A038j714n6J407r93j57J480r35p32J211o44q20J397pr80Q64m5j014P16K45
1631B61p41P26L32r02J96K12n34N36L59o37K50J64o56L45L55m97M08K10q43K98
1651a58N32o59K33M99p67J75O41q05%Q42o30k05P62o01k56Q96n14m27R12l72o02
1672e04Q08k20n33R08j83q96P49J88q06O78K43r07M86L82r03L93O71p73O5N31
1692C77o69N9O51n78q6O29m08j93M41l91o6N50l47j55M69l51k02M46l06m6O28
$$ plain form
1557 1213 -496 436 1057 -1230 -821 683 -540 -12 1534 -175 -824 499 -616 -977 951 611 -255
1574 -255 634 -183 -1280 29 437 -98 643 473 -592 -335 -229 -394 443 602 44 120 -282 -602 130
1593 130 72 -132 700 309 -552 84 -154 -745 557 692 -473 324 423 -1067 -208 739 -417 182 1038
1612 1038 -676 -732 675 -318 -475 1005 70 -662 549 -95 -915 482 475 -505 359 314 -700 16 261
1631 261 -480 246 578 -324 -128 84 -450 86 445 -192 58 222 -434 -89 266 -231 177 387 -456 -158
1651 -158 374 -285 -52 447 -320 -145 496 -309 -309 533 -97 -302 460 -141 -397 499 -15 -442 470 98 -504
1672 -504 304 84 -449 459 276 -620 129 317 -489 189 432 -475 11 393 -510 -117 554 -219 -154 377
1692 377 -292 -233 418 -160 -246 383 -25 -218 223 -168 -234 316 -31 -186 283 -68 -270 176 -130 -176 452
1713D52m42l69O04k88l26P20k19n05P26j81p51O82J89o33N52J48p85M29L25p56
1733d28L69N59o70Q4L66o52J75O49n54n4N25n23j57N72l74q8O46m65l58N80k13
1754a1k51N47k41l52N47j75m44N21L9m09L66n8l90M38O3m47K96R9l50L09K3l66
1776b46L74P0n02L37J57m33L75J34o74M05M06p03K14N15o95Q3O14o62n7Q14n53
1797b7l82P23k83l67O60k13n14O06l5n29M54J25m16L00j2m08L78J44l47J98L0
1818H5l17K76K3k82M05K1m80K62O4l34M69J04n97K97K62o19K97M46n75J77L97
1839C81p47P3P36m87j65N75m69k26O31l28k68O40k33m37M83j50k57N59k01m54
1859c44N17n1m41M93Om53M51l0n56M97J91n22K98J09m96M03J94n58L40K40o34
$$ plain form
1713 452 10 -359 245 -43 -369 351 132 -373 353 172 -579 103 292 -341 211 359 -426 3 328 -428
1733 -428 -59 500 -170 -86 280 -372 -197 452 -102 -156 369 -154 -311 261 -113 -201 445 -20 -378 202 -11
1754 -11 -262 285 44 -308 239 64 -380 141 180 -229 137 79 -311 127 190 -257 39 138 -212 97 120 -246
1776 -246 128 198 -304 33 190 -243 132 266 -408 -3 403 -300 -86 429 -266 -183 431 -231 -288 526 -27
1797 -27 -409 314 31 -336 324 111 -403 203 168 -361 93 218 -198 102 90 -318 60 204 -143 55 85
1818 85 -232 44 67 -215 190 211 -269 -7 57 -277 192 296 -301 -4 258 -361 -64 382 -193 -16 381
1839 381 -366 -293 443 -44 -209 366 -103 -329 302 -26 -294 346 113 -324 159 9 -248 311 110 -344
1859 -344 173 122 -319 174 180 -273 178 148 -408 89 280 -242 56 165 -331 72 266 -292 48 288 -346
1880c46K96K96n61L73L77q14J51O12o30R3O34o90q2P15o25j90Q83m29l99O47l99
1901h8l38Q19k38n16O30j50n47N89pm35N57p2o41M73J46m03M26m1n05M65mn21
1923d01O07Q6o50N21L4p76P59L59j038M90N21j069L96P99j036J51R74j077k14
1942e64J174o79l78J052o50n82J091l38p14J000j49p99P53n3o85Q05J02q24N11
1961G3J41o17N44J48n94M91L6o74N21J96n50N50Jq44O71L00q79O44L64j096N29
1982d5N57j107N67Q68j304J11R83j089J21J226j153l16J329r65n25J490o27p88
2000f67J314n86r94J459r4j186J102J09j243R32L43j147P86N09j179M00N73q73
2018d42M07N26q50K99M72q05K76M98o75L59L71r33L94O24r20L51O26j115L51R14
$$ plain form
1880 -346 -50 246 -315 58 435 -379 -228 384 -246 -153 481 -209 -291 424 -201 -391 492 63 -336 311 -88
1901 -88 -426 393 155 -361 269 119 -428 161 154 -281 276 204 -437 36 182 -221 205 164 -341 124 120 -401
1923 -401 206 292 -358 163 197 -579 180 539 -499 -9 512 -557 -161 638 -398 -247 727 -350 -564
1942 -564 610 -69 -447 605 -45 -627 464 126 -588 412 263 -536 217 164 -521 284 386 -438 73
1961 73 214 -403 141 289 -305 186 222 -452 69 265 -285 265 266 -578 93 393 -486 158 522 -574 -45
1982 -45 512 -595 -28 840 -464 -353 630 -459 -338 888 -265 -581 748 -217 -742 748 121 -667
2000 -667 647 61 -933 526 432 -754 348 457 -786 146 489 -658 128 637 -542 -142 431 -442
2018 -442 -35 491 -359 -60 412 -393 -117 381 -294 65 436 -497 -103 521 -399 -48 578 -537 -186 728
2038G28j195J83J146j291j66J414j034l31J547j152r01J772n18j038J671m25j509
2055a099J430R8j415J454M52j735P34O22j399Q39R46j409K95Q54j252J72J029
2072F16q66J20Q42j012j39Q41p07M1Q47o95l4O12r09NR85o82J0Q23j065j66J162
2093F29r05k12J380r26o75J425p84q01J690n96j252J707j21j542J409O8j684J461
2111B71P21j789Q91P95j932N91J383j380L35J241j689k93J464q32j59J317r13
2128B2o41J001o10l61J155l45m74O63n80l69Q63m16k08R44o01m48P98p30l11J401
2148G53n50p11J176o76r93J520k02j091J491j44j711J335M72j604J176O78j850
2165i31Q24J136j798L65J398j561P4J575j336m19J511j097o47J684n05q52J147
$$ plain form
2038 728 -467 -284 862 -429 -595 819 -215 -546 1001 -151 -1052 720 202 -836 835 410 -1099
2055 -1099 331 429 -986 468 920 -815 -81 541 -858 -19 927 -482 -187 667 -585 -413 616
2072 616 -250 -130 712 -300 -439 402 -305 -264 583 -112 -146 466 -443 -438 547 -135 -125 698 -367 -533 629
2093 629 -276 -488 892 -34 -709 716 -68 -869 821 225 -1027 680 559 -983 426 494 -1190 271
2111 271 992 -797 94 889 -1043 -452 931 -449 -114 1127 -562 -855 609 -223 -382 935 22
2128 22 -619 382 -228 -589 566 221 -253 410 -170 -539 324 -92 -300 644 43 -405 393 -337 -648 753
2148 753 203 -508 668 -8 -1001 519 317 -774 717 573 -1138 197 669 -935 241 919 -931
2165 -931 -107 1029 -769 -404 994 -567 -493 1082 -254 -673 838 -259 -906 778 273 -579 568
2182E68n49r35J273Kp96Q45j36q98O79M3m89P76p5p32N68j13n18Q29j38o79Q98
2203D23j60r67R36N2r37J066J47j352R16M66j430Q60Q62j519M70J023j571K53
2221d62J516j363k82J458j108n06J588p75q49J464m87j061J308o7j022J002j4
2238C40j089R21L25j014O24K93r11N13L75p83M56L89q02K61L87o15L97L22p74
2257c85L27L99p42L83M73q16L20N11r74L11Q58r67L3Q56r57n5J158q85l91J190
2277F47o92o47J260m29p93J186k87j033J138J24j148Q34L23j106O97N18j139M14
2295a33O95r17J83O69p76O1O26o20K8O00n71j16N18m00R1N12o64j44N99l77M0
2316i6N96o23k56O02m51o7R00m65n63O13l66l08J018k21p61O70j11p09Q26J58
$$ plain form
2182 568 19 -916 357 359 -437 408 272 -626 53 96 -393 383 308 -424 144 31 -487 342 204 -475 423
2203 423 263 -704 232 284 -653 413 560 -792 124 590 -840 20 882 -637 -167 856 -715 -462
2221 -462 1054 -309 -591 867 -241 -747 841 66 -783 681 194 -867 441 374 -648 354 340
2238 340 -749 172 497 -517 107 400 -511 2 377 -406 50 439 -363 -102 285 -330 67 389 -385
2257 -385 -58 341 -401 -18 455 -361 -41 470 -504 -193 665 -302 -269 587 -370 -425 733 -152 -543 647
2277 647 -45 -692 568 139 -654 532 245 -788 350 474 -674 160 483 -623 74 592 -547 -133
2295 -133 562 -355 -172 497 -279 -218 408 -212 -184 416 -155 -271 247 -153 -62 450 -214 -358 241 -136 -96
2316 -96 500 -123 -379 223 -228 -295 605 140 -423 190 -176 -484 534 313 -448 222 111 -598 228 386
2336C86q40O26K24r05N11M66r08K76O09o69K29N30r20o7P77m03K1O53p13l82O65
2357A66k90j33P74l00n68M04j36k29N98r1m68L97ol25L40j59l48N31N2k98L59
2378B70k40o03M77K43k26N55r1r70K29M19k82N42K91q77m6M32n02K68P01n70k14
2399a94M49m64j17O46l65k83O85j34m02L17k91l71O83K07l43K19k40n63L79L01
2419A19n4L58j91o62J70K47j14M00L3n33J76J71l86K22K47l83J82K98m04K5J99
2440A20m73J22N87j85r7J00n86o4O95m5r6K91m83l76M95K9j00M51k09n29L14Q2
2462D3k19L27rl37L04J02l87J28P1k16L03J58l07P3nl68K52L26j79O3Jm58J40
2485a94L84k04O3J93m16J6L15k81%M01l02j73L76j98j86L45j60k13M39l8l69J95
$$ plain form
2336 386 -454 172 396 -509 2 468 -440 -164 445 -224 5 535 -385 -452 325 -78 -57 596 -117 -499 166
2357 166 -124 -257 517 217 -351 53 -83 -312 286 195 -273 124 118 -207 133 -26 -374 157 209 -89 270
2378 270 30 -573 -96 147 -79 476 385 -585 -356 63 -219 323 614 -263 -309 123 -379 -111 590 20 -194
2399 -194 255 -209 -326 320 -45 -328 357 223 -179 138 -153 -524 159 366 23 242 2 -561 -182 119
2419 119 65 423 232 -430 -260 -13 -127 273 306 -227 -51 120 -266 -44 203 -180 2 300 -104 -79 120
2440 120 -353 -231 356 171 74 174 -412 -476 219 174 78 369 -114 -490 5 34 -66 385 176 -353 -39 43
2462 43 -176 151 142 -195 109 211 -176 -48 23 -193 110 268 -39 34 29 -339 -87 239 60 123 124 -334 -194
2485 -194 190 -14 49 242 -174 -158 157 -124 -124 277 -25 -198 178 -20 -206 139 -21 -234 205 167 -202 -7
2507gJ9k11K96R2l13J29O8k50J46J42j39Q4K6k51J15J69j63O2N7j46R7L5j90J56
2531B3J05j99Q2M1k26K10J51l15Q5J99k98N7K93k74pK72l35r4M66j57k44K85j55
2554c5k04M27l5l79K48O8l06K53J79l24M2J27k23J18K80j79j98N8J4R0J25o9j33
2577e6n9K6J46J6o5Q7j42j66K62J31k24Q8l6k70L08K83l96m9J82k53J38M15l42
2600B4k15K66k21p3N36r8m02J56p5j32M87O2m83M9J06j64K90J70l67p0J26j18
2622a46J68K36k35j82K9J2J98J67k07k08jP9K20O4j75p9p1n8K80J52k59%l6k42
2646b94L41L53m13j48J89k55J64N20m09l60L78j22j74N73p3n88K40J00k55M45
2666B12K08o55m8L30j36J90K61m38k29K80KN0K26k21k37O9O9J69J48k29j96J0
$$ plain form
2507 -7 12 -199 97 189 -124 5 73 -177 -31 111 -28 56 82 -169 -54 115 -48 14 71 -75 22 57 -133 23
2531 23 128 -71 11 52 -174 36 187 -128 -43 156 -142 -85 208 -66 -73 199 -136 -230 236 79 -165 120 -35
2554 -35 -239 188 153 -226 22 90 -216 37 216 -108 -66 61 -162 -44 236 57 -141 -83 -69 21 146 77 -56
2577 -56 -115 -89 57 73 8 95 -47 -213 49 180 -44 44 8 -262 46 329 -67 -116 66 -187 -49 366 24
2600 24 -191 75 -146 -219 317 219 -183 -27 -102 -234 253 315 -168 -119 -13 -177 113 283 -84 -154 -28 -146
2622 -146 22 258 23 -159 -130 -118 80 247 40 -168 -169 -90 130 194 19 -60 -131 -189 91 243 -16 -16 -52 -294
2646 -294 47 400 -13 -161 28 -227 -63 457 48 -312 66 -56 -230 343 270 -318 -78 22 -233 212
2666 212 420 -235 -283 47 -89 101 362 -76 -305 -25 -23 27 253 32 -205 -136 -67 102 250 21 -175 -165
2688a65M4K68J26l29j05J20r8K02K72l67j53K21k10J02M67l00l96L09p1o7N06
2709C76j96n49L20J39k60M06N2n99J68K70k95K74K94o00j15M31j58Q0L51m67k86
2730c64M36Nj09K87k08l44K58R2q2K30r5l34R9J31N8J21j62k13J08O9P5J52k49
2753c9j65K62r8p1L93j86m23L57L9k78M71K2o88K77L96m24K05L09o33kN64l43
2775e5o3M82m20l28N49r3k10M48k46m89M75J61l36K65K3m64K48K54k98J23J41
2796A67l14K2K00r1R0Mk37J17J01j30J83l5l00K45J42l30J63J90l62J12K49l47
2818a61J23K86m51M4M26l67l5M32m70r6O53l65l75O42j88m97O17J9o05M63K06
2839C01o38K84L68m88R0L06l74Q0K94l49K2L03k64j7K32k73L8L27k82r4K29j63
$$ plain form
2688 -165 -121 147 273 -56 -161 -41 -139 63 335 -32 -185 36 -174 -72 395 95 -301 8 -63 -130 376
2709 376 180 -369 -49 90 -170 236 288 -311 -143 127 -168 106 400 -200 -315 116 -42 38 389 -78 -364
2730 -364 72 77 -32 255 47 -297 -39 53 -29 201 106 -228 -129 2 60 181 19 -194 -86 -17 58 210 -39
2753 -39 -204 58 -40 -111 282 96 -327 30 69 -209 262 284 -404 -127 269 -155 50 359 -274 -276 288 -55
2775 -55 -118 364 -56 -384 165 72 -138 310 64 -425 50 211 -125 140 163 -301 -53 201 -97 26 167
2796 167 -147 -125 75 -16 74 78 -159 -42 59 -71 112 77 -223 22 164 -166 -3 187 -175 -63 186 -161
2818 -161 -38 248 -203 -159 267 -100 -135 297 -173 -269 384 19 -356 286 98 -399 218 237 -368 95 301
2839 301 -337 -53 315 -173 -83 223 -151 -71 223 -126 -104 199 -65 -82 150 -123 -85 242 -40 -134 95 -68
2861f8j9K49j63m5J28k61N3L20k06L3J98n16RO29k90k34M93l40m42O62J6m57M64
2884B13j0o34M13K98m59K36J14n06L40L57n22O5K95n03K01N75m97j89M04l99j26
2905c34O97q6m06J68j85j31M40N1k14L9j82QL28j91j21K74k44j25N31j64m22K77
2927Hj03j77O29N7o04M9p0j84O82K18o01J07o5n58N99N71n81J5K41o83J29Q00
2949D79m24k97M48k32j62M85k62l78L40J8JL80k74m64J92l6O2O77j43o72N1lq2
2972b96O16J42n32j6j6j89L77J22k98J64k3k88M14M0o00K26L21k71L69K36q83
2993c85j27N53j11K47M71o60m46K96j04K22O67l87m97K16k21k1O94j81n10M14
3013A30j2m05L77M1m77L32L01k75J22m6m71J49L17M1K67j68o43J28K68p1M10J26
$$ plain form
2861 -68 -87 162 -1 -46 82 -179 -126 194 -12 21 219 -297 -288 341 51 -183 310 -30 -472 190 206 -251 213
2884 213 203 -431 -18 280 -179 57 171 -335 5 362 -160 -95 200 -303 -102 473 -24 -213 191 -208 -334
2905 -334 363 277 -129 39 -146 -277 163 214 0 39 -143 -135 193 2 -119 155 -89 -214 317 153 -269 8
2927 8 -95 -272 357 414 -190 -141 -211 -395 287 505 -96 11 -54 -612 -13 558 -23 -8 233 -450 -321 479
2949 479 55 -242 206 -26 -188 297 35 -343 -3 15 16 396 122 -342 -150 -186 -124 553 410 -262 -211 -214 -296
2972 -296 320 462 -70 -86 -102 -291 86 208 -90 74 51 -237 177 217 -383 -157 164 -107 262 498 -385
2993 -385 -512 41 -70 177 648 -12 -458 -162 -266 -44 623 236 -261 -45 -266 -287 407 226 -284 130
3013 130 118 -287 90 131 -346 -14 287 12 134 88 -383 -234 83 124 391 223 -420 -292 -24 -95 315 441
3035D41o65j7K79k61K22L91m42j10L02k62M8K87l94l8N00k05j12K70m92k07P09
3056B44l5k67L91l10n63M65K66k41L33m3o02J70K93j84K34N0l88J65J60l18J65
3077a5J76l13J50K67l54NK12l31P8L99j92j07R6k90P8L70k20k2J97l60j9M21k75
3100d9j00M21k96k73M85r0l24L63o2l44M11N1m21K23R8k75K64J02m05K17J51l67
3122b20K25K29m04Q7K63l35Q3L39l41j12L08j35n3K19k00p5K46j35n6J81j96l3
3144a15K73j78o1K61k45j74L57l4j41K33k09k67M00J5k00K72j59l21L56M8l02
3165a91L47M1m95K59K67m12J52K55m49R6M26l18j51K60k08k6L76j52j77J61j99
3186a38n0L48n2j11J00k48q7L89k2j82J59j49j47L08j9j89J67p5j72K88%k34J96
$$ plain form
3035 441 -224 -241 38 -223 -1 390 -52 -162 140 -122 -74 213 -181 -219 281 76 -36 234 -258 -465 244
3056 244 209 -58 333 23 -540 -75 191 -50 283 240 -362 -192 101 -83 151 201 -187 -22 138 -180 -15
3077 -15 161 -152 -2 265 -89 -84 128 -203 -125 274 82 -25 71 -219 -141 229 9 -13 184 -176 -195 226 -49
3100 -49 -149 272 -24 -297 188 98 -226 137 75 -269 142 193 -228 -5 93 -182 82 184 -221 -4 147 -220
3122 -220 5 234 -170 -83 180 -155 -72 267 -74 -186 122 -13 -66 153 -47 -122 124 -11 -67 114 -82 -115
3144 -115 158 -20 -81 180 -65 -239 118 84 -57 176 -33 -300 100 115 -85 187 28 -293 63 111 -191
3165 -191 156 197 -298 -39 228 -184 -32 223 -226 -130 296 -22 -173 87 -121 -147 229 77 -100 61 -138
3186 -138 -188 160 108 -3 97 -151 -238 151 129 -53 106 -43 -190 118 99 -90 77 2 -170 118 118 -116 80
3209H0r9k32L85J23l75J02M4k98L26K46l72%J65k97J34L22k62k0J42l14R8L67
3231B65k64j16K27k49k4M49k23l03L08q9j74L75k0l23J44J6j57K65P7k50K3k2
3253f5n9K69J6k77J06Qj73K88P1l07J39M1k65K43K06l19K3J19k58K14K70l73n1
3276a34K50k22J7L64k78j94L23j48j62L80p8k81J61Lj01K59m0k67J17Kn7K28n5
3299H7k27J71k9j86K96O2l16J25Q7k44K15J69l45L4J96j85R0J87k94lK25k01L7
3322d9K56k43j00K24j61oL08j99k17K34o5p2K75j36k02K31q0j36K65k2k54K02
3344E3j1k26K81P3l33J05J58k01J30J10k45M6J35j47Q2R7j81M8P6j76J32J52k47
3367h9J5J64j96Q4K17k94l7K77k03n3K90j83j57K73j17j43L16q2k93K38N3k10
$$ plain form
3209 80 -19 -251 134 257 -118 -16 28 -270 56 302 -70 -70 95 -202 -68 254 -8 -28 114 -200 -102 265
3231 265 1 -115 112 -137 -161 288 65 -238 70 -19 -193 182 162 -161 -17 -1 -158 107 184 -66 -43 -65
3253 -65 -124 145 161 -116 -10 -2 -175 113 184 -123 16 57 -208 35 241 -78 -55 64 -194 20 290 -83 -134
3276 -134 116 -106 -89 275 -3 -197 126 -22 -184 196 118 -163 -2 1 -100 159 119 -148 -31 -29 -86 142 87
3299 87 -140 31 2 -184 112 174 -142 -17 70 -174 41 210 -135 -101 95 -90 0 187 -107 -110 115 -86 -49
3322 -49 207 -36 -136 88 -73 -79 229 30 -187 47 -18 -90 185 49 -153 78 -2 -138 127 105 -149 53
3344 53 42 -184 97 170 -163 -58 100 -101 29 139 -106 -60 75 -72 10 107 -74 -26 50 -126 6 158 -89
3367 -89 -74 90 -106 -22 195 -99 -136 141 -62 -115 175 -8 -165 108 -9 -152 164 82 -211 27 80 -130
3389a30K26K6l09J71J51k26J02J21k15L7J10j47R3J31k12J2R6j07R6J12k24K2
3411f4J51j70M5J68j90oJ64j89J0K41j77r0J87j12l4K11j65j24K42q5j23K09p8
3434B1j76K34n0j98K68nk53J78O8k44K11R6l29J30K04k30L8J67k20JK07j64k6
3457g2K00j37r1J49p1oJ39j40o2J46o4k2J25j20n0J55j17m9J85j03q8J56j10l3
3481h0K19j23j62K46n7j89K28k2k23K23O2k76J50J26k43Q6J64k28P4J57k40PK11
3504A10j36qJ53j89k9K10j38p5K27j12j23J53k8j03J73m7j36J24J5p2P6p0m4J44
3528G5n1p1J25q0j16J72l3j26K21l6k43J64O0j56J52N5k43J17J08k39J18J78k46
3551i5O3J90k71nK76j99q9K99j31j69J89o3j29K30Rj71Q7l1r4J45oo0J24p7j57
$$ plain form
3389 -130 96 122 -187 -16 135 -91 11 132 -83 -46 64 -83 10 141 -71 -59 37 -70 26 138 -86 -64
3411 -64 87 -83 -38 130 -60 -66 98 -91 -81 160 -17 -107 80 -32 -66 145 -20 -144 98 13 -110 99 21
3434 21 -155 79 29 -169 99 94 -159 19 87 -157 54 150 -179 -49 155 -75 -37 130 -90 -89 118 -46 -72
3457 -72 128 -9 -100 49 -22 -28 111 -29 -91 55 -9 -31 94 -26 -76 79 -38 -87 98 -5 -93 63 -47 -80
3481 -80 139 16 -146 100 43 -146 82 60 -163 60 122 -154 -4 122 -121 -35 129 -99 -25 132 -108 -101 110
3504 110 -26 -34 119 -70 -99 111 -27 -102 125 13 -110 43 15 -88 85 38 -98 26 41 -31 45 -25 -69 75
3528 75 24 -47 78 -2 -118 54 21 -105 116 80 -163 1 61 -95 57 112 -131 -14 94 -145 -27 151 -95
3551 -95 -32 158 -113 -118 158 -41 -130 169 38 -131 58 -5 -134 96 105 -66 21 -10 -104 41 35 -25 99 22 -135
3576a35J38L2j05J43j2j63J35L6j71Q6O3r3J09J4j67J17Nj73J66J10k05Q3R9k95
3600a83Q0K68j76m9K02j77j08K29j10p9K51j01j44J56r3j08K37l6j79K32j8k83
3622a89J56J15j71J49Q4k31J6J13r2K6R6o4jor6J15N1j38J15L0j94J13J23k35
3646a15P0K10k01k0J64j57m7K02j43m0K09j39j00J91j09q3K66j11k08K54k0k47
3668a74K11P1k22J31J09k38M9J35j18J7J05j06L9K1j31Q5J02j38O9N8j81N6J69
3691A19j55k6J70j14n3J18q5j5J31j22j3J20j00l5J66j51n6K48j44j73K71k8k19
3714a46K29J9k52J56R7k23J20J30j98L5Q6j30R0J06k00K4J32j53M4J47j75j9J70
3737H9j17o5J80n6r5Q6n0oJ03r6k8J16j11J2J53j57n6K04j09j38K34k5k09J90
$$ plain form
3576 -135 3 35 -70 73 61 -102 33 69 -102 -16 47 -46 63 77 -90 27 32 -141 25 135 -70 13 112 -183
3600 -183 -103 165 -11 -60 142 -35 -143 86 -24 -103 148 47 -97 59 -34 -142 95 59 -120 112 94 -189
3622 -189 -33 82 -89 60 144 -87 -71 42 -50 -24 72 8 7 1 -95 20 71 -67 48 78 -116 -3 120 -115
3646 -115 -45 165 -36 -56 108 -49 -96 106 -37 -77 132 -7 -107 84 -25 -108 158 47 -161 93 73 -174
3668 -174 37 108 -114 17 126 -112 -63 72 -46 -29 76 -30 9 30 -101 -16 86 -52 17 75 -106 -50 119
3691 119 -36 -62 108 -6 -59 59 -26 -41 90 -32 -45 75 -25 -60 106 -45 -101 147 3 -170 101 73 -146
3714 -146 83 102 -150 6 103 -120 0 130 -68 -33 53 -77 13 119 -81 -57 75 -78 -34 113 -62 -81 89
3737 89 -28 -93 87 31 -64 22 -28 -34 69 -27 -55 61 -50 -38 115 -42 -98 106 -3 -141 93 68 -141 49
3761D9J9j71J63L5k11R0J14j29Q3L5j90J01J08j86R4J26k14K2J47j51PK13j55
3784aj26J66j2q5J07m6p6J07k2l8R4q2n6R9p2j8K02j04j84J41Lp7J80k4j69Q6
3810gK6j23J34N1j35Q5J2j71J25R1j99R6J51j90K6J42k27j7K59o9r4J23j19j12
3834a42J42K8kJ06j06j60O9K5K7J60j11j46J12j2p4J38K3j41O9L9j04Q2J5j39
3858a02O9P8k7N6m3k05J03J37o0R4K1k35j0J50q3Q3J52j94j10J28m2K6J41j37
3882a0p7J65n9r2J21p6q8K17J0j48O5m1j82J71J70o7ro4j95Q2J91j1K6n2j67L3
3908h7J04l3R0Pj61J5J05o5K8M5j54M2J61m7n0j1j25M4K12m1n5K3j73m2K32J8
3934H2p1R0j61j39K09R0j14O0m4j32J38R9j49K6L6j27J16J25j47j5K2j25J21J76
$$ plain form
3761 49 68 -103 60 95 -116 -26 88 -41 42 77 -113 -12 96 -90 4 130 -84 -62 85 -66 -59 154 -1
3784 -1 -127 39 27 -58 49 3 -73 34 12 -26 68 -14 -70 29 -43 -61 141 37 -147 -6 -3 -80 100 76 -93 -7
3810 -7 19 -104 30 81 -54 31 43 -128 -3 88 -111 -15 136 -54 -28 114 -113 -130 129 60 -34 89 -30 -142
3834 -142 0 28 26 132 26 -134 -65 -40 -13 147 36 -110 2 -10 -84 54 77 -64 5 44 -60 22 37 -102
3858 -102 -33 45 18 74 31 -174 -71 66 6 100 121 -114 -124 26 -57 26 178 -16 -126 2 -40 -14 127 -10
3882 -10 -87 78 19 -73 48 -28 -116 101 111 -37 28 -13 -195 -24 146 79 70 6 -189 -107 84 73 99 47 -120 -87
3908 -87 17 -16 74 81 -80 -65 40 -25 3 48 -106 -64 97 50 0 -11 -136 -92 120 79 24 47 -126 -168 64 82
3934 82 11 101 -60 -199 10 100 -14 46 2 -130 8 107 -42 -16 20 -107 9 134 -13 -28 -6 -131 -10 166
3958A66j01j20J5o4O5J79m8j16j7l5L3J11k5l5j3r6N0J46p4n1L2r3L3J84p5j31
3984h0P2m7JJ54m2j43P6k1o1J82J4j80M3L1r5J59Q2k22k2J24o2N0J08j55n5J05
4010A6k3j1J17q7j05Q3NJ8Q1q5j06P6N7OK7p5q6Q9K7J4K7q2n6O4oJ6J09j17j12
4039a19J19K3n0J12n7j85J43J08j50P0L9j74P3J70j39l0J12j76lK20m1q3M7j07
4063g8l6J87L4j28J5k6k6R8K5o6j0k1k5J01Nm5Nn4k6J57mj17K6m0k7J53N2j66
4091c7KL2p9J22Q9j49pQq6J28J26j70l9N4p6R3J53j76p9J15p1J1J80j11j50J17
4117@k9l9K11n4k22P4O2l1J28Pk01J5J09k6N4J2j16k1N6K9N8l0r2j6J5L5J39o4
4145F3j75O9O0n4J29K6k41M7J44j20O0J47k19r3K08l6l9J73j53j81J93O7q9Q0
$$ plain form
3958 166 65 -55 -40 -104 -39 140 92 -24 -41 -76 -43 68 43 8 -5 -101 -51 95 21 -30 2 -91 -58 126 51 -80
3984 -80 -8 -55 -54 100 58 -85 -9 -30 -91 91 105 -75 -32 -1 -96 63 145 -77 -99 25 -37 13 121 -34 -89 16
4010 16 -7 -18 99 12 -93 -10 -5 13 94 9 -97 -21 36 42 69 -6 -92 -3 24 38 65 -17 -73 -9 -15 1 110 -7 -119
4039 -119 0 23 -27 85 28 -157 -14 94 -56 14 53 -121 -48 122 -17 -47 65 -111 -114 106 65 -18 29 -78
4063 -78 -114 73 107 -21 -6 -32 -58 40 65 -1 -11 -32 -57 44 49 4 9 -45 -71 86 82 -35 -9 -49 -76 77 129 -37
4091 -37 -35 -3 -82 40 129 -20 -27 -19 -105 23 149 -21 -60 -6 -82 11 164 -12 -91 24 -47 -36 144 33 -117 0
4117 0 -29 -68 143 89 -133 -59 3 -28 100 107 -94 -79 30 4 58 70 -46 -67 -11 18 76 46 -46 -62 -47 -12 127 63
4145 63 -112 -43 17 -37 92 118 -123 -76 68 -52 8 155 -64 -157 51 15 -24 149 -4 -185 8 75 -14 66
4169F6l9j63J11R6q3L5Pj53P3R4k8L3k7j36P4R2m5L4j0j55Q0J28q6J4M4j32QJ41
4197G3n7oM2j13l4J56j0l3J8r6j0J34l6l8N7r5k7J38m9o0J25r2j22J96J0j33J22
4224F0j7j92J69J01j84L5J14j70K5J62j23m2J32q8p4J33J0q2L0j8j7N6j4Jll3
4250b9K4M2q3L4P8j15oJ33r4m7J46j01r3J86k6j33J31J8j55J08M7j42Q6P6j64
4275g9M2J01r4J9O6j05MJ01o3j3O9p0rP4o5K4O9r8l0R8n1j3J04j05p7J47j2p5
4303d1O9rr8P4M3p2O5j2q4M0L5J1M2p0q4J02J1m6P1k8j15J15N1j35J01L7j63N7
4331c3J26j10RP5j50nJ90o5r0J00p2q2J52K6j13N4mq6P3O4m6j5k0m2Q4Nl0Pn1
4360d9OJ11j9j08P0l0o5J25M0j09L1J6j31J03J14j10j2K6q6M9J18j05k6Q5o7k
$$ plain form
4169 66 27 -136 -25 71 -12 23 30 -123 -50 44 16 49 22 -114 -40 52 7 41 31 -124 -44 84 -2 12 56 -76 -68 73
4197 73 16 10 52 -61 -95 61 51 18 36 -60 -70 64 28 -10 47 -48 -75 63 14 -46 79 -13 -135 61 71 -62 60
4224 60 43 -149 20 121 -63 -28 86 -84 -59 103 -20 -62 70 -18 -92 41 51 -31 -1 -19 -36 20 6 7 4 -29
4250 -29 -5 37 -46 -12 66 -49 -55 78 -16 -63 83 -18 -111 75 49 -84 47 65 -90 18 65 -77 9 85 -79
4275 -79 -37 64 -30 -11 55 -50 -46 55 -8 -21 48 -22 -31 43 -22 2 71 -27 -57 41 -10 -23 81 -24 -101 46 34 -41
4303 -41 28 19 -79 -5 38 -34 31 19 -65 -25 10 21 63 -7 -91 11 22 -24 47 19 -96 19 70 -65 36 73 -90 -33
4331 -33 93 -17 -8 67 -83 -88 102 37 -53 47 -25 -107 45 71 -42 12 8 -78 -5 59 13 -2 -22 -64 20 25 -5 2 -49
4360 -49 -43 68 49 -59 11 -19 -84 41 81 -28 3 19 -112 -9 105 -5 -17 9 -77 -28 90 -15 -41 44 -23 -25
4386b5Q7q5m2Q4k7kR8p1r7O7jqJ27n0j36M5K1k7J04Oj16L1J6n5O8M5q2j5M1LJ5
4417A9j7o7L3M9J6L7n2j27N8Q6l2Q3kj56k5J18n5N7Q6j38q2J19j2l3R9p1p2J26
4445D5K4j10L1j1n4J05P3q5j0m1q1R2J19k5m3n6q6O7J01lll5n9K1M3k4J2J2n4
4474c5K6P3n5m4nl8P5J31o4j01k7l9P8J38k9p8nj00NJ65Rq4K6p1n4J50K4j23L4
4503a8L6n3Q0L8j35l2Q4KM3P2j28p6K3L8O5Q0p1j00qJ8P4M3m4o2mRL5N1o7l2L6
4534cj7L2P9j00q5O0K2K5Q0p9j28O0O7%P2m5j07mN2J5O6kj11jN9qN3%j19J6R4
4565D3k7NL1j00k1J06jj7K4o9n4Q3N3l9J8n0o4Q4N2k0j4n1k4O6L5j6jn7k1M4K9
4596B7j4M5p4q4J06M7n7L2l4o7Q2O7q1k9M7o9L1R6l1o1K4n6%J19J0q3rk1lP9N
$$ plain form
4386 -25 62 -23 -65 19 -8 -10 88 17 -80 -13 -14 -22 105 55 -81 -36 -15 -42 62 68 -48 -17 -1 -56 12 57 -25 -40 1 4 19
4417 19 2 -65 -32 17 33 70 18 -109 -51 35 3 86 84 -72 -97 21 -34 23 109 -29 -111 8 -4 -37 62 -9 -81 45
4445 45 69 -41 -10 -21 -75 30 103 18 8 -33 -114 -22 97 72 29 -27 -113 -46 55 52 49 14 -45 -24 19 -5 7 19 -35
4474 -35 -9 64 9 -35 -40 -78 -3 128 64 -37 -64 -103 -25 113 84 6 1 -99 -94 71 80 -4 22 -49 -103 47 71 -52 -18
4503 -18 18 -35 45 83 -52 -84 0 2 45 117 -11 -87 -64 -26 39 119 48 -52 -60 -42 32 75 31 -31 -35 -26 9 60 -7 -39 -3
4534 -3 -20 12 91 -9 -94 -34 -12 13 93 14 -114 -54 13 13 85 40 -67 -71 -19 -4 62 60 -51 -52 7 -1 52 52 -67 -51 43
4565 43 16 21 52 -48 -69 37 36 19 43 -26 -80 3 56 17 35 -15 -79 5 57 37 23 -28 -52 14 49 33 32 -25 -46 -2 27
4596 27 13 58 -16 -100 6 53 -4 28 -6 -73 9 76 -5 -34 13 -56 -25 71 40 -21 3 -53 -53 66 76 -7 -16 -37 -40 39 44
4627D4n0Kpj2L6J3l5J1qk5O6rn9K3kj3Q4Jr2MK8k1M9M7q1k2K9l4K6N9l3l7K1l3
4661c0K4N7o1k8N3j7jN8p7l2P6j1l3O6l4p8N8J6j8N5kq9K4M4l6L7J8o3J5M5n2
4692a6ML9l3j0N2l9kJ7l1J0L4j4Jjm7J7P2n3lL5n9LO7n4MN9m9o7Q5Nn4N7j3o8
4726e2O1J7n3K9K3m9J8K0m3K5J7l2MK9l8K1K2m2J4M5n6nM1j8J5J4n8J5M3k7j6
4757a6M6m4j3N4k1l7P0k9l7L2lk7M7rm7N3lm1L6J8m4L1rn8M6L0l3K4Rn3J7L2m0
4790a9L5L3p4j1M2k7L4L1o7j7N3j8jL4j5m3M3j0k7N7l0l7K2K3j9K7j8l2K8K9k5
4821AK3k7j8K9L0n3L0Pn1L3L1m9L3J6n9JP5l2j4Om8QO9rk8J7m7mO5J0l2Ml9pM5
4856A6J7j8om2nN6Pl4K9k8l7P1%m1L1j8n2O5L6n1LRn7M7N8n2k5QMJ2M3k4l3kp
$$ plain form
4627 44 -6 -4 -11 -23 13 26 -9 2 -6 -31 35 26 -33 -10 -12 -25 59 60 -32 -28 0 -21 28 75 -6 -28 1 -33 -7 52 19 -18 3 -30
4661 -30 -6 51 -10 -38 15 -2 -3 55 -22 -54 22 11 -22 44 10 -68 -10 6 -12 43 41 -48 -24 20 -16 21 39 -24 -9 36 -16
4692 -16 -12 27 -6 -16 36 -3 -5 12 -19 -9 25 11 12 11 -36 -19 53 0 -3 32 -27 -24 43 -11 -7 52 3 -64 21 26 -28 29 16 -52
4726 -52 9 26 -27 2 25 -24 -6 14 -29 -4 13 -19 -15 14 -24 -3 19 -23 -9 36 -20 -25 16 -2 13 27 -31 -16 27 0 -16
4757 -16 30 -14 -27 27 6 -31 39 10 -27 5 2 -25 22 13 -34 19 16 -25 11 29 -15 16 7 -51 -5 25 -8 16 25 -28 -11 21 -19
4790 -19 16 49 -25 -36 6 -21 13 44 -23 -40 13 -5 -6 28 13 -30 13 3 -24 33 3 -34 -12 11 -8 19 1 -31 -3 26 1
4821 1 24 -3 -21 8 38 -15 15 22 -29 4 35 -14 19 35 -24 -23 52 20 6 12 -36 -28 41 32 4 21 -26 -30 35 45 13 17 -22 -29 16
4856 16 33 15 9 -33 -38 18 25 -9 20 -8 -45 26 26 -15 16 -2 -54 11 47 -4 -1 8 -49 -2 56 4 -21 -13 -9 3 46 22 -11 -13 -20
4891b0K3N0l1l4j0pL9M7m3l0jj7L3O8m6m4K3pl1P0J8q1J2Rj1N5K1p9qK1J0J5J1
4924B5m4JK7pK1Pn5J1MqN0J3p8j0M9oK7K1o9k5Q0k0nL6l5n3N0J3k0L5j3o6K5N1
4958C2rOj4n7M1L1jJk7k8K9jrM4j3p5L8L2k1J0km9K1P1n0rK8o2L0N1j0l7K1k1
4992ik2O0Ol2Ll3jN4Rk6k3rQM6om3K5k9j0O2J7l9Nk7m8Q4K8n2kJ8n3M4M1n1j3
5027a8L6j6kL0k5k1J8k1K6L4l1l6PjK6L8m7k9L1%kN2m2m2L7%l4N5Po2K4K5k6K7
5061A8J1n2pN2rkOl5pK8RkJ6k7j0nRK3J9l7j6L1j4%M7o4mO2k9l3L7j1m6N9Ok6
5097cK2mo5M3N3m2j1J0l0J0N0k6j0J0k3PK3j8RKl3OL5j5Qqk7J7L6k5j2L4l6PL1
5132B5j7k0K2j0k8L9J4l5J3Ql7M4kj8LLjK2k3j9K5%j4J5J2k4LLj3PM4n2j5L6k2
$$ plain form
4891 -20 3 53 22 -12 -22 -29 10 57 14 -16 -17 -34 -1 67 21 -23 0 -7 -38 32 50 -31 -19 -10 -21 34 55 -24 -32 -11 -1 14 25
4924 25 -19 -18 9 2 23 30 -25 -14 -10 -18 32 45 -33 -43 6 0 27 48 -21 -46 34 14 9 45 10 -43 7 20 0 35 22 -44 -19 32
4958 32 23 29 15 -42 -1 30 29 30 3 -25 4 3 -6 38 25 -50 -12 20 -1 9 7 -42 -21 50 0 -9 19 -43 -13 38 28 -9 12 -9
4992 -9 -31 29 35 3 6 -27 -28 26 35 9 -14 -23 -15 31 25 -18 7 -22 -32 30 47 8 13 -14 -62 22 50 -2 -4 14 -39 5 46 -5 -18
5027 -18 18 2 0 30 5 -16 2 -19 7 41 10 -26 -19 -20 6 44 -3 -32 -1 -1 -3 49 7 -35 2 2 -32 23 30 -32 -8 17 -9 18
5061 18 29 -23 -30 22 13 11 17 -18 -25 3 12 10 26 -1 -11 -16 -7 16 35 -2 -18 13 -1 -1 46 -18 -22 40 11 -22 15 4 -42 17 23 -3
5097 -3 19 15 -50 -7 46 4 -7 3 -27 -17 33 7 -3 7 -16 -9 14 -4 5 7 -26 -20 15 0 8 0 -27 -10 26 1 -11 23 -13 -6 25
5132 25 8 -12 10 0 -28 11 25 -10 3 11 -26 18 16 -2 1 4 3 25 2 -17 8 8 -6 9 21 -3 0 3 -10 -3 41 -11 -26 10 -12
5167a2oM5k2l3M4j9k7L8mk5J3Pk4M1Nl3jRnJ6jj1J9j2nJ4k0lJ5j0k5M6Km0K6J3
5203A5k3K1J7m2qM6k2j4N0k8k8K3mk8M1rk4J5J4j4J7j2j3J3Mj3J5qOPj3j9K2J1
5237A5l3J5J3k9K1J7m1J5L1k2mK8l1mK8j2k5M6nm0OK8k1J0opLRJJ2j3%J3k6j4
5272b2L5%l3K9Lj8J8J7n5K2M6m7QL3n7kM2j9j5M7j4o3M7lk0L8kl1J3JqK3j5j3
5306a5J7j4kJ9rj5L1qoJ2j7k9K6J8k3L4rl5J1K9m0M3J2l0j4K2k5RK7k8nL2j9l
5340dK3l0OK8j5qJ4j9k1L6lj6L5k8m0M0K2j6J7Pn4J6K5k5RJ7oj6JLnQlRPrkok3
5379b6L5K2l4J8J0n2J5O4n9MM5o4k0P2k3l5N7j6l3M1%m8L4J5l9J3L1m6OK6j3O
5411FJ0rj1Nk3K5kj6J5%qK0j6j8L6nk1K5Jk5J9Ol2K1K2m4ML7l8J0L1l0j6M7l0
$$ plain form
5167 -12 -18 27 5 -28 16 -3 -30 8 4 -21 -8 -1 -25 16 21 -12 -13 -4 -9 7 6 -5 14 2 -3 11 -9 -12 3 -7 -32 14 16 -24 2 15
5203 15 -8 13 30 -12 -20 26 4 -10 40 12 -16 7 3 -25 16 7 -17 -2 12 -2 15 3 -10 3 7 -6 9 1 7 14 1 -18 4 15
5237 15 -18 -3 10 -19 2 19 -22 -7 24 2 -2 26 -5 -9 19 7 -18 28 23 -17 -11 17 -4 6 0 -7 -4 5 6 18 5 5 18 -8 -22
5272 -22 13 13 -20 9 12 -6 12 29 -26 -4 42 -5 3 36 -21 -23 19 0 -15 32 18 -45 2 -1 -21 17 15 -16 -3 -2 -10 13 -2 -15
5306 -15 2 -12 -14 5 -4 -19 12 4 -2 10 -7 -36 -10 8 -15 19 10 -25 -14 15 -25 18 30 0 -14 8 -17 -8 19 -9 -14 18 -1 -4
5340 -4 19 -11 -5 23 8 0 14 -5 -26 10 7 -9 26 -2 -42 -2 20 4 21 28 -26 -10 15 -10 -1 16 10 -6 -5 -2 -7 1 -2 7 14 5 3 -3 -26
5379 -26 9 31 -3 15 25 -27 -12 52 -7 -3 42 -22 -42 30 7 -28 29 13 -20 21 21 -27 7 22 -17 -4 27 -19 -13 13 0 6
5411 6 16 7 -4 1 -22 3 1 -15 0 0 -8 12 -4 -22 14 9 -12 13 14 -11 8 14 -18 3 25 -19 -15 22 -16 -6 25 -5 -21 26 -4
5446dk0N5j8k9L4ok9L2J0m5L2J6l3K4jj9J0J7l0J3MrnJ3pj4J1loJ1mJ5j2k2K6
5481GJ2j7J7ol9L9K6m9J1K8n3J4M1l0j7L8k1m6P3Jn6M7Jl8K1L1n5K1J5k8%L4k0
5514BLMk1PJ9J3k0qKPkj1J7kpnJ1k1J8rk3M0J6l8qK8k6nM1j1l2L7l0nM5k1k7M2
5552B0k1k8M5Rm5K5J7l9K4K7m7%L7l5PK8k8JK6k6mK1j1j2J4OMJ2k3LpkNOj6J9
5588A2Nk2PJ4k0OPj3JL2k3k3L9k2j4L3j1k8L5%m2L6K9n9KK6k4ML3k1pL3l2QK5
5623B6k5nK2k1qL8ok5JJ3j6K5pj6LjJ6Mj2j3J7pORk2JK5j8rK5j4k2K9j1j9K9N
5660A7l6J6K3l1J3J1k7J1K3k1rL0j7l2K8Kj2K9k3j6K4Mj9K5j3mNJ3j2NMj1%LP
5695A0llnJ4mj0QPj7J0Nk1K2Kj7QLjMKm0K4K1j7lK4k9jL3k6j3L7k2j4K8j0j2K2
$$ plain form
5446 -4 -24 31 13 -16 18 12 -17 15 25 -20 12 28 -5 19 18 -1 9 26 -4 9 13 4 -1 12 5 -9 2 -1 -7 4 0 15 3 -19 7
5481 7 19 2 19 13 -26 13 39 -10 1 29 -24 -10 31 1 -16 22 1 -45 28 29 -27 20 21 -17 4 35 -20 1 16 -12 -12 22 2
5514 2 5 9 -12 -5 14 27 7 -1 1 8 6 -5 12 10 3 -2 9 -12 6 -3 -26 14 30 -8 -16 12 -14 -19 22 11 -21 16 -14 -19 26 5 -22 20
5552 20 -1 -29 16 25 -20 5 22 -17 7 34 -13 -13 24 -11 -4 24 -4 -3 23 -3 -7 14 3 -9 5 11 15 27 4 7 0 -2 3 9 -7 12
5588 12 17 -5 2 16 -4 2 9 -4 -3 29 6 -17 22 0 -14 19 8 -20 15 15 -27 9 38 -21 -19 7 -17 -13 20 -1 -8 25 -7 1 26
5623 26 1 -4 18 -3 -11 27 21 -4 -3 10 -6 19 12 -4 -1 -2 14 18 6 -7 10 3 9 18 -4 -3 22 4 -5 20 6 -16 13 2 -17 12 17
5660 17 -19 -3 20 -11 2 13 -14 -3 20 -1 -10 20 3 -29 -1 1 -11 18 -5 -21 3 7 -12 13 0 -4 1 14 2 7 11 0 0 3 10
5695 10 7 4 -1 13 9 -1 7 14 -3 7 12 -9 13 15 -2 6 9 8 12 14 -26 -2 19 2 -1 23 -6 -7 26 0 -13 24 2 -12 16 6 -6 16
5733A6mk9J0J9k4QK4j9j0J8j6KJ6%j2J5nqJ4jj7J4Mlj1oK3j8J1nmjQLj5OJ9k8
5771fLPoj4K3j3lK6j8j5J8J3k3K1poP%pJ2j0j0NJ5k1KJ8j3%Oj4rK4j3KJ0lj2J6
5810ElmKOoJ3pmJ4qpJ1MqJ0nj%k1J1J0J1k4J2rLQqj0J9j6rK1Rj9LOj7MJ3j1k1
5852b3M6k4mK1j7nJ4j1j3K1jqKNnLJ1k1LRpkLoMj0OJ0J2j0lJ7j8J1Nk5K2Mj8j
5892cK0l1K1Qj0LNkj7MOJJ1pj6KJjQmj5K4pk0J2QrJ2J0j2nRj6K0Lk2J8Lj7qJ4
5933AO%Qj1pLJnJ6kLmj8J2KNjOqoPkj3J7%qOj6j0K1K0k6J7Nk8J0mj9K9Mj5JQj5
5977a0NJ3j2KJJ1jj9KNM%lOMj7J4%j0J7k3lJ7JrK1pk0jK1j8J4J0j8J1j3j1J4R
6016GlQkj1NMKJKj2NJljPj5QM%k0K9j7qK8l0jK1%k1J8nMj3J0rLJ3k6J5J2rRlk6
$$ plain form
5733 16 12 -17 -7 12 -12 -4 20 1 -9 9 -7 -5 11 11 -1 14 9 1 15 14 -3 11 15 12 1 -5 18 0 11 6 2 1 9 12 -3 3 22 -6
5771 -6 -3 4 -2 -16 7 -6 -9 17 -1 -16 2 15 -8 13 6 0 7 7 0 12 2 -8 -3 12 -9 -7 11 -2 -2 4 -10 -19 5 -8 -6 4 1 -11 5
5810 5 2 -2 0 6 0 13 6 2 16 8 1 12 16 8 18 13 12 12 -9 2 12 23 -1 11 2 5 13 5 -5 14 -2 -11 10 19 0 3 9 -8 -4 9 -2 -23
5852 -23 23 -1 -5 16 -1 -6 8 -3 -16 5 4 -4 -2 3 -2 1 12 -9 -6 3 -4 -6 -3 -9 -5 -15 -9 1 13 3 0 17 -1 10 15 -10 12 16 -2 -3
5892 -3 17 -14 7 15 5 8 13 11 -6 -2 4 5 16 9 -7 -5 -4 -5 3 -1 -16 8 1 -19 -7 1 -8 4 14 2 -3 6 -10 10 13 -9 9 12 -5 -13 1
5933 1 7 7 15 4 -3 0 1 -4 12 10 13 9 -9 3 5 10 9 15 7 1 8 6 -7 10 10 2 8 -8 -18 3 23 -3 14 19 -9 1 -3 -22 7 11 -4 -3 5 -10
5977 -10 -5 8 -4 -2 -1 10 9 -10 -8 -3 1 1 -2 4 8 -9 5 5 -5 12 -11 -14 3 4 -5 16 9 -11 -12 9 -9 5 15 -3 8 -5 -16 -2 7
6016 7 4 12 10 -1 4 8 10 11 13 1 6 7 4 3 10 -5 3 7 7 -13 16 -1 -9 19 -11 -12 9 9 -12 6 1 5 -8 2 -7 -4 9 -17 -2 10 1 10 7 -19
6060a9K4%oNJ3k2J5Jk0J4J4k0mK4j9J3Kj4nK6j9pJ5%j0MjmLKlMo%Nkj0J1kj0J4
6101FKj5K0j0j1J4mk1QK0j0jK0k5rK1mjJ2kj1J3j1QoJ1j6J1j0Nqj4K5kj%KqOO
6141A0lPJ0k1nONlONk3jK4j9NkJ0j0LmKJ3j2jMjj1J0j6%%J7qKk0NJ7oNkRj9J1
6184aJqK3j1qMRoOMk4jQJ5kn%j5J5MLj3lK0nj4J6%j2Mj7LJ6morK7j7lJ3k3J7K
6227CJ1j7LnkJ0QrklkPqmQjmMJ5qjkllOkKJj2J7mJ1mJ5l4J2QOjnj2NPrKMo%Ok3
6277a5L0Kj7JKRqljjK0j2j4JLj0MRojR%qJ2llJ%qLjKLjkMpJ7j7J0oJ3NjJj3jM
6325Fj0J3j4lJ1%Lj2J7j1%LmrJ3j2OQPnj0MmJ7qprJ6plonJ7KmlnpJ3OqnJ4rP%
6371CjolPlMMokJ7rPlqOoPOKpmj1RqJ8j1KMqPMmJj3KPllj3J3N%jJk3RLJ2KjMj5
$$ plain form
6060 -19 5 5 -1 4 17 -5 10 11 -9 5 19 -1 -5 19 0 13 15 1 -4 22 3 -4 11 11 1 5 4 0 3 5 2 6 0 0 5 3 -7 4 2 -8 6
6101 6 8 -7 13 3 -8 6 2 -19 -11 9 -1 -2 18 -7 -16 5 1 0 12 10 -1 12 1 9 3 14 -2 9 -1 4 -4 -18 7 5 4 4 6 -2 4 10
6141 10 7 14 24 3 -2 4 9 6 12 17 -6 -7 17 -2 3 1 11 1 4 0 2 15 3 2 6 5 -6 4 -12 -12 -12 5 -3 -1 -21 -16 1 -5 0 -2 7 -12 -1
6184 -1 0 -8 15 4 -4 0 9 3 9 13 -11 -12 -4 11 9 4 4 -11 4 8 11 -2 -5 15 10 -4 12 12 0 4 -13 -10 6 2 -4 -13 14 -3 -6 7 -16 1 3
6227 3 14 -3 0 -5 -7 3 11 2 0 -3 -5 2 -6 -10 -2 -3 -7 -3 12 4 3 1 -2 -5 1 -1 1 2 -10 7 3 14 10 25 -9 3 11 17 16 11 -1 4 11 2 4 8 2 2 8 -15
6277 -15 15 17 0 1 3 12 4 1 0 -1 19 7 -7 -6 -3 -13 -9 0 -6 -7 2 2 -6 6 3 0 1 1 -7 -4 -5 -3 0 -1 -3 1 -6 11 -6 4 -2 11 16 15 16 3 2 6
6325 6 -4 9 -5 -8 3 3 6 -6 11 0 0 3 -1 -10 3 -9 -3 5 12 7 -3 1 -3 14 6 -1 -10 6 -1 -4 -10 -15 2 4 0 -3 -8 -15 -2 4 -4 -9 5 -4 3 3
6371 3 2 -4 -7 0 -3 1 5 -1 -3 14 5 12 9 1 7 1 8 14 16 9 5 -6 3 -5 13 2 4 8 0 7 11 7 8 -5 -3 4 1 -2 -15 -2 3 3 2 3 -20 -11 -8 4 6 5 9 -6
6423fL%koP%J1oJ9k2%oRJ2Lj7MP%mnPnmKNK1j2j6kjK2j2J0oj8RJJRpqONqMKl2
6471b6J0OOMMk6J6J2Rk0J5rj2OOQlorPOpjJ0jknMJ4mrJQPmnj7OJ4moLlnJ8j3Q
6518A1nL%Mj9J6j5%LRjr%KKOqlRj7KKK2k0J2qj0LLNOj3nNRnPk%NQj0j0KQnRpR
6567A0qnJ6j1mnPj7K5%j4ROj1LNOnj2%PnKMj0OMoQkj3OmNJj3RJ1j3jJ2rQqmKJ4
6614Fo%ojJ2kKjMrJ4Mj4oOj6K2n%OnJ0moqLLNj0RMrKpJ1qOj0J8j4Qj6QJL%KmP
6663IorOjOqLmmMQpPj3J0olQ%kJ5rK%jJ3j7PloJ7j4J5Qk6J2nKmLkrRloJ3oj0Q
6712A%pJ0Lo%MnlpPJ4jpOj1nNRj7J1oLjJmLpJ2OknjkNMmQrkJ0KrJ5j5PJ%qMJ0
6763A7%j6%pJ4l%qNmKLOj9MJ2npJMOl%J2k2Rq%Nnj2J9mnJ3qKJJ3qnQONj3lOJJ
$$ plain form
6423 -6 -3 -3 -5 -11 -4 -4 7 1 20 -2 -2 -8 1 13 16 -1 3 10 10 6 1 8 3 -1 1 6 27 15 -1 -3 -4 18 6 16 10 -8 1 2 3 12 5 -3 3 8 0 4 6 -26
6471 -26 -16 -10 -4 0 4 -22 -6 6 15 -5 10 1 -11 -5 1 9 6 0 -9 -2 4 -3 -4 6 5 3 -2 2 16 12 3 4 12 19 15 10 -7 -1 13 9 3 6 3 -2 16 3 11
6518 11 6 9 9 13 -6 10 -5 -5 -2 7 6 -3 -3 -1 1 7 -1 -4 5 -12 -10 -8 14 -6 6 -2 -12 -9 -6 -1 5 -8 -13 -8 1 -4 3 1 1 6 14 4 -6 -4 4 -1 8 1 10
6567 10 2 -3 13 2 -2 -7 0 -17 8 8 -6 3 9 -2 1 6 12 7 -5 -5 2 -3 -1 3 -7 -1 3 -3 5 3 -10 -4 -8 -3 -2 -15 -6 5 -8 -9 3 -6 2 -6 -10 -8 6
6614 6 0 0 -6 -7 5 3 5 4 8 -1 13 17 3 -3 3 -13 9 4 4 10 5 15 11 5 -3 0 3 8 -2 7 11 2 4 -3 8 0 6 -4 14 0 8 -8 0 1 4 4 6 2 9
6663 9 3 -6 0 -1 5 -3 0 -4 -8 -4 4 -3 4 -9 1 -5 -8 0 0 -2 13 4 6 6 5 18 1 8 5 -1 16 2 17 25 -1 11 6 8 4 7 5 -4 5 2 -4 9 3 -7 1
6712 1 1 -6 4 7 1 1 5 0 -3 -10 -3 11 10 3 9 -2 -7 -2 7 -10 1 -5 -2 -3 -2 -6 -3 -10 2 8 6 1 0 -2 3 7 3 11 2 0 10 12 3 18 3 10 11 11 3 7 17
6763 17 17 1 1 -6 8 5 5 -3 2 -2 0 3 9 -10 -6 6 1 -6 -5 -1 5 2 2 14 -8 1 -7 -7 -2 -7 -19 0 -4 -9 4 -4 -2 -1 12 4 -1 7 13 18 5 2 8 9 10
6812A0jnmMJ1NqpNpJ4j0j4J1nmNM%l%J2orLqKj0J9jpkPo%Omj%QKqRrmOpN%Olp
6864fJ1lpK5k1J6j7ORj1MrJ5KplMkjMJ0rnJ0qrRj1Oj4N%RRj2Qo%p%PLlpJ3ppN
6912bJ2k4QJJ2Nj7J1rq%J6Mlj3NPmkmJ4j0j6J4jJ0JpkNJ1rmJ1qJJ1k3PRj0MNq
6956@LPllmJjqOlJ0qlMLkjKjoJ5j1Oj2LJ0j3J4N%j0mJ5k1J1k%J8j7QJ1j6LOoO
7002A2j3J4mj1J0%JRj1J1j0qKJRr%JMmNrJjpLPrJLoRj0QNrl%ROmoJ1JolRpqpJ9
7053F%J4qlnJPj1QQJqJ3j8J1j2QNpkJj3jJK1Lmnkj4J4j1J1q%J4rqOrlJ1noknM
7100a1J2QnkLlrJ9oj8RmPO%qJ6j3jMJ5nj1Rk%Plo%mLKoJ1j5mJ8ljqJ0LJlkj4Q
7148Dj3qJ5Nj6K0q%MmLmPnNjLkokJ0lj2KMjNJ6qj3J5kkJOlj2KOmL%pQjmLjNLm
$$ plain form
6812 10 9 4 0 4 15 20 12 5 10 3 17 7 -7 4 -1 -5 0 4 4 1 1 13 7 -2 1 -7 -5 -15 4 3 -4 -6 1 -5 -5 1 -3 -4 -4 4 6 -2 7 -2 -6 0 -7 -2 -2 4 1 -6
6864 -6 5 2 -5 20 -1 15 -2 4 13 2 6 -3 12 14 7 4 8 6 5 9 19 10 5 15 7 -2 7 -4 2 -12 -7 -7 2 11 -1 7 1 1 -6 -6 1 4 1 -6 7 0 -7 -2
6912 -2 10 -14 -6 -5 7 12 -5 6 -3 -11 -11 5 9 6 -7 -2 5 1 -1 -5 9 -1 -17 -3 -4 6 7 0 -2 3 14 5 1 12 4 5 16 -7 0 9 -1 3 8 0
6956 0 3 10 7 4 0 1 0 -8 -2 -5 5 -3 -6 -2 1 -1 -2 0 -1 -7 8 -3 3 -9 -6 4 -9 5 10 10 0 -4 11 -10 1 -1 -1 17 0 8 19 3 6 12 6 12
7002 12 -1 13 9 -2 8 8 9 18 7 18 8 0 2 3 12 3 3 4 8 4 9 0 1 0 -7 -4 3 -6 -5 -2 -8 1 -9 -1 4 -5 -8 -8 1 7 3 -3 8 9 3 0 9 2 -6 -13 6
7053 6 6 20 12 9 4 5 12 1 9 17 18 10 23 5 16 4 12 17 10 8 9 -4 -5 -4 17 20 16 11 9 -5 9 -2 9 1 1 15 6 -2 4 -5 -8 3 -2 -8 -10 -15 -11
7100 -11 1 9 4 2 5 2 -7 12 6 -12 -3 -7 0 6 6 -2 14 1 0 4 19 14 3 12 10 10 17 14 8 8 4 7 9 3 14 -1 -5 13 10 9 1 11 14 15 12 10 -4 4
7148 4 -9 -17 -2 3 -13 7 -1 -1 3 -1 2 -2 5 0 5 4 7 5 -1 -3 7 4 -8 -6 -2 -3 2 18 10 -3 12 10 8 9 15 12 0 2 8 4 7 7 0 8 7 3 6 5 10 13 9
7199I%%j0J8j9JL%llM%j0KRNoJRqLj7J1nrJ8pPMj0LoJ0noPJOqRj3K0oloJnJ3L
7248A2k2MMLQLj3RL%j4QNjmlMkkKJlMko%jMjlPM%j0oJ4k2J1J1qoJ%MNjlPj0pK7
7299A5j2KNj2J1j1J8j2km%POj0PLj1J2j1lJ1J8k0j2QJ2j1mRqlpJ2knKoNJ1j6%
7340hJ6qJnMKj0J8rn%Kj3J5Qj5Rjj1J2Rj0%PlMj3MMjjpkP%NLj2K2k4J7jomOKl
7387EMj7NlOOJ1j3kkmRlpMj3RJOj5J2j2jJJ9j1j0ONPkMNj4J6lPj6jjPpK7nj2K
7433A0lPm%KpJ3j3PJk5K1%p%Rkj1QKj6K6k5NJ1j4J3Jj1Om%mmKpK1j5Rj5MPN%K
7478EoRj3oJ7mQplKJ0j3JKkQQpkJmLJKj2RPnkJ0nj4JPLPqj1J1nMkNrJokPLj2j
7529iOLJnRj1%Qlj0RJ3j0QnMOj5RnNkkqRLLjLrRNnQj3Pj0LJ0j0j1PMmPljJ1rl
$$ plain form
7199 9 9 9 -1 17 -2 -1 2 2 -1 -4 0 0 -10 -8 1 6 0 1 10 2 5 -12 -1 -6 -15 3 -4 3 7 -3 0 -6 4 -1 -7 0 1 7 -1 8 -5 15 9 6 0 1 -4 9 12
7248 12 -10 -6 -2 1 9 12 -1 8 11 11 -3 5 10 9 5 2 6 4 2 4 5 2 6 4 -2 -2 -3 1 0 -3 4 8 8 -2 -8 6 -16 -5 6 -2 -8 -7 -7 -3 2 1 -2 5 -5 -12 15
7299 15 3 5 10 -2 9 -2 16 4 2 -2 -2 5 11 1 8 11 0 12 1 -2 9 27 7 -5 3 15 4 0 9 1 -2 -9 3 1 -4 -2 -8 -3 8 -8 -8
7340 -8 8 0 1 -4 0 2 -8 10 1 -4 -4 -2 -15 0 8 -7 2 1 -10 2 11 1 1 8 5 9 -4 0 4 3 2 -5 -7 0 0 5 8 -4 18 -6 11 10 4 0 6 8 5
7387 5 9 -8 -3 -6 0 6 17 4 2 0 -4 5 2 -5 -1 -14 -5 -4 2 -13 -1 -13 -14 -13 6 -5 -15 -9 -4 3 1 5 10 -4 12 9 16 0 -1 -2 5 -2 25 20 8 10
7433 10 7 14 10 10 12 5 18 5 12 13 -12 9 9 2 2 11 9 -2 6 8 -8 18 -7 -2 9 -5 8 9 -2 4 0 0 -4 -8 -6 -13 8 -7 2 -13 -9 -2 3 3 5
7478 5 -1 8 -5 -11 6 2 10 3 0 2 12 -1 0 2 0 8 16 9 7 8 4 7 8 10 -2 7 14 9 7 17 12 -2 -1 6 9 16 8 -3 8 3 7 5 10 1 2 -4 -6 1 4 -8 -9
7529 -9 -3 0 1 -4 5 -6 -6 2 -1 -11 -2 11 1 9 4 8 14 -1 8 3 8 6 4 -4 5 8 11 10 13 4 13 18 13 21 8 15 5 8 18 8 -3 4 8 4 11 8 7 18 9 6
7579FmjJ1j0rOOJ0j4nOPj4%KpJ4nNKj5J4j1oQkQj6K1j3kJ1mj0J8lOlMPrJ4j9R
7623A3ok0J6lPQlo%Nkj1J4j3P%pOJ0j4KPmnJ3nqLkNpJ3lkqlM%LLj4jJ5qmKN%J
7672CQj1J2mklJ2JJmjpK1j3kKqJ2j3OnJ4mq%LpMmLmOnPj6NOj1RLmj1J2Lj0Pmj0
7720a1KOlj3K1pj1J6jJkJ2olOqjRPmLJl%j4K1j8J0KJJk3J6JmLMOj5Rk3K4mmmn
7766ePPj6kLMkJ6j3RpNj3MjnJ6pKJ0kk0J0ppJ8Lj3J8pkkm%J3j0%%J5j2J%ML%l
7812HmpJ4j4J9pJnnOKoqKJ5j5Qj2mJ9j2kj3J9pkJ2j5K7lj7mJ6lnnJ1rQoNMmMM
7857A0J1j4J5k0MLMk1J0LoMlJ0Kj5N%pJ0NnpPOj5J0nQmmNoLoKMnKkoMnJ3j6J5
7903Cj0JJ1krPj6JK2nj0PjjRLp%R%mMnlklK2j1j3R%K%%%LkpLJ2qrJ7j1j8J6j0
$$ plain form
7579 6 2 1 12 2 -7 -1 5 15 1 -4 2 9 -5 -5 -3 -10 4 -1 4 6 -9 5 -6 -12 -4 -6 2 -14 7 -6 -8 3 -1 -11 7 4 10 7 11 18 9 23 4 13
7623 13 7 -13 3 0 7 15 12 6 6 11 9 -2 12 -1 6 6 -1 5 15 1 3 10 6 1 14 9 1 4 2 7 0 13 10 8 0 -3 1 1 4 7 -7 -8 7 -1 -5 -3 2 2 3
7672 3 11 0 12 8 6 3 15 16 17 13 12 5 26 13 11 13 5 17 4 10 5 19 15 7 7 10 3 7 3 6 2 8 3 10 -6 -1 5 -6 3 6 2 -9 3 6 -4 3 -1 -11
7720 -11 -9 -3 -6 -19 2 -5 -16 0 -1 0 -2 10 4 1 7 -1 -2 7 14 10 13 14 11 11 -3 18 0 10 12 13 14 -9 7 8 4 7 11 17 2 11 -12 12 8 4 0 -5
7766 -5 2 9 -7 -9 -6 -2 -4 12 -1 8 1 6 -7 -3 -4 -9 7 0 2 12 10 -10 0 -7 -14 4 7 -6 12 5 3 1 -3 -3 10 0 0 0 15 3 4 4 8 11 11 8
7812 8 4 -3 11 -3 16 9 10 5 0 6 8 2 -6 -4 11 -4 4 -8 -12 7 -5 -7 -20 -1 -8 -10 2 -13 14 11 -6 -10 6 3 -2 -7 4 -5 3 -3 2 6 2 6 10
7857 10 21 7 22 2 6 9 13 -8 2 5 -1 3 0 10 12 -3 2 2 -5 5 10 5 -2 5 11 -4 6 1 9 5 1 6 0 3 -3 -1 3 -2 0 -2 -8 -4 -9 4 -12 3
7903 3 -7 -6 5 3 -6 1 -15 -14 8 3 -7 0 -1 -2 7 10 3 3 12 12 8 12 7 4 2 -1 21 10 -3 6 6 8 8 8 8 11 9 2 5 17 9 0 17 6 -12 4 -6
7950fj0J8qQMj3LOnLJ4rj9ONpJ3j1pJ1Nj7J1KjLNj4J2NJqJ4nK%j5MRlj5J3OpJ1
7995A4qOjqJ1ooRLj5oJ2kJJMj0KN%%Qj8J1mrMOj5J1Lj0jjj0NJ7k3NjmK4j2J5l
8040Djj0J1OJoLj4PK1j4j5K1j1pPNj1K1kloKMnPk3J2QrLlJlpJJJ4k8J1lO%J3q
8085ApOJ2k9J3j6RN%jJ1Oj1LjmJ0qLJ4j5jj4J8JkJ5k1J7kj1J3jnNlmlJ1j2JML
8128A0kLj0jmOqJ5Mk0J3j3J2J5l0OKk%oOoJ7ojJj2OJ2kj3LJ8j9MRkk0QjJ3J1j0
8171FJkKMnJ4kJmKj3OlJ0Kopjjn
$$ plain form
7950 -6 -16 2 -6 2 6 -7 -4 2 -3 0 14 5 -14 -8 -3 -10 3 -8 -15 -4 1 -16 -5 -3 -4 -1 4 -10 2 7 8 0 14 9 11 11 -4 0 9 6 -9 4 10 3 14
7995 14 6 12 11 3 14 8 2 11 14 -1 -7 5 3 4 5 9 -1 1 6 6 6 14 -4 7 3 -6 -2 4 -11 0 3 -7 -8 -9 -19 -14 3 -20 -15 -16 -20 4 -8 7 4
8040 4 3 -7 4 10 11 5 8 -6 1 22 8 -7 14 3 -4 3 8 -3 18 16 13 7 9 13 8 15 -8 4 12 3 6 3 4 1 -6 -5 -4 10 -18 -7 -10 -4 -4 9 1
8085 1 -6 0 12 -17 -4 -20 -11 -6 -6 -7 4 10 -1 2 1 -3 7 -1 2 16 1 0 -14 4 5 3 18 -3 14 12 1 14 13 8 13 10 6 3 14 2 3 7 10
8128 10 8 11 1 0 -4 2 -6 9 13 -7 6 -7 5 20 -10 -4 -2 -4 -4 -10 -4 -10 7 1 0 1 -11 -5 7 5 -8 -5 13 -6 -2 7 5 -15 -7 -8 5 16 6
8171 6 7 5 7 11 6 20 18 19 15 17 4 10 7 17 19 13 6 5 4 -1
8191a
$$ Imaginary data points
##PAGE= N=2
##DATA TABLE= (X++(I..I)), XYDATA
0@%%%%%%%%%%qJ6j6J6j6K4l2L2m0M8n6O5p3Q8j04J19j35J53j70J91k15K42k74
33a45L06l43L84m27M75n26N84o48P17p95Q77r70J077j194J329j483J658j865K110
52A121k405K771l236L852m710O003q189J2788l7237M4973L5923r6961N8909K9445
66D3047q9804J8067P4839n3722q235M5587l7167k0330M5487j3964j3767K2759
78A2797j7272j0254L1722j2790j7648K0366o945j5765K5229O830k1321l829P697
91a183Q35k797N142J4527j6523k4184K9049J2802l6029J9108K6380m8827J957
104a9743N3625l4359k6509M7363j7268l1727M8288K03m1989K4934K372k9020L6324
117A2494J0298l9230K0258M567m0849L6453L0753n1760Q906L4468m9192k65N7461
$$ plain form
0 0 0 0 0 0 0 0 0 0 0 0 -8 8 -8 8 -8 16 -16 16 -24 24 -32 33 -40 48 -56 63 -72 81 -89 102 -113 129 -145
33 -145 161 -182 202 -225 250 -276 308 -340 377 -418 459 -511 566 -628 701 -782 876 -989 1121
52 1121 -1284 1487 -1749 2103 -2607 3396 -4793 7995 -29242 15731 51654 -45307 13602 43047
66 43047 -46757 -28690 46149 -7573 -15808 29779 -7388 -27718 17769 3805 -9962 12797
78 12797 -4475 -14729 16993 4203 -13445 6921 -24 -15789 9440 16270 -5051 -8880 -1183
91 -1183 -348 -3145 1997 16524 1 -24183 4866 17668 -18361 747 27127 -21700 -19743
104 -19743 33882 -477 -26986 20377 3109 -28618 19670 19873 -22116 2818 5190 -23830 12494
117 12494 22792 -16438 3820 8387 -32462 3991 34744 -17016 -8110 26358 -22834 -23099 34362
130C4362l0289k8616M2760j1690l3055L4325R680l0754R833J3092j3450J842N629
143C669n092l54j293M572P170j1552l336J0849q467p60J5952j0694q596J3166
157E234r273k846K1189j4070j3789K4355j0092j7535L2883m692l5749K8242J3543
170A7400l7113J9757K5263m0669%L4794k3297q872L1010j6202j9581K3528j314
183D704j2705J5284l478j2644J1779j484p673J2574l614j0892J2403n12j1612
196g870J0486K273j1232P101M373q157K602N99l564O927j492n297O994n234o897
211h388J4957o21j3764J0943J449j5892J2091R994j5823L626P529j4385N238J2867
225I821j2385K53Q848j3639K430J5367j3313l556J5848j2349p666K0163n947j4657
$$ plain form
130 34362 4073 -24543 18217 6527 -26528 7797 17477 -13277 -3444 9648 -3802 -1960 3669
143 3669 -1423 -1777 -3070 1502 8672 -2880 -6216 4633 -3834 -4594 11358 664 -7932 5234
157 5234 -4039 -6885 14304 234 -13555 10800 708 -16827 16056 11364 -24385 3857 17400
170 17400 -19713 44 25307 -15362 -15362 19432 -3865 -12737 18273 2071 -17510 6018 4704
183 4704 -8001 7283 3805 -8839 2940 1456 -6217 6357 2743 -8149 4254 3742 -7870
196 -7870 2616 4889 -6343 758 5131 -3026 -424 175 -3389 3538 2046 -3251 3743 -1491 -8388
211 -8388 6569 5948 -7816 3127 4576 -11316 775 10769 -5054 -1428 6101 -8284 -3046 9821
225 9821 -2564 -2311 6537 -7102 -4672 10695 -2618 -6174 9674 -2675 -10341 9822 3875 -10782
239a0782J5568O54j5146J1878O464j5186K987Q935p103N48N340n558j666L359
253B92m5J965q74l893K295j27j859O009n18p300K901J620l218O512P54r179L067
270a598L082n695P047M431j2178J329P717q603K671J1674j0694o829J1042l428
284c2m933J1475k469j1082O598L119n967N395K051p749K028L237l624L355J926
299C328o252J224L595l205J960K654n696n74M974j196j021J794k495j569K547
314F8J226L11q86k463L91Q92J55L236m09n646P09L206j549K444K309o149j516
331c671M620j400N28M370m563m203M452K1j114N083k332o449L587K646k812L380
347B143J056o520O36M537k051M62K853m106k457L712P66n26J376k080k540K017
$$ plain form
239 -10782 4786 5440 -9706 2172 8636 -6550 -3563 5372 -1731 -1183 4157 -1401 -3067 292
253 292 247 2212 1338 -2555 -260 -387 -2246 3763 3245 -4055 -1154 466 -2752 3760 4514 -4665 -1598
270 -1598 1484 -4211 2836 7267 -4911 -3582 4135 -4468 -1797 9877 -817 -7646 3396 -32
284 -32 -4965 6510 4041 -7041 -443 2676 -3291 2104 4155 -3594 -1566 1671 -1953 1402 3328
299 3328 -2924 -1700 1895 -1310 650 3304 -2392 -2966 2008 812 -209 1585 -910 -2479 68
314 68 1294 1605 719 -1744 -1353 -461 -306 2930 2521 -3125 -2416 790 -759 1685 3994 -2155 -3671
331 -3671 949 -451 77 4447 -116 -4319 133 154 -960 4123 1791 -4658 -1071 1575 -1237 2143
347 2143 3199 -3321 -2685 1852 -199 263 3116 -990 -3447 265 1031 505 1881 -199 -2739 -722
363g22J891n4o1j506j360J089J407N64k39j580r62O60J152J459k29k624q50J308
381f57Q64J671L24l575j312K425N59P57J660k989l001K374J477J5K125j629m485
398c397J297L091r3J073l51m250k27L725M91k63M70k746j879K795K014m22k80
415A048j635j992J375K897M64j644j646n70P44J858J349j395k460R0J184O13J455
432A735m7l132r20K234R31N88L85k858j870K650J843l74L2j757k142J856K368
449A522j69k92j314k152R90K553O26m30j683k093J053K511N27m28j414k016Q84
466a325K350K74l18p09k012R0K373P13m53p43j818l3K270Q58n97r53j542L42K073
485H40K82n53l07j573j09K275K64p77J01j552p20K660Q49j602n2p98j027K496
$$ plain form
363 -722 1169 1115 1054 -452 -1812 -723 684 1248 1009 -571 -1533 -873 279 1738 1509 -1115 -1965 -657
381 -657 207 1878 2202 -1373 -2685 -260 299 1056 2716 -273 -3274 -900 577 592 2717 1088 -3397
398 -3397 -2100 991 898 1971 1620 -2630 -2857 868 1359 1096 1566 -1180 -3059 -264 1750 1328 1048
415 1048 -587 -2579 -1204 1693 2157 513 -1133 -1703 -959 899 2248 853 -1607 -1517 -333 280 1735
432 1735 1688 -1444 -2364 -130 801 1389 1774 -1084 -2954 -304 1539 1165 1197 -560 -2702 -846 1522
449 1522 1353 1061 -253 -2405 -1415 1138 1764 1334 -349 -2442 -1389 1122 1649 1221 -193 -2209 -1325
466 -1325 1025 1299 981 272 -1740 -1650 723 1436 983 240 -1578 -1611 659 1517 920 -33 -1575 -1233 840
485 840 1122 569 262 -1311 -1420 855 1119 342 443 -1109 -1829 831 1680 78 26 -772 -1799 697
503F97J321k162l29K76j240J474J934j738r73O19r50P24K144j008j647J88j00
520g70Q32J460j019j242J97k61R15J461j366r92Q93q56J20K296j014j825J253
537H2k26o67K200m89k523J400R55j186J342r4k640J297J769j502P98P93k935J46
555a480K598q60k9J276k476j087K689K28p45O71j423p28K029Mq10O35j257n12
573a277K391r3j327P66j289j295K946J252j776j47j012j397K466J644j253j5j059
590d75j660K292J147j772J288Pl093K080K546l197j69K127k457O60L831k639k857
607b341K011l74P8L394j195l023P05p13L4L936l88l116R60q92j574M072J080m015
625a361O67J465k026J474J725k921n96J928j48Q54L82k545m64Q24j1K812J053
$$ plain form
503 697 2018 -144 -473 -197 -1437 37 1971 233 -740 -121 -1071 -347 1797 789 -858 -670 -770
520 -770 62 1522 503 -739 -542 -803 112 1573 207 -785 108 -748 -628 1668 654 -1171 82
537 82 -144 -811 1389 900 -1623 -223 732 -454 888 794 -1846 -549 1220 -282 516 1309 -1626 -1480
555 -1480 1118 258 229 1505 -971 -2058 631 859 114 785 -638 -1366 663 667 -143 492 -765 -1277
573 -1277 1114 1021 -306 460 -829 -2124 822 2074 298 151 -861 -2258 208 1852 599 584 -475
590 -475 -2135 157 1304 -468 820 827 -2266 -186 2360 -837 -1006 1121 -1336 -676 3155 516 -2341
607 -2341 -330 -704 -626 2768 1573 -1450 -745 -1458 -1424 2512 2124 -992 -32 -924 -2498 1574 2654 -1361
625 -1361 -694 771 -1255 219 1944 -977 -1573 355 207 1061 1443 -1102 -1566 -742 -753 2059 3112
642C112m254j083J757r40J917L136l216k544J789n34J75K676j221j595J049j080
658h56M33K464k671j478L525j060j388L880k391m953M402K563l477K471J284n856
674c108K50M359j197L21J940l407j605K262O5R51J069k932k10K362j719M8K377
691A826k662j176L587n55j798J631j233j804K373J036k60L25k640r26L007n71
707A60l52L042k875l470M325N34l507L502J160n111J528L267k982P8K097k318
723i22J98K123j411L2K41k263K102K188l307Q01K407m424m0N245k494k284L918
740B110k002l293M168R08l052J464K81j905J645K30j257J617q92j609K786l97
756H02k612K785J78l517K551J988l393O72J753k282P52J541j853P45N74k168J968
$$ plain form
642 3112 -1142 -2225 -468 -1408 509 3645 429 -2115 -326 -860 -685 1991 770 -825 224 -856
658 -856 -423 2041 -630 -2108 1417 357 -1031 2849 458 -4495 -93 2470 -1007 1464 2748 -3108
674 -3108 -2858 1501 304 625 2565 -842 -2447 -185 -120 831 1900 -1032 -1242 1120 -599 -551 1826
691 1826 -836 -2012 1575 1020 -778 853 -380 -2184 189 1225 965 1290 -1350 -2276 731 160
707 160 -192 2850 -25 -3495 830 1364 -2143 1359 2519 -2592 -1064 2203 -779 -701 1396 -922
723 -922 -724 1399 -12 20 261 -2002 100 2288 -1019 -218 2189 -2235 -2275 2970 476 -1808 2110
740 2110 108 -3185 983 1891 -1161 303 584 -1321 324 554 -703 914 22 -1587 1199 802
756 802 -1810 975 1153 -2364 187 2175 -1218 -546 1207 -1075 -323 1218 -635 110 684 -1484 484
773D84R78l490K274K317m955J126M697m550j336N463k907l147N155p18m125L394
789F60J016l257J581R56j766J207j05j296J887o27j657K662o03k780L034O12l627
806b103K247J809l419R30J966k417P60J567k320O97J305k255J446J469l437J278
822d77K799l833K09M057l404j569M299j856k237L751r34k946K646K54j681J951
838A029p31j639K237r35j512L325r02l050L259J4l735L340J698m453J556K747
854B248l495K29K647k394r5K423j697m21J297j718L87J771j686N53J665k899l57
871a542K771j526l22K589k050j521K391j010r43K502r54j213K042j603j409L099
887A301r89k015L410n09l404K708M98l457K793K302l657M69J946k893K80K745
$$ plain form
773 484 1462 -2028 246 2563 -2392 -1266 3431 -1119 -2455 3008 101 -3046 2109 1391 -2734 660
789 660 1676 -1581 0 956 -810 397 292 -1004 883 256 -1401 1261 658 -2122 912 1524 -2103
806 -2103 144 1953 -1466 -536 1430 -987 -227 1340 -980 -283 1022 -1233 213 1682 -1755 -477
822 -477 2322 -1511 -1302 2755 -649 -2218 2081 225 -2012 1739 805 -2141 505 759 -922 1029
838 1029 298 -1341 896 -39 -1551 1774 872 -2178 1081 1095 -2640 700 2398 -2055 -499 2248
854 2248 -1247 -1018 1629 -765 -860 1563 -134 -555 742 -976 -589 1182 -504 49 1714 -1185 -1542
871 -1542 1229 -297 -619 1970 -80 -1601 790 -220 -1163 1339 385 -828 1214 -389 -1798 1301
887 1301 312 -1703 1707 1198 -2206 502 1000 -2457 336 2638 -1019 -550 1396 -1497 -1217 1528
903A528j480j93J508j984n63J590q80M61J555j837l15J584j836l86K424r58o73
920d55J884j488j507J937l88q25K107m80j534J202q63j264K432K56j636J533k58
937F53k361J462Q67j631J581J154k314j6P93j392R62J512j189K04M51j996L09
954i51J537r21P46J292k311n94J801j204k63K343q65j362J430q47j388J921M32
971G96j159J028l9j552O05L69o79J152N46j235k1M5o83Q85N73p08L79M8r84M22
991b12L70o25P87L35j181N87O07j448K88J092j007M10J313j565q58J428m98m65
1009f42J684k97j435O77r7q50J227P37j012q6J24n88L97M81l02J51J06m41N7k4
1029a33j78N36R0m63L49J3p45L50M30m42N33L10j183k5Q63l71K9O80p43m89P90
$$ plain form
903 1528 48 -145 1363 -621 -1184 406 -474 -13 1542 -295 -610 974 -862 -1248 1176 218 -455
920 -455 1429 -59 -1566 371 -17 -842 1265 785 -749 453 -410 -1674 758 1014 -622 911 653
937 653 -1708 -246 621 -1010 571 1725 -589 -605 188 -1204 -242 1270 81 285 736 -1260 -951
954 -951 586 -335 411 1703 -608 -1202 599 -605 -868 1475 610 -752 678 -169 -1557 364 796
971 796 -363 665 626 -926 -321 48 -631 521 1067 -168 -189 -144 -827 58 631 -77 302 350 -634 -212
991 -212 158 -467 320 655 -526 61 668 -780 -492 600 -407 3 1316 -249 -1107 321 -177 -642
1009 -642 1042 745 -690 -13 -110 -960 267 1004 -8 -94 30 -558 -161 320 18 169 275 -166 -109 -133
1029 -133 -311 225 315 -148 201 214 -531 -181 249 -193 340 650 -533 -558 305 -66 -37 643 -100 -589 201
1050B01j61l48P56j57p87L38K81j88L79j10o31J87L25k9K25j96m20L06L7k73N62
1071B97J11p43J82K75m45M25N11q60j81P31k91k71N66k17m43N24L5n16K88K86
1091B64l41m6K48l0j40n9J06L7k2K02j13n70L24O04m80r6M77o04l12R48j56o04
1113c63Q08j61j163P33P79q07J63N32j039n4J142m33n37P73k06p45N22L72m21
1132a05J53K03m52j14M66R7l54l8L01j33k54L47K1l99L57K49o80J52O39n63j93
1153c00O83l64l28O03l21m10Q15o1o74M10L8m36O02N7o58M29J07o44M78L77o02
1174a99K77J86q27M20P46p31p7N61o33p9P90m12l25O37k66n35M93J86k62J15k2
1195D3k05P2J52J03j85j90M57o0o53N48L77q95M13O64j208J98J309j230m68J723
$$ plain form
1050 201 40 -308 448 291 -496 -158 123 -65 314 204 -427 -240 85 56 281 85 -335 -29 8 -265 297
1071 297 408 -335 -153 122 -323 102 613 -247 -428 303 12 -259 307 90 -353 171 206 -310 -22 264
1091 264 -77 -123 125 95 -45 -104 2 39 17 219 106 -464 -140 464 -16 -112 365 -239 -551 397 241 -363
1113 -363 445 284 -879 -146 633 -174 -11 521 -518 -572 570 137 -400 373 167 -578 -56 316 -105
1132 -105 48 251 -201 -315 151 248 -106 -144 157 24 -230 117 138 -261 96 345 -335 -183 456 -107 -300
1153 -300 383 19 -309 294 -27 -437 378 317 -357 53 91 -345 257 314 -344 85 192 -452 26 403 -199
1174 -199 78 264 -563 -143 603 -128 -205 356 -277 -356 434 22 -303 334 68 -467 26 212 -50 65 43
1195 43 -162 -90 62 165 -20 -210 247 187 -466 82 459 -436 -23 641 -567 -369 940 -290 -758 965
1215I65q30j137J662k69j479J650L22j995J030J077j726M30J322j448j32J347
1231G89j012m24J375m89q30P70r4m26O19l6m59J96Nn8J17j32K64O8o58K94M23
1252C02o41M08N17j151K89J021j173n8J377j088m55J510j019p88J913o88j377
1269a101J812k39j653J726J89j940J574P11k302J081J358k080N66J587k032OJ997
1286A260j578o09K018r91j098J639m17j072J404k8j255P40L57o73L41K06l23J10
1304C1j43N8K40m51L86M21j193L22J276j378j62J736j474p62K352j150j610K674
1322A173m55k501K400N53k823J973J261l174J209K198k915K72K625k379n33K642
1338A526j807j099K741j016j684K188l41j744J718J79j564J215L87j455O21N74
$$ plain form
1215 965 135 -1002 660 391 -1088 562 884 -1111 -81 996 -730 -300 1022 -426 -558 789
1231 789 -223 -647 728 239 -591 179 85 -341 278 242 -217 -21 -16 -74 43 -89 175 243 -415 -121 302
1252 302 -339 69 586 -565 -276 745 -428 -486 891 -197 -652 858 -161 -949 964 276 -1101
1269 -1101 711 472 -1181 545 734 -1206 368 1079 -1223 -142 1216 -864 -298 1289 -743 -737 1260
1286 1260 -318 -927 1091 100 -998 641 224 -848 556 528 -727 13 370 -303 38 244 -79 31
1304 31 -112 -54 186 -265 121 542 -651 -329 947 -431 -593 1143 -331 -1093 1259 109 -1501 1173
1322 1173 718 -1783 617 1170 -1653 320 1581 -1593 -384 1814 -1101 -829 1796 -583 -1116 1526
1338 1526 -281 -1380 1361 345 -1339 849 508 -1236 482 661 -903 312 699 -756 -135 439
1354D39p16M18J22n80L85o8k56O33l99k97Q71p75n32J522n80j001J551n82j366
1373a211K028j61k038J998M01k584J767J175k844J379J913l198N31K842k811n09
1389a322L227k131j396L280j377k225L093k15k597K276N15k562J513J055k218
1404a084R41J359j810J31J198j107J4R47p12q3N64m02m2k8j87O99k25o13J036
1423E96m54j242J510J28j626J777N71k771J128J657k480Q20K394k683m30K660
1439A555k209j009L335j179j865K666r08k400K672K51k409K280P62k975J125J265
1455I57k311J137J994k163j93J585j703m09J915n30m63J026q64q07P50k9O5N94
1473E51l77mM2r94L62P74o00O70O56j669PJ015j392M58K075j435o31J504j874
$$ plain form
1354 439 -277 141 263 -317 68 0 -256 377 -22 -319 552 -223 -755 767 187 -814 737 155 -1211
1373 -1211 817 656 -1382 616 1017 -1567 200 1375 -1469 -90 1823 -1375 -844 1998 -813 -1322
1389 -1322 1905 -226 -1622 1658 281 -1944 1149 934 -1663 613 1128 -1434 79 1134 -1084
1404 -1084 -143 1216 -594 -463 735 -372 -358 589 -123 -206 358 -44 -86 -114 -301 398 173 -440 596
1423 596 142 -1100 410 538 -1088 689 1260 -1511 -383 1274 -1206 -386 2008 -675 -1105 1555
1439 1555 -654 -1663 1672 493 -1372 1294 386 -2014 658 909 -1500 780 1542 -1433 -308 957
1455 957 -1354 -217 1777 -386 -579 1006 -697 -1106 809 279 -184 842 -22 -829 -79 -108 -43 551
1473 551 174 170 212 -782 -420 354 -246 424 1080 -589 -582 433 -959 -501 1574 139 -492 1012 -862
1492h62q29K901o69j480K412q31k708K191O24k266K249J304l168N25J641k425
1508a391M69K627j553n83J696j744j243K087K6o36J379n59j509O26N4l81J187
1525E52L43p13p7n33l51P04J48J75O09p30n16M38q05J1J714m09p85J044r86j364
1545a531J691K96j082J708J02k449P17R40j491J232J534j983r9J210j824r0K171
1562A052q35m95J489j339j245J656k25q38J750j7j594O15m9j063J282Q82r86J60
1580B00J04j083K70O92j82M69J63q57p5P7k31O94K18n27M45j28j003N65M06o38
1600d21Q60M40j425K78P11j246M39J400j081k38J089j321n17J752m80q31J376
1617G85m71j267J164P9j105J172M24j321M81M80j066M66P16q10K99N80r47o9O32
$$ plain form
1492 -862 -1691 1210 541 -939 1473 642 -2066 125 749 -1517 732 2036 -1132 -607 1034 -1391
1508 -1391 -922 1705 152 -431 1265 -479 -1722 365 391 -245 1134 575 -934 -308 -254 -635 552
1525 552 895 182 105 -428 -779 -75 73 248 857 127 -389 49 -756 -745 969 560 -225 819 -167 -1531
1545 -1531 160 456 -626 1082 1184 -1265 -548 392 -1099 133 1667 -316 -415 795 -1029 -1119 1052
1562 1052 217 -278 1211 -128 -1373 283 58 -780 970 953 -641 -26 -75 -1138 144 1026 40 200
1580 200 304 -779 -509 183 1 470 633 -224 -299 -222 -453 241 459 -68 377 249 -754 -189 217 -421
1600 -421 439 879 -546 -268 443 -803 -364 1036 -45 -283 806 -515 -1032 720 240 -591 785
1617 785 314 -953 211 290 -815 357 781 -540 -59 421 -645 -179 537 -273 26 606 -341 -410 222
1636B22l95J98N27o89p7M54n28J01O11m80J8L99p10L9P90n61j52O54n62k02P98
1657D55n28l85R36l48o00P81k35n64Q43j39p30P77K0q23O69K13p62O23J96j004
1677f05N19N96q53K85N80q97J20P28p63J3Q78o67l22P13m19k50P42l54l95O71
1697C20k01m64M83j10k68N32j47m22M53j05l99M87m1l06N23k01n91N75O6n01N52
1718B35P3o89N06J67q22N00N27p27K05M30p90J41O67o50K0P38o00k55N72m18j00
1739b70P52m04m16O02k74l66O05j19l65N74k18n78N80R1m48M23K6n39M42J06n48
1760c44L95K54n15K08J90m47K90K74n07J29L12l85J47K07l90J92K53m89J28L97
1780B99m38J02L31n90J46N95n93j10O73n02k54P07l76l70Q03k89o44P00M6n97
$$ plain form
1636 222 -173 25 552 -137 -214 240 -288 -187 424 -56 -38 361 -349 -310 480 -81 -233 421 -141 -343 455
1657 455 -73 -458 478 130 -470 311 76 -488 355 216 -514 263 283 -540 129 342 -420 203 399 -605
1677 -605 -86 510 -343 -58 522 -375 -255 473 -290 -277 601 -66 -388 325 -94 -344 398 44 -351 320
1697 320 119 -345 138 28 -240 292 145 -277 176 71 -328 159 118 -188 335 134 -457 118 184 -317 235
1718 235 308 -381 125 292 -530 -30 497 -230 -25 405 -385 -244 423 -227 -207 531 -69 -324 248 -170 -270
1739 -270 482 78 -338 264 -10 -376 229 110 -255 319 101 -477 103 194 -254 169 195 -344 98 204 -344
1760 -344 51 305 -210 -2 188 -259 31 305 -202 -73 239 -146 1 208 -182 10 263 -226 -98 299
1780 299 -139 -37 294 -296 -150 445 -148 -258 415 -87 -341 366 -10 -380 423 134 -510 190 236 -361
1800c61N36Q2o46M49K56o25K76L50m90J06K19l80K19L15m22M2K01k98J50J93l01
1821a29J93J86n04J32K93l16K26K60o18R9N08n22K4O15n04j73N47m84j90Q27k92
1842A78n22N72j72m59O37m4n14N44j0o01M27J52m25M02N4n94M19K21n42L00K62
1863B85n41K49K40n55K96M14n80O2L59m67J81L95n32O3M53n52L6N41m76K1N22
1884D14o60j39Q13m32k92P09m38m18P81k81n02Q50j36p16N77J8n49O73Q5p59M73
1905G1J99o70M41K95n84L26J96o67L14M43n15J72K04n57K90L01n55L35L58p26
1925c29K15M18p20L94O42r90N2Q52q39q0J061q02l76J118o84o49J248k53q65R63
1945C76j71q93R81J29r93P64K74j021N37M15q09N03M21r19K48N15o46K59M40o70
$$ plain form
1800 -361 175 257 -389 60 316 -309 -33 317 -173 -67 152 -228 -9 306 -116 -74 127 -171 -21 172 -129
1821 -129 64 250 -254 -122 171 -145 81 341 -277 -178 330 -192 -168 447 -57 -230 317 -167 -357 470 178
1842 178 -344 228 56 -403 234 190 -324 220 210 -391 36 188 -237 165 219 -375 44 265 -277 23 285
1863 285 -256 -7 233 -322 -26 388 -192 -130 229 -238 -57 338 -194 -131 322 -230 -194 347 -129 -108 414
1884 414 -246 -385 428 -4 -296 413 -25 -443 338 57 -445 405 269 -447 130 148 -401 272 357 -402 71
1905 71 270 -400 41 336 -248 78 274 -393 -79 364 -151 21 225 -332 -42 259 -296 39 397 -329
1925 -329 -114 304 -416 -22 620 -370 -318 534 -305 -385 676 -126 -502 616 -68 -717 531 278 -587 376
1945 376 205 -688 293 422 -571 193 467 -554 -17 398 -411 92 513 -406 -158 357 -289 -30 410 -260
1965b60J94L78o68K71N15o18J83L30q01L65O77q64J78O90r94P8R48r00qJ101j032
1986b37m42J272o55m65J284p25q58J362l58r94J375p8j276J073J21j268J123N17
2004G71j472O69O98j317M72R05j142K44R04j109m1R59p12o7P98p47j26P53o34
2023a94j06P64n54j07O16p41PR08p54j42Q68q26j84J155q43m43J312q00p73J525
2043F88m63j005J428m26j375J617K51j554J194L18j788J037R24j561P55J024j797
2060g33J57J312j197J79J312j294l58J239q84l39J316o03m97R38o65n31J046l22
2078G6m25R05m42n39P43n17l20J101l74n77Q42o11n89J275l80p77J292m06j178
2097i01J305m4j256J378J52j643J252O37j823Q48R11j716P91J358j833P6J412
$$ plain form
1965 -260 -66 312 -356 -85 430 -188 -5 325 -476 -111 566 -298 -120 570 -424 -346 602 -298 -306 795 -237
1986 -237 -679 593 -62 -527 757 32 -826 536 178 -816 559 481 -795 278 399 -869 254 771
2004 771 -701 -32 666 -651 -179 726 -416 -172 732 -377 -418 541 -171 -238 560 -187 -313 440 -194
2023 -194 -300 464 -90 -197 419 -322 -315 593 -161 -303 565 -261 -445 710 -133 -576 736 -64 -837 688
2043 688 225 -780 648 222 -1153 464 715 -839 355 673 -1115 -78 846 -715 40 1064 -733
2060 -733 -576 736 -461 -282 1030 -264 -622 617 -267 -606 710 107 -390 548 -117 -648 398 76
2078 76 -349 556 114 -425 318 -199 -519 582 208 -369 473 -138 -727 548 168 -609 683 277 -901
2097 -901 404 360 -896 482 634 -1009 243 880 -943 -95 816 -900 -109 1249 -584 -508 904
2114I04j572p9J871j087n96J423j171q24J774k83q73J199m83j100J073K6p42J031
2132D91Rr69N77p9o03Q62Ko14P81k45q26P88j23o33J213j06j220R33K7j218J242
2153B89M87j460R08N20j778P96J224j599L85J285j695O3J656j464m23J776j059
2170h9p26J737p98j116J594l89j164J564M4j428R31J30j150J057N39j159M72L35
2188C84j011M99N36o65M42K42r01L89L33o14N49K48q73N70K95j059O20N97j054
2207d73N61O12j361M14J022j288J99J289j318k42J404j127m24J725r04r99J558
2224F48m60j110J525j42j361J231J98j383J004N35j297O07N51j166N40P76j095
2241c99J88P12q70J45P39p58N8O68p33m9O80n14J3N36o62j3O64n97KO81o87q9
$$ plain form
2114 904 -668 -747 1124 37 -559 864 -307 -1131 643 360 -513 686 203 -897 176 202 -540 491
2132 491 500 -469 108 29 -574 288 290 -324 457 212 -614 174 51 -582 631 525 -695 238 265 -953 289
2153 289 776 -684 224 744 -1034 -238 986 -613 -228 1057 -638 -575 1081 -383 -806 970 -89
2170 -89 -815 922 124 -992 602 213 -951 613 657 -771 160 290 -860 197 736 -423 49 384
2188 384 -627 -128 408 -257 185 427 -474 -85 248 -366 183 431 -442 128 423 -636 -16 581 -473
2207 -473 88 700 -661 -247 775 -513 -314 975 -343 -585 819 -308 -732 993 89 -910 648
2224 648 188 -922 603 461 -900 331 529 -854 150 685 -612 -5 546 -620 -80 696 -399
2241 -399 -211 501 -369 -224 515 -243 -185 483 -250 -299 381 -133 -120 416 -246 -259 405 -192 -190 491 -196 -285
2263b85P59p39j03J035p23m76J040n34n36J190m62q67J155j66j028J088J29j150
2281f73Q89K82j219P80O40j282M18Q17j087K18Q82j030k4J012p69k57Q83n49l19
2300c88P71l94l24O88l55l92O31j71k50N06m04l79P17j22l24N58l73n10O90o3
2320A12l80P49k32q33N94J09m83P83M4j000M72L63p46N09N06r22K42N90q53J55
2340b21P61p88q9Q45n38k08O47o44l27R59j64m24N75m44n88P73P4m06N94j40p65
2361e18M00K20l28M60M7o12K95K31m14K11J07l80M08K37m98J37M7n48M16N17l84
2382E1J44M5q66J81Q00k50Q0L10q40k11P30k31l5O62m78n27N72j70l20O51j21
2403A77n20N94O0o37K64M8l51N74L22n91k1J3m21L82N16k53Lo7o05J79N50j44
$$ plain form
2263 -285 474 -265 -368 667 -56 -532 508 -26 -562 628 166 -701 454 288 -740 348 477 -673
2281 -673 216 498 -721 59 699 -583 -165 652 -435 -217 665 -365 -389 623 -146 -403 480 -69 -388
2300 -388 383 -11 -335 353 -2 -394 237 66 -184 322 -82 -461 256 134 -190 368 -5 -515 175 112
2320 112 -268 481 249 -584 10 119 -364 419 463 -537 -65 298 -448 61 567 -355 -113 477 -376 -221
2340 -221 540 -248 -337 508 -30 -238 409 -235 -562 397 233 -191 384 -60 -648 125 199 -207 387 247 -518
2361 -518 -118 102 -226 234 281 -331 -36 195 -219 -8 99 -281 127 364 -134 3 50 -498 -82 435 51
2382 51 195 240 -626 -445 355 105 185 495 -345 -556 174 -57 -92 570 92 -435 137 -33 -353 298 177
2403 177 -343 251 311 -326 -62 -14 -365 209 531 -60 -81 -68 -489 -107 409 156 159 92 -513 -334 216 72
2425G2R4R5n43M1M12l18M0L90l42m2L94l75j69L48k50lN85j83m09J32k62p0P44
2448C81K5m58J59k37l79N64K52l13K33q9n52K63L44k62J52J11l84J61K35l79K3
2469a50K56j76J46K16l84n8J71k41J55M15k54j59Q1l13R5N01j90j99K18k67j17
2490b54M30j54j76L91j85l16L64Ll35L13M3l25L35Q5m50J37K00k16J74J67l48
2511a17L1J79k08P0K25j58l5R2k09O7K18j59m7J20j31K2J22j70P7J64k08k4J40
2534F1j70Q8K26k97m3K85k18p2L37j92j74L17j87k07M39l4l82K41M8k74L31R1
2556B14m58J68K47l09J07K56l13q3K74j45j9K92j89k59J51J08K9O4r4j47pR0J34
2579A11jj47L6j8j54K40J73k95k6J09j95J90L05l80k04L24j01j5L56k64l62L22
$$ plain form
2425 72 166 261 -282 -241 171 -147 -107 283 -59 -101 293 -82 -251 97 -153 -156 429 246 -163 -31 -293 -363 381
2448 381 406 -52 107 -130 -509 55 307 -6 227 138 -414 -151 193 -69 83 194 -190 -29 206 -173 -150
2469 -150 106 -70 76 292 -92 -150 21 -220 -65 350 96 -63 18 -295 -200 301 111 -88 130 -137 -254
2490 -254 176 22 -154 237 52 -264 100 103 -232 81 124 -201 134 219 -231 -94 106 -110 64 231 -117
2511 -117 -86 93 -115 -45 180 22 -13 79 -130 -63 155 -4 -51 69 -62 -40 82 -88 -11 153 -55 -79 61
2534 61 -109 -21 205 -92 -135 150 -68 -140 197 5 -169 148 -39 -246 193 159 -223 18 66 -208 123 214
2556 214 -244 -76 171 -138 -31 225 -88 -171 103 -42 -61 231 42 -217 -66 42 71 135 41 -106 -113 -23 111
2579 111 110 -37 -1 -19 -173 67 240 -55 -81 28 -167 23 328 -52 -256 68 -33 -48 308 44 -318 4
2601DPj57M00j5n45J50K00j74L16J39n61k1L26r1J04J75l71j48K97k9K6J91k46
2624b3k30J59J11R6J07k48k20J41J38J39J2k40j03Q7PK18J10l17j10J37j20K18
2646F9L19m29k80L33m3j2M20l04m99M22J27k80L79L9o53J85L92k81J89K69o36
2667b74j34N34k9o2K16l62k71M23J18j19J20j83k45J72J80M9N2k34k04J44J38
2688B9J47N4l47j32K55NO0K06l14k45L23k2n5L68k44m69L38J77j94L11p1n98K83
2711a35L95l18J48J63n55N0M92k51OL27n07k20N65j8j86K74l10l60N11J81k99
2732d7J62p7l65K75K46j96J02k7l19J18K52j8jj25k01J64J45k1O8j78j97K79N1
2755I0j72K64o2m58K98K68l58K26J80o47J31O17l71j27M10m66j84O75j74l47M61
$$ plain form
2601 4 11 -146 254 239 -306 -156 44 -130 186 325 -236 -257 69 -22 82 257 -114 -262 35 6 32 223 -23
2624 -23 -253 -94 17 113 220 -28 -248 -107 31 170 182 -58 -161 -74 -67 151 261 -56 -166 -29 -149 69
2646 69 388 -41 -321 12 -31 -43 377 73 -426 -4 123 -157 222 261 -392 -207 185 -96 93 362 -274
2667 -274 -408 126 97 35 251 -111 -382 41 159 40 160 -23 -268 -96 84 133 185 -49 -253 -109 29
2688 29 176 230 -117 -249 6 11 71 277 -37 -282 41 19 -36 332 88 -381 -43 134 -60 251 180 -418 -135
2711 -135 260 -58 90 253 -302 -252 240 -11 -5 322 -185 -405 160 142 -44 230 -80 -440 71 252 -47
2732 -47 115 38 -327 -52 194 -2 100 73 -246 -128 124 106 105 -20 -221 -57 88 67 135 -43 -240 39 90
2755 90 -82 182 120 -338 -40 228 -130 96 276 -371 -240 377 6 -121 289 -177 -361 314 140 -207 254
2776B54k34m44N61J17m19L02k8n31M10L61m56P3J93m25J42L92k90o9K25k45o2
2797a73K85o2n2O3k09Q0J93j49M4N4k44J26K67l26K2K83l08k8L49k59p8L53l18
2820h7j30M82k20k85M51k18l11O10j27n64N44J04o25M51K90o94K50M47o19O3N58
2841C70m53j49M53k63j31L84k47j43L47j78j59K86j56j02L40j68k58L03n7j32
2861a13K55r5j75J61j18l4L42j62j70K21k73j21O43j24n10M17q3n06N71K77o35
2882b32K35K49o11K42N10n02j1L23m14J23M70m78j63M63k98n1N91m18m17M97j20
2903a2k60N93J0o14J55R6j57L80R9l72nnk5K85q0k76K77n6k38M16k9n22K45J91
2927I6k35M08J15p17ML13j13M41K39p57j01L01l36L80O43o58l37M33l84m6Q28
$$ plain form
2776 254 20 -424 137 254 -165 137 109 -422 -12 349 -107 -34 159 -266 -124 268 -22 -91 134 -111 -173
2797 -173 112 50 -2 61 -148 -68 125 -24 20 74 -170 -44 223 -103 -81 202 -106 -134 215 -44 -122 231 -87
2820 -87 -217 265 45 -240 211 -7 -318 292 165 -399 145 249 -376 75 365 -329 -79 368 -251 -188 370
2841 370 -83 -232 221 -42 -173 211 -36 -179 168 -10 -169 117 -39 -141 199 31 -227 76 19 -113
2861 -113 142 47 -128 33 -85 -119 223 61 -109 112 -161 -282 361 237 -273 144 61 -445 126 403 -232
2882 -232 3 252 -359 -117 393 -109 -120 203 -211 -88 382 -96 -259 204 -94 -145 446 28 -389 108 -12
2903 -12 -272 321 331 -283 -128 -32 -189 191 290 -82 -87 -92 -117 168 88 -188 89 33 -205 211 182 -340 -95 96
2927 96 -139 269 384 -333 -329 -16 -129 312 551 -206 -307 -6 -342 38 681 23 -314 119 -265 -311 517
2948E17l09n84M82Ql48M02p0m45L35K34j88J78j78m81K75K63m7M03j50p69R4L77
2970al8L78J24o76j06K62r0K49K00l89J1J53k67K39J72n31J01N23k66MK57p07
2992c98j86Q17N2j57K80n34n40N44K45k3M36l54o84L21J61j27N35o5o75L21K46
3013B15m61K20K48m50J75M38l63j14J09l35J44M59m9n8j18n47J46N53p0Q5R0o18
3035c01j06N22j36OL76l72k98M05r9j47L27k28j73M99j21l48K50j96k51O79J07
3056C95n41J96l5n26M56M84l87L4Q2n35J31N03k08MJ31l54M1L21k76JK95k84r
3079h1L23k93j44L19j85p1M12j61k86J76j36j3M09j60k30K14j95j18M39j29k89
3100a99L78j23l89M30J20m51K53J55l89K59J96m49J01L13l20J20K06l85O9L00
$$ plain form
2948 517 208 -376 106 114 -234 168 98 -347 -12 222 34 212 34 -447 -172 91 44 447 297 -472 -378 -1
2970 -1 -39 339 463 -213 -319 -57 -147 102 302 -87 -76 77 -190 49 221 -310 -209 314 48 52 309 -398
2992 -398 -584 233 285 128 408 -126 -666 -122 123 100 536 182 -502 -181 -20 -147 388 323 -352 -31 215
3013 215 -246 -26 222 -228 -53 385 22 -92 17 -318 -174 285 236 178 60 -487 -341 212 142 227 317 -301
3035 -301 -407 115 -21 -15 361 -11 -309 96 -3 -150 177 -51 -224 275 154 -194 56 -140 -391 288 395
3056 395 -146 50 15 -511 -55 429 42 76 158 -377 -246 257 49 53 184 -170 -129 192 -84 -83 212 -72 -81
3079 -81 242 -51 -195 124 -61 -132 280 119 -167 9 -127 -140 269 109 -121 93 -102 -220 219 90 -199
3100 -199 179 56 -333 97 217 -234 19 174 -215 44 240 -209 -108 205 -115 5 211 -174 -105 195
3120A95l04K9L41l56r2L91k40j00L85k44k48L68l4j82K01q0j78K64l8j75J74o9
3142Hj34K57o5k04K43j04k20L25P5k79J48m1k93L49J61l19J12M4l41K72K35l68
3164a39J52K00m70J26M15l69n7L72l32r7N01k49l24L29l0j42L24q5l27J68Rr8
3186a23L04nk71Q3p3j02L64L5l22J18Kj68K58P0k83J06Q2k11K26P4k98J08P8k16
3210a64K70J81m20j6K28k18J62L13m02j55L00j67mL51k19k01K28j61l4L91j97
3231F6k82K71o9j38L94j15m10K86J11k55K41R1l69Q4J81j55J34J24k97j6J35o1
3253d9J89K6l08N9J49j57J76J15l30L6J96j98R6K59l31r1K47j46L4K99l26j67
3275b22L37j05j31L30j58l21L36K8k64K85N0l72J26J63j43J50L3k89P6J62j11
$$ plain form
3120 195 -109 -80 261 -95 -187 204 -36 -136 249 5 -243 125 91 -91 110 30 -148 116 78 -97 77 8
3142 8 -126 131 66 -138 105 1 -219 106 181 -98 50 9 -284 65 226 -93 19 63 -278 -6 229 -139
3164 -139 13 213 -257 -131 284 -85 -142 230 -102 -199 302 53 -271 58 28 -114 210 125 -202 -34 -25 -123
3186 -123 181 176 -95 -12 -85 -187 177 212 -110 8 10 -158 100 170 -113 -7 75 -136 90 164 -134 -26 52 -164
3210 -164 106 287 -133 -149 79 -139 23 336 -66 -221 79 -88 -92 259 40 -161 67 -94 -128 263 66
3231 66 -216 55 -14 -152 242 127 -283 3 114 -141 100 191 -178 -94 87 -68 66 190 -107 -123 12 -49
3253 -49 140 166 -142 -83 66 -91 85 200 -130 -94 102 -96 0 259 -72 -163 84 -62 -28 271 -55 -222
3275 -222 115 10 -121 209 51 -270 66 94 -170 115 165 -207 -81 82 -61 89 122 -167 -91 71 -40
3296d0J39Ok68J33J18k11J81J50l50L8K25k16R7K21l13p2K98j43l3K02k24r5K91
3319A34j11j11K59j61k12K70k1j29K62j23k81K44O6j66J96l3k64J95Q5k14J90
3340G5P5l09J18J45k32J62J53l39J2K65j68jJ80k25m5K22j05l0J50j40m9J40j11
3363e7L2J82k11p8K45j21n6K35j92j51L10p7j96K60m9k62K63K7k50K40M2l38J73
3386b9K02k65J17J21l07P9K63k09j7J77j93l5J94j15oJ56j81p1J92q0oJ27k01
3409h7k6K11j04p9J97j38r4K08j07r5K29r3j72J91rj12J72n9k03K30K9k00J57
3432D6J5k06J88O9k42J56J12k83J01J86k17O5J70k91OL08k00q1K24j41j09K30
3454A06p8j36K05p0j70J74J9j02J24p1j18J59qr4J10n5q7J44l5j05J51rj78J50
$$ plain form
3296 -40 99 105 -163 -30 88 -123 58 208 -142 -104 121 -95 2 223 -90 -162 136 -7 -40 162 -62 -157 134
3319 134 23 -88 171 10 -202 68 47 -82 180 57 -224 20 86 -80 116 83 -181 14 99 -115 75
3340 75 150 -159 -41 104 -128 34 187 -152 -140 125 -43 -44 136 -89 -134 88 -17 -47 103 -37 -86 54 -57
3363 -57 -25 157 -54 -132 113 -8 -64 171 -21 -172 138 61 -135 125 76 -186 77 104 -146 94 136 -202 -29
3386 -29 173 -92 25 146 -161 -82 181 -28 -45 132 -61 -96 98 -17 -23 133 -48 -119 73 -7 -13 114 -87
3409 -87 -113 98 -6 -85 112 -26 -120 88 -19 -114 115 22 -150 41 32 -80 92 33 -170 60 89 -111 46
3432 46 61 -145 43 112 -130 26 138 -145 -44 142 -75 -10 160 -131 -125 183 -17 -98 126 -15 -124 106
3454 106 28 -108 97 27 -143 31 50 -52 72 1 -117 42 34 -60 50 -5 -92 52 17 -88 63 54 -124 26
3478B6nj19J84k5k29J92P9k41J56R1k57J52J56k84N8K20k09l3K31j59n9J89j61
3501d7o9K42p7j15J45j02r8K39o1j59J94l1j94J66M7j61J16J8j48P5Q3j05L7K
3525cp2J34oj35J16Lj55J33P7j74J24M2k36R7J75j80N9J12k13K6K02k11OK46j92
3550b5o8K28k02r9L11r8j85K59k8k70J81O5j74J89O4k27L2P4r6R8N4j07Q4j8j76
3575a34J19J13j37P6L7j76Q3J06j61L3J22j10N0N6j80N8J27j59P3J69k20k5J79
3598I9k05j6L23j52j78K34j01j70K40%j73J96j7k12J47L3j65J88L0k02J24P7k73
3621a73J04K15j85K8J37k05m8K06o6l6J09o7o4M7q0R1R5j27J5P7j67N1J69k04
3645g8qK36j47j22J99r9j03K07n4j36K00p5j67J97j8j60K15mk55J95Q8k63J21
$$ plain form
3478 26 21 -98 86 61 -168 24 103 -138 18 109 -148 4 160 -124 -66 154 -55 -88 143 -16 -75 114 -47
3501 -47 -116 126 49 -66 79 -23 -121 118 57 -102 92 61 -133 33 80 -81 35 53 -95 -20 63 -42 -5 -3
3525 -3 -75 59 53 -82 34 37 -118 15 92 -82 42 84 -152 -55 120 -60 -1 111 -102 -76 126 -85 -79 167 -25
3550 -25 -93 135 -67 -166 145 47 -138 121 93 -177 4 69 -105 84 148 -79 -47 27 -69 29 83 -24 60 42 -134
3575 -134 -15 98 -39 37 74 -102 -19 87 -74 -41 81 -29 21 77 -103 -45 82 -77 -4 165 -55 -80 99
3598 99 -106 -122 201 49 -129 105 4 -166 74 74 -99 97 80 -132 15 48 -117 71 101 -101 23 100 -173
3621 -173 -69 146 -39 -11 126 -79 -127 79 13 -23 86 19 -45 2 -78 13 108 -19 -4 73 -94 -43 126 -78
3645 -78 -86 150 3 -119 80 -19 -122 85 31 -105 95 20 -147 50 32 -128 87 83 -172 23 111 -152 -31
3668c1J87k30K8J77k01k8K05j03n8J33p5l4P3j00L2J47j47k1J15j16j8J88j02
3691B1j07J89o6j23J32%q3J07n3q5J46o1r7J54n7j29K19m5k45K30R2k56J12J42
3715A37k75R1J93k23K0J69j57o1J65q6MJ41j69n4J83r3m8J76j09j06J70m3j21
3738i6J64jj52R0J5l8P9n0p5R7j8o2J28o6j23J93j9k06J94N2k27J27J06j92Q2
3763BJ18k11L5J72j32OR4j67K6J75j50k4J79j74p6K15q3r6K00r3j82J80O5j33
3787e4P3Kj02J04K6p5P0m7p9J14j7o0J39n0j90J20J03j20J08M1k05N3J10j22P4
3812A6J12j68J2R3j49P8J47j94pJ96j48q7J86j23q4K65k3k05J10l8j24J54R0r3
3836A6M9o8j68J31Q3k0P8o8j84J15Q8j04Q7O6j74L7R4j10K7Q0j09K1J28o4j5j0
$$ plain form
3668 -31 156 -74 -46 131 -70 -98 107 4 -54 79 4 -30 43 -57 -25 122 -25 -46 69 -47 -65 123 21
3691 21 -86 103 37 -86 46 46 -37 70 17 -68 78 17 -80 74 17 -112 107 62 -183 47 139 -117 -5 137
3715 137 -138 -47 146 -77 -57 112 -45 -106 59 -27 -23 118 -51 -105 78 -15 -63 113 4 -102 68 25 -96
3738 -96 68 67 -85 5 20 -18 61 11 -64 33 15 -47 81 15 -108 85 66 -140 54 106 -121 6 112 -80 2
3763 2 120 -91 -56 116 -16 -10 84 -83 -57 118 -32 -56 123 -51 -127 88 5 -91 109 16 -166 14 79 -54
3787 -54 19 21 -81 23 49 -26 44 -3 -82 32 15 -45 94 44 -146 -26 77 -43 65 106 -99 -46 64 -58 16
3812 16 128 -40 -28 65 -84 -6 141 -53 -60 136 -12 -99 87 -36 -120 145 122 -83 27 -11 -135 19 109 16
3836 16 65 -3 -171 -40 43 23 101 33 -151 -36 52 -52 35 101 -73 -36 58 -52 -25 55 -54 -33 95 31 16 6
3862Fj53R6K00r5k6M0j89j7K38l1l4J17j62j61J84L6o0J18r0j27J61Oj41J17n
3887B8j20J94K8j98K8M7j32J33K03j62q7j2j03R2K14m2r1n1j06O7J47l0j5L0j43
3912h1pJ56m6l8N7j02J3J65o9j22K9l7N0J80n7j41L2o6k6K33K8j65L6o4j29K13
3938D2J45j82j4K9j21J17J17j73j2Q9p6O0J06j34r2J06n5M6J67j18j77O2L8K1
3962iJ62q7j64J6M2L4J00l1r0nk7J9J53o4j09M4k3QJ38m8j74P4O0l9J05j2j84
3989a11O9P8o4J00M4j86pJ37q1P7Q7k12n6J83j0m5J00j22j05J59K5p5R1o4j13
4014a01Q9O1m1L7m1j14Q1R9m1nm3q0R6N9k3%n8o5R5K7k3O5p9j16J17P2j01Q5k6
4043B6j62J15J52j59j4J06j44L4J93j18j01J11p6n1K08k3j56M6qo0J88J9j67K
$$ plain form
3862 6 -147 -51 149 54 28 68 -121 -138 100 69 35 152 -10 -171 13 49 -11 107 17 -110 51 57 -84 33 28
3887 28 -92 102 130 -68 -40 7 -125 8 211 49 -38 -50 -153 -61 153 111 20 -31 -137 -70 77 47 32 62 -81
3912 -81 -88 68 22 -16 41 -61 -48 117 48 -74 -45 -82 -32 148 91 -50 -18 -84 -110 123 151 -14 22 -42 -171 42
3938 42 187 5 -9 20 -101 16 133 -40 -52 37 -39 21 127 -7 -99 7 -48 -2 165 47 -130 -68 -30 -9
3962 -9 153 66 -98 -82 -40 -6 94 63 -27 -32 -59 -40 113 49 -60 -16 -39 -31 107 59 -115 -41 19 -20 85 73 -111
3989 -111 -42 36 -28 72 116 -70 -77 60 -21 56 143 -69 -125 58 48 3 103 -19 -124 35 60 -15 76 12 -101
4014 -101 -12 49 8 45 4 -110 -29 70 29 24 -19 -99 -3 56 33 33 -25 -90 5 32 9 74 -5 -121 -4 68 -33 52 26
4043 26 -136 -21 131 -28 -42 64 -80 -46 147 29 -72 39 -37 -88 120 97 -59 -13 -21 -81 107 126 -41 -39
4067c9K3j3Q4K8r9JJj2P3J9r7J1ql3J42J3j66J4N3l8J17M0j82rP8k9O9Q3j47n1
4097g4O9l6P0J02j44r4J10k0M1J07j50j20J69Rn3J25o9j78J25O7p3J17j7k14N8
4122g3J55o1L3L1j99J9J74j7m6M0j04l6J11L2jm3q3J4M9L6O2n5j83Q6J34o7L3
4149D1L8j99oK20n9o6J26j37j47K44L6j40J11o1j97J86J61j65JL9j34Q6J47j08
4173A7l4L5j06L2J50n4k6j8r5P3J20n6k4lr1N8J39r0n3N9q1j2J65m1r5N0n8l9
4201g8J42Mr7K8n5qJ32k1r1O6l3p0J42%j14Q4k0j45J64R5j90M3O6j67J16J59j98
4228d6k7J53j13m4J86p0j25J41k9j05J31K6j23K8K5j8L6pl3J5k8K3N7o9rQ2o6
4255in7J44m2j10J33m4j11J40L2j62R0P4j53N2J22j45J1J21j40j4J46p0n6R1o7
$$ plain form
4067 -39 -16 -29 55 83 -16 -15 -14 -26 47 66 -31 -20 -28 -61 81 94 -72 -58 -5 -43 74 114 -68 -77 1 -28 41 124 -23 -74
4097 -74 -5 -41 29 131 -13 -107 3 -17 24 131 -19 -139 30 39 -14 111 42 -136 -11 56 -17 100 83 -131 -73
4122 -73 82 21 54 85 -114 -95 79 62 16 56 -48 -84 27 59 58 15 -68 -54 -5 31 93 38 -145 -59 75 8 41
4149 41 79 -120 -126 94 35 -31 95 -42 -189 55 91 -49 62 1 -196 -10 151 -14 -13 26 -108 -22 125 17
4173 17 -17 18 -88 -56 94 40 14 -4 -99 -26 94 38 14 11 -80 -22 117 27 -26 33 -48 -60 105 64 -31 19 -39 -78
4201 -78 64 68 -29 -1 -56 -64 68 47 -44 22 -11 -81 61 61 -53 31 11 -134 30 125 -65 -22 44 -123 -7 152 -46
4228 -46 -73 80 -33 -77 109 39 -86 55 26 -79 52 78 -45 -17 8 -10 26 19 -14 1 -27 -4 53 -16 -25 57 -9
4255 -9 -66 78 36 -74 59 15 -96 44 76 -86 4 78 -75 -23 99 -46 -35 86 -54 -68 78 8 -48 43 -24
4280b4k4J18l9q6Q5m4l3Q6m1k4Q0o1p5J44j3p8Q6o3q7J46K7j19M9K1j04P6O7o9
4308AQK2r0N8N7m6Rj9o5O6P1r2M1J2j13Q0Q6j22J4R6j21nJ52q3p3J02q2n8J97
4337A03l9j51R1Nq8J21M9j34J3N4p3M3P4o0k9pNN2J9o5jnj0R8nj20O1K7r1J03
4367D0P6j51KP2r3O4J29j26p3P5m5J3J15q3q7J05k4l8Q7o3q1J25Ko7P7l2j30Q4
4395b7O9k1N9m1j57M7J13l6M0J8j31QP9m4K3O3q1k2O5mj6Rm3JR7k9j6l5q8P4J03
4426G7l0j2J7j44MJ51j3k5P3j15j02J59K4r3O1j0q6R7M8j29RN1n3Q1O5j24n7L2
4454d4k9P5J34o5j15j2k7N3J15pp5k8l9L3O1pl5L5l5QN9n8n1K7K1L1R8q7j32J7
4484g9M1P4J01n3j48J3mRJ50Nj27Rkn1J08O0j42NQ8n5J6N6j31k9J32Lj4L0r2q4
$$ plain form
4280 -24 -48 70 31 -55 30 -14 -47 39 -2 -26 54 -7 -82 62 49 -29 57 -6 -93 53 80 -39 10 31 -73 3 70 1
4308 1 9 31 -59 -1 56 10 19 0 -65 1 72 -20 21 33 -80 0 86 -36 -22 74 -47 -52 100 17 -56 46 -36 -94 103
4337 103 64 -87 4 9 -79 42 91 -43 -30 24 -49 -6 68 8 -21 -28 -23 29 48 -17 -18 -23 -33 65 60 -60 1 28 -63 40
4367 40 116 -35 -33 39 -54 10 139 13 -60 15 -30 -17 98 15 -72 33 9 -29 58 -5 -86 39 41 -26 51 19 -111 -27
4395 -27 42 21 80 39 -118 -71 42 6 46 64 -67 -59 20 -24 -1 62 -19 -41 24 20 4 13 -30 -29 68 39 23 -12 -100 -26 77
4426 77 47 35 52 -92 -88 63 50 25 98 -17 -119 40 64 -29 32 22 -64 33 81 -48 -39 12 -41 40 105 -19 -76 -44
4454 -44 -73 2 136 71 -44 -56 -83 -30 85 78 3 -25 -64 -31 30 23 -12 23 -12 -4 55 -3 -54 -27 -6 25 123 36 -96 -79
4484 -79 -38 36 137 84 -64 -51 -55 -46 104 109 -18 -9 -11 -62 46 106 -36 -31 57 2 18 74 -57 -86 46 49 35 65 -27 -111
4514a11Q2O3M3%q7j00M3O9N1K7p6p4L4L3K2L2o1m7N8J4mM2p5p2Q0P6k8J6n7j30
4544a37R5J23m5J6j9j18K5J09JnMr7j4R1NKlq4pJ23k1m1Qm6j0J05J5q7Oj8n7J03
4576B2N0n6l4j7l0O6P8o8m6j1LN8L8l6j8l1j4N2M0l9ooo4P4P3p9j5K6n7M2R9r7
4608cn1P2j3k3J10m8r9L5KnR2%j13OL0k3P7J0p4oK3kK5J3n4J6Mj7M0Qp2J5L0j9
4642a4M4J5j07oR3k7J1L7p8l9Q1k1j1O5m0o5P2k7J0N3n0m1O8Nk6L0m1l6P3K6n3
4673AL1qq6N2N4n0M8Lq8J8O8m7RL9n4j3N7k9k0N0l4kK2j7j1K5k4k1N4j3l6K9m0
4706c3J5P7m8l6M1k4l2P4j9m5O4k7p1O6L3o3K7K1m9K6N0n2j8N8n0J5K3m2K3L6
4736D0m4j0M4j8j9L6l6rM9k5k2M3k5j6M5m6pN3k7l7N2pl7K9Qm9N1%n4K8L5n7L1
$$ plain form
4514 -111 -29 34 77 77 -10 -110 -67 2 53 80 4 -70 -36 -3 19 51 -10 -57 1 15 11 53 -22 -94 -14 62 34 50 -7 -137
4544 -137 -42 81 36 52 33 -85 -60 49 50 45 49 -48 -62 29 34 36 33 -51 -58 65 44 3 11 -35 -45 60 75 -12 -6 -24 -81 22
4576 22 72 16 -18 -35 -65 1 79 11 -35 -46 -43 15 53 17 -1 -32 -46 6 46 7 1 -5 -69 5 78 -1 -16 10 -47 -5 94 -3
4608 -3 -54 18 5 -18 92 44 -55 -20 -18 -23 69 69 -44 -38 -8 -31 46 56 -18 -24 -1 -3 22 35 -19 -3 1 -16 24 32 -40 -25 5 -14
4642 -14 30 45 -62 -68 25 -2 9 46 -32 -71 10 -11 -22 43 3 -62 10 -17 -7 46 -4 -45 23 28 2 32 -9 -45 28 54 1
4673 1 32 24 -62 -10 44 -6 42 45 -43 -25 43 -4 5 44 -10 -23 34 5 -15 35 1 -1 21 4 -7 18 -6 -27 27 14 -22 7 -33
4706 -33 -18 59 11 -25 16 -8 -40 34 15 -30 34 7 -64 2 35 -28 -1 20 -29 -3 47 -5 -23 35 -15 0 23 -19 4 40
4736 40 -4 -14 30 12 -7 29 -7 -16 33 8 -14 29 4 -12 33 -13 -20 33 6 -31 21 14 -23 6 14 -35 16 16 -38 -10 25 -32 -1
4769aJ7n2M1K1n3K4K6l0JJ6l8jN9l4rK8m0RM9k8rN4q1oN5j7PL6n3k8O4Kl3L5k4
4804Gm4M9J9l7L8j1n2K5K3j7J6jm5L1M1l9qQk7L1L1m3jK3m1NO5n1LK3n1J4O6k9
4838B1m6K1j7nO9j5m9J4Jk7N6J8n2Oj3j1M9K4l3j6j4j6N4J2l2J4j6k8O3J5m7N
4870Ell0M3N8p3l1M5j5ON9o5m6N1RrK7j4n2K1J7PL1k9l2QlL8L8n1o9M9OLM9l7
4905A1m9K8J8pM1Kq1J1M7oJ3Qo6j5N9jRRm9mM0L%Ml3kL0nJ0J5n9pO1j0j0J8n4
4942b1l6Q3Nm0K3k0n3O0M1l5jkn6K4P4k2k6j7j5K1M8j4j8ql2L5K9k2J3rn5N0M0
4975D4l9lJ0n0J5R2m6m6L3j4j4O5rn4J9Rk7N2J1m6j9QlM5Rm0j4%QL2Pn0jK1k7
5010b2M7J1m6nOk9M1N3o8l9N2j4lO9o2k2L0J1k8M2j3l2K6jKK9k6l4J8J0kL2m4
$$ plain form
4769 -1 16 -36 5 26 -27 -3 23 -7 -6 10 -28 -29 30 -4 -13 15 -25 -16 33 5 -4 50 -31 -37 18 1 8 44 -9 -37 27 29 -4 31 7
4804 7 -37 12 31 -6 32 21 -31 -6 17 0 16 15 -30 1 42 3 -5 3 -24 7 38 -5 -6 17 -24 -19 46 -5 -2 21 -30 -16 50 21
4838 21 -25 -4 -21 -26 43 28 -21 -7 -6 -33 23 41 -11 -5 -18 -29 20 44 11 -5 -19 -35 19 31 -1 13 -3 -31 32 47 0 5
4870 5 2 -28 15 73 0 -31 14 -1 5 64 -1 -47 4 13 4 31 17 -35 -14 3 10 41 12 -20 -12 -15 23 61 10 -59 -10 -4 -1 48 11
4905 11 -38 -10 8 1 42 44 -37 -26 21 15 28 36 -30 -45 14 13 22 31 -18 -22 18 21 21 25 -8 -10 20 15 25 40 -19 -26 35 25 15 33 -21
4942 -21 -57 26 31 -9 14 -6 -59 1 42 7 6 4 -52 -28 46 24 -2 -19 -34 -13 35 21 3 -5 -37 -2 27 5 18 9 -46 4 44
4975 44 5 2 12 -38 -23 69 23 -23 10 -4 -18 47 38 -16 3 12 -15 37 48 2 -17 -9 -12 33 42 2 -12 -12 -4 28 35 -15 -16 5 -22
5010 -22 25 36 -10 -15 -9 -38 3 56 -12 -51 1 -13 -16 53 -9 -31 -1 10 -18 24 11 -21 5 4 6 35 9 -25 -7 3 1 33 -11
5043a1l3M2J9JK0j8n0K0L3m3M0K9q4K0M7k9QK2n4pO2kk5Ol0JL4nkMk5j0J4J7N
5078A6Mm9kL8Lj9K1j4j2M1j3l8L8Jm2N8%m8K1Ol7L3N1m6j6Nj9J5N4k8l2J6JnJ3
5113A5j0Qlj8OK7j0k7K3j6kM4k9l5K6LoL2om5J8J0k0K1J8m3lJ4%J1Ml1%L3j3J1
5149Glj6J1J6k8J8K6m3nL3k4OM1m6k3M3%k3L7j3l1K8K5n1M1Nm8RK7k2J1J8k2p
5183cJ0KrK2k6RJ9k0KqNJ1j0rPJ3l4pN3l4mK5k1k4O2j8m2M9pl8L0Lk5K1J0k8M
5220a0K2k0JJ3j5rK3jkJ4j2Lpj0K9J1m0LL0l2KL4k8pK5k9j1M8pl6K7j0j8L4Ol7
5256a6jJ9j0J8rj6J5pPJ7j0qJ1j4k1N0Nn6J5L1l9L3Jm4K3M9m0j8M8m3j5M2Mj9
5290BK0Pm6J5K3j7K0ml3J9J6oqRj4J3j7RJjrJ3Jj4J7j6m0L8K7l6JJ9m3NM4k1M
$$ plain form
5043 -11 -44 -2 17 18 38 20 -30 -10 23 -20 20 49 -35 -15 32 3 11 33 -21 -28 34 32 7 13 -17 -16 18 13 11 15 -10 -20 -6 11 16
5078 16 20 -29 -31 7 10 -9 12 -2 -14 27 14 -24 14 15 -27 31 31 -17 4 10 -27 6 57 11 -5 0 -19 -4 50 22 -10 6 7 2 15
5113 15 5 13 10 -8 -2 25 15 -12 11 -5 -7 37 8 -27 -1 2 -4 28 22 -23 -5 5 -15 6 24 -19 -22 -8 -8 3 7 -24 -24 9 -4 7
5149 7 4 -12 -1 15 -13 5 31 -12 -17 16 -8 -2 39 -7 -30 13 13 -10 27 14 -17 11 36 -15 26 31 -17 -8 19 -3 8 26 4 -3
5183 -3 7 9 0 22 -4 5 24 4 6 -2 3 14 4 -5 2 15 -19 -26 27 -7 -11 14 -7 -31 31 13 -29 20 13 -25 5 8 -17 4 14 -14 -10
5220 -10 12 -8 -7 6 -9 -18 5 4 2 16 4 7 0 -10 19 30 -10 -7 23 -9 -7 27 -1 -8 17 -12 -23 25 18 -18 9 -1 -19 15 21 -16
5256 -16 -17 2 -8 10 1 -15 0 -7 0 17 7 -1 10 -4 -25 25 30 -26 -11 20 -19 14 15 -29 -6 43 3 -15 33 -10 -25 17 21 2
5290 2 22 29 -17 -2 21 4 24 20 -13 6 22 16 8 17 3 16 -1 8 9 8 -1 12 13 -1 16 0 -40 -2 25 -11 -10 9 -34 -29 15 -6 -2
5327bJ9j7j6K7j3PJ9l4j7M4k4k2L0l%K1j4k5J4J1l3N0Qk9J6j8l0K9L9l5jKj7n
5361a9M0j5kL4k3j6KLjK0j9J1Ok9LomK0K2n0J0J6k7J3L5k0l2O1n4j5N2Om1K4J8
5396B3o7N2Mk6RM8m2KK6m3lM4j0j9K5j5l0K1%J8Oj2kokOOj9J7K8m2JL4l8NL1l1
5433ak0M7l0k1M7j7k0L5k6k8N8j1m2L7Lm4L6J9m3K5J8m0pN2k9j1K4l3QL2k1oK2
5466A3kj5K0Nj9QnKNJ5j0j7j0K0J9j8qJ6k7jL8k8oM3m1j3N4j8m3O1l3m3O8%n2
5501b2K1L2m5K4L3o3J1L1j8j9L6k5j7J6kj3L1lk7RKNOnlQqMJ6k6MJ8l4L3K4l1
5537Ck3M0l5J9K7j4l2L6j9k4N7j0l2J3J2l6K5K4m6RK6l3J0K7m1ML5j9j8L7k9j0
5569a7L0oj4K9j1l1J1KLONj2kmkJ7pj1J4j5J1J8jk0L5l7j1M7k9qL4j0j9K9jl9
$$ plain form
5327 -2 17 0 -16 11 -2 5 24 -10 -27 17 -7 -29 1 -2 -2 19 5 -20 -6 5 -28 22 30 1 17 -1 -31 -2 37 2 1 3 -14 -19
5361 -19 21 6 4 38 15 -1 1 4 3 23 4 15 21 -8 -5 -11 -15 5 27 -23 -13 3 -24 -11 24 4 -28 33 -21 -36 16 22 -19 5 23
5396 23 -44 8 12 -14 -5 43 1 3 29 -14 -17 27 17 -2 23 8 -22 -1 -1 17 23 11 9 3 1 7 13 -6 11 39 -3 -2 32 -6 -1 30 -1
5433 -1 -21 26 -4 -25 22 5 -15 20 -6 -34 24 13 -29 8 11 -33 3 22 -21 4 22 -18 -25 27 -2 -13 11 -22 -14 18 -3 -9 13
5466 13 11 -4 16 21 2 10 5 7 12 27 17 0 -10 10 29 11 3 19 -8 -9 29 1 -5 38 -3 -16 38 20 -23 38 5 -38 30 30 -22
5501 -22 -1 31 -14 10 43 -20 -9 22 4 -15 21 -4 -21 -5 -7 -20 11 8 -19 -10 -8 -3 3 -2 -5 3 -5 -1 15 -11 -7 11 -23 10 34 3
5537 3 -20 20 -15 4 31 17 -15 21 2 -22 35 25 -7 6 18 -18 7 31 -15 -6 20 -13 -3 24 -17 -13 22 3 -15 22 -7 -17
5569 -17 13 7 -7 22 11 -20 -9 -7 -4 2 7 -5 -7 -11 -13 4 -3 -14 0 -15 -4 14 13 -7 28 -9 -20 27 -2 -10 24 14 -5 24 23 -16
5605a6J8L1l9K0K2k7j5L5l0lK7k7j8M9j7j9J9rk1K3kk0K2J1k6%J4nQqlj5J3MM
5640@nj1J6j0oJ4mj4K7oj9L1ll1K3J1k6K0Pl0J0L6l8OJ0okL4k8qK6j4k2J9J0j5
5676BJ1lk0L3Kl3NJ2j5jJ9k5K0Kj5%J2%MqlkpKJ3q%J1mj4QJ0k0J7Pk9J3J6k5R
5716dJ1j4KJ1lnK8j9j8L2j6j0K5Nj6JQk7J4J5j6P%pj8K0LpJ0Nk9J2Kkjj0jJ5K
5755EplJJ4j8mLRnj3L0k0NK4l2lL1j6j8L6j9%Qmj5J0J1j4J4%j4K2nk4J1K5j6j9
5793a0L4j4Ooj1JJ7nj5J7j0pJ7jj5OPj5Ljj1K1lk4J2J2mlj4JJ5jj4K1KjrmLJ2
5833ImpJ3Lnj5J4j0kJ4k3J8Rj7j2K2JpK1j9k3K6%j1PJ1k2J2Ok2RJ5LrJ3j0j3O
5871AKLmJoKl%nMLkmklMJ1Mmj5J2%oJ9lj2J6k3%NKJJ2Jj2NRj6RLrMjj1K1rjRP
$$ plain form
5605 -16 2 33 -6 14 36 9 -6 29 -1 -4 23 -4 -22 27 10 -9 10 1 -20 3 1 -19 3 14 -12 -12 2 -3 5 -3 -6 -21 -8 -4 0
5640 0 -5 -16 0 -10 -16 -2 -6 -20 7 1 -18 13 10 -21 2 13 -13 7 14 -16 -6 30 -8 -2 8 2 0 34 6 -2 24 10 -12 7 17 2
5676 2 13 10 -10 23 25 -8 -3 9 -6 -7 12 -13 7 9 -6 -6 6 6 10 2 -1 -3 -10 -8 5 -3 -3 8 4 -10 -2 8 -12 5 12 -17 -4 12 -13 -4
5716 -4 7 -7 -5 6 3 -2 26 7 -11 21 5 -5 20 25 9 10 18 -9 5 20 4 11 11 4 -14 6 9 2 12 17 -12 0 2 0 -1 -11 -12 3 5
5755 5 -2 -5 -4 10 -8 -12 -9 0 -5 -18 12 -8 -3 21 -11 -14 17 1 -17 19 0 0 8 4 -11 -1 10 -4 10 10 -4 18 13 -11 0 25 9 -10
5793 -10 24 10 16 10 -1 0 17 12 -3 14 4 -3 14 13 -2 4 11 -4 -1 -2 -13 8 5 -19 -7 5 1 -2 -16 -15 0 -1 -15 6 8 7 -2 -6 -3 9
5833 9 5 -2 11 14 9 -6 8 -2 -4 10 -13 5 14 -3 -15 7 8 1 22 3 -20 6 6 -5 2 13 -9 3 9 -13 -4 11 14 5 18 8 -5 1
5871 1 3 6 2 3 -3 -1 -4 -4 -9 -5 -2 -4 -8 -10 -13 -9 2 6 2 -13 -1 -1 -7 12 9 -3 13 -10 -10 -5 -3 -2 10 11 -1 4 13 -3 6 9 0 4 3 -8 13 4 3 12 19
5920A9k6LJ5j3QK1k3j2J3j3QkJ0oQll0J5NJkklPKj3JJ9j5J3nqJ1j4kJ9rj9K0j0
5960a2%K0KnmJ1j0mK1j4mJ2j4mRj3J2pJ7j1LLk0K2pNJ3lk3RK%J4j4k0J8prK1j
6000Hlkkk0J8Rj1OJ5k1lknJ0lKoKqNJ2jJ1mooJ3k1J6Jjj3K3j0qJ2oMJlj1PPqM
6045BJ4j3KPj3JjrORpkNl%Qk5K2Jj5J1OpNOj9NJ9k1lLm%J6Kk3J8Lj5PNrOK4l0
6090fJ2lOMLj0oJ1jj7J0JJJ7k4OJ1k4PJ6j1L%oj1J8mk7L6rk0J1J1Lm%j0LJklJ
6132fLrJ2Jkj7jK2j1qJ4mj3J4OnPLj2%K4j9%QprNOQkj0nJ5Kj4Rj3LK6pj2jkrR
6177aJ7j7Nj4j6L5MnrmjjJ7joqnJ0LNj8J1j1LJ4jorMNJ3j7MlmOmQj2OpoJ4J4j8
6222fMJ1k1K4kkrJ1rPLj4LlKoJ6%j4Qk0J6JMj0loJ7Qj1jj6MJ0MLoMk7K4LJmNj0
$$ plain form
5920 19 -7 -4 11 -2 6 27 4 -8 5 -8 0 -2 8 2 10 7 -23 -8 -3 -2 -4 -6 -9 -2 0 -13 -12 7 -8 5 0 -8 3 -11 -13 6 -3 -22 -2 -12
5960 -12 -12 8 10 5 1 12 2 -2 19 5 1 13 -1 -5 4 -9 3 -4 13 2 5 8 -12 10 3 8 21 18 -5 4 6 6 20 6 -14 4 -3 -12 9 8
6000 8 5 3 1 -19 -1 8 -3 3 18 -3 -6 -8 -13 -3 -6 -4 -10 -8 -16 -11 1 0 11 7 1 -5 8 -13 3 4 3 -10 13 3 -5 7 1 5 6 3 -8 -1 6 -2 2
6045 2 16 3 5 12 -1 0 -1 -10 -4 5 -2 -4 1 -2 -2 6 -19 3 4 -11 0 6 -1 4 10 -9 -4 15 -6 -9 -6 -10 -10 6 8 -15 3 6 -9 -2 3 -6 0 24 -6
6090 -6 6 3 9 13 16 6 0 11 10 -7 3 4 5 22 -2 4 15 -9 -2 14 3 6 6 0 -11 7 3 -24 12 3 -17 -6 5 8 4 4 -6 -3 -2 -4 -7 -6
6132 -6 -3 -12 0 1 -1 -18 -19 3 -8 -16 -2 -6 -19 -5 1 -4 3 6 -6 -6 18 -1 -1 7 0 -9 -4 2 10 8 -2 -7 8 10 -4 5 -8 -5 21 14 2 1 -1 -10 -1
6177 -1 16 -1 4 -10 -26 9 13 8 -1 -5 -6 -7 10 9 3 -5 -10 0 3 8 -10 1 -10 -7 7 6 0 -9 -5 0 13 -4 0 -3 -7 -1 -5 3 -9 -3 -10 -16 -2 12 -6
6222 -6 -2 9 -12 12 10 8 -1 10 1 8 11 -3 0 -3 -1 -7 9 9 -5 3 -17 -1 0 4 -6 -9 -15 2 10 -1 -2 -18 -14 -4 0 3 -3 1 -26 -2 1 2 -2 3 -7
6267gqJ9Mj4NNJPj1qJ1%kNkrkJ0kJ0qpPJ0rOlKpPj0J2j1QnJ3rj2JJ8k0kMQpj2
6313a4J3mmJ3jpMjj5K2nrMLk%QLk4J5Lj6J0JKkMkMpjQjKRqJ1j4J3j3%rOOJj4N
6360cNLOKq%Nj3J9llj4Nj7J7l%j0J6j8J0nmJ6J1j2oJ7%j4%M%Noj1J6KrrK4j0O
6403A1Kj0RLojJMrmOj6KlK0j4K%%J8jj2NpqJ1%Nk0J1%KJ0Mk2JmlJ1pJ9k3%LJ5
6448EkNj1Lkq%Rj0MJ1Ml%n%NkmNJ6k5O%OLj3J1j1JRqm%mJ2LOk0J1mOOj3%qKOL
6497AqKj1J5Kj2J6j0j1JJ7mLo%kM%Rj5QJ6k1NJ1mpNkPJjj1j4J9QKj4%QoJ0j5J4
6541A0jqKlQlQj4mnJ2rLNLJrqPLkRNojJ2pj2K1j5qNNpMljnkJ2MnrJ3J3nk7K7k
6590A1KOnkkmJLpRJ0j4JL%lpNQj0J2j5J7j4j2K0j1Qj2MnJ6j4oOlONmlKlNJKrJ
$$ plain form
6267 -7 -15 4 8 -6 -1 4 5 12 1 -7 4 4 2 7 5 -4 -6 4 2 12 4 -3 4 14 5 11 8 10 3 10 0 12 1 9 4 17 8 -4 -3 15 -5 -7 -3 5 -2 -14
6313 -14 -1 -5 -9 4 3 -4 0 -1 -16 6 1 -8 -4 -1 -3 -3 5 8 -16 -1 2 -14 -4 -3 -1 -3 1 -1 3 -4 -5 3 2 4 13 5 16 2 15 2 2 -7 -1 5 6 -8 -3
6360 -3 2 5 11 13 5 5 10 -3 16 13 10 -4 1 -16 1 -2 -2 -12 4 -14 -4 -9 -13 3 14 2 -4 13 13 -1 -1 3 3 8 2 -9 7 9 0 -9 15 5 11
6403 11 13 3 12 15 9 8 9 13 4 0 6 -10 -8 -11 9 -5 -3 -3 -3 15 14 2 7 0 -8 3 3 8 -12 -1 -1 1 11 15 -7 -6 -10 -13 -2 -9 10 -13 -13 -10 5
6448 5 3 8 -3 0 -2 -10 -10 -1 -11 -7 4 8 5 5 0 0 5 3 -1 4 20 -5 1 1 7 10 -3 8 -3 -2 7 -1 -5 -5 -9 3 6 12 -8 3 -1 5 11 -2 -2 -10 -8 -2 1
6497 1 -7 -5 -16 -1 1 -11 5 -5 -16 -15 2 -2 1 -5 -5 -7 -3 -3 6 -9 -1 15 -6 -1 10 6 -1 4 2 9 10 9 -2 -16 3 11 13 -1 -1 7 1 11 -4 10
6541 10 9 1 3 0 8 5 13 -1 -5 -10 2 -7 -4 1 4 5 -4 -12 -5 -2 -4 5 10 4 3 15 8 -4 17 2 -6 -1 4 -3 1 -2 -3 -8 -10 2 6 1 -8 5 18 13 -14 13 11
6590 11 13 19 14 12 10 6 7 10 3 12 22 8 9 12 12 9 2 7 15 5 17 2 19 5 -7 13 2 10 -2 2 -3 13 -1 -7 -1 -4 2 7 3 0 2 -1 4 5 7 -2 -1
6637aj2JJ3Rj8RlJKkJOJnjpjJ7klQRk0J0qQrpJ4o%LmnQrJ1Pj6Oqp%J6jLnqNlm
$$ plain form
6637 -1 -13 -12 1 10 -8 1 -2 -1 1 -1 0 6 7 2 1 -6 -7 10 8 5 13 22 2 12 4 12 3 -4 10 4 4 7 3 -2 6 -3 8 15 -1 5 -3 -10 -10 6 5 8 3 -5 0 -3 -7
$$ [...]
8191b
##END NTUPLES=NMR FID
##END=
