##TITLE=1H_LY-835.40
 CCl4 8 sc, 
 6.6.2019
##JCAMPDX= 6.0         $$ Bruker NMR JCAMP-DX V2.0
##DATA TYPE= NMR FID
##DATA CLASS= NTUPLES
##ORIGIN= UXNMR, Bruker Analytische Messtechnik GmbH
##OWNER= root
$$ XWIN-NMR		Version 3.5
$$ Thu Jun  6 14:20:12 2019 Russian Standard Time (UT+4h)  she@DPX200
##.OBSERVE FREQUENCY= 200.13155
##.OBSERVE NUCLEUS= ^1H
##.DELAY= (6, 6)
##.ACQUISITION MODE= SIMULTANEOUS
##.ACQUISITION SCHEME= undefined
##.AVERAGES= 8
##.DIGITISER RES= 18
##SPECTROMETER/DATA SYSTEM= spect
##.PULSE SEQUENCE= zg30
##.SOLVENT NAME= CDCl3
##.SHIFT REFERENCE= (INTERNAL, CDCl3, 0, 15.7039)
##AUDIT TRAIL= $$ (NUMBER, WHEN, WHO, WHERE, WHAT)
$$ ##TITLE= Audit trail, XWIN-NMR		Version 3.5
$$ ##JCAMPDX= 5.01
$$ ##ORIGIN= Bruker BioSpin GmbH
$$ ##OWNER= she
$$ F:/spectra/data/she/nmr/H-F/1/audita.txt
$$ ##AUDIT TRAIL=  $$ (NUMBER, WHEN, WHO, WHERE, WHAT)
(   1,<2019-06-06 14:18:47.62 +0400>,<she>,<DPX200>,
      <created by zg, POWCHK disabled, PULCHK disabled
       configuration hash MD5:
       00 E9 B6 7A A2 85 ED C7 34 08 36 98 17 FE 4E 26
       data hash MD5: 16K
       64 9D E8 BA AB 6C 5E 84 14 29 7C 1C B7 F1 BD F8>)
$$ ##END=
$$ 
$$ hash MD5
$$ 49 2C 14 CF D7 AF 43 3A BC 1C 5D B4 F7 18 03 F0
##$RELAX= 
##$RELAX= 
##$RELAX= 
##$RELAX= 
##$RELAX= 
##$RELAX= 
$$ Bruker specific parameters
$$ --------------------------
##$DU= <F:/spectra>
##$EXPNO= 1
##$NAME= <H-F>
##$PROCNO= 1
##$TYPE= <nmr>
##$USER= <she>
##$AMP= (0..31)
100 100 100 100 100 100 100 100 100 100 100 100 100 100 100 100 100 100 
100 100 100 100 100 100 100 100 100 100 100 100 100 100 
##$AQSEQ= 0
##$AQ_mod= 1
##$AUNM= <au_zg>
##$AUTOPOS= <>
##$BF1= 200.13
##$BF2= 200.13
##$BF3= 200.13
##$BF4= 200.13
##$BF5= 200.13
##$BF6= 200.13
##$BF7= 200.13
##$BF8= 200.13
##$BYTORDA= 1
##$CFDGTYP= 0
##$CFRGTYP= 5
##$CHEMSTR= <none>
##$CNST= (0..31)
1 1 145 1 1 1 1 1 1 1 1 1 1 1 1 1 1 1 1 1 1 1 1 1 1 1 1 1 1 1 1 1 
##$CPDPRG= <>
##$CPDPRG1= <>
##$CPDPRG2= <>
##$CPDPRG3= <>
##$CPDPRG4= <mlev>
##$CPDPRG5= <mlev>
##$CPDPRG6= <mlev>
##$CPDPRG7= <mlev>
##$CPDPRG8= <mlev>
##$CPDPRGB= <>
##$CPDPRGT= <>
##$D= (0..31)
0 1.2 0 0 0 0 0 0 0 0 0 0.03 0 0 0 0 0 0 0 0 0 0 0 0 0 0 0 0 0 0 0 0 
##$DATE= 1559816327
##$DBL= (0..7)
120 120 120 120 120 120 120 120 
##$DBP= (0..7)
150 150 150 150 150 150 150 150 
##$DBP07= 0
##$DBPNAM0= <>
##$DBPNAM1= <>
##$DBPNAM2= <>
##$DBPNAM3= <>
##$DBPNAM4= <>
##$DBPNAM5= <>
##$DBPNAM6= <>
##$DBPNAM7= <>
##$DBPOAL= (0..7)
0.5 0.5 0.5 0.5 0.5 0.5 0.5 0.5 
##$DBPOFFS= (0..7)
0 0 0 0 0 0 0 0 
##$DE= 6
##$DECBNUC= <off>
##$DECIM= 24
##$DECNUC= <off>
##$DECSTAT= 4
##$DIGMOD= 1
##$DIGTYP= 9
##$DL= (0..7)
0 120 120 120 120 120 120 120 
##$DP= (0..7)
150 150 150 150 150 150 150 150 
##$DP07= 0
##$DPNAME0= <>
##$DPNAME1= <>
##$DPNAME2= <>
##$DPNAME3= <>
##$DPNAME4= <>
##$DPNAME5= <>
##$DPNAME6= <>
##$DPNAME7= <>
##$DPOAL= (0..7)
0.5 0.5 0.5 0.5 0.5 0.5 0.5 0.5 
##$DPOFFS= (0..7)
0 0 0 0 0 0 0 0 
##$DQDMODE= 0
##$DR= 18
##$DS= 0
##$DSLIST= <SSSSSSSSSSSSSSS>
##$DSPFIRM= 0
$$ [...]
##$SUBNAM2= <"">
##$SUBNAM3= <"">
##$SUBNAM4= <"">
##$SUBNAM5= <"">
##$SUBNAM6= <"">
##$SUBNAM7= <"">
##$SUBNAM8= <"">
##$SUBNAM9= <"">
##$SW= 24.9336996594482
##$SWIBOX= (0..15)
0 0 2 0 0 0 0 0 0 0 0 0 0 0 0 0 
##$SW_h= 4990.01996007984
##$TD= 16384
##$TD0= 1
##$TE= 0
##$TE2= 300
##$TE3= 300
##$TEG= 300
##$TL= (0..7)
0 120 120 120 120 120 120 120 
##$TP= (0..7)
150 150 150 150 150 150 150 150 
##$TP07= 0
##$TPNAME0= <>
##$TPNAME1= <>
##$TPNAME2= <>
##$TPNAME3= <>
##$TPNAME4= <>
##$TPNAME5= <>
##$TPNAME6= <>
##$TPNAME7= <>
##$TPOAL= (0..7)
0.5 0.5 0.5 0.5 0.5 0.5 0.5 0.5 
##$TPOFFS= (0..7)
0 0 0 0 0 0 0 0 
##$TUNHIN= 0
##$TUNHOUT= 0
##$TUNXOUT= 0
##$USERA1= <user>
##$USERA2= <user>
##$USERA3= <user>
##$USERA4= <user>
##$USERA5= <user>
##$V9= 5
##$VALIST= <valist>
##$VCLIST= <CCCCCCCCCCCCCCC>
##$VD= 0
##$VDLIST= <DDDDDDDDDDDDDDD>
##$VPLIST= <PPPPPPPPPPPPPPP>
##$VTLIST= <TTTTTTTTTTTTTTT>
##$WBST= 1024
##$WBSW= 4
##$XGAIN= (0..3)
0 0 0 0 
##$XL= 0
##$YL= 0
##$YMAX_a= 44306
##$YMIN_a= -57013
##$ZGOPTNS= <>
##$ZL1= 120
##$ZL2= 120
##$ZL3= 120
##$ZL4= 120
##$ABSF1= 10
##$ABSF2= 0
##$ABSG= 5
##$ABSL= 3
##$ALPHA= 0
##$AQORDER= 0
##$ASSFAC= 0
##$ASSFACI= 0
##$ASSFACX= 0
##$ASSWID= 0
##$AUNMP= <proc_1d>
##$AZFE= 0.1
##$AZFW= 0.1
##$BCFW= 1
##$BC_mod= 2
##$BYTORDP= 1
##$COROFFS= 0
##$CY= 11.3945322036743
##$DATMOD= 1
##$DC= 2
##$DFILT= <>
##$DTYPP= 0
##$F1P= 18.9103706918063
##$F2P= -1.10871071338519
##$FCOR= 0.5
##$FTSIZE= 0
##$FT_mod= 4
##$GAMMA= 1
##$GB= 0.15
##$INTBC= 1
##$INTSCL= 1
##$ISEN= 128
##$LB= 0.24
##$LEV0= 0
##$LPBIN= 0
##$MAXI= 10000
##$MC2= 0
##$MEAN= 0
##$ME_mod= 0
##$MI= 1.114404
##$NCOEF= 0
##$NC_proc= 0
##$NLEV= 6
##$NOISF1= 3.799351
##$NOISF2= 2.8
##$NSP= 1
##$NTH_PI= 0
##$NZP= 0
##$OFFSET= 15.70392
##$PC= 1
##$PHC0= -8573.929
##$PHC1= 12.00019
##$PH_mod= 1
##$PKNL= yes
##$PPARMOD= 0
##$PSCAL= 0
##$PSIGN= 0
##$REVERSE= no
##$SF= 200.130013532006
##$SI= 16384
##$SIGF1= 3
##$SIGF2= 2
##$SINO= 400
##$SIOLD= 16384
##$SREGLST= <1H.CDCl3>
##$SSB= 0
##$STSI= 0
##$STSR= 0
##$SW_p= 3612.71676300578
##$SYMM= 0
##$S_DEV= 0
##$TDeff= 0
##$TDoff= 0
##$TI= <>
##$TILT= no
##$TM1= 0
##$TM2= 0
##$TOPLEV= 0
##$USERP1= <user>
##$USERP2= <user>
##$USERP3= <user>
##$USERP4= <user>
##$USERP5= <user>
##$WDW= 1
##$XDIM= 8192
##$YMAX_p= 0
##$YMIN_p= 0
$$ End of Bruker specific parameters
$$ ---------------------------------
##NTUPLES= NMR FID
##VAR_NAME=  TIME,          FID/REAL,        FID/IMAG
##SYMBOL=    X,             R,               I
##VAR_TYPE=  INDEPENDENT,   DEPENDENT,       DEPENDENT
##VAR_FORM=  AFFN,          ASDF,            ASDF
##VAR_DIM=   8192,          8192,            8192
##UNITS=     SECONDS,       ARBITRARY UNITS, ARBITRARY UNITS
##FACTOR=    0.0002004,     1,               1
##FIRST=     0,             0,               0
##LAST=      1.6414764,     0,               0
##MIN=       0,             -57013,          0
##MAX=       1.6414764,     44306,           0
$$ Real data points
##PAGE= N=1
##DATA TABLE= (X++(R..R)), XYDATA
$$ [...]
1133B37k46l46M07K52k66k00J17J17j04N8J32l25oM97k96l89N61Mn35M42J19n69
$$ 237 -9 -355 52 304 38 -162 -45 72 -32 26 158 -167 -173 324 28 -361 200 204 -331 111 230 -339
1155c39M20K27p11L71N24o97%M50n17K29O06p72j57P13m70j52P71m87l78P25m57
$$ -339 81 308 -403 -32 492 -205 -205 245 -272 -43 563 -209 -366 347 -123 -275 496 9 -369 356 -101
1176a01m58J052j11q52N45P2o30P07K82q82K47M74n85K8N37k69j63K01j49j21
$$ -101 -559 493 382 -470 75 147 -483 224 506 -376 -129 345 -240 -212 325 56 -107 94 -55 -176
1196a76K18K00j63l75K63L73n47j3O73n72k73R74n94p73J386j50j393J224M71
$$ -176 42 242 79 -296 -33 340 -207 -220 453 -119 -392 582 -12 -785 601 451 -942 282 753
1215G53j668R10R52j774M94J564j755l65J926j049q47J721o84j217J588l0j385
$$ 753 -915 -5 947 -827 -333 1231 -524 -889 1037 -12 -859 862 178 -1039 549 519 -866
1232h66J133M15j327N00O00q09L67N30p91p5M89j62J1O3q0J07k30m4L91k78l3
$$ -866 267 682 -645 -145 455 -354 13 543 -248 -323 166 4 15 78 -2 105 -125 -169 222 -56 -89
1253h9N69p08l54J162m42p78J202l24j083J373q3j509J454M94j921J054R73j971
$$ -89 480 -228 -582 580 138 -640 562 238 -845 528 445 -1064 390 884 -1037 17 990 -981
1271i81Q18J418k163L49J973j994m00K286j462r26K284j125j478K349l08j947
$$ -981 -163 1255 -908 -559 1414 -580 -980 1306 -156 -1082 1202 77 -1401 948 640 -1307
1287a307J791L39j940J233P79j738P66J027j503N1J105o94j44N79m16j61L15j5
$$ -1307 484 823 -1117 116 895 -843 -77 950 -553 -502 603 -91 -235 344 -72 -233 82 67
1305F7L8k39O9N08p35k60J295o50r02J553n32j464K040O8k354J815R77k765J278
$$ 67 105 -134 -65 443 -292 -552 743 93 -809 744 212 -1252 788 856 -1498 317 1294 -1471 -193
1324a93J867k839N55K462k777l79L177k046j357L054j321j930K935n65k380K552
$$ -193 1674 -1165 -610 1852 -925 -1304 1873 -173 -1530 1524 203 -1727 1208 643 -1737 815
1340H15L00k654J728R04k312J192J285k111M69J434j576p4J344q21j98P16o53
$$ 815 1115 -1539 189 1093 -1219 -27 1258 -853 -384 1050 -526 -600 744 -77 -275 441 -212
1357b12j19N55k36J42m7m24O09j69p35J116k5j242J139J45j601J487P03k289J122
$$ -212 -331 224 -12 130 83 -341 268 99 -636 480 455 -787 352 497 -1104 383 1086 -1203 -81
1376h1J350k458Q15K016k665J79K744k602p96L390j909j796L403j077k567L247
$$ -81 1269 -1189 -374 1642 -1023 -844 1900 -702 -1498 1892 -17 -1813 1590 513 -2054 1193
1392A193j00l206K648J108l249J541J610k889Q23K117k323PK085j673o52J751
$$ 1193 1093 -2113 535 1643 -1606 -65 1545 -1344 -521 1596 -727 -720 1365 -308 -960 791
1408G91q55n62J366o03p10Q45j92l88L55r6L06N3o91M72L6r52J169N65j715R70
$$ 791 -64 -626 740 137 -573 272 80 -308 47 -49 257 310 -381 91 127 -825 344 909 -806 164
1428A64R27k449O52K246k088k1K422k462j131L162j350j662L234p39k736K523
$$ 164 1091 -1358 -706 1540 -548 -569 1853 -609 -1740 1422 72 -1590 1644 905 -1831 692
1444F92k8k689K663J070l053J523J297l125R08K224k294N11K291k512r16K280
$$ 692 664 -2025 638 1708 -1345 178 1475 -1650 -742 1482 -812 -301 1990 -522 -1438 842
1460H42j153o47K291o87j395J142n00j034J310M66n02L16m52m92L25l01L97Q49
$$ 842 -311 -958 1333 646 -749 393 -107 -1141 169 635 133 449 -3 -495 -170 -471 -74 775
1478G75o18RL50j512J00J630q34N4J577j720j105J800j026o48K951p18k366J920
$$ 775 157 166 516 -996 -896 734 -100 -46 1531 -189 -1294 506 -520 -1168 1783 1065 -1301 619
1496F19m41k388K719J152k720J602J129l528O61K548k079L73K575k359j297K157
$$ 619 178 -2210 509 1661 -1059 543 1672 -1856 -1195 1353 -726 -353 2222 -137 -1434 723
1512G23j268r26K737j34j579J007p05j493J565Q01p23P65j11j391J19K47j5R76
$$ 723 -545 -1471 1266 1132 -447 560 -145 -1638 -73 728 5 770 659 -732 -613 -366 -381 595
1530E95K02n73n3p08l00R00j25R4J223r05j230Q92n25n94K161Q0j707J109k23
$$ 595 797 224 171 -537 -837 63 -62 32 1255 350 -880 12 -513 -1107 1054 1134 -573 536 313
1549C13k161J540J456j535R60Q73k679J09J893j432L10K134j660j001J572j339
$$ 313 -1848 -308 1148 -387 573 1446 -1233 -1124 769 -663 -353 1781 121 -880 692 -647
1565f47p74K477k61j330J422o20j773J397N18r74J358L85j846J08N22o89Q42Q72
$$ -647 -1421 1056 795 -535 887 267 -1506 -109 409 -565 793 1178 -668 -560 -38 -727 115 987
1583I87q27j11L1q08L05O13q8M88j36r15L05Q5n58Q74L81q28N98Nj459P07R84
$$ 987 160 49 80 -728 -423 190 102 590 454 -461 -156 -71 -629 245 626 -202 396 401 -1058 -351 633
1604F33j025N86R15j668r0J239j213M4J869j054r74J318p58r00J754j59j240J282
$$ 633 -392 194 1109 -559 -649 590 -623 -579 1290 236 -738 580 -178 -1078 676 517 -723 559
1622E59k0j497R11N00j069Q70N30j297L73N65j002L55Q02o82J62L82r47J28P50
$$ 559 539 -958 -47 453 -616 254 784 -513 -140 425 -577 -222 580 -102 60 442 -505 -377 373
1641C73m62J22M15p43O8N37o48K19O90p18q3N77o51O1Q23p47k11Q99n83l70Q78
$$ 373 -89 33 448 -295 -227 310 -338 -119 571 -147 -230 347 -304 -243 580 -167 -378 521 -62 -432 446
1662D46m98l85J003m95o63R64j84p14R10j33q23Q76j2r80Q92L54j018N10L21r84
$$ 446 -52 -437 566 71 -592 372 188 -526 384 251 -572 304 292 -688 204 558 -460 50 371 -613
1682f13O02O50j019K45P19r37L1P84o58mP74p02k66P65m07k83O36l24k06O08m25
$$ -613 -11 639 -380 -135 584 -353 -322 462 -196 -200 574 -128 -394 371 -36 -319 317 -7 -213 395 -30
1703c0l82O04j68k18N39l26l03N56l56l56P63j27m48N64l05n72Q17mo84P07R7
$$ -30 -412 192 24 -194 345 19 -284 272 -84 -440 323 196 -252 312 7 -565 252 248 -436 271 368
1724C68q24N05J81p45O46M36r26K70M85p94K25O07o43J64N77q27r2P40m75m5O40
$$ 368 -456 49 230 -515 131 567 -359 -89 396 -398 -173 434 -209 -45 532 -295 -387 353 -122 -167 473
1745D73n81k39P18m52l16P76k55m02N48k99l85P30j26n57N54om90M46j2m38M91
$$ 473 -108 -347 371 -81 -397 379 124 -278 270 -29 -414 316 190 -367 187 181 -309 137 125 -313 178
1766A78N4n40L48J44l92L18J4m50M44J14m99L45J19m89L99J00o07N03L27q09K91
$$ 178 232 -308 40 184 -208 110 124 -326 118 232 -267 78 197 -292 107 207 -400 103 430 -379 -88
1787h8M66o98K59N75q37M7Q12p19k14Q66m78l61P61m01m47Q34j54o38N77km85
$$ -88 378 -320 -61 514 -323 -276 536 -183 -397 469 -9 -370 391 -10 -457 377 223 -415 162 160 -325
1808c25M78L2m83M56M8n19L13J45k88L17k9m36L42P1l52L67O7m12L48m2n30N46
$$ -325 153 185 -298 158 206 -313 0 145 -143 174 145 -291 51 122 -230 137 204 -208 140 98 -432 114
1830A14K67o23L04J67o59M16M16p17K91N18p93OO34n32M4O58o69k16P45m04k74
$$ 114 381 -242 62 229 -430 -14 402 -315 -24 494 -299 -293 341 -191 -147 511 -158 -374 371 -33 -307
1851c07O60l35k98O02l59l42P01j70m61N06j53l60O08j41n24N74on38M66M5m41
$$ -307 353 18 -280 322 -37 -379 322 152 -309 197 44 -316 292 151 -373 201 195 -343 123 168 -273
1872b73M94l4n99N00J56n13M39N7o15M97J70p11N34L71q20K84M07p75L81O55r04
$$ -273 221 187 -412 88 244 -269 170 227 -388 109 279 -432 102 473 -347 -63 344 -431 -50 605 -299
1893b99N1P36p43p2Q18o04j54P63o32l51Q75k96l84O47l55m23P07k00m42O50j32
$$ -299 -248 488 -255 -327 491 -113 -267 496 -136 -487 388 92 -292 355 0 -423 284 84 -358 292 160
1914A60m76M57j56k57O19k05m86N50j71l93P06k27n45Q10k05q33R28J15r19P93
$$ 160 -316 141 -15 -272 347 142 -344 206 35 -358 348 121 -424 386 181 -652 276 391 -528 265
1934B65J50j163Q24N96j264N04Q13j220K04R48j047J00J095j022l30J111o49l74
$$ 265 415 -748 76 672 -592 -88 725 -495 -291 657 -390 -290 805 -217 -547 564 -85 -459
1952d59J035n56n43R82m04o14R32j62n80O48k38n22P58p8n35N90j54m85O31k15
$$ -459 576 20 -523 459 55 -559 373 211 -369 279 41 -481 277 199 -336 254 100 -385 246 31
1972C1m00Q25k98p01P97j49o12R91j54j039R98P5j117J021L59j300P81M67j439
$$ 31 -369 456 158 -543 254 105 -507 484 330 -709 289 364 -753 268 627 -673 108 575 -864
1991h64Q62R34j488L25J012j408K28J342j303j46J442j193n39J554p27o97J411
$$ -864 -2 932 -556 -231 781 -627 -399 943 -360 -506 936 -257 -796 758 31 -666 745
2008G45o36r52J363k15j037J095K9r69Q33K1q84P85K11p93N71Q1o77O10Po47P57
$$ 745 109 -843 520 305 -732 363 392 -577 256 277 -607 178 389 -404 167 248 -429 181 188 -459 298
2029B98J0q10P26j0p87R41J5j154R72L78j294Q96M94j556Q12R15j588O26J267
$$ 298 308 -502 224 214 -573 368 383 -771 201 579 -715 181 675 -881 -69 846 -742 -116 1151
2048A151j798J8J521j384J5J783j490p81J756r28p87J912n92j258J439m32j274
$$ 1151 -647 -629 892 -492 -477 1306 -184 -965 791 -137 -924 988 396 -862 577 145 -1129
2065a129J601K17j336R77J04j296R49L94j096Q07M59j122M43L12q82O58M27q39
$$ -1129 472 689 -647 330 434 -862 87 481 -615 192 651 -471 -28 284 -598 60 487 -352
2083c52N65J99j020N34L70p92Q56L28j361O33N31j229P72Q38j528N40J070j716
$$ -352 213 412 -608 -74 296 -496 360 688 -673 -40 491 -738 34 872 -656 -116 954 -762
2101g62K83J499j527p7J747j421m79J816j357r52K156n58j191J763o52j699J748
$$ -762 -479 1020 -507 -584 1163 -258 -737 1079 -278 -1230 926 368 -823 940 288 -1411 337
2118C37K39j446J513L17j954P66O81j235R82Q63j511J94P10j070L69Q59p96K38
$$ 337 576 -870 643 960 -994 -228 453 -782 200 1063 -448 -254 456 -614 -245 614 -182 56
2136E6M74r78J95N52o93M70N37r48M00L93j240N32R54j042M27P95j641J98J414
$$ 56 530 -448 -253 299 -394 76 613 -335 65 458 -782 -250 704 -338 89 884 -757 -559 855
2155H55j325O0J614j447n95J723j127p08K036q58j321J882l62j552J675m5j682
$$ 855 -470 -410 1204 -243 -838 885 -242 -950 1086 228 -1093 789 427 -1125 550 505 -1177
2172a177J622N21j872R83O79j757Q12J162j414L57R64j525RJ275p57k2Q78r91
$$ -1177 445 966 -906 77 756 -1001 -189 973 -441 -84 880 -645 -636 639 -118 -140 738 -253
2190b53k54Q68n60nP66o25j24N15p14J31Q12p71M6P77r32j1R43r93o4J332j001
$$ -253 -507 361 -199 -204 562 -63 -187 328 -386 -255 557 -214 -168 609 -323 -334 609 -384 -448 884 -117
2211a17m96J353r09o47J654o72j072J635m08j427J594J26j531J306L18j758J106
$$ -117 -613 740 -169 -816 838 166 -906 729 321 -1106 488 614 -917 389 707 -1051 55
2228E5Q80j688N96J023j524L43J189j323P4J204j133k55J214p45l08R94p12m39
$$ 55 935 -753 -157 866 -658 -315 874 -449 -375 829 -304 -559 655 -90 -398 596 -116 -555
2246e55J040m27m57Q13l77m37P15l40l23P62l46m18O30l61k61Q52m92m88R19m21
$$ -555 485 58 -399 414 37 -400 315 -25 -348 414 68 -350 280 -81 -342 510 18 -470 449 28
2266B8o13J073k81p98J041k30j055J181K03j239Q77L22j291Q63O64j394N30Q92
$$ 28 -585 488 207 -591 450 220 -835 346 549 -690 187 509 -782 81 745 -649 -119 773
2284G73j339K41J129j159j2J114j047k70J307p35n96J077m52n70J023l17p25Q54
$$ 773 -566 -325 804 -355 -367 747 -300 -570 737 2 -594 483 31 -539 484 167 -558 296
2302B96r4o14O66q4n74N83m3m74O55q0o70M77Pl56P24r2q26M84J00n11P63J63
$$ 296 202 -412 254 170 -404 179 136 -338 317 237 -433 44 51 -305 419 327 -499 -15 85 -426 337 500
2324E00q65L98J16p89P38N75r36K13L97r18M19Q28r51rQ55p99j16R05p50l30J004
$$ 500 -365 33 149 -640 98 673 -263 -50 347 -571 -152 676 -275 -284 571 -228 -344 561 -189 -519 485
2345D85m53l79R49n10p86P88ql83R10k25j025N16K15m75P12J99q31K40J67n51
$$ 485 32 -347 602 92 -694 94 86 -297 613 388 -637 -121 94 -381 331 530 -301 -61 106 -445
2365d45M65M19n75J24K28m35K36J79n67K59M50l42J99O0q14J98O11l12L37L88
$$ -445 20 439 -136 -12 216 -219 17 196 -371 -112 338 -4 195 255 -559 -361 250 -62 275 663
2385F63r82k53N90k68L35Q00q13n97N54k69o9Q80l36n70O08k44n41P05j0n69O07
$$ 663 -319 -572 18 -250 85 885 72 -525 29 -240 -309 571 235 -335 273 29 -512 193 183 -386 221
2406B21J56n94L32op37M77O26l46J29p2q06K00O25j25K22J79p52j33L60j44L33
$$ 221 377 -217 115 109 -628 -151 475 129 258 186 -620 -420 205 80 302 481 -271 -404 -44 -188 145
2427A45L87n94j70L58k93M6L74l90jN47l37k69K98l64p9O91q6k48K78n41m22P47
$$ 145 532 -62 -232 126 -167 -121 253 -137 -138 409 72 -197 101 -263 -342 349 263 15 293 -248 -670 77
2449G7K22j86L25m20o61N28L00k85M08J2o47K00K22l20K89K40m75J28K85l54M4
$$ 77 299 113 438 18 -643 -115 185 -100 308 320 -327 -127 95 -225 64 304 -171 -43 242 -112 -68
2470f8J27l28K51M22l50j27R2l45J70M67k30j8J53n05m0M98j14lK80m71j93N08
$$ -68 59 -269 -18 404 54 -73 19 -326 -156 311 81 63 216 -289 -329 169 55 52 332 -139 -332 176
2492A76j68j89M20k02k66M38j53l75M25K6l88L86J08m30J90O6l42L28K62l96J4
$$ 176 8 -181 239 37 -229 209 56 -319 106 132 -256 130 238 -192 -2 64 -278 50 312 -84 -70
2513g0J33k60J62K30k66L4J94k62mJ98j29M6J26k35M3J67j83M4J40j85J06R3l06
$$ -70 63 -197 -35 195 -71 -37 157 -105 -109 89 -40 6 132 -103 -60 107 -76 -32 108 -77 29 122 -184
2536a84J20K76k74%K16l28M8M30l45j40M05k66k18M90j45k98M00j46l89N00J24
$$ -184 -64 212 -62 -62 154 -174 -126 304 -41 -181 224 -42 -260 230 85 -213 187 41 -348 152 276
2557B76m86J93J37l63K97K85m97rK92k23K9L39k32j91J30q4M4K74o4k24q2K1K00
$$ 276 -210 -17 120 -243 54 339 -158 -167 125 -98 -69 270 38 -153 -23 -107 -63 211 147 -77 -159 -138 62
2580F2J26j50m1o6j12K57J05k41P4L7l04K37L48l54r2J68k96J66N25l72l62L10
$$ 62 188 38 -3 -69 -181 76 181 -60 14 51 -253 -16 332 -22 -114 54 -242 -76 449 77 -285 25
2602B5j55m2N76j93n02K83l5k40N51J26n89M5J32k24M20K67n93j07K75j00J70
$$ 25 -130 -172 404 211 -291 -8 -43 -283 268 394 -195 -150 -18 -242 178 445 -148 -255 20 -80 90
2623I0K47l70k25K19JJ01K28k18k97K7J12K57J18k59k04m1P1L62P5l84j8M0j73
$$ 90 337 -33 -258 -39 -38 63 291 73 -224 -197 -85 172 290 31 -173 -214 -143 219 294 -90 -108 -68 -241
2646b41L48L03m82j03K00l01K38N94n06m51M32r8r3O60k86o95M20J81l27M99J26
$$ -241 107 410 -72 -175 25 -276 -38 556 50 -401 31 -67 -160 500 214 -481 -61 120 -207 292 418
2667D18p79Q9L87k24K60L03o50k19M52J4Q0J87m16k59L19J17O3R6k85j92J16Q2
$$ 418 -361 -272 115 -109 151 454 -196 -415 37 51 131 318 -98 -357 -38 79 142 238 -47 -239 -123 -41
2689d1K42J06l88j58J40J9K87J59n01j59L16j11J79L09m73k48L91j38j0N46l74
$$ -41 201 307 -81 -239 -99 -80 207 366 -135 -294 22 -89 90 399 -74 -322 69 -69 -79 467 93
2710I3n65M72O5j96N37j94p56M36L74m03L43J41p64J55N47l48J10L82o58k10O08
$$ 93 -472 0 65 -131 406 212 -544 -108 266 -137 206 347 -417 -262 285 -63 47 429 -229 -439 169
2731A69n0q4K87m27l41N12J47j97J39j60k94K62J70o0R2j74k01J37R9J24R0l71
$$ 169 119 35 322 -105 -446 66 213 16 155 -5 -299 -37 133 73 165 -9 -210 -73 26 150 240 -131
2753a31j15L18p2M2K98m58k58N73j16k88N54k01o47N53K18m89M11J52q45L12O04
$$ -131 -246 72 0 42 340 -118 -376 197 81 -207 347 146 -501 52 270 -219 192 344 -501 -189 415
2774D15n05P2L67o70J7P10m11j45N17m76l27O85r2l32M56k39n07N61K12m37J75
$$ 415 -90 -18 349 -321 -304 406 -5 -150 367 -109 -436 249 157 -175 281 42 -465 96 308 -129 46
2795D6N0l52K47J97k16P4J4j98J48L8q4K06j72k47L35N2k64K65p1l56L89R7m18
$$ 46 96 -256 -9 188 -28 46 60 -138 10 48 -36 170 -2 -249 86 138 -126 139 68 -288 101 198 -220
2818b20K87J16m41L14K06n38L20L02o89K49N51o67LO34o27j47Q64m79n22Q06j57
$$ -220 67 183 -258 56 262 -276 44 346 -343 -94 457 -210 -207 427 -200 -347 517 38 -484 322 165
2839A65n81O30J1n74M54J36n28L33K00m37K16J44l84K57J62m13K04K44l69P0J93
$$ 165 -416 214 225 -349 105 241 -287 46 246 -191 25 169 -215 42 204 -209 -5 239 -130 -60 133
2860A33k71J58K28l31jJ03j61K55Q5l42K21lm82M24M12n58J00L24p18J34Q51n28
$$ 133 -138 20 248 -83 -84 19 -142 113 198 -144 77 74 -408 16 428 -130 -30 294 -424 -290 561 33
2882C3k85N69m26k89P27k05m18N33j96m10O42n1n74M64n5m65P19J73q76K25L18
$$ 33 -252 317 -109 -398 329 124 -294 239 43 -367 275 224 -350 114 59 -406 313 486 -390 -165 153
2903A53m95M16N23o96j85L33k80J24M88k34k11J7k16K70K90l72K6J80l36K66L31
$$ 153 -342 74 597 -99 -284 49 -231 -107 381 147 -64 -47 -263 7 297 -75 -49 131 -205 61 392
2924C92o28q3M89k36J01M88n58m09L78j44K32P09n34o19L32k41L4J000k93q12
$$ 392 -236 -319 170 -66 35 523 -35 -444 -66 -210 22 731 197 -422 -90 -331 -297 703 410 -402
2944d02M54r1n42Q50K89q45K38K93n49K98L94o76K0N02j70J60P8p29jN28m6K85
$$ -402 52 -39 -581 269 558 -287 -49 244 -305 -7 387 -289 -269 233 63 223 301 -428 -429 99 53 338
2966C38K62q50l24M72j8K49N71n54n77K31J0J81M37l41k50K60j98RL83m76j73
$$ 338 600 -250 -574 -102 -120 129 700 146 -431 -200 -190 -9 428 87 -163 97 -101 -92 291 -185 -358
2987c58O96j59k75M96m79p07P53M06k63M14l40r91L88N93q8M44q4r37J33L65k73
$$ -358 338 179 -96 400 -79 -786 -33 373 110 524 184 -807 -419 174 86 530 446 -491 -358 7 -266
3008b66N22L61q58l6N01m37P8N09n39j43P13j90l53J55l29l0O35N0j77J9n73j64
$$ -266 256 617 -241 -277 224 -213 -135 374 -165 -308 405 215 -138 17 -312 -342 293 343 166 185 -388 -552
3030e52O47R2L3K77o50n20O54J52j72M33k71n30M26J00l33L45k2l69M47Q0m79
$$ -552 95 187 220 497 -153 -673 -19 133 -39 394 123 -407 19 119 -214 131 109 -260 187 267 -212
3051b12K79o6n35O56M70o30K6R5o79L71Q02m22j88K65n57q9O44r9j10K63m16j82
$$ -212 67 1 -534 122 592 -38 -12 83 -596 -225 577 155 -33 232 -325 -414 230 131 21 284 -132 -314
3073c14M77j49j37L42k73j44M97k26l91L82n0j94M38o0m05J87l5j85M53M5l44
$$ -314 163 14 -123 219 -54 -198 299 73 -318 64 14 -180 258 198 -207 -20 -55 -240 213 258 -86
3094h6J64j60k60N44N9m74L03O9m86L93K36n60K15L36n12J43L93m70kL71l51O6
$$ -86 78 -82 -342 202 261 -213 90 159 -327 66 302 -258 -43 293 -219 -76 317 -153 -155 216 -135 -69
3116f9M01m51j19M54k77n3M23l81k21N47j88l02M50j10l99L80L9l00K96j4l20
$$ -69 332 -119 -238 216 -61 -114 309 -72 -293 254 66 -236 214 104 -295 85 124 -176 120 106 -214
3137b14K34Q6k02J75o6k07L27J6l11J98lk66L69J04m13J97M7l65L13K71l53R7
$$ -214 20 106 -96 79 13 -194 133 149 -162 36 33 -233 136 240 -173 24 71 -294 19 290 -63 34
3159C4O6m40K86M05m36M3K56m56Q9N11m48j25N10l40k26N55j91m08M10m6k49M45
$$ 34 100 -340 -54 351 -85 -42 214 -242 -153 358 -90 -215 295 -45 -271 284 93 -315 95 49 -200 245
3181B45l1m62J58Q1j03L46k1m09J56J9j85L73R3l84J02K2k36L04K00l67J5J36
$$ 245 214 -248 -90 -9 -112 234 213 -196 -40 -21 -206 167 260 -124 -22 0 -236 68 268 -99 -84 52
3203E2j73K26J03m08J09J93k12K09J80m69L6K74k95J91L90m74k15L47j56M4M34
$$ 52 -121 105 208 -200 -91 102 -110 99 279 -190 -154 120 -175 16 406 -68 -283 64 -92 -48 386
3224C86l67l02L58j08p5M09k42l34L88q5k22M55p8n06K99J54k63K95P0n25J35
$$ 386 19 -283 75 -33 -108 301 59 -275 113 28 -194 261 183 -323 -24 130 -133 162 232 -293 -158
3245a58L34j86P9J01l25K6J78r4J65O6l56N8J51j35K20J25m58L1L22k00Q5K23
$$ -158 176 -10 69 170 -155 -129 49 -45 120 186 -170 -112 39 -96 124 249 -209 -178 144 -56 29 252
3267B52l95m4L51k26J3L28l32k04L84j28j01L89k66l57M18O5k68K73o5l78L10
$$ 252 -143 -187 164 -62 -49 279 -53 -257 127 -1 -102 287 21 -336 82 147 -121 152 87 -291 19
3288A9J58k45J66K2l19J41J48j23J74k2l53J73J94k07J77O0l94J48K79k78N1K37
$$ 19 177 -68 98 120 -199 -58 90 -33 141 119 -234 -61 133 -74 103 163 -231 -83 196 -82 -31 206
3310B06l24j8K94k09J6K26k97p5L41j34p1K16k86r6M14j43j77L04k04k29L44l1
$$ 206 -118 -136 158 -51 -35 191 -106 -181 160 26 -45 171 -115 -211 203 60 -117 187 -17 -246 98 67
3332F7j71K77j02l41K97J02k36K36n1l28K72J59l19J73J52l54R9K40k40N9J79
$$ 67 -104 173 71 -270 27 129 -107 129 78 -250 22 181 -138 35 187 -167 -68 172 -68 -9 170
3353A70l01OK48j11rQ8k25N5K17j67L8J39k55K9K20k33K4K94l08j16L59j50j35
$$ 170 -131 -125 123 12 3 91 -134 -79 138 -29 9 148 -107 -78 142 -91 -67 227 -81 -197 162 12 -123
3376a23L18k18k11M01o2k77K75m4k95L26O2l32K67O5l65J76K20k69J02J05l06
$$ -123 195 -23 -234 167 105 -172 103 59 -236 90 152 -180 87 152 -213 -37 183 -86 16 121 -185
3397a85J14K68k36NJ48k16L7J93j76M1J52k48LK23j39%J36k42pK84j44o8J84j72
$$ -185 -71 197 -39 -34 114 -102 -65 128 -48 -7 145 -103 -100 123 -16 -16 120 -122 -129 155 11 -57 127 -45
3421d5o1K25j39n9K40j71j42K63r5j21K77j73k11L39k8k53K61m4k69K99N2l33
$$ -45 -106 119 -20 -79 161 -10 -152 111 16 -105 172 -1 -212 127 99 -154 107 63 -206 93 145 -188
3443a88K35J37l85J58K50l10O8K06l31M5L37k19j03K12j56n6K37j28q7J72j20
$$ -188 47 184 -201 -43 207 -103 -35 171 -160 -115 222 3 -100 112 -44 -100 137 9 -78 94 -26
3464b6p1J97p5m6J19j54o9K36p0q8J20j34m6K36j19r6K14j34j50K74j01j53L09
$$ -26 -97 100 25 -21 98 -56 -125 111 41 -47 73 -61 -107 129 10 -86 128 -6 -156 118 17 -136 173
3487A73j27k77L29M9l17K17Q7l25K38J65l78J01K14k80Q2K34k56J3K11k96L1L31
$$ 173 46 -231 98 147 -170 47 134 -191 47 212 -166 -65 149 -131 -49 185 -71 -58 153 -143 -112 219
3509B19k27q8K14j88q3L23j23j92K35l7j66J64j9j10J34m8o0J30m4r7J12j13l7
$$ 219 -8 -96 118 -70 -153 170 47 -145 90 53 -113 51 32 -78 56 8 -52 78 34 -63 49 -64 -101
3532a01K91j17k13K01o4j62K90j2k30K09k4k88K54J02k41J92M3l40K17J89l81
$$ -101 190 73 -140 61 -3 -165 125 113 -117 92 68 -220 34 136 -105 87 130 -210 7 196 -185
3553a85J29L03l35J5K87l31p5L86j59j50K82j18k27J97k4n7K43j11k00J40m6n0
$$ -185 -56 247 -88 -73 214 -117 -192 194 35 -115 167 49 -178 19 -5 -62 181 70 -130 10 -36 -86
3575h6K24q2j55J90n0k08K06M3j53J31Nj34J24k7j66J68J1q4K03j02k87K50Q0
$$ -86 138 56 -99 91 41 -167 39 82 -71 60 65 -69 55 28 -138 30 41 -43 160 58 -229 21 101
3598A01k75K78J47l99R2J78l08J18L44l09p4K37k16l0K63j97l4L00k28j67K90
$$ 101 -174 104 251 -148 -56 122 -186 -68 276 -33 -107 130 -86 -116 147 -50 -84 216 -12 -179 111
3619A11j49j40L64p2k79K48j5l09K25J80j85O3K6j98P5J02o8R4m5r8J27n8j61
$$ 111 -38 -178 186 114 -165 83 68 -241 -16 164 -21 42 68 -130 -55 47 -21 73 28 -70 57 -1 -162
3642a62K57K8k67J87R3k85J35J45k93J39K20k48LJ44k24Q6K24k58L1K48l20m3
$$ -162 95 123 -144 43 136 -149 -14 131 -162 -23 197 -51 -48 96 -128 -42 182 -76 -45 203 -117 -160
3664a60L42k20r2L62k28k21L46m7k83K59O4k30J75Qk09J44O8j30J18j2j64J52
$$ -160 182 -38 -130 232 4 -217 129 82 -201 58 122 -108 67 75 -134 10 78 -52 66 54 -110 42
3686D2J8k06K07R6k68Q0J24j90R3J42k00J8J31j41M2P8j44J05R6k62J23J78k74
$$ 42 60 -146 61 157 -111 -31 93 -97 -4 138 -62 -44 87 -54 -12 66 -78 27 123 -139 -16 162 -112
3709a12N2K61l02oL21k70j45L97j18k36K61o9k03K84k8k09J92j0j99J96J5j86
$$ -112 -60 201 -101 -107 214 -56 -201 196 78 -158 103 34 -169 115 87 -122 70 60 -139 57 72 -114
3731a14K14ql06K30J38k50P7J23k14P0J85j90MJ17j18K4P6j37J35K4k18J25J71
$$ -114 100 92 -214 16 154 -96 -19 104 -110 -40 145 -45 -41 76 -42 -18 58 -79 56 80 -138 -13 158
3754A58k50O6J81k74K8K99k49j14K93j31j20K41j02j51K18j03j44K74l2j95J92
$$ 158 -92 -26 155 -119 -91 208 -41 -155 138 7 -113 128 26 -125 93 -10 -154 120 88 -107 85
3775H5r5j80L19J0l04K06P8k75J57J54k33M5J38j79K5J66j22j7L1j15J46J15k23
$$ 85 -10 -190 129 139 -165 41 119 -156 1 155 -78 -33 105 -74 -49 117 -5 -22 9 -106 40 155 -68
3798f8M1Q3j96J19K05k11j5J60k48k5K91q1o8J29k07p3K59q7q2K11j34j20K50
$$ -68 -27 56 -140 -21 184 -27 -42 118 -130 -155 136 55 -13 116 -91 -164 95 8 -74 137 3 -117 133
3821A33j53j60L06l2k34K54L3l28J36R4j61J98J49k93n6Q0q4J59J45j80OJ7k20
$$ 133 -20 -180 126 94 -140 114 147 -181 -45 49 -112 86 235 -58 -114 -34 -118 41 186 6 12 29 -191
3844a91J17K33j39NQ0k37L3K38j34r1J55o7k2J41j58p5J26n8N3K07j74j33P6j27
$$ -191 -74 159 20 25 105 -132 -99 139 5 -86 69 2 -20 121 -37 -112 14 -44 9 216 42 -91 -15 -142
3868a42J1L81o0k81Q6r1j25L30O4k19J01k1k22J83J11j77J12N2k02J44J27l16
$$ -142 -131 250 190 -91 -5 -96 -221 109 173 -46 55 34 -188 -5 106 -71 41 93 -109 35 162 -154
3890a54K1K17j01R7J45l31j23K12mO9J98j82k12N1l9J21K48j25j86L8p8N4K47
$$ -154 -133 84 -17 80 225 -106 -229 -17 -21 48 246 64 -148 -97 -136 -15 233 108 -78 -40 -118 -64 183
3913A83j22j62J54l4o6J56q3j69J51K2oJ42j19k42J04Q4J4K35j01l63R6J20n7
$$ 183 61 -101 53 19 -47 109 26 -143 8 30 24 166 47 -195 -91 -7 7 242 141 -222 -126 -6 -63
3936f3K07P8l53J7J42j25J45J63k74o4J90r6N0J26k46q6K85k5n8J21k23j39K70
$$ -63 144 222 -131 -114 28 -97 48 211 -63 -127 63 -33 17 143 -103 -189 96 71 13 134 -89 -228 42
3959D2P0r5J12j28k10J39J65nL4j35j65J14J17L1L9j49j37J77N3p8J18r0j87J56
$$ 42 112 17 129 1 -209 -70 95 90 124 -11 -176 -62 55 86 125 -24 -161 16 69 -9 109 19 -168 -12
3983a2J05q6R1n9k32J45J82j06M4l1k45J58K31j82jQ4k33K3K94j18r9J44j95q3
$$ -12 93 7 98 39 -193 -48 134 28 72 41 -204 -46 185 3 2 86 -147 -124 170 52 -47 97 -98 -181
4007a81L08Rj97Q0q7o9K29L8j86L8Oq9J62N3j45J2J0q5J47P8j21n2k7nJ73L2j61
$$ -181 127 136 -61 19 -68 -137 92 130 -56 -18 -12 -101 61 114 -31 -19 -9 -94 53 131 10 -42 -69 -74 99 131 -30
4034c0Ml8m0K07K6k04P3L3j79J70J70k65K0J31j85P8K40k54j21K32m9l7J75j71
$$ -30 -26 -64 -104 103 129 -75 -2 31 -148 22 192 -73 -53 78 -107 -29 211 -43 -164 68 19 -18 157 -14
4058a4j88K32L8r7J62p3k28J38Q5o8J10k7k23P9J23k5O5n7j57J07Q9n5M5l5j51
$$ -14 -202 30 68 -29 133 60 -168 -30 55 -13 97 70 -153 -74 49 24 89 32 -125 -18 71 16 61 26 -125
4083a25J18J03r6N4lk11P4K03n8Pk7k13R0K08p5Nlk04P3K16j14k6J09k32l7L30
$$ -125 -7 96 0 54 51 -160 -86 117 59 66 39 -174 -84 124 49 54 51 -153 -80 136 22 -4 105 -127 -164 166
4109A66r0j38J50j76j22L60L6k68Q7k0j72K82J19k87L1M9j54J49K03j88r2M1q1
$$ 166 76 -62 88 -88 -210 150 186 -82 5 -15 -187 95 214 -73 -42 7 -147 2 205 17 -75 -34 -115
4132a15J13J83j22j49PPJ35N1j08l6k8n9J96Q6j88%K3j68J80K53k71j09J45j38
$$ -115 -2 181 59 -90 -83 -76 59 110 2 -34 -62 -121 75 161 -27 -27 -4 -172 8 261 -10 -119 26 -112
4156a12N1L23k07k43K13m5p4K75o1k88J44L6j00K11M0k90K7J10n8J50M1k68K8
$$ -112 -61 262 55 -188 25 -20 -94 181 120 -168 -24 12 -88 123 163 -127 -100 10 -48 102 143 -125 -97
4179i7J39o8J11O0k44J5J16p6R8J16k35o8J54n1O2J16j91j07J73PkO7j29p6J17
$$ -97 42 -26 85 145 -99 -84 32 -44 54 170 -65 -133 21 -30 32 148 -43 -150 23 30 28 95 -34 -110 7
4204GoK5Q3j41p3J28n7M6J65k14j45K44k2j00K18j25k42K79L7k34K11M5l15J34
$$ 7 1 26 109 -32 -105 23 -34 12 177 -37 -182 62 40 -60 158 33 -209 70 107 -127 84 129 -186 -52
4228e2J86k12P9J68k80j3K54r9q2J31j13p7J66j5p7O8k1m6L7j6N3K7j37K0J11
$$ -52 134 -78 1 169 -111 -124 130 31 -51 80 -33 -110 56 41 -36 32 11 -35 2 -14 39 66 -71 -51 60
4253F0r4J8J30j71m4K09j01j13K25p4j52J88m5j42J97j0k08J33O5j57J21O1k01
$$ 60 -34 -16 114 -57 -101 108 7 -106 119 45 -107 81 36 -106 91 81 -127 6 71 -86 35 96 -105
4276a05R9J03j80P0J27j55RR6j37P9J32j88j7J24r3K6J37j91l7J84r2n8J95j04
$$ -105 -6 97 -83 -13 114 -41 -32 64 -73 6 138 -50 -67 57 -36 -10 127 -64 -101 83 -9 -67 128 24
4300B4j20J24k4o3J69o0j59Q2L2lP6p6p8P2qlJ25q3j16J33o2p7K38n3k38J46N9
$$ 24 -96 28 4 -59 110 50 -109 -27 5 2 78 2 -76 -4 -12 -15 110 27 -89 44 -18 -95 143 90 -148 -2 57
4327E7j45J74M6k88R5J90j75M9J41k33k9K04q8k7J86j89j30J92L9o5Q8j01j25
$$ 57 -88 86 132 -156 -61 129 -46 3 144 -89 -118 86 -2 -29 157 -32 -162 30 69 4 92 -9 -134
4350a34J41O1n9L0o6m6R4j8LO6j18n3J52Mo3J02j39j49K28R5j44O1o9j51J58J13
$$ -134 7 68 9 39 -27 -73 21 3 6 72 -46 -99 53 57 -6 96 -43 -192 36 131 -13 48 -21 -172 -14 99
4376I9j01O0j1j88J02J21q4N0J6j87R9J52j47k3P4j22O3K08j73j13J08p4MK28
$$ 99 -2 58 47 -141 -39 82 -2 48 64 -123 -24 128 -19 -42 32 -90 -27 181 8 -105 3 -71 -67 161
4400A61n8j60M7r4j3K19N5j75%l2n7J53M1j20J8L9m2N2rq9M1J2J3J13m9j80L4
$$ 161 103 -57 -10 -104 -117 102 157 -18 -18 -50 -107 46 87 -33 -15 24 -18 34 25 -64 -23 -11 2 115 66 -114 -80
4427h0J4K1K37k4k86J2O7p6J94J11k34m4J20j31N1J91j33q9J48n5m3R6j31j06
$$ -80 -66 -45 192 168 -118 -106 -39 -115 79 190 -44 -88 32 -99 -48 143 10 -79 69 14 -29 67 -64 -170
4451a70K30O2p0L1j64j35K05J21l8N9j10k17Q6J44L2Q0p8j81K3R9kM8m3q1P9Q8
$$ -170 60 122 52 83 -81 -216 -11 110 72 131 21 -196 -110 34 66 146 68 -113 -90 9 7 55 12 -69 10 98
4477I8j04j1l3o5J43J16p8k7r5j70J59K14l2j3q6k51J04K53n1k7N7k00m4K23l7
$$ 98 -6 -17 -50 -115 28 144 66 39 -56 -226 -67 147 115 102 16 -235 -131 122 71 44 101 -99 -143 80 43
4502D3r8J24p3j08K12J6j91QK4k5J91P3k33r4L6J7J68J00j43j11l1k7J40J34p3
$$ 43 -55 69 -4 -112 100 116 -75 -67 -43 -68 123 196 -37 -131 -95 -78 90 190 47 -64 -95 -122 18 152 79
4527G9q6o8l8J41R4j07o5K3k6J30L9j71l4O6j4J00R7j65j26O8lJ01J71j54j92
$$ 79 -7 -75 -113 28 122 15 -50 -27 -53 77 116 -55 -89 -23 -37 63 160 -5 -131 -63 -66 35 206 52 -140
4552a40O6L0N8J59j19j67Q7PpJ52n0j93Q2M8o1J49Mk39K0J46j4O3Kj96k6J85J4
$$ -140 -74 -44 14 173 54 -113 -26 -19 -26 126 76 -117 -35 13 -48 101 105 -134 -114 32 18 81 83 -113 -139 46 60
4579F0j1Pj22l7J05M8K4k0j13l2P0N7O5l5j70J0J19kK8L0j59j6J46l2m3J13j25
$$ 60 49 56 -66 -103 2 50 74 54 -59 -91 -21 36 101 66 -104 -94 25 23 51 81 -78 -94 52 20 -23 90 -35
4606c5r4J76L5j06P0p5j23J76J08j15j7j3j00R9J44p8l8Pj24N6J28l1j4Kj26K3
$$ -35 -129 47 82 -24 46 -29 -152 24 132 17 0 -13 -113 -14 130 52 14 21 -103 -47 81 50 36 38 -88 -65
4632f5J42m1m8J0m9L3J04q6n0O2m0J7J11o1q0L4m9JJ54j2j20Qk0j5J38pj05M8
$$ -65 77 36 -12 -2 -51 -18 86 0 -50 12 -28 -11 100 39 -41 -7 -56 -55 99 87 -33 -25 -45 -60 78 71 -34 14
4660A4j6m5J09j7j07Q5mq5J15K8j56L8P0o6P6P4j74l5J45p0L0J01j22n8P1k9k0
$$ 14 -2 -47 62 45 -62 23 19 -66 49 77 -79 -41 29 -37 39 113 -61 -96 49 -21 9 110 -12 -70 1 -28 -48
4687d8J38n4q2N1k6j1Q2k3q5Q3rj8K6n5j4Q7j3n1N3m0m6Q6j1n7J01n0j19J13N2
$$ -48 90 36 -46 5 -21 -32 50 27 -58 25 16 -2 24 -31 -45 42 29 -22 31 -9 -55 31 20 -37 64 14 -105 8 60
4716F0r4P0J2j24O9Q8j20K8P3j13K2Q3q4PR3r0l4J03m9j9O4o9k0R2m1n3Q8j8o5
$$ 60 -34 36 48 -76 -7 81 -39 -11 62 -51 -29 54 -30 -23 70 -20 -54 49 0 -19 45 -24 -44 48 7 -46 42 24 -41
4745d1P0m4l4J15l9p8P6qo2P7op5Q2j0q9P2M6q1O5nq9O3N8r3J1M9p1M4M6r9L3
$$ -41 29 -15 -49 66 27 -51 25 17 -45 32 26 -49 33 23 -66 6 52 -29 36 31 -58 5 63 -30 -19 30 -41 3 49 -50 -17
4776a7R1j17J9P3o8QM1n0MR3j05l9R2k5JP4j00n5R6ll9Q3l6q5P0rm1J11j1j36
$$ -17 74 -43 -24 49 -19 -11 30 -20 -16 77 -28 -67 25 0 1 75 -25 -80 16 13 -26 57 21 -64 6 -3 -44 67 56 -80
4806h0M4N9m8P4j3j10L9O3n3L9L2j03M3M3n9O2M1j23J7N5l4M1M3j41J2J08l4k2
$$ -80 -36 23 -25 49 36 -74 -35 28 -25 14 46 -57 -14 29 -30 32 73 -50 -33 22 -12 29 72 -69 -57 51 17 -5
4834eN5j00rJ12k8l6O9o5o9R9L2m2K6p6n0J08N8o7Rn3l6R1L1n3L4n8o2R8M3l9
$$ -5 50 -50 -59 53 25 -11 58 -7 -76 23 55 13 39 -37 -87 21 79 12 21 -32 -68 23 54 1 35 -23 -85 13 56 17
4864A7K7m7j15J13R8q9%or2P8J16r8l6O0q3K2J17n7m7L6n1jJ20k2q2rj9M1J08
$$ 17 44 -3 -118 -5 93 4 4 -2 -94 -16 100 2 -34 26 -57 -35 82 25 -22 14 -37 -38 82 60 -22 -31 -50 -9 99
4893I9o6q1L6l4M0R9o2p8L7k0j1J30j9j28L3mk1J36J2j67RO5l0P1M2j14l4O2j9
$$ 99 33 -48 -12 -46 -6 93 31 -47 -10 -30 -41 89 70 -58 -25 -29 -50 86 98 -69 -60 5 -25 46 88 -26 -60 2 -17
4922a7M2N3r1l6J7rR6L0j17l0O1l4Q4L6j43j5J18n8K4Q8j18p8J00J2nP7q2j32
$$ -17 25 78 -13 -49 -32 -41 55 85 -32 -62 -1 -35 49 85 -58 -73 45 -13 11 99 -19 -97 3 15 10 87 5 -127
4950a27J13P6m3M0o6r2Q4O8k5kj1j02N5N6rN1m4j14N7P6k7M3l7j34P9J18p4MK7
$$ -127 -14 62 19 59 -7 -99 -15 53 28 26 15 -87 -32 24 15 66 22 -92 -35 41 14 57 20 -114 -35 83 9 13 40
4979D0j18K1J36o3j3M4j02l3J44J6o0jo0j9J17J4o8ok7j4J09j6n2J6m3k4J19Q
$$ 40 -78 -57 79 16 3 47 -55 -88 56 72 12 11 -49 -68 49 63 -5 -11 -38 -52 57 41 -11 5 -38 -62 57 65
5007F5o3J6o4k8J34N7j33mJn7J03Q8j27j8M8p3N0J02p6l7K6n3L4R4o0p7N0j0L5
$$ 65 2 18 -46 -74 60 117 -16 -20 -19 -76 27 115 -12 -30 18 -55 -5 97 21 -16 10 -43 -9 85 25 -52 -2 -12 23
5036B3M7q8l3P1m9L8Q0p7p8P1k7j5J36m7j27O4J8m0J11qj46N1Q2n9K4K6r2QP0
$$ 23 70 -18 -51 20 -29 9 89 12 -66 5 -22 -37 99 52 -75 -11 7 -33 78 70 -76 -25 57 -2 22 48 -44 -36 34
5065C4k9J0K1q0k2P8K3J5Lj09lP2NK7Rr7RO5o2L1Q9j14k8R5n6j7R4q5n3J31J1
$$ 34 5 15 36 -44 -66 12 35 50 53 -56 -59 13 18 45 54 -43 -34 31 -31 0 89 -25 -53 42 -14 -31 63 -22 -75 56 67
5096F7r2L1j8o6J09N0r6J3J4q9N9N4l2J9kr0M2P7m2%Ko6N4N4p1kM2n4K6O7o5j7
$$ 67 -25 6 -12 -78 31 81 -15 -2 12 -77 -18 36 4 23 21 -69 -27 50 8 8 10 -56 -2 52 -19 -21 21 -33 -7 60 -5 -22
5128b2N2q7J4J08k3p1K6m0J4R0k4o9L9ok3N3j3m1M2k4l3O7On7K6ml7Q7kj06N7
$$ -22 30 -57 -43 65 42 -29 -3 -43 -29 61 37 -32 7 1 -22 31 18 -23 19 -5 -38 29 35 -22 4 0 -37 50 48 -58 -1
5159aL9o2M9K7r7K4O5q2J9Q4p1m2O2l5QO7n3n3N6J7k9L5k2l9M6ok5L7lj5Oj3K
$$ -1 38 -24 25 52 -45 -21 44 -38 -19 65 -6 -48 14 -21 -13 54 1 -52 4 21 -8 27 5 -34 12 6 -19 18 15 0 6 -7 -5
5192eM6l5m2O6km5O1l2p0Q0L0q7M0M6q9K4N2o6J8O9q9k1R1l3%K3l0l0N5k7j1K6
$$ -5 41 6 -36 30 28 -17 44 12 -58 22 52 -35 5 51 -38 -14 38 -28 -10 59 -30 -51 40 7 7 30 0 -30 25 -2 -13 13
5224A3ok9M3l7LN7l7n0O8j7l0O0k1p1P7kp8P5K0p3L6L2q5O8N1j05MO0l0KL8n9
$$ 13 7 -22 21 -16 -13 44 7 -43 25 8 -22 38 17 -54 23 21 -57 18 38 -35 1 33 -52 16 67 -38 -34 26 -4 -2 36 -23
5256b3j3N4k0KK0k3NJm7N0N1o6qL1m1K8O4q4k1R4m0o5R6k6o9P1J8p6P9Mj19M9
$$ -23 -36 18 -2 0 20 -3 2 3 -44 6 57 -9 -17 14 -27 1 65 -19 -40 54 14 -51 45 19 -50 21 39 -37 42 46 -73 -24
5288b4O8m1J5J6q9QP2j5KL4o4rJ5j0K9M6o7nK2j5J9K6p2J5P5m6j5K3n4oJ06m1
$$ -24 44 3 18 34 -55 -47 25 10 12 46 -18 -27 -12 -22 7 53 -14 -19 3 -12 7 33 -39 -24 51 5 -10 13 -41 -47 59 18
5320A8k7N8o3q5R6L6k4N1n0r2P4K2k6N1j9n8N1no6Q8J3r8P3M4j12L9M0j21P2J29
$$ 18 -9 49 -14 -99 -3 33 9 60 10 -82 -8 14 -12 39 20 -38 13 8 -58 30 43 -55 18 62 -50 -11 29 -92 -20 109
5350A09r2n5N2q7J8J35m3n2O4n6p3R4K3l8L2j2n4M0Qk5J2qK8J7n6k0N2n0K7R4
$$ 109 17 -38 14 -73 -55 80 37 -15 49 -7 -80 14 37 -1 31 19 -35 5 13 -12 0 -8 20 37 -19 -39 13 -37 -10 84
5380H4p9l9P6p6o3J77Jj22P3j2j29J25P5j41N1P3j20J0J05j04mJ03p3k7Q2l7p7
$$ 84 5 -34 42 -34 -97 80 81 -41 32 20 -109 16 91 -50 1 74 -46 -36 69 -35 -39 64 -9 -36 46 9 -68
5407f8P3Kj1M7l9o5M0K7qK1j2k1K1k2LM8l8pL5o0J3P5n6n0Q8k2l8P4n4q0J10K0
$$ -68 5 7 -4 43 4 -61 -21 6 -2 19 7 -14 7 -15 -12 36 -2 -9 26 -34 -21 54 -2 -52 36 14 -24 50 -4 -84 26 46
5439D6q8Q0j4r9Q5K7j01R4L8j32L3J02j06K2R5j31nJ43q6o2J18n1o5R3j6p0P0
$$ 46 -42 38 24 -75 10 37 -64 30 68 -64 -31 71 -35 -13 82 -49 -54 89 3 -59 59 8 -57 36 20 -50 20
5466B0J3q9N2M4n2J8lqK3Ll3lkL8K3o0MN7r2J3R8o3l3P9o8q0J59Nj30R4K3j24
$$ 20 33 -56 -4 40 -12 6 3 -5 18 21 -12 -15 -17 21 44 -16 -12 45 -47 -34 64 1 -32 47 -21 -101 58 63 -67 27 50 -74
5498g4R6N1j46M7J12j36J1J39j27l4J11q4k1J40o3j02R3pl6P4Pr2N1Rl6K0J5j9
$$ -74 22 73 -73 -26 86 -50 -39 100 -27 -61 50 -34 -55 85 22 -80 13 6 -30 44 51 -41 10 19 -17 3 18 -1
5526aPj6mL7j0k6K3j8J9M3o7m3P7k1l0R6n6q3Q8j1p5J26J7j30M6L8r4Q9N8j44
$$ -1 6 -10 -14 23 13 -13 10 -8 11 54 -13 -56 21 0 -30 66 10 -73 15 4 -71 55 72 -58 -12 26 -68 21 79 -65
5556f5K5J07r7j0J19j11k0J29q1m7J23n1r0Q7J5o0P0j5r0N2N8l6Jmm2K5J8k0K8
$$ -65 -40 67 -30 -40 79 -32 -52 77 -4 -51 72 21 -69 18 33 -27 43 28 -62 -10 48 12 13 9 -33 -8 10 -10 18
5585A8j1omk5L5M3o5k6P9l6j5N3m5n4R2Jq9R0J6j25Q0M8j16N8R4j58JJ46r0j1
$$ 18 7 1 -3 -28 7 50 -15 -41 38 2 -13 40 -5 -59 33 34 -55 35 51 -74 6 54 -62 -4 90 -68 -67 79 -11 -22
5615b2J05j01n5J40l5q8J01j3j01P4L2o6O1J0j02M7M5l2rJ9l5J8K4nlokJ5k4n
$$ -22 83 -18 -73 67 32 -56 45 32 -69 5 37 -29 32 42 -60 -13 32 0 -9 10 -25 -7 17 12 9 3 1 16 -8 -13
5645a3M4k0n4N7j1rN5l9o3R2Pr1M8N2j09O3N4j09M3P3j21JJ12o2l3P4o9m2J33
$$ -13 31 11 -43 14 3 -6 49 10 -53 39 46 -45 3 55 -54 9 63 -46 -3 70 -51 -50 62 0 -33 41 -28 -70 63
5674F3l6q3Q7kp0O7Rp1N0L6j01M4N3m9qK1k7J0L0k0j7J8JJ1j4j0K1J1k0qMjL7
$$ 63 27 -56 31 29 -41 26 35 -36 14 50 -51 -7 46 -3 -11 10 -17 -7 23 3 -14 4 5 16 2 -8 13 24 4 -4 0 -1 36
5707C6k2o1O8On6K8L5o8M7N3j14K6P1p1j0Q5p3j3Q0o1m5J07j0j03O9J7o5O3Np3
$$ 36 14 -47 21 27 -29 -1 34 -34 13 66 -48 -22 49 -22 -32 53 -20 -33 47 -14 -59 48 38 -65 4 21 -44 19 24 -49
5737d9N1M1q7J8N6m6%L9m3PM9j7l9K9j0MJ2j0jJ0nj4%LK4Pn9K6K3l4K1J3m4K0
$$ -49 2 43 -44 -26 30 -16 -16 23 -20 -13 36 19 -20 9 -1 3 15 5 4 14 9 -5 -5 -2 22 29 -30 -4 19 -15 6 19 -25 -5
5771eM1o6kQ0m2m6O4k7l1Q9m1o4Q0Op9O1J9p6M9L5r4M1M9o1J9J9l6NM2n9LP6m8
$$ -5 36 -30 -32 48 6 -40 24 -3 -34 55 14 -50 30 36 -43 18 37 -39 10 45 -49 -8 41 -20 -1 18 -18 -13 29 -30 -27 49 1
5804Al8O0k7l0N2j9m3O9Om2J6mpK1j6k6K9LjJj6JL3j7k4L0j9j2M4l4j3O2l7n5
$$ 1 -37 23 -4 -34 18 -1 -44 25 31 -11 5 1 -6 15 -1 -27 2 5 4 5 -11 -10 23 6 -18 12 -7 -19 25 -9 -22 40 3 -52
5838e2N6K3m4M7pp3N2K6p0L3N7o2QM6p5QQ8o8l5Q7j7n7M2j5k0N4Jp3K8J9l2K0
$$ -52 4 27 -17 30 23 -50 2 28 -42 -9 48 -14 -6 40 -35 -27 61 -7 -42 45 28 -29 13 -2 -22 32 33 -40 -12 7 -25 -5
5870eM2k9J2Pn8L4K1j9K0k4j8L2Nl6J7RoRJ0m5J4K1l2K6N1m0k5J8l8L0M3k7j5
$$ -5 37 8 20 27 -31 3 24 5 25 1 -17 15 20 -16 1 10 4 13 23 -22 -8 13 -19 7 58 18 -7 11 -27 3 46 19 4
5903DJ6m7JM0l1J3M9m7l8O2l7jN3k3l8O8k4p6N4L0m1N6mq7K4M7n6K8O6n2k8K3
$$ 4 20 -27 -26 14 -17 -4 45 -2 -40 22 -15 -16 37 14 -24 44 20 -56 -2 28 -13 43 39 -48 -24 23 -33 -5 61 9 -19 4
5935Dm0J3P9l6k6J1mKOk1L0J7l6LPm1J5M6l6PP1q4k8N4j6QN8m3o6N4Mn0N6L0p4
$$ 4 -36 -23 56 20 -6 5 1 3 9 -12 18 35 -1 2 9 -32 -17 29 -7 0 71 -13 -41 13 -3 5 63 20 -46 8 12 -38 18 48 -26
5970b6L4Jn1N1K5l9PL4m7J4Km1M2L8m3jKm0K3L6l8L2L0o5j5N1l0J5N4n5m7O6k2
$$ -26 8 9 -42 9 34 -5 2 36 -11 3 5 -36 6 44 1 0 2 -38 -15 21 -17 15 45 -20 -35 16 -14 1 55 0 -47 19 -3
6003cl3O8qm0L2j6l2L6Kk3J6J6k5J8pl3N1J8m5K9j8l7N1Ln0M0L1p8J9M8o2K7M6
$$ -3 -36 32 24 -16 16 0 -32 4 6 -17 -1 15 -10 8 1 -32 19 37 -8 21 3 -34 17 20 -30 10 41 -37 -18 30 -32 -5 41
6036D1o3j1Q4n0k6N3l9j3O7m0m0O0j6j6K1k4RL2l9%L4k7j3M2k5qM5k7n5P7po5
$$ 41 -22 -33 51 1 -25 28 -11 -24 43 3 -37 23 7 -9 12 -12 -3 29 -10 -10 24 -3 -16 26 1 -7 38 11 -44 33 26 -39
6068c9N4jm4N1K9q3J8N3n5LO8n2jJ3m2J2N7j8k5J4l3J9L0l0jK6l3J1Pk9J1M5n9
$$ -39 15 14 -30 21 50 -33 -15 38 -17 -14 54 2 1 14 -28 -16 41 23 -2 12 -21 -2 28 -2 -3 23 -10 1 8 -21 -10 35 -24
6101b4kP7n1l0M4k9k1R4l0q2N1Pl8O9J6r1L9J4n4M8L8m3j7J3l2N2J6m5oL2k2K7
$$ -24 -26 51 0 -30 14 -15 -36 58 28 -54 -3 4 -34 35 51 -40 -1 13 -41 7 45 2 -15 -2 -34 18 34 -11 -17 15 -7 20
6133B0J0n9J7L7m7K2O2p4j7L5m0L4P5o8n5M5j3JN8k7k9L1l0j4N5kl1J5j3pM2j2
$$ 20 30 -29 -12 25 -22 0 62 -12 -29 6 -34 0 75 7 -48 -3 -16 -15 43 16 -13 18 -12 -26 29 27 -4 11 -2 -9 33 21
6165B1o2L7KnM5j8q1N4K6n1P1J0q4nN2m6N0O9j01l7O4j7ON6n2m7N2%k6M9j3m6
$$ 21 -41 -4 -2 -7 38 20 -61 -7 19 -32 39 49 -35 -40 12 -34 16 85 -16 -53 11 -6 0 56 4 -43 9 9 -17 32 19 -27
6197b7J5RK7J0l5l1J2OL6L8q9nL8j9%O5n7l9N9j6j8P3k6q6N0J8l3O2nr0K2O5l3
$$ -27 -12 -3 24 34 -1 -32 -20 -14 22 60 -29 -34 4 -15 -15 50 -7 -46 13 -3 -21 52 26 -60 -10 8 -25 37 32 -58 -36 29 -4
6230dJ3J2o2LM7j1J6K5o1k0N5j0K6J4p5rP5k2j0L0m2k1L9RpL3l5l6K6J1RJ8l8
$$ -4 9 21 -41 -38 9 -2 14 39 -22 -42 13 3 29 43 -32 -41 34 12 2 32 -10 -31 8 17 10 43 8 -28 -2 9 18 36 -2
6263bl4K3K2MK3l9k6N9k1k0L8k1l8L5J0j7N4m4n3M7M3n4K8Qp3L6M7m9PM9n4m3
$$ -2 -36 -13 9 13 36 -3 -29 30 9 -11 27 6 -32 3 13 -4 50 6 -47 0 43 -11 17 25 -48 -12 35 -14 -7 42 -12 -55
6295e5R0k7k2M8l5m2M4L3l1Pj5j0K5J0k0lOj2K1j7PL6n1j5N1l2NL0l8k3M9%m9
$$ -55 35 8 -14 34 -1 -43 1 34 3 10 -5 -15 10 20 0 -3 3 -9 12 -5 2 38 -13 -28 23 -9 -4 26 -12 -35 14 14 -35
6328c5O2%o1M0%m4N3L1o9J1L6l8J5J6m1J0L4k4l1O3j2k8J5j2oM2j5k1J9k1KL3
$$ -35 27 27 -34 6 6 -38 15 46 -23 -12 24 -14 1 17 -24 -14 20 -4 -35 28 16 -12 3 -9 -15 27 12 -9 10 -11 -9 24
6360B4l2rK3lk2L5J4k6Mj4j7M4J6m1nM%K7ok6K9j4k7L8J1j9Mj7l6O1L6p1J7Ll8
$$ 24 -8 -17 6 3 -19 16 30 4 8 -6 -23 21 37 -4 -9 -5 -5 22 16 -10 19 5 -22 16 27 8 12 -5 -41 20 56 -15 2 5 -33
6395c3M3N2n4l9M9l7rP1j2n4K2j8j1O2K9p7lJ3ML0K0m6k9K4j0K8L1j7n0j1K2M1
$$ -33 10 62 8 -31 18 -19 -28 43 31 -23 -1 -19 -30 32 61 -16 -19 -6 -2 28 48 2 -27 -3 -13 15 46 29 -21 -32 -10 31
6427C1J0l4k0k9K2N7J3n9oJqM0N0o4k5J0j5K9Q1n0q5L4RK4N1l0q7K1L6LM5po9
$$ 31 41 7 -13 -42 -20 37 50 -9 -15 -14 -22 18 68 4 -21 -11 -26 3 84 34 -51 -17 -8 16 67 37 -50 -29 7 10 55 48 -21
6460b1oJ3J3N1kq3k6M4K6M6j1p4j2M3KL9J4p7k0K5K5J8M9p0o8L9K7K7K4n3o6N4
$$ -21 -27 -14 -1 50 48 -35 -61 -17 9 55 44 -30 -42 1 3 42 56 -21 -41 -16 9 27 76 6 -62 -23 4 31 55 2 -64 -10
6492a0K5J8Om3l5K6K5J2K8l6o8L6L4J0L6m8q2L3O5qL0j6q4J7N9j4lJ6o8j8P2Q
$$ -10 15 33 39 -4 -39 -13 12 24 52 16 -52 -16 18 28 64 16 -66 -33 32 24 54 38 -46 -29 30 16 13 29 -39 -57 15 23
6524B3J8np1k3O5N7m8Ko1oP0J2Non3k9N1QK3J2p2m3O5L4pPk5n9N6M0m4L0mp0L1
$$ 23 41 36 -35 -58 7 64 16 18 -43 -49 21 33 38 32 -21 -50 1 9 32 44 -28 -71 -6 28 21 28 3 -56 0 40 -4 26 22 -48 -17
6559a7O0j9j5J0o2QQ0j6j8j4l3J7N2nl0K0m1j3N8nNmm3j1O1Jk8J8m8jO3jl3K3
$$ -17 43 24 9 19 -43 -35 45 29 11 -3 -36 -19 33 28 -2 18 -23 -36 22 17 22 18 -25 -36 25 26 -2 16 -32 -33 30 29 -4 19
6593A9m7j1O1qk9K6No1M8L2m2K1kl7L1L0n6J6K7l2J1L4m5J7K7m1j8M6l5qM7k9
$$ 19 -28 -39 22 14 -15 11 16 -45 3 35 -7 14 12 -25 6 36 -20 -4 23 -9 2 36 -9 8 35 -6 -24 22 -13 -21 26 -3
6625cj2N1l3l5M2Jl4K4oj2M3j0l1K1kj4L0j2l0L7nl5L6Ok8J6j0oM2ln6J2K0k4
$$ -3 -15 36 3 -32 10 11 -23 1 -5 -17 26 16 -15 6 4 -10 20 8 -22 15 10 -25 11 17 -11 5 -5 -11 31 28 -28 -16 4 -20
6659b0M3J7p3L3Nm4N9K9m7k8K4l2K7P1o0k8J8j6K3N2m0m7L8j6LO6k7o5K5j6jO7
$$ -20 23 40 -33 0 5 -39 20 49 2 -26 -2 -34 -7 64 4 -24 -6 -22 1 53 13 -34 4 -12 -9 57 30 -35 -10 -26 -27 40
6691D0mo5MRJ3M9j0n5QoLM1Pm6Lj2pP4pn5j6K2OM4J0q2MK7k7O0J9o4k2K9k9M7
$$ 40 36 -29 -25 -16 -3 46 36 -19 -11 -17 -14 27 34 -12 -9 -21 -28 46 39 -16 -32 -10 -4 40 50 -32 -28 -1 -28 32 51 -13 -35 -6 -35 12
6727A2O6q5n2M3OJ6P6p1q4M5K9PM9l3o0jL2J1N7k8p3kK6K7N1k8o2lK2K0L6l0m6
$$ 12 78 -7 -59 -16 -10 6 82 11 -73 -28 1 8 57 24 -36 -37 -5 6 63 35 -38 -40 -14 13 64 36 -26 -29 -7 13 49 19 -27
6760b7qK8JN4j5o1j3K2J8P1j9j03rM5RM6J7q9k8O1oK1N2q3l5L6jL0N7p6o5N7L5
$$ -27 -35 -7 -6 48 33 -28 -41 -19 -1 70 51 -52 -61 -16 -7 39 56 -33 -61 0 -6 15 67 -16 -51 -15 -16 14 71 -5 -70 -13 22
6793B2j6M6n3p8N6M0JK1k4o7%O0L0J3l7n7OL6L1K6m5n0K4K4rM4j1o2J5J6l0O0
$$ 22 6 52 -1 -79 -23 17 18 39 15 -52 -52 8 38 51 14 -43 -37 -1 30 56 11 -39 -15 9 0 44 33 -29 -14 2 -28 32
6825C2J2r4RO2k2L7Pj02J4P6rlL2o2m8N4K8pL4m3o2L2M2Onj4n0M0K8j5J3k0k9
$$ 32 44 -50 -41 21 -1 36 43 -59 -45 31 22 19 51 -11 -59 -5 23 16 50 7 -55 -23 19 25 20 6 -44 -4 24 9 22 2 -27
6858b7L3J4j0J6j4o1K9L4K0Ql0o1K3L9RQJp3L3J7j4M6Jp3MM1j4J9Oo0qQ7m6qL4
$$ -27 6 20 10 26 12 -49 -20 14 34 42 12 -49 -26 13 22 30 31 -42 -9 8 -6 40 41 -32 -28 13 -1 18 24 -36 -44 43 -3 -11 23
6893B3l7k5N1Nl6M9l3m2N0J2j6Jkn3M5L7k3j4Pj1RJ1kJ2k3%j1J6J3J2l0l4L6J3
$$ 23 -14 -39 12 17 -19 30 -3 -45 5 17 1 2 0 -53 -8 29 6 -8 -1 -12 -3 8 6 18 -5 -5 -16 0 13 25 -5 -39 -3 10
6927A0j0K0mm4L0J6l7K6L1n6J6K7l4RL5n9j7O6j4l5N1k1j7L6qm6M6J5m4J4J5l5
$$ 10 0 20 16 -28 2 18 -19 7 38 -18 -2 25 -9 0 35 -24 -41 25 11 -24 27 6 -11 25 17 -29 17 32 -12 2 17 -18
6959a8L6Pl5QQl0K6J2k1J3Nl7J5M2k6pMk2J4L1l0mJ6j0NJ6l3J2Nl6K7M6l5Nkm7
$$ -18 18 25 -10 -2 6 -24 2 14 -7 6 11 -26 -11 31 5 -2 2 -20 -6 25 -5 -9 7 -3 2 18 -15 -3 2 -34 -7 39 4 9 7 -40
6995d0J9P3l8k6J9k4j6P7j6m0K2l1k1O7J8m9JJ3m6O6L4o5l1K7j4K0M4m7l4J6j2
$$ -40 -21 52 14 -12 7 -17 -33 44 28 -12 10 -21 -42 25 43 -6 -5 8 -38 28 62 -3 -34 -7 -21 -1 43 -4 -38 -22 -34
7026c4K7N2j0m7k4OL1M3l1j9j9lK3M7l4j7Jj9J8M7k8l0J0j6JQ5k6o7OPJ9O7l5
$$ -34 -7 45 35 -12 -36 -30 1 44 13 -6 -25 -28 -5 42 8 -9 -8 -27 -9 38 10 -20 -10 -26 -25 60 34 -33 -27 -20 -1 66 31
7059C1n9j0K5jM6K1o1l2J6QN7Rn6l9K9K6K1Rm8l7M4%J7L9n4l1PK0J2L9k5p1LN2
$$ 31 -28 -38 -13 -14 32 53 -8 -40 -24 -16 41 50 -6 -45 -16 10 31 40 -8 -45 -1 -1 16 55 1 -30 -23 -3 9 48 23 -48 -45 7
7093GJ7J5m1m4jM1K3Qj2l0pOK9L5l8m3J0K3K4K8l1o5K9M6j5K2Pq2PN3j4J9K6q0
$$ 7 24 39 -2 -46 -47 -6 17 25 13 -17 -24 -18 11 46 8 -35 -25 -2 22 50 19 -46 -17 29 14 36 43 -39 -32 21 7 26 52 -28
7127b8k7P3K4l2J4m8l3O6L6l1jj9l6K2M0Kpml6nL9K0kl5l3L4J7J9ok0l1L2J5k1
$$ -28 -55 18 42 10 24 -24 -57 9 45 14 13 -6 -42 -20 20 22 15 11 -25 -30 9 29 27 -8 -41 -7 10 29 23 3 -28 4 19 -2
7161bJ7lk9PK0Nj2Nk7JM6nk0orOK9jk3J8j0j2L0j3j2L3l5l4O2ll3J9Nl5K6K3l7
$$ -2 15 12 -17 -10 10 15 3 8 -19 -18 28 23 3 -3 -12 -6 23 22 -1 17 7 -5 25 12 0 33 -2 -36 26 23 -10 9 14 -21 5 28 -9
7198iJ0K7l9j0M3j3j2J8k3oK0J5j9KMj9J0NmJ1pJmpK2mj7j7L0j9MK3j8k1M1k2
$$ -9 1 28 -11 -21 22 9 -3 15 -8 -14 6 21 2 4 8 -11 -1 4 0 11 4 5 1 -6 16 12 -5 -22 8 -11 -7 16 -2 -23 18 -4
7234dl2O7lk8JQl5M4Ll7LL8j7lJ5j7nN%JJ9j2j9KOJ7J6m0k0K7J4j9J9j5j9K5O
$$ -4 -36 31 28 0 1 9 -26 18 21 -16 -13 25 8 5 20 3 -2 3 3 4 23 11 -8 -6 0 17 33 -7 -27 0 14 -5 14 -1 -20 5 11
7271A1j5K5km3J3J6J0J1j2l2RK2ONk6j9J9onL7mm2K0J0k4N3no2J4M0j6NJ3l9j2
$$ 11 -4 21 19 -24 -11 5 15 26 14 -18 -9 13 19 24 -2 -21 -2 -8 -13 24 20 -22 -2 8 -16 37 32 -30 -16 24 8 13 26 -13 -25
7306b5M9k0rM1k9l0M4Kk7L3k0m0K2M1j7qqk3K3J5j0Lj7QnjJ2J4k2k1K8J2k3J7
$$ -25 24 4 -5 36 7 -23 21 23 -4 29 9 -31 -9 32 15 7 -1 -24 -1 14 4 7 -10 -2 -7 -8 4 18 -4 -25 3 15 -8 9
7340Iql2L1L0k9LJ1k3nL1k7J6J0l3NL1qj3K2l4kL7ol6M4j9nK7j7l4N0Lk3MJ4k6
$$ 9 1 -31 0 30 1 4 15 -8 -13 18 -9 7 17 -16 -11 20 12 -1 21 -13 -15 22 16 -20 24 5 0 27 10 -24 26 29 6 10 24 -2
7376bLJ5k9J8J9k5nJ9k9J3Lj4K9K0l3j0PmK3pl1K8kk5K2K0l5J6J4l9%M3l1j4M2
$$ -2 1 16 -13 5 24 -1 -6 13 -16 -3 0 -14 15 35 2 -8 -1 -5 18 11 -20 8 6 -19 3 23 -12 4 18 -21 -21 22 -9 -23 19
7411A9j7j2M6k3m3M4lj1K5rk2LNjK7ql1MpPM1k5j8J3rJJ9jj5J2pj8K5J8n2J3J0
$$ 19 2 -10 36 13 -30 14 11 0 25 16 -6 -3 2 1 28 20 -11 -7 -14 -7 34 9 -9 4 -5 -4 15 14 -1 11 4 -14 11 29 -23 -10 0
7448@j1K5J7n2lK6j1L2J6m4j9J6rK3K7k5l6K1mJ6K6l4l1L5J1oK3l4k2K9LjK2k3
$$ 0 -11 14 31 -21 -24 2 -9 23 39 -5 -24 -8 -17 6 33 8 -28 -7 -11 5 31 -3 -34 1 12 6 29 -5 -27 2 5 4 26 3
7482Cl3J7J3J8Qk7j5KJ4K1J4l2l0L4kpK9qm1J2J9k6K9Ll9rM9j0J4%l7j1M5Kl0
$$ 3 -30 -13 0 18 26 -1 -16 -14 0 21 35 3 -27 7 5 -2 27 19 -22 -10 9 -17 12 15 -24 -33 16 6 20 20 -17 -28 17 19 -11
7517a1K0j2k9L6J7j3r%k5QN1j5j6j5j5L6kOJ4l8J2J0kqJ7k0k5K9QmJ0j4k2K8K0
$$ -11 9 -3 -32 4 21 8 -1 -1 -26 -18 33 18 2 -13 -28 8 6 12 26 -12 0 10 8 0 17 -3 -28 1 9 5 15 1 -21 7 27
7552B7l0J4qk2K2J3k0J3Mm3K3K8j1qJk2J0L0j7qMnjK6k0j7L1jj8N%mjLrK4J5l1
$$ 27 -3 11 3 -19 3 16 -4 9 13 -30 -7 21 10 2 3 -19 -9 21 4 -4 0 -5 -6 20 0 -17 14 13 -5 0 0 -4 -5 -2 -11 13 28 -3
7590clkJ2Rj2kRk5PK9j9j9L2j9j1K9lk8K1J7l2L1Pm8PM8k3rK1l5JL1k4JJ8Mk8
$$ -3 -6 -8 4 13 1 -1 8 -17 -10 19 0 -19 13 -6 -17 12 9 -19 2 19 -13 18 25 -23 -16 32 9 0 21 -14 -13 18 -6 -5 13 17 -11
7627a1J3jmJ5qj0J4J0k0J9j5j0K0j3jK3k9J1J2qnKnj4K0%rJ0j6LK5qk2QKj8K8
$$ -11 2 1 -3 12 4 -6 8 18 -2 17 2 -8 12 -1 -2 21 -8 3 15 7 2 4 -1 -15 5 5 -4 6 -10 -7 18 10 -12 -4 -2 -20 8
7664Hmk8K8J4l2NL4k5mK3l2NL7j9l5L1%j5L2k1j3J8J5l8J3J8pj3K7k4MLoqJ1J
$$ 8 4 -24 4 18 -14 -9 25 0 -4 19 -13 -8 29 10 -25 6 6 -9 23 2 -11 7 22 -16 -3 15 8 -5 22 -2 2 5 -1 -9 2 3
7700C%rRJ6j3qlJ1j9K1oj7K2rk0K7Rj9%J7l3J0K5k0nJ6oj5K6j3jJJ9k1K8nk2J4
$$ 3 3 -6 3 19 6 -2 -5 6 -13 8 2 -15 7 -2 -22 5 14 -5 -5 12 -21 -11 14 -6 -11 5 -1 -16 10 -3 -4 -3 16 -5 23 18 -4 10
7738A0nk0K5Ol4J1J8j0%J5l3J6K5k6nK0noJ1j5QomqJ1%OKk6RJ4rMPj5OJ9k3JL0
$$ 10 5 -15 10 16 -18 -7 11 1 1 16 -17 -1 24 -2 -7 13 8 2 13 -2 6 0 -4 -12 -1 -1 5 7 -19 -10 4 -5 -1 6 -9 -3 16 -7 -6 24
7778B4j5k8L6pk3J8Km4M2K3l3kK2k5K4J7m1J5J1l6LL8j8okmoL4km2K8j0jK8j4
$$ 24 9 -19 17 10 -13 5 7 -37 5 28 -5 -7 15 -10 14 31 -10 5 16 -20 -17 21 3 -3 -5 -9 -15 19 17 -25 3 -7 -8 20 6
7813Fqj0J0nK2pj3Pj4oL0Jk8OQj3L4k1l1M0j0RPj0k3J2J3l5K5K9m1mL2j6KK8n2
$$ 6 -2 -12 -2 -7 15 8 -5 2 -12 -18 12 13 -15 -9 -1 -14 20 -1 -32 8 -2 7 14 4 -19 -7 6 -29 -4 25 -16 -20 12 -4 -2 26 -26
7850b6J1L5k3%L8k7l6M2j4j2L6j7l2J9J3j4K3k0l3L9K1k5J1nl1L5Qj8K1pk4J2
$$ -26 -15 20 -3 -3 35 8 -28 14 0 -12 24 7 -25 -6 7 -7 16 -4 -37 2 23 -2 9 4 -27 8 16 -2 19 12 -12 0
7882@J9k5K2lm1K4K9k6K0mm3K7J8k1mK0l3J2L4m0J1K0m7jO2k2k2L1l1rN7j4l4
$$ 0 19 -6 16 13 -28 -4 25 -1 19 15 -28 -1 17 -4 -8 12 -21 -9 25 -15 -4 16 -31 -32 30 8 -14 17 -14 -23 34 20 -14
7915a4K7j5k0L4Nk0Omk6L0K1k6Lj0j5L4%%rJ5l3J2J5j2KLl0K0K4k3Olj9K2L0l0
$$ -14 13 -2 -22 12 17 -3 3 -1 -27 3 24 -2 1 -9 -24 10 10 10 1 16 -17 -5 10 -2 0 3 -27 -7 17 -6 0 -3 -22 0 30 0
7951@j3K5j8J4J4j5j7K3j5j4K9Kl4Prj0M8km7L7mj5J4K2l7J5J5k6J2K0l7KK0p
$$ 0 -13 12 -6 8 22 7 -10 13 -2 -16 13 15 -19 -12 -21 -31 17 15 -32 5 1 -14 0 22 -15 0 15 -11 1 21 -16 -14 6 -1
7985alK1k0j7L5k4MJ7j4pK1j1pK2j4rJ9k4JK5j9k4M3j0j0J0j4k3M1Kk4J8mj1J0
$$ -1 -4 17 -3 -20 15 -9 -5 12 -2 -9 12 1 -6 16 2 -7 12 -12 -11 14 -5 -29 14 4 -6 4 -10 -33 8 10 -14 4 0 -11 -1
8020aJj8K3Kl1J5J5j0Mml0K6J7k1LNJNMj0mJ9k4jK5j4LRk0J1K4ql4J7Qk5M4j5
$$ -1 0 -18 5 7 -24 -9 6 -4 0 -4 -34 -8 9 -12 -9 -4 -3 2 6 -4 -8 11 -13 -14 11 -3 0 9 -11 0 24 16 -18 -1 7 -18 26 11
8058A1k2J2mj4K3nM%qlK3Mk3MLj7J2Mj7RJ0j7RJ9k1pQk1K3K0j6j7OMkJ3krOmr
$$ 11 -11 1 -3 -17 6 1 5 5 -3 -6 17 21 -2 2 5 -12 0 4 -13 -4 6 -11 -2 17 -4 -11 -3 -24 -1 19 3 -14 -8 -4 -6 7 5 -4 2 -2 -11
8099a1K3j3%Rj4oK8j3j7K0Jj5J6j2j5K7Jk2K7j2lkPqJK0j6j4J1Oj0J7j3lJ5r%
$$ -11 12 -1 -1 8 -6 -12 16 3 -14 6 7 -8 8 -4 -19 8 9 -13 14 2 -1 -3 4 -4 -3 17 1 -13 -2 4 -6 11 -2 -5 10 1 1
8136AoMPmJMpjOmjJJ5j7oPoNJ6j1KMj1pLJ1j3J3Lj6J2Jj8K0Qj6Rj4jJ6Qj1qK0
$$ 1 -5 -1 6 2 3 7 0 -1 5 1 0 1 16 -1 -7 0 -6 -1 15 4 6 10 -1 -8 -5 6 -7 6 9 -7 5 6 -12 8 16 0 9 -5 -6 10 18 7 -1 19
8180A9j4j2J6j3mK4j3kkK0j8
$$ 19 5 -7 9 -4 -8 16 3 1 -1 19 1
8191A
$$ Imaginary data points
##PAGE= N=2
##DATA TABLE= (X++(I..I)), XYDATA
0@%%%%%%%%%%oJ4j6J6j6J6k4L2l2M0m8N6o5P3q8J02j12J25j45J67j86K09k35K61
$$ 0 0 0 0 0 0 0 0 0 0 0 -6 8 -8 8 -8 8 -16 16 -16 24 -24 32 -33 40 -48 54 -58 67 -78 89 -97 112 -123 138
34A38k93L28l65M07m52N01n55O13o77P49q29R18j023J141j270J420j596J805k059
$$ 138 -155 173 -192 215 -237 264 -291 322 -355 394 -435 483 -540 601 -669 751 -845 960 -1099
53a099K371k770L299m035N143p016J0967l2069L7868L1647q1289M9191K3234p6029
$$ -1099 1272 -1498 1801 -2234 2909 -4107 6860 -25209 12659 44306 -36983 12208 35442 -40587
67d0587J6345O3474m5101o572L6907l1882j5329L8391j2674j0865J8129j5729
$$ -40587 -24242 39232 -5869 -12441 24466 -7416 -22745 15646 2972 -7893 10236 -5493
79e493o142K8056j2855j5561J7116o681j1976K3615N563k0370m861P560J938k633
$$ -5493 -11635 16421 3566 -11995 5121 -1560 -13536 10079 15642 -4728 -9589 -2029 -91 -2724
93b724O274J2948j8860k0991K9356R041l2149K1042J9868m6601P178M7260l5144
$$ -2724 3550 16498 -2362 -23353 6003 15044 -17105 3937 23805 -22796 -15618 31642 -3502
106c502j9605M3302k0070k5073M5545m975l6876K4995o41k3938L5457M805l5843
$$ -3502 -23107 20195 125 -24948 20597 15622 -21254 3741 3100 -20838 14619 19424 -16419
119a6419K0284J262l4362L7366K2944m8802J1622K8121m4947N956M9947l1988
$$ -16419 3865 5127 -29235 8131 31075 -17727 -6105 22016 -22931 -16975 32972 984
131I84k2885L8609j3050k6431L2061N582k7593R404J1584j0576J005L839l536
$$ 984 -21901 16708 3658 -22773 9288 14870 -12723 -3319 8265 -2311 -1306 2533 -1003
144a003j441j165P205M734j2764n58Q942q945K901J3261j2450m826J0644j0565
$$ -1003 -2444 -3609 3596 8330 -4434 -4992 3950 -4995 -2094 11167 -1283 -6109 4535 -6030
158f030K478J7713j7720o862K2404j5708r827L2362j3987k8306L3077L365l3581
$$ -6030 -3552 14161 -3559 -10421 11983 -3725 -13552 18810 4823 -23483 9594 12959 -20622
171b0622K6637J4941m0780J0567K8997k7426r26K7080k1943j2079K4470o215r450
$$ -20622 6015 20956 -19824 -9257 19740 -7686 -8612 18468 -3475 -15554 8916 2701 -6749
184f749J5036p624r377J3231l887n736J2185o462q562J3121k489r791J0550K80
$$ -6749 8287 663 -8714 4517 630 -5106 7079 617 -7945 5176 2687 -7104 3446 3726
198C726r784P096L374o539J248k7j86M596m023p90N380q859o55J4757p745r307
$$ 3726 -6058 1038 4412 -2127 -879 -906 -1092 3504 -519 -1309 4071 -4788 -5443 9314 1569 -7738
214g738J3698m945j2141J6756K759j5947Q590L288j3670J0484Q001j4206M502
$$ -7738 5960 1015 -11126 5630 8389 -7558 1032 4320 -9350 1134 9135 -5071 -569
227e69N471j3439Q215J0658j6298K468J2791j5638k00J8576j2745r223J7322n300
$$ -569 4902 -8537 -322 10336 -5962 -3494 9297 -6341 -6541 12035 -710 -9933 7389 2089
241B089j1360J5147L32j4855P454O500p930K791L649o572n1L732J00J134k046
$$ 2089 -9271 5876 6208 -8647 -1193 5307 -2623 168 3817 -2755 -2806 926 1026 2160 114
256A14k566K510r02M9N153l383n252M144Q2j073N937l421o628N422J64l087Q326
$$ 114 -2452 58 -844 -795 4358 975 -4277 -133 -51 -1124 4813 1392 -5236 186 350 -2737 5589
273E589k110j0648O854L498q412P998N540j4344Q72J0359p539K87J0223r153o563
$$ 5589 3479 -7169 -315 3183 -5229 2769 8309 -6035 -5163 5196 -2343 -2056 8167 -986 -7549
288g549J0251j066m476P022k623o826N655J373l511M564j187o026M184K366l470
$$ -7549 2702 1636 -2840 4182 1559 -5267 388 1761 -1750 2814 1627 -4399 -215 2151 -1319
303a319L140K34o089K453M625k672m34J142l017m1L185O46p62j741j329J307N80
$$ -1319 1821 2055 -4034 -1581 3044 372 -62 1080 -1937 -1978 1207 1853 1091 -650 -1979 -672 -92
320i2R95K413l335m133L513J870j469L156j077o211K476L944k520K081J681o445
$$ -92 903 3316 -19 -4152 -639 1231 -238 2918 1841 -4370 -1894 2050 -470 1611 3292 -3153
336c153j63N111j857O28L459n783k944O136j7k077L747k809n095M718K726l199
$$ -3153 -3316 1795 -62 566 4025 -1758 -4702 1434 1417 -660 3087 278 -4817 -99 2627 -572
352e72J842L99m952J193M151j020l58L58l113k83L434P02r12p58j736M8K132R38
$$ -572 1270 1669 -3283 -2090 2061 1041 683 1041 -2072 -2355 1079 1781 869 111 -1625 -1577 555 1493
370A493l89j170j446K45J398J185M71j820k169R25J687Q11R66j908l309J482K666
$$ 1493 1104 -66 -1512 -1267 131 1316 1787 -33 -2202 -1277 410 1221 2187 279 -3030 -1548 1118
387A118k22Q10m51l961J70L596R1R3O78l746j767L992J609q64L76k552k630L302
$$ 1118 896 1706 1255 -2706 -2536 1060 1151 1244 1922 -1824 -3591 401 2010 1146 1522 -1030 -3660 -358
405c58K841j310m28r89k563J425L387j69j249r21j797L38L056J281j620k057q61
$$ -358 2483 1173 745 -244 -2807 -1382 2005 1836 587 -334 -2131 -1793 1263 2544 924 -1133 -1994
422a994R10J936J274q17k516r80J660J374N07J94k046k130J648K298J03r3j541
$$ -1994 -1084 852 2126 1309 -1207 -2187 -527 847 1354 1548 -498 -2628 -980 1318 1421 1328 -213
439b13k576J334L231Nj049j015k006O36L141M83j300r21j639L1K782J207j023
$$ -213 -2789 -1455 1776 1781 732 -283 -2289 -1653 1488 1971 671 -250 -1889 -1858 924 2131 1108
456A108j346j815R9K887J255j160j311j587L1K713J138j301q48j133n69K190J611
$$ 1108 -238 -2053 -1954 933 2188 1028 -283 -1870 -1839 874 2012 711 -137 -1270 -1839 351 1962
473A962j017j075j066n59J994J713r22j327j059j61K072J223j220q33o47n40J829
$$ 1962 945 -130 -1196 -1755 239 1952 1030 -297 -1356 -1517 555 1778 558 -275 -922 -1462 367
490C67J388j331o90l10j019J615K113j513j375J95p39J196K356j568j989Q53j54
$$ 367 1755 424 -266 -576 -1595 20 2133 620 -755 -560 -1299 -103 2253 685 -1304 -451 -605
507f05J99K168p77k240O66L73k96J782O3k272j91Q27L54J212l21j940K1O85L58
$$ -605 -406 1762 985 -1255 -589 -216 -512 1270 1333 -939 -1130 -303 51 1263 942 -998 -977 -292 66
526F6J283o11j969P14O31o89J555L64k531L46J380j053R74J030k610j60K327q51
$$ 66 1349 738 -1231 -517 114 -575 980 1344 -1187 -841 539 -514 460 1490 -1120 -1280 1047 196
544A96k38J016k138k82K901p46j184J420j667j372L094M06j836J181p96k277K369
$$ 196 -42 974 -1164 -1446 1455 709 -475 945 -722 -2094 1000 1406 -430 751 -45 -2322 47
561D7J816j789l6q8j427J574J318j564j03J19r25J670R71k090o8M22j315J805
$$ 47 1863 74 38 -50 -1477 97 1415 -149 -252 -133 -1058 612 1583 -507 -575 -153 -1468 337
579C37K181k189j390L45q90J592K475j562j489n2j093J528K231j903n03J239k340
$$ 337 2518 329 -1061 -716 -1606 -14 2461 899 -590 -642 -1735 -207 2024 121 -382 857 -1483
596a483L60L523k255k106K932q90j388L677j081m351K081J864j130K323j73m262
$$ -1483 -1123 2400 145 -1961 971 81 -1307 2370 1289 -3062 -981 883 -247 2076 1903 -2359
612b359N39J754n25K682O00m285J0J552j604K534K496m372j183L144j286k88K493
$$ -2359 -1820 -66 -591 2091 2691 -1594 -1584 -32 -1636 898 3394 -978 -2161 983 -303 -591 1902
629A902k228j833K806N77q52L22j840p85K040N19R62P97l920j793L273M60K87
$$ 1902 -326 -2159 647 1224 372 694 -1146 -1931 109 628 1590 2387 -1533 -3326 -53 407 694
646F94K555k973l791K724J384q73K146p18k879J363M54q19K239j181k681L272
$$ 694 3249 276 -3515 -791 593 -280 1866 1148 -1731 -368 86 -733 1506 325 -2356 916
662I16P51l034K531j50n167L483M753m131m76K492m716o12O002o46k305J741k368
$$ 916 1667 -1367 1164 1014 -4153 -670 4083 -48 -524 1968 -2748 -3360 2642 1996 -309 1432 -936
679i36k144L361J014o40Q27k445j079L173p35j372K424j595k040L740K10l319
$$ -936 -3080 281 1295 655 1482 -963 -2042 1131 396 -976 1448 -147 -2187 1553 1763 -1556
695a556J408L48j984K354J574j873l38j251r05L351N59j952J733j656l528M286
$$ -1556 -148 200 -1784 570 2144 271 -67 -1318 -2223 1128 1687 -265 1468 -188 -3716 570
711E70K152m297J857K185m980P74M475k976j163K960k003p59K826j450j146J318
$$ 570 2722 -1575 282 2467 -2513 -1739 2736 -240 -1403 1557 -446 -1205 1621 171 -975 343
727C43j546J093K787l297r42L239k936r90N435j878l998L790l56l785L952J811
$$ 343 -1203 -110 2677 -620 -1562 1677 -1259 -2249 3186 1308 -2690 1100 744 -3041 911 2722
743B722m077P64J403j999J344R53j870J058J8j757K402J90l090K374J128l704
$$ 2722 -1355 -591 812 -1187 157 1110 -760 298 316 -1441 961 1151 -1939 435 1563 -2141
759b141K062K646l850M5K802k342Q4K403k173l11J658j841R34J729l206R86K969
$$ -2141 -79 2567 -1283 -1238 1564 -778 -694 1709 -464 -775 883 -958 -24 1705 -1501 -515 2454
776B454m169LM969l730k334N453k024l846N047L3m737L192J741l695J383J567
$$ 2454 -1715 -1712 3257 -473 -2807 2646 622 -3224 1823 1856 -2881 311 2052 -1643 -260 1307
792A307k225J013N54j714J639M6k016K348Ql116K763J295l931J760K454l588M68
$$ 1307 -918 95 649 -1065 574 620 -1396 952 960 -2156 607 1902 -2029 -269 2185 -1403 -935
809i35K723k500J9K171k220kJ900j913O55J627l043P93L007l424k91L966l094
$$ -935 1788 -712 -693 1478 -742 -744 1156 -757 -102 1525 -1518 -725 2282 -1142 -1433 2533 -561
826e61j747M495j658k772L789p22l197L021O95k387J671l25j931K413j59j912
$$ -561 -2308 2187 529 -2243 1546 824 -2373 648 1343 -1044 627 302 -1629 784 625 -1287
842a287K697o80l131L169O21l682K981J752m617J345L119l480O8L004k425l96
$$ -1287 1410 730 -2401 768 1389 -2293 688 2440 -2177 -832 2287 -1193 -1125 1879 -546 -942
858i42K551j851q35J691j217L76J755j961m5J603k482Q4L196j700r85K248k093
$$ -942 1609 -242 -1077 614 -603 -227 1528 -433 -478 1125 -1357 -1273 1923 223 -762 1486 -607
875f07j391L104n74j378K162j069j578K056r98j151K998r04k177K843p34l087
$$ -607 -1998 1106 532 -846 1316 247 -1331 725 -273 -1424 1574 670 -1507 1336 602 -2485
891b485L050P47l152K736J533m255O74K377k441Q38K636k371p18J524j739N9K160
$$ -2485 565 1312 -1840 896 2429 -1826 -1152 1225 -1216 -378 2258 -113 -831 693 -1046 -987 1173
908A173r99m6J068k178j67K061j435j32K379j475j174J732j370j036K562j59j188
$$ 1173 174 128 1196 -982 -1149 912 -523 -655 1724 249 -925 807 -563 -1599 963 804 -384
925c84J426r81j518J562j93o10K226n43k083J262l09j480K263P02j978J215L28
$$ -384 1042 61 -1457 105 -88 -698 1528 985 -1098 164 -145 -1625 638 1340 -638 577 905
942I05k496P97J424j046J067P90k107K6P48j295J123J572j510J18O41k274L31
$$ 905 -1591 -794 630 -416 651 1441 -666 -640 108 -1187 -64 1508 -2 116 757 -1517 -1186
959a186K433j160l04J687j682j223J857n64p87K110j98j669P99j93j057J322N11
$$ -1186 1247 87 -217 1470 -212 -1435 422 -142 -929 1181 983 -686 113 -80 -1137 185 696
976F96q02P56j83j421M70N03k72R92L5j248K96J39o48Q19M04p02N95o2j216P38
$$ 696 -106 650 467 -954 -484 19 -253 739 774 -474 -178 -39 -687 132 536 -166 429 367 -849 -111
996a11N45j109P72Q33j284L37P04j718J46J860p02m32J069j209r69J486O6n89
$$ -111 434 -675 97 930 -354 -17 687 -1031 -885 975 273 -159 910 -299 -1268 218 284 -305
1014c05J154k34j451M13M43k87P20J23q65J69J62l93L46J58k39M43j06o43L43
$$ -305 849 615 -836 -423 20 -267 453 576 -289 -120 42 -351 -5 153 -86 357 251 -392 -49
1033d9J09m26N67K45n89K88Qq99N59Q31n83n1K55q12J77R33m94k81N80m91l65
$$ -49 60 -366 201 446 -143 145 153 -746 -187 644 61 10 265 -547 -370 563 69 -212 368 -123 -488
1054d88P53m6l40L53l56l95P23J71l89P6k95j79P04J8m75L59j62n60O03K75n36
$$ -488 265 219 -121 232 -124 -519 204 375 -14 62 -233 -412 292 310 -165 194 32 -528 75 350 -186
1075a86L86J03q86L27Q04n43j82M29m43j20O92k43m57M04R3l32J16J63j05m9N
$$ -186 200 303 -583 -256 548 5 -177 252 -191 -311 381 138 -319 85 178 -154 -38 125 20 -29 -24
1096b4P2po5J38j58k97N44K85p32L6M14n08K21P64p55m25Q77m42n48J126K3j058
$$ -24 48 41 -24 114 -44 -341 203 488 -244 -208 206 -302 -81 683 -72 -497 380 -62 -610 516 539 -519
1118e19N14J86q14P76P02j127j65P87m90j70P79k89m92M33l0l96L73K79l29k53
$$ -519 -5 181 -633 143 845 -282 -447 340 -150 -320 459 170 -322 111 81 -315 58 337 8 -245
1138b45J92J69r8m1J32k01j01M44j29m89M51K32n97K43L64n70J64M36o15P6O89
$$ -245 -53 116 18 -23 109 -92 -193 251 122 -367 84 316 -281 -38 326 -244 -80 356 -259 -183 506
1159E06o08k82O45k96j22O24n44m54Q33j48m78O94k01o57O68j5o59Q29K01j069
$$ 506 -102 -384 261 -35 -157 467 -77 -531 302 154 -324 370 169 -488 180 165 -494 335 536 -533
1179e33L55N01o40L70N03q87j0P36m72k07O28k04l70K43Kj39K04J22j89k72J79
$$ -533 -178 323 -317 53 556 -331 -341 395 -77 -284 344 140 -230 13 15 -124 80 202 13 -259 -80
1200h0M00l86k34O51k63n54Q31j20r73J052L64j508P20J025j563K17J452j438
$$ -80 320 -66 -300 351 88 -466 365 245 -728 324 688 -820 -100 925 -638 -421 1031 -407
1218d07k97J826j232j046K005l66j515J543M9j607J268O31j619O69R51j385J02
$$ -407 -704 1122 -110 -1156 849 483 -1032 511 560 -1047 221 852 -767 -98 853 -532 -430
1235d30J046p23j05P15o79k79O91q5k24J49j16K7m3j07L71j06k96M68l21n55J023
$$ -430 616 -107 -212 503 -176 -455 236 151 -73 76 -40 -13 -56 -163 208 102 -194 274 -47 -602 421
1256D21k9j052Q84K64j280R12O18j583Q09J113j851K87J620j662j09J884j629
$$ 421 392 -660 224 488 -792 120 738 -845 -36 1077 -774 -487 1133 -529 -638 1246 -383
1273c83o25K284j274j335K384n83j792K088j22k071J920O26k350J174J211k072
$$ -383 -1008 1276 2 -1333 1051 468 -1324 764 642 -1429 491 1117 -1233 -59 1152 -920
1289i20N44J488j637K3J488j266m83J432m58o50P08k04l80M23K0j06p1o6M12l77
$$ -920 -376 1112 -525 -502 986 -280 -763 669 211 -439 269 65 -315 108 128 22 -49 -115 297 -80
1309h0m81J101j43j256J182K66j679J378Q99k419Q84J878k500J39K561k259p44
$$ -80 -561 540 397 -859 323 589 -1090 288 1187 -1232 -348 1530 -970 -831 1730 -529 -1273
1326a273K933j823j585L290r06k499K809Pk756K363P49k921J740J440k889Q32
$$ -1273 1660 -163 -1748 1542 636 -1863 946 953 -1803 560 1309 -1612 128 1568 -1321 -489
1342d89J951k267K02J980j864l86J927j185p47J632n05q10Q86l30m37P34j48k14
$$ -489 1462 -805 -603 1377 -487 -873 1054 -131 -878 754 249 -561 325 -5 -442 292 144 -70
1360g0J74l81L46K14p73O68M49j317N89Q40j524P03J314k081J63K055j945l41
$$ -70 104 -277 69 283 -490 178 627 -690 -101 739 -785 -82 1232 -849 -686 1369 -576 -917
1378i17K484j878j078K975j500j969L295n86k855K919L86l290K387J359l536J536
$$ -917 1567 -311 -1389 1586 86 -1883 1412 826 -2029 890 1276 -2014 373 1732 -1804 -268
1394b68K340l252K70K652k467l89K757j760j125K416j001j448J952k08j237J268
$$ -268 2072 -1180 -910 1742 -725 -1114 1643 -117 -1242 1174 173 -1275 677 469 -768 500
1410E00r7j144Q57K07o67M04J05o9J45o03J58N08p83N92R03j589J02J463j823
$$ 500 403 -741 116 323 -344 60 165 96 241 -362 -204 304 -479 113 1016 -573 -471 992 -831
1429h31j67K633j463j319K440j347j972L121m9k636K499M62l330J788J518k847
$$ -831 -998 1635 172 -1147 1293 -54 -2026 1095 1046 -1590 909 1371 -1959 -171 1347 -1500
1445a500J525K082l168J98K354k572j49L006j763r32K473j753j744K663j35j516
$$ -1500 25 2107 -1061 -863 1491 -1081 -1230 1776 13 -919 1554 -199 -1943 720 585 -931
1461i31J952j17k091R98M56j150J131Q07j029p3p2n19N07J86L6P05n76o08N00
$$ -931 1021 904 -1187 -189 267 -883 248 1055 26 -47 -119 -638 -131 55 91 796 220 -388 112
1480A12q14j44J837m17r25J266j025j583J980J83j317K213o1l011J348J076k291
$$ 112 -702 -846 991 574 -351 915 -110 -1693 287 470 -847 1366 1305 -1706 -358 718 -1573
1497a573J795K033k996J41K033k863k19L416j430j129K498j647k170K478O2j561
$$ -1573 222 2255 -741 -600 1433 -1430 -1649 1767 337 -792 1706 59 -2111 367 429 -1132
1513a132K297L51k485N89M15j356J397J328j263j3J97j310J89R72j5N14J08j000
$$ -1132 1165 1516 -969 -380 35 -1321 76 1404 141 128 325 -985 -796 176 161 675 783 -217
1531b17k05p5j66J018K33n01O81n97j465R83N05p52J509M11k225M26Q03j768J070
$$ -217 -422 -497 -663 355 588 87 768 171 -1294 -311 194 -558 951 1362 -863 -437 366 -1402 -332
1550c32K091j666l47J241k098m09K582p53q05J951j182j825J751j58j196K199
$$ -332 1759 93 -254 987 -1111 -1520 1062 309 -496 1455 273 -1552 199 41 -1155 1044
1566A044K77k142Q60L24j798J194J366j265M62O50j864j37J324l99K86Q77j014
$$ 1044 1321 -821 39 363 -1435 -241 1125 -140 322 972 -892 -1029 295 -104 182 1059 45
1583D5n93M39m24K30Q86k26q3m4q62K14O03m38M96N72j012L7M54j147M08J421
$$ 45 -548 -109 -533 -303 583 357 274 230 -632 -418 185 -253 243 815 -197 -160 294 -853 -445 976
1603I76r15k44J037j279o18J644n56o42J717o28j628J289J04j195J453M00j651
$$ 976 61 -183 854 -425 -1043 601 45 -597 1120 492 -1136 153 257 -938 515 915 -736
1620g36P75O21j562N69J115j076K36Q55j227j17J033p55n8J017o15l64N76o26
$$ -736 39 660 -902 -333 782 -294 -58 797 -430 -547 486 -269 -327 690 75 -289 287 -339
1638c39j27R82l39l50N07n06k38P45l81j84P61n25m60P24l08k97Q44m49n92R21
$$ -339 -466 516 177 -173 334 -172 -410 335 -46 -230 531 6 -454 270 -38 -335 509 60 -532 389
1658C89k12p09Q22n9p20Q33l7r35P99K71r45O36L09r59N41M59j018N00P49j102
$$ 389 177 -532 290 231 -489 344 307 -628 171 442 -503 133 442 -517 24 483 -535 -35 714 -388
1678c88J03P52q35J52R30r00k49R66o65l65R55l99m23Q13m03n88Q39r2n80O04
$$ -388 -285 467 -368 -216 714 -186 -435 531 -134 -499 456 57 -366 447 44 -544 295 203 -377 227
1698B27l7m72N10j51n22N94J00m72M39q2n18N35k6n18O39J42p24L97R1o53O46
$$ 227 190 -282 228 77 -445 149 249 -223 216 134 -384 151 125 -393 246 388 -336 61 152 -501 145
1719A45L28q40M00M29q84K33N80o96K80O47q78j18P82n97j03P71n00k44O79n63
$$ 145 473 -367 33 462 -422 -189 391 -305 -25 622 -256 -374 408 -189 -292 479 -21 -265 414 -149
1739a49l70Q89k14m37O27l15n09P33j27n50P07J1o64M53N1n10N69J42p00L82K76
$$ -149 -519 370 156 -281 346 31 -478 255 128 -422 285 296 -368 85 136 -374 195 337 -363 19 295
1760B95n77K70K62m89K71K72n68J70L86m28J00K49m35K38L20n34J25L42m67J43
$$ 295 -282 -12 250 -239 32 304 -264 -94 292 -136 -36 213 -222 16 336 -198 -73 269 -198 -55
1780e5L57n66K02N35p40k6P26n40j39P36o22k98R22m26n55Q75j69o74P03l5o84
$$ -55 302 -264 -62 473 -267 -293 433 -107 -246 490 -132 -430 492 66 -489 386 217 -457 246 211 -473
1801d73P12J50q19M24L30o02L01K69n35K48K80n41J49L80l57J10J43m58K31K98
$$ -473 239 389 -430 -6 324 -278 23 292 -243 5 285 -256 -107 273 -84 26 169 -289 -58 240
1821B40m10J85K47m52J44K12m73L28M61o43LM31n42J31O19o30p4O95o14k96Q09
$$ 240 -170 15 262 -190 -46 166 -307 21 482 -161 -158 273 -269 -138 481 -149 -223 472 -142 -438 371
1842C71l06l26O58l95n05P89j01n39N95o1n26N15j9n33N85R9o56L97J62m93M26
$$ 371 65 -261 397 2 -503 286 185 -354 241 180 -346 169 150 -383 202 301 -355 42 204 -289 137
1863A37J40o38L96K85o27K77L39n28K54K34o24K96M55n96J60L19n87K37M55o66
$$ 137 277 -361 35 320 -307 -30 309 -219 35 269 -355 -59 396 -200 -40 279 -308 -71 384 -282
1883b82J81O14p53o5O99n82k6Q05p13l40R02m33m46Q71k82n65P47k57o15Q52L4
$$ -282 -101 513 -240 -305 394 -188 -214 591 -122 -462 440 7 -439 432 150 -415 332 75 -540 312 346
1904C46p14N24K1o16O14J20o52M98J45o27L34J98m26M30O8o55M21J94n46N03J04
$$ 346 -368 156 177 -439 175 295 -357 141 286 -341 -7 191 -235 195 263 -392 29 223 -323 180 284
1925B84p07N62K00r09O34N33j023L69N89j090L53R98j146o7J151r68l34J217o95
$$ 284 -423 139 339 -570 64 597 -426 -57 532 -558 -205 793 -353 -420 731 -237 -571 646 -49
1944d9m86J214o28q12J203j72q29R43j19q77Q64Q1r01P73K48q55M53J87o57N72
$$ -49 -535 679 51 -761 442 270 -559 384 265 -612 252 333 -568 205 453 -402 51 238 -419 153
1964A53K47p51L98K00o08M60J73o04N62R2q87O01L61q14O22K66j137O33O43j176
$$ 153 400 -351 47 247 -361 99 272 -332 230 322 -565 36 397 -417 205 471 -666 -33 610 -566
1984e66N32Q13j289K16R86j224K09J337j301l59J403r68m43J542q44q45J522n87
$$ -566 -34 779 -510 -294 692 -532 -323 1014 -287 -646 757 -211 -654 888 44 -801 721 134
2002A34j095J551j31j226J181J7j325J128M16j335P54N64j173M86N40r78M47O32
$$ 134 -961 590 459 -767 414 431 -894 234 650 -685 69 633 -540 -54 486 -492 -45 587
2020E87r23K15M99p28L11M12p24M13L99r04L92M96q79M99N12j198N13Q81j275
$$ 587 -336 -121 378 -350 -39 373 -351 62 461 -443 -51 445 -434 65 577 -621 -108 773 -502
2039e02K76J010j369J51J414j332j99J588j355o86J860p56q43J759q58j441J796
$$ -502 -226 784 -585 -434 980 -352 -551 1037 -318 -1004 856 100 -743 1016 158 -1283 513
2056E13p6j367J603R0j798J125M46j497J187Q15j664M68P48j294N05R75j153K48
$$ 513 437 -930 673 763 -1035 90 536 -961 226 1041 -623 -155 593 -701 -196 779 -374 -126
2074a26Q62j134NP96p44K36P55q65N2N95r21J97Q26p57K78O41j265J14J105j021
$$ -126 736 -398 -393 403 -341 -105 650 -215 -163 432 -489 -292 534 -223 55 696 -569 -455 650 -371
2094c71J24J196j288k16J431j237m50J806r81q91J839p57j280J791m69j510J973
$$ -371 -247 949 -339 -555 876 -361 -811 995 14 -877 962 205 -1075 716 247 -1263 710
2111G10K06j878J276K79j932J367J097j758P03R28j971K95J482j111K15J165j439
$$ 710 916 -962 314 593 -1339 28 1125 -633 70 998 -973 -678 804 -307 -92 1073 -366
2128c66l75J231p32j17J115o99l52P10p38j55R17n08l0P15q40j37P83q94P7J274
$$ -366 -741 490 -242 -359 756 57 -295 415 -323 -478 439 -69 -99 616 -224 -361 422 -472 -395 879
2148H79q88l31J025j163l60J731p99p65J610q32j250J756k71j369J764m9j871
$$ 879 -9 -340 685 -478 -838 893 94 -671 939 107 -1143 613 342 -1027 737 688 -1183
2165a183J500N15j913J155Q52j858R15J235j975K52J399j503R2J649j269m46J308
$$ -1183 317 832 -1081 74 926 -932 -17 1218 -757 -505 894 -609 -517 1132 -137 -583 725
2182G25j091m76J600m61p06R27o00o40J069j69m74P84l76n41O48l35k20Q98n18
$$ 725 -366 -842 758 297 -409 518 -82 -722 347 178 -296 488 112 -429 219 -116 -336 562 44
2201D4m55Q61n19m73J059n15n82J307n20j055J318k06j128J443j1j514J252L61
$$ 44 -411 450 -69 -542 517 2 -580 727 207 -848 470 264 -864 579 568 -946 306 667
2219F67j699J121Q74j737O36J048j704M52J456j550j45J491j191l54J494r20o27
$$ 667 -1032 89 963 -774 -138 910 -794 -342 1114 -436 -581 910 -281 -635 859 -61 -688
2236f88J396o73p93J319k97q61R85k38q09J000rq22P02L4p23O35O1n93O42j0p07
$$ -688 708 35 -758 561 264 -597 388 150 -659 341 332 -490 212 246 -477 158 219 -374 268 258 -449
2257d49N70N2n27O83j04p76P82N2q64Q44K12j068P28L37j175P81P09j341L61Q77
$$ -449 121 173 -354 329 225 -551 231 283 -581 263 475 -593 135 472 -703 78 787 -554 -193 684
2277F84j217K90J109j264p3J261j038l55J378p96o33J282n81p58J313k75j047
$$ 684 -533 -243 866 -398 -471 790 -248 -603 775 -21 -654 628 47 -711 602 327 -720
2294g20J005O9r10Q17J36r82O73L29q12M50K73p08M12K89o02L85K22p50L29L95
$$ -720 285 354 -556 261 397 -585 88 417 -395 55 328 -380 32 321 -281 104 326 -424 -95 300
2314C00m60L79J44q94L11N35n30L69L86r36J03N78o47L47P85r43k29P31o34J8
$$ 300 -160 219 363 -531 -220 315 -215 154 540 -396 -293 285 -362 -15 770 -173 -402 329 -305 -287
2334b87R96p40m64R85m54n56R57l55o74R66l6p84P55r3r51P47M49o56N05P6j099
$$ -287 709 -31 -495 490 36 -520 437 82 -592 374 338 -446 309 216 -735 12 461 -195 310 386 -713
2355g13M11P03n26K95L71q98J1N61m49K02N55n85j54M26l53K6L71m68P3N87l75
$$ -713 -302 401 -125 170 541 -357 -346 215 -234 -32 523 -62 -216 210 -143 -117 254 -214 -141 446 71
2376G1j57K12n79J03Q40k55k04L65p53l64Q89N5j46N99o75q12P63J90l13O84j56
$$ 71 -86 126 -453 -350 490 235 31 396 -357 -721 168 223 77 676 1 -811 -48 142 -171 513 357
2397C57q51N12J66o30N44L23o98L42L79o91Q1L30n77L26P65m87l16J38n41J79
$$ 357 -494 18 184 -446 98 421 -277 65 444 -247 -166 164 -413 -87 678 191 -125 13 -528 -349
2417c49Q31j78k08J34n89j81O50L2JL07n53l38N44p9j72M24k48k24N22k15m64
$$ -349 482 304 96 230 -359 -540 110 142 143 450 -103 -441 103 24 -148 276 28 -196 326 111 -353
2438c53L47j3j98N98mn65J70j49l71P40L83n29K2j44n65N36N76m32N4J37o02R6
$$ -353 -6 -19 -217 381 377 -188 -18 -167 -538 202 585 56 78 -66 -631 -95 481 49 103 240 -362 -266
2460b66M87k83P7L18m37o8M12k83j44L05k05R0M10l73l11K38j19O8M81k36k96
$$ -266 221 -62 15 333 -104 -172 240 -43 -187 118 -87 3 413 40 -271 -33 -152 -84 397 161 -135
2481a35J96k69j17N83k1k88K11k60k77N54Ll60L26j0l75L37N2m56L52J99m38K17
$$ -135 61 -208 -325 258 237 -51 160 -100 -377 177 180 -180 146 136 -239 98 150 -306 46 245 -193 24
2503B4K59m65N3K83k97J43L39m16j27K87j52J7K92k53j06K52j87r3K70p4p5J48
$$ 24 283 -182 -129 154 -143 0 339 -77 -204 83 -69 -52 240 -13 -119 133 -54 -147 123 49 -26 122
2525A22j85n0K31j06p0J71j25l4J71k19rL35k17j78K85j73j00M24k27l19M18p7
$$ 122 -63 -113 118 12 -58 113 -12 -46 125 -94 -103 232 15 -163 122 -51 -151 273 46 -273 145 68
2547F8l23M04O0m42K82R7m40L55K88n52M6L39l19J25L30m29j57M20j22j19K96
$$ 68 -255 149 209 -233 49 146 -294 61 349 -203 -157 182 -137 -12 318 -111 -268 152 30 -89 207
2568B07j39k96K16N3m2J97p3k73j9J22J78Q3k18j02N3m3J74J35k86l4J74j96J06
$$ 207 68 -228 -12 41 -1 196 123 -150 -169 -47 131 214 -4 -106 -53 -96 78 213 -73 -107 67 -129 -23
2591b3L60l28k51K89r6j0M63l20m86L80J12j66L93r8o17K79K57k79L31J95o54
$$ -23 337 9 -242 47 -49 -59 404 84 -402 -22 90 -76 317 219 -398 -119 138 -141 190 385 -269
2612b69l0M07j54J65K59n71j99M73J9n4K08l29k68L55J10n6J23j84k89J43K21
$$ -269 -299 108 -46 119 378 -193 -392 81 100 46 254 -75 -343 12 122 66 189 5 -284 -141 80
2633H0J37pk89j90J26J71K23J3m22r3K33m3J65K69m43k62L75q5J5M83m05n78N16
$$ 80 217 210 -79 -269 -143 28 251 264 -158 -251 -18 -61 104 373 -70 -332 43 -42 -27 456 51 -527 -11
2656a1J95k70M10j25p39L75N08m03J70K35p04j1O31j37q8K82n25k72O13J46k06
$$ -11 184 -86 324 199 -540 -165 343 -60 110 345 -359 -370 261 124 36 318 -207 -479 134 280 74
2677G4P6k88k54M29K17j35j5k15j68K38J63O1J8l46j59L01J10R0O7m54j79M61
$$ 74 150 -138 -392 37 254 119 104 -111 -279 -41 122 183 201 -145 -304 -3 107 197 264 -190 -369 92
2699I2M6q6K35l78l17N02P5k34L76k16o04M65L51l61K50J3p27L46O23m61j4L00
$$ 92 138 52 287 -91 -408 94 169 -65 311 95 -509 -44 307 -54 196 209 -518 -172 451 -10 -24 276
2721B76o20QP43k82k34L84m24l13P10O5l85K01j97l51N20K74l90Rj9k59K73K52
$$ 276 -344 -336 407 125 -109 275 -149 -462 248 313 -72 129 -68 -419 101 375 -15 -6 -25 -284 -11 241
2743B41j78k5j00j45J89J75l3lk64j37L93M3j81J99k37l21N56R0m55L48L9o69
$$ 241 63 38 -62 -207 -18 157 124 121 -143 -280 113 156 -25 174 -63 -384 172 262 -193 155 194 -475
2765d75M37M94n78R8L42o94J11P97m59k93M67m11j98P72k27m87N06j73m65O53
$$ -475 -38 456 -122 -24 318 -376 -265 532 73 -220 247 -164 -362 410 183 -304 202 29 -436 217
2785B17J31n83L22K9n26M64L82n40k0K48l13J48L06k70o2J08j58R8J44j54Q7k6
$$ 217 348 -235 87 116 -410 54 436 -104 -124 124 -189 -41 265 -5 -67 41 -117 -19 125 -29 58 32
2807C2k65K71J79l25J19J03l39K43K49m42R6L19m33J08L76m68P0M59n55l6O88
$$ 32 -233 38 217 -108 11 114 -225 18 267 -175 -79 240 -193 -85 291 -177 -107 352 -203 -239 449
2828D49m90l22P28l42m35Q13j81p45O96J86p48M29L14o66K54L92n60J22M18m49
$$ 449 -41 -363 365 23 -412 401 220 -525 171 357 -391 38 352 -314 -60 332 -228 -106 312 -137
2848a37K5L19l48P2L10l84L0L58l23r6L31k01j9K89k87j24K53j03J04J53l50L1
$$ -137 -112 207 -141 -69 241 -143 -113 245 -78 -174 157 -44 -63 226 -61 -185 68 -35 69 222 -128 -97
2870i7K31l89K08N21n32k00M72m31r9Q62l47o32N84q9m52O50N0o48M17J20n29
$$ -97 134 -255 -47 474 -58 -258 214 -217 -316 546 199 -433 151 62 -390 260 310 -338 79 199 -330
2891c30M72J98o79K74L19n05M05L50r04J4O92l70M6N46o09m03N59n1q9M39k29
$$ -330 142 340 -339 -65 254 -251 154 504 -400 -386 306 -64 -18 528 -81 -484 75 24 -65 374 145
2912A45l95J51k6J44K95l46j58L18k07J9L81m80k39O30o5k34M01l91n09N44J83
$$ 145 -250 -99 -125 19 314 -32 -190 128 -79 -60 321 -159 -398 232 167 -67 334 -57 -566 -22 161
2933A61p7M78m55p85M82K45j29O98j79j071L90M11n19N37M84r49l4O01m40J8N25
$$ 161 84 562 107 -678 -196 49 -80 618 439 -632 -242 169 -350 187 671 -278 -312 289 -151 -133 392
2954C92n38j89O65j31k05J34n17k9P51k7j52J65o76l38P78J95j01L37n09o64M30
$$ 392 -146 -335 330 199 -6 128 -389 -418 333 306 154 319 -357 -695 83 278 177 514 5 -659 -229
2975b29L40lK62k80m01L08K4j42L38k41l07O33M0n73L22j28o17P34O33n80n2p9
$$ -229 111 108 370 90 -311 -3 21 -121 217 -24 -331 302 342 -231 91 -37 -654 80 713 133 81 2
2997Bp91M53R17k36j11j7q19R8P74j82J03L38p90k34P25k15k14N43l26l50O75
$$ 2 -789 -336 581 345 234 217 -602 -504 270 88 191 529 -261 -495 230 15 -199 344 18 -332 343
3018C43p7n90K03L6r0N63L6m98k8k42p6P24J64l51O6m07m50P44L77m15J58p7n71
$$ 343 266 -324 -121 -85 -175 388 424 -74 -102 -344 -420 304 468 117 183 -224 -674 70 447 32 190 113 -458
3041d58L62L56m07J70J83m13K61K40n32R6K55m22M06N67p53k67L97l71J67Q50
$$ -458 -96 260 -147 23 206 -207 54 294 -238 -142 113 -309 97 664 -89 -356 41 -330 -163 687
3061F87m31n72L44k24j73O94Km28K05j94k66N24K6l34K81q5k82M16m1n00L62J89
$$ 687 256 -316 28 -196 -369 325 327 -101 104 -90 -356 168 194 -140 141 56 -226 190 149 -351 11 200
3083B00l19K79N8m96J49K21k15K95J28m59N5J11k36M01J78n76J29L08m49J87M04
$$ 200 -119 160 218 -278 -129 92 -123 172 300 -159 -104 7 -229 172 350 -226 -97 211 -238 -51 353
3104C53n30NM87m21j03N23l44k39M82j93j80M14k93k92N15r7k73L94j80l67N15
$$ 353 -177 -172 315 -106 -209 314 -30 -269 213 20 -160 254 -39 -331 184 87 -186 208 28 -339 176
3125A76K0m38L40R3m72K90K25l85J50J75l73J51K43k53L9R9k16J99J26l62J22
$$ 176 196 -242 98 191 -281 9 234 -151 -1 174 -199 -48 195 -58 -19 80 -136 63 189 -173 -51
3146e1J71k66K06K05m48N7K66l07J25L84l89j11K45k89J17M81l88k28L87k71j05
$$ -51 120 -146 60 265 -183 -126 140 -167 -42 342 -47 -158 87 -202 -85 396 8 -220 167 -104 -209
3167b09N62k89l70N22j13m10M99Kn32L51J91l57K79R4n17J28L06j33J56L7m44
$$ -209 353 64 -306 216 103 -307 192 194 -338 13 204 -153 126 220 -297 -169 137 4 160 197 -247
3188b47J06K42j75K06J46m41J2K39k14J69K48l98q6K92j21N3J67l52%L18j66J3
$$ -247 -141 101 -74 132 278 -163 -151 88 -126 43 291 -107 -193 99 -22 31 198 -154 -154 164 -2 11
3210A1K22m00o7M12j69m4L53l70l35M59L2j51L23k23m35M19J02k35K85q6m32L49
$$ 11 233 -167 -234 178 9 -35 318 -52 -387 72 104 -47 276 53 -382 37 139 -96 189 103 -329 20
3232B0J48l37L09Q0n47K22L81l29O4J84m49M8M68j79j15J38k56k0L10r6lR0k89
$$ 20 168 -169 140 220 -327 -105 276 -53 11 195 -254 -206 262 83 -32 106 -150 -170 140 44 41 131 -158
3255a58lK88j10M4J33l92l4M35j34j16K30k69j62M32q4j94K84j74l19M11N3k86
$$ -158 -161 127 17 61 194 -198 -232 203 69 -47 183 -86 -248 184 100 -94 190 16 -303 108 161 -125
3277a25K75p4m08L88K18l82J22J09l68J98L18l10RJ40k63N2K88j70K3O1l29J12
$$ -125 150 76 -332 56 274 -108 14 123 -245 -47 271 -39 -30 110 -153 -101 187 17 40 101 -228 -116
3299a16L39k16j9J54l17K6L82k26j18K86k33j43L62j16j39K38j87j67L66l9k32
$$ -116 223 7 -12 142 -175 -149 233 7 -111 175 -58 -201 161 45 -94 144 -43 -210 156 117 -115
3320a15J90j19j65L74Pl17K23rk97K96J36l06J60M1l58K47K34k81O4J00l11J59
$$ -115 75 -44 -209 165 172 -145 78 69 -228 68 204 -102 58 99 -259 -12 222 -59 5 105 -206 -47
3342d7K92l24JK59k98j0L18k01p9K17k02q5L06p0j39J19j35k6K44j06j04J71j59
$$ -47 245 -79 -78 181 -117 -127 191 -10 -89 128 -74 -159 147 77 -62 57 -78 -104 140 34 -70 101 -58
3365e8o6K86j58j15K74j65k21L50j6k65K55l9l08L60Q2l78J91J34l36K11J88l49
$$ -58 -124 162 4 -111 163 -2 -223 127 111 -154 101 62 -246 114 196 -182 9 143 -193 18 206 -143
3387a43J22K05l53Q2L27k57o8K09k30ML22j89j54K16j35n5K45j35q1J73j42j05
$$ -143 -21 184 -169 -87 240 -17 -85 124 -106 -102 220 31 -123 93 -42 -97 148 13 -68 105 -37 -142
3409a42K75p3j22J60j48j09L06o8j88J79p4j30K37n4j60K12o0k13K56J8k08J89
$$ -142 133 60 -62 98 -50 -159 147 79 -109 70 -4 -134 103 49 -111 101 41 -172 84 102 -106 83
3431H3k7k71K95J01l26J59J04k84J74J90l44P9K71l37K5L31k57r1K78k16j05L75
$$ 83 56 -215 80 181 -145 14 118 -166 8 198 -146 -67 204 -133 -108 223 -34 -125 153 -63 -168 207
3453B07j48k38K43m4j37K33m9j94J81j6j44J88Jj45J17p1j00K25j1j89J14l7r7
$$ 207 59 -179 64 20 -117 116 67 -127 54 38 -106 82 83 -62 55 -16 -116 109 98 -91 23 -14 -111
3476a11K18l5k06J96j4k09K31K6k29K24K6l38K42J93l64J07K16l03Q1K72l26k5
$$ -111 107 72 -134 62 48 -161 70 96 -133 91 117 -221 21 214 -150 -43 173 -130 -49 223 -103 -128
3498a28L13k28o7K97k06j12K52j61r7L44j47k37K50m6j87K97k0k95K00P3k05J10
$$ -128 185 -43 -110 187 -19 -131 121 -40 -137 207 60 -177 73 27 -160 137 117 -178 22 95 -110 0
3520@R0j61Q8L3j12J16J3j45Q9pn8J98n6k57J52R5j84J89P1k89J07J19k70J56
$$ 0 90 -71 17 50 -62 54 67 -78 11 4 -54 144 88 -169 -17 78 -106 83 154 -135 -28 91 -179 -23
3544b3K28k62K0J67k98R6L09l25l3L64k56j69L38j75k19M16m8k91K44Ol03K06
$$ -23 205 -57 -37 130 -168 -72 237 -88 -121 243 -13 -182 156 -19 -238 178 130 -161 83 89 -214 -8
3566hJ27j49J50l3k46J28Q0j07J59Ok28J42M9k18J51J38k00O3Q8j69O0P8j58J07
$$ -8 119 -30 120 87 -159 -31 49 -58 101 107 -121 21 70 -148 3 141 -59 4 92 -77 -17 61 -97 10
3590A0J09j36R0j6k84J96K25k76R0K28l87l0L16j92l4L56k34k44K99p2j68L01
$$ 10 119 -17 73 57 -227 -31 194 -82 8 236 -151 -181 135 -57 -91 265 31 -213 86 14 -154 147
3612A47j02j85K87j09k63K87K4k39K81M2l56J65J43k94J29K98k44o8J07j58M0
$$ 147 45 -140 147 38 -225 62 86 -153 128 170 -186 -21 122 -172 -43 255 11 -57 50 -108 -68
3633f8J86r2kJ0j23J03K3j65J72J23k89Q7J90k67M3K27k33JK72k22j20K24j37
$$ -68 118 26 24 34 -89 14 37 -128 44 167 -122 -35 155 -112 -69 158 -75 -74 198 -24 -144 80 -57
3656e7k1K58k02r0K65j90j73L69q9k32L18o7l38L09J15l58J73J95k75N0J43k12
$$ -57 -78 180 -22 -112 153 -37 -210 159 70 -162 156 89 -249 60 175 -183 -10 185 -90 -40 103 -109
3678a09P2J59j53K7P4j74R4J12k08J23J72k80j0K29j64kJ81j74o5J92r8l9J25
$$ -109 -37 122 -31 -4 70 -104 -10 102 -106 17 189 -91 -101 128 -36 -38 143 -31 -96 96 -2 -41 84
3701H4j20K5J26j95QK44k26o6K98j89j55L38j45k61L70K8l59J95R9k55K01R8k68
$$ 84 -36 -11 115 -80 -72 172 -54 -120 178 -11 -166 172 27 -234 136 164 -195 0 99 -156 45 143 -125
3724a25J11J15k31J40J29k28R1J14k89J24K45k49l4J92j78j9K24j45q0J53p2l1
$$ -125 -14 101 -130 10 139 -89 2 116 -173 -49 196 -53 -87 105 -73 -92 132 -13 -93 60 -12 -43
3746d3J13r7J8R7j94M2K23j90p0K26j71q9L20j45k22K73j4k18K19J4k38K00Mj92
$$ -43 70 -27 -9 88 -106 -64 159 -31 -101 125 -46 -135 185 40 -182 91 77 -141 78 92 -146 54 58 -134
3770a34K10M3k50J30N8k21K34J21l41Q0K15k58M9K39k25o6K09j32m3K07j00j12
$$ -134 76 119 -131 -1 57 -164 70 191 -150 -70 145 -113 -64 175 -50 -116 93 -39 -82 125 25 -87
3792h7J04n8N3J17j81n3J46r8K2K06j78j23K10j27j05L06m0j91J20q7j14K48p
$$ -87 17 -41 12 129 -52 -105 41 -57 -35 171 -7 -130 80 -47 -152 154 114 -77 43 -44 -158 90 83
3815H3j70J71l6j97K02Qk25K35R6l05J46J45l20O6K40j66N2J74k87j03K05j6M2
$$ 83 -87 84 48 -149 53 61 -164 71 167 -138 8 153 -167 -101 139 -27 25 199 -88 -191 14 -2 40
3838D0J48k14j06J21j19P5K54j32j39J14j40k9K71q4j75J55J3r9J01p7j19J62
$$ 40 188 -26 -132 -11 -130 -55 199 67 -72 42 -98 -127 144 60 -115 40 53 -46 55 -22 -141 21
3860B1L8n0J40j17k24J44K8l1K87l9l76M8J10r1K42J07l23NJ12j77J30J90k05
$$ 21 59 9 149 32 -192 -48 -20 -51 236 197 -179 -131 -21 -112 130 237 -86 -81 31 -146 -16 174 -31
3883c1J3J29j98M1J88k53l8K91o6o6J32k54j68L25Q0o2Q8j57k37J53J07L0J83
$$ -31 -18 111 -87 -46 142 -111 -149 142 76 10 142 -112 -280 45 125 63 151 -6 -243 -90 17 47 230
3906B30j53k65Q6O7K5J69q4k20J33O7j24J19pj81J37J17j07O3n0k32J31J87l1
$$ 230 77 -188 -102 -35 -10 159 75 -145 -12 55 -69 50 43 -138 -1 116 9 72 22 -210 -79 108 77
3929G7Q0p3l44R8K83q4O4P0l24m8K66p4K1J77k43j22K36j8o9J35j87r7L01K4j94
$$ 77 157 84 -260 -162 121 37 101 171 -153 -201 65 -9 12 189 -54 -176 60 42 -27 108 -79 -176 125 149 -45
3954d5O0p2j41K93J14k16J9m2j69J69K22q1p3q3j31J42J74o3m5q6r9J73J09j36
$$ -45 15 -57 -198 95 209 -7 12 -30 -199 -30 192 111 38 -45 -176 -34 140 77 32 -54 -153 20 129 -7
3978gK2Lj78J32J75j42nJ6j75J20K29j40r4N8j59R7K75j72j53J47j31m2L12q8
$$ -7 15 18 -160 -28 147 5 0 16 -159 -39 190 50 -44 14 -145 -48 227 55 -98 49 -82 -124 188 100
4002A00k19J39m1j22K89M9k82L4N7r3J89N9k41j1J09p1J00Q0j92jQ6m2O8P7j52
$$ 100 -119 20 -21 -143 146 195 -87 -53 4 -89 100 159 -82 -93 16 -55 45 125 -67 -68 18 -24 44 121 -31
4027c1p2O4L3J03J8j82k9Q1l6J59K2k36K4J29j30P3K06k52p5K08q9n3K46j89j98
$$ -31 -103 -39 -6 97 115 -67 -96 -15 -51 108 130 -106 -82 47 -83 -10 196 -56 -131 77 -12 -65 181 -8 -206
4052b06K68L1j43J27p9k02K43J21j88P6J1k29J36J73j10K0Qj96N3K05m9m3j8j17
$$ -206 62 93 -50 77 -2 -204 39 160 -28 48 59 -170 -34 139 29 49 57 -139 -86 119 70 27 9 -108
4076a08Q1J46j03l1K2j08R2J45j12l2N0j70N8K32o8j14J1j17O1K40r3j23M1j07
$$ -108 -27 119 16 -15 7 -101 -9 136 24 -8 42 -128 -70 162 94 -20 -9 -126 -65 175 82 -41 0 -107
4100a07J8K64j07j44J35j25q8L22k9k53J15j6j40K94R5l64L1J35j40J79J48l04
$$ -107 -89 175 68 -76 59 -66 -154 168 139 -114 1 -15 -155 139 234 -130 -99 36 -104 75 223 -81
4122h1n4J76r7O2K21k00j61J15oN7J37j15j84N3P9Q1L2j41p1N9rJ27Q4k20l7J17
$$ -81 -135 41 -56 6 227 27 -134 -19 -25 32 169 54 -130 -77 2 83 115 -26 -97 -38 -47 80 164 -56 -93 24
4148B4r0P4K47k36k32K36j9m3K45j42l17K27J24j48J63J5l23J18J72j17J07O3
$$ 24 -66 8 255 19 -213 23 4 -39 206 64 -253 -26 98 -50 113 128 -195 -77 95 -22 85 148
4170A48k99J6K13n0L4N1k50KK25n0kN6j85m6K15m0k7J22j74j22K26K2o9R4j45
$$ 148 -151 -135 78 28 62 113 -137 -135 90 40 38 94 -91 -137 78 38 11 133 -41 -163 63 85 16 110 -35
4195c5j26K03P7r7L7q8p6J44M1o9O3j08q7J68No9J35j35j85K53P1j88J28rk47
$$ -35 -161 42 119 22 59 -29 -105 39 80 11 74 -34 -121 47 52 -17 118 -17 -202 51 122 -66 62 53 -194
4220a94K04J67k54N6J74k88M9K63j84o1K05k08q7L08n7j90J34j5j37J75K1j35
$$ -194 10 177 -77 -21 153 -135 -86 177 -7 -68 137 -71 -158 150 93 -97 37 22 -115 60 81 -54
4242e4N5J7o2N6O%L7r2l0J52o5n6J30j13q8K13n9j56J79J9k06J51N3j75J29P9
$$ -54 1 18 -44 12 18 18 55 -37 -67 85 20 -36 94 -19 -107 106 47 -109 70 89 -117 34 87 -88 41 120
4268A20k34P6J70j97N5J14j87K0J65j38k1J69j45n1J69j15nJ63j60q1J74n3m3
$$ 120 -114 -38 132 -65 -10 104 -83 -63 102 -36 -57 112 -33 -84 85 -30 -35 128 -32 -113 61 8 -35
4291c5J43j29r7J86k0j28J72l6j84J39N1j06J09Oj78O7J13n4K8k6j18Q1O0m5Q9
$$ -35 108 -21 -118 68 48 -80 92 56 -128 11 62 -44 65 71 -107 -40 73 19 47 21 -97 -16 44 -1 88
4316H8n4j42J26J4q2J40J7k57J03J63j51N0J00k36K2K49j31p9J59j58r1K56m8
$$ 88 34 -108 18 32 -50 90 107 -150 -47 116 -35 15 115 -121 -99 150 19 -60 99 -59 -150 106 58
4339E8j20J42r6j57K18R4j55L2k9j17J50Q0q8j5j9n3R9K8o2M0m8q1J61N3j36M6
$$ 58 -62 80 -16 -173 45 139 -16 16 -13 -130 20 100 12 -3 -22 -75 24 52 -10 30 -18 -99 62 115 -21 25
4365B5m2j16J91J23j94l9M3j08J26J65j68k8N7j49O5J87j10l8P4j55M1J88j30
$$ 25 -17 -133 58 181 -13 -52 -9 -117 9 174 6 -22 35 -114 -49 138 28 -10 64 -91 -50 138 8
4388Hj02J35m6k5J79j21j83J61K0n3J64m3k24M9N2l8J85L1k11l7P7j9J04N6j65
$$ 8 -94 41 -5 -30 149 28 -155 6 26 -27 137 94 -130 -81 -29 -67 118 149 -62 -99 -22 -41 63 119 -46
4413d6lP0l5K2J5q5M9N9k7N6l8j77N8J16%J20k9l11J4K14l0O8J05k29j04J84m5
$$ -46 -49 21 -14 8 23 -62 -13 46 19 75 37 -140 -82 34 34 154 125 -186 -172 42 12 80 185 -44 -148 36 -9
4440il4J80j01j50J66mj03Q5m7j13K09R3j81l9l4q3K03J66j44m6o0j39J15J97
$$ -9 -43 137 36 -114 52 48 -55 30 -17 -130 79 172 -9 -48 -82 -165 38 204 60 14 -46 -185 -70 127
4464A27k9k3o4j52L4J78k6j0k0p8O3P2j05k5J6j6J03J08j37r2qn6J52K08j00j42
$$ 127 98 75 11 -141 -107 71 45 35 15 -63 0 72 -33 -58 -42 -58 45 153 16 -76 -84 -140 12 220 120 -22
4490b2k8j47J09K83n8j64O0j16o5K44Mj73R3K4j39J52O2k17jJ23j9J02M4k50r6
$$ -22 -50 -197 -88 195 137 -27 33 -83 -148 96 100 -73 20 44 -95 57 119 -98 -99 24 5 107 151 -99 -195
4515a95J47P9R1M5j98j03M1M6J21Q8j31j07LRJ16Q0j32r5P9kO0M3j58m5J42J2
$$ -195 -48 31 122 167 -31 -134 -93 -47 74 162 31 -76 -73 -64 52 132 0 -95 -16 -18 42 85 -73 -118 24 36
4541C6J0N8j39j42J44O0M6Q5j49k08J16J20QJ07j23j89R7J08l3P2j9j93P3J42
$$ 36 46 104 -35 -177 -33 27 73 158 9 -199 -83 37 45 152 29 -160 -63 45 12 84 65 -128 -55 87
4565H7p6N1K0k06K0K17l4n2Qj40pJ96K8j01Nq1k6J35M7m3k4r8j5J22N8j8m3j40
$$ 87 11 62 82 -124 -104 113 79 27 35 -105 -112 84 112 11 16 -65 -91 44 91 48 24 -74 -89 33 91 73 30 -110
4593a10J8J64J3n7Pj01k9J73Lj12Q1n0j08J51P4j38NPj10J47J40j69q7P1n1Q6
$$ -110 -92 72 85 28 35 -66 -95 78 81 -31 50 0 -108 43 117 -21 -16 -9 -119 28 168 -1 -88 -17 -68 18
4619A8J38j08j12M9m7L6J39m5q3J2o7K3J50n4q6L5k4J5Q1o0q9R4%k6R7n8j14O3
$$ 18 156 48 -64 -15 -62 -26 113 68 -15 -3 -70 -47 103 49 -37 -2 -26 -11 70 10 -79 15 15 -11 86 28 -86 -23
4647b3K2k1J12jj68J1N9j1R9nj36L5L3m1O4K3j03M1N2q8O2O0j52J3J26o0RP9j60
$$ -23 -1 -22 90 89 -79 -68 -9 -20 79 74 -62 -27 6 -35 29 52 -51 -10 42 -46 16 76 -76 -63 63 3 12 91 -69
4676f9n0J73mo4Q2p5r2J18J3n3J02j6j30N7K5l0O0j4r6P4L7o4K6j3l0Q3J1j07
$$ -69 -119 54 50 -14 68 -7 -99 19 32 -21 81 65 -65 -8 17 -13 47 33 -63 11 48 -16 10 -3 -33 50 61 -46
4704d6O6no9P7K4p6N4Mj40J07R5j11J5N2j13L2J25r8m1J07p2l6J16n8m9R6o4o3
$$ -46 20 15 -54 23 47 -29 25 29 -111 -4 91 -20 -5 47 -66 -34 91 -7 -48 59 -13 -49 67 9 -40 56 -8 -71
4732g1J12j2o9O7l7n4J12kj02Q1J4p8M8Mo0R4or3L9N3p2M7K6q0M6K8r6O4O5p8
$$ -71 41 29 -40 27 -10 -64 48 46 -56 25 39 -39 9 13 -47 47 41 -52 -13 40 -32 15 41 -39 7 35 -61 3 68 -10
4762a0kN4q5M0Q8r2l9R2o2qP0p5NP2o2l9J00m5l1O6k5m7J02n9q7J09Nm5N8m3r9
$$ -10 -12 42 -43 -3 85 -7 -46 46 -16 -24 46 -29 -24 48 -14 -53 47 2 -29 37 12 -35 67 8 -79 30 35 -10 48 5 -94
4793i4J17L2p5N2Nj13P6N5p5O3J1j33L0J01m4J7Or8L7Q8n5kK9q5J9O2l1J2N2j04
$$ -94 23 55 -20 32 37 -76 0 55 -20 43 54 -79 -49 52 8 25 31 -67 -30 58 3 1 30 -55 -36 26 -5 7 59 -45
4823d5j2J07k5l1N3r8j7J50l0r2N7m3m4J13%r2M9jq7J20L9r4J8j5n4J12O2j13
$$ -45 -57 50 25 -6 47 -51 -68 82 52 -40 17 -26 -70 43 43 -49 0 -1 -88 32 71 -23 -5 -20 -74 38 100 -13
4851a3k3Mj7P7N5r5nPn7Q9O6r3RLq1Q5J10j09n0M0m9M6J14r6r6Q4k3k3J10l2r6
$$ -13 -36 -32 -49 28 83 -12 -17 -10 -67 22 88 -5 4 7 -74 11 121 12 -38 2 -47 -1 113 17 -79 5 -18 -41 69 37 -59
4882e9M1J4j1R6k9j11L6J0J8P5n7r8M9L7pP3l7j22N8L7l8R7J7j63%Q4k8O7L6j69
$$ -59 -18 -4 -15 81 52 -59 -23 -13 5 80 23 -75 -26 11 4 77 40 -82 -24 13 -25 72 89 -74 -74 10 -18 49 85 -84
4912h4k3J32%lL4j13k3R0J5RL4q7n2P1K8L3Qj07n0J09PQL0j25l5J45j5n0O7o8
$$ -84 -107 25 25 22 56 -57 -80 10 25 34 68 -19 -71 0 28 61 69 -38 -88 21 28 36 66 -59 -94 51 36 -14 53 -15
4942a5r6J29M7n9K5k7j26J15J04p7k4j7p2P8J13o4m4Lp4O5P1j3j6l3r1O1J06k4
$$ -15 -111 18 65 6 31 4 -122 -7 97 20 -4 -21 -93 -15 98 34 -10 -7 -81 -16 55 42 26 -7 -98 -37 69 45
4970D5l6rr7O3J40q8l8M0p6J2J40m3q7N4m6m5J39L3j32J1Jl0J16J7j07j6K3lQ0
$$ 45 9 0 -97 -34 106 18 -20 20 -56 -44 96 53 -34 20 -26 -71 68 101 -31 -20 -19 -49 67 84 -23 -39 -16 -19 61
4999F1lq9J1J4k4Q4J5j15J6J6m3J32L4j56k6P0l4O9P1j30m5Q1l1J3J05p9p8M8
$$ 61 58 -31 -20 -6 -30 54 69 -46 -30 -14 -57 75 109 -47 -73 -3 -37 32 103 -27 -72 9 -22 -9 96 17 -61 -13
5027a3NjP1l7r3N9J9KL6n8o6Q5K4k4M8n6q7Q8Ql0J12m6j51P3P8o4N8K8j55M5J26
$$ -13 -8 -9 62 25 -68 -9 10 12 48 -10 -76 9 33 9 57 1 -86 2 10 -20 92 46 -105 -32 46 -18 40 68 -87 -42 84
5058H4q0l3O2o9NQ1k7j7J8o3j1Q2K3l1pq4NR8Nk0J1p3j5R5m1mO0o8o5J27j4o5
$$ 84 4 -29 33 -36 -31 50 23 6 24 -39 -50 32 55 24 17 -67 -62 36 41 21 32 -41 -56 39 -2 -6 54 -14 -79 48 34 -31
5090c1P0l7p3J10L3j21L5J8n0O0O9j13mO0o5K8Q4m9l5Jl3L3P1l4n2L0l4L9N1o7
$$ -31 39 2 -71 39 72 -49 -14 4 -46 14 83 -30 -34 26 -39 -11 73 24 -11 -10 -43 -10 61 27 -25 5 -29 10 61 -6
5120fk7O2l9lP8n3n3P0m3j4Q8l0p7K2L4l0P6j0j02L4M5m1K6K8n9J1K8m6M3K2o0
$$ -6 -33 29 -10 -13 65 12 -41 29 -14 -28 60 30 -47 -25 9 -21 55 45 -57 -23 22 -19 7 35 -24 -13 15 -31 12 34 -26
5151b6J1J3l2P2Rr9K1P6o6K9N2r9mR7n9k6J03o3p4R1jm4O3l7p7P7M0n0J2Nl4K4
$$ -26 -15 -2 -34 38 47 -52 -31 45 -21 8 60 -39 -43 54 -5 -31 72 9 -65 26 25 -19 44 7 -70 7 47 -3 9 14 -20 4
5183DK4m2L8J2m8J2Oj3M4j4o9O6Pm6L6Pp8P0N5j05K0P0q7nQ6o1j7P9o6m7R6po3
$$ 4 28 -14 24 36 -12 0 6 -7 37 23 -46 20 27 -19 17 24 -54 16 71 -34 -14 56 -31 -36 50 -11 -28 51 -15 -62 34 27 -36
5216c6N2j5m3N3Rn0L8Ml3M0rl6N6j0o9N3K0n7N6qo2P1Po6L0N9p5J1N0n7J5N7p3
$$ -36 16 1 -42 11 20 -30 8 12 -21 19 10 -26 30 20 -49 4 24 -33 23 15 -47 24 31 -35 -5 54 -21 -10 40 -17 -2 55 -18
5249a8k9Q6k5k5L8k4l7O7j4l0M5l3j9K2rJ9M5o1n4O8j8j4P6o4o6J08pq4O7K4r1
$$ -18 -47 39 14 -11 27 3 -34 33 19 -11 34 1 -18 4 -5 14 59 -2 -56 12 -6 -20 56 -8 -74 34 27 -57 10 34 -57
5280e7O8L9q1L3L4r4J6J13n3k0L7q0mJ04k5l7L5l6m0N8J0mL7l3n7M2mPL1n8j0
$$ -57 11 50 -31 2 36 -58 -42 71 18 -2 35 -45 -49 55 30 -7 28 -8 -48 10 20 16 53 20 -37 5 1 8 39 -19 -29
5311b9Q5m0n6N1j7k3Q3Or0M4k1p8J07M5o3K2l5p7Q4N5n0J1Mp1N3K1p7N3N1q5J9
$$ -29 56 16 -40 11 -6 -29 54 60 -30 14 -7 -85 22 67 4 26 -9 -86 -2 53 3 14 18 -53 0 21 -56 -3 48 -37 -18
5342a8O7q6%P7q0K8J20p8j05O7j7lJ09k2j05M8Rq0Q2O8o8%pm4L2L8k6kmJ6Pl4
$$ -18 49 -37 -37 40 -40 -12 108 30 -75 -8 -25 -28 81 59 -46 2 11 -69 13 81 13 13 6 -38 -6 32 6 4 0 16 23 -11
5374a1m1O6%k2O9m7p7P7kp6J32L3j62M5M9r3P0J03j32l1J22r9l0J30o0n7J07m4
$$ -11 -52 14 14 -8 61 14 -63 14 12 -64 68 101 -61 -16 33 -60 10 113 -19 -50 72 -27 -57 73 13 -44 63 19
5402A9q7J11j4r1P9K9o2L7j8o6N3M6k7lok0K0j1NM7j7l6K5k7j5P9l3o0P0J0o1
$$ 19 -68 43 29 -62 17 46 -16 21 3 -63 -10 36 9 6 0 -20 0 -11 -6 41 24 -12 13 -14 -29 50 17 -43 27 37 -24
5433b4M5j4o9R6L0j14L9N3j02M3R1j09K2P7j22JJ41q4l8R1q4l0J30l8j07J07J3
$$ -24 21 7 -62 34 64 -50 -11 42 -60 -17 74 -35 -13 64 -58 -57 84 0 -38 53 -31 -61 69 31 -76 31 44
5460D4j09R0L3r9M9L8q8M3M8n1k6M0nmJ6l0KPPL9m8k2P2n5l1Q7j5o9Q5k4j04J31
$$ 44 -65 25 58 -41 8 46 -42 1 49 -2 -28 12 7 3 19 -11 -9 -2 5 44 -4 -26 46 -9 -40 47 32 -37 48 24 -80 51
5492E1L6j47N4P6j24N0J10j48j2J57j04n7J29o4q8J21j3q2J01Mj49Q5N4o5M3K7
$$ 51 87 -60 -6 70 -54 -4 106 -42 -54 103 -1 -58 71 7 -81 40 27 -55 46 50 -99 -14 40 -25 18 45
5518D5r5K4N7n3K1L6m0%Qk0L9j6k4K7nMK6n3m5Q5Pn5P4l0r7P9M3r1Q5N2j56K9
$$ 45 -50 -26 31 -22 -1 35 -5 -5 3 -17 22 6 -18 9 4 8 34 -19 -64 21 28 -27 47 17 -80 -1 42 -49 36 88 -68 -39
5550c9J02q7L0R1j48rJ37o8n8J32q0o7J32l4r2J19j3j28Q4N4q8L8K3r4M8P5n0
$$ -39 63 -24 6 97 -51 -60 77 9 -49 83 3 -64 68 34 -58 61 48 -80 4 58 -30 8 31 -63 -15 60 10
5577A0k4K4l1pL2j1J1J5l6J2%MM3n2m2P1jl9M5oq4R6L2j12M9O5j22L8J05j12J
$$ 10 -14 10 -21 -28 4 -7 4 19 -17 -5 -5 -1 42 -10 -52 19 18 -21 24 18 -66 30 62 -50 -1 64 -58 -20 85 -27 -26
5608b6J11j22l9J62n8p2Q5m6p5J30Qj29Q1M1j08O0N4p9K9K6o6J2Q0m9l9L1k4J3
$$ -26 85 -37 -76 86 28 -44 41 -5 -80 50 58 -71 10 51 -57 3 57 -22 7 33 -33 -21 59 10 -29 2 -22 -9
5636iM3l1rOj0Mj%K6j2n7O0J6m9M1j0p1P2M4q8J2O9p2NQ6p5k5R7q1m8J29l6q0
$$ -9 34 3 -6 0 -10 -6 -7 -7 19 7 -50 10 26 -23 18 8 -63 9 53 -35 -23 46 -26 -21 65 -10 -35 62 -19 -67 62 26 -54
5669e4Q7k7o9J13Jj21P6M1j03O2N8r1J7N6q1J1Q7n4l4M4k6%M2k5k9L2ommmQJ1
$$ -54 33 6 -63 50 51 -70 6 47 -56 6 64 -27 -10 46 -35 -24 63 9 -25 19 -7 -7 35 10 -19 13 7 3 -1 -5 3 14
5701A4j7NJ7k6J5K0n3J7M5o3oN8m4jO2q9J1R8n6n4R8l5o0P7j9o8R2J7j19O0N3
$$ 14 -3 2 19 -7 8 28 -25 -8 37 -26 -32 26 -18 -19 43 -46 -35 63 7 -47 51 16 -44 33 14 -54 38 55 -64 -4 49
5732D9q6K5N8q7J6P4o2j7P8m3k9M3k3k3O7k2n2K8J7k4J5J0j5K5k0j3K5j2NPl5
$$ 49 -37 -12 46 -41 -25 49 -13 -30 48 5 -24 19 -4 -27 40 18 -34 -6 11 -13 2 12 -3 22 2 -11 14 2 7 14 -21
5763b1ON7m5j5M4l8j1O0n3mO1k1o4O0j4n0Q2j3p1O2L6r4M9M0n4J9M0q4RP3m8k1
$$ -21 -15 42 -3 -18 26 -12 -23 37 -16 -20 41 20 -44 16 2 -48 34 21 -50 12 48 -46 3 43 -11 8 48 -36 -27 46 -2 -23
5795b3O0k5m0O8l5m7P1%o0M4Kl2K8Qm7M3J5m5NK2k3J9j4j9K6K3l4QNj5K2%j8J3
$$ -23 37 12 -28 40 5 -42 29 29 -31 13 15 -17 11 19 -28 15 30 -15 -10 12 -11 8 -6 -25 1 24 -10 -2 3 -12 10 10 -8 5
5829E%l1L5jk0L2j6o5N3M0n4L2K2p0K5N6p1QP5o5l1P0m2k4Q8l6n0P9kq3M1K5l4
$$ 5 5 -26 9 8 -12 20 4 -61 -8 32 -22 10 32 -38 -13 43 -28 -20 55 -10 -41 29 -13 -37 51 15 -35 44 42 -41 0 25 -9
5862iL9K2q2J4L7k7PK5j8j3Pk7J7M3k6j4Kj7J9K3m8J6K7k7J3J4m4J9L5l5KM5m2
$$ -9 30 52 -30 -16 21 -6 1 26 8 -5 2 -25 -8 35 9 -5 -3 -20 -1 22 -26 -10 17 -10 3 17 -27 -8 27 -8 -6 39 -3
5895cl3L4k3K2N2m3l2L9l2mN4k3j8M2l3n9P4J6o7O6j0n6N2Rq2N9N5n0%K4p4LP3
$$ -3 -36 -2 -25 -3 49 6 -26 13 -19 -23 31 8 -10 32 -1 -60 14 30 -37 29 19 -37 15 24 -58 1 56 6 6 30 -44 -41 32
5928C2k1pN1n6o1N3jOM4j0n6J7opL3k1J5K5l2k0L7m1J3L6rk0N0n3m8P4J7l9M4
$$ 32 11 4 55 -1 -62 -9 -10 -4 40 30 -26 -9 -15 -22 11 -10 5 30 -2 -22 15 -26 -13 23 14 -6 44 -9 -57 17 34 -5 39
5961C9j3r3O0M6n5L3L5p2oM4m6J2N6l4k0M6k9j9K6j8K0L6l3l1K1k8J9M5k4rL3
$$ 39 26 -67 -7 39 -16 17 52 -20 -26 18 -28 -16 40 6 -14 32 3 -16 10 -8 12 48 15 -16 5 -23 -4 41 17 8 41
5992D1n7l6P5pk1N2l8o1P5J2o1M0J5o2L5Rm1L1M1n8KK7l4KJ9l2M8L0o0J3J8l8
$$ 41 -16 -52 23 16 -5 47 9 -52 23 35 -26 14 29 -33 2 11 -30 1 42 -16 -14 13 -21 -19 0 -32 16 46 -14 -1 17 -21
6024b1K1L7n9K0N1n2k6O4l7j7N2m6k0O5j5m5N5ll6L0lm0M5Qm7J5J4j2J7j6j5M1
$$ -21 0 37 -22 -2 49 -3 -29 35 -2 -19 33 -13 -33 32 17 -28 27 24 -12 18 15 -25 20 28 -19 -4 10 -2 15 -1 -16 25
6056B5k5k4M2rk0M3lo7N5K9q9L0M2n9K4M6p7j4R3n9j3Q0m9l8N2k0j7O3j2n2LJ4
$$ 25 0 -24 18 9 -11 32 29 -38 17 46 -43 -13 29 -30 -6 40 -37 -51 42 -17 -30 50 1 -37 15 -5 -22 41 29 -23 -20 -6
6088flM0k0k0K8k2j3M0k6mM4n1oN7j9o7P4rl3N5lj03N4M9m7J5M2p1KL8k6J0N3
$$ -6 -9 31 11 -9 19 -3 -16 24 -2 -6 38 -13 -19 38 19 -48 26 17 -16 39 36 -67 -13 36 -11 4 46 -25 -23 15 -11 -1 52
6121E2l6n1M0j1KL2m6qM8k2kK8o1PM6k8JM6m7l2M7onP2n6p1N3K9l5M5j3o1L3K2
$$ 52 16 -35 5 -6 -4 28 -18 -26 22 0 -2 26 -35 -28 18 -10 -9 37 -10 -42 5 -1 -6 66 10 -61 -8 21 -14 31 18 -43 -10 12
6155A2k1L3K8p5J8J9j0K8qo6L5L2k8L7j2p6M5M3m4K6K6p7qO3j7J2M4q1m2R6pk3
$$ 12 -9 24 52 -23 -5 14 4 32 24 -42 -7 25 -3 34 22 -54 -9 34 -10 16 42 -35 -43 20 3 15 59 -22 -64 32 25 2
6187BM2l8o5N7K8l4J9ml7RL1PK1m2l4L1K2J1J2n6l4N7Mj8M5l7o1O9J4n2O9jq9
$$ 2 44 6 -59 -2 26 -8 11 7 -30 -21 10 17 38 -4 -38 -7 15 26 38 -18 -52 5 9 -9 36 -1 -62 7 21 -31 38 37 -52
$$ [...]
8191c
##END NTUPLES=NMR FID
##END=
