##TITLE=1H_LY-835.24
 CCl4 8 sc, 
 6.6.2019
##JCAMPDX= 6.0         $$ Bruker NMR JCAMP-DX V2.0
##DATA TYPE= NMR FID
##DATA CLASS= NTUPLES
##ORIGIN= UXNMR, Bruker Analytische Messtechnik GmbH
##OWNER= root
$$ XWIN-NMR		Version 3.5
$$ Thu Jun  6 14:28:19 2019 Russian Standard Time (UT+4h)  she@DPX200
##.OBSERVE FREQUENCY= 200.13155
##.OBSERVE NUCLEUS= ^1H
##.DELAY= (6, 6)
##.ACQUISITION MODE= SIMULTANEOUS
##.ACQUISITION SCHEME= undefined
##.AVERAGES= 8
##.DIGITISER RES= 18
##SPECTROMETER/DATA SYSTEM= spect
##.PULSE SEQUENCE= zg30
##.SOLVENT NAME= CDCl3
##.SHIFT REFERENCE= (INTERNAL, CDCl3, 0, 15.7039)
##AUDIT TRAIL= $$ (NUMBER, WHEN, WHO, WHERE, WHAT)
$$ ##TITLE= Audit trail, XWIN-NMR		Version 3.5
$$ ##JCAMPDX= 5.01
$$ ##ORIGIN= Bruker BioSpin GmbH
$$ ##OWNER= she
$$ F:/spectra/data/she/nmr/H-F/1/audita.txt
$$ ##AUDIT TRAIL=  $$ (NUMBER, WHEN, WHO, WHERE, WHAT)
(   1,<2019-06-06 14:27:10.17 +0400>,<she>,<DPX200>,
      <created by zg, POWCHK disabled, PULCHK disabled
       configuration hash MD5:
       00 E9 B6 7A A2 85 ED C7 34 08 36 98 17 FE 4E 26
       data hash MD5: 16K
       2E 2B 65 4C BA 18 6A 1A 1A A9 F0 31 89 FC D0 77>)
$$ ##END=
$$ 
$$ hash MD5
$$ B3 AC 83 48 45 78 BC E4 17 EF 7D 01 32 4C 9D 47
##$RELAX= 
##$RELAX= 
##$RELAX= 
##$RELAX= 
##$RELAX= 
##$RELAX= 
$$ Bruker specific parameters
$$ --------------------------
##$DU= <F:/spectra>
##$EXPNO= 1
##$NAME= <H-F>
##$PROCNO= 1
##$TYPE= <nmr>
##$USER= <she>
##$AMP= (0..31)
100 100 100 100 100 100 100 100 100 100 100 100 100 100 100 100 100 100 
100 100 100 100 100 100 100 100 100 100 100 100 100 100 
##$AQSEQ= 0
##$AQ_mod= 1
##$AUNM= <au_zg>
##$AUTOPOS= <>
##$BF1= 200.13
##$BF2= 200.13
##$BF3= 200.13
##$BF4= 200.13
##$BF5= 200.13
##$BF6= 200.13
##$BF7= 200.13
##$BF8= 200.13
##$BYTORDA= 1
##$CFDGTYP= 0
##$CFRGTYP= 5
##$CHEMSTR= <none>
##$CNST= (0..31)
1 1 145 1 1 1 1 1 1 1 1 1 1 1 1 1 1 1 1 1 1 1 1 1 1 1 1 1 1 1 1 1 
##$CPDPRG= <>
##$CPDPRG1= <>
##$CPDPRG2= <>
##$CPDPRG3= <>
##$CPDPRG4= <mlev>
##$CPDPRG5= <mlev>
##$CPDPRG6= <mlev>
##$CPDPRG7= <mlev>
##$CPDPRG8= <mlev>
##$CPDPRGB= <>
##$CPDPRGT= <>
##$D= (0..31)
0 1.2 0 0 0 0 0 0 0 0 0 0.03 0 0 0 0 0 0 0 0 0 0 0 0 0 0 0 0 0 0 0 0 
##$DATE= 1559816829
##$DBL= (0..7)
120 120 120 120 120 120 120 120 
##$DBP= (0..7)
150 150 150 150 150 150 150 150 
##$DBP07= 0
##$DBPNAM0= <>
##$DBPNAM1= <>
##$DBPNAM2= <>
##$DBPNAM3= <>
##$DBPNAM4= <>
##$DBPNAM5= <>
##$DBPNAM6= <>
##$DBPNAM7= <>
##$DBPOAL= (0..7)
0.5 0.5 0.5 0.5 0.5 0.5 0.5 0.5 
##$DBPOFFS= (0..7)
0 0 0 0 0 0 0 0 
##$DE= 6
##$DECBNUC= <off>
##$DECIM= 24
##$DECNUC= <off>
##$DECSTAT= 4
##$DIGMOD= 1
##$DIGTYP= 9
##$DL= (0..7)
0 120 120 120 120 120 120 120 
##$DP= (0..7)
150 150 150 150 150 150 150 150 
##$DP07= 0
##$DPNAME0= <>
##$DPNAME1= <>
##$DPNAME2= <>
##$DPNAME3= <>
##$DPNAME4= <>
##$DPNAME5= <>
##$DPNAME6= <>
##$DPNAME7= <>
##$DPOAL= (0..7)
0.5 0.5 0.5 0.5 0.5 0.5 0.5 0.5 
##$DPOFFS= (0..7)
0 0 0 0 0 0 0 0 
##$DQDMODE= 0
##$DR= 18
##$DS= 0
##$DSLIST= <SSSSSSSSSSSSSSS>
##$DSPFIRM= 0
$$ [...]
##$SUBNAM2= <"">
##$SUBNAM3= <"">
##$SUBNAM4= <"">
##$SUBNAM5= <"">
##$SUBNAM6= <"">
##$SUBNAM7= <"">
##$SUBNAM8= <"">
##$SUBNAM9= <"">
##$SW= 24.9336996594482
##$SWIBOX= (0..15)
0 0 2 0 0 0 0 0 0 0 0 0 0 0 0 0 
##$SW_h= 4990.01996007984
##$TD= 16384
##$TD0= 1
##$TE= 0
##$TE2= 300
##$TE3= 300
##$TEG= 300
##$TL= (0..7)
0 120 120 120 120 120 120 120 
##$TP= (0..7)
150 150 150 150 150 150 150 150 
##$TP07= 0
##$TPNAME0= <>
##$TPNAME1= <>
##$TPNAME2= <>
##$TPNAME3= <>
##$TPNAME4= <>
##$TPNAME5= <>
##$TPNAME6= <>
##$TPNAME7= <>
##$TPOAL= (0..7)
0.5 0.5 0.5 0.5 0.5 0.5 0.5 0.5 
##$TPOFFS= (0..7)
0 0 0 0 0 0 0 0 
##$TUNHIN= 0
##$TUNHOUT= 0
##$TUNXOUT= 0
##$USERA1= <user>
##$USERA2= <user>
##$USERA3= <user>
##$USERA4= <user>
##$USERA5= <user>
##$V9= 5
##$VALIST= <valist>
##$VCLIST= <CCCCCCCCCCCCCCC>
##$VD= 0
##$VDLIST= <DDDDDDDDDDDDDDD>
##$VPLIST= <PPPPPPPPPPPPPPP>
##$VTLIST= <TTTTTTTTTTTTTTT>
##$WBST= 1024
##$WBSW= 4
##$XGAIN= (0..3)
0 0 0 0 
##$XL= 0
##$YL= 0
##$YMAX_a= 40944
##$YMIN_a= -52707
##$ZGOPTNS= <>
##$ZL1= 120
##$ZL2= 120
##$ZL3= 120
##$ZL4= 120
##$ABSF1= 10
##$ABSF2= 0
##$ABSG= 5
##$ABSL= 3
##$ALPHA= 0
##$AQORDER= 0
##$ASSFAC= 0
##$ASSFACI= 0
##$ASSFACX= 0
##$ASSWID= 0
##$AUNMP= <proc_1d>
##$AZFE= 0.1
##$AZFW= 0.1
##$BCFW= 1
##$BC_mod= 2
##$BYTORDP= 1
##$COROFFS= 0
##$CY= 11.3945322036743
##$DATMOD= 1
##$DC= 2
##$DFILT= <>
##$DTYPP= 0
##$F1P= 18.9103706918063
##$F2P= -1.10871071338519
##$FCOR= 0.5
##$FTSIZE= 0
##$FT_mod= 4
##$GAMMA= 1
##$GB= 0.15
##$INTBC= 1
##$INTSCL= 1
##$ISEN= 128
##$LB= 0.24
##$LEV0= 0
##$LPBIN= 0
##$MAXI= 10000
##$MC2= 0
##$MEAN= 0
##$ME_mod= 0
##$MI= 1.114404
##$NCOEF= 0
##$NC_proc= 0
##$NLEV= 6
##$NOISF1= 3.799351
##$NOISF2= 2.8
##$NSP= 1
##$NTH_PI= 0
##$NZP= 0
##$OFFSET= 15.70392
##$PC= 1
##$PHC0= -8574.492
##$PHC1= 12.80019
##$PH_mod= 1
##$PKNL= yes
##$PPARMOD= 0
##$PSCAL= 0
##$PSIGN= 0
##$REVERSE= no
##$SF= 200.130013532006
##$SI= 16384
##$SIGF1= 3
##$SIGF2= 2
##$SINO= 400
##$SIOLD= 16384
##$SREGLST= <1H.CDCl3>
##$SSB= 0
##$STSI= 0
##$STSR= 0
##$SW_p= 3612.71676300578
##$SYMM= 0
##$S_DEV= 0
##$TDeff= 0
##$TDoff= 0
##$TI= <>
##$TILT= no
##$TM1= 0
##$TM2= 0
##$TOPLEV= 0
##$USERP1= <user>
##$USERP2= <user>
##$USERP3= <user>
##$USERP4= <user>
##$USERP5= <user>
##$WDW= 1
##$XDIM= 8192
##$YMAX_p= 0
##$YMIN_p= 0
$$ End of Bruker specific parameters
$$ ---------------------------------
##NTUPLES= NMR FID
##VAR_NAME=  TIME,          FID/REAL,        FID/IMAG
##SYMBOL=    X,             R,               I
##VAR_TYPE=  INDEPENDENT,   DEPENDENT,       DEPENDENT
##VAR_FORM=  AFFN,          ASDF,            ASDF
##VAR_DIM=   8192,          8192,            8192
##UNITS=     SECONDS,       ARBITRARY UNITS, ARBITRARY UNITS
##FACTOR=    0.0002004,     1,               1
##FIRST=     0,             0,               0
##LAST=      1.6414764,     0,               0
##MIN=       0,             -52707,          0
##MAX=       1.6414764,     40944,           0
$$ Real data points
##PAGE= N=1
##DATA TABLE= (X++(R..R)), XYDATA
$$ [...]
$$ plain form
912 1054 -1177 -234 559 -1225 -34 1397 -411 45 1041 -1129 -1061 754 -111 150 1300 -350 -743
929 -743 279 -949 -481 1497 267 -314 766 -896 -1357 908 305 -500 1283 381 -1294 -73 -205
946 -205 -778 1081 976 -512 221 -279 -1379 344 748 -295 1001 643 -1619 -480 656 -653 443
963 443 1414 -633 -585 553 -866 -669 1128 329 -179 576 -479 -923 295 47 -73 905 247 -561 -131
982 -131 -485 -390 813 475 -198 199 -298 -603 262 37 -148 741 127 -633 236 -78 -697 486 429 -461
1002 -461 602 474 -1159 -378 533 -277 398 958 -635 -744 273 -345 -166 957 254 -482 -65 -364
1020 -364 -337 555 319 -183 110 -110 -276 130 -89 -138 423 129 -237 96 -173 -351 279 148 -121 403 26
1041 26 -654 -27 248 -44 364 166 -621 -82 363 -147 64 303 -314 -188 249 -87 47 332 -260 -340 192
$$ packed form
912A054k231R43P93j784J191J431j808M56R96k170O8J815q65K61J150j650l93
929g43J022j228M68J978j230n81J080j662m61K265o03q05J783r02j675J221j32
946b05n73J859j05j488P33n00j100J723M04j043J296l58k262J139J136j309J096
963D43R71k047M8J138j419J97J797p99n08P55j055m44J218k48j20R78o58q08M30
982a31l54R5J203l38o73L97m97l05Q65k25j85Q89o14p60Q69l14o19J183n7q90
1002d61J063j28j633P81R11q10O75N60j593j09J017o18J79J123p03p36M17k99
1020c64K7Q92k36n02K93k20j66M06k19m9N61k94l66L33k69j78O30j31k69N24l77
1041B6o80O27K75k92M08j98p87N39M45n10K11K39o17J26M37l36J34K85n92q0N32
$$ plain form
1062 192 105 135 208 -386 -335 323 69 -42 307 -191 -400 230 45 -210 408 129 -573 -14 313 -122 122
1083 122 197 -398 -137 356 -17 -202 97 10 -86 37 25 0 -16 -14 43 -59 -10 217 -145 -364 274 279 -225 81
1107 81 32 -496 180 570 -322 -168 388 -389 -342 590 90 -296 356 -152 -663 415 518 -351 -37 185 -379
1128 -379 -29 416 -118 -170 213 -82 -256 116 200 -20 -100 -65 6 13 107 93 -225 -101 294 -26 -250 178 53
1151 53 -225 189 77 -316 187 212 -370 80 334 -251 -29 185 -321 83 464 -315 -232 306 -193 -96 453
1172 453 -185 -284 409 -166 -417 499 193 -431 172 42 -427 341 383 -434 -99 271 -239 -74 285 -54 -128
1193 -128 119 -58 -181 80 230 -19 -304 34 247 -209 -43 330 -293 -217 563 -228 -558 641 133 -764
1213 -764 454 370 -836 325 645 -895 17 968 -703 -457 920 -332 -498 872 -208 -797 708
$$ packed form
1062A92q7L0P3n94N1O58k54j11L49m98k09O30j85k55O18k79p02N59L27m35K44
1083A22P5n95K61M93l73j85K99q7r6J23j2k5j6KN7j02M9K27l62k19O38Nn04L06
1107H1m9n28O76L90q92J54N56p77M7R32n00l86O52n08n11J078J03q69L14K22n64
1128c79L50M45n34n2L83k95j74L72Q4k20q0L5P1PR4j4l18J24L95l20k24M28j25
1151E3k78M14j12l93N03K5n82M50K54n85K22K14n06M04L81p79Q3N38m99R7N49
1172D53o38r9O93n75k51R16l06o24O03j30m69P68M2q17L35L70n10J65L59l39p4
1193a28K47j77j23K61J50k49k85L38K13m56J66L73o23P6P80p91l30J199n08q97
1213g64J218q4j206J161L20j540R12R51j671K46J377j252j66J370j080n89J505
$$ plain form
1230 708 232 -751 410 360 -648 104 337 -412 148 425 -355 -225 180 -14 35 74 -82 -7 -76 -29 144
1251 144 -125 23 355 -346 -333 505 -72 -361 550 -114 -617 676 111 -857 599 439 -935 369 574
1270 574 -1010 285 899 -1062 -114 1146 -820 -450 1170 -561 -641 1218 -353 -1027 1089 191 -1065
1287 -1065 706 360 -1027 472 596 -893 171 708 -634 -211 540 -223 -107 340 -192 -210 145 96
1305 96 32 -183 -1 318 -354 -266 625 -206 -496 763 -194 -897 993 341 -1279 653 703 -1374 415
1324 415 1126 -1353 -8 1456 -1234 -599 1641 -669 -897 1468 -445 -1209 1408 49 -1378 1097
1340 1097 485 -1353 618 616 -1192 445 904 -1020 -43 838 -662 -232 688 -294 -159 442 -279 -262 243
1359 243 35 105 -47 -259 269 -42 -384 488 86 -613 503 106 -909 665 599 -1116 298 760 -1174
$$ packed form
1230G08m76r83J161n0j008P52K33p49N60K77p80J30M05j94M9L9j56P5o9M7J73
1251A44k69J48L32p01J3Q38n77k89R11o64n03J293n65r68J456j60j374J304K05
1270E74j584J295O14j961R48J260j966L70J620j731q0J859j571o74K116q98j256
1287a065J771l46j387J499J24j489J064N37j342M23P51p63J16M47n32j8L55m9
1305I6o4k15J82L19o72Q8Q91q31k90J259r57p03J890o52j620J932N0k077J789
1324D15P11k479J345J464k690O35K240k310k28K365j913p64K617j359j427K475
1340A097o12j838J971kj808J637M59j924R77Q81j500M30R20r82J35O01p21J7N05
1359B43k08P0j52k12N28l11l42Q72m02o99J116l97j015J574o6j715J414M62j934
$$ plain form
1378 -1174 252 1196 -1260 -189 1522 -1090 -738 1679 -654 -1114 1660 -271 -1548 1500 336 -1776
1394 -1776 1001 900 -1537 516 973 -1464 93 1273 -950 -260 1101 -658 -539 790 -336 -368
1410 -368 764 -94 -489 281 -37 -212 134 -14 191 142 -312 101 -81 -543 622 514 -786 363 521
1429 521 -1301 7 1186 -795 -8 1377 -1202 -1026 1440 -399 -899 1649 -39 -1484 984 15
1445 15 -1574 1186 988 -1332 561 719 -1701 81 1196 -981 249 1467 -1071 -906 851 -533
1461 -533 -367 1386 31 -775 389 -330 -815 497 537 53 288 -244 -520 -120 -187 241 617 -33 121
1480 121 128 -1035 -369 765 -114 281 1018 -808 -919 592 -598 -425 1762 207 -1152 623 -444
1497 -444 -1556 1235 1058 -1065 776 732 -1965 -285 1161 -821 340 1700 -937 -1089 708 -711
$$ packed form
1378a174J426R44k456J071J711k612L52K417k333m60K774j931j277L048j164k112
1394a776K777j01k437K053M57k437J557J180k223O90J361j759J19J329j126l2
1410c68J132q58l95P70l18j75L46j48K05m9m54M13j82m62J165j08j300J149J58
1429E21j822J308J179j981P87J385k579J76K466j839n00K548j688j445K468r69
1445A5j589K760j98k320J893J58k420J782J115k177J230J218k538J65J757j384
1461e33J66J753j355q06J164p19m85J312M0m84K35n32k76M00o7M28L76o50J54
1480A21Pj163O66J134q79L95P37j826j11J511j190J73K187j555j359J775j067
1497d44j112K791j77k123J841m4k697J680J446j982J161J360k637j52J797j419
$$ plain form
1513 -711 -660 1501 476 -556 446 -580 -1261 497 700 39 636 71 -905 -346 -104 -72 721 566 -33
1532 -33 -136 -651 -517 331 109 276 883 -221 -775 39 -554 -423 1303 572 -661 382 -297 -1417 458
1551 458 894 -397 742 648 -1521 -497 725 -580 313 1391 -587 -661 554 -869 -710 1289 317
1568 317 -430 708 -397 -1244 413 343 -346 879 531 -901 -328 -48 -460 532 796 -165 -119 -143 -608
1587 -608 -84 276 159 487 116 -545 -126 -129 -299 509 350 -272 342 13 -933 64 496 -318 474 592 -878
1608 -878 -296 493 -621 -23 1074 -259 -490 507 -531 -604 900 144 -570 589 31 -797 291 191
1626 191 -510 498 413 -643 -6 199 -507 148 441 -252 116 218 -547 -124 337 -116 162 224 -433 -65
1646 -65 263 -285 60 373 -264 -30 236 -376 6 477 -289 -174 382 -250 -159 424 -267 -235 525 -143 -389
$$ packed form
1513g11N1K161j025j032J002j026o81J758K03o61N97n65r76N59K42L2P93j55n99
1532c3j03n15J34Q48k22J67O07j104n54Q14n93J31J726p31j233J043o79j120J875
1551D58M36j291J139r4k169J024J222j305Q93J078j978p4J215j423J59J999r72
1568C17p47J138j105q47J657p0o89J225l48j432N73K80m12R92K64r61M6k4m65
1587f08N24L60j17L28l71o61M19lj70Q08j59o22O14l29r46R97M32q14P92J18j470
1608h78N82P89j114N98J097j333k31R97j038p3J504p56p14J159n58q28J088j00
1626A91p01J008q5j056O37K05p06O55K93o93L68J02p65M23M61m53K78O2o57L68
1646f5L28n48L45L13o37K34K66o12L82M71p66J15N56o32R1N83o91L2P60o68k46
$$ plain form
1667 -389 396 -67 -310 465 -44 -464 404 46 -523 358 234 -432 239 121 -591 234 433 -451 44 329
1687 329 -439 -27 356 -332 -29 453 -289 -220 294 -180 -120 311 -171 -119 331 -181 -273 191 -94 -41 322 -163
1709 -163 -237 240 -161 -220 355 -13 -155 295 -199 -398 370 103 -278 311 50 -401 217 63 -417 320 315
1730 315 -382 56 144 -414 109 315 -314 74 343 -390 -145 279 -208 52 382 -306 -203 333 -190 -180 336
1751 336 -92 -180 296 -176 -278 340 36 -248 202 -13 -230 223 12 -269 197 91 -221 112 32 -167 184
1772 184 6 -250 168 104 -187 150 11 -248 229 87 -322 201 197 -347 104 186 -348 165 325 -427 -45
1793 -45 389 -287 -93 388 -249 -175 406 -196 -273 388 -1 -287 218 -49 -238 278 28 -261 163 46 -230
1814 -230 117 35 -117 215 10 -281 94 40 -120 200 13 -214 163 -22 -295 207 175 -214 138 10 -390
$$ packed form
1667c89P85m63k43P75n09m20Q68l58n69Q81j24o66O71j18p12Q25J99q84M95K85
1687C29p68M12L83o88L03M82p42O9N14m74O0M31m82N2M50n12r2M64k85N3L63m85
1709a63p4M77m01n9N75l68j42M50m94j99P68k67l81N89k61m51O18j54m80P37n
1730C15o97M38Q8n58N23K06o29L88K69p33K45M24m87K60L30o88J03N36n23J0N16
1751C36m28q8M76m72j02O18l04k84M50k15k17M53k11k81M66j06l12L33q0j99L51
1772A84j78k56M18o4k91L37j39k59M77j42m09N23mn44M51Q2n34N13J60p52L82
1793d5M34o76J94M81o37P4N81o02p7O61l89k86N05k67j89N16k50k89M24j17k76
1814b30L47q2j52L32k05k91L75n4j60L20j87k27L77j85k73N02l2l89L52j28m00
$$ plain form
1835 -390 187 268 -318 107 262 -362 4 266 -275 40 374 -307 -170 311 -147 -68 307 -187 -139 327 -132
1856 -132 -207 308 -37 -169 233 -127 -204 327 -15 -278 203 -2 -207 229 -11 -241 255 15 -308 170 67
1877 67 -188 243 -15 -356 233 119 -317 212 162 -367 139 145 -423 194 384 -401 -43 297 -332 4 401
1898 401 -300 -109 393 -273 -224 366 -97 -127 310 -219 -249 328 -19 -181 247 -64 -195 215 -109 -143 315
1919 315 -41 -229 186 -124 -130 371 -116 -279 363 -108 -379 390 29 -395 427 43 -623 365 333 -529 199
1940 199 320 -595 129 440 -517 16 554 -441 -204 461 -302 -126 533 -276 -313 441 -147 -270 399 -76
1960 -76 -243 316 -127 -300 346 41 -199 228 -124 -210 319 -84 -191 368 -101 -299 306 -109 -241 531 -66
1981 -66 -499 389 25 -443 511 123 -600 391 177 -685 385 483 -623 151 386 -720 149 676 -612
$$ packed form
1835c90N77Q1n86M25J55o24L66K62n41L15L34o81J37M81m58P9L75m94M8M66m59
1856a32p5N15l45j32M02l60p7N31l42k63M81k05k05M36k40k30M96k40l23M78j03
1877F7k55M31k58l41N89j14m36N29n0n29N06On68O17J90p85L58L40o29L36L97
1898D01p01J91N02o66M9N90m63l0M37n29l0N77l47j62M28l11j31M10l24l4M58
1919C15l56j88M15l10oN01m87j63O42m71k71P69l61m24Q22l84o66R88l2q62P28
1940A99J21r15P24L11r57N33N38r95K37O65p63J76O59q09l7P54n88j23O69m75
1960g6j67N59m43j73O46l05k40M27l52q6N29m03j07N59m69j98O05m15j32P72n97
1981f6m33Q88l64m68R54l88p23R91k14q62J070R8j106P74K35j106Q69N27j288
$$ plain form
2000 -612 -91 638 -561 -246 689 -366 -277 693 -321 -506 594 -63 -435 497 -29 -438 430 17 -451
2019 -451 322 128 -293 249 -11 -311 302 -3 -297 325 11 -304 338 -71 -369 477 16 -535 443 153
2039 153 -499 470 132 -787 411 449 -698 333 530 -851 25 611 -656 148 909 -691 -433 680
2057 680 -449 -234 963 -280 -584 624 -285 -633 747 151 -507 462 -76 -669 438 203 -475 368
2075 368 219 -462 184 34 -464 327 269 -293 253 34 -486 207 95 -312 489 209 -601 188 108 -549 485
2096 485 397 -679 284 447 -803 112 592 -704 100 828 -699 -210 767 -719 -446 996 -211 -384
2114 -384 836 -474 -914 771 167 -519 788 76 -963 273 191 -555 604 521 -682 -26 171 -517
2132 -517 241 439 -323 141 210 -471 0 137 -271 339 273 -401 157 88 -583 236 400 -382 359 321 -869
$$ packed form
2000f12N21P29j199L15R35j055Q9R70j014j85J100o57l72R32n26m09Q68m13m68
2019d51P73j94m21N42k60l00O13l05k94O22l14l15O42m09k98Q46m61n51R78k90
2039A53o52R69l38r19J198L8j147J031J97j381Q76N86j267Q04P61j600K58J113
2057F80j129K15J197j243l04J208r09l48J380n96o58R69n38n93J107k35o78Q43
2075C68j49o81O46j50m98P91n8n62N46k19n20O93j12m07Q01k80q10P89q0o57J034
2096D85q8j076R63J63j250R15M80j296Q04P28j527M89R77j486K73J442j207j73
2114c84J220j310m40J685o04o86J307p12j039J236q2p46J159q3j203O56J97o88
2132e17P58J98p62M64O9o81M71J37m08O10o6o74N58o9o71Q19J64p82P41l8j190
$$ plain form
2153 -869 25 590 -521 166 723 -709 -202 722 -613 -277 976 -363 -504 828 -307 -670 811
2170 811 -107 -765 825 267 -818 414 135 -851 493 575 -616 206 383 -781 -25 549 -291 144
2188 144 401 -552 -227 350 -205 65 337 -300 -56 190 -369 41 359 -273 74 263 -469 38 409 -473
2208 -473 3 588 -433 -139 540 -516 -209 792 -324 -421 726 -267 -564 740 -36 -635 687 75
2226 75 -827 527 357 -713 336 358 -741 249 536 -621 34 497 -521 -73 502 -387 -81 476 -384
2245 -384 -226 458 -156 -157 333 -227 -189 336 -150 -149 315 -145 -141 240 -223 -63 420 -226 -209 338 -230 -175 504
2268 504 -206 -345 500 -153 -460 551 49 -471 430 26 -601 481 295 -609 264 325 -601 215 444 -561
2288 -561 58 502 -531 -78 570 -328 -188 448 -302 -223 513 -164 -319 337 -73 -208 311 -119 -268 293
$$ packed form
2153h69Q94N65j111O87N57j432N07R24j335L36J253j339j41J332j135l63J481
2170H11r18o58J590n58j085J232k79r86J344Q2j191Q22J77j164P56N74q40M35
2188A44K57r53L25N77n55K70K72o37K44K46n59M10L18o32L47J89p32N07L71q82
2208d73M76N85j021K94O79j056L07J001j116r7J147r93k97J304p76n99J322o12
2226G5r02J354j70j070J049K2j099R90K87j157O55M63j018M48N75q89L06N57q60
2245c84J58O84o14jM90n60L8N25m86JM64m60ML81m63J60M83o46J7N47n68N5O79
2268E04p10j39Q45o53l07J011n02n20R01m04o27J082j86r04Q73O1r26Q16K29j005
2288e61O19M44j033M53O48q98J40O36p50P9P36o77j55O56m10j35N19m30j49N61
$$ plain form
2308 293 -19 -191 264 -85 -269 204 -36 -114 400 -25 -402 113 -27 -123 452 59 -419 123 -27 -327 384
2329 384 258 -362 139 58 -487 255 405 -404 30 305 -367 41 371 -445 -129 473 -158 -89 401 -325 -370
2350 -370 344 -38 -56 535 -123 -554 105 12 -88 477 91 -420 50 4 -253 239 185 -204 104 40 -258 122
2372 122 51 -265 145 197 -68 156 -99 -528 57 330 27 289 85 -586 -202 192 -81 321 458 -394 -358
2393 -358 82 -185 134 528 -177 -261 219 -170 -222 300 -72 -175 377 53 -290 118 -117 -356 276 336 -24
2414 -24 142 -173 -555 44 364 109 233 -9 -456 -126 118 -31 268 236 -267 -125 33 -171 99 197 -200
2435 -200 31 270 -140 -115 11 -273 59 443 8 -109 23 -372 -193 363 179 70 187 -327 -425 213 197
2456 197 36 245 -94 -349 112 66 -135 173 114 -160 78 54 -180 38 30 -171 164 243 -102 -63 -96 -223 158
$$ packed form
2308B93l12j72M55l49j84M73k40p8N14m25l77N15j40r6N75l93m78N42j50l00P11
2329C84j26o20N01q1n45P42J50q09M34K75o72M08L30q16L16O02o31O9M90p26m5
2350c70P14l82j8N91o58m31O59r3j00N65l86n11M70m6k57M92n4l89L08o4k98L80
2372A22p1l16M10N2k65K24k55m29N85K73l03K62k04o71L84L94k73M02J37q52L6
2393c58M40k67L19L94p05q4M80l89n2N22l72j03N52l24l43M08k35k39O32O0l60
2414b4J66l15l82N99L20k55J24k42m47L30K44j49K99l2n03J42J58k04K70R8l97
2435b00K31K39m10K5J26k84L32L84m35j17J32l95J79N56j84j09J17n14r8O38j6
2456A97j61K09l39k55M61m6k01L08n9k74K38k4k34K18qk01L35P9l45L9l3j27L81
$$ plain form
2479 158 310 -44 -13 -24 -273 8 224 -28 89 135 -278 -132 188 -44 5 171 -159 -93 217 -98 -188 162
2501 162 -21 -94 203 -34 -205 108 -8 -158 179 126 -145 19 -25 -143 136 149 -128 -1 52 -109 32 67
2523 67 -90 63 81 -107 -12 52 -49 55 19 -106 56 49 -132 57 89 -113 58 46 -204 60 216 -121 -48
2546 -48 121 -183 -22 236 -125 -133 186 -101 -176 233 9 -180 120 -29 -181 198 136 -238 -43 51 -77 121
2568 121 132 -183 -104 44 -31 42 141 -26 -108 -80 -35 134 113 -34 -70 -111 -43 181 75 -132 -5 -24 -90 154 119
2593 119 -168 -19 25 -171 152 262 -166 -162 31 -119 112 334 -155 -284 73 -54 -13 313 -21 -294 41
2614 41 -16 -90 288 118 -310 -95 59 -17 196 126 -271 -159 90 52 103 86 -157 -172 -1 77 142 95 -122 -172
2638 -172 -90 72 266 66 -212 -115 -65 2 285 96 -274 -54 55 -126 199 248 -254 -196 117 -90 107 361
$$ packed form
2479A58J52l54L1j1k49K81K16k52J17M6m13J46L20k32M9J66l30O6L10l15r0L50
2501A62j83p3K97k37j71L13j16j50L37n3k71J64m4j18K79J3k77J27N3j61J41L5
2523F7j57J53J8j88R5O4j01J04l6j25J62pj81J89L2k02J71j2k50K64J56l37P3
2546d8J69l04J61K58l61qL19k87p5M09k24j89L00j49j52L79o2l74J95R4j28J98
2568A21J1l15P9J48p5P3R9j67q2K8M5J69k1j47l6m1O8K24j06k07J27j9o6K44l5
2593A19k87J49M4j96L23J10m28MJ93j50K31K22m89j29L57j27M1L26l34k73L35
2614D1n7p4L78j70m28K15J54p6K13p0l97J12K49l8N1j7k43j5J71P8O5m7k17n0
2638a72Q2J62J94k00k78R7N0O7K83j89l70K20J09j81L25M9n02N8L13k07J97K54
$$ plain form
2660 361 -214 -369 148 72 -21 285 -73 -418 79 170 -60 197 79 -358 -102 173 47 151 64 -299 -174
2681 -174 153 132 98 6 -228 -130 98 96 137 10 -203 -117 19 51 200 53 -282 -124 67 30 205 92 -321
2704 -321 -109 163 -31 107 201 -275 -198 201 -16 28 297 -193 -362 202 132 -61 234 -84 -419 146 261
2725 261 -143 106 79 -365 -45 265 -40 42 129 -278 -168 250 98 -12 24 -200 -163 170 122 -10 -11 -139 -90
2748 -90 75 56 81 12 -196 -61 80 3 137 103 -295 -83 256 -39 -22 190 -220 -224 303 26 -181 244 -54
2771 -54 -366 204 197 -172 147 44 -383 111 320 -170 1 137 -303 -16 327 -115 -81 203 -196 -192 270 50
2793 50 -121 105 -91 -182 164 114 -86 -12 -71 -67 104 3 -35 64 -108 -72 113 -29 -31 141 -132 -147 186 23
2817 23 -114 130 -57 -157 213 14 -213 179 50 -270 183 128 -320 142 215 -353 44 358 -265 -108 311
$$ packed form
2660C61n75j55N17p6r3L06l58l45M97R1k30K57j18m37K56K75j26J04q7l63J25
2681a74L27k1l4r2k34R8K28kM1j27k13Q6J36L2J49j47l35J58J91l7J75j13m13
2704c21K12K72j94J38R4m76P7L99k17M4K69m90j69N64p0j93K95l18l35N65J15
2725B61m04K49k7m44L20L10l05Q2Q7m07J10M18j52j10L6k24L7L33m8j32jj28M9
2748i0J65j9K5o9k08J35J41p7J34l4l98K12L39k95J7K12m10mN27k77k07M25k98
2771e4l12N70pl69L19j03m27M94K09m90J71J36m40K87L43m42L4K84l99MM62k20
2793E0j71K26j96r1L46n0k00P4n9MJ71j01l8R9j72L6J85j42kJ72k73j5L33j63
2817B3j37K44j87j00L70j99k27L92j29l20M53n5m48M62P3n68L97L14o23J57M19
$$ plain form
2838 311 -183 -127 329 -118 -232 250 2 -186 163 1 -155 154 -25 -170 144 36 -146 120 15 -145
2858 -145 99 52 -146 88 69 -131 -31 -25 -28 183 -8 -153 44 -80 -132 269 82 -248 126 19 -336 186
2880 186 334 -240 -25 140 -291 8 352 -169 -123 200 -149 -47 287 -163 -189 246 -109 -117 385 -38 -382
2901 -382 112 17 -152 354 163 -385 -112 72 -84 181 198 -138 -78 -53 -107 162 119 -121 47 -23 -151 204
2923 204 74 -329 -7 176 -34 176 94 -396 -164 133 -7 278 269 -350 -267 25 -168 270 524 -247 -361
2944 -361 112 -184 -52 494 1 -353 185 18 -240 212 69 -280 113 195 -32 144 -112 -423 32 260
2964 260 112 261 -48 -562 -153 226 77 294 205 -360 -285 26 21 229 244 -161 -135 17 -102 106 96 -286
2986 -286 41 332 -78 -49 71 -416 -188 446 164 4 131 -404 -491 225 298 172 284 -278 -533 47 141
$$ packed form
2838C11m94N6M56m47j14M82k48j88L49j62j56L09j79j45L14j08j82K66j05j60
2858a45K44m7j98K34j9k00J00OlK11j91j45J97j24n2M01j87l30L74j07l55N22
2880A86J48n74K15J65m31K99L44n21M6L23l49J02L34m50k6M35l55qN02m23l44
2901c82M94r5j69N06j91n48K73J84j56K65J7l36O0K5n4K69m3k40J68p0j28L55
2923B04j30m03L22J83k10K10q2m90K32K97j40K85ro19Q3K92j93M38K54p71j14
2944c61M73k96J32N46m93l54N38j67k58M52j43l49L93Q2k27J76k56l11M55K28
2964B60j48J49l09n14M09L79j49K17q9n65P5L11nK08J5m05K6J52j19K08j0l82
2986b86L27K91m10K9J20m87K28O34k82j60J27n35q7P16P3j26J12n62k55N80R4
$$ plain form
3007 141 28 361 11 -407 55 95 -211 160 189 -261 64 296 -133 -109 -25 -224 99 394 74 -79 -189
3028 -189 -371 48 368 98 104 20 -451 -203 263 81 103 195 -266 -225 194 3 -72 145 -101 -66 251 -79 -197
3051 -197 93 -114 -99 410 107 -259 26 -159 -298 356 372 -165 -63 -83 -326 119 316 -51 13 29 -248 -18
3073 -18 175 -70 57 123 -187 -2 205 -155 -121 130 -73 38 246 -121 -204 56 -47 14 230 -50 -115 40
3095 40 -165 -49 263 -27 -128 114 -134 -147 271 5 -252 148 56 -192 130 51 -235 85 111 -176 96 96
3117 96 -215 35 114 -149 104 151 -276 -39 195 -132 -30 158 -175 -100 215 -49 -103 141 -48 -102 106 -21
3139 -21 -47 105 -64 -66 126 -28 -69 77 -94 -47 249 -25 -180 81 -41 -78 219 34 -159 67 -60 -173
3161 -173 197 112 -155 83 -21 -235 159 183 -236 16 144 -192 33 195 -213 -92 201 -71 -39 175 -125
$$ packed form
3007A41j13L33l50m18M62M0l06L71K9m50L25K32m29K4Q4j99L23K95l20j53j10
3028a89j82M19L20k70Oq4m71K48M66j82K2R2m61M1M19j91p5K17k46L5L17l30j18
3051a97K90k07J5N09l03l66K85j85j39O54J6n37J02k0k43M45J97l67O4J6k77K30
3073a8J93k45J27O6l10J85K07l60L4K51k03J11K08l67q3K60j03O1K16k80o5J55
3095D0k05J16L12k90j01K42k48j3M18k66k57M00r2k48L22p9k86L20K6k87K72%
3117I6l11K50P9k63K53M7m27K37K34l27J02J88l33P5L15k64n4K44j89n4K08j27
3139b1k6J52j69kJ92j54m1J46j71M7K96k74j55K61j22l7K97j85j93K26j27j13
3161a73L70q5k67K38j04k14L94K4m19K52J28l36K25J62m08J21K93k72L2K14l00
$$ plain form
3182 -125 -164 76 -20 40 212 -95 -205 24 -31 41 206 -47 -188 49 -24 -69 170 26 -142 36 -13 -53 138
3205 138 -3 -157 56 31 -9 166 -37 -245 73 89 -72 162 52 -275 -7 96 -82 146 159 -227 -103
3226 -103 91 -68 100 154 -229 -100 165 -70 -11 159 -153 -163 176 0 -69 167 -63 -227 97 98 -20 93
3248 93 -60 -188 57 98 6 65 -69 -140 70 29 -38 136 -23 -200 55 84 -54 118 8 -237 41 146 -71
3271 -71 67 46 -197 20 157 -91 35 121 -187 -71 173 -39 -31 117 -159 -136 168 55 -75 54 -103 -116
3293 -116 133 34 -52 79 -83 -144 90 34 -42 117 -76 -203 91 86 -104 60 -11 -172 82 92 -116 31 44
3316 44 -128 34 86 -77 42 43 -167 27 167 -70 -4 59 -174 -14 178 -63 -39 115 -105 -74 151 -30 -41
3339 -41 125 -100 -139 143 20 -88 93 -39 -135 125 56 -117 39 18 -117 51 60 -61 40 -6 -120 38 57
$$ packed form
3182a25l9K40r6O0J72l07j10K29n5P2J65k53j41K37p3m5K39j44j68J78m9m0J91
3205A38j41j54K13k5m0J75k03k08L18J6j61K34j10l27K68J03j78K28J3l86J24
3226a03J94j59J68N4l83J29K65k35N9J70l12j0L39j76o9K36k30j64L24Jj18J13
3248I3j53j28K45M1r2N9j34p1K10m1o7J74j59j77K55K9j38J72j10k45K78J05k17
3271g1J38k1k43K17J37k48J26Q6l08J16K44k12QJ48k76K3L04j13j30J29j57j3
3293a16K49r9q6J31j62o1K34n6p6J59j93j27K94nj90J64p1j61K54J0k08J47J3
3316D4j72J62N2j63J19Jk10J94J40k37O6O3k33J60J92k41K4J54k20L1K25j81j1
3339d1J66k25l9K82j23j08J81j32r6K60o9j73J56k1j35J68Rj21J01m6j14J58J9
$$ plain form
3362 57 -48 55 -36 -142 80 74 -115 48 49 -146 24 102 -114 24 123 -159 -34 152 -69 -21 103 -121 -59
3385 -59 176 -42 -95 101 -45 -83 147 5 -105 115 -21 -144 89 77 -72 51 -20 -108 95 77 -72 23 14
3408 14 -97 59 62 -74 57 31 -121 17 77 -36 32 13 -132 41 96 -68 1 44 -94 15 89 -98 11 94
3432 94 -117 -29 121 -58 -22 107 -121 -77 170 -27 -109 104 -45 -95 155 18 -133 92 35 -146 80 87 -92
3455 -92 38 38 -119 55 115 -78 -21 25 -60 37 67 -79 -7 44 -85 18 73 -52 17 12 -110 2 109 -47 -18
3480 -18 17 -111 20 107 -108 -32 106 -107 -55 118 -86 -59 122 -74 -118 142 -6 -137 68 -18 -105 129 20
3503 20 -160 39 27 -121 85 78 -120 45 52 -136 46 150 -84 -46 69 -61 -6 90 -49 -49 58 -10 -4 23 -68
3528 -68 0 37 -57 38 93 -86 -68 39 -87 23 146 -68 -103 52 -67 -57 126 -32 -59 107 -78 -130 124 6
$$ packed form
3362E7j05J03r1j06K22oj89J63Jj95J70P8k16J38R9k82J25J86k21M8J24k24O2
3385e9K35k18n3J96j46l8K30j42j10K20j36j23K33j2j49J23p1q8K03j8j49R5r
3408A4j11J56Lj36J31k6j52J38O0j13O8j9j45J73N5j64O9M3j38J09P4j87J09Q3
3432I4k11Q8J50j79L6J29k28M4K47j97q2K13j49n0K50j37j51K25n7j81K26Pj79
3455i2J30%j57J74O0j93N7M6q5R7L0j46P2N1j29J03N5j25O9nj22J12J07j56K9
3480a8L5j28J31Q7k15P6J38k13N2J73k04K7J81j96m4K60j48j31K05q6q7K34j09
3503B0j80J99j2j48K06pj98J65Pj88J82J04k34L8J15j30N5R6j39%J07o8OK7r1
3528f8O8L7r4R5N5j79J8J07j26J10J23k14l5J55j19J0J83j58k7J66j85n2K54j18
$$ plain form
3552 6 -120 124 17 -157 103 44 -194 46 142 -92 12 59 -147 -26 104 -38 15 80 -92 -61 19 -60 49
3575 49 126 -88 -63 77 -55 -29 92 -37 -40 102 -19 -67 42 -38 -19 75 -34 4 65 -117 -82 105 -27 -8 151
3600 151 -100 -189 109 24 -121 126 59 -156 19 3 -128 74 94 -107 35 56 -129 -1 63 -129 43 175
3622 175 -126 -87 87 -91 -64 149 3 -89 51 -44 -97 49 52 18 27 -73 -32 62 -53 -13 92 -52 -42 105 -53
3647 -53 -106 108 -3 -91 99 17 -98 57 -19 -97 108 59 -109 49 -6 -153 97 83 -150 53 117 -165 -34
3670 -34 127 -109 -33 139 -81 -75 115 -42 -69 70 -12 -12 66 -83 -63 91 -26 -38 97 -42 -85 94 -9 -83
3694 -83 103 22 -80 18 15 -27 58 -16 -59 56 -17 -62 72 -23 -101 113 31 -157 71 86 -149 35 114 -122 -8
3719 -8 89 -118 -32 131 -50 -47 50 -88 -5 104 -71 -64 88 -76 -69 123 -25 -84 92 -41 -121 79 47 -75 18
$$ packed form
3552Fj26K44j07j74K60n9k38K40R6k34J04M7k06J21J30j42N3O5j72L1Q0p9J09
3575D9P7k14K5J40j32K6J21j29lJ42j21m8J09q0J9R4j09L8O1j82L5J87j32J9J59
3600A51k51q9K98q5j45K47o7k15J75j6j31K02K0k01J42K1j85J28O4j92J72J32
3622A75l01L9J74j78K7K13j46r2J40r5n3J46Ll4Rj00M1R4j15M0J05j44J0J47j58
3647e3n3K14j11q8J90q2j15J55p6p8K05m9j68J58n5j47K50j4k33K03O4k82J31
3670c4J61k36P6J72k20OJ90j57k7J39q2%P8j49K0J54j17j2J35j39m3J79j03p4
3694h3J86q1j02R8lm2Q5p4m3J15p3m5J34r5p8K14q2j88K28J5k35J84P9k36J14
3719hR7k07Q6J63j81LR7j38Q3J09j75PJ52j64PJ92j48n9J76j33q0K00l2j22R3
$$ plain form
3744 18 -14 -53 56 4 -57 43 -10 -46 81 -9 -78 101 6 -135 97 84 -121 27 54 -107 47 91 -114 -26 76
3769 76 -49 25 81 -98 -14 81 -93 -8 145 -68 -71 98 -66 -74 142 -10 -132 57 28 -67 48 -1 -76 23 -8
3794 -8 -34 66 9 -82 8 -53 -57 130 30 -126 1 -9 -88 76 87 -97 15 16 -123 28 92 -32 37 28 -135 13
3820 13 100 -103 5 135 -69 -18 102 -113 -87 138 7 -38 114 -34 -117 1 -11 13 152 15 -112 -18 -51
3843 -51 -34 126 39 -74 31 -16 -124 41 62 -70 28 31 -71 35 28 -101 -19 32 1 80 2 -163 -42 37 -26 103
3869 103 134 -121 -94 -12 -89 70 219 -19 -99 -12 -86 -23 133 -20 -64 96 -35 -72 65 -32 -80 114 38 -57 88
3894 88 -32 -182 -7 104 42 98 -3 -190 -81 39 27 112 56 -111 -67 -26 -43 112 94 -83 -42 26 -44 28 49
3919 49 -104 -44 75 10 19 -7 -142 -56 84 18 61 57 -142 -132 52 42 76 139 -103 -178 55 36 8 105 -5 -129
$$ packed form
3744A8l2l9J09n2o1J00n3l6J27r0o9J79r5j41K32j3k05J48K7j61J54M4k05Q8J02
3769G6j25P4N6j79Q4R5j74Q5J53k13lJ69j64qK16j52j22J89k9r5J15m9p5R9l1
3794hk6J00n7r1R0o1mJ87j00j56J27j0p9J64J1j84J12Jj39J51O4j24O9rj63J48
3820A3Q7k03J08J30k04N1J20k15K6K25j31m5J52j48q3J18j2K4J39j37j27R4l3
3843e1J7J60q7j13J05m7j08J65K1j32R8Lj02J06pj29Q2N1l1P9p8j65J21P9o3J29
3869A03L1k55K7Q2p7J59J49k38q0Q7p4O3J56j53m4J60j31l7J37r7m8J94p6r5J45
3894H8j20j50J75J11o2N6j01j87J09J20j2Q5n6j67M4M1j7J55j8j77M1O8p0P2K1
3919D9j53O0J19o5Rk6j35Q6J40o6M3mj99J0J84j0L4O3k42p5K33j9k8R7j10j24
$$ plain form
3945 -129 44 50 -52 68 4 -117 43 97 -24 43 -4 -163 26 168 26 -22 -39 -139 -36 134 52 -2 -18 -109
3969 -109 -50 75 55 54 -2 -135 -35 100 41 13 -4 -132 -44 120 18 -27 14 -91 -44 104 17 -32 22 -107 -86
3994 -86 132 60 -51 18 -80 -107 138 100 -103 -19 8 -103 66 132 -68 -19 32 -81 29 142 -6 -53 8 -58 35
4019 35 123 -30 -102 10 -15 24 68 -23 -79 -15 -10 36 77 -18 -54 -36 -55 42 120 -65 -97 8 -34 5 132 -33 -129 50
4047 50 3 -80 92 31 -133 35 50 -66 69 45 -138 -19 96 -14 24 31 -138 -45 115 11 -8 43 -88 -64
4071 -64 78 22 10 56 -60 -62 70 50 9 19 -84 -34 108 35 -34 -2 -56 -29 91 38 -29 5 -66 -70 76 38 -19 1
4099 1 -89 -97 113 51 -66 20 -39 -113 107 91 -131 -8 32 -120 44 152 -78 -70 24 -84 10 176 -31 -137 12
4124 12 -29 2 148 -3 -136 -7 21 -6 91 35 -76 -36 -7 31 98 10 -75 -31 -20 49 131 -37 -104 8 -9 2 140
$$ packed form
3945a29J73Oj02J20o4j21J60N4j21O7m7j59J89J42j42m8j7j00J03J70q2n4j6r1
3969a09N9J25k0jn6j33J00J35n9k8j7j28Q8J64j02m5M1j05M7J48q7m9N4j29K1
3994h6K18p2j11O9r8k7K45l8k03Q4K7j11J69O6k00M9N1j13J10J13j48m7O1o6R3
4019C5Q8j53p2J12k5L9M4r1n6O4NM6M1r5l6J8j9R7P8j85l2J05m2L9J27j65r6J79
4047E0m7q3J72o1j64J68J5j16J35k4j83J19J15j10L8Pj69R3J60j04j9N1j31K4
4071f4J42n6j2M6j16kJ32k0m1J0j03N0J42p3o9L2n4K7J20n3o7L4p1mJ46l8n7K0
4099Ar0qK10o2j17Q6n9p4K20j6k22J23M0j52J64J08k30QR4j08R4J66k07j06J49
4124A2m1L1J46j51j33J29K8k7R7n6j11M0K9L8O7q8q5M4J1O9Q2j68o7J12j7J1J38
$$ plain form
4151 140 14 -145 12 35 -54 106 71 -153 -54 47 -35 80 80 -158 -98 70 -5 32 77 -110 -93 86 12 21 102
4176 102 -77 -108 44 24 19 98 -61 -140 75 74 -10 49 -51 -105 52 69 -14 49 11 -104 -13 74 14 34 -16 -101 -7
4203 -7 74 28 31 -46 -105 50 62 -25 58 10 -125 37 87 -76 42 66 -151 -24 149 -28 -38 71 -109 -87 142
4228 142 3 -98 70 -21 -123 73 59 -86 24 5 -91 20 83 -26 -22 -12 -38 23 37 -25 14 -8 -44 45 9 -41
4254 -41 68 26 -89 35 66 -53 28 46 -91 10 82 -69 -21 81 -51 -16 59 -59 -23 100 -52 -50 65 -24
4278 -24 -25 72 -37 -71 74 -9 -67 64 -8 -84 50 -8 -66 74 15 -107 8 41 -51 42 18 -123 -14 54 -28 0
4304 0 38 -70 -38 35 -2 25 20 -67 -29 12 5 73 13 -116 -10 52 -44 30 71 -112 -39 91 -38 -12 99 -66 -107 89
4332 89 17 -34 83 -47 -121 80 63 -46 20 -17 -105 35 89 -29 17 3 -104 -11 70 13 7 -18 -86 5 67 -12 -1
$$ packed form
4151A40j26j59J57K3q9J60l5k24R9J01q2J15%k38O0J68p5L7M5j87J7J79p4RQ1
4176A02j79l1J52k0nP9j59p9K15jq4N9j00n4J57J7q3O3l8j15R1Q7o0K0n0q5R4
4203gQ1m6Lp7n9J55J2q7Q3m8j35J62N0j63J18K4k17J27J73j77j0J09j80K2K29
4228A42j39j01J68r1j02J96j4j45J10j9r6J11O3j09MJ0k6O1J4o2L9k2l6Q9l6n0
4254d1J09m2j15J24L1j19Q1J8j37J01P2j51M8J02j32L5P5j18L6J23j52KJ15q9
4278b4jR7j09l4J45q3n8J31p2p6J34n8n8J40n9j22J15L3r2R3k4j41J09O8q2K8
4304@L8j08L2P3l7K7nq7L8M1pO8o0j29J06O2r6P4M1j83P3J30j29K6J11j65m1J96
4332H9p2n1J17j30p4K01j7j09O6l7q8J40N4j18M6j4j07R3Q1n7ok5o8R1O2p9J1
$$ plain form
4359 -1 -40 -87 49 75 -45 -16 -1 -88 13 95 -6 -32 -4 -93 -21 136 33 -29 -18 -87 -23 121 27 -40 28 -61 -54 89
4387 89 7 -59 58 -29 -61 96 44 -104 -21 25 -22 102 54 -136 -70 3 -18 75 91 -71 -94 -23 -51 32 100 -14 -62
4414 -62 -20 -39 25 46 -44 -37 29 17 28 -7 -117 -61 52 8 53 73 -117 -125 1 18 40 136 -38 -157 -7 5 3 96
4442 96 12 -103 36 29 -74 25 21 -56 61 91 -32 5 -33 -123 14 159 58 -15 -70 -161 -47 129 80 7 -11 -113
4468 -113 -71 37 29 35 31 -56 -45 38 10 -31 -12 -44 9 109 13 -79 -67 -67 17 142 51 -46 -35 -122 -63 140 97 -23 -12
4497 -12 -81 -123 87 106 -51 -26 18 -54 26 83 -91 -63 57 9 41 91 -65 -103 -14 24 71 135 -33 -147 -66 -13 80
4524 80 119 -17 -103 -43 -38 14 84 7 -55 -21 -24 3 76 -19 -96 -13 7 43 75 -51 -135 -12 46 40 79 -27 -138 -39 29
4553 29 31 113 32 -126 -63 26 15 83 35 -127 -57 89 25 23 39 -93 -59 83 36 -5 40 -51 -96 64 86 22 5 -57
$$ packed form
4359al9m7J36K6j20K9J5q7J01Q2j01k6K8q9P2J57j03o2J1o9O4J44r4o7O8q9PJ43
4387H9q2o6J17q7l2J57n2j48Q3M6m7J24m8j90O6P3k1R3J6j62k3P1k8Q3O8j14m8
4414f2M2j9O4K1r0PO6j2J1l5j10N6J13m4M5K0j90qJ26J7K2R6j74j19J50J2kR3
4442I6q4j15J39pj03R9mp7J17L0j23L7l8r0J37J45j01p3n5r1J14J76m9p3j8j02
4468a13M2J08qOmq7J1Q3k8m1J9l2N3J00r6r2J2%Q4J25r1r7J1q7N9K03m3j20J1
4497a2o9m2K10J9j57K5M4p2Q0N7j74K8J20m8L2N0j56l8Q9L8M7O4j68j14Q1N3R3
4524H0L9j36q6O0NN2P0p7o2L4lK7P3r5p7Q3K0L6L2j26q4J23N8oL9j06j11R9O8
4553B9KQ2q1j58O3Q9j1O8m8j62P0J46o4kJ6j32L4J42m7m1M5r1m5J60K2o4j7o2
$$ plain form
4581 -57 -90 41 82 18 -31 -79 -52 41 57 12 12 -68 -80 31 40 10 30 -47 -106 37 71 -21 6 -47 -101 39 80 -51 -23
4610 -23 17 -46 23 91 -10 -37 -10 -65 -8 110 21 -76 -42 -63 -5 111 34 -51 -19 -43 -24 61 22 -29 3 -35 -36 44 36 -43
4640 -43 -2 -6 -3 60 24 -80 -36 13 3 48 29 -67 -41 -8 -29 52 46 -45 -44 -11 -35 29 57 -57 -35 20 -36 4 23 -73 -40
4671 -40 65 -16 -37 61 -46 -80 44 28 -16 51 -7 -103 -1 44 1 46 7 -70 -3 19 -27 29 27 -30 -1 -9 -35 21 14 -33
4701 -33 -11 23 -16 0 -4 -54 16 40 -28 -10 16 -55 6 47 -32 -14 57 -45 -49 47 -9 -33 32 -44 -57 54 0 -60 7 8 -29
4732 -29 39 5 -50 33 9 -48 1 27 -19 21 4 -62 12 43 -37 -1 33 -37 1 19 -36 15 53 -36 -8 19 -18 13 33 -45
4762 -45 -18 41 -28 -17 43 -13 -15 29 -36 -18 60 1 -32 15 -24 -21 45 -5 -45 31 4 -43 25 -9 -44 25 8 -41 14 10 -65 -8
4794 -8 32 -9 27 15 -70 -9 53 -6 -11 9 -63 -10 47 -6 3 43 -44 -23 46 17 3 35 -41 -41 47 22 12 8 -51 -32 43 -4 -37
$$ packed form
4581e7l3J31M1o4m9m8K7R3J6m5%q0j2J11Rl0K0p7n9J43L4r2K7n3n4J40M1j31K8
4610b3M0o3O9O8j01k7K7n5N7J18q9r7L4k1N8J16p7q5L2k4J9Q5l9n1L2l8jQ0qp9
4640d3M1mLO3l6j04M4M9j0M5j9r6K6L3k1Q1or1JL3k4O4K8j14K2N5n6M0J9r6L3
4671d0J05q1k1R8j07l4J24j6m4O7n8r6J02M5m3M5l9p7O7K2m6N6kn7K9qk6N6pm7
4701c3K2L4l9J6mn0P0K4o8J8K6p1O1M1p9J8P1j02mR6n6k4O5p6j3J11n4o0O7Jl7
4732b9O8l4n5Q3k4n7M9K6m6M0j7o6P4L1q0L6L4p0L8J8n5N1L8q9K8K7l7L1K0p8
4762d5K7N9o9J1O0n6kM4o5J8P8n9l3M7l9LO6n0m0P6k7m7O8l4l5O9j7m9N5mp5N7
4794hM0m1L6j2q5O1O2n9nK0p2N3N7n3RM0q7K1O9k9j4L2p6%Q8k5j0mn9J9P5m7l3
$$ plain form
4827 -37 39 -24 -59 45 29 -15 34 -22 -69 29 44 -32 -9 -25 -52 26 45 -51 -23 -2 -34 1 43 -16 -23 -22 -38 21 65 -4 -26
4858 -26 -38 -51 16 69 -29 -45 -5 -42 14 60 -18 -32 18 -36 -15 91 43 -46 -2 -14 -26 75 15 -61 -15 7 3 58 14 -39
4888 -39 -11 -5 -17 38 19 -57 -24 -9 -6 52 38 -83 -28 19 -4 37 30 -91 -48 43 -10 17 55 -48 -65 21 17 28 56 -61
4918 -61 -91 6 30 38 17 -57 -58 7 18 21 34 -29 -41 21 5 18 55 -25 -85 24 43 4 50 -24 -81 30 68 -4 7 8 -55
4949 -55 19 78 -9 11 -4 -49 -6 54 22 2 -25 -73 -1 67 18 -15 -25 -64 -6 69 5 -5 4 -62 -30 66 34 -11 2 -45 -44
4980 -44 81 33 -57 -19 -34 -30 61 54 -41 -9 -3 -35 38 37 -31 -18 -16 -42 33 52 -32 -23 -15 -31 68 65 -55 -26 18 -11 34 69 -51
5013 -51 -49 7 -33 17 87 -18 -77 -23 -26 15 66 -25 -78 -15 2 -2 34 -12 -31 -16 -12 -15 20 -11 -61 -15 0 9 42 -20 -90 -2 37
5046 37 4 45 13 -81 1 36 -8 20 51 -47 -42 34 -1 -2 36 -38 -45 44 27 -22 1 -32 -11 41 21 -15 0 -36 -22 40 24 24
$$ packed form
4827c7P6o3l5J04j6m4M9n6m7R8J5p6K3j6k7P8J9r6K8K1l2L5M2n9pJj6N9M4o9k2
4858b6j2j3O7N3r8j6M0l7N6M6p8j4N0n4K1J06m8q9M4j2j2J01o0p6M6K2mN5m4n3
4888c9K8Oj2N5j9p6L3J5LN8j4j21N5M7k3M1pj21M3R1n3K7L8j03j7Q6mJ1K8j17
4918f1l0R7K4Qk1p4jO5J1LJ3o3j2O2j6J3L7q0o0J09J9l9M6p4n7J11L8p2J1Jo3
4949e5P4N9q7K0j5m5M3O0l2k0k7m8P2O8m9l3j0l9N8P5o4j0Ro6L2R6l2m5J3m7J
4980d4J25m8r0L8j5MR1pr5L2Ol2P3jo8J3Kk6P5J9q4RQj6R9lj20K9M4k9M5L5j20
5013e1KN6m0N0P0j05n9N4lM1N1r1n3O3J7mL6m6j9J5MlL5l1n0M6J5RL3o2p0Q8L9
5046C7l3M1l2r4Q2L5m4K8L1r8NP6l5jL8p4pQ9j7m9K3l3K1N2k0l6J5l6J4O2j6%
$$ plain form
5078 24 24 -43 -53 32 34 -6 20 -39 -54 30 23 -39 13 8 -41 17 19 -38 -9 3 -54 2 40 -30 -34 -13 -40 15 55 -19 -33 -13 -30
5111 -30 -2 37 -16 -3 20 -26 -5 50 15 -27 9 -22 -29 48 0 -48 -4 6 -6 48 19 -48 -5 23 -16 23 25 -36 -14 1 -30
5142 -30 31 32 -31 -27 6 -18 15 16 -33 -4 24 -29 -5 23 -29 -17 14 -41 -11 34 -42 -47 29 -10 -28 36 -22 -52 32 14 -33 3
5174 3 16 -31 6 19 -16 15 18 -27 -9 15 2 12 2 -27 5 22 -17 -2 9 -27 23 21 -42 8 32 -43 -5 29 -22 -10 26 -38
5206 -38 -26 57 -7 -21 16 -15 -32 26 9 -27 15 -9 -46 -11 3 -8 12 -9 -47 14 19 -28 18 -3 -27 15 9 -35 16 26 -41
5237 -41 -5 26 -20 12 35 -45 -14 39 -16 0 28 -7 -10 29 -15 -7 39 -2 -19 5 18 -7 14 -18 -38 25 8 -3 22 -22 -28 26
5269 26 -8 -25 49 6 -53 22 13 -36 26 13 -58 2 33 -27 -15 15 -48 -5 61 -33 -19 5 -37 -30 35 21 -9 15 -56 -39 30
5300 30 16 -5 18 -17 -22 24 1 -7 27 1 -17 36 2 -21 19 -3 -29 42 53 -24 -11 -23 -44 39 54 -16 -1 -25 -55 4 32
$$ packed form
5078B4%o7j0Q5Km0K6n9j5Q4po2N2nm9N8Kn7K9J2n7N6L8p0mK1k7N5M0p4j4K0j7
5111c0K8L9n3J3K3m6K1N5l5m2L6l1pP7m8m8M4J0j2N4k9o7M3K8l9L9Ko1K2J5l1
5142c0O1Jo3ML3k4L3Jm9K9K8n3K4K8n2J2L1n5L0M5p6nP6l9j8O4n8l0Q4j8m7L6
5174CJ3m7L7J3l5L1Lm5J8K4j3J0j0k9L2J7l9J5J1l6N0ko3N0K4p5L8L4n1J2L6o4
5206c8J2Q3o4j4L7l1j7N8j7l6M2k4l7L5J4j1K0k1l8O1Nm7M6k1k4M2om4N1J0o7
5237d1L6L1m6L2K3q0L1N3n5J6K8l5lL9m4QM6m1j7K4J3k5K1l2k0O3j7j1K5m4oN4
5269B6l4j7P4m3n9P5rm9O2j3p1O0L1o0J2L0o3M3O6r4J4K4m2PO5j4l0K4p1J7O9
5300C0j4k1K3l5nM6k3qL4k6j8N3l4k3M0k2k6P1J1p7J3j2k1Q3J5p0J5k4l0N9K8
$$ plain form
5331 32 0 19 -7 -60 -19 13 -25 13 23 -48 4 43 -43 -27 32 -26 -6 43 -21 -50 16 -13 -22 61 33 -51 -13 -11 -38 26 45
5362 45 -29 -15 -1 -8 5 12 12 33 4 -12 10 -10 -12 32 2 -4 58 9 -75 -4 20 -7 61 39 -86 -3 26 -56 9 73 -17 -41
5394 -41 33 -49 -31 73 -3 -49 33 -15 -55 20 -11 -39 25 26 -35 -5 9 -43 -10 20 11 28 0 -46 -20 3 2 23 -7 -42 -2
5425 -2 17 -23 -1 8 -17 23 6 -37 30 15 -46 19 24 -27 28 17 -54 14 62 -38 -20 48 -60 -21 68 -29 -47 62 -27 -56
5455 -56 45 10 -46 39 -7 -61 32 48 -53 -18 17 -34 -2 27 -25 -10 20 -7 -11 10 8 0 1 6 10 -4 -8 -3 -15 -14 51 3 -45 22
5489 22 10 -52 34 39 -49 23 40 -64 -6 74 -28 -40 55 -19 -18 67 -27 -66 48 33 -38 43 7 -65 24 36 -32 17 36 -43
5519 -43 -32 10 -5 6 17 -40 -25 3 -2 -11 -19 -18 8 -2 -28 2 -9 -22 15 7 -18 35 -4 -52 8 44 -16 33 22 -53 -9 55 -10
5552 -10 18 70 -29 -30 69 -9 -13 83 -27 -55 47 16 -53 37 12 -54 38 46 -39 5 23 -42 1 40 -13 -3 16 -40 -27 25 2
$$ packed form
5331C2l2J9k6n3M1L2l8L8J0p1N2L9q6J6N9n8K0M9o4k9O6k9rQ3k8q4L8Kk7O4J9
5362D5p4J4J4pJ3P%K1k9j6K2k0kM4l0oO2m9q4P1K4k7O8k2j25Q3K9q2O5O4r0k4
5394d1P4q2J8J04p6m6Q2m8m0P5l1k8O4Jo1L0J4n2L3L0rJ7k8m6K6K3jK1l0l5M0
5425bJ9m0K2Rk5M0j7m3O7j5o1O5Nn1N5j1p1O8M8j00J8O8j08L9Q9r7j8J09q9k9
5455e6J01l5n6Q5m6n4R3J6j01L5L5n1L2K9n2J5L0k7mK1kqJNMj4mNj2JO5m8m8O7
5489B2j2o2Q6Nq8P2J7j04N8Q0j02j2R5p4JQ5r4l9J14j5p1Q1l6p2Q9J2o8M9J9p9
5519d3J1M2j5J1J1n7J5K8nrqJK6j0k6L0j1j3L7qk5N3l9m8O0L6o0M9j1p5M4O4o5
5552a0K8N2r9jR9p8mR6j10k8J02l1o9R0k5o6R2Qq5M4J8o5M3L9n3J0J9n6J3N2k3
$$ plain form
5583 2 10 -13 -32 -1 13 -16 -3 -10 -30 9 -6 -20 14 10 -50 0 25 -31 -9 9 -64 2 65 -31 -15 32 -23 -15 73 1 -52 61
5615 61 6 -67 27 31 -32 20 9 -53 20 29 -34 -19 17 -32 -4 38 -15 -24 13 -24 -10 32 2 -9 -7 -28 6 17 -3 -8 -7 -21 7
5648 7 0 -31 -6 3 -38 11 9 -22 11 24 -49 -16 42 -26 -36 20 -30 -21 51 -13 -52 32 5 -40 38 19 -40 26 21 -51 12 44 -31
5681 -31 -14 28 -18 14 38 -11 -15 30 2 -22 6 -3 -8 8 -5 -6 11 2 -6 -3 -17 3 -1 -11 -8 14 -25 -6 14 -25 -5 29 -25 -24 29
5716 29 -27 -18 30 -20 -41 35 -14 -58 34 15 -34 23 10 -43 8 26 -48 -3 40 -30 -17 33 -17 9 30 -30 -24 38 6 -7 24
5747 24 -1 -2 16 19 -9 11 20 -6 -8 -13 -11 7 -11 -10 -7 -14 -13 -3 -26 -13 10 -13 -31 17 5 -8 19 -21 -35 29 -2 -39 -1 4 -29 5
5783 5 7 -41 10 21 -36 -11 24 -19 -2 21 -17 -15 44 -24 -25 27 -6 -16 10 -3 -18 28 3 -32 15 13 -4 9 1 -24 15 17 -7 -5
5817 -5 -3 -15 -1 -3 -20 -9 9 -12 -3 1 -10 -8 -15 -24 2 2 -28 -6 -13 -35 3 3 -29 0 20 -41 -10 25 -15 7 25 -32 -33 19 -2 -32
$$ packed form
5583BQk3j9L1J4k9J3pk0L9j5j4L4mo0N0K5n6K2J8p3O6O3r6J6M7n5QQ8p2n3J13
5615F1n5p3R4Mo3N2j1o2P3Ro3J5L6m9K8M2n3rL7l7J4M2l0j1Kk1L4J1k0nJj4K8
5648Gpl1K5Rm1M9kl1L3J3p3L3N8o8j0N6n0RP2o4l9Q4k7m5P8j9n9O6np2O3L2p5
5681c1J7M2m6L2K4m9mM5k8k4K8rnJ6j3jJ7rqLj4K0mj0LK2l9J9K0l9K0L4n4JN3
5716B9n6RM8n0k1P6m9m4R2j9m9N7j3n3N1J8p4M5M3p0J3N0n0K6K1o0OO2l2j3L1
5747B4k5jJ8Lk8K0Rk6knKJ8j8JLpJJ0k3J3K3k3j8M8j2j3K7m0j4O4l1l7L8Nl3L4
5783EKm8N1J1n7K5L5m3J7K3l8KN9o8jN2l3j0K6j3j5M6k5l5M7kj7J3qk5L9Kk4K
5817eKj2J4kj7J1J8k1RMj1KprK6%l0K2pk2L8%l2K9K0o1L1L5m0K2J8n7jN2k1l0
$$ plain form
5853 -32 20 1 -34 13 -15 -42 15 13 -33 13 14 -14 -15 3 -23 10 39 -25 -18 11 -3 15 19 -5 5 15 -27 -13 -2 -12 10 7 -13
5886 -13 -12 14 -18 -16 8 11 11 -2 -34 -39 9 -7 5 16 -1 -24 -6 -30 -25 25 6 -11 2 -21 -27 19 5 -36 18 17 -30 -6 0 -28 24
5921 24 39 -21 -20 13 -37 -8 30 2 14 13 -37 -30 33 -1 -12 24 -5 -2 2 -11 -11 16 11 6 9 -14 9 11 -27 -16 22 3 -13 -5 -38 -30
5957 -30 25 1 -25 10 -1 -48 -18 11 -21 26 14 -42 -19 15 -12 -4 20 -9 0 13 -30 -27 15 -5 -1 32 -4 -18 7 -15 1 38
5989 38 13 -10 6 -27 -18 40 8 -22 12 -8 -30 7 -1 -12 23 0 -43 -12 20 -2 10 7 -14 3 7 -35 -2 4 -20 9 4 -33 -3
6022 -3 21 -25 8 6 -20 -6 11 -26 -15 27 -23 -24 22 -6 -19 15 -2 -22 31 1 -20 19 4 5 19 -5 -14 17 8 -14 17 14 -4 12
6056 12 -19 -21 20 3 -25 13 19 -29 14 6 -31 14 50 -26 -20 35 -15 -10 26 -11 -13 26 -37 -42 -2 -3 2 17 -9 -30 0 -5 -10 4 -3 -17
6092 -17 -8 -28 -23 5 -20 -26 9 -5 -17 26 -14 -29 22 21 -11 9 2 -27 3 18 -8 22 23 -34 -19 20 1 11 19 -10 -7 14 -5 -2 18
$$ packed form
5853c2N2j9l5M7k8k7N7km6M6Jk8jJ8k6L3K9o4PK9j4J8Mk4J0J0m2J4J1j0K2lk0
5886a3JK6l2KK4L%j3l2nM8j6J2J1j7k3J8k4NN0j9j7J3k3oM6j4m1N4jm7K4Ok8N2
5921B4J5o0JL3n0K9L8k8J2jn0PO3l4j1L6k9LMj3%K7nnLk3K3Kl8J1L8j9j6Ql3Q
5957c0N5k4k6L5j1m7L0K9l2M7j2n6K3L4k7QK4k9RJ3m3LM2k0ML3l6j4K5k2J6L7
5989C8k5k3J6l3RN8l2l0L4k0k2L7qj1L5k3m3L1L2k2J2lk1J7Mm2L3Ok4K9nl7L0
6022cK4m6L3kk6J4J7l7J1M2n0jM6k8j3L4j7k0N3l0k1L9j5JJ4k4rL1rk2L1lj8J6
6056A2l1kM1j7k8L8Om8M3ql7M5L6p6ON5n0NL6l7kL9o3nM0jNJ5k6k1L0nnJ4pj4
6092a7Rk0NK8k5oL5j4j2M3m0j5N1jl2K0pk9L0J5k6L0Jn7J5L9j9J0Qk9LK1j9LK0
$$ plain form
6127 18 -13 4 12 -9 -3 18 -27 -30 8 10 3 28 -21 -38 15 6 -6 7 -22 -36 9 7 3 12 0 -21 -17 10 5 6 -11 -43 -20 3 -1 -3 -8 -35
6165 -35 4 8 -20 13 20 -28 5 39 2 24 11 -50 -22 41 9 -13 11 -32 -27 38 4 -21 16 -14 -36 11 14 -6 0 -16 -42 -2 26
6198 26 5 -15 -39 -25 20 10 -10 11 -21 -15 10 8 -13 13 -17 -55 -4 29 -10 4 -9 -49 -4 31 -12 -13 -2 -32 -8 13 -4 -5
6230 -5 19 -41 -9 31 4 3 -10 -26 -7 36 13 -9 2 -15 -7 41 9 -7 4 -28 -22 21 26 -7 -6 -15 -33 26 24 -17 -24 -27 -24 -1 2 4 -6
6267 -6 -25 -21 -8 7 -11 14 -16 -28 10 27 -22 -4 -10 -40 19 16 -22 0 16 -22 -10 31 -6 -11 7 -22 -14 32 15 -27 3 -6 -13 29
6301 29 20 -25 -2 9 -5 1 7 9 -6 -16 -9 11 11 2 -8 -9 -10 15 -2 -30 7 -7 -25 4 5 -20 -11 8 -34 -1 17 -13 -14 -3 -32 -12
6337 -12 19 -15 -9 17 -20 -27 8 -6 -10 19 -10 -16 17 3 -8 20 6 -15 19 2 -10 24 8 -9 -11 -4 -1 14 19 -18 -10 9 20 0 6
6372 6 -8 -2 -4 6 1 4 -14 -10 -12 -14 8 0 -32 -14 2 -10 10 15 -27 -16 16 -19 -10 12 -21 -41 3 -6 -14 24 -10 -52 3 15 0 14 3
$$ packed form
6127A8l1J7Qk1OK1m5lL8KpK5m9j7N3rj2J3k9j4M5kmRj2k1MK7nJj7l2K3K3mknk7
6165c5L9Mk8L3Pm8L3L4l7K2j3o1K8O3l2k2K4m3NO5l4k5L7l0k2M7Lk0Oj6k6M0K8
6198B6k1k0k4J4M5j0k0K1l2OK5kk1K6l0l8N1L3l9J4j3m0M5L5m3jJ1l0K4K1j7j
6230eK4o0L2M0k7jj3j6J9M3k3k2J1j7QM8l2j6J1l2OM3Nl3Jrj8N9km1plLK3LKj0
6267fj9MJ3J5j8K5l0j2L8J7m9J8ol0N9ll8K2J6l8J2M1l7nJ8k9QM6j7m2L0rpM2
6301B9rm5K3J1j4OOKj5j0PK0%rj0jjK5j7k8L7j4j8K9Jk5RJ9m2L3J8l0jJ1k9K0
6337a2L1l4OK6l7pL5j4mK9k9oL3j4j1K8j4k1L4j7j2L4j6j7kPLJ5Nl7QJ9J1k0O
6372Fj4OkJ0nLj8MkkK2ql2J8J6j2K0Nm2J1L2l5RK2l3k0M4rqL8l4m2N5J2j5J4j1
$$ plain form
6409 3 -36 -17 16 5 5 21 -20 -17 14 9 22 1 -10 -32 0 18 19 -12 -17 -7 20 10 24 -2 -23 -25 6 -3 19 24 -36 -29 10 6 9 16 -37
6446 -37 -37 14 11 -6 14 -10 -38 -13 9 -2 1 -12 -45 -22 23 10 -1 -22 -41 -3 33 8 0 -10 -30 -17 34 28 22 -1 -31 -20 28
6479 28 34 21 10 -42 -21 36 36 8 8 -18 -26 17 30 12 3 -22 -12 17 24 2 -3 -46 -32 24 35 -4 12 -22 -25 17 21 -1 -5 -14 -36 -12
6515 -12 38 4 -11 -23 -43 -20 34 5 -24 -17 -22 12 24 7 -26 -8 -24 -8 35 24 3 -9 -31 2 38 42 -3 -26 -12 -3 44 25
6547 25 -12 0 -2 -12 22 37 -1 -2 0 -13 10 36 -8 -21 -14 -7 13 16 -12 -33 -7 -9 -8 17 -2 -14 -11 -28 -4 34 -3 -26 -24 -9 -8 16
6583 16 -1 -27 -16 -24 -11 5 13 -13 -7 -12 -8 13 11 -20 -18 0 -9 18 18 -17 -5 20 -4 13 23 -2 9 10 -5 3 26 -1 1 15 -11 -1
6619 -1 32 -16 -21 32 -11 -16 16 2 -9 0 -6 -13 4 9 -17 -4 -1 -13 -3 -5 -10 -1 11 -9 2 0 -3 19 3 -41 -9 4 -11 2 3 -19 -5
6656 -5 5 -13 7 14 -12 -5 6 -17 13 28 -18 -18 20 19 1 13 -28 -24 20 10 -1 21 -13 -26 9 3 -5 16 -17 -42 -4 19 -7 1 -12
$$ packed form
6409Cl9J9L3j1%J6m1LL1nJ3k1j1k2L2J8Jl1nJ0K7j0J4k6k1kL1rK2No0PL9mLPn3
6446c7%N1lj7K0k4k8K5K2j1Lj3l3K3M5j3j1k1j9L8L6k5qj0k0J3N1ook3l0J1M8
6479B8Oj3j1n2K1N7%k8%k6qM3J3j8rk5J0K9Pk2nm3J4N6J1l9J6l4lM2Mk2mrk2K4
6515a2N0l4j5j2k0K3N4k9k9PnL4J2j7l3J8j6J6M3j1k1j2k2L3L6Mm5k3J4RM7j9
6547B5l7J2kj0L4J5l8jKj3K3K6m4j3PPK0Lk8k1K6kJK5j9j2Lj7K4L8l7k3KJ5JK4
6583A6j7k6J1qJ3J6Qk6OnMK1kl1KJ8rK7%l5J2K5k4J7J0k5J1Jj5QK3k7KJ4k6J0
6619aL3m8nN3m3nL2j4j1RopJ7Nk6J3Lj2J0knRJ2k0J1klK2j6m4L2J3j5J3Jk2J4
6656eJ0j8K0Pk6PJ1k3L0J5m6%L8jj8J2m1MM4j0j1K2l4j3L5oqK1l3k5L8K3k6Qj3
$$ plain form
6691 -12 -41 -8 14 -4 -4 -9 -31 -23 7 10 -2 -22 -31 -22 5 14 14 -12 -39 -9 13 0 -1 -2 -42 -13 19 10 14 7 -35 -29 12 23 19 5 -31 -33
6729 -33 29 29 -1 -8 -26 -28 14 39 7 7 -14 -41 6 48 34 16 -21 -39 10 32 12 0 -7 -32 0 25 5 7 -13 -44 -10 34 12
6762 12 -5 -22 -31 -11 25 14 -3 -17 -51 -9 20 -1 4 -1 -38 -32 22 15 1 3 -28 -17 24 29 -4 10 -10 -24 24 18 -22 1 -6 -30 13
6797 13 33 9 -7 -25 -11 15 39 22 -7 -9 -17 14 33 22 5 -20 -31 -1 19 2 10 -14 -34 0 24 -3 -7 -9 -43 9 33 -3 -20
6830 -20 -10 -33 -19 23 2 0 -10 -14 -32 26 15 1 -4 -14 -22 23 34 -9 7 -2 -11 12 24 0 7 -8 -22 26 24 8 -7 -8 -17 20 33
6865 33 1 -15 -9 -10 4 27 6 -12 -11 -24 -15 13 8 -5 -11 -37 -2 26 -10 -11 -8 -27 -22 23 -15 -13 5 -22 -28 5 -1 -26 -13 -12 -29 7 18
6902 18 -21 -18 9 -7 9 18 -2 -8 14 -5 -13 23 8 -14 -10 -7 10 17 -1 -5 -3 -7 4 7 -5 6 14 -15 -9 11 5 -1 -1 -21 -8 27 -4 -13 13
6941 13 -11 -6 11 7 -9 -3 -6 -28 16 0 -13 6 -18 -28 -2 1 -15 -10 -1 -27 -14 2 -9 4 5 -14 -14 7 4 4 20 -16 -8 10 0 -7 2
$$ packed form
6691a2k9L3K2j8%nk2QL0Lj2k0rRK7R%k6k7L0K2j3jjm0K9L2rMpm2OM1J1mj4l6k
6729c3O2%l0pj8kM2K5l2%k1k7M7M2j4j8l7j8M9K2k0j2pk5L2K5k0Kk0l1L4M4k2
6762A2j7j7rK0L6j1j7j4l4M2K9k1Nnl7ON4pj4Kl1J1M1Nl3J4k0j4M8om0K3pk4M3
6797A3K0k4j6j8J4K6K4j7k9kqL1J9j1j7k5j1L0K0j7Qk4k0L4K4k7mkl4N2K4l6j7
6830b0J0k3J4M2k1kj0mj8N8j1j4nj0qM5J1m3J6rrK3J2k4Pj5j4M8kj6j5jrL7J3
6865C3l2j6OjJ4K3k1j8Jj3RK8nj3ok6L5K8l6jLj9NM5l8KJ8k7oL3ok5J3Jj7L6J1
6902A8l9LK7j6J6Rk0oK2j9qL6j5k2MLJ7Pj8mKmJ1Lj2J1Qk9OK0oo%k0J3L5l1rK6
6941A3k4NJ7mj6Olk2M4j6j3J9k4j0K6Lj6NRk6J3J6j1J3Jj9%K1l%J6l6QJ8j0pR
$$ plain form
6978 2 -1 7 7 4 8 9 0 -12 -4 0 12 15 -19 -14 -11 -1 -3 -7 -21 -30 -7 -17 -9 12 -4 -24 -4 6 -9 11 6 -49 -24 8 -11 1 -9 -20 -25 8
7018 8 -13 -10 -2 -24 -32 -8 17 21 -6 -21 -25 4 9 31 14 -19 -20 -1 6 2 27 -1 -7 -7 2 10 23 -10 -18 5 21 19 11 -1 -35 14 20 13 2 -19
7058 -19 -34 -13 1 11 10 1 -35 -14 27 2 -4 -7 -33 -22 4 -10 -14 -8 -28 -28 24 9 -2 -1 -24 -29 2 21 7 -19 -27 -30 15 26 -2 -14
7094 -14 -29 -17 -2 15 15 -9 -15 -20 -1 21 9 8 -30 -19 26 20 3 2 -17 -20 15 22 -6 -2 1 -34 14 21 7 -10 -6 -20 -12 26 19 -24 -14
7131 -14 -15 -23 4 6 -17 -28 -10 -30 4 19 -9 -25 -21 -24 9 14 -15 -16 -11 1 -5 11 -10 -10 -2 -6 9 11 4 0 -16 -11 9 13 2 -17 5 -9 5
7170 5 13 8 -2 2 -7 22 6 -10 -8 -2 -1 -3 21 2 -26 -11 -2 -16 8 5 -23 -13 11 -13 -2 9 -18 -18 -13 -5 -16 10 -10 -22 8 5 -6 10
7208 10 -5 -6 -10 3 -13 -2 1 8 -6 0 -1 -2 -2 -8 -3 -15 2 14 3 -8 13 -13 -12 9 8 6 7 4 -12 4 16 -3 -2 11 -9 -6 6 0 -8 12
7248 12 -5 -10 -6 -1 5 5 -17 -18 9 4 -8 -12 -22 -8 8 6 -6 2 -4 -14 6 15 4 -4 -9 -26 -3 8 3 -2 -17 1 16 15 1 18 0 -9 20
$$ packed form
6978BlQ%lMJrj2QMJ2Ll4NLJ0kmj4rK3j0QK1j6k0K0J0j5K0nn5K5L2j9J2j0j1nL3
7018Hk1LQk2qK4K5Mk7j5mK9NK2j7l3jJ9PmK5k8o%RQJ3l3qK3J6kqj2l4M9Opj1k1
7058a9j5K1J4J0jrl6K1M1k5olk6J1K6j4mOk0%N2j5j1Jk3nL1J9j4k6qlM5J1k8j2
7094a4j5J2J5J7%k4onJ9K2j2jl8J1M5oj7jj9lL5Pk8MLl5M8Pj4j7Mj4QL8pm3J0
7131a4jqK7Kk3j1J8k0L4J5k8j6MlL3Nk9jNJ2oJ6k1%QmJ5Kpmj6NK0Mj1j9K2j4J4
7170EQnj0MrK9j6j6KOJkK4j9k8J5Rj4K4lk8J0K4k4J1J1k7%NQj1K6k0j2L0lj1J6
7208A0j5jmJ3j6J1LPj4Ojj%oNj2J7J2j1j1K1k6JK1jkJlj6J6J2j9JJ3k0LJ2oqK0
7248A2j7nMNO%k2jK7nj2mj0J4J6kj2Qoj0K0Rj1qnj7K3J1nnj5J8J5jj4J7j8rK9
$$ plain form
7287 20 9 12 17 11 -12 12 23 1 1 10 -20 10 31 -10 -2 9 -10 -2 18 6 -11 5 -12 -26 14 11 -14 -18 -5 -20 7 -11 -36 -18 -17
7322 -17 -24 -5 2 -11 -6 -9 -7 3 4 -3 -3 -5 -5 15 13 -20 -14 17 -2 -5 4 -4 -1 5 -6 4 22 5 -4 -11 -6 9 20 -2 -8 7 -15 -3 18 -4 -3
7363 -3 12 8 -9 13 4 -16 6 7 -16 4 8 -25 -4 6 -5 -15 -5 -17 -12 9 -19 0 0 -7 -9 -8 -11 0 5 -16 5 0 -11 -22 4 -14 -1
7400 -1 15 -15 -3 -4 -10 5 16 -4 -1 19 8 -3 22 3 8 13 2 -2 3 0 -19 -4 9 8 15 -3 -13 12 11 2 -1 -4 -8 -5 6 -8 16 9 -26
7439 -26 -13 -5 -9 9 -7 -20 -6 8 -8 -3 -4 -7 -13 0 0 -10 3 -16 -14 8 -3 1 2 -2 -19 12 15 4 -5 -2 -11 19 9 0 12 0 -13 5
7477 5 18 8 0 -9 -10 2 16 5 1 -18 -10 -1 1 -9 -1 -16 -3 -3 10 2 2 -20 -13 -1 3 -10 -10 -6 -29 -4 10 -10 -7 -3 -18 -15 18 2 -6 -7 -13
7518 -13 -7 11 0 -8 -11 -13 -3 13 15 -8 -3 5 2 9 4 -3 -2 -2 -8 20 20 4 5 1 -1 21 22 -3 -1 8 2 9 12 -1 -7 9 -16 6 6 -1 -18 -12 -12 4 17
7563 17 -15 -22 -19 -3 -11 10 -4 -12 -1 -15 -16 3 -2 -12 -11 -6 -5 -6 -1 -8 0 5 2 9 1 1 -5 14 10 13 -3 -8 9 -4 3 5 6 -8 5 2 -14 13 7 -1
$$ packed form
7287B0j1LNok3K4J1k2%Rl0L0K1m1QJ1j9QK0j2j7J6j7j4M0lk5mJ3j5K7j8k5J8J
7322a7pJ9Pj3NlKJ0Jp%k%K0kl3OL1j9lRqLOj1J0J8j7rpNJ5J1k2oJ5k2J2K1k2J
7363cJ5mj7K2rk0K2Jk3K0Ml3K1J0j1j0J0j2NK1k8J9%pkJlJ1Nk1K1nj1j1K6j8J3
7400aJ6l0J2joJ5J1k0LK0j1j1K5j9NNj1mNlj9J5J3jPj8j0K5jrllmLJ1j4K4pl5
7439b6J3QmJ8j6j3J4J4j6NjloJ3%j0J3j9KK2j1MJmj7L1Lj1rLrL0j0rJ2j2j3J8
7477EJ3j0qrjJ2J4j1mj9QRKj0Qj5J3%J3q%k2PJ2Mj3%Mk3K5J4k0LMj5LL3j6qjo
7518a3OJ8j1qlkJ0J6Kk3NQlPnpJ%oK8%j6JmkK2Jk5KRoPLj3oJ6k5K2%pj7O%J6J3
7563A7l2pLJ6qK1j4qJ1j4jJ9nj0JNJjNpQNlPq%oJ9mLj6nJ7j3PKJj4J3lj6K7oq
$$ plain form
7607 -1 3 3 -3 2 5 -10 -1 25 -14 -10 9 -6 -20 8 -11 -3 -8 -15 -14 4 -6 0 -2 -11 -19 -4 -6 -15 -6 -1 -10 -10 5 -2 0 -5 -3 4 -6 -1 2 -1 7 9 2 -5 1 13
7655 13 -1 0 5 4 6 9 -5 15 1 4 7 4 -2 -2 14 -6 3 19 -1 -7 -5 1 -5 6 -9 -9 3 12 -7 -8 7 -18 -4 -3 -14 -8 -4 -17 -18 -2 -8 -11
7697 -11 -11 -17 -10 -4 -7 1 6 -6 14 4 -8 3 4 14 2 -6 11 14 16 -2 -7 -2 -6 9 6 0 -4 13 -1 -10 14 10 -4 11 7 -2 13 2 -4 4 4 -12
7739 -12 2 -2 -13 5 18 -14 -2 3 -13 -17 -3 0 -17 11 -14 -24 -5 -12 -6 -10 -8 -1 -10 -9 -13 -12 7 5 -7 10 -2 3 -8 6 7 -1 -6 -5 -2 2 17
7780 17 -6 1 4 14 -16 16 7 -10 9 19 -7 13 2 -7 -10 -5 -4 -9 7 -12 -15 2 -9 -10 4 -8 -4 -2 -7 -16 10 -8 -19 -2 -2 -9 -6 -7 -24
7819 -24 -13 -16 0 0 -16 -7 -5 3 -3 -10 2 -14 8 13 -6 16 5 -12 -7 15 5 10 14 -13 12 28 8 2 22 -6 0 14 -2 -6 2 -12 1 6
7857 6 -2 -7 13 -14 -16 14 4 -11 1 -5 -15 2 -3 -8 -4 -6 -15 -1 -2 -2 -19 -5 -19 1 13 -14 -15 -6 -12 0 7 -10 -12 -2 -14 -3 2 -8 1 -4
7897 -4 -5 -2 18 6 -9 14 1 1 29 0 0 8 17 -9 13 3 -3 9 0 -9 14 -3 -8 3 5 -8 11 -1 -22 5 8 7 0 -4 -15 -6 -13 -8 -2 -2 -4
$$ packed form
7607aM%oNLj5RK6l9MJ9j5j4K8j9QnpJJ8j0OkrqJ5krRNr%J5pKnKPj0NLlQKppOJ2
7655A3j4JNjKLj4K0j4LLlo%J6k0RJ6k0oKOoJ1j5%J2Rj9jJ5k5J4Jj1OMj3jJ6ol
7697a1%oPOlQNj2K0j0j2J1JJ0j2qJ7LKj8nNmJ5lomJ7j4rK4mj4J5mrJ5j1oQ%j6
7739a2J4mj1J8J3l2J2Nj6mJ4Lj7K8k5j0J9pOmKPrJmJJ9kj2J7j2Nj1J4JqnJLMJ5
7780A7k3PLJ0l0L2rj7J9J0k6K0j1rlNJnJ6j9lJ7j1jJ4j2MKnrK6j8j1J7%pLjj7
7819b4J1lJ6%j6RKQopJ2j6K2Nj9K2j1j7NK2j0NMk7K5J6k0oK0k8OJ4j6mQj4J3N
7857FqnK0k7kL0j0j5J2oj0J7nnMkrJ4j%j7J4j4K0J2k7jRoJ2Pj7kJ0j2J1Nj0Rn
7897djLK0j2j5K3j3%K8k9%QRk6K2j0oJ2rrK3j7nJ1Kj3J9j2k1K7Ljpmj1RpNO%k
$$ plain form
7938 -4 -1 -3 -8 -7 14 -24 -14 7 -2 10 -4 -17 -3 8 1 -3 10 -13 -12 7 -5 2 11 8 -8 16 -1 3 8 5 1 17 12 -3 25 16 6 11 4 -4 12
7979 12 7 -2 4 14 6 2 7 -3 6 10 -6 -12 2 -12 -18 -5 -4 -21 -10 -14 -22 2 -10 -17 -2 -4 -3 9 -12 -7 -5 -10 -5 -1 -2 -13 -5 3 -11 4 -9 -13 -5
8022 -5 -4 2 6 8 9 -11 5 2 12 19 1 2 15 5 0 10 10 -8 11 1 0 16 18 3 -4 10 1 8 -5 -3 3 1 2 -19 -13 -11 2 -9 -14 -15 -9 -22 -13
8065 -13 5 0 -7 -18 -20 -1 7 -7 -8 -5 -2 0 0 2 1 5 -4 -7 10 5 -1 4 3 -3 10 2 6 7 0 3 9 1 0 5 -4 3 0 -3 4 8 7 -1 24 8 -8 17 3 3 10
8114 10 -2 -10 -5 -10 -20 1 -7 -7 -14 -1 -13 -10 0 -21 -16 -5 -6 -11 -3 -12 8 2 1 6 0 1 2 6 -5 6 12 1 -1 5 7 11 22 -3 -1 -4 4 0 -10 0
8158 0 2 6 -1 -8 9 5 11 14 2 14 15 10 -2 -1 -1 -2 1 1 -15 15 -5 -4 -6 -7 -2 -5 -11 -20 -10 -4 3 -18 -6
$$ packed form
7938dLknJK1l8J0K1rJ2j4j3J4J1pmJ3k3JJ9j2PRlj6K4j7MNlmJ6nj5K8rj0NpqJ6
7979A2nrOJ0qmNj0RMj6oJ4j4oJ3Jj7J1mqK4j2pJ5kJJ2k1NKnNMjj1QQj4J5j3mQ
8022eJOMKJk0J6lJ0Pj8JJ3j0nJ0%j8J9j0jJ6Kj5pJ4rPj3KOkJk1OKJ3j1njOj3R
8065a3J8npj1kJ9Qj4jLLK%KjMrlJ7noNjoJ3qMJpLOqjNrPllPMjqK5j6j6K5j4%P
8114A0j2qNnj0K1q%pJ3j2LJ0k1NJ1jnQrK0ojNoJJMj1J1Oj1kOKMJ1k5KlQmj0J0
8158@KMppJ7mOLj2J2Jnj2J%jL%j6L0k0JkjNlorJ0OPk1J2
8191f
$$ Imaginary data points
##PAGE= N=2
##DATA TABLE= (X++(I..I)), XYDATA
$$ plain form
0 0 0 0 0 0 0 0 0 0 0 0 0 8 -8 8 -8 8 -14 16 -16 20 -24 25 -32 38 -41 48 -56 64 -72 81 -89 103 -113 129
34 129 -143 159 -177 198 -218 241 -269 296 -329 362 -402 447 -497 552 -617 691 -779 885 -1012
53 -1012 1172 -1380 1661 -2060 2683 -3788 6331 -23315 11247 40944 -33276 11254 32204 -37304
67 -37304 -22533 35828 -4887 -11200 22020 -6820 -20685 14188 2835 -7006 9024 -5444 -10472
80 -10472 15512 3540 -11129 4250 -1783 -12473 9602 15073 -4146 -9486 -2338 -55 -2519
93 -2519 3605 15910 -2259 -22307 5301 14130 -15707 3857 22313 -21308 -14908 29410 -2931
106 -2931 -21548 18647 378 -23283 18906 14800 -19746 3136 3067 -19340 13342 18469 -15144
119 -15144 2982 4903 -26914 7129 29251 -15921 -6500 20234 -20517 -16192 30317 1815 -20665
$$ packed form
0@%%%%%%%%%%%Qj6J6j6J6k2L0l2L6m4M9n7P0p9Q9j04J20j36J53j70J92k16K42
34A29k72L02l36L75m16M59n10N65o25O91p64Q49r44J049j169J308j470J664j897
53a012K184k552L041l721M743o471J0119k9646L4562K9697p4220M4530K0950o9508
67c7304J4771N8361m0715o313L3220k8840j3865L4873j1353r841J6030j4468n028
80a0472K5984j1972j4669J5379o033j0690K2075N471j9219n340P148K283k464
93b519O124J2305j8169k0048K7608Q829k9837J9564J8456m3621O400M4318l2341
106b931j8617M0195j8269k3661M2189m106l4546K2882o9k2407L2682N127l3613
119a5144J8126J921l1817L4043K2122m5172R421K6734m0751M325M6509k8502k2480
$$ plain form
132 -20665 14613 4087 -20804 7925 14174 -11440 -3938 7616 -1402 -1377 2145 -671 -2584 -3666
146 -3666 3717 7962 -4152 -4637 3450 -4785 -1805 10407 -1068 -5461 3949 -5856 -3045 13177
160 13177 -3438 -9384 11175 -3811 -12490 17646 4219 -21809 9195 11958 -19251 5703 19348
173 19348 -18599 -8440 18475 -7163 -7983 17109 -3428 -14494 8428 2631 -6235 7650 487
186 487 -8267 4299 823 -4776 6490 662 -7567 4655 2842 -6528 2897 3656 -5544 467 4251
201 4251 -1515 -1221 -986 -504 2946 -868 -645 3791 -4963 -4650 8893 889 -7130 5903 621 -10316
217 -10316 5636 7551 -7283 1183 3986 -8776 1292 8493 -4910 -525 4511 -7956 -74
230 -74 9648 -5731 -3304 8603 -5939 -5924 11330 -813 -9358 6908 1927 -8615 5605 5827
$$ packed form
132b0665L5278j0526k4891K8729O249k5614P502J1554r018K5L522k816j913j082
146c666P383M245j2114m85Q087q235K980J2212j1475m393R410r805K811J6222
160A3177j6615n946K0559j4986q679L0136j3427k6028L1004K763l1209K4954J3645
173A9348l7947J0159K6915k5638q20K5092k0537j1066K2922n797q866J3885p163
186D87q754J2566l476n599J1266n828q229J2222j813r370R425P59r200O011L784
201D251n766K94K35M82L450l814K23M436q754L13J3543q004q019J3033n282j0937
217a0316J5952J915j4834Q466K803j2762J0068P201j3403M385N036j2467P882
230g4R722j5379K427J1907j4542J5J7254j2143q545J6266m981j0542J4220K22
$$ plain form
244 5827 -8224 -1189 5048 -2411 140 3679 -2611 -2800 946 1055 1903 129 -2214 -65 -745 -626
260 -626 3923 884 -3845 -228 -54 -817 4329 1102 -4673 135 200 -2244 5239 2802 -6638 -52
276 -52 2823 -4759 2860 7386 -5877 -4524 4893 -2300 -1654 7590 -1290 -7013 2742 1503 -2556 3989
292 3989 1217 -5088 535 1779 -1620 2640 1416 -4214 -153 2117 -1211 1696 1872 -3871 -1519
307 -1519 2934 407 -106 942 -1835 -1882 1215 1816 923 -717 -1765 -573 -109 916 3042 -184 -3831
324 -3831 -476 1148 -171 2746 1499 -4160 -1605 2006 -392 1507 2833 -3074 -2898 1799 -67
339 -67 569 3584 -1857 -4241 1508 1311 -525 2825 -30 -4477 174 2522 -547 1154 1341 -3152
355 -3152 -1718 2060 904 604 848 -2053 -2072 1167 1692 789 -33 -1649 -1412 689 1445 948 -186 -1493
$$ packed form
244E827j4051P035O237p459K551L539o290j89L746J09Q48j774k343K149o80J19
260f26M549l039m729L617J74p63N146l227n775M808O5k444P483k437r440O586
276e2K875p582P619M526j3263J353R417p193O46R244q880n723R755j239m059O545
292C989k772o305N623J244l399M260j224n630M061K270l328K907J76n743K352
307a519M453k527n13J048k777m7L097O01q93j640j048J192M64J025K126l226l647
324c831L355J624j319K917j247n659K555L611k398J899J326n907J76M697j866
339f7O36L015n441k384N749j97j836L350k855m447M651K348l069J701J87m493
355c152J434L778j156l00K44k901j9L239N25r03q22j616K37K101P56m97j134j307
$$ plain form
373 -1493 -1110 242 1236 1565 -124 -2082 -1118 445 1174 1988 99 -2868 -1331 1165 905 1526 961
390 961 -2611 -2196 1166 1105 1085 1594 -1803 -3207 561 1909 1041 1266 -1151 -3326 -89 2396 1047
407 1047 542 -456 -2589 -1000 1987 1609 389 -466 -1995 -1466 1335 2306 703 -1168 -1880 -895 994
424 994 2017 1032 -1312 -2028 -354 925 1285 1271 -680 -2379 -722 1278 1314 1138 -399 -2613 -1150
441 -1150 1736 1620 603 -467 -2192 -1297 1562 1766 468 -404 -1793 -1509 1052 1906 865 -351 -1945
458 -1945 -1663 1058 2038 812 -426 -1796 -1543 1048 1902 515 -318 -1251 -1532 525 1809 742 -282
475 -282 -1165 -1499 366 1826 874 -428 -1343 -1286 690 1678 444 -409 -960 -1224 523 1587 269 -339
493 -339 -618 -1382 185 1914 417 -729 -590 -1182 93 2080 457 -1267 -446 -556 -194 1656 681
$$ packed form
373a493L83J352R94L29j689j958R64J563P29Q14j889k967J537K496k60O21n65
390I61l572M15L362o1k0N09l397j404L768J348q68K25k417k175L237K485j349
407A047n05r98k133J589K987l78j220q55j529N29K801R71j603j871p12R85J889
424I94J023r85k344p16J674J279L60j4j951j699J657K000L6j76j537k214J463
441a150K886j16j017j070j725Q95K859K04j298q72j389K84K561Q54j041j216j594
458a945K82K721R80j226j238j370K53K591Q54j387q33r33k81K057J284j067j024
475b82q83l34J865J460r52j302r15N7J976R88j234q53n51k64J747J064j318o08
493c39k79p64J567J729j497j146J39n92J275J987j623j724Q21j10L62J850r75
$$ plain form
510 681 -1263 -493 -168 -382 1200 1082 -978 -975 -225 104 1203 770 -992 -881 -191 204 1284 525 -1217
529 -1217 -429 139 -420 950 1056 -1166 -664 495 -462 517 1264 -1112 -1041 954 127 53 824 -1220 -1162
548 -1162 1418 537 -421 790 -851 -1725 1147 1154 -471 673 -214 -2087 282 1656 -26 37 -136 -1364
566 -1364 243 1279 -241 -269 -203 -882 752 1311 -677 -519 -137 -1212 587 2216 -19 -1046 -648
583 -648 -1376 276 2312 590 -721 -717 -1513 150 1897 -71 -326 663 -1459 -709 2213 -212 -1658
600 -1658 1078 -102 -1067 2287 746 -2921 -557 868 -128 2016 1317 -2504 -1475 152 -279 2091
616 2091 2075 -1831 -1337 17 -1351 1160 2911 -1266 -1841 972 -375 -366 1748 -586 -1910 838 1109
633 1109 219 371 -1233 -1556 363 735 1520 1748 -1874 -2796 287 440 923 2875 -424 -3320 -353
$$ packed form
510F81j944P70L25k14J582j18k060LP50L29J099m33j762J11O90L95J080p59j742
529a217P88N68n59J370J06k222N02J159r57R79P47k376P1J995q27p4P71k044N8
548a162K580q81r58J211j641q74K872Pj625J144q87j873K369J374j682O3j73j228
566a364J607J036j520k8O6o79J634N59j988J58L82j075J799J629k235j027L98
583f48p28J652K036j722j311Mp96J663J747j968k55R89k122P50K922k425j446
600a658K736j180r65L354j541l667K364J425r96K144o99l821J029J627m31K370
616B091j6l906M94J354j368K511J751m177n75K813j347RK114k334j324K748K71
633A109q90J52j604l23J919L72P85K28l622r22L083J53M83J952l299k896K967
$$ plain form
650 -353 637 -62 1839 661 -1757 -154 91 -577 1426 45 -2009 1146 1251 -1309 1206 470 -3818
667 -3818 93 3734 -435 -343 1473 -2962 -2458 2930 1534 -399 1164 -1264 -2626 682 1198 610
683 610 1196 -1214 -1707 1197 187 -717 1370 -516 -1827 1784 1279 -1653 -8 56 -1493 919 1847
700 1847 -48 -250 -1346 -1711 1371 1406 -209 1253 -775 -3266 1176 2289 -1604 617 1829 -2663
716 -2663 -953 2570 -682 -1016 1551 -727 -907 1587 -128 -821 346 -1153 237 2394 -959 -1258
732 -1258 1481 -1451 -1510 3192 541 -2464 1303 283 -2658 1350 2180 -1513 -308 609 -1150 396
748 396 939 -776 323 92 -1182 1163 699 -1868 738 1165 -2049 402 2108 -1561 -754 1447 -999
765 -999 -363 1617 -679 -633 758 -935 242 1390 -1563 -130 2046 -1844 -1012 2899 -1012 -2078
$$ packed form
650c53R90o99J901j178k418J603K45o68K003j381k054L155J05k560K515p36m288
667c818L911L641m169R2J816m435N04N388j396j933J563k428j362L308N16n88
683F10N86k410m93K904j010r04K087j886j311L611n05k932J645O4j549K412R28
700A847j895k02j096l65L082L5j615J462k028k491M442J113l893K221J212m492
716b663J710L523l252l34K567k278j80K494j715o93J167j499J390K157l353k99
732a258K739k932n9M702k651l005L767j020k941M008Q30l693J205R17j759J546
748C96N43j715J099k31j274K345m64k567K606M27l214K451J706l669Q07K201k446
765i99O36J980k296M6J391j693J177J148k953J433K176l890Q32L911l911j066
$$ plain form
781 -2078 2656 -105 -2678 2133 1142 -2650 764 1516 -1629 169 1008 -994 310 475 -979 672
797 672 296 -1218 1136 500 -2017 963 1457 -2016 169 1769 -1572 -457 1605 -945 -416 1313
813 1313 -861 -493 978 -789 172 1195 -1570 -268 1952 -1329 -863 2215 -1028 -1633 2237 -66
829 -66 -1865 1672 318 -2045 971 949 -970 719 -32 -1428 949 398 -1011 1388 161 -2095 1127
846 1127 923 -2046 1063 1806 -2202 -286 1871 -1368 -559 1689 -818 -608 1446 -480 -812 521
862 521 -623 121 1337 -667 -316 853 -1418 -680 1837 -132 -535 1302 -964 -1592 1276 317 -625
879 -625 1185 -157 -1122 779 -434 -1020 1577 264 -1201 1314 11 -2129 959 908 -1621 1207
895 1207 1708 -1966 -652 986 -1182 197 1970 -532 -702 498 -1058 -493 1176 -10 248 891
$$ packed form
781b078M734k761k573M811r91l792L414P52l145J798Q39k002J304J65j454J651
797F72l76j514K354o36k517K980M94l473K185J600l341J115K062k550N29J729
813A313k174L68J471j767R61J023k765J302K220l281M66L078l243o05L870k303
829f6j799L537j354k363L016k2j919J689p51j396K377n51j409K399j227k256L222
846A127k04k969L109P43m008J916K157l239Q09K248k507K10K054j926l32J333
862E21j144P44J216k004L51J169k271P38K517j969m03J837k266o28K868r59r42
879f25J810j342r65J901j213n86K597j313j465K515j303k140L088n1k529K828
895A207N01l674J314J638k168J379J773k502j70J200j556N65J669j186K58O43
$$ plain form
911 891 -1188 -811 909 -539 -256 1562 -171 -791 733 -739 -1193 1114 590 -262 833 -343 -1269
928 -1269 292 -100 -351 1456 468 -1052 164 -405 -1234 1041 1030 -689 558 399 -1544 -310 604
945 604 -334 819 1041 -939 -517 52 -945 376 1317 -270 133 464 -1545 -688 1276 -2 0 1200
963 1200 -624 -1196 581 -187 -620 1205 604 -715 102 -259 -901 454 597 -119 539 143 -910 -242
981 -242 34 -107 806 544 -566 -185 -101 -509 315 439 -181 410 152 -799 3 275 -513 356 699 -490
1001 -490 48 435 -1030 -468 980 124 -29 655 -636 -1015 464 250 -179 768 209 -834 -226 12
1019 12 -141 578 409 -398 -116 7 -260 132 127 -122 315 153 -407 -30 29 -259 283 327 -216 115 47 -611
1041 -611 -17 543 9 70 116 -562 -154 544 -7 -140 258 -221 -286 313 61 -119 229 -172 -367 270 247
$$ packed form
911H91k079L77J720j448K83J818j733o20J524j472m54K307n24q52J095j176r26
928a269J561l92k51J807r88j520J216n69q29K275j1j719J247j59j943J234R14
945F04r38J153K22j980M22N69r97J321R41j587M03L31k009Q57J964j278KJ200
963A200j824n72J777p68m33J825o01j319Q17l61o42J355J43p16O58l96j053O68
981b42K76j41R13k62j110L81Q4m08Q24J24o20N91k58r51Q02K72p88Q69L43j189
1001d90N38L87j465N62J448q56j53O84j291l79J479k14m29R47n59j043O08K38
1019A2j53P19j69q07K82J23k67L92nk49M37j62n60L77N9k88N42M4n43L31o8o58
1041f11N94N60n34O1M6o78M08O98n51j33L98m79o5N99k52j80L48m01j95O37k3
$$ plain form
1062 247 -43 57 -294 -319 401 240 -191 112 -101 -405 237 269 -234 199 162 -547 -70 487 -62 -77 188
1083 188 -291 -182 415 74 -275 72 98 -107 31 57 -13 -6 -13 43 -5 -38 136 -60 -296 230 358 -272 -125
1106 -125 145 -306 78 590 -265 -411 367 -134 -397 556 245 -494 125 62 -555 305 645 -423 -302 264
1126 264 -216 -107 455 -57 -321 168 25 -249 114 227 -73 -162 -29 52 32 52 57 -165 -120 265 63 -288
1148 -288 97 181 -226 71 195 -273 50 291 -293 -57 390 -188 -204 259 -151 -66 449 -219 -405 351 36
1169 36 -210 365 -42 -439 317 83 -442 363 323 -532 -26 260 -325 183 446 -440 -253 374 -88 -185 300
1190 300 -7 -238 92 1 -141 86 199 -34 -273 11 287 -112 -145 297 -118 -310 448 14 -622 458
1210 458 397 -755 174 639 -706 -39 829 -643 -335 1022 -391 -788 905 74 -758 664 170 -916
$$ packed form
1062B47k90J00l51k5P20j61m31L03k13l04O42L2n03M33l7p09M77N57n49j5K65
1083A88m79J09N97l41l49L47K6k05J38K6p0PpN6m8l3J74j96k36N26J28o30J47
1106a25K70m51L84N12q55j46P78n01k63R53l11p39O19o3o17Q60L40j068J21N66
1126B64m80J09N62n12k64M89j43k74L63J13l00q9J33Q1k0K0Nk22M5L85k02l51
1148b88L85Q4m07K97J24m68L23K41n84K36M47n78j6M63m10Q5N15o68j86P56l15
1169C6k46N75m07l97P56k34n25Q05m0q55N06K86n85N08K63q86J87O27m62r7M85
1190C00l07k31L30r1j42K27J13k33k39K84K76l99l3M42m15j92P58m34o36J080
1210D58o1j152R29M65j345O67Q68j472L08J357j413l97J693q31q32J422m94j086
$$ plain form
1228 -916 510 569 -782 118 590 -609 -114 533 -292 -84 462 -295 -341 309 85 -74 74 -88 -57 5
1248 5 -28 139 -24 -104 246 -184 -386 468 153 -495 336 146 -661 425 419 -848 252 733 -850 -46 840
1269 840 -757 -165 1074 -728 -570 1209 -378 -873 1107 -63 -999 986 161 -1235 810 676 -1183
1286 -1183 309 769 -969 80 885 -740 -201 860 -478 -490 648 -33 -328 320 -79 -301 185 125
1304 125 -38 -118 -53 250 -155 -343 507 60 -637 492 199 -914 597 712 -1230 138 1088 -1101 -175
1323 -175 1379 -957 -649 1533 -672 -1123 1580 -47 -1399 1187 237 -1480 1022 690 -1522 581
1339 581 1009 -1361 100 1090 -1002 -83 1157 -819 -495 1005 -393 -549 781 -69 -464 420 -95
1356 -95 -366 326 135 -72 -3 -231 148 152 -362 265 294 -620 197 432 -768 265 850 -966 -194 1036
$$ packed form
1228i16J426N9j351R00M72j199M95O47q25K08N46p57m6O50k24j59J48j62L1O2
1248El3J67j63q0L50m30k02Q54l15o48Q31j90q07J086oj267J100M81j583Q04Q86
1269H40j597N92J239j802J58J779j587m95J980j170r36J985q25j396K045j34j859
1286a183J492M60j738J049Q05j625N39J061j338j2J138o81k95O48l99k22M86o0
1304A25j63q0O5L03m05j88Q50m47o97J129k93j113J511J15j942J368R50k189R26
1323a75J554k336L08K182k205m51K703j627j352K586r50j717K502l32k212K103
1339E81M28k370J461R90k092R19J240j976L24J500j398j56J330q50l95Q84n15
1356i5k71O92j91k07O9k28L79Mn14O27K9r14Q17K35j200J033N85j816P72J230
$$ plain form
1376 1036 -818 -318 1315 -792 -783 1525 -471 -1261 1527 78 -1545 1269 481 -1762 958 1023 -1782
1393 -1782 388 1473 -1395 -209 1381 -1095 -473 1527 -577 -808 1138 -272 -884 814 87 -603
1409 -603 638 112 -700 247 204 -270 168 93 12 123 -321 -85 158 -342 382 641 -776 -167 696 -914
1429 -914 -309 1404 -391 -670 1148 -688 -1361 1448 393 -1249 1147 448 -1787 509 818 -1383
1445 -1383 689 1442 -1401 -271 1059 -1282 -323 1656 -528 -498 1315 -790 -1343 1065 218 -576 1135
1462 1135 187 -1240 156 194 -640 571 789 -234 -124 -240 -548 83 233 240 545 -138 -369 35 -658
1481 -658 -286 1065 251 -246 594 -653 -1184 750 261 -464 1360 365 -1672 124 343 -1170 1002
1498 1002 1538 -1224 -208 896 -1591 -556 1770 -211 -370 1385 -794 -1621 856 205 -650 1344
$$ packed form
1376A036j854N00J633k107RK308j996p90K788j449j623K814p88k243K720O5k805
1393a782K170J085k868J186J590k476O22K000k104k31J946j410o12J698p27o90
1409f03J241n26q12R47m3m74M38p5q1J11m44K36K43n00P24K59j417O09Q63j610
1429i14O05J713j795k79J818j836o73K809j055j642K396o99k235K296L09k201
1445a383K072P53k843J130J330k341R59J979k184L0J813k105n53K408q47p94J711
1462A135r48j427J396L8q34J211K18j023J10j16l08O31J50PL05o83k31M04o93
1481f58L72J351q14m97Q40j247n31J934m89p25J824r95k037J796K19j513K172
1498A002N36k762J016J104k487J035K326j981j59J755k179q27K477o51q55J994
$$ plain form
1514 1344 637 -1184 -87 -134 -953 695 1188 -179 -21 -60 -976 -256 464 223 589 400 -503 -478 -409 -241
1534 -241 620 483 37 411 -330 -1040 79 162 -181 1104 612 -1129 -216 106 -1022 481 1391 -397
1552 -397 -96 505 -1345 -696 1261 37 -131 1119 -539 -1224 545 -138 -640 1280 621 -946 154
1569 154 -83 -1137 463 945 -331 333 428 -1083 -526 467 -41 419 764 -401 -552 -57 -336 73 593
1588 593 166 124 -32 -647 -192 231 -74 410 428 -448 -68 117 -733 20 842 -160 3 481 -787 -557
1608 -557 741 -147 -239 965 -139 -899 379 -63 -603 833 453 -798 219 276 -809 142 569 -422
1626 -422 201 498 -660 -247 428 -300 -20 568 -216 -188 251 -401 -186 513 24 -91 198 -353 -203 383
1646 383 -109 -87 400 -189 -249 288 -193 -145 485 -146 -364 378 -53 -320 378 -44 -371 441 46 -515 299
$$ packed form
1514A344p07j821J097m7q19J648M93j367J58l9r16P20P20k41L66j89r03K5O9J68
1534b41Q61j37m46L74p41p10J119Q3l43J285m92j741R13L22j128J503R10j788
1552c97L01O01j850O49J957j224j68J250j658o85J769o83n02J920o59j567J100
1569A54k37j054J600M82j276O64R5j511N57R93n08M60L45j165j51M95k79M09N20
1588E93m27m2j56o15M55M23l05M84J8q76L80J85q50P53Q22j002J63M78j268K30
1608e57J298q88r2J204j104p60J278m42n40J436l80j251J017N7j085R51M27r91
1626d22O23K97j158M13O75p28K80N88p84K8M39o52K15O99m89j15K89n51J50N86
1646C83m92K2M87n89o0N37m81M8O30o31k18P42m31k67O98m22l27Q12l95n61Q14
$$ plain form
1667 299 178 -409 303 158 -533 250 285 -511 195 432 -463 -11 320 -450 72 565 -378 -211 419 -292
1687 -292 -189 456 -155 -213 440 -153 -383 322 32 -215 298 -12 -252 264 -45 -331 233 115 -130 238
1707 238 -57 -336 211 42 -245 310 125 -297 163 -10 -397 322 287 -360 136 175 -424 87 269 -339 141
1728 141 413 -400 -159 277 -274 -16 427 -237 -140 354 -284 -274 380 -34 -136 316 -201 -352 341 -1 -290
1749 -290 309 33 -304 209 -15 -325 286 168 -325 99 143 -249 131 142 -275 110 192 -247 25 148 -166
1770 -166 89 100 -234 90 205 -206 18 134 -213 131 202 -307 64 290 -308 -54 304 -245 -6 389 -320
1791 -320 -212 444 -120 -261 371 -89 -312 346 -21 -362 333 138 -379 122 113 -251 182 144 -315 81 163
1812 163 -243 39 148 -127 96 61 -283 51 176 -126 100 88 -246 83 135 -257 152 277 -240 -27 132
$$ packed form
1667B99j21n87P12j45o91P83L5p96P06K37q95M52L31p70N22M93r43J67O30p11
1687b92J03O45o11n8O53n93k30P05k90k47N13l10k40N16l09k86N64j18k45L68
1707B38k95k79N47j69k87N55j85m22M60j73l87P19l5o47M96L9n99N11J82o08M80
1728A41K72q13K41M36n51K58M43o64R7M94o38J0O54m14j02M52n17j51O93l42k89
1749b90N99k76l37N13k24l10O11j18m93M24M4l92L80J1m17L85Q2m39K72J23l14
1770a66K55J1l34L24J15m11K24J16l47L44P1n09L71K26n98K54L58n49K39L95p09
1791c20J08O56n64j41O32m60k23O58l67l41O95j95n17N01rl64M33l8m59L96Q2
1812A63m06K82J09k75K23l5l44L34J25l02K26j2l34L29N2l92M09J25n17K13J59
$$ plain form
1833 132 -303 105 383 -267 -83 316 -265 -144 360 -131 -108 352 -213 -298 348 5 -196 270 -56 -269 290
1854 290 3 -300 253 87 -269 154 31 -247 252 93 -342 146 147 -251 130 118 -263 139 141 -307 96 204
1876 204 -201 94 98 -343 117 291 -306 58 288 -326 -21 290 -308 28 459 -328 -240 378 -169 -144 429
1897 429 -161 -280 394 -94 -320 386 77 -263 236 -51 -317 310 136 -286 163 58 -266 149 52 -196
1917 -196 237 68 -324 126 61 -185 286 28 -380 238 102 -416 276 233 -445 207 245 -573 166 543 -497
1938 -497 -77 468 -458 -113 585 -347 -241 586 -274 -414 513 -53 -318 467 -83 -454 407 89 -388 323
1958 323 120 -355 231 68 -346 279 187 -319 132 45 -253 261 86 -295 250 63 -372 237 121 -299 356
1979 356 99 -573 258 302 -468 264 324 -631 131 438 -595 102 655 -568 -188 569 -480 -113 781 -421
$$ packed form
1833A32m35M08K78o50J84L99n81J21N04m91K3M60n65q5O46l43k01M66l26k13N59
1854B90k87l03N53j66l56M23j23k78M99j59m35M88Jl98L81j2l81M02Km48M03J08
1876B04m05K95Mm41M60J74n97L64K30o14L05L11n98L36M31p87Q8O18n47K5N73
1897D29n90j19O74m88k26P06l09l40M99k87k66O27j74m22M49j05l24M15r7k48
1917a96M33j69l92M50o5k46M71k58m08O18j36n18O92m3o78O52L8q18P39L77j040
1938d97M20N45r26L45O98r32J06Q27q60j40R27n66k65P85n50l71Q61l18m77P11
1958C23k03m75N86j63m14O25r2n06M51q7k98N14j75l81N45j87m35O09j16m20O55
1979C56k57o72Q31M4p70P32O0r55P62L07j033O97N53j223L80P57j049L67Q94j202
$$ plain form
1999 -421 -415 673 -275 -482 710 -47 -540 589 -28 -660 521 254 -555 332 230 -526 278 254 -484 201
2019 201 321 -347 93 179 -326 192 193 -349 180 188 -368 194 142 -412 291 240 -564 219 393 -542 150 371
2041 371 -689 134 686 -607 -90 665 -675 -298 841 -365 -250 866 -495 -760 780 -7 -478
2058 -478 811 -26 -883 474 152 -684 601 431 -710 183 221 -652 312 497 -492 116 379 -494 -21
2077 -21 292 -350 195 425 -350 -14 181 -431 99 367 -282 230 309 -640 -27 419 -393 213 560 -629
2097 -629 -72 615 -606 -200 801 -414 -279 848 -458 -607 792 -266 -663 963 148 -775 551
2114 551 -82 -983 699 629 -686 346 293 -1007 103 644 -444 262 591 -743 -319 427 -290 79
2132 79 579 -319 -163 287 -382 -118 371 -141 114 331 -433 -104 279 -410 103 593 -326 -42 384 -692
$$ packed form
1999d21OJ088r48k07J192p57m93J129o17o32J181k67q09Q87j02p56Q04k4p38O85
2019B01J20o68M40Q6n05N18Jn42N29Qn56N62n2n54P03n1q04P83J74r35O92K21
2041C71j060Q23N52j293N17P55j340L77J139j206J15J116j361k65J540p87m71
2058d78J289q37q57J357l22q36J285j70j141Q93L8q73R64J85r89O08K63q73M73
2077b1L13o42N45K30p75L36J95o12N30K68o49N12P9r49O13M46q12O06L47j189
2097f29N57O87j221M06J001j215J35J127j306j49J399j058l97J626q15r23J326
2114E51o33r01J682p0j315J032n3j300J110N41j088P06L29j334M24P46p17L69
2132G9N00q98J56M50o69K64M89n12K55K17p64L29L83o89N13M90r19K84M26j076
$$ plain form
2152 -692 -187 818 -265 -203 703 -502 -552 784 -218 -551 890 -37 -832 645 96 -833 610 321
2170 321 -848 520 561 -929 68 507 -698 208 802 -613 -216 522 -578 -206 763 -134 -221 388 -416
2189 -416 -342 522 9 -116 337 -215 -235 275 -194 -58 432 -174 -159 317 -308 -147 505 -255 -216 608 -256
2210 -256 -428 528 -191 -410 748 -47 -688 590 92 -724 552 299 -775 398 402 -846 258 640
2228 640 -697 0 594 -602 -57 703 -510 -279 635 -322 -312 577 -205 -347 477 -188 -387 463 10
2247 10 -335 286 -70 -302 329 15 -267 273 -10 -263 232 -35 -172 365 -79 -369 314 -1 -288 417
2267 417 3 -467 380 96 -516 390 286 -551 224 294 -588 268 511 -603 -18 517 -477 -54 592 -436
2287 -436 -222 585 -331 -323 607 -153 -420 433 -71 -374 454 13 -460 295 123 -315 224 64 -331 236 141
$$ packed form
2152f92N05J005j083O2R06j205n0J336j002l33J441r27p95J477n49r29J443k89
2170C21j169J368M1j490R97M39j205R06N94j415L97P38j100L72R69q97q7O09q04
2189d16P4Q64n13j25M53n52k0N10m69J36M90o06J5M76o25J61O52p60L9Q24q64
2210b56j72R56p19k19J158p95o41J278m98q16J276k53j074J173Mj248J104L82
2228F40j337O97N94j196N45P60j213K31R14r57J0Q89p82j42Q24o65j99Q50m53
2247A0l45O21l56k32O31l14k82N40k83k53M95k67j37N37m44k90O83l15k87P05
2267D17m14m70Q47k84o12R06j04q37P75P0q82Q56K43j114N85N35r94M23O46j028
2287d36K14Q07r16QR30p60k67Q53n04l03Q28m41m73P55j72m38N39j60l95N67r5
$$ plain form
2308 141 -290 161 51 -330 161 151 -177 247 38 -473 93 221 -116 267 107 -502 22 224 -244 256
2328 256 331 -430 -84 218 -347 124 521 -358 -205 388 -243 -156 426 -258 -265 518 -13 -320 291 -148 -433
2349 -433 384 199 -215 324 -72 -616 116 311 -89 288 96 -533 -53 231 -176 143 262 -258 -53 115
2369 115 -231 37 183 -195 66 271 -137 -55 -28 -382 94 512 2 -38 1 -520 -173 454 111 95 293 -437
2391 -437 -481 254 106 59 440 -151 -452 188 36 -254 279 112 -248 252 121 -398 22 76 -250 255 413
2412 413 -177 -136 -123 -401 139 548 71 -64 -89 -426 -90 328 70 99 164 -325 -229 147 -44 39 234 -149
2434 -149 -97 240 -119 -239 76 -58 60 411 -36 -318 -21 -169 -115 449 240 -170 -16 -251 -348 317 387
2455 387 -64 58 -76 -356 91 233 -114 79 153 -191 -20 122 -146 -3 122 -100 84 210 -176 -170 8
$$ packed form
2308A41m31M51j10l81M91j0l28M24k09n11N66J28l37L83j60o09N24K02m68N00
2328B56P5p61L46L02n65M71L97q79J53N93o31Q7N82o84pP83n31l07O11m39k85
2349d33Q17j85m14N39l96n44P32J95m00L77j92o29M80K84m07L19J19n20K05J68
2369A15l46K68J46l78K61K05m08Q2K7l54M76M18n10m0L9n21L47O27l43j6J98p30
2391d37m4P35j48m7L81n91l01O40j52k90N33j67l60N00j31n19M20N4l26N05J58
2412D13n90M1J3k78N40M09m77j35k5l37L36M18k58K9O5m89R6L76j91Q3J95l83
2434a49N2L37l59j20L15j34J18L51m47k82K97j48N4N64k09m10J54k35r7O65P0
2455C87m51J22j34k80M47J42l47J93P4l44J71J42k68J43J25k22J84J26l86OJ78
$$ plain form
2476 8 -94 167 308 -116 -184 -4 -177 15 294 5 -66 74 -223 -156 262 43 -92 137 -89 -148 210 -5
2498 -5 -232 162 99 -139 129 27 -246 73 114 -140 119 171 -190 -68 75 -88 99 175 -141 -77 101 -68
2520 -68 4 115 -55 -9 94 -93 -51 78 -26 13 48 -93 17 96 -108 11 120 -82 -21 87 -147 0 238
2543 238 -114 -152 138 -71 -78 225 -65 -214 165 1 -190 178 93 -229 71 89 -151 128 163 -242 -94 172
2565 172 -21 36 133 -168 -128 131 44 20 104 -47 -130 -14 53 142 101 -89 -109 -33 29 175 61 -166 -48 63
2589 63 -41 94 126 -180 -82 111 -49 74 229 -178 -254 123 28 44 252 -146 -356 113 126 -40 209 3
2611 3 -337 22 148 -67 163 103 -340 -135 187 40 95 82 -270 -157 210 122 3 15 -178 -154 103 157 94
2634 94 10 -164 -152 25 143 214 4 -262 -107 95 81 186 68 -300 -102 190 -20 93 219 -255 -253 218
$$ packed form
2476Hj02K61J41m24o8J80j73J92K79k89p1J40k97O7M18k19j35K29k26n9L58k15
2498ek27L94o3k38K68j02k73L19M1k54K59N2l61J22J43j63J87P6l16O4J78j69
2520f8P2J11j70M6J03j87M2J29j04L9L5j41J10P9k04J19J09k02O1J08k34J47K38
2543B38l52l8K90k09pL03k90j49L79j64j91L68q5l22L00J8k40K79L5m05J48K66
2565A72j93N7R7l01M0K59q7k4Q4j51q3J16O7Q9m1j90k0P6O2J46j14k27J18J11
2589F3j04J35L2l06R8J93j60J23J55m07p6L77r5J6K08l98k10M69J3j66K49k06
2611Cl40L59J26k15K30o0m43K05L22j47N5j3l52J13L67q8j19J2j93K4K57N4o3
2634I4q4j74J2J77J18P1k10k66J55K02j4J05j18l68J98K92k10J13J26m74KM71
$$ plain form
2656 218 59 3 255 -185 -412 197 238 -92 117 -46 -403 83 328 -58 18 65 -320 -104 292 84 -6 10
2678 10 -267 -142 259 163 -14 -75 -209 -78 189 130 31 -35 -200 -69 135 113 106 22 -278 -101 214 105 72 36
2702 36 -286 -118 284 67 -38 134 -212 -242 268 119 -106 170 -110 -375 210 276 -132 61 -4 -378 110
2723 110 378 -146 -89 101 -276 -62 366 2 -135 65 -187 -168 308 151 -137 -40 -127 -109 215 154 -103 -78
2745 -78 -78 -51 133 83 -16 -25 -166 -53 173 45 14 67 -230 -101 317 50 -141 132 -93 -238 299 157 -260
2768 -260 114 71 -334 146 333 -194 -37 115 -283 42 404 -149 -174 164 -171 -88 367 -51 -230 162 -70
2789 -70 -218 270 129 -233 21 -4 -157 170 166 -165 -61 11 -43 78 37 -76 20 -37 -83 114 36 -87 90 -41
2813 -41 -164 167 99 -159 78 37 -163 169 96 -243 91 166 -261 68 225 -267 4 299 -277 -98 387 -182
$$ packed form
2656B18j59n6K52m40k27O09M1l30K09j63l57M86K45l86P6M7l85K16L96k08r0J6
2678A0k77J25M01r6j77o1j34J31K67n9r9o6j65J31K04k2pq4l00J77L15j09l3l6
2702C6l22J68M02k17j05J72l46l0N10j49k25K76k80k65N85O6m08J93o5l74M88
2723A10K68n24N7J90l77K14M28l64j37K00k52J9M76j57k88R7q7J8L24o1k57K5
2745g8%K7J84n0r9rj41J13K26j28l1N3k97J29M18k67j91K73k25j45N37j42m17
2768b60L74m3m05M80J87n27J57J52l98L25L62n53k5L38l35Q3M55m18j79L92k32
2789g0j48M88j41l62K54k5j53L27ml31J04P2n4J21m1j13R6n7m6J97p8j23J77j31
2813d1j23L31o8k58K37m1k00L32p3l39L34P5m27L29J57m92K71K95n76J79M85n69
$$ plain form
2835 -182 -248 324 -42 -230 281 -1 -303 205 124 -250 100 97 -199 82 73 -185 101 113 -169 51 89 -157 57
2858 57 111 -149 19 105 -132 -41 86 -8 111 20 -205 26 59 -101 188 142 -281 15 155 -247 103 390 -213
2881 -213 -186 198 -153 -44 362 -97 -246 213 -20 -136 256 -42 -247 226 45 -183 269 34 -433 85
2901 85 217 -137 206 173 -430 -158 247 5 89 165 -191 -162 49 -19 124 132 -150 -33 51 -113 112 127 -284
2924 -284 -46 297 -31 -9 56 -341 -141 325 115 71 138 -380 -327 208 89 154 398 -290 -525 174 101 -62
2946 -62 395 46 -456 105 199 -229 118 180 -249 50 263 -103 -41 -34 -298 92 401 52 -8 -115 -494 -60
2968 -60 460 156 40 51 -398 -315 217 175 140 150 -225 -227 85 -5 47 143 -191 -17 339 -87 -230 65 -193 -109
2992 -109 502 226 -256 -46 -253 -342 387 470 6 -23 -275 -474 181 387 17 143 -10 -444 -5 282 -127
$$ packed form
2835a82o6N72l66j88N11k82l02N08q1l74L50lk96K81rk58K86J2k82K20L8k46K14
2858E7N4k60J68Q6k37R1J27r4J19r1k25K31L3j60K89m6m23K96J40m02L50K87o03
2881b13K7L84l51J09M06m59j49M59k33j16L92k98k05M73j81k28M52k35m67N18
2901H5J32l54L43l3o03K72M05k42Q4P6l56K9K11o8J43Qk82J17Q4j64K25J5m11
2924b84K38L43l28K2O5l97K00M66k10m4O7n18N3N35j19O5K44o88k35O99p3j63
2946f2M57l49n02N61R4m28L47O2m29K99K13l66O2Pk64L90L09l49o0j07l79M34
2968f0N20l04j16J1m49Q3N32m2l5J0l75kL12r0N2R6l34J74L56m26j43K95k58Q4
2992a09O11k76m82K10k07q9P29Q3m64k9k52j99O55K06l70J26j53m34M39K87m09
$$ plain form
3013 -127 70 245 -215 -58 290 -125 -213 73 -47 94 366 -31 -283 -148 -169 146 453 56 -151 -78 -344
3034 -344 -132 422 174 -84 55 -231 -268 241 137 -128 101 -22 -126 182 -28 -278 83 60 -80 300 116
3055 116 -392 -70 58 -156 314 395 -289 -258 26 -166 125 399 -76 -174 29 -162 -28 258 -24 -41 119
3076 119 -144 -68 224 -88 -172 183 21 -49 181 -96 -258 109 93 -9 156 -34 -207 38 -15 -43 240 28
3098 28 -225 80 5 -157 215 87 -271 83 163 -192 48 133 -208 27 189 -157 -5 155 -183 -48 185
3119 185 -102 -2 176 -195 -90 255 -41 -121 162 -94 -133 226 41 -168 130 27 -139 92 41 -92 84
3140 84 -7 -102 119 13 -115 81 4 -87 174 13 -218 46 89 -89 156 53 -214 9 60 -139 138 163 -202
3163 -202 -40 69 -183 103 233 -214 -96 198 -124 -61 213 -139 -163 229 17 -129 147 -53 -197 120 89
$$ packed form
3013a27J97J75m60J57L48m15q8K86j20J41K72l97k52J35k1L15L07l97k07P3k66
3034c44K12N54k48k58J39k86l7N09j04k65K29j23j04L08k10k50L61k3j40L80j84
3055A16n08L22J28k14M70Q1o84L1K84j92K91K74m75r8K03j91J34K86k82j7J60
3076A19k63P6K92l12q4L55j62p0K30k77j62L67j6j02J65j90j73K45n3k8K83k12
3098B8k53L05p5j62L72j28l58L54Q0l55K40Q5l41K35J62l46J52J60l38J35K33
3119A85k87J00J78l71J05L45k96q0K83k56l9L59j85k09K98j03j66K31n1j33J76
3140H4r1r5K21j06j28J96p7r1K61j61k31K64M3j78K45j03k67K23N1j99K77K5l65
3163b02J62J09k52K86J30m47J18K94l22O3K74l52k4L92k12j46K76k00j44L17l1
$$ plain form
3184 89 -23 126 -77 -231 60 104 13 163 -43 -225 61 90 -59 118 53 -172 24 78 -49 91 30 -174
3206 -174 30 125 -27 69 -28 -221 56 196 -70 53 71 -242 -37 200 -30 21 126 -210 -143 183 20 -15
3228 -15 129 -178 -151 211 37 -99 128 -74 -176 188 82 -138 94 2 -225 87 194 -62 -8 -31 -165 88
3250 88 184 -27 -9 -35 -119 96 105 -62 58 -3 -193 48 168 -46 39 31 -198 26 230 -50 -28 66 -141 -11
3274 -11 208 -40 -72 115 -124 -105 196 17 -107 85 -75 -146 182 98 -143 3 -13 -85 135 78 -98 20 -23
3297 -23 -126 103 104 -82 44 -4 -179 99 169 -99 -7 45 -122 47 155 -109 -34 84 -81 4 141 -70 -36
3320 -36 67 -110 3 194 -41 -84 71 -98 -26 197 -16 -123 96 -50 -104 153 37 -98 85 -22 -149
3341 -149 139 86 -118 31 27 -136 108 106 -147 2 71 -101 15 106 -58 -9 35 -97 24 102 -41 -17 11 -109
$$ packed form
3184H9j12J49k03j54K91M4r1J50k06j82K86K9j49J77o5k25J96N4j27J40o1k04
3206a74K04R5j52R6r7j93K77J40k66J23J8l13K05K37k30N1J05l36O7L26j63l5
3228a5J44l07K7L62j74j36K27k02j02L64j06k20K32r2k27L12J07k56N4k3j34K53
3250H8R6k11J8k6q4K15Rj67J20o1j90K41J20k14Q5qk29K24K04k80K2R4k07J30
3274a1K19k48l2J87k39J9L01j79j24J92j60p1L28q4k41J46j6p2K20n7j76J18m3
3297b3j03K29Jj86J26m8j75K78P0k68R2N2j67J69J08k64P5J18j65Q5J37k11L4
3320c6J03j77J13J91k35m3J55j69P2K23k13j07K19j46n4K57j16j35J83j07j27
3341a49K88n3k04J49mj63K44kk53J49O9j72J16R1j64M9M4j32J21P8j43K4K8j20
$$ plain form
3365 -109 59 133 -104 -11 95 -100 -2 157 -65 -35 129 -89 -70 179 -18 -95 109 -51 -80 182 20 -148
3387 -148 92 31 -104 119 52 -132 57 56 -131 66 119 -95 1 46 -81 55 111 -93 -29 61 -77 17 90 -79
3411 -79 -11 65 -102 -9 125 -52 -23 29 -89 9 114 -63 -49 66 -63 -3 104 -62 -47 117 -71 -64 137 -17
3435 -17 -91 105 -60 -99 172 32 -155 82 25 -133 111 71 -149 48 92 -128 36 132 -84 -30 76 -88 3
3458 3 123 -62 -55 53 -30 9 82 -65 -40 59 -49 -15 87 -33 -40 40 -79 -9 126 -40 -59 38 -61 -3 112 -56
3484 -56 -69 116 -43 -87 125 -14 -100 111 7 -122 124 61 -152 47 80 -98 76 66 -158 24 96 -100 22
3507 22 113 -117 -21 98 -102 3 168 -71 -88 94 -8 -35 95 -11 -77 74 23 -32 34 -42 -28 65 -28 -12 86
3532 86 -72 -100 56 -24 -13 138 -64 -148 65 14 -65 103 5 -126 71 3 -138 111 75 -134 65 70 -147 50
$$ packed form
3365a09J68P4k37R3J06j95R8J59k22L0J64k18J9K49j97p7K04j60k9K62j62j68
3387a48K40o1j35K23o7j84J89jj87J97N3k14R6M5j27J36N6k04O4R0j38R4P3j69
3411g9O8P6j67R3J34j77K9N2j18R8J05j77J4J15j29O0J07j66J5J64j88PK01j54
3435a7p4J96j65l9K71j40j87K37n7j58K44m0k20J97M4k20J64R6k16N4J06j64R1
3458CJ20j85PJ08q3L9P3j47K5R9j08L4J02j20pQ0j19P0J35j66j9R7r9N8J15j68
3484e6j3J85j59m4K12j39q6K11j04j29K46o3k13J99L3j78J74j0k24J82P2j96J22
3507B2R1k30R6J19k00J05J65k39j7J82j02k7J30j06o6J51n1n5O6p6J4R3r3J6R8
3532H6j58k8J56q0J1J51k02q4K13n1p9J68r8j31J97o8j41K49l6k09J99Nk17J97
$$ plain form
3556 50 115 -163 23 203 -71 -62 77 -93 -51 165 13 -43 81 -63 -74 86 0 28 127 -67 -109 87 11 -46
3580 -46 90 -6 -84 89 9 -97 32 19 -14 70 -1 -38 51 -85 -106 134 49 -69 75 -57 -193 96 110 -122
3604 -122 59 90 -178 -33 95 -80 40 143 -111 -50 98 -98 -30 136 -71 -3 162 -80 -152 114 1 -69
3626 -69 150 38 -136 21 18 -80 61 90 -16 -9 -63 -47 86 -8 -45 79 -17 -93 90 -18 -127 90 62 -112 47
3651 47 62 -111 17 51 -77 77 79 -128 -20 46 -115 55 121 -131 -21 145 -128 -78 162 -31 -95 134 -25
3674 -25 -108 105 17 -106 67 33 -45 41 -40 -80 111 19 -82 80 2 -88 77 44 -78 69 84 -90 10 73 -30
3699 -30 30 26 -68 54 46 -76 49 42 -106 72 87 -156 9 138 -114 -29 150 -83 -58 126 -67 -65 142 -20 -113
3724 -113 63 -25 -47 112 -33 -98 90 -10 -110 93 36 -109 78 26 -116 75 87 -93 -19 30 -39 50 34 -64
$$ packed form
3556E0O5k78J86J80k74RJ39j70M2K16j52n6J24j44j1J60q6K8R9j94m2J96p6n7
3580d6J36r6p8J73q0j06J29j3l3Q4p1l7Q9j36k1K40q5j18J44j32j36K89J4k32
3604a22J81L1k68J45J28j75J20J03k54O1J48j96O8J66k07O8J65k42p2K66j13p0
3626f9K19j12j74J57lr8J41K9j06Pn4J6J33r4l7J24r6p6J83j08j09K17k8j74J59
3651D7J5j73J28L4j28J54Kk07J08O6j61J70O6k52J10J66k73N0K40j93o4K29j59
3674b5q3K13q8j23J73l4p8Q6q1m0J91r2j01J62p8r0J65l3j22J47J5j74J00O3j03
3699c0O0mr4J22qj22J25pj48J78J5k43J65J29k52Q5J79k33K5J84j93KK07j62r3
3724a13J76q8k2J59j45o5J88j00j00K03n7j45J87n2j42J91J2j80P4M9o9Q9j6r8
$$ plain form
3748 -64 41 33 -55 72 34 -98 69 58 -121 48 115 -102 -20 105 -58 2 132 -76 -64 109 -17 -17 89 -56
3772 -56 -53 104 -43 -40 155 -20 -125 74 13 -86 121 35 -143 39 84 -68 12 36 -76 22 56 -29 36 15 -80 10
3798 10 20 -22 102 46 -140 -19 80 -53 59 95 -96 -45 53 -71 19 135 -22 -24 46 -99 -5 131 -68 -38 134
3823 134 -32 -84 85 -55 -94 144 68 -77 48 2 -146 24 66 -4 85 3 -163 -31 31 -6 104 51 -113 -10
3847 -10 30 -90 55 113 -63 -21 58 -62 -4 49 -81 -21 97 13 23 -3 -144 -24 113 31 50 93 -137 -126 64
3872 64 3 61 184 -36 -174 19 4 -2 136 29 -95 62 14 -92 61 19 -72 90 78 -85 26 6 -146 37
3896 37 183 25 1 -39 -176 -43 135 69 47 15 -140 -78 50 11 73 88 -92 -101 44 -5 3 46 -67 -47 112 29
3922 29 -49 -14 -83 -28 139 51 -17 13 -133 -109 124 116 10 55 -99 -175 81 123 -12 32 -3 -137 37 99 -45 16
$$ packed form
3748f4J05qq8J27l8j32J67j1j79J69O7k17Q2J25j63O0J30k08J2J73j26%J06j45
3772e6LJ57j47LJ95j75j05J99o1r9K07q6j78J82M5j52Q0K4j12R8L4q5O5k1r5R0
3798A0J0m2J24n6j86J21R9j33J12L6j91N1R8j24R0J16j57kP0j45R4J36j99L0J72
3823A34j66n2J69j40l9K38p6j45J25m6j48J70M2p0Q9q2j66J32O2l7J10n3j64J03
3847a0M0j20J45N8j76M2P9j20N8N3j30O0J18q4J0k6j41J20J37q2J9M3k30J1J90
3872F4o1N8J23k20j38J93j5oJ38j07j24J57m8j06J53m2r1J62j2j63J11k0j52J83
3896C7J46j58k4m0j37J33J78o6k2l2j55O2J28l9O2J5j80rJ45m9QM3j13K0J59q3
3922B9p8L5o9N5J67q8o8L0j46K4K33qj06M5j54p6K56M2j35M4l5j34J74O2j44O1
$$ plain form
3948 16 37 -88 30 130 -37 -39 14 -101 19 187 5 -104 -28 -62 0 153 46 -78 -53 -60 -26 106 67 -14 -33
3973 -33 -104 -23 133 44 -44 -14 -78 -25 135 27 -93 -9 -25 -27 114 52 -81 -6 -26 -56 136 94 -94 -31 3 -63 99
4000 99 110 -128 -69 62 -36 39 131 -68 -91 49 -18 18 120 -34 -118 13 7 19 102 -32 -130 23 34 15 49 -33
4026 -33 -87 6 34 12 41 -34 -92 -2 2 44 104 -53 -127 29 16 -17 96 -24 -138 39 74 -76 50 56 -118 14
4052 14 91 -39 2 55 -114 -30 140 14 -33 13 -99 -34 146 29 -53 15 -43 -59 96 53 -39 18 -36 -51 73 62
4078 62 -36 1 -49 -32 91 44 -83 -21 -17 -20 94 42 -83 -21 -22 -44 72 60 -55 -31 -51 -70 102 77 -97 -26 6 -70
4106 -70 81 100 -129 -64 83 -56 19 145 -76 -123 61 -7 -8 144 -25 -171 24 69 5 89 4 -148 0 84
4130 84 6 51 29 -97 -45 43 37 44 -22 -100 -34 16 51 91 -46 -141 12 52 -8 74 -10 -162 0 95 -41 48 66 -153
$$ packed form
3948A6K1j25J18J00j67kN3j15J20J68j82j09P6l4O2J53j07j24K5pL4J32l9q1j9
3973c3p1Q1J56q9q8L0o4N3J60j08j20Q4j6kJ41o2j33P5k0l0J92m2j88O3L4o6J62
4000I9J1k38N9J31r8P5R2j99k3J40o7L6J02j54q4J31oJ2Q3j34r8J53J1j9L4q2
4026c3n4R3K8k2K9p5n8R0MM2O0j57p4J56j3l3J13j20j14J77L5j50J26Oj74J32
4052A4P7j30M1N3j69Q4J70j26m7M6j12O5J80j17q2O8n8j6J55m3r2N7n4j5J24j1
4078F2r8L7n0J7J23m7j27O2MlJ14n2j25O2jk2J16j2j15K4k0j9J72k5j74P1L2p6
4106g0J51J9k29O5J47j39P5J26k21m7J84o8jJ52j69j46J95M5o4Q4q5j52J48Q4
4130H4p8M5k2j26N2Q8oPo6p8O6N0L5M0j37r5J53M0o0Q2q4j52J62R5j36Q9J8k19
$$ plain form
4158 -153 -77 106 11 19 67 -133 -95 123 44 -30 38 -80 -94 97 58 -38 50 -45 -113 68 86 -18 46 -46 -115 76
4184 76 121 -23 1 -3 -101 60 114 -33 0 17 -90 0 98 16 -19 -24 -79 2 89 18 -10 -35 -77 46 83 -39 -6 21
4212 21 -99 13 106 -44 -24 69 -106 -54 154 4 -105 61 -36 -81 142 47 -142 51 40 -106 59 83 -89
4235 -89 -8 45 -67 -2 100 -30 -59 -1 -15 27 46 -36 -3 9 -22 38 46 -42 26 54 -87 12 92 -43 -11 57 -59 -20
4263 -20 99 -42 -60 84 -20 -54 57 -24 -51 74 -20 -76 69 35 -54 59 -13 -91 62 39 -82 44 27 -91
4287 -91 41 41 -58 60 48 -107 10 74 -33 -7 63 -88 -17 109 -16 -36 39 -32 -32 65 19 -1 24 -46 -29 44 36 42
4315 42 11 -83 -10 101 -6 -11 71 -85 -55 110 4 -55 67 -40 -117 81 70 -62 32 -10 -103 60 119 -90 -42
4340 -42 3 -71 33 112 -38 -43 23 -63 -1 110 12 -42 -21 -58 18 81 -9 -31 -8 -37 48 89 -42 -43 31 -41 24 117 -9
$$ packed form
4158a53P6J83r5QM8k00L8K18p9p4O8j18j4J91l9r6Q8r5o8J81J8j04O4r2o9J91
4184G6M5j44K4mr8J61N4j47L3J7j07R0R8q2l5nn5Q1Q7p1k8k5m2J23L7j22L3K7
4212B1j20J12R3j50K0R3j75N2K08j50j09J66r7m5K23r5j89J93j1j46J65K4j72
4235h9Q1N3j12O5J02j30k9N8j4M2J9q2L3J2l1O0Qq8O8K8j41R9Q0j35L2O8j16L9
4263b0J19j41j8J44j04l4J11q1k7J25r4n6J45l4q9J13p2p8J53k3j21J26j7j18
4287i1J32%r9J18j2j55J17O4j07K6P0j51P1J26j25k0P5p1%R7m6k0K5p0J7P3qO
4315D2l1r4P3J11j07nQ2j56L0J65j06n9J22j07p7J98j1j32R4m2r3J63N9k09M8
4340d2M5p4J04P9j50nO6q6O2J11r8n4K1l7P6O3r0k2K3k9Q5M1j31jP4p2O5R3j26
$$ plain form
4369 -9 -72 -9 -41 18 130 32 -102 -41 -38 -6 113 36 -76 15 -20 -46 94 38 -79 19 24 -57 64 54 -105 -28 73
4396 73 4 41 41 -147 -94 68 47 41 54 -77 -113 13 9 36 83 -35 -99 -15 7 9 40 -33 -41 43 22 -12 -15 -90 -30 101
4426 101 42 7 32 -91 -113 80 81 32 74 -63 -171 22 99 12 49 15 -101 1 67 -38 4 46 -47 32 86 -63
4452 -63 -61 -4 -61 31 163 13 -104 -65 -85 -1 167 62 -73 -63 -83 -60 81 69 -3 13 -53 -51 49 31 -36 -9 -11 23
4480 23 84 -17 -110 -32 9 61 147 29 -111 -52 -32 5 169 108 -76 -51 -34 -63 105 141 -70 -49 35 -39 19 78 -62
4507 -62 -77 87 41 -8 44 -68 -115 32 77 66 67 -91 -161 -28 76 87 85 -62 -125 -26 35 36 64 -3 -91 -22 19 7
4535 7 55 -28 -95 -2 67 33 18 -62 -118 22 107 38 11 -51 -123 -4 94 51 56 6 -118 -47 84 51 21 18 -104 -52 108
4564 108 43 -43 15 -74 -64 99 54 -43 3 -44 -78 68 89 -34 -41 -46 -61 61 97 -21 -68 -53 -29 60 70 -19 -36 -43 -43
$$ packed form
4369io3O3l2N9J12r8j34O1LL2J19p7j12R1l5k6J40n6j17R8Nq1J21j0j59P7J01
4396G3o9L7%j88N3J62k1oJ3j31l6J26mK7M7j18o4Q4K2KL1p3qQ4k1l4lp5O0J31
4426A01n9l5K5j23k2J93Jm9M2j37j08J93P7q7L7l4j16J02O6j05M2M2r3P9N4j49
4452f3KN7n7R2J32j50j17L9k0Q4J68j05j35J0k0K3J41j2p2J6o6KJ00j8o7K7kL4
4480B3O1j01r3P8M1N2Q6j18j40N9K0L7J64o1j84K5J7k9J68L6k11K1Q4p4N8N9j40
4507f2j5J64m6m9N2j12m7J47M5j1Jj58p0J33J04J1kj47o3R9O1JK8o7q8O9M1j2
4535GM8q3o7R3O9l4j5q0n6J40Q5o9k7o2p2J19R8m3Nn0j24P1J31l3l0lj22N2J60
4564A08o5q6N8q9J0J63m5r7M6m7l4J46K1j23pnj5J22L6j18m7J5K4Q9J0q9j7p%
$$ plain form
4593 -43 52 64 -8 -11 -39 -86 52 94 -39 -54 -18 -57 33 105 -39 -62 40 -20 7 88 -15 -77 11 -6 9 100 11 -104
4621 -104 -36 10 19 98 20 -83 -32 12 -11 68 44 -68 -24 -1 -31 44 32 -59 -29 20 4 24 1 -81 -30 55 11 20 18 -75
4651 -75 -39 35 0 32 44 -49 -68 10 -5 23 52 -48 -40 62 4 -19 36 -34 -45 75 17 -47 40 -7 -67 55 60 -27 24
4680 24 5 -97 17 74 17 8 -1 -56 6 61 -1 13 39 -18 -17 14 -13 19 30 -32 -4 45 -20 -14 9 -35 8 55 -40 -38 28 -21
4712 -21 -5 53 -26 -39 44 -12 -53 47 11 -57 23 -3 -41 42 9 -75 -6 36 -28 24 18 -47 19 33 -38 9 41 -13 4 26
4742 26 -43 15 59 -32 -16 27 -17 -4 34 -15 -5 46 -39 -33 29 -1 5 39 -24 -45 45 -2 -41 27 6 -39 21 -10 -19 51 18 -48
4774 -48 -8 1 -18 30 -1 -50 5 26 -42 2 20 -40 16 39 -35 -2 22 -51 1 62 -10 -3 6 -54 -11 70 6 -34 11 -28 -22 66
4806 66 13 -15 35 -21 -30 37 23 -11 17 -20 -27 54 28 -29 0 -12 -29 50 17 -53 16 0 -53 32 42 -33 5 -12 -61 29 60
$$ packed form
4593d3R5J2p2lk8m7J38M2j33j5L6l9R0P2j44k3J02o0K7Q1j03o2Q8j7J5R1q9j15
4621a04O8M6RP9p8j03N1M4k3P9k4j12M4K3l0P5j2r1L0M9j6K0k3q2N1Q5m4Rkr3
4651g5L6P4l5L2J2r3j9P8j5K8K9j00QJ02n8k3N5p0j1J20n8o4Q7m7o0J22Nq7N1
4680B4j9j02J14N7n7rrn5O2N5o2J4K6n7JL1k7L2J1o2K8M9o5OK3m4M3M7r5KO6m9
4712b1J6N8p9j3Q3n6m1J00l6o8Q0k6l8Q3l3q4O9M2o4N2oo5O6J4p1M7L2n4J7K2
4742B6o9N8M4r1J6M3m4J3L8m9J0N1q5OO2l0OL4o3k1R0m7l9O8k1m5O0l1rP0l3o6
4774d8M0Rj9M8l1m9N5K1o8M4J8o0N6K3p4L3K4p3N2O1p2PRo0M3Q1o4m0M5l9OQ8
4806F6n3k8N0n6rO7j4l4K8l7pQ1k6n7K9j2j7P9l3p0O9j6n3Q5J0p5L8j7m9R0L1
$$ plain form
4837 60 -32 -31 5 -31 31 51 -43 -38 18 -12 15 48 -21 -28 0 -19 17 71 -13 -60 -13 -14 36 72 -19 -61 17 7 22 78 -7 -46
4869 -46 17 15 -11 80 29 -65 -12 20 5 48 31 -70 -19 37 15 34 15 -49 -13 27 3 33 29 -58 -26 27 -1 34 21 -73 -42
4900 -42 55 21 -3 16 -87 -53 62 18 -14 21 -41 -51 33 37 14 20 -37 -73 47 69 10 8 -54 -58 32 43 -2 7 -20 -54 36
4931 36 41 -2 27 -23 -66 37 57 -25 1 -30 -69 29 78 -18 -39 -4 -42 -3 76 -27 -39 -1 -46 -18 75 16 -40 -26 -32 -1
4961 -1 75 6 -55 -26 -34 9 73 -1 -45 -14 -28 -15 82 30 -38 -12 -16 -19 73 53 -67 -25 7 1 56 50 -58 -29 23 -13 31 48
4993 48 -23 -44 2 -10 34 50 -42 -47 7 7 36 34 -64 -49 32 12 9 45 -39 -61 41 21 7 62 -31 -86 -6 28 15 41 -17 -98
5025 -98 -15 45 -5 24 -8 -51 6 22 -11 22 7 -51 -3 38 1 21 -10 -93 7 68 0 9 9 -51 -4 74 -4 -2 38 -43 -43 46
5057 46 22 -21 24 -16 -39 52 35 -29 -18 -1 -9 44 37 -28 -12 -13 -18 50 24 -7 -8 -40 -50 44 54 -22 2 -13 -50 26 42 -44 -4
$$ packed form
4837F0r2JL6l6O2K0r4NN6l0K7L3o9pK8j9L6N4q4m7M7jN0L6r1m2P8j0J5N6q5l9
4869d6O3kk6R1n1r4N3L2j5M3j7j01N1N6k2J9j9o4L6M0k4L0mq7L2N3k8L5j3r4L1
4900d2R7l4k4J9j03L4J15m4l2L5o2j0Q4Mk3On7l6J20K2n9ko2mR0J1m5Rk7l4R0
4931C6Nm3K9n0m3J03K0q2K6l1l9R8M9r6k1L5l8L9P9j03j2L8m5K8R3n9n6J4oL1
4961aP6o9o1K9qM3O4p4m4L1j4J3R7n2o8K6mlR2k0j20M2L2oN5oj08K9N2l6M4J7
4993D8p1k1M6j2M4J6r2nN4%K9kr8J5Q1k0lL6q4k2J02k0j4N5r3n5Q0L4j3K6n8q1
5025i8Q3O0n0K9l2m3N7J6l3L3j5n8M8M1l7K0l1q3J00O1o8R%o0M7P8p8KM0q1%Q9
5057D6k4m3M5m0k3R1j7o4J1J7qN3po5J6jnO8k6l1jl2j0R4J0p6K4j5l7P6J6q6M0
$$ plain form
5090 -4 33 -33 -1 42 -20 -18 29 -18 -7 56 -20 -57 -3 1 18 63 -2 -45 4 1 11 51 -4 -21 20 -2 -23 40 15 -39 12 14 -19
5123 -19 39 11 -65 6 35 -11 15 18 -59 2 39 -16 11 32 -40 -27 11 2 5 22 -38 -28 15 -2 13 24 -30 -13 39 -15 -17 19
5155 19 -25 -15 39 -8 -18 38 -15 -44 43 41 -22 26 -5 -38 41 49 -22 -11 31 -19 11 41 -15 15 22 -18 -2 36 24 6 12 -20
5187 -20 7 42 -2 7 11 -19 0 18 -25 2 29 -29 -16 37 -11 -20 25 -19 -24 43 25 -37 7 10 -27 19 19 -28 9 15 -45 -6 17 -7
5221 -7 5 0 -39 13 21 -28 -13 13 -19 2 19 -20 4 39 -29 -20 34 -2 -1 36 -17 -23 47 0 -35 26 4 -14 31 9 -26 20 9
5254 9 -17 16 21 -4 6 -27 -19 14 17 -11 -9 -24 -33 27 19 -15 36 10 -53 0 28 -24 5 24 -42 -10 50 -29 -30 10 -16 -9 48 1 -43
5289 -43 14 -6 -31 48 29 -3 2 -25 -25 35 28 -10 -4 -12 -22 33 33 -16 40 6 -12 22 3 -27 32 20 -26 33 29 -41 -30 7 -10 32
5323 32 50 -44 -52 -6 -29 10 46 -13 -8 -9 -58 -15 41 -7 -20 8 -38 -11 38 -28 -46 54 20 -21 31 -19 -60 23 38 -21 47
$$ packed form
5090dL7o6L2M3o2KM7m7J1O3p6l7N4MJ7M5o5m3M9lJ0M0n5j7M1k2k1O3k5n4N1Kl3
5123a9N8k8p6P1K9m6K6Lp7O1L7n5K7K1p2J3L8rLJ7o0J0M3j7J5J1n4J7N2n4kL6
5155A9m4J0N4m7j0N6n3k9Q7ko3M8l1l3P9Qp1J1M2n0L0L0n6L0Pm0J6L8j2j8Ol2
5187b0K7L5m4RMl0J9J8m3K7K7n8J3N3m8rM5m4nO7j8o2M4Ll7M6%m7L7Oo0L9K3k4
5221gJ2nl9N2Qm9J5K6l2K1J7l9K4L5o8RN4l6JL7n3oP0m7l5O1k2j8M5k2l5M6j1
5254Ik6L3Nk5J0l3QL3Lk8Kj5rO0ql4N1k6o3N3K8n2K9J9o6L2O0p9jM0k6PN7m7m4
5289d3N7k0k5P9j9l2Nk7%O0pl8Oqj0N5%m9N6l4j8L4j9l0N9j2m6N9mp0J1L7j7M2
5323C2J8r4qM6k3L9L6n9Njm9M3N6m8j3K8m6K7M9o6j8J00l4m1N2n0m1Q3J5n9O8
$$ plain form
5354 47 43 -61 -30 7 -6 34 54 -24 -22 20 -7 17 25 -1 2 0 -19 7 12 -8 33 16 -7 28 13 -58 6 44 -14 38 34 -61 -40
5387 -40 52 -11 -9 71 -26 -60 17 -7 -37 50 10 -63 27 26 -36 5 17 -38 27 41 -39 -18 20 -22 7 27 2 -2 4 -49 -10 33
5419 33 18 17 -8 -41 1 23 -6 2 6 -13 7 15 -34 1 45 -32 0 46 -23 -10 10 -43 -4 63 -24 -46 29 -19 -30 61 -11 -60
5451 -60 36 1 -69 50 30 -62 15 23 -64 16 51 -58 -26 38 -22 -15 34 -18 -17 27 2 -15 7 6 -5 9 -6 13 10 -19 4 15
5483 15 11 51 21 -60 5 47 -26 13 58 -34 -11 60 -30 -27 70 -8 -56 63 4 -48 55 5 -78 42 60 -51 14 18 -68 3
5513 3 52 -37 8 32 -38 -25 29 1 7 18 -23 -24 15 13 -9 1 4 1 4 -22 -2 6 -11 12 20 -17 17 8 -57 10 59 5 6 26 -44 -16
5549 -16 69 1 -25 56 -6 -35 51 11 -28 51 9 -51 37 50 -31 1 26 -32 28 60 -39 -27 36 -15 -11 51 2 -15 26 -13 -14
5580 -14 37 30 -28 -11 -13 5 24 -1 0 3 -9 25 16 -24 8 26 -29 7 38 -17 -13 31 -46 -8 85 0 -46 36 -3 -38 67 18 -46
$$ packed form
5354D7mj04L1L7j3M0K0p8KM2k7K4Qk6Lkj9K6Nk0M1j7k3L5j5p1O4L8n8N2mr5K1
5387d0R2o3KQ0r7l4P7k4l0Q7m0p3R0jo2M1J2n5O5J4q0K1L8m2K9K0k5mOn3L9M3
5419C3j5jk5l3M2K2k9QMj9K0Qm9L5M4p7L2M6o9J3K0n3L9O7q7k2P5m8j1R1p2m9
5451f0R6l5p0J19k0r2P7Qq7Q0L5j09L2O4o0PM9n2JM4k5j7K2jj1J4j5J9lk9K3J1
5483A5mM0l0q1O5M2p3L9M5r2K3P1r0LR7p8m8J19n9n2J03n0q3J20J8j11O5Mq6P1
5513CM9q9M5K4p0J3N4k8OJ1m1jL9kk2J0LlLk6K0Qj7K3Ql7L4ro5O7M9n4JK0p0K8
5549a6Q5o8k6Q1o2k9Q6m0l9P9m2o0Q8J3q1L2K5n8O0L2r9J2O3n1MO2m9j7M1l9j
5580a4N1pn8J7kJ8J9k5JLj2L4rm0L2J8n5L6L1n5MM4p7L8R3q5m6Q2l9l5J05m9o4
$$ plain form
5613 -46 31 20 -63 31 60 -37 -2 34 -45 15 61 -32 -37 23 -8 -13 36 -24 -30 17 -13 -12 7 2 -36 -17 -5 0 12 1 -23 -7 -12 9
5647 9 20 -8 0 22 -22 -2 35 -19 4 20 -11 -10 54 -6 -34 45 -2 -26 39 15 -51 31 40 -32 24 32 -29 11 42 -20 4 54 -26
5680 -26 -25 36 7 -8 25 -9 -37 31 12 -12 28 -2 -12 -1 -1 -20 17 4 -18 -16 -5 10 3 -19 -19 10 -12 0 12 -18 1 12 -15
5713 -15 -36 26 -6 -24 20 -4 -30 26 5 -50 22 32 -23 4 32 -34 10 39 -45 -10 46 -4 -15 39 -3 -17 44 0 -27 26
5743 26 13 -24 18 13 -15 21 6 -15 21 19 -20 -2 -3 -8 12 4 -26 3 2 -2 -2 5 -2 20 -13 -31 21 -1 -14 11 2 -23 23 20 -35 5
5779 5 18 -27 2 43 -15 0 40 -15 -15 39 2 -16 29 -5 -15 47 4 -32 22 21 -15 14 14 -27 5 16 -26 5 25 -7 -7 12 -24
5812 -24 8 21 -17 -18 13 -1 -19 11 -20 8 -3 -12 -5 3 -8 -9 -14 -16 12 10 -25 -6 12 -36 6 12 -23 -10 18 -28 -14 35 7 -11 18
5847 18 -10 -37 27 11 -23 24 30 -14 16 18 -27 14 43 -12 6 17 -15 -5 28 2 12 42 -19 -22 2 4 4 15 -16 -14 13 -8 -15 18
$$ packed form
5613d6P7j1q3R4K9r7L5L6p9O0M6r3nO0l1nM9o0oM7l0JJ9nl8J9J2NJ2j1k4J6nK1
5647IJ1k8QK2m4K0L7n4K3J6l1JO4o0k8P9m7k4O5k4o6Q2Rp2N6Qo1M0L1o2K4N0q0
5680b6JO1k9j5L3l4k8O8j9k4M0l0j0J1%j9L7j3k2KJ1J5pk2%K9k2J2J2l0J9J1k7
5713a5k1O2l2j8M4k4k6N6k1n5P2J0n5K7K8o6M4K9q4L5N6n0j1N4m2j4O1m4k7N3
5743B6j3l7M2nk8L6j5k1L6kl9J8jnK0ql0K9jm%PpK2l3j8N2k2j3K5rk5M6ln5M0
5779EJ3m5K9M1n8J5M0n5%N4l7j8M5l4j0O2m3l6N4jl6K9%m1L2J1m2L1K0l2%J9l6
5812b4L2J3l8jL1j4j8L0l1K8j1rPQj1jnkK8kl5J9J8m8M2Ol5J3K8m6J4M9k8j8K9
5847A8k8k7O4j6l4M7Om4L0Km5M1K9n5J8J1l2J0L3k6J0L0o1lK4K%J1l1KK7k1pL3
$$ plain form
5881 18 -3 6 10 -13 -15 2 -9 -16 14 4 -7 1 -33 -21 16 5 -1 11 2 -21 1 4 5 46 10 -19 6 4 -12 28 26 -16 11 26 -38 -11
5917 -11 23 -22 14 45 -32 -29 24 -17 -17 55 11 -17 8 -20 -37 22 34 -18 -4 -3 -33 -15 5 -17 9 8 -11 -3 -3 -14 4 -12 -12 17
5951 17 -6 -25 -7 -9 -28 29 11 -36 -14 9 -34 -6 26 -10 6 20 -23 -23 28 13 -6 28 -6 -20 -3 -7 -25 28 14 -4 5 -21
5983 -21 -23 10 2 -5 38 8 -32 7 6 -17 31 15 -28 8 4 -33 2 25 -13 6 14 -40 -13 18 -17 -13 7 -11 -10 -1 -25 -11 11 -17 -8
6018 -8 12 -26 -14 4 -23 -20 23 -21 -24 8 -17 -21 20 -6 -30 10 -2 -25 17 8 -24 8 10 -35 14 25 -17 14 14 -13 -4 -2 -5 6 4 -13
6054 -13 6 -2 -22 14 19 -25 5 21 -24 -1 25 -40 -8 30 -22 -26 46 -11 -27 32 -3 -14 19 -5 -24 30 12 -2 6 -5 -32 3
6086 3 14 -4 21 7 -6 -5 -13 -3 32 8 -12 13 3 -11 10 -1 -22 41 29 -19 1 17 -28 15 40 -3 11 27 -25 -32 28 16
6118 16 8 23 -21 -7 32 7 -6 8 0 -7 12 1 -8 23 -2 -19 29 10 -31 -6 -32 -26 24 23 -18 -4 -22 -32 10 23 -6 7 0 -42
$$ packed form
5881A8k1RMk3kJ7j1pL0j0j1Ql4J2L7j1oJ2rk3K2LJM1l6k9K5kj6M0km2K7J5o4K7
5917a1L4m5L6L1p7LN3m1%P2m4k8K5k8j7N9J2n2J4Jl0J8K0k2K6jj9Q%j1J8j6%K9
5951A7k3j9J8kj9N7j8m7K2K3m3K8L2l6J6J4m3%N1j5j9L4l4j4J7mj8N3j4j8Rk6
5983b1kL3qpM3l0m0L9jk3M8j6m3L6ml7L5K3l8J9Qn4K7L1l5MK0j8JRk4J4K2k8R
6018hK0l8J2J8k7LM3m4lL2k5mM1k6k4M0j2k3M2rl2L2Km5M9J1m2L1%k7RKlJ1kj7
6054a3J9qk0L6Nm4L0J6m5K3K6o5L2L8n2mP2n7j6N9l5j1L3k4j9N4j8j4Qj1k7L5
6086CJ1j8K5j4j3JqJ0L5k4k0K5j0j4K1j1k1O3j2m8K0J6m5M3K5m3J4J6n2pO0j2
6118A6qJ5m4J4L9k5j3J4qpJ9j1rL1k5j7M8j9m1K5k6ON0jm1J4j8j0M2J3k9J3pm2
$$ plain form
6152 -42 -4 15 4 17 -6 -26 8 28 12 -7 2 -22 20 25 -9 5 12 -31 -3 52 -2 -3 5 -43 -17 53 20 -30 7 -12 -19 34 18
6185 18 -31 4 -8 -32 4 19 -16 -7 -5 -18 8 25 4 -24 -25 -13 0 9 -17 -1 -12 -9 10 18 -7 -6 -13 -36 9 38 -11 -7 -4 -40 7
6220 7 25 -13 -18 22 -24 -6 37 1 -10 23 -14 -19 44 7 -23 -10 -3 -6 35 19 -31 -3 2 -16 18 2 -13 -3 -7 -20 18 27 -19 -24 -15
6255 -15 -12 27 20 -26 -18 -7 -7 14 11 -2 -1 6 -21 10 21 -5 2 3 -27 25 35 -18 -21 18 -20 7 30 -12 -14 26 -1 -15 57 13 -16 24
6291 24 -6 -13 29 22 -22 7 -2 -6 14 26 -18 -1 14 -12 -3 5 -6 -22 -5 4 10 6 -11 -8 -15 -11 3 0 -17 9 5 -21 0 5 -17 -2 -4 -25
6329 -25 -11 24 -3 -16 5 0 -7 24 -7 -21 16 0 -26 16 4 -15 19 -7 -15 0 13 -14 19 -4 -14 14 11 -18 5 14 0 -8 13
6362 13 16 7 6 -22 0 23 0 13 17 -14 -3 2 1 7 4 -10 -21 7 -8 21 7 -41 -19 10 0 -5 0 -27 -23 25 6 0 15 -12 -25 9
6398 9 21 -13 17 11 -27 2 46 6 7 2 -27 13 42 8 0 5 -11 -23 18 22 4 -22 -16 -13 24 25 10 -17 -29 -10 10 -2 -1 -2 -33 -21
$$ packed form
6152d2L8J9j1J3k3k0L4K0j6j9Rk4M2Nl4J4Pm3K8N5n4jQm8K6P0l3n0L7j9pN3j6
6185A8m9L5j2k4L6J5l5RKj3K6J7k1k8jJ2J3Rk6J6j1LJ9Qk5Jpk3M5K9m9MLl6M7
6220GJ8l8nM0m6J8M3l6j1L3l7nO3l7l0J3PlM1j6n0K8Nj8L4j6j5J0mj3L8Rm6nR
6255a5LL9pm6QJ1%K1lj3JPk7L1J1k6PJl0N2J0n3lL9l8K7K3m2kM0k7j4P2m4k9M0
6291B4l0pM2pm4K9rmK0J2m4J7J5k6RQj1j6J7ROmj7LpMJ4lj7K6mk6K1Nk2J5kk1
6329b5J4L5k7j3K1npL1l1j4L7j6k6M2j2j9L4k6qJ5J3k7L3k3j0K8lk9K3Rj4qK1
6362A3Lrjk8K2K3k3J3Ml1J1NjOlj4j1K8j5K9j4m8K2K9j0nNk7MM8j9oJ5k7j3L4
6398IJ2l4L0ol8K9M4m0Jnk9M0K9l4qNj6j2M1Mj8k6OLL7Jj5k7j2J9K0j2Jjl1J2
$$ plain form
6434 -21 25 16 11 8 -23 -33 26 36 -6 -9 -26 -29 19 34 -8 -16 -6 -25 -1 29 8 1 -14 -29 -1 45 17 -10 -39 -36 14 33 3 -10
6468 -10 -14 -16 0 39 16 7 2 -28 -4 34 41 -6 -14 -18 -7 49 34 -11 -21 -15 -3 29 25 -15 -15 -16 -16 11 35 -3 -25 -29 -20 14 46 -20 -22 -18
$$ packed form
6434b1M6rnll1j0N9J0m2lj7lM8J5m2qJ0j9K4L0k1pj5j5K8M6k8k7k9LN0J9l0j3
6468a0mkJ6L9k3rnl0K4L8Pm7qmJ1N6j5m5j0OJ2L2mm0%j%K7K4l8k2mRL4L2o6kM
$$ [...]
8191a
##END NTUPLES=NMR FID
##END=
