##TITLE=1H_LY-835-1
 CCl4, 8 sc, 
 5.6.2019
##JCAMPDX= 6.0         $$ Bruker NMR JCAMP-DX V2.0
##DATA TYPE= NMR FID
##DATA CLASS= NTUPLES
##ORIGIN= UXNMR, Bruker Analytische Messtechnik GmbH
##OWNER= root
$$ XWIN-NMR		Version 3.5
$$ Wed Jun  5 16:06:40 2019 Russian Standard Time (UT+4h)  she@DPX200
##.OBSERVE FREQUENCY= 200.13155
##.OBSERVE NUCLEUS= ^1H
##.DELAY= (6, 6)
##.ACQUISITION MODE= SIMULTANEOUS
##.ACQUISITION SCHEME= undefined
##.AVERAGES= 8
##.DIGITISER RES= 18
##SPECTROMETER/DATA SYSTEM= spect
##.PULSE SEQUENCE= zg30
##.SOLVENT NAME= CDCl3
##.SHIFT REFERENCE= (INTERNAL, CDCl3, 0, 15.7039)
##AUDIT TRAIL= $$ (NUMBER, WHEN, WHO, WHERE, WHAT)
$$ ##TITLE= Audit trail, XWIN-NMR		Version 3.5
$$ ##JCAMPDX= 5.01
$$ ##ORIGIN= Bruker BioSpin GmbH
$$ ##OWNER= she
$$ F:/spectra/data/she/nmr/H-F/1/audita.txt
$$ ##AUDIT TRAIL=  $$ (NUMBER, WHEN, WHO, WHERE, WHAT)
(   1,<2019-06-05 16:05:12.17 +0400>,<she>,<DPX200>,
      <created by zg, POWCHK disabled, PULCHK disabled
       configuration hash MD5:
       00 E9 B6 7A A2 85 ED C7 34 08 36 98 17 FE 4E 26
       data hash MD5: 16K
       75 12 8D C9 69 D9 64 D3 A4 FC D2 07 6D 0A D3 C0>)
$$ ##END=
$$ 
$$ hash MD5
$$ EF 47 6B 2A 23 10 B3 AD C4 10 71 79 FD 12 18 D8
##$RELAX= 
##$RELAX= 
##$RELAX= 
##$RELAX= 
##$RELAX= 
##$RELAX= 
$$ Bruker specific parameters
$$ --------------------------
##$DU= <F:/spectra>
##$EXPNO= 1
##$NAME= <H-F>
##$PROCNO= 1
##$TYPE= <nmr>
##$USER= <she>
##$AMP= (0..31)
100 100 100 100 100 100 100 100 100 100 100 100 100 100 100 100 100 100 
100 100 100 100 100 100 100 100 100 100 100 100 100 100 
##$AQSEQ= 0
##$AQ_mod= 1
##$AUNM= <au_zg>
##$AUTOPOS= <>
##$BF1= 200.13
##$BF2= 200.13
##$BF3= 200.13
##$BF4= 200.13
##$BF5= 200.13
##$BF6= 200.13
##$BF7= 200.13
##$BF8= 200.13
##$BYTORDA= 1
##$CFDGTYP= 0
##$CFRGTYP= 5
##$CHEMSTR= <none>
##$CNST= (0..31)
1 1 145 1 1 1 1 1 1 1 1 1 1 1 1 1 1 1 1 1 1 1 1 1 1 1 1 1 1 1 1 1 
##$CPDPRG= <>
##$CPDPRG1= <>
##$CPDPRG2= <>
##$CPDPRG3= <>
##$CPDPRG4= <mlev>
##$CPDPRG5= <mlev>
##$CPDPRG6= <mlev>
##$CPDPRG7= <mlev>
##$CPDPRG8= <mlev>
##$CPDPRGB= <>
##$CPDPRGT= <>
##$D= (0..31)
0 1.2 0 0 0 0 0 0 0 0 0 0.03 0 0 0 0 0 0 0 0 0 0 0 0 0 0 0 0 0 0 0 0 
##$DATE= 1559736311
##$DBL= (0..7)
120 120 120 120 120 120 120 120 
##$DBP= (0..7)
150 150 150 150 150 150 150 150 
##$DBP07= 0
##$DBPNAM0= <>
##$DBPNAM1= <>
##$DBPNAM2= <>
##$DBPNAM3= <>
##$DBPNAM4= <>
##$DBPNAM5= <>
##$DBPNAM6= <>
##$DBPNAM7= <>
##$DBPOAL= (0..7)
0.5 0.5 0.5 0.5 0.5 0.5 0.5 0.5 
##$DBPOFFS= (0..7)
0 0 0 0 0 0 0 0 
##$DE= 6
##$DECBNUC= <off>
##$DECIM= 24
##$DECNUC= <off>
##$DECSTAT= 4
##$DIGMOD= 1
##$DIGTYP= 9
##$DL= (0..7)
0 120 120 120 120 120 120 120 
##$DP= (0..7)
150 150 150 150 150 150 150 150 
##$DP07= 0
##$DPNAME0= <>
##$DPNAME1= <>
##$DPNAME2= <>
##$DPNAME3= <>
##$DPNAME4= <>
##$DPNAME5= <>
##$DPNAME6= <>
##$DPNAME7= <>
##$DPOAL= (0..7)
0.5 0.5 0.5 0.5 0.5 0.5 0.5 0.5 
##$DPOFFS= (0..7)
0 0 0 0 0 0 0 0 
##$DQDMODE= 0
##$DR= 18
##$DS= 0
##$DSLIST= <SSSSSSSSSSSSSSS>
##$DSPFIRM= 0
$$ [...]
##$SUBNAM2= <"">
##$SUBNAM3= <"">
##$SUBNAM4= <"">
##$SUBNAM5= <"">
##$SUBNAM6= <"">
##$SUBNAM7= <"">
##$SUBNAM8= <"">
##$SUBNAM9= <"">
##$SW= 24.9336996594482
##$SWIBOX= (0..15)
0 0 2 0 0 0 0 0 0 0 0 0 0 0 0 0 
##$SW_h= 4990.01996007984
##$TD= 16384
##$TD0= 1
##$TE= 0
##$TE2= 300
##$TE3= 300
##$TEG= 300
##$TL= (0..7)
0 120 120 120 120 120 120 120 
##$TP= (0..7)
150 150 150 150 150 150 150 150 
##$TP07= 0
##$TPNAME0= <>
##$TPNAME1= <>
##$TPNAME2= <>
##$TPNAME3= <>
##$TPNAME4= <>
##$TPNAME5= <>
##$TPNAME6= <>
##$TPNAME7= <>
##$TPOAL= (0..7)
0.5 0.5 0.5 0.5 0.5 0.5 0.5 0.5 
##$TPOFFS= (0..7)
0 0 0 0 0 0 0 0 
##$TUNHIN= 0
##$TUNHOUT= 0
##$TUNXOUT= 0
##$USERA1= <user>
##$USERA2= <user>
##$USERA3= <user>
##$USERA4= <user>
##$USERA5= <user>
##$V9= 5
##$VALIST= <valist>
##$VCLIST= <CCCCCCCCCCCCCCC>
##$VD= 0
##$VDLIST= <DDDDDDDDDDDDDDD>
##$VPLIST= <PPPPPPPPPPPPPPP>
##$VTLIST= <TTTTTTTTTTTTTTT>
##$WBST= 1024
##$WBSW= 4
##$XGAIN= (0..3)
0 0 0 0 
##$XL= 0
##$YL= 0
##$YMAX_a= 52414
##$YMIN_a= -68124
##$ZGOPTNS= <>
##$ZL1= 120
##$ZL2= 120
##$ZL3= 120
##$ZL4= 120
##$ABSF1= 10
##$ABSF2= 0
##$ABSG= 5
##$ABSL= 3
##$ALPHA= 0
##$AQORDER= 0
##$ASSFAC= 0
##$ASSFACI= 0
##$ASSFACX= 0
##$ASSWID= 0
##$AUNMP= <proc_1d>
##$AZFE= 0.1
##$AZFW= 0.1
##$BCFW= 1
##$BC_mod= 2
##$BYTORDP= 1
##$COROFFS= 0
##$CY= 11.3945322036743
##$DATMOD= 1
##$DC= 2
##$DFILT= <>
##$DTYPP= 0
##$F1P= 18.9103706918063
##$F2P= -1.10871071338519
##$FCOR= 0.5
##$FTSIZE= 0
##$FT_mod= 4
##$GAMMA= 1
##$GB= 0.15
##$INTBC= 1
##$INTSCL= 1
##$ISEN= 128
##$LB= 0.24
##$LEV0= 0
##$LPBIN= 0
##$MAXI= 10000
##$MC2= 0
##$MEAN= 0
##$ME_mod= 0
##$MI= 1.114404
##$NCOEF= 0
##$NC_proc= 0
##$NLEV= 6
##$NOISF1= 3.799351
##$NOISF2= 2.8
##$NSP= 1
##$NTH_PI= 0
##$NZP= 0
##$OFFSET= 15.70392
##$PC= 1
##$PHC0= -8573.4
##$PHC1= 12.2002
##$PH_mod= 1
##$PKNL= yes
##$PPARMOD= 0
##$PSCAL= 0
##$PSIGN= 0
##$REVERSE= no
##$SF= 200.130013532006
##$SI= 16384
##$SIGF1= 3
##$SIGF2= 2
##$SINO= 400
##$SIOLD= 16384
##$SREGLST= <1H.CDCl3>
##$SSB= 0
##$STSI= 0
##$STSR= 0
##$SW_p= 3612.71676300578
##$SYMM= 0
##$S_DEV= 0
##$TDeff= 0
##$TDoff= 0
##$TI= <>
##$TILT= no
##$TM1= 0
##$TM2= 0
##$TOPLEV= 0
##$USERP1= <user>
##$USERP2= <user>
##$USERP3= <user>
##$USERP4= <user>
##$USERP5= <user>
##$WDW= 1
##$XDIM= 8192
##$YMAX_p= 0
##$YMIN_p= 0
$$ End of Bruker specific parameters
$$ ---------------------------------
##NTUPLES= NMR FID
##VAR_NAME=  TIME,          FID/REAL,        FID/IMAG
##SYMBOL=    X,             R,               I
##VAR_TYPE=  INDEPENDENT,   DEPENDENT,       DEPENDENT
##VAR_FORM=  AFFN,          ASDF,            ASDF
##VAR_DIM=   8192,          8192,            8192
##UNITS=     SECONDS,       ARBITRARY UNITS, ARBITRARY UNITS
##FACTOR=    0.0002004,     1,               1
##FIRST=     0,             0,               0
##LAST=      1.6414764,     0,               0
##MIN=       0,             -68124,          0
##MAX=       1.6414764,     52414,           0
$$ Real data points
##PAGE= N=1
##DATA TABLE= (X++(R..R)), XYDATA
0 0 0 0 0 0 0 0 0 0 0 0 0 0 0 0 0 5 -8 8 -8 8 -8 8 -8 14 -16 16 -16 21 -24 24 -29 32 -37 40 -45 48 -54 61 -68
39 -68 74 -81 91 -101 110 -123 136 -152 172 -192 219 -250 291 -343 410 -505 645 -863 1251 -2056
59 -2056 4327 -21892 -68124 37673 8530 -34739 52414 7358 -60484 19526 18962 -23071 23431
72 23431 4257 -30357 14880 8133 -11858 11356 -10682 -11731 27996 1274 -19108 5692 -8595
85 -8595 -8318 28329 11812 -23916 -13309 6023 2915 4887 19449 -4788 -36792 7056 29436
98 29436 -18055 2850 23681 -37034 -7555 45776 -21910 -21374 34862 -16837 -14664 38341 -18670
111 -18670 -26800 28462 -5299 -3342 27424 -28027 -18704 28762 -11071 4866 30426 -39388 -17752
124 -17752 40152 -15544 -6615 36585 -30073 -25600 39983 -4629 -20665 24842 -6703 -21469
136 -21469 20856 6688 -17510 1118 6724 67 889 1293 -3175 -10247 3698 16359 -4400 -8369
150 -8369 3074 -8263 1508 15635 -4954 -5264 810 -10155 10324 11010 -17096 5702 7721 -21335
164 -21335 14977 16270 -31694 7636 23856 -27890 5638 24864 -31921 -1601 31542 -19815
176 -19815 -5900 21155 -20226 -5033 23949 -10093 -6311 9826 -11626 2204 12440 -10666
188 -10666 917 5747 -11773 6870 9283 -13782 1725 8553 -9074 2333 7762 -8489 -3263
201 -3263 7014 1836 -3693 -2202 3359 -1534 -3644 9765 -861 -14314 9211 7228 -12992 8120
215 8120 5987 -18246 6881 12946 -13050 3033 5991 -14086 6989 9918 -11740 3709 2551
228 2551 -11409 11384 4960 -15107 8195 3592 -13616 12889 5704 -18808 7124 8925 -12335
241 -12335 7361 6592 -15846 2294 11072 -5393 61 2201 -7002 880 5964 591 -1461 -3979
255 -3979 -980 3617 613 1606 -436 -6443 1461 5616 -1168 -3 -2151 -4392 5233 3050 -3043
270 -3043 1757 -4532 -3853 10374 245 -7114 5226 -4144 -6126 13566 797 -11807 5549 -110
284 -110 -6461 11489 1320 -12347 4126 2900 -4249 7289 -259 -9200 3610 2527 -1737 5259
298 5259 -3086 -7031 5013 2455 -1496 3260 -3984 -5233 5790 3212 -2441 43 -2329 -2309 3735
313 3735 3388 -1227 -3589 -1745 2025 1907 1717 367 -5597 -2004 6011 1158 -1468 886 -4842 -1644
329 -1644 7174 431 -3070 921 -3999 -620 7354 -730 -3851 977 -3284 779 7362 -2701 -4939
344 -4939 2197 -1557 888 6203 -3535 -5360 2860 383 679 4302 -3414 -5171 2531 2434 1157 1354
360 1354 -3721 -3421 2681 3154 882 -1182 -3414 -1157 2685 2774 329 -2715 -2756 601 2724 2506 -775
377 -775 -4277 -1349 2856 2280 1218 -1860 -4701 561 4429 920 -315 -1950 -4205 1704 5164 -81
393 -81 -1829 -2077 -2952 2984 5118 -1563 -3260 -1514 -784 3732 3611 -3010 -3452 -279 865 3468 2010
410 2010 -3704 -3282 813 2471 2866 -87 -4181 -2363 2225 3496 1273 -2352 -3469 -494 2894 3174
426 3174 -324 -3561 -2181 1118 2960 2443 -1702 -4263 -637 2837 2653 828 -3080 -3774 1497 3715
442 3715 1165 -884 -3191 -2356 2882 3457 -296 -1945 -2795 -813 3780 2737 -1744 -2789 -1853 1178
458 1178 4001 898 -3026 -2317 -247 2258 3022 -832 -3172 -1261 852 2625 1876 -2137 -2935 -119
474 -119 1905 2597 123 -3231 -1706 1379 2132 1590 -1439 -3193 94 2132 1329 631 -1990 -2715 1339
491 1339 2479 503 -432 -2350 -1582 2618 2120 -840 -1244 -1818 -8 3071 673 -1840 -829 -926 706
508 706 2770 -412 -2264 -324 -39 1222 1995 -1482 -2290 436 1073 1344 304 -2270 -939 1202 905
525 905 1108 -721 -2467 496 1493 92 975 -1027 -2510 1547 1784 -818 212 -1015 -1385 2450 923
542 923 -1975 16 -447 -63 2728 -615 -2631 671 -160 418 3112 -1544 -3345 1249 561 481 2530
559 2530 -2026 -3142 1828 1199 -57 794 -1762 -1117 1937 395 -361 -390 -1686 1109 2331 -856 -910
576 -910 -1167 -1599 2908 2947 -1957 -1971 -1354 -451 3581 1971 -2167 -1549 -1551 364 3615 -81 -1953 429
594 429 -1714 301 3820 -2242 -2732 3008 -180 -454 2563 -3634 -2946 4713 1566 -877 537 -4138
610 -4138 -1964 4742 1859 25 -549 -5009 -567 4807 568 187 -177 -4673 572 4543 -1460 -1002
626 -1002 1131 -2098 892 2630 -2392 -1782 963 1053 2326 -253 -3341 -1315 -97 2860 4600 -2613
642 -2613 -4884 297 -74 2214 5077 -2785 -4853 1185 72 1157 3609 -2400 -2595 1602 -611 1017
658 1017 1387 -3661 887 3682 -2449 -48 500 -4810 2807 6077 -3429 -1795 567 -4438 2406 6525
674 6525 -2196 -2689 -629 -2762 2564 4151 -1486 -1216 -1526 -1608 3431 812 -2532 1667 -526 -1857
690 -1857 3323 -746 -3732 2481 1376 -835 1821 -2005 -3215 1881 1873 1631 367 -4262 -889 2293
706 2293 -471 2868 1341 -5852 161 3526 -2555 1894 2703 -5220 39 3890 -2576 92 1783
721 1783 -2678 1381 1994 -2662 406 -32 -1532 3731 200 -3717 2002 -707 -2519 5104 595 -4820
737 -4820 1900 280 -2502 3790 766 -3673 1018 392 -848 1833 -817 -759 1261 -1709 740 2107
753 2107 -3220 321 2903 -2954 532 2753 -3884 -18 3652 -2347 -291 1868 -2501 472 1761
768 1761 -1653 1126 17 -2335 2427 66 -2470 3208 -689 -3599 4037 311 -4028 3416 490
783 490 -3858 3051 834 -3256 2242 511 -2302 1740 -98 -985 1647 -1504 -322 2315 -2234 -103
799 -103 2743 -2867 -288 3199 -2706 -411 3116 -2609 -790 2745 -1548 -303 1342 -1668 636
814 636 834 -1571 1500 -135 -2200 2591 -104 -2782 3030 -106 -3363 3314 579 -3601 2360 551
830 551 -2575 2627 290 -2719 1530 -63 -843 2273 -1205 -1217 1846 -1912 -38 3394 -2392 -1248
846 -1248 2764 -2350 -567 3576 -2087 -1306 2768 -1608 -1080 1982 -1027 40 1388 -1382 112 147
862 147 -1548 1895 963 -1836 1256 -689 -2672 2807 1459 -2174 1289 -428 -2629 1953 995 -1063
878 -1063 1496 -849 -1761 1346 -554 6 2300 -1647 -848 1847 -2404 -512 3478 -1253 -737 2046
894 2046 -2866 -1274 3271 -484 -287 1812 -2318 -1438 1592 -273 1140 1444 -2195 -570 449 -1269
910 -1269 1789 1604 -1799 408 -44 -2496 1346 1950 -897 740 -185 -2341 405 889 138 1575 -383
927 -383 -1690 -57 -780 553 2462 -680 -983 590 -1978 -404 2587 -220 -111 1031 -2386 -1141
943 -1141 1846 -41 710 1312 -1994 -1025 474 -734 1634 1775 -1763 -547 -54 -1589 1542 1853 -1320
960 -1320 278 132 -2255 550 1598 -450 826 234 -1928 -128 473 -144 1456 527 -1233 -470 -831
977 -831 -141 1940 537 -738 -129 -1255 -539 1504 408 34 367 -1323 -719 877 12 453 642 -961
995 -961 -160 207 -1046 598 1200 -559 219 -116 -1707 476 1307 -382 618 109 -1899 -6 1050
1012 1050 -60 842 103 -1637 -1 680 -211 654 168 -872 214 37 -517 613 210 -399 456 -135
1030 -135 -610 233 -47 116 821 -284 -762 -51 -97 532 718 -560 -436 34 -388 518 691 -594 -143
1049 -143 66 -556 614 561 -884 16 420 -447 373 193 -903 328 581 -538 189 108 -777 367 510
1068 510 -391 250 -92 -774 515 574 -434 20 -144 -420 598 320 -529 14 7 -205 366 156 -264 -52
1088 -52 -127 56 349 -25 -177 -149 -118 437 141 -480 99 116 -215 429 -16 -596 386 126 -403 576 -15 -825
1110 -825 409 268 -352 595 -187 -940 637 409 -570 418 -33 -792 566 319 -611 426 100 -766 395
1129 395 437 -488 94 105 -368 318 254 -448 -86 247 -4 -7 42 -91 -153 81 200 -99 -1 144 -371 -1 601
1152 601 -262 -314 394 -301 -64 690 -509 -405 770 -362 -354 837 -427 -513 810 -367 -379 949 -513
1171 -513 -684 967 -138 -540 711 -400 -543 902 -179 -617 687 -167 -579 618 46 -459 346
1188 346 -69 -395 423 200 -433 -40 260 -89 -108 210 -110 -293 377 67 -534 432 240 -816 445 542
1208 542 -869 332 510 -1038 534 825 -1297 287 984 -1214 269 1041 -1314 192 1125 -1333
1224 -1333 126 1275 -1284 -111 1253 -1001 -89 1061 -1073 -136 1208 -786 -371 892 -577 -297
1240 -297 796 -348 -342 482 -244 -401 420 251 -414 -120 362 -192 -228 581 -265 -560 843 -167 -905 1047
1260 1047 51 -1189 1090 162 -1352 1210 192 -1586 1405 424 -1862 1272 551 -1797 1372 579
1276 579 -2029 1321 757 -2039 1213 908 -1998 926 901 -1760 913 889 -1751 638 1014 -1349 351
1293 351 777 -1058 240 684 -753 46 533 -447 -214 367 78 -325 2 366 -392 -80 711 -686 -360
1312 -360 1267 -720 -750 1549 -776 -1010 1883 -733 -1270 2126 -837 -1644 2446 -473 -1858 2280
1328 2280 -536 -1930 2459 -355 -2043 2371 -244 -2130 2177 -71 -1930 2033 -106 -1883 1875
1343 1875 -21 -1816 1636 240 -1510 1172 91 -1289 1019 375 -978 438 289 -591 55 394
1359 394 45 -357 25 315 -578 188 872 -1087 -204 1327 -1121 -321 1624 -1337 -468 1892 -1513 -535
1377 -535 2247 -1691 -776 2460 -1662 -845 2563 -1768 -872 2804 -1861 -1238 2891 -1491 -1175 2713
1393 2713 -1567 -1396 2620 -1130 -1159 2413 -1108 -1445 1889 -577 -764 1655 -732 -982 1114 -388
1409 -388 -454 916 -168 -335 150 -305 -13 150 249 288 -595 -21 275 -981 657 1245 -1315 107 716
1428 716 -1962 754 1998 -1884 291 1452 -2728 244 2449 -1918 435 1962 -2955 -155 2377
1443 2377 -2041 482 2443 -2543 -467 1751 -2147 643 2702 -2018 -482 1266 -2212 307 2485
1458 2485 -1078 -123 812 -2135 -252 1842 -160 221 428 -1331 -573 388 322 814 242 -348 -587 -1134
1476 -1134 451 1176 -176 705 55 -2189 112 967 -608 1763 822 -2773 -11 631 -1423 2208
1492 2208 1573 -2566 341 199 -2566 2110 2212 -2140 792 274 -3255 1315 2085 -1545 1487 763
1508 763 -3366 183 1435 -900 1880 1133 -2613 -406 312 -867 1833 1503 -1283 -581 -761 -957 1383
1525 1383 1281 23 -92 -1123 -933 276 462 1268 648 -1156 -548 -643 -742 1819 1095 -897 481 -1014
1543 -1014 -2151 1670 1333 -602 1431 -831 -2865 1285 904 -764 2238 -62 -2823 728 109 -1047
1559 -1047 2584 559 -2222 682 -495 -1626 2173 975 -1141 933 -911 -2067 1458 992 -287
1574 -287 1141 -744 -1829 481 332 339 1378 -382 -1209 -280 -389 625 1120 -169 -84 -418 -1096 454
1592 454 588 -13 1000 -375 -1466 464 -44 -328 1652 -59 -1291 543 -748 -748 2040 140 -1107
1609 -1107 837 -956 -1072 1827 19 -765 1283 -908 -1316 1420 -125 -521 1398 -693 -1039 1043
1625 1043 -528 -449 1396 -343 -645 587 -786 -206 1183 -321 -194 437 -825 -85 676 -296 316
1642 316 225 -871 188 344 -364 555 -10 -664 594 -101 -580 812 -94 -573 752 -356 -533 953
1660 953 -384 -512 970 -515 -545 934 -492 -300 974 -770 -442 1044 -527 -227 830 -799 -229
1677 -229 892 -641 -16 832 -860 -193 716 -574 209 616 -857 64 536 -674 276 522 -610 272
1695 272 177 -713 449 342 -497 430 11 -621 410 -14 -269 731 -175 -599 433 -218 -127 749 -357
1714 -357 -305 534 -550 -157 788 -381 -58 489 -756 -2 704 -579 136 618 -760 11 429 -677
1732 -677 408 593 -826 141 356 -738 411 467 -670 343 151 -840 455 381 -564 412 45 -652
1750 -652 460 86 -488 544 31 -526 350 -108 -253 531 -189 -303 429 -248 -178 419 -235 3 329 -481
1770 -481 43 421 -409 130 273 -506 290 247 -609 397 270 -637 364 167 -598 520 92 -702 587
1789 587 119 -714 556 100 -618 564 -52 -614 663 -10 -608 528 -62 -469 536 -128 -382 546
1807 546 -201 -396 472 -129 -174 349 -285 -89 340 -305 -4 316 -261 92 92 -389 313 193 -397 318 43
1828 43 -445 396 2 -364 583 -103 -570 548 -34 -385 610 -200 -466 611 -258 -429 712 -189 -409
1847 -409 529 -310 -269 631 -315 -253 556 -333 -229 429 -307 -17 402 -450 -29 353 -360 96 232 -370 210
1868 210 91 -465 343 131 -414 347 -49 -387 494 -148 -416 588 -155 -436 559 -243 -330 656 -336 -359
1888 -359 733 -344 -370 665 -322 -220 621 -461 -208 646 -416 -162 552 -386 -79 404 -426 83 402
1907 402 -439 46 256 -316 224 89 -380 329 -6 -365 401 -91 -284 448 -314 -248 660 -398 -295 664
1927 664 -463 -194 724 -615 -176 831 -677 -203 869 -671 -161 809 -727 -74 846 -786 -98
1944 -98 850 -699 -77 693 -689 54 661 -710 35 582 -587 95 419 -476 175 216 -473 256 182 -346
1964 -346 218 -87 -180 424 -246 -175 440 -403 -58 494 -533 67 519 -787 171 694 -845 156 584
1983 584 -940 375 695 -1094 329 704 -1120 422 744 -1108 420 605 -1186 565 717 -1164
1999 -1164 426 568 -1047 518 490 -1002 557 439 -940 465 332 -720 497 207 -584 449 -15
2016 -15 -493 507 48 -218 294 -380 -85 473 -307 129 309 -640 204 331 -633 562 299 -969 525
2035 525 289 -921 755 239 -1040 901 183 -1270 887 258 -1070 1109 109 -1338 935 63
2051 63 -1069 1319 156 -1344 797 -54 -909 1302 63 -1111 795 -191 -822 1057 35 -645 701
2068 701 -376 -600 765 -145 -229 617 -355 -231 240 -493 291 605 -368 128 -158 -734 638 327 -378
2087 -378 697 -397 -1018 846 77 -394 1131 -578 -1079 1100 -313 -647 1418 -467 -930 1207 -696
2104 -696 -850 1559 -422 -731 1362 -837 -1018 1323 -403 -334 1475 -908 -1100 1035 -398 -113 1343
2121 1343 -746 -774 639 -584 36 1125 -471 -365 258 -616 193 579 -329 282 94 -593 205 -96
2139 -96 -175 863 -143 -503 427 -684 -253 1206 -318 -224 712 -1241 -367 1461 -540 -105 997 -1390
2157 -1390 -354 1418 -885 -4 1328 -1335 -357 1239 -1100 15 1355 -1170 -133 1133 -1294
2172 -1294 -129 1248 -819 112 850 -1306 -124 970 -616 293 657 -1005 -122 457 -394 503 356
2189 356 -691 47 27 -214 513 -109 -252 399 -443 -155 565 -476 97 631 -793 76 620 -929 304
2208 304 879 -975 218 568 -1228 529 957 -1202 362 674 -1371 547 901 -1247 512 666 -1424
2225 -1424 555 833 -1215 460 607 -1181 565 584 -1097 488 487 -954 485 335 -791 484 168
2242 168 -678 524 114 -552 405 -42 -305 443 -211 -211 410 -295 -33 349 -415 155 295 -629 336 377 -730
2263 -730 366 260 -788 621 297 -947 626 256 -969 740 305 -993 699 147 -979 906
2279 906 195 -1072 714 141 -855 893 28 -990 788 56 -779 852 -15 -866 664 -14 -525 735
2297 735 -205 -638 571 -51 -298 442 -318 -213 509 -240 -72 283 -428 121 418 -333 144 14 -623 451
2317 451 448 -392 228 -231 -650 739 283 -486 454 -317 -693 824 103 -457 658 -396 -665 888 -119
2336 -119 -600 746 -221 -455 780 -467 -669 838 -45 -238 650 -660 -649 689 -9 97 614 -812
2354 -812 -651 528 9 302 499 -775 -388 365 -170 301 382 -496 -18 130 -375 256 117 -306 453 93
2374 93 -505 45 -271 -94 972 75 -636 -48 -522 -35 1148 59 -464 20 -756 -123 1149 41 -278
2393 -278 154 -751 -122 842 -254 -93 505 -519 -157 400 -572 64 738 -246 -31 65 -850 5 789 100
2413 100 203 -209 -1044 8 675 226 373 -266 -888 50 282 104 530 -171 -610 139 -36 -90 466 -148
2433 -148 -178 430 -305 -416 242 -98 256 614 -490 -518 88 -221 439 777 -441 -463 -78 -382 525 780
2453 780 -420 -311 -49 -426 365 495 -346 43 68 -439 163 163 -280 276 130 -297 126 -201 -375 453 265
2474 265 -121 59 -466 -324 539 166 -23 176 -502 -299 414 4 101 269 -519 -201 371 -177 71 294
2494 294 -398 18 305 -417 35 357 -263 95 232 -416 23 243 -236 228 234 -387 -32 119 -143 259 98
2515 98 -317 68 20 -153 229 19 -113 104 -171 -100 255 -71 -50 110 -233 37 208 -221 86 163 -358 68
2537 68 242 -259 156 86 -453 221 278 -361 120 108 -404 282 216 -413 167 111 -403 299 210 -429 95 76 -248
2560 -248 359 95 -480 66 155 -93 258 -29 -383 59 127 42 198 -115 -298 -13 103 206 79 -283 -134
2581 -134 70 82 236 -109 -349 145 106 -64 243 -205 -392 326 136 -121 234 -353 -442 551 204 -270 134
2602 134 -379 -336 682 134 -382 141 -272 -245 651 78 -419 91 -215 -100 618 -41 -489 44 -16 108 424
2623 424 -229 -429 100 124 179 180 -280 -298 45 217 316 -42 -379 -136 64 294 323 -362 -392 159 64 200 285
2646 285 -493 -316 394 -3 118 277 -624 -272 610 15 -25 151 -666 -92 764 -113 -233 131 -528 27
2666 27 744 -200 -323 95 -374 127 685 -243 -428 13 -138 262 442 -353 -387 63 94 278 145 -308 -231
2687 -231 4 218 331 -121 -309 -91 -18 392 320 -457 -272 162 -47 367 224 -667 -110 369 -146 310 206
2708 206 -774 -13 522 -184 233 110 -821 148 677 -303 21 64 -680 258 640 -385 -101 80 -497 277
2728 277 563 -365 -192 12 -247 352 385 -384 -245 23 30 316 77 -310 -143 -6 185 247 -129 -187 -103 -72
2750 -72 404 180 -403 -45 27 -111 513 30 -650 179 202 -295 492 67 -760 285 299 -378 442 26 -809
2771 -809 372 418 -405 268 -36 -651 472 339 -465 198 -7 -508 459 266 -444 151 -31 -365 437 224
2791 224 -427 7 47 -95 244 40 -218 -33 5 127 73 -140 49 -62 -151 344 58 -356 183 0 -225
2812 -225 440 -28 -444 331 34 -298 431 -95 -407 459 -101 -365 557 -176 -473 589 -123 -456 607
2831 607 -152 -511 627 -74 -550 526 6 -447 410 -71 -378 403 -20 -301 234 -100 -127 264 -129 -75
2851 -75 187 -237 29 251 -215 -48 83 -148 169 91 -278 20 -2 23 319 -218 -279 264 -195 11 598 -402
2873 -402 -438 463 -208 -73 708 -445 -554 579 -69 -172 516 -376 -343 572 -139 -172 342 -400 -65 616
2893 616 -263 -185 190 -525 168 794 -342 -395 86 -369 247 712 -264 -422 -75 -166 293 386 -135 -176 -285
2914 -285 -44 494 -45 -281 174 -157 -3 472 -406 -450 484 116 59 286 -649 -444 512 222 340 177 -958
2935 -958 -330 577 112 442 202 -1071 -173 691 -179 242 355 -774 -66 598 -331 -54 261 -342 232
2954 232 395 -489 -301 -20 84 731 152 -753 -337 -152 189 950 116 -790 -324 -220 155 861 112 -574
2974 -574 -275 -225 225 486 -222 -123 139 -271 155 113 -624 234 650 -255 46 -86 -909 255 970 18 -38
2995 -38 -341 -953 294 920 137 63 -451 -805 372 527 -20 331 -267 -671 400 180 -335 336 30 -275
3015 -275 409 -119 -620 168 286 241 337 -470 -624 28 176 586 431 -649 -507 6 -51 640 521 -669
3035 -669 -361 117 -201 368 348 -445 18 140 -339 139 54 -251 437 159 -426 90 -242 -309 785 304 -501
3056 -501 2 -357 -330 797 312 -418 21 -280 -284 539 188 -174 86 -298 -139 342 -132 -44 254 -229 5
3077 5 198 -409 -18 427 -117 36 59 -457 37 310 -56 175 -54 -452 118 135 -63 332 -156 -417 334
3098 334 -3 -267 378 -86 -341 398 -103 -356 379 -25 -259 360 -125 -284 299 -77 -73 343 -264 -212 331
3119 331 -134 -16 268 -343 -83 398 -193 -52 232 -272 -21 285 -170 -15 104 -220 101 143 -176 51
3139 51 -45 -119 284 -65 -313 180 -13 -82 340 -194 -353 247 -20 -37 343 -262 -339 225 -52 74 319 -378
3161 -378 -207 324 -146 37 293 -416 -55 398 -281 -54 274 -364 29 420 -254 -148 108 -230 185 367
3181 367 -261 -179 -40 -109 322 212 -285 -71 -78 -109 354 110 -267 9 -87 -37 310 -53 -245 85 -25 65 170
3204 170 -295 -131 236 -60 111 135 -450 -45 336 -93 136 126 -541 -26 416 -73 74 33 -464 96 348
3225 348 -158 49 5 -348 196 233 -223 85 -38 -282 322 204 -302 13 -8 -116 344 78 -325 7 5 9
3247 9 271 -65 -213 31 -75 121 261 -219 -175 85 -83 188 204 -348 -100 194 -85 136 79 -340 17 169
3269 169 -117 187 2 -374 112 178 -124 170 -68 -363 238 187 -211 100 -70 -261 290 136 -206 62 -89
3290 -89 -151 281 87 -137 25 -175 -22 333 -72 -154 53 -152 63 266 -143 -91 104 -137 96 204 -186
3311 -186 -42 69 -110 195 101 -306 34 107 -107 208 -6 -336 144 114 -136 215 -15 -327 144 97 -92
3332 -92 189 -108 -267 184 59 -78 127 -169 -146 243 -41 -107 137 -161 -89 240 -42 -77 61 -163 18 220
3354 220 -77 -81 -18 -130 152 127 -176 24 -7 -145 192 75 -211 89 -21 -148 262 42 -245 98 -4 -102
3376 -102 240 -77 -222 191 -33 -107 238 -124 -203 220 -70 -95 254 -166 -214 254 -28 -80 161 -170 -110 213
3398 213 -53 -77 96 -140 -25 137 -85 23 31 -169 80 126 -97 39 -30 -126 165 39 -140 84 -40 -82
3420 -82 176 -59 -105 153 -127 -75 240 -107 -107 180 -140 -34 259 -195 -131 244 -143 -44 229 -196 -78 236
3442 236 -181 -31 237 -225 -64 209 -147 -2 154 -215 -7 195 -141 -14 105 -154 28 103 -144 43
3462 43 30 -131 66 38 -86 77 -63 -87 141 -31 -62 83 -96 -8 140 -134 6 158 -189 22 170 -180
3484 -180 39 160 -251 78 214 -282 35 217 -220 56 177 -270 43 195 -210 74 162 -228 49 106 -185
3505 -185 152 105 -257 100 100 -184 114 80 -192 87 38 -173 80 63 -87 32 -29 -43 41 -78 22 93 -104
3528 -104 6 35 -179 106 150 -179 42 80 -226 75 142 -149 98 31 -251 123 94 -175 176 29 -233 187
3550 187 10 -247 278 87 -267 189 16 -278 221 117 -210 153 10 -270 121 104 -67 110 -69 -157 87
3571 87 -35 2 164 -107 -75 62 -143 13 164 -94 -39 47 -119 4 51 -33 129 -21 -163 65 -65 -56 265
3594 265 -60 -217 175 -129 -203 345 26 -228 180 -111 -232 273 44 -161 199 -71 -191 161 -52 -23 238
3615 238 -153 -140 178 -149 -49 281 -110 -88 151 -193 -86 263 -16 -75 69 -125 -42 72 -15 67 1 -119
3637 -119 24 -73 -73 199 -43 -159 153 -89 -193 196 -1 -106 146 -120 -155 153 -51 -38 151 -167 -52 151
3659 151 -195 13 258 -212 -64 212 -210 -29 275 -198 -58 229 -201 -88 214 -63 -16 100 -153 -5
3679 -5 68 -80 71 18 -138 83 -8 -126 168 8 -165 123 19 -131 95 -25 -91 110 -44 -68 80 -85
3701 -85 2 110 -162 20 136 -228 29 207 -219 -17 178 -226 35 218 -227 -50 165 -140 21 128 -151
3722 -151 18 60 -139 114 63 -180 88 21 -130 169 12 -214 132 45 -148 115 -2 -132 103 -6 -75 100
3744 100 -69 -56 98 -79 29 80 -208 10 192 -169 5 125 -212 18 193 -177 -6 116 -191 18 151
3765 151 -131 12 -7 -169 129 78 -165 57 -21 -168 167 31 -190 108 -11 -184 143 42 -155 73 4
3786 4 -57 121 -46 -89 86 -34 32 74 -181 -22 145 -89 56 126 -249 -57 152 -62 104 105 -267 -41 129
3809 129 -46 107 40 -201 50 45 -126 136 16 -181 144 27 -200 99 -21 -144 228 71 -241 -21 -36
3830 -36 -47 238 32 -185 -60 -109 32 233 -14 -103 -41 -195 46 257 -81 -73 42 -133 41 119 -134 24 115
3853 115 -75 27 -24 -182 66 122 -4 114 -145 -314 136 184 32 155 -189 -335 153 159 -3 135 -133 -259
3875 -259 123 57 -30 114 -131 -118 148 -55 -105 67 -79 65 229 -181 -203 50 -28 157 230 -196 -240 -24 0
3898 0 206 188 -183 -178 -81 9 250 90 -193 -27 -19 -32 166 -19 -150 98 39 -61 57 -126 -121 187 97 -14 -22
3923 -22 -262 -62 293 97 -19 -43 -295 -27 319 28 -39 3 -254 -18 259 -36 -64 13 -148 64 175 -159
3945 -159 -79 65 -19 144 31 -272 -46 93 4 149 -13 -280 -47 96 70 130 -81 -248 -3 97 86 53
3967 53 -149 -115 99 28 27 21 -178 -13 164 -21 -14 4 -171 58 210 -72 -69 -45 -119 164 175 -155 -45 11 -87 195
3993 195 100 -214 -18 42 -81 171 76 -247 -6 99 -27 117 -36 -222 46 111 -15 33 -94 -98 108 37 -51
4016 -51 1 -129 -57 151 17 -64 -49 -124 49 155 -26 -102 -73 -56 142 104 -130 -30 -46 -61 189 56 -177 8
4040 8 2 -53 176 2 -217 54 97 -46 100 -88 -198 147 110 -51 28 -139 -156 195 88 -66 19 -140 -114 216
4064 216 75 -117 -35 -98 -18 183 -9 -144 -41 -10 91 86 -92 -84 -36 13 166 9 -193 -66 19 63 166 -67
4088 -67 -246 1 70 48 126 -122 -207 81 68 28 108 -171 -162 175 67 -23 47 -181 -84 274 49 -116 -13 -139
4112 -139 5 270 -16 -171 -27 -65 71 219 -62 -164 -30 -26 133 145 -147 -147 23 49 122 16 -181 -65 51
4135 51 82 88 -97 -164 0 47 86 65 -187 -149 116 64 69 33 -241 -86 205 28 -31 16 -202 -12 222 -30 -58
4160 -58 6 -168 52 240 -69 -119 1 -95 96 211 -135 -120 45 -27 96 114 -158 -97 55 7 96 36 -166 -66
4184 -66 51 38 82 -69 -150 26 72 45 18 -133 -91 77 19 24 11 -159 -41 111 -8 28 1 -188 30 159 -59
4209 -59 -20 4 -151 60 139 -116 -21 25 -125 88 116 -120 8 9 -109 107 89 -150 5 31 -54 86 38 -143
4233 -143 32 36 -62 59 21 -102 8 5 6 45 -56 -56 27 -12 27 21 -99 -3 54 -60 29 30 -114 7 30 -89 58
4260 58 20 -137 31 41 -82 46 1 -137 70 40 -116 69 7 -142 62 37 -93 68 -10 -124 90 53 -83
4283 -83 33 -29 -61 95 15 -45 19 -56 -22 88 -23 -32 3 -62 7 98 -51 -56 -2 -55 58 56 -87 -19 11 -38 78 38
4311 38 -86 11 -17 -58 112 -6 -139 33 6 -44 90 -53 -134 87 28 -57 55 -55 -92 102 15 -50 26 -103
4335 -103 -84 129 26 -69 10 -104 -24 143 -18 -63 22 -47 13 78 -37 -23 10 -31 43 22 -72 -22 -8 4 91 -37
4361 -37 -138 40 43 6 85 -81 -151 65 23 -7 90 -80 -104 63 7 -3 75 -99 -47 117 -45 -71 42 -67 16
4386 16 138 -87 -116 21 -37 52 132 -86 -119 -15 -14 97 115 -101 -94 -13 1 99 28 -91 -7 30 -23 33 -25 -55 77
4413 77 50 -30 -12 -105 -45 137 77 -10 -73 -193 -12 201 53 -22 -54 -174 5 167 -10 -17 -14 -135 7 112 -76
4438 -76 -45 39 -43 37 21 -192 -55 117 44 54 -54 -237 -43 138 77 63 -69 -228 -43 118 98 53 -94 -152
4462 -152 -2 79 41 -5 -66 -5 70 -12 -50 -37 -38 102 120 -78 -107 -81 -34 182 171 -98 -171 -99 -24 204 147 -132 -112
4489 -112 -56 -26 151 75 -131 -20 -2 -39 94 -7 -132 50 91 -20 -9 -105 -122 146 160 -28 -93 -146 -79 161
4513 161 150 -29 -93 -159 -49 148 97 -28 -95 -95 29 109 -7 -52 -41 -11 92 31 -102 -48 6 24 130 -27 -165
4538 -165 -49 31 87 155 -63 -215 -13 80 78 87 -94 -156 41 63 18 46 -98 -109 86 48 -39 -7 -107 -51 150 39
4564 39 -87 -51 -74 38 136 -22 -137 -40 -24 60 103 -64 -110 -44 11 93 64 -101 -91 -4 50 88 -29 -111 -25 37 27
4591 27 60 -55 -90 20 31 35 38 -91 -58 85 37 0 -4 -101 -5 143 10 -64 -26 -75 5 136 -26 -74 -17 -73 36
4618 36 106 -21 -79 -24 -44 53 66 -77 -60 14 -11 25 1 -78 0 35 11 24 -43 -78 17 39 27 5 -105 -86 65 44
4646 44 11 -9 -101 -43 69 1 -9 5 -79 -25 52 -33 -10 15 -54 22 61 -67 -36 28 -6 50 45 -114 -48 28 3 42 22
4675 22 -92 -38 37 -21 36 -1 -90 -22 19 -12 27 -23 -42 34 -1 -33 -2 -34 -9 50 -13 -46 -7 -44 0 61 -15 -31 -26 -50
4705 -50 36 69 -49 -15 9 -44 43 30 -54 17 24 -57 35 54 -60 26 19 -53 34 18 -64 42 38 -33 26 1 -47 44 4 -35
4735 -35 35 -17 -46 38 -1 -22 25 -18 -36 37 -1 -20 20 -20 -9 14 -40 -4 25 -49 -12 11 -42 18 5 -63 9 22 -46 14
4765 14 -6 -58 22 -9 -45 33 0 -51 36 -4 -36 19 -21 -46 59 -1 -60 17 -18 -37 55 -28 -35 31 -31 -24 60 -14 -37 10 -48
4796 -48 5 53 -40 -33 8 -21 17 29 -59 -7 24 -32 23 10 -66 -2 18 -16 31 -22 -68 21 20 -1 20 -54 -53 54 8 -27 18
4827 18 -52 -42 62 -1 -29 17 -65 -13 78 -17 -43 2 -32 32 76 -57 -43 8 -23 28 45 -71 -21 14 -7 34 22 -77 -23
4856 -23 13 -10 43 -23 -77 11 39 -3 11 -46 -65 45 24 -4 9 -67 -36 68 16 -27 -24 -77 3 76 -13 -46 -20 -46 41 80
4886 80 -51 -45 2 -35 37 58 -65 -46 11 -16 62 19 -93 -17 37 -7 55 -15 -88 12 41 3 37 -39 -66 41 29 6
4914 6 17 -53 -63 66 33 -15 -9 -64 -5 78 2 -26 -29 -49 21 61 -33 -34 -16 -40 60 56 -57 -51 -13 -6 59 11 -93 -20 23 -9
4946 -9 50 -20 -81 -5 32 -5 33 -30 -84 21 41 -11 23 -73 -66 73 34 -16 3 -43 -19 66 6 -26 10 -34 14 66 -13 -40
4976 -40 -7 -18 53 58 -52 -47 -8 -13 49 19 -68 -16 16 -5 44 -1 -62 -6 16 -1 28 -45 -82 28 27 -7 20 -77 -48 64 20
5007 20 -15 3 -58 -16 70 3 -5 -5 -60 1 85 -8 -14 4 -34 38 64 -48 -20 22 -3 38 42 -65 -15 28 0 41 10 -76 -27
5038 -27 31 27 45 -26 -64 13 40 18 27 -34 -35 31 10 -31 12 -43 -29 41 -10 -22 -9 -44 2 61 -28 -40 -8 -32 34 44 -45 -38
5070 -38 -9 -27 44 37 -53 -12 -7 -23 37 15 -54 8 15 -2 28 -14 -43 49 32 -12 24 -21 -37 41 23 -9 7 -43 -37 48 30 -17
5102 -17 1 -43 -8 41 -6 -25 -7 -36 -3 11 -22 -22 2 -20 8 12 -46 -28 6 -12 21 -7 -73 -2 11 -10 15 -16 -59 15 7 -20
5134 -20 21 -8 -46 14 7 -24 21 -37 -38 36 2 -19 14 -17 -10 36 -16 -26 19 -22 -8 24 -19 -20 1 -21 12 31 -38 -24 0 -23
5166 -23 19 16 -41 -10 -1 -16 3 2 -35 7 0 -25 20 -12 -39 6 1 -29 -2 -10 -18 14 -16 -38 6 -11 -21 23 -21 -15 9 -29 -14 39
5200 39 -4 -15 25 -35 12 26 -18 -7 21 -26 1 24 -25 3 20 -19 5 21 -19 -3 4 -28 13 5 -26 19 7 -20 10 -8 -12 11
5232 11 -13 -18 21 -14 -31 -2 0 -23 15 -28 -28 3 -20 -14 19 -16 -27 9 -37 -9 23 -44 -27 7 -24 6 -6 -41 -8 13 -21 19
5264 19 13 -31 -12 0 -30 24 1 -39 11 13 -18 8 1 -29 27 15 -35 10 2 -20 26 11 -14 13 -20 -24 27 9 -22 -1 -20 -3 21
5297 21 -2 -9 -1 -8 -10 7 -10 3 11 -15 -7 -2 -26 3 9 -6 11 -18 -58 12 24 -8 23 -22 -49 24 19 -8 37 2 -55 21 13 0 34
5332 34 -16 -26 25 -15 -34 15 14 -7 35 -19 -34 26 6 10 23 -17 -38 -9 -7 12 23 -20 -20 -17 -22 11 3 -17 3 -13 -19 6 -1 -9 23
5367 23 -20 -29 4 -28 -19 45 -4 -30 10 -26 -12 48 -8 -26 12 -34 -27 46 -3 -9 35 -36 -28 45 -14 -12 21 -17 -15 26 -22 -19 36 5
5401 5 -7 12 -13 -14 40 1 -7 4 -16 -4 17 3 16 -13 -13 7 -11 -2 22 -23 -4 14 -30 -9 20 -22 5 25 -43 -16 29 -33 12
5434 12 27 -41 -25 33 -25 2 42 -47 -8 42 -30 -4 44 -46 -25 25 -23 -6 19 -36 -11 29 -18 -12 7 -22 0 21 -19 -4 1
5465 1 -2 -5 -18 -4 0 -13 11 14 -16 -10 -1 -19 21 22 -43 -1 2 -31 26 14 -50 1 18 -51 22 20 -56 12 21 -53 7 -3 -63 12 28 -44
5501 -44 0 11 -45 18 25 -38 16 -2 -34 19 22 -18 3 -8 -24 12 11 -30 -12 2 -2 11 -4 4 -7 -9 5 -4 -15 22 -18 -27 28 -14
5535 -14 -58 6 0 -25 43 -13 -55 19 -2 -37 43 0 -41 22 -3 -40 24 -10 -57 25 -9 -53 8 -7 -46 28 2 -40 -1 -2 -25
5566 -25 8 4 -39 -2 -9 -16 17 -10 -7 -21 -22 9 0 -10 8 -10 -8 15 -9 -6 16 -21 -15 34 -13 -26 16 -23 -16 36 -32 -39 30 -24 -15 32
5602 32 -32 -30 31 -22 -26 23 -36 -35 24 -21 -22 15 -26 -20 19 -8 -13 9 -20 -27 7 -10 -4 -1 -20 -12 9 11 4 -7 -7 1 -13 -19 -7 -23 3 11
5640 11 -24 3 19 -33 7 18 -25 4 17 -38 5 24 -36 -14 22 -23 0 30 -44 0 17 -39 -2 23 -37 -13 14 -22 -5 14
5670 14 -42 0 13 -29 -3 -5 -23 -18 2 -25 -11 1 -28 -21 -1 -21 -5 -5 -9 0 -4 -11 -10 -18 1 2 -12 1 -6 -20 12 5 -22 2 -8 -24 21
5707 21 6 -33 -1 6 -29 9 -6 -40 9 6 -35 10 -7 -35 6 -10 -26 3 -3 -37 -4 3 -23 1 2 -34 1 -6 -35 -13 -20 -18 -3 -12 -14
5742 -14 -3 -8 -23 -6 -15 1 -27 -15 -7 0 -14 -13 -14 -12 2 -20 -17 5 -16 -21 5 -11 -16 15 -11 -24 24 -14 -16 15 -7 -19 9 -11 -17 12
5778 12 -16 -34 12 -6 -18 13 -7 -8 25 -22 -23 7 -16 -23 -5 -12 -20 -12 -13 -20 4 -14 -15 -12 -8 -7 -4 -11 -7 -11 -6 -7 -12 -8 -9 -22 -3 3 -19 -8 14
5819 14 -4 -7 4 -19 -9 8 -7 1 15 -14 -1 10 -1 -3 7 -23 -10 10 -1 -1 1 -23 4 13 -22 -11 1 -28 -15 10 -32 -14 -4
5852 -4 -31 -17 6 -33 -21 -3 -7 -6 -6 -30 -10 -2 -11 -4 -13 -22 -16 -16 -6 4 -8 -21 -16 -11 -3 -3 -12 -9 1 -17 -13 19 -21 -1 -1 -20 -3 4 -19 -7
5892 -7 6 -16 -8 -5 -27 -6 21 -16 -4 6 -18 2 3 -6 11 -1 -22 -12 0 -17 -2 -4 -26 4 -4 -28 8 20 -11 -11 -20 -15 8 3 -4 -6 -7
5929 -7 -12 -7 7 1 8 -23 -12 -7 -8 4 3 -22 -2 -2 -13 0 1 -14 -2 1 -30 1 -4 3 17 5 -30 -11 -5 -17 12 -1 -30 -3 -8 -17 16 0
5967 0 -24 2 -12 -22 6 -10 -21 16 -17 -12 -15 -23 -10 21 -1 -13 6 -13 1 5 -10 -9 -2 -26 3 5 1 3 -6 -39 3 8 -6 10 -2 -15
6003 -15 2 4 -15 12 -6 -17 17 2 -23 0 -8 -8 -9 -14 -17 6 -10 2 19 -10 -5 7 -12 -2 18 -9 -20 -4 -19 -7 -4 -29 -11 -2 -21
6038 -21 -12 -1 -15 -6 -12 -23 6 -3 -26 -3 -6 -22 -1 -11 -21 -2 -5 -20 -8 -12 -15 10 -17 -12 2 -1 -17 13 -6 -10 -3 -18 -6 9 -14 -6 -1
6075 -1 -27 0 16 7 3 7 -22 -14 12 -9 7 0 -18 0 3 -12 0 11 -11 3 -6 -22 0 0 -2 9 -2 -9 -4 -14 1 10 -17 -17 -7 -21 -4
6112 -4 21 -16 -25 -7 -12 8 13 -16 -14 -2 -7 -2 8 -8 -2 -5 -8 -15 -10 -19 3 7 -3 -7 -9 -15 1 8 11 9 -14 -20 0 14 1 5 -18 -15 6 -2 -2 -1 -16
6155 -16 -18 8 -14 -17 -2 -26 3 10 -13 -25 -11 -8 2 2 -22 -19 14 -12 4 6 -20 -11 -10 -11 -2 0 -28 -19 13 -3 10 -12 -21 6 4 -2 4 -10 -24
6194 -24 -8 3 4 -3 -7 -15 12 15 14 7 -9 -16 20 7 4 3 -22 -2 -3 -9 -2 -2 -21 15 13 -15 -6 -12 -37 13 4 -17 -15 -5 -5 11 -1 -21 -16 -21 -11
6235 -11 12 -7 -23 3 -4 2 12 -15 -7 -8 -8 4 -8 -1 -7 -3 -9 9 -1 -25 -11 8 -8 1 -10 -20 -1 3 2 6 -7 -23 0 14 -8 9 -8
6272 -8 -16 10 -5 -11 -6 -9 -21 9 -14 -13 2 -8 -13 10 -7 -16 4 -4 -10 -6 -25 -11 -4 -10 -10 12 -28 -5 0 -14 -2 -3 -2 -4 -2 -9 0 -13 -6 4 8 4
6314 4 0 -10 -2 11 -6 -8 16 -15 1 14 2 -14 9 -1 -2 17 6 12 -2 -13 -7 -5 -14 -4 0 -10 -4 9 -15 7 -9 -18 -15 2 -15 -2 -17
6351 -17 -27 -6 -5 -11 -13 -13 -12 -4 -11 -7 11 -6 -13 -2 0 6 4 -18 5 4 5 14 1 -3 3 17 3 18 6 -17 9 17 4 1 3 -5 6 20 -2 -9 2
6392 2 -9 -2 -1 -6 -16 -3 -13 6 6 -14 -16 -5 -9 16 -2 -14 7 -6 6 9 -14 -11 1 2 6 7 -5 -21 8 -2 1 -3 -13 3 10 -1 -1 -2 -6
6431 -6 5 3 -6 -1 -8 -20 8 -2 7 5 -18 -13 12 12 -15 -3 -10 10 15 5 -10 -19 -16 -4 12 5 0 -7 -7 16 20 7 -14 -9 2 8 1 -19 -19 -8 1 3
6473 3 6 -13 -16 -1 4 0 -11 -23 -16 3 13 -1 -1 -11 -6 2 -6 -2 -18 0 7 4 -8 -13 -15 -17 11 17 -5 -16 -8 -9 9 7 -4 -9 -4 2 17 3 -14 1
6515 1 -5 3 16 -11 -7 -7 9 7 12 4 -9 4 7 7 -7 -13 -8 2 1 3 -11 -19 -8 5 -5 2 -16 -19 3 6 -10 -10 -7 -9 8 1 6 -8 -15 -10 7 1 -16
6558 -16 -15 -16 11 1 7 -3 0 5 2 11 -5 -3 -6 -8 3 12 0 7 1 6 16 3 -16 -4 4 2 9 -4 -6 10 -2 5 9 2 -14 -3 1 -3 -11 1 -10 -2 0
6601 0 -4 -2 0 -3 2 4 2 14 -3 -17 1 -7 -1 1 -9 3 5 0 -8 8 2 -2 -3 5 5 5 -2 -8 4 2 -10 -11 -12 -8 -9 6 4 1 -4 4 2 -4 14 -8 -13 7 -3
6648 -3 0 -10 -6 -6 -6 -7 -3 -9 -10 -13 1 -15 -1 -2 -12 -5 10 -3 -8 -16 -10 7 10 3 -10 -7 -9 -2 5 7 -6 2 -10 3 9 -11 -2 2 5 8 8 -12 4 12 -5
6693 -5 3 -13 3 -4 -6 13 11 1 -11 0 3 7 -4 -16 -11 4 9 6 -9 2 4 17 10 -2 -7 -15 14 19 -9 -2 0 -21 5 7 -7 -3 -12 -8 15 11 -9
6734 -9 -17 -10 -4 0 10 -6 -4 5 6 15 -9 -11 5 0 -2 4 -9 -11 -9 4 0 10 -4 -10 7 3 6 0 -22 12 -1 -8 -2 -3 -16 2 2 -5 -1 -11 -16 1 16 2
6778 2 -8 -14 -9 3 6 -7 -11 -9 -7 7 3 -11 -18 -8 -8 0 -11 -4 -5 1 1 4 -5 -7 5 12 8 13 -14 -3 5 14 8 4 -4 -3 5 9 7 -7 -10 -5 7 4 5 -7 -5 12
6826 12 11 0 -6 -16 -13 -2 -10 -10 -11 -10 2 10 -7 -5 -4 -17 0 4 -5 -16 0 -8 -5 10 -7 -3 -9 -4 -11 -14 -11 4 2 4 4 -6 -16 -5 -7 1 0 -14 0
6869 0 -7 1 8 7 6 -5 5 -6 -13 -2 -7 -4 5 -7 7 0 -1 14 10 2 -4 5 7 2 7 4 10 4 2 8 5 -9 -14 -14 3 4 -4 1 -14 -2 -5 3 -11 -6 -1 -3 4 2 -4
6918 -4 0 -8 -6 0 -12 -9 1 -4 -14 4 0 -8 8 -16 0 -5 -2 -5 0 -7 0 -5 -5 -6 8 7 -11 -5 -5 -4 7 -7 -17 0 -9 -4 -9 -7 0 2 -3 -2 -11 -12 -5 -8 2
6965 2 -13 -9 -6 2 7 0 -13 2 -6 -11 11 -17 2 -3 -19 3 0 -11 -5 -3 9 8 -14 -3 -9 -2 -9 5 -4 -2 8 -9 3 2 -3 -8 9 25 7 6 2 5
7007 5 -5 -3 -1 -13 -4 -3 13 4 -9 -6 -4 1 -9 0 -10 5 2 -4 0 -3 -5 -5 7 15 1 -11 -9 -4 -6 15 -1 -2 -12 -8 5 -7 -3 -11 -2 -7 -1 -11 -8 -13 2
7052 2 0 -3 -1 1 3 6 4 4 9 -9 -1 3 8 -14 -5 -1 16 3 -11 -11 -3 2 -2 9 -2 -9 -2 -4 1 5 5 -4 7 -2 -6 -6 -4 -13 0 1 -4 0 -11 -8 1 -3 8 -3 -3
7101 -3 8 1 17 4 -8 4 -8 2 -5 -5 -13 -6 2 8 14 10 -10 8 8 9 3 -8 -4 6 -5 -4 6 0 7 3 3 9 -9 -5 2 -6 -6 2 0 -8 4 -3 -5 -2 -1 -2
7147 -2 3 0 -15 -6 4 -7 2 -22 -5 -1 -7 11 4 4 -6 12 -1 4 -4 -1 7 -9 -8 -12 1 -3 1 2 8 -4 -1 -1 8 1 3 3 5 -2 20 -4 6 -2 -7 -1 3 5
7193 5 3 -7 -8 -3 -4 -2 12 7 0 2 1 1 -11 -2 -8 -3 -8 -6 -8 -5 -15 -5 -5 0 -2 -7 3 -14 2 -6 3 2 -1 6 0 7 -1 0 -4 2 7 -9 1 9 -11 2 -4 -6 -1
7242 -1 -2 1 2 12 6 0 7 4 -7 -1 -4 3 -2 7 -5 -1 -7 -3 6 5 7 -5 5 2 1 -2 -12 -10 -15 -3 -1 -6 -12 3 -6 -7 3 -6 4 4 -4 3 7 -1 0 4 9 5 -3 -3 -11
7293 -11 -2 1 6 -3 -2 -3 3 4 8 7 4 8 13 3 6 -6 3 0 -4 9 0 -1 7 -3 2 -5 -4 5 -11 9 1 1 1 -4 5 3 0 -2 0 6 -1 -3 -12 -6 1 -4 1 -9 -9 1 -12
7344 -12 -12 7 -6 0 -1 2 1 1 2 -1 -2 9 -1 13 0 -10 1 -14 2 2 2 2 1 4 -7 7 -12 -4 -1 0 0 -8 -3 -14 4 -11 -4 -3 -7 0 -1 2 -3 -3
7388 -3 -5 1 -7 -4 8 0 12 2 3 -6 -11 -13 -12 1 5 -1 -2 5 -3 1 -9 -9 -8 0 12 3 -3 -5 -6 -6 1 1 1 -1 4 4 -2 -8 1 3 -9 -6 -6 -5 -2 4 -10 7 0 -7 11
7439 11 4 -3 -4 -6 3 1 -5 -18 -8 -13 -13 -9 -2 -7 -4 -6 -13 -9 -13 -14 -9 -18 -7 -3 -3 -10 -20 -6 -21 -9 -13 0 -9 -10 2 -8 0 3 -11 -1 -2 6 -4 5 4 -3 -9
7486 -9 -18 -6 -3 -3 -1 -2 -3 -6 -2 -4 0 3 -4 4 -10 2 -7 -2 1 -4 1 1 -7 -6 -6 -3 -11 -2 -6 -4 -5 -18 5 6 7 10 2 -13 -11 -9 2 -6 -8 -4 -6 -16 -17 -8 -1 0 -7 -6 -7
7539 -7 -1 -9 -9 -10 -4 6 -8 -1 -8 -14 -4 5 4 7 -1 1 1 0 -1 -7 -11 -4 2 -6 -3 -14 -3 -7 -5 -5 -7 -9 -6 0 -4 -5 -13 -4 -5 -4 -3 2 -4 -3 3 2 -8 -10 -1 -15 -13 3 -7
7592 -7 0 -1 -2 -5 -5 -5 -6 1 0 1 -13 -6 5 7 4 -4 -6 6 -5 0 -8 5 2 1 4 -4 4 -7 5 -10 -1 -4 -9 -4 3 -1 -3 -11 4 -9 -11 -1 -1 -8 -4 -2 -7 0 -3 -4
7642 -4 -10 -3 -3 -9 0 5 -7 3 -21 -16 -12 -4 -10 -4 -8 -4 -2 0 0 0 -5 -12 0 4 -14 -6 -8 -7 4 -9 -5 -7 5 -4 -9 9 -16 0 2 -4 6 0 5 -5 -5 -4 1 -7
7690 -7 -15 6 0 2 3 -5 0 -10 -9 -12 1 -7 2 -3 -5 -2 -11 -8 -1 -13 5 0 -7 1 0 0 -11 -1 -10 -8 5 -7 7 1 -12 -11 -1 3 7 -2 -6 -5 -15 -24 3 -8
7736 -8 -6 -4 -11 12 0 -5 -1 -1 7 5 -4 -5 -12 -5 2 -3 -16 -6 5 -5 -7 1 -6 4 -4 -9 -1 1 11 -8 -13 1 1 -10 -7 4 2 4 -8 6 1 2 1 1 8 12 -2
7783 -2 3 -2 8 5 5 10 1 4 -3 14 17 5 14 2 6 4 9 12 9 4 3 -6 -2 -1 -4 -4 1 -3 0 3 -3 8 2 2 -9 0 -3 -6 2 -4 1 -3 -9 -13 3 3 -4 -5 -10 -11 -3 -3 -3 1
7837 1 1 10 7 1 5 1 8 0 -2 6 -5 -1 -2 -1 -4 -5 1 2 2 -10 6 1 8 11 -7 -2 -11 0 -3 0 -1 -7 4 -8 -3 0 3 -14 -13 -1 -2 -4 -6 -3 9 -8 6 3 2
7886 2 1 8 -7 6 -1 -9 2 9 -9 -4 -2 -11 16 -4 11 -8 -3 0 -4 15 -7 6 13 10 -5 2 9 0 4 -1 -2 -2 6 5 1 -3 5 0 4 -1 -9 4 1 -7 3 0 -6
7933 -6 5 2 -7 -8 -2 -2 2 -5 -8 2 -2 -9 -6 -11 -4 -18 -11 -9 -5 -16 2 -4 1 -3 -4 -3 -6 -2 -4 -13 -11 -6 -5 1 -1 -2 -3 -7 9 -6 -7 -13 13 -3 4 -1 -1 -1 -1 -1 -4 10
7985 10 0 0 2 0 -12 -6 3 -1 -6 -2 -8 -9 2 10 4 9 16 1 2 8 -7 15 2 1 -4 2 -11 -2 3 -14 -4 -6 -14 -3 -2 11 -5 7 -1 -10 5 -2 -8 -1 -8
8030 -8 -5 4 -10 -5 -2 1 -4 4 1 -8 -2 -7 8 -6 -11 -1 -6 -3 -3 1 -5 3 -13 1 6 7 -4 -9 -1 -6 0 -7 -10 -2 -14 -4 -4 -7 -6 -1 3 1 -3 1 -17 3 -6 6 -3
8079 -3 -6 9 -11 0 5 -6 0 -10 -7 -5 5 -3 -9 -2 4 -2 -4 10 -3 -1 -4 -15 15 16 4 8 -2 10 3 -9 -7 3 -9 -5 -1 14 6 9 0 14 3 -1
8121 -1 7 -8 -11 -9 1 -2 5 -2 2 -11 -1 -11 -8 1 2 1 6 5 4 -5 15 -7 -1 -7 6 -14 -8 -1 0 -11 -7 -6 -1 -11 -1 -3 3 -11 5 2 -13 -9 -3 -10 -11 -4
8167 -4 -6 4 -14 -1 -3 -1 -19 2 9 1 -3 1 4 10 7 11 1 -1 5 1 5 -9 -1 5
8191E
$$ Imaginary data points
##PAGE= N=2
##DATA TABLE= (X++(I..I)), XYDATA
0 0 0 0 0 0 0 0 0 0 0 0 -8 8 -8 8 -9 16 -16 21 -24 26 -32 40 -46 49 -57 66 -78 89 -98 113 -127 143 -160
33 -160 179 -200 224 -248 276 -306 338 -376 416 -459 508 -564 625 -692 772 -862 966 -1088
51 -1088 1234 -1411 1633 -1922 2308 -2860 3714 -5220 8644 -31091 18644 48919 -44303 29291
65 29291 20336 -62381 6253 44767 -26073 6397 14441 -31109 6256 21670 -17313 4225 1244
78 1244 -13408 21376 7137 -27449 3353 5778 -6912 20840 10044 -29232 -13258 15108 10142
91 10142 1004 7575 -5648 -30126 4701 36912 -11984 -15348 22862 -21593 -18581 45781 -7218
104 -7218 -37035 32242 2066 -28510 31321 -2776 -36578 28253 11556 -19219 19494 -14241
116 -14241 -27093 33543 4678 -14725 24043 -24710 -28210 45014 1758 -26148 29529 -13664
128 -13664 -35040 39289 11053 -32976 17494 6370 -25830 16149 14169 -20920 -1283 12232
140 12232 -1045 -2207 -413 -2510 -5177 3426 14637 -4091 -14263 4147 77 -1048 14108
153 14108 -3831 -12326 4062 -3178 4404 13185 -15170 -4035 14725 -15179 2906 21911 -25555
166 -25555 -5530 31311 -19846 -10576 29718 -21029 -14612 35705 -10866 -20651 23383 -8929 -14277
179 -14277 25490 -3926 -16716 12107 -4080 -4407 14508 -7823 -6582 9888 -7683 415 12237
192 12237 -11757 -4066 12527 -6457 -3105 9319 -6443 -5401 8479 2029 -5133 -2187 3118
205 3118 1090 -3828 5459 2155 -13155 4984 12337 -12260 136 10818 -14743 464 17640
218 17640 -11505 -5407 11042 -10130 657 13941 -11116 -3353 8625 -9154 4826 9841 -15220
231 -15220 1719 10914 -12578 5059 11069 -17861 966 15544 -11195 -609 10509 -13244
243 -13244 -1867 14916 -4837 -5582 4259 -4513 -213 7340 -720 -3741 -2442 -213 4500 948
257 948 -1396 -351 -4483 918 6853 -1679 -3106 -202 -2760 4061 4459 -4982 -712 -411 -3493 8258
273 8258 2665 -10079 2691 1990 -6519 9830 4035 -14308 2734 6584 -6890 6662 4399 -13508
287 -13508 1823 8449 -4980 2823 2257 -9552 2458 6566 -3358 1796 -663 -7094 4718 5268
301 5268 -3857 634 -1389 -4837 5585 4559 -4602 -1538 -134 -1349 3596 2940 -2827 -3638 -465
316 -465 3071 2248 -384 -911 -3867 -1436 6433 1885 -4281 -133 -1846 -1543 6795 1206 -5830 377
332 377 -530 -1016 6481 -52 -6401 1133 346 -293 6059 -1912 -6934 2843 1852 -828 4450 -2507 -6494
349 -6494 3669 3139 -1276 2313 -2406 -5288 3458 4113 -822 -466 -2829 -2704 3685 3549 -1006 -2290
365 -2290 -2481 -8 3474 2120 -1299 -3022 -1783 1891 3068 947 -1890 -3732 -388 4001 1992
380 1992 -993 -2225 -3289 1274 5118 183 -2708 -1536 -2196 2000 5278 -1060 -3925 -1037 -681 2800
396 2800 4523 -2567 -4627 96 1302 2906 2533 -3771 -3924 1584 2354 2117 671 -4021 -2897 2553
412 2553 3158 1152 -1398 -3943 -1231 3551 3193 -492 -3215 -2691 1048 3523 2011 -1757 -3729 -1068
428 -1068 2628 2835 710 -2543 -3720 572 3972 1782 -1132 -3118 -2588 2496 4155 -223 -2544 -2379
444 -2379 -878 3364 3243 -1799 -2996 -1363 582 3674 1993 -3119 -3006 -44 2118 3274 -102 -3928
460 -3928 -1761 1524 2485 1873 -1691 -3473 -199 2223 2114 621 -2647 -2688 1168 2642 1473 -909
476 -909 -3238 -1037 2587 2065 116 -1895 -2682 798 2995 663 -824 -1794 -1895 1831 2905 -524
492 -524 -1589 -1538 -704 2756 2066 -1945 -1792 -526 579 2723 421 -2748 -820 496 781 2102 -590
509 -590 -2820 95 1208 799 1173 -1502 -2402 1118 1786 452 -334 -2028 -737 1985 967 -91 -818
526 -818 -2032 631 2274 -251 -312 -548 -1991 1385 2423 -1352 -819 -23 -1011 1883 1323 -2499 -413
543 -413 919 -184 1776 -270 -3080 810 1445 -247 1847 -1088 -3660 1629 2207 -483 1170 -1407
559 -1407 -3242 2175 2372 -1067 -62 -972 -1191 2097 762 -1327 -257 -721 751 2247 -1202 -1870
575 -1870 3 -354 2254 2520 -2840 -2751 430 812 2832 1450 -3345 -1962 367 928 3010 -62 -3224
592 -3224 298 143 -280 3141 -1216 -3624 2966 1349 -2138 1577 -1698 -3023 4783 2429 -3311 -531
608 -531 -1879 -1421 5218 2127 -2814 -1299 -2932 -133 5699 706 -2643 -348 -2887 229 5242 -1061
624 -1061 -2977 1542 -823 -254 2663 -1908 -2254 2070 1374 694 -723 -3366 -448 2104 2229 2613 -3024
641 -3024 -5507 1649 2856 1109 3008 -2806 -5740 2210 2751 33 2272 -1994 -3640 2278 951
656 951 -440 1484 -2503 -439 4147 -2020 -2251 1904 -2558 1256 6144 -3622 -4546 2306 -1475 1175
672 1175 6270 -2756 -5190 901 -246 1923 4131 -2412 -2998 32 -527 2771 1661 -3344 482 1148
688 1148 -2216 2122 725 -3902 1973 2817 -2062 292 -725 -2886 2476 2834 -346 -689 -3398 -941
704 -941 3932 344 204 1146 -4934 -867 5352 -1445 -889 3057 -4085 -1554 5106 -1592 -2000 2680
720 2680 -1767 -247 2723 -2491 -809 1755 -1262 2103 1148 -4356 954 1873 -2578 3289 1785 -5649
736 -5649 761 2861 -2537 2151 1824 -4297 299 2182 -1225 1078 48 -1674 1339 -526 -515 2307
752 2307 -2147 -1135 3531 -1823 -1420 3268 -2506 -1545 4304 -1411 -2180 2489 -1429 -750 2603 -1385
768 -1385 -360 1148 -2155 1326 1563 -2893 1721 1158 -3934 2595 2285 -4557 1785 2529 -4170 1544
784 1544 2616 -3636 966 2075 -2729 924 1218 -1744 1176 -249 -1304 2301 -1021 -1521 2898 -1524
800 -1524 -1809 3489 -1372 -2069 3335 -1303 -2167 3116 -583 -1692 1788 -963 -415 1609 -1419 328
816 328 1004 -2222 1470 1331 -3110 1714 1599 -3654 1925 2230 -3935 1099 2345 -2886 1270 1587 -3136
833 -3136 863 1510 -1496 1470 -182 -2179 1852 -307 -1202 3083 -1288 -2723 2946 -616 -1898 3441
849 3441 -874 -2756 2764 -313 -2128 2207 -83 -1090 1492 -1002 -777 1055 -990 980 1537 -2236
865 -2236 64 742 -2224 2000 2398 -2865 -96 921 -2317 1475 2124 -1778 339 45 -2027 1354
881 1354 783 -836 1736 -916 -1988 1979 -798 -1312 3423 -412 -2483 1843 -1266 -1849 3603 448
897 448 -2015 1317 -1327 -1868 2397 657 -239 1060 -2037 -1258 1591 -365 830 1746 -2138 -818
913 -818 971 -1661 899 2614 -1319 -698 314 -1888 437 1959 -156 448 -357 -2051 231 615
929 615 343 1948 -670 -2122 652 -555 -528 2723 157 -1598 645 -1410 -1245 2533 670 -617
945 -617 788 -1695 -1422 1517 219 702 1502 -2028 -1426 983 -591 984 2075 -1643 -979 737 -1489
962 -1489 317 2287 -552 -429 324 -1689 -160 1450 33 630 350 -1670 -590 259 186 1661 431
979 431 -1584 -424 -344 -249 1674 613 -862 -41 -853 -676 1316 457 -191 405 -882 -562 681 -466
997 -466 269 1340 -706 -633 239 -1103 375 1776 -492 -420 239 -1479 -36 1723 -24 -83 92 -1477
1015 -1477 -71 1339 -103 67 245 -942 -4 530 -419 380 448 -605 131 111 -625 276 363 -70 486
1034 486 -267 -916 172 396 328 504 -626 -686 334 20 274 663 -636 -490 389 -260 273 664 -812
1053 -812 -303 726 -302 -32 388 -720 87 845 -511 -214 377 -564 159 730 -461 -141 181 -581
1071 -581 354 766 -547 -299 160 -274 433 421 -640 -152 279 -135 229 207 -364 -100 74 65 298 -72 -299
1092 -299 -32 13 313 174 -511 -37 327 -191 177 131 -585 215 421 -450 232 230 -778 246 638 -442
1112 -442 162 114 -877 454 761 -697 28 306 -713 337 631 -661 59 397 -687 175 677 -516
1130 -516 -166 323 -273 126 347 -434 -168 382 30 -114 22 -67 -83 82 187 -72 -128 138 -172 -92 553
1151 553 -126 -518 373 30 -279 567 -201 -630 709 36 -635 682 -24 -774 715 114 -697 736 -59
1170 -59 -917 833 302 -860 515 66 -721 753 196 -852 499 239 -700 454 323 -605 195 196 -417
1189 -417 286 317 -468 -107 362 -26 -181 152 16 -274 237 240 -497 160 459 -678 94 794 -724 -152
1209 -152 816 -764 -12 1071 -1011 -331 1301 -827 -418 1295 -894 -493 1389 -843 -577 1475 -793
1226 -793 -765 1428 -527 -736 1184 -571 -676 1301 -400 -871 963 -168 -644 801 -60 -629 473
1243 473 31 -460 364 309 -438 -204 384 -8 -332 401 34 -646 571 282 -994 639 580 -1253 559
1262 559 801 -1389 573 925 -1587 670 1172 -1862 460 1402 -1760 454 1374 -1937 399 1595
1278 1595 -1908 273 1679 -1826 43 1637 -1565 44 1500 -1536 -102 1553 -1157 -311 1192
1293 1192 -840 -255 968 -597 -315 688 -329 -349 430 122 -342 -64 356 -169 -287 591 -287 -640
1311 -640 1084 -142 -1168 1244 27 -1488 1489 211 -1827 1599 297 -2154 1844 698 -2460
1326 -2460 1567 779 -2415 1713 931 -2577 1546 1024 -2567 1417 1159 -2343 1238 1012 -2245 1169
1342 1169 1044 -2099 1002 1131 -1786 595 855 -1411 592 889 -1147 108 639 -603 -35 479 -38
1359 -38 -349 -56 368 -274 -148 816 -633 -667 1341 -471 -974 1560 -533 -1257 1857 -547 -1430 2152
1377 2152 -617 -1769 2368 -479 -1910 2451 -501 -2018 2625 -544 -2303 2741 -153 -2335 2415
1392 2415 -256 -2332 2425 119 -2151 2048 -37 -2187 1757 441 -1499 1335 -57 -1505 1125
1407 1125 275 -837 820 68 -726 223 -51 -46 341 69 101 -471 -288 551 -472 163 1310 -1098 -762
1426 -762 1168 -1118 -18 2312 -1464 -1066 1876 -1715 -711 3010 -1193 -1190 2190 -1978 -1237 3101
1442 3101 -1026 -1047 2567 -1808 -1699 2501 -945 -572 2810 -1602 -1857 1876 -1011 -462 2763 -832
1458 -832 -1497 1057 -1215 -529 2341 14 -876 306 -1035 -544 1062 508 334 -56 -825 -479 -417 579
1476 579 1431 -311 -375 105 -1690 -17 1909 -349 412 812 -2657 -565 2005 -732 933 1760 -2810
1493 -2810 -833 1585 -1633 1162 2807 -2459 -892 1316 -2337 673 3154 -1592 -368 1208 -2875
1508 -2875 -280 2815 -582 337 1130 -2720 -894 1712 -221 1010 1354 -1905 -1206 248 -234 1373
1524 1373 1347 -819 -796 -781 -565 924 881 576 160 -1504 -823 345 -71 1449 1164 -1615 -513 -90 -1504
1543 -1504 1603 2123 -1300 -15 -176 -2533 1214 2259 -1101 761 353 -2995 419 1744 -961 1483
1559 1483 932 -2834 8 965 -1294 1650 1537 -1960 -69 47 -1723 1448 1789 -988 108 -365
1575 -365 -1792 765 1280 -39 674 -483 -1565 80 451 542 987 -468 -761 -164 -654 531 1072 -252
1593 -252 203 -223 -1498 453 885 -426 989 150 -1773 312 349 -729 1645 533 -1846 366 68
1610 68 -1112 1644 688 -1498 711 -126 -1524 1366 702 -1083 907 -139 -1448 1029 305 -813
1626 -813 1151 22 -1205 560 -99 -457 1171 -72 -782 443 -402 -297 914 -129 -205 320 -711
1643 -711 -25 716 -342 138 246 -742 327 359 -685 535 297 -827 499 134 -752 768 101 -853
1661 -853 795 6 -885 855 39 -737 835 -280 -806 1052 -59 -735 805 -344 -631 1018 -241
1678 -241 -521 842 -513 -590 927 -241 -301 715 -628 -323 808 -445 -118 712 -538 -148 458 -592
1696 -592 173 629 -560 71 282 -625 259 381 -413 428 56 -782 364 227 -330 597 -119 -639 519
1715 519 -153 -390 804 -127 -490 514 -406 -309 853 -312 -329 695 -532 -358 720 -399 -26 739
1733 739 -735 -282 681 -526 50 729 -638 -58 492 -684 180 710 -589 23 354 -633 246 446
1751 446 -559 288 292 -632 214 244 -364 388 46 -505 363 19 -351 430 -50 -258 364 -285 -179 540 -274
1772 -274 -160 420 -384 -6 451 -518 78 507 -610 51 488 -564 196 416 -706 264 474 -741 261
1791 261 453 -700 276 327 -671 419 346 -738 318 306 -596 371 184 -535 395 101 -547 420 134 -379
1811 -379 294 -68 -272 376 -139 -199 390 -173 -154 243 -295 111 367 -398 76 272 -463 213 278 -446 337
1832 337 146 -677 380 320 -537 391 120 -614 488 136 -603 562 139 -665 426 47 -468 554 -28
1851 -28 -523 503 -65 -467 466 -62 -268 417 -279 -260 468 -208 -150 371 -289 -24 283 -404 151 345 -455
1872 -455 135 231 -442 317 152 -537 438 160 -605 426 127 -532 525 8 -580 613 6 -623 603
1891 603 25 -519 571 -137 -491 645 -132 -458 571 -142 -364 467 -217 -181 499 -315 -190 406 -247
1910 -247 -10 270 -382 139 222 -428 242 176 -419 313 -6 -419 562 -73 -567 618 -88 -520 701 -214
1930 -214 -543 848 -285 -609 899 -253 -591 870 -334 -525 930 -414 -540 947 -355 -521 816
1947 816 -367 -364 790 -448 -334 743 -383 -259 599 -356 -132 442 -388 41 376 -373 49 168 -273
1966 -273 310 -16 -369 410 -117 -302 547 -271 -280 623 -476 -229 858 -579 -331 843 -626 -150 966
1985 966 -851 -240 1038 -851 -166 1092 -893 -192 997 -923 -19 1091 -1000 -147 1009 -870
2001 -870 -15 898 -884 44 823 -859 36 723 -710 126 537 -657 162 327 -556 339 303 -440 178
2020 178 -86 -253 536 -115 -230 400 -450 -81 601 -479 106 564 -887 106 747 -848 249 706 -1051
2039 -1051 356 716 -1258 409 901 -1133 480 671 -1418 476 830 -1163 723 700 -1555 386
2055 386 739 -986 818 554 -1412 431 495 -927 774 497 -986 413 121 -762 702 243 -553
2072 -553 487 -108 -533 381 -141 21 662 -422 -288 155 -518 473 676 -614 180 7 -1017 712
2090 712 666 -729 609 -73 -1314 951 465 -1000 1020 125 -1396 951 147 -1171 1340 269 -1340
2107 -1340 1018 -79 -1379 1289 372 -977 1079 -361 -1475 1148 380 -627 1044 -411 -1232 816
2123 816 87 -305 1047 -324 -861 427 -198 -14 759 -309 -171 249 -562 91 356 -233 580 48 -849
2142 -849 339 -65 -411 1134 -14 -874 588 -559 -647 1571 -63 -916 885 -747 -805 1625 -270
2159 -270 -796 1279 -784 -989 1492 -417 -687 1434 -691 -868 1304 -689 -681 1492 -410 -659 963
2176 963 -849 -554 1334 -298 -374 740 -789 -433 874 -182 57 445 -736 -161 423 -187 337 102
2194 102 -488 295 -104 -349 615 -166 -302 674 -508 -367 844 -545 -204 1062 -739 -399 902 -830
2212 -830 -51 1265 -999 -360 1095 -1002 -97 1318 -1038 -225 1114 -1130 -66 1312 -1022 -192
2228 -192 1035 -980 -12 1011 -962 -32 909 -851 23 726 -760 111 552 -678 227 439 -638
2245 -638 211 289 -432 307 59 -392 385 -60 -276 416 -235 -131 433 -448 23 605 -615 -5 592 -680
2265 -680 184 651 -904 188 691 -917 275 752 -1002 236 666 -966 430 677 -1131 311 691
2282 691 -920 442 516 -1087 453 596 -913 472 433 -992 409 462 -695 456 178 -804 476
2299 476 311 -513 335 -27 -408 490 -40 -339 335 -200 -98 518 -276 -165 236 -439 255 625 -510 -127
2319 -127 137 -508 559 552 -703 104 99 -664 674 469 -746 326 50 -792 731 340 -846 525 205
2338 205 -728 577 0 -823 789 354 -637 402 -250 -750 803 378 -350 365 -548 -739 807 368
2356 368 -131 302 -642 -523 671 114 -9 353 -477 -246 353 -212 98 331 -320 178 222 -589 -1 186
2376 186 -80 706 88 -939 -68 93 14 983 59 -965 -31 -162 -69 1108 110 -823 58 -300 -191 928
2396 928 -48 -518 431 -285 -404 536 -212 -163 757 -226 -482 175 -468 -6 973 30 -350 -189 -741 133
2416 133 1008 123 -170 -267 -768 170 704 54 181 -131 -692 162 331 -130 329 -17 -398 299 -100 -485
2436 -485 369 204 -14 425 -438 -672 357 193 215 578 -520 -731 209 46 364 687 -544 -636 202 -102
2456 -102 251 555 -401 -261 209 -304 66 381 -237 71 236 -360 -7 62 -269 399 361 -353 -121 -207 -240
2477 -240 588 297 -319 7 -286 -286 538 186 -175 170 -366 -291 513 6 -150 300 -282 -185 396 -250 -139
2498 -139 458 -180 -150 302 -306 -107 385 -142 -7 261 -360 -135 305 -82 93 151 -335 -18 180 -138 130
2519 130 107 -211 64 -33 -132 256 20 -192 116 -108 -50 272 -135 -88 224 -254 -61 342 -205 -37 220 -333
2541 -333 64 425 -343 -87 271 -305 106 360 -397 -24 311 -305 115 355 -425 -36 299 -207 144 208
2561 208 -486 2 371 -93 73 25 -382 73 304 -18 53 -97 -283 85 222 93 -4 -272 -132 211 112
2582 112 79 -84 -315 139 257 -121 69 -69 -352 300 305 -267 50 -102 -385 509 362 -464 -22 -49 -262
2603 -262 600 253 -614 10 67 -226 536 188 -608 21 92 -125 462 26 -613 71 249 17 256 -176 -472
2624 -472 197 309 51 48 -266 -256 198 277 149 -124 -394 -45 261 216 170 -343 -420 308 270 9 131 -370 -350
2647 -350 500 193 -168 160 -408 -305 695 145 -360 102 -352 -151 814 -27 -554 145 -158 -69 724 -135
2667 -135 -600 178 -40 23 605 -204 -614 160 138 132 333 -354 -468 234 258 135 34 -351 -192 188 243 178
2689 178 -186 -370 25 163 241 204 -462 -348 351 121 98 173 -575 -195 588 -19 -29 213 -599 -120 735 -110
2711 -110 -183 185 -590 3 845 -259 -362 226 -388 108 757 -372 -409 279 -229 112 605 -372 -424 209
2731 209 -40 215 345 -429 -332 232 135 177 37 -369 -110 175 177 160 -171 -253 34 73 262 151 -446 -143 265
2754 265 -29 262 99 -655 70 504 -257 156 204 -722 133 621 -378 82 241 -704 186 692 -457 -79
2774 -79 224 -531 284 567 -545 -56 271 -426 278 436 -519 -50 239 -303 276 323 -477 -98 240 -81
2794 -81 120 69 -268 -18 124 86 53 -153 -16 73 -112 228 138 -398 72 228 -234 238 126 -496 205 288
2816 288 -368 220 121 -473 325 194 -472 387 130 -595 433 206 -587 415 164 -634 455 238 -664
2835 -664 358 301 -562 257 204 -455 279 188 -400 174 96 -216 218 -6 -204 200 -89 -100 286 -155 -169 188
2857 188 -57 41 156 -264 -15 177 -22 179 -118 -359 290 79 -167 423 -207 -588 475 149 -313 518
2877 518 -210 -708 594 258 -446 378 -113 -517 546 101 -437 308 -127 -250 569 -118 -476 276 -165
2896 -165 -27 736 -300 -690 254 9 99 613 -325 -637 113 108 226 332 -264 -308 -77 43 433 43 -427
2917 -427 130 79 -147 346 -199 -494 532 308 -269 108 -384 -409 684 386 -124 -21 -734 -289 900 267
2937 267 -84 48 -872 -229 1002 15 -222 306 -609 -267 779 -162 -323 392 -178 -27 397 -448 -365 323
2957 323 196 396 39 -867 -265 372 289 642 -40 -1026 -248 336 278 648 -19 -835 -214 167 246 456 -218
2978 -218 -346 207 -117 -13 261 -406 80 731 -302 -373 102 -498 219 1074 -180 -596 -210 -526 389 1089
2998 1089 -96 -470 -333 -526 461 788 -198 -89 -136 -594 368 488 -404 133 217 -391 188 70 -578 221
3018 221 529 15 24 -429 -559 325 465 299 153 -713 -565 381 283 359 352 -748 -522 433 67 174 351 -457
3040 -457 -189 309 -225 18 257 -245 218 225 -531 -36 122 -218 593 344 -737 -183 82 -191 660 371
3060 371 -707 -179 58 -186 492 263 -417 -35 -84 -162 385 21 -230 226 -112 -185 233 -233 -117 485 -75
3081 -75 -235 95 -302 -12 454 -70 -82 14 -367 96 348 -127 116 -42 -445 268 247 -344 223 111 -433
3102 -433 267 138 -434 298 199 -372 227 56 -368 269 120 -220 239 -114 -307 357 29 -220 238 -190
3122 -190 -198 426 -66 -249 254 -129 -145 324 -88 -152 152 -129 -8 210 -163 -44 90 -118 161 39 -340
3143 -340 159 177 -168 189 -50 -388 260 186 -178 205 -112 -401 280 162 -92 231 -252 -302 415 40 -157
3164 -157 267 -246 -199 454 -131 -252 321 -157 -146 441 -171 -322 224 -67 49 347 -272 -316 134 25 198
3185 198 202 -362 -161 118 -31 257 133 -353 -63 92 -48 231 -2 -311 82 102 -32 128 -194 -178 309
3206 309 18 -95 121 -315 -110 449 -33 -125 123 -382 -83 541 -30 -173 78 -321 30 463 -142 -165 105
3227 105 -245 98 334 -245 -77 119 -208 191 262 -361 -90 171 -91 215 113 -381 -27 194 6 165
3247 165 -55 -285 68 80 46 221 -187 -250 181 51 49 173 -292 -163 303 16 -19 108 -283 -41 303 -80
3269 -80 7 70 -322 52 304 -154 9 39 -308 191 328 -268 -33 88 -210 198 228 -287 -25 63 -124 226
3291 226 132 -244 -23 -10 -29 301 -19 -281 74 0 1 247 -117 -202 153 -37 3 212 -154 -132 150 -42 55
3314 55 124 -280 -22 242 -80 68 70 -321 91 270 -160 56 76 -308 98 237 -145 58 -22 -267 168 187
3336 187 -151 51 -48 -162 236 63 -206 106 -21 -137 229 13 -177 84 -45 -29 230 -66 -153 63 -43
3357 -43 76 152 -179 -54 101 -95 119 146 -232 11 114 -151 165 113 -301 40 135 -130 151 19 -283 162
3379 162 119 -184 163 -12 -251 209 88 -189 185 -43 -263 245 97 -194 116 -52 -157 240 23 -174
3399 -174 100 -40 -63 153 -59 -64 86 -109 22 170 -97 -43 57 -103 108 89 -173 40 53 -97 142 31
3421 31 -177 143 2 -130 220 -5 -214 178 -6 -134 241 -79 -218 259 -12 -158 222 -94 -170 256 -65
3442 -65 -145 250 -103 -171 255 -57 -115 195 -131 -104 244 -94 -122 140 -94 -40 148 -108 -24 99 -107 34 108
3465 108 -90 10 4 -100 126 46 -115 74 -11 -63 157 -68 -86 171 -98 -74 214 -125 -63 219 -181 -54 285
3488 285 -184 -103 277 -153 -91 235 -191 -70 281 -160 -62 220 -193 -52 203 -143 37 166 -237 8 213
3509 213 -150 23 143 -189 20 131 -147 30 134 -104 10 40 -51 58 -7 -5 96 -68 -62 76 -98 42
3531 42 184 -161 -71 170 -155 8 220 -132 -24 119 -202 59 228 -165 52 118 -245 109 160 -251 158
3552 158 192 -330 54 172 -251 148 230 -250 34 120 -252 89 223 -102 16 -7 -161 120 73 -52 112 -65
3574 -65 -135 104 -40 -22 196 -72 -119 81 -70 -9 118 -24 35 5 -179 57 71 -70 193 8 -283 121 50
3597 50 -215 260 138 -327 85 64 -242 236 152 -243 94 32 -224 147 84 -100 175 -54 -224 187 0 -123
3619 -123 260 -28 -221 148 -63 -129 271 38 -185 55 -34 -61 118 22 10 21 -131 19 29 -56 171 17 -210
3642 -210 106 42 -189 180 103 -175 84 -4 -176 180 74 -126 125 -79 -126 186 -58 -63 256 -131 -175 249
3664 249 -88 -120 292 -96 -170 225 -104 -162 247 1 -108 123 -70 -45 142 -56 -3 73 -135 40 91 -127
3686 -127 107 87 -189 76 111 -150 52 51 -130 91 18 -108 85 -9 -51 130 -95 -68 184 -131 -61 253 -139
3709 -139 -143 222 -104 -84 250 -143 -142 225 -66 -89 168 -102 -50 149 -84 35 133 -161 18 118 -130 82 91
3732 91 -213 78 153 -164 58 91 -138 78 79 -102 65 0 -85 107 -11 -62 106 -119 -37 224 -102 -121 176
3755 176 -116 -57 250 -112 -103 182 -111 -53 198 -92 -73 94 -100 63 139 -174 -13 90 -129 99 118 -214
3777 -214 45 117 -149 98 122 -180 23 96 -83 74 9 -124 95 38 -47 60 -113 -65 200 -32 -43 137 -178
3800 -178 -88 231 -2 -10 116 -208 -78 230 -8 -14 56 -181 1 142 -102 48 93 -179 74 124 -189 56 113
3823 113 -138 140 118 -266 -41 121 -12 150 31 -260 -46 42 41 202 -21 -197 -20 -50 63 250 -59 -179
3845 -179 65 -50 -8 165 -88 -50 146 -64 -43 31 -122 79 190 -49 -15 -73 -238 163 290 -61 -33 -121 -274
3868 -274 210 291 -97 -10 -76 -223 130 171 -67 50 -51 -146 154 36 -139 98 19 -13 165 -142 -252 144
3890 144 101 57 137 -211 -261 96 126 143 128 -228 -229 52 109 196 60 -250 -74 93 -20 106 25 -173 65 103
3914 103 -107 17 -30 -88 195 128 -119 -61 -126 -24 329 94 -181 -80 -156 11 355 34 -191 -6 -127 -17
3936 -17 286 -9 -170 41 -49 30 178 -128 -119 127 21 46 33 -230 -52 207 19 21 -22 -247 -14 231 59
3959 59 34 -69 -214 66 193 46 -17 -129 -105 150 81 -51 4 -112 -26 202 -10 -115 22 -81 28 230
3981 230 -62 -154 28 -37 100 170 -184 -136 100 -18 105 108 -238 -70 139 -33 75 93 -241 -42 191 -19
4003 -19 20 13 -187 40 184 -38 -31 -45 -88 115 95 -87 -18 -42 -37 150 51 -124 -24 -32 49 166 -39 -155 -16 17
4029 17 125 108 -142 -73 44 -21 131 81 -198 -24 109 -43 100 61 -239 36 186 -55 6 -25 -174 135 177
4052 177 -113 -33 -60 -102 183 141 -139 -40 -48 -60 219 104 -174 -42 11 22 156 4 -178 4 71 60 74 -100
4076 -100 -98 49 65 103 12 -197 -50 108 67 104 -50 -246 36 193 27 30 -95 -189 125 168 -39 19 -91 -146
4100 -146 216 139 -115 6 -86 -76 266 80 -216 -28 -3 5 222 -15 -246 0 50 51 169 -62 -210 38 85
4123 85 92 105 -150 -162 98 104 61 -15 -168 -54 153 86 22 -92 -143 64 143 45 8 -133 -126 176 124 -32 -9 -159
4149 -159 -77 248 72 -135 -12 -100 -25 267 -5 -155 21 -45 22 229 -44 -182 52 9 53 179 -136 -182 105
4172 105 51 44 81 -134 -109 131 54 38 23 -136 -39 143 49 23 -63 -134 44 122 4 -23 -90 -75 121 58 -36 -1 -105
4199 -105 -44 158 20 -50 9 -106 3 187 -48 -98 40 -87 39 160 -91 -77 84 -61 29 135 -117 -60
4221 -60 77 -55 59 116 -151 -32 105 -32 37 57 -134 1 111 -53 28 34 -92 8 60 -10 22 -20 -70 47
4245 47 35 -12 17 -70 -28 86 -28 -18 60 -82 -12 94 -45 2 65 -121 -6 110 -72 2 49 -120 32 101 -102
4270 -102 11 58 -137 31 91 -102 12 41 -120 48 99 -95 -10 30 -63 69 44 -80 13 3 -48 68 8 -70
4294 -70 2 -29 -7 90 -22 -90 29 2 32 73 -73 -44 40 -31 27 41 -108 -4 43 -42 69 35 -164 28 91 -53
4320 -53 57 8 -125 80 92 -79 8 -6 -89 88 59 -75 14 -31 -70 133 54 -109 -4 -32 -27 135 8 -112 17
4345 17 3 -13 66 -27 -67 32 -9 18 28 -68 -24 41 10 47 -29 -132 37 100 -3 35 -60 -135 83 83 -30 35 -55 -117
4373 -117 74 59 -48 42 -50 -77 125 5 -111 39 0 -4 107 -72 -139 74 43 16 84 -93 -154 52 66 67 72 -127
4399 -127 -119 52 54 69 26 -109 -28 60 -17 6 3 -53 58 45 -58 -30 -47 -5 148 54 -101 -92 -99 52 219 27 -119
4426 -119 -68 -91 35 194 -2 -104 6 -69 -4 139 -50 -84 73 -14 -18 45 -124 -36 173 38 -47 -61 -166 22
4450 22 203 64 -39 -86 -176 21 195 82 -38 -91 -130 45 130 14 -22 -51 -19 77 -8 -65 -6 3 67 86 -91 -134
4476 -134 6 57 147 115 -162 -198 13 81 170 88 -193 -153 37 38 128 65 -164 -63 84 -14 54 32 -123 33 131
4501 131 -51 -68 -37 -52 140 157 -104 -149 -69 2 173 127 -97 -131 -78 21 157 92 -82 -99 -30 38 126 -12 -80 -13
4527 -13 28 69 32 -103 -48 67 43 64 -37 -180 -17 125 82 67 -81 -198 24 164 52 14 -88 -155 77 122
4551 122 -18 -11 -66 -93 92 81 -64 -28 -41 -14 140 29 -126 -38 24 55 109 -39 -144 -17 45 61 68 -71 -110 12
4577 12 54 72 29 -108 -60 63 78 52 -18 -116 16 91 33 21 -68 -85 59 67 -16 10 -62 -68 108 62 -54 -24 -49 0
4605 0 144 29 -120 -16 -9 22 117 -37 -120 2 8 35 107 -38 -106 6 22 34 64 -78 -66 49 28 7 11 -55 7
4632 7 71 1 -14 -20 -43 50 80 -12 -21 -67 -54 83 75 -25 -25 -61 -27 100 30 -40 -4 -37 -27 86 -2 -31 28 -27 2 59 -53
4663 -53 -65 59 1 11 27 -89 -42 90 21 -5 23 -89 -48 73 13 8 18 -81 -15 56 -12 10 -5 -41 27 36 -49 7 7
4692 7 -15 37 -9 -48 12 6 0 56 -7 -47 3 -16 28 59 -39 -38 30 -28 10 49 -46 8 59 -43 7 62 -40 -4 60 -24 12
4723 12 29 -53 19 50 -50 1 23 -44 26 34 -56 17 11 -42 25 19 -28 26 13 -15 28 1 -39 11 0 -22 30 -20 -21 32 -24 -21
4755 -21 37 -17 3 32 -44 11 53 -43 -12 29 -46 -4 28 -50 16 19 -64 21 36 -43 18 5 -46 51 33 -62 11 16 -33 52 8
4786 8 -61 26 -4 -23 46 0 -41 11 -17 -6 56 -29 -64 16 3 -3 27 -46 -10 43 -12 3 18 -56 -11 44 -13 13 -10 -62 29
4817 29 56 -23 3 -9 -43 41 46 -53 -4 -7 -37 59 22 -52 11 -10 -13 82 6 -64 14 -4 20 60 -36 -61 43 16 3 38 -48
4848 -48 -42 52 14 5 6 -66 -21 66 5 14 -10 -74 24 75 -18 0 -7 -45 46 52 -35 -11 -24 -39 75 36 -59 -13 -19 -1 94 -5 -76
4881 -76 -4 -11 21 58 -43 -71 39 1 32 53 -66 -58 37 4 31 23 -79 -26 63 10 9 3 -69 24 73 -8 -6 8 -57 40 63
4912 63 -17 -3 -30 -38 73 54 -34 -45 -15 11 89 8 -62 -7 -11 30 67 -39 -45 5 -8 42 49 -54 -58 26 13 47 18 -82 -21
4943 -21 61 1 19 -1 -81 11 70 -13 3 -14 -72 37 71 -14 -4 -25 -29 79 52 -51 -26 -25 -16 64 14 -54 -8 -12 17 73 -17
4974 -17 -68 -4 3 28 55 -51 -64 19 16 49 18 -74 -42 49 -5 14 -5 -76 -7 49 11 12 -33 -67 42 68 -17 -6 -32 -29 73
5005 73 33 -57 -8 -39 -15 87 11 -40 -1 -35 12 75 -9 -59 8 -2 16 48 -44 -38 48 -1 14 22 -60 -24 42 15 18 -1 -60
5036 -60 1 64 26 8 -18 -65 35 61 -5 2 -13 -32 45 18 -18 6 -13 -29 48 16 -40 2 -6 11 56 -29 -57 9 9 26 46
5067 46 -36 -33 22 3 25 40 -39 -30 21 -3 18 32 -57 -8 39 -11 6 4 -39 31 52 -45 -23 -12 -31 49 47 -29 -3 -17 -29 58
5099 58 31 -33 -15 -14 2 50 -3 -36 13 -3 -1 29 -16 -24 16 -6 -4 30 -28 -25 38 9 13 17 -43 -11 43 1 -1 -5 -53 15 29 -18 6
5134 6 -6 -59 21 35 -33 3 -10 -28 30 15 -47 0 -1 -20 30 -6 -35 6 -7 -17 29 -8 -39 11 -7 4 23 -26 -26 11 6 -4
5166 -4 16 -32 -14 23 -30 6 7 -27 -2 15 -17 5 -2 -36 7 15 -24 1 -6 -27 21 6 -40 11 -10 -40 17 -7 -15 17 -5 -13 30 0
5200 0 -31 9 -10 -4 30 -15 -25 19 -12 -15 15 -7 -8 13 -16 -5 32 -8 -9 14 -15 10 22 -32 5 14 -31 10 10 -21 17 9 -18 10
5234 10 5 -28 5 10 -13 20 -8 -15 17 3 -19 17 -7 -17 11 -2 -1 27 -23 -34 13 -4 0 13 -30 -8 25 -20 6 14 -28 -11 32
5267 32 -7 13 6 -33 -1 23 -32 -7 7 -29 11 14 -39 -8 14 -17 9 11 -40 -10 -3 -22 39 14 -46 -8 -9 -23 28 4 -26 1 -10
5300 -10 -7 9 2 0 8 -9 -12 16 -25 7 26 3 -7 -7 -36 19 42 -20 -1 -5 -35 22 38 -14 -1 -9 -50 9 25 -14 9 15 -41 13 4
5335 4 -43 23 30 -16 10 -3 -28 28 15 -10 8 -9 -48 12 20 8 25 -31 -39 6 8 15 25 -12 -14 0 -20 -5 13 -18 9 -1 -24 8
5369 8 3 -31 29 13 -53 1 3 -20 50 12 -39 11 -10 -27 51 20 -32 16 -21 -39 27 23 -26 30 5 -35 15 -3 -16 38 -3 -27
5401 -27 16 -6 -6 42 7 -21 3 -8 -6 19 8 0 -14 -16 -3 8 -2 8 -8 -19 26 -19 -20 36 -3 -23 25 -29 -34 34 -2 -8 34 -33
5435 -33 -44 31 -5 -27 39 -20 -31 53 -22 -24 44 -8 -16 52 -5 -20 30 -16 -18 39 -11 -15 18 10 -13 14 -6 -18 18 14 -1 -2 -16 -6
5469 -6 -2 7 20 -29 -19 6 -16 10 28 -42 -9 47 -18 19 30 -52 -1 24 -41 6 34 -42 -2 50 -44 -15 23 -43 -4 52 -37 -27
5501 -27 13 -22 6 48 -21 -21 8 -34 3 33 -36 -22 9 -7 14 25 -16 1 2 8 7 -4 13 8 -10 15 4 -25 6 7 -21 31 11
5534 11 -45 -2 19 -16 23 14 -47 17 25 -29 10 14 -52 11 29 -25 19 3 -51 21 31 -41 1 34 -29 19 30 -41 15 23 -7 19
5566 19 17 -28 -17 10 -3 5 7 -17 -10 4 15 4 -16 0 -1 -16 15 10 -17 14 -14 -24 16 -6 -35 26 -3 -23 14 -13 -36 34 9
5599 9 -34 28 2 -33 41 6 -41 23 -9 -43 29 12 -26 20 -8 -32 39 14 -23 21 1 -22 26 6 -3 6 -2 -12 15 9 -16 -12 9
5632 9 22 -9 -8 15 -5 -5 22 -10 -6 18 -15 -16 37 -18 -16 16 -15 -3 30 -27 -20 26 -13 -3 28 -19 -16 36 -20 -14 35 -13 -15 27 -19
5667 -19 -12 20 -16 -15 29 -17 -18 17 -3 -3 17 -3 2 6 -7 -7 12 6 -7 4 -10 4 -2 2 -11 -12 10 6 -1 0 9 -16 5 15 0 -3 5 -29 6
5706 6 16 -22 -12 23 -22 6 12 -23 3 16 -17 9 39 -25 18 14 -19 14 18 -33 12 26 -7 -10 5 -18 10 8 -5 15 18 -5 -8 10
5740 10 4 6 -3 -20 15 -2 -8 -7 2 9 -4 -8 0 3 0 13 10 3 14 20 -17 22 20 -7 12 6 -15 26 0 -29 19 7 -21 20 11 -4 14 5 -22
5779 -22 24 9 -23 11 26 -13 17 -9 -15 7 8 -14 11 10 -15 17 7 -3 12 2 -21 12 7 -12 1 4 -7 9 -13 -5 0 8 -3 -6 6
5814 6 12 14 -7 4 9 8 14 3 -5 22 -15 -8 11 -6 -2 20 -10 -7 12 -9 -10 29 10 -7 6 -12 -3 22 -6 -11 23 11 -16 12 -11 -2 17
5851 17 -11 -1 11 -4 -10 5 -3 -1 16 -25 -15 8 0 -6 0 -7 -3 0 -5 6 3 -12 -7 5 5 14 7 8 11 -9 -14 16 5 12 7 -24 -6 6 -14 0
5891 0 23 -12 -19 -3 -12 14 22 -16 -13 11 2 10 19 -13 -5 11 -18 -3 30 -7 -2 12 -18 -5 19 -11 10 19 -7 -21 -14 -15 10 25 -11 -8 -11 -23
5929 -23 9 9 5 7 -3 -5 23 6 11 14 -6 -4 5 -1 1 15 2 -2 -2 -7 10 9 2 17 8 -25 -5 28 2 25 15 -21 -4 12 1 11 14 -12 3
5968 3 -5 -22 11 8 -14 -1 6 -17 9 4 2 36 -1 -20 13 -1 -1 17 -8 -15 -4 -13 -1 22 1 6 2 -13 16 5 -4 5 8 -9 0 10 -6 12
6006 12 15 -4 7 11 -16 13 12 -11 3 -1 -9 3 13 -2 9 2 -19 12 -7 6 13 -2 -13 -2 3 -4 12 -18 -7 14 -3 -11 14 -14 2
6041 2 8 -12 -4 13 1 0 2 -14 12 4 -19 11 7 -12 9 3 -5 6 -4 -11 15 15 -15 13 2 -12 1 -10 -11 14 0 -23 12 5 -2 12 6 -6
6079 -6 7 -11 -9 26 6 7 13 -6 0 4 -7 -5 12 -7 -1 8 -10 5 16 -4 11 5 -7 -3 6 -5 15 -8 -25 10 2 5 26 1 -21 4 -7
6116 -7 -10 18 5 -16 21 -7 3 17 -1 -11 20 -7 0 7 -5 2 13 -3 -7 -2 -17 11 18 4 2 -11 -15 22 12 -5 1 -3 -17 15 5 -6
6152 -6 -1 5 -8 13 10 -10 -3 -16 -12 14 -12 -22 11 -10 -7 -4 -23 -11 0 -10 15 13 -17 -10 -4 6 7 -1 -19 -16 0 5 0 -9 -23 9 2 -4 -5 -6 -11
6193 -11 11 0 10 9 -10 1 29 11 -10 -1 -14 2 10 4 3 -13 -13 -1 21 -7 -10 14 -12 0 27 -4 -16 0 -9 14 22 -15 -9 13 3
6228 3 5 1 -25 -8 5 1 8 7 -22 0 15 9 3 -10 -6 2 3 -6 -2 -8 -13 1 10 3 5 -20 -8 11 6 -12 0 -9 6 25 -6 -8 -6 -23 0 3 -16 -8
6270 -8 -4 -13 8 5 -10 -5 -12 -17 5 -5 -14 -10 -3 -9 16 -1 -3 4 -4 -7 -3 -2 -4 -3 -3 0 11 -19 -6 -1 4 4 -1 -9 2 -1 -1 -4 -2 -1 -1 4 2 14 0 -13 16
6317 16 3 -5 2 -4 2 10 5 -8 12 4 2 11 -7 -1 10 -2 0 12 12 2 16 5 -2 15 -3 -1 4 -7 -4 0 2 7 2 -7 3 7 -9 -3 5 2 9 10 -1 5
6361 5 -3 8 11 22 -1 -10 -16 -1 12 -11 -9 -5 -2 -2 5 -5 -4 11 -4 -1 21 2 -4 -6 -1 3 10 -5 -4 7 9 4 8 -3 -13 -3 16 5 15 -8 -6
6402 -6 4 19 5 -8 -13 -5 8 2 8 -1 -3 0 14 13 4 -2 -12 13 11 5 -1 -14 0 11 3 4 -16 -11 6 12 0 -11 6 -7 0 10 7 -15 -2 -9 13
6443 13 15 -12 -16 -2 12 7 6 -11 -7 5 10 6 19 -11 -2 7 11 16 -4 -15 4 15 14 -7 -14 -17 9 21 19 -9 -8 -1 8 6 9 -3 -13 9 16 8 -3
6484 -3 1 -12 5 -2 -15 -17 -9 -1 4 18 -7 -6 -4 10 18 13 -10 6 -3 10 24 6 -2 -10 4 3 15 1 -14 4 13 12 12 6 -9 6 17 17 6 3 8
6525 8 13 10 13 -5 1 8 9 13 -6 1 0 2 15 14 4 -3 -3 -3 5 0 -11 -8 -7 4 4 1 -6 -3 -1 6 5 2 -6 4 8 9 6 -7 4 1 6 3 -3 2 -4 -2 14 11 11 6 12
6576 12 6 12 12 4 4 1 4 -3 3 -16 2 2 -2 1 2 -12 -6 16 -7 -4 1 6 8 13 1 9 3 -1 10 8 -7 5 4 -3 0 3 12 9 7 -1 12 1 0 6 4 11 5 3 -8
6625 -8 9 -4 0 6 8 -12 17 6 13 13 6 9 18 0 7 4 4 15 3 0 15 18 10 9 7 -5 4 3 -4 8 13 4 16 13 -6 0 3 -3 20 13 -6 9 -4 -4
6669 -4 1 2 2 5 12 10 18 4 0 -2 3 1 14 -6 -1 6 3 -3 -8 -16 -11 14 6 6 0 -8 3 12 0 10 -3 -8 12 -3 5 -11 -12 -3 10 -4 -7 -9 3 1 9 3 4
6716 4 0 1 4 14 -2 -7 0 -14 -1 11 -4 -12 -1 1 7 4 -9 -11 7 8 7 10 -3 -3 7 6 -2 3 -14 8 11 11 12 -16 -9 -2 8 7 7 -6 1 10 -1 -1
6760 -1 -2 3 5 12 -9 0 -14 -5 9 11 1 0 -10 -3 10 12 0 -4 -6 -3 18 12 1 5 12 -2 -9 -2 -10 4 5 -1 7 -4 -6 8 0 13 8 4 -19 8 14 9 -7
6805 -7 -24 1 6 5 15 -3 -3 3 7 -8 -3 -17 -4 8 13 7 -3 1 -9 0 2 4 -5 -1 -3 5 4 -9 1 -2 3 20 10 4 0 2 4 20 13 -3 -4 8 1 9
6849 9 2 -4 -8 -2 20 12 -1 4 -1 9 10 -5 -9 8 7 5 14 -5 -4 -1 -2 1 9 -2 0 5 8 8 4 -5 5 16 4 -2 10 1 6 6 -7 -7 5 3 2 6 -3 -9 -3 4
6897 4 -3 5 6 5 7 -14 -1 15 2 7 14 0 3 11 7 -2 7 12 8 5 6 15 6 5 18 -6 12 4 1 6 9 5 1 -4 3 8 1 -6 0 5 7 -3 0 10 10 3 -11 -1 5
6946 5 6 -17 4 -6 0 -4 2 -2 1 5 12 12 -2 -7 8 7 4 10 -4 -11 0 4 2 -4 -4 -7 1 8 3 4 11 3 -2 5 4 -6 0 9 6 -5 -4 -10 -7 19 11 1 -6 -3 -6 12
6996 12 1 18 -1 5 6 0 2 4 -2 -7 16 8 7 -2 12 5 14 11 10 13 13 13 11 22 -12 -2 -13 -1 4 -7 -2 -4 5 15 4 0 17 5 7 18 4 4 4
7039 4 -2 8 8 6 -10 2 3 0 5 3 4 13 -11 2 10 5 15 10 -3 8 6 0 -4 20 8 1 -3 -4 8 9 -5 -7 6 12 6 4 6 -2 3 0 13 10 0 13 3
7084 3 14 0 7 1 9 3 12 11 -7 -1 2 6 7 18 0 0 7 -3 -2 7 1 1 9 8 -4 -6 -6 -4 3 3 4 -6 9 12 9 10 3 1 -3 7 7 -3 -1 -1 5 7 3 8 9 -5
7134 -5 -4 2 -2 6 1 4 3 16 -2 -10 6 5 6 1 3 -3 -6 6 0 0 -7 6 5 15 16 3 -8 2 -6 5 -9 -10 -8 -10 -4 -2 -12 -8 -3 5 -6 8 0 5 15 1
7180 1 1 1 4 2 0 -14 6 -1 9 1 10 9 -1 -7 0 6 5 -5 -4 4 10 11 -5 5 2 11 4 5 5 11 3 6 -7 -1 6 -4 6 3 3 -6 3 4 -2 0 -1 -1 6 1 7 7 8
7231 8 0 8 -1 -6 1 5 3 5 -1 7 6 -8 -3 3 6 -9 -4 -6 2 -1 0 7 1 0 8 0 4 2 4 13 1 0 2 -1 4 6 5 8 7 -4 2 12 15 -11 -9 12 13 -1 6 13 -1 7
7283 7 -3 1 13 2 7 -9 2 7 0 -9 5 5 4 -3 -19 11 12 1 6 -3 6 -8 3 3 0 0 3 1 -5 5 -1 1 6 6 8 -1 3 4 -12 3 -2 5 4 5 -1 10
7329 10 5 0 4 4 4 3 13 5 -3 -8 3 11 -6 1 10 -2 -4 0 -1 3 1 6 11 12 13 5 1 -2 -5 6 0 -1 -5 4 6 -9 -3 -4 3 -3 3 8 0 7 -2 -1 5 -5 1 -8 -2 -3 -7
7382 -7 3 -1 2 3 -3 -3 -9 -2 3 -4 -4 -3 -5 -9 -1 -5 -5 -3 -5 -7 3 9 -1 3 2 -5 -4 3 -12 1 4 7 -1 -6 -2 11 2 0 14 0 3 -3 9 2 0 -8 4 13 -3 0
7432 0 7 1 13 3 5 -14 5 15 4 -2 -1 5 -1 -3 -1 -10 1 -1 -4 -6 6 -2 2 4 3 -7 -7 -3 -7 -2 4 -8 -5 7 -6 -6 -7 -1 2 3 -3 5 -4 -5 -4 -5 -11 -1
7480 -1 4 -5 4 2 -9 -4 0 -11 2 7 -6 2 0 6 15 1 -3 5 -2 11 8 -2 6 -10 1 -4 -4 2 -8 4 2 -2 4 1 3 -3 7 8 -3 -4 10 -7 -6 -6 2 2
7526 2 -1 -1 -8 4 5 1 -1 3 1 12 -2 7 6 -4 4 -7 5 0 -6 10 -9 0 -4 -4 -10 -2 0 4 10 4 11 3 -4 0 4 9 5 5 -4 2 -1 -9 -3 3 3 -4 -3 -1 8 1 -9 7
7578 7 2 -4 0 -3 -9 -12 0 -2 -1 -6 -1 -4 -5 -5 -13 -8 -3 -16 5 -6 8 4 -11 13 -3 -8 5 2 -1 -3 -3 2 -9 4 -3 -8 9 -1 -1 5 4 -7 0 -3 -3 -12 -2
7625 -2 2 -5 -1 -9 9 1 -1 0 6 0 13 0 4 1 -7 0 -4 -1 4 0 3 -3 2 -4 -9 -4 -8 -9 -9 5 -4 -4 6 -4 11 1 4 0 0 -2 0 9 -4 -2 -14 9 -9 5
7673 5 4 -2 -7 -2 2 -15 -15 -8 0 -3 -3 5 -18 -6 -2 -12 -12 -5 -3 3 -2 -10 -6 3 1 -3 8 7 1 0 -2 1 -12 -5 8 -12 -4 -10 2 2 -5 -11 -9 -4 1 -4 3 -6 -12 -8 -11 -3
7725 -3 -11 -10 -7 2 -8 -11 7 -7 4 -3 2 5 9 22 4 5 -3 1 -5 -1 -7 10 -14 -11 -10 7 -2 -15 -4 1 -8 6 1 -6 6 -8 -10 1 -10 0 -9 -9 4
7768 4 -1 14 -4 -5 5 -4 1 2 -1 2 2 -1 9 -1 -1 0 -4 -13 -6 -2 -7 1 0 4 1 2 -3 -3 -2 -5 -1 2 -5 -8 0 -18 1 -6 -3 -1 -8 2 8 0 -10 -4 6 3 -1 10
7818 10 0 8 8 10 0 -3 1 4 -3 -3 -14 2 2 4 10 13 -6 -1 6 -6 10 7 -2 0 10 -2 -10 0 1 0 0 -1 -7 10 1 -3 2 2 -8 0 -5 -1 3 -6 -7 9 -2
7865 -2 -13 1 -13 -7 -12 -4 -3 -2 2 6 2 2 3 6 6 -6 -10 11 0 4 -4 -7 -10 -5 5 -10 11 12 10 8 6 -2 -3 3 -11 -5 1 -6 3 -7 -16 -4 4 3 -7 -1 -9 -8
7913 -8 -4 -1 -10 -15 -1 3 4 2 -2 10 -2 4 2 2 -1 -11 -5 5 -7 -4 4 -3 1 -1 -4 9 5 7 12 -3 9 -2 -9 -3 5 3 -7 2 11 2 4 -7 -4 3 4 1 -11 -9
7961 -9 0 -16 -2 -4 -9 3 -6 -17 -12 2 -4 -13 -6 3 2 -1 3 3 -1 6 1 -5 -3 -16 -4 3 -6 -3 -11 5 1 -7 -11 1 9 2 -2 -8 -9 -9 -8 -1 2 10 -2 -6 -4 -5 1 -11
8011 -11 -12 -8 -6 -5 -4 -10 -3 7 4 5 3 -4 7 -2 -7 0 5 -8 -3 -9 3 -9 -6 1 0 5 7 2 2 -12 -1 3 3 -4 -3 2 -2 -3 -3 -5 5 -1 7 1 -10 -1 3 11 3 14
8061 14 5 -5 1 -3 3 -5 -10 13 7 7 3 2 -6 4 1 0 -1 -7 4 4 -5 -7 -1 -6 -6 -6 0 -3 -6 -6 14 -4 1 -20 8 -9 1 -18 4 -7 -1 10 -14 4
8105 4 -5 10 -9 -10 -5 0 -8 10 2 1 2 8 -4 1 -4 7 2 -6 0 -3 -3 1 7 3 -3 -11 0 4 2 22 2 15 6 -6 -7 5 3 3 2 -1 5 -5 -5 -1 3 -9 -1 2
8153 2 1 1 -2 -3 -3 -2 10 -11 2 5 -12 3 -6 4 -4 -17 -4 -10 -4 -6 4 3 -13 13 4 7 -6 1 8 -7 -6 -2 -11 4 -7 -9 -6 6
8191F
##END NTUPLES=NMR FID
##END=
