##TITLE=1H_LY-823.40
 CCl4, 8 sc, 
 28.5.2019
##JCAMPDX= 6.0         $$ Bruker NMR JCAMP-DX V2.0
##DATA TYPE= NMR FID
##DATA CLASS= NTUPLES
##ORIGIN= UXNMR, Bruker Analytische Messtechnik GmbH
##OWNER= root
$$ XWIN-NMR		Version 3.5
$$ Wed May 29 14:03:49 2019 Russian Standard Time (UT+4h)  she@DPX200
##.OBSERVE FREQUENCY= 200.13155
##.OBSERVE NUCLEUS= ^1H
##.DELAY= (6, 6)
##.ACQUISITION MODE= SIMULTANEOUS
##.ACQUISITION SCHEME= undefined
##.AVERAGES= 8
##.DIGITISER RES= 18
##SPECTROMETER/DATA SYSTEM= spect
##.PULSE SEQUENCE= zg30
##.SOLVENT NAME= CDCl3
##.SHIFT REFERENCE= (INTERNAL, CDCl3, 0, 15.7039)
##AUDIT TRAIL= $$ (NUMBER, WHEN, WHO, WHERE, WHAT)
$$ ##TITLE= Audit trail, XWIN-NMR		Version 3.5
$$ ##JCAMPDX= 5.01
$$ ##ORIGIN= Bruker BioSpin GmbH
$$ ##OWNER= she
$$ F:/spectra/data/she/nmr/H-F/1/audita.txt
$$ ##AUDIT TRAIL=  $$ (NUMBER, WHEN, WHO, WHERE, WHAT)
(   1,<2019-05-29 14:02:44.84 +0400>,<she>,<DPX200>,
      <created by zg, POWCHK disabled, PULCHK disabled
       configuration hash MD5:
       00 E9 B6 7A A2 85 ED C7 34 08 36 98 17 FE 4E 26
       data hash MD5: 16K
       DD B8 33 DA 26 44 A5 62 5F DD A0 7F 37 79 BE 97>)
$$ ##END=
$$ 
$$ hash MD5
$$ A9 8D 76 83 F4 EA AC 0D F8 95 35 A1 43 E5 A0 E7
##$RELAX= 
##$RELAX= 
##$RELAX= 
##$RELAX= 
##$RELAX= 
##$RELAX= 
$$ Bruker specific parameters
$$ --------------------------
##$DU= <F:/spectra>
##$EXPNO= 1
##$NAME= <H-F>
##$PROCNO= 1
##$TYPE= <nmr>
##$USER= <she>
##$AMP= (0..31)
100 100 100 100 100 100 100 100 100 100 100 100 100 100 100 100 100 100 
100 100 100 100 100 100 100 100 100 100 100 100 100 100 
##$AQSEQ= 0
##$AQ_mod= 1
##$AUNM= <au_zg>
##$AUTOPOS= <>
##$BF1= 200.13
##$BF2= 200.13
##$BF3= 200.13
##$BF4= 200.13
##$BF5= 200.13
##$BF6= 200.13
##$BF7= 200.13
##$BF8= 200.13
##$BYTORDA= 1
##$CFDGTYP= 0
##$CFRGTYP= 5
##$CHEMSTR= <none>
##$CNST= (0..31)
1 1 145 1 1 1 1 1 1 1 1 1 1 1 1 1 1 1 1 1 1 1 1 1 1 1 1 1 1 1 1 1 
##$CPDPRG= <>
##$CPDPRG1= <>
##$CPDPRG2= <>
##$CPDPRG3= <>
##$CPDPRG4= <mlev>
##$CPDPRG5= <mlev>
##$CPDPRG6= <mlev>
##$CPDPRG7= <mlev>
##$CPDPRG8= <mlev>
##$CPDPRGB= <>
##$CPDPRGT= <>
##$D= (0..31)
0 1.2 0 0 0 0 0 0 0 0 0 0.03 0 0 0 0 0 0 0 0 0 0 0 0 0 0 0 0 0 0 0 0 
##$DATE= 1559124164
##$DBL= (0..7)
120 120 120 120 120 120 120 120 
##$DBP= (0..7)
150 150 150 150 150 150 150 150 
##$DBP07= 0
##$DBPNAM0= <>
##$DBPNAM1= <>
##$DBPNAM2= <>
##$DBPNAM3= <>
##$DBPNAM4= <>
##$DBPNAM5= <>
##$DBPNAM6= <>
##$DBPNAM7= <>
##$DBPOAL= (0..7)
0.5 0.5 0.5 0.5 0.5 0.5 0.5 0.5 
##$DBPOFFS= (0..7)
0 0 0 0 0 0 0 0 
##$DE= 6
##$DECBNUC= <off>
##$DECIM= 24
##$DECNUC= <off>
##$DECSTAT= 4
##$DIGMOD= 1
##$DIGTYP= 9
##$DL= (0..7)
0 120 120 120 120 120 120 120 
##$DP= (0..7)
150 150 150 150 150 150 150 150 
##$DP07= 0
##$DPNAME0= <>
##$DPNAME1= <>
##$DPNAME2= <>
##$DPNAME3= <>
##$DPNAME4= <>
##$DPNAME5= <>
##$DPNAME6= <>
##$DPNAME7= <>
##$DPOAL= (0..7)
0.5 0.5 0.5 0.5 0.5 0.5 0.5 0.5 
##$DPOFFS= (0..7)
0 0 0 0 0 0 0 0 
##$DQDMODE= 0
##$DR= 18
##$DS= 0
##$DSLIST= <SSSSSSSSSSSSSSS>
##$DSPFIRM= 0
$$ [...]
##$SUBNAM2= <"">
##$SUBNAM3= <"">
##$SUBNAM4= <"">
##$SUBNAM5= <"">
##$SUBNAM6= <"">
##$SUBNAM7= <"">
##$SUBNAM8= <"">
##$SUBNAM9= <"">
##$SW= 24.9336996594482
##$SWIBOX= (0..15)
0 0 2 0 0 0 0 0 0 0 0 0 0 0 0 0 
##$SW_h= 4990.01996007984
##$TD= 16384
##$TD0= 1
##$TE= 0
##$TE2= 300
##$TE3= 300
##$TEG= 300
##$TL= (0..7)
0 120 120 120 120 120 120 120 
##$TP= (0..7)
150 150 150 150 150 150 150 150 
##$TP07= 0
##$TPNAME0= <>
##$TPNAME1= <>
##$TPNAME2= <>
##$TPNAME3= <>
##$TPNAME4= <>
##$TPNAME5= <>
##$TPNAME6= <>
##$TPNAME7= <>
##$TPOAL= (0..7)
0.5 0.5 0.5 0.5 0.5 0.5 0.5 0.5 
##$TPOFFS= (0..7)
0 0 0 0 0 0 0 0 
##$TUNHIN= 0
##$TUNHOUT= 0
##$TUNXOUT= 0
##$USERA1= <user>
##$USERA2= <user>
##$USERA3= <user>
##$USERA4= <user>
##$USERA5= <user>
##$V9= 5
##$VALIST= <valist>
##$VCLIST= <CCCCCCCCCCCCCCC>
##$VD= 0
##$VDLIST= <DDDDDDDDDDDDDDD>
##$VPLIST= <PPPPPPPPPPPPPPP>
##$VTLIST= <TTTTTTTTTTTTTTT>
##$WBST= 1024
##$WBSW= 4
##$XGAIN= (0..3)
0 0 0 0 
##$XL= 0
##$YL= 0
##$YMAX_a= 70188
##$YMIN_a= -89286
##$ZGOPTNS= <>
##$ZL1= 120
##$ZL2= 120
##$ZL3= 120
##$ZL4= 120
##$ABSF1= 10
##$ABSF2= 0
##$ABSG= 5
##$ABSL= 3
##$ALPHA= 0
##$AQORDER= 0
##$ASSFAC= 0
##$ASSFACI= 0
##$ASSFACX= 0
##$ASSWID= 0
##$AUNMP= <proc_1d>
##$AZFE= 0.1
##$AZFW= 0.1
##$BCFW= 1
##$BC_mod= 2
##$BYTORDP= 1
##$COROFFS= 0
##$CY= 11.3945322036743
##$DATMOD= 1
##$DC= 2
##$DFILT= <>
##$DTYPP= 0
##$F1P= 18.9103706918063
##$F2P= -1.10871071338519
##$FCOR= 0.5
##$FTSIZE= 0
##$FT_mod= 4
##$GAMMA= 1
##$GB= 0.15
##$INTBC= 1
##$INTSCL= 1
##$ISEN= 128
##$LB= 0.24
##$LEV0= 0
##$LPBIN= 0
##$MAXI= 10000
##$MC2= 0
##$MEAN= 0
##$ME_mod= 0
##$MI= 1.114404
##$NCOEF= 0
##$NC_proc= 0
##$NLEV= 6
##$NOISF1= 3.799351
##$NOISF2= 2.8
##$NSP= 1
##$NTH_PI= 0
##$NZP= 0
##$OFFSET= 15.70392
##$PC= 1
##$PHC0= -8577.99
##$PHC1= 18.60025
##$PH_mod= 1
##$PKNL= yes
##$PPARMOD= 0
##$PSCAL= 0
##$PSIGN= 0
##$REVERSE= no
##$SF= 200.130013532006
##$SI= 16384
##$SIGF1= 3
##$SIGF2= 2
##$SINO= 400
##$SIOLD= 16384
##$SREGLST= <1H.CDCl3>
##$SSB= 0
##$STSI= 0
##$STSR= 0
##$SW_p= 3612.71676300578
##$SYMM= 0
##$S_DEV= 0
##$TDeff= 0
##$TDoff= 0
##$TI= <>
##$TILT= no
##$TM1= 0
##$TM2= 0
##$TOPLEV= 0
##$USERP1= <user>
##$USERP2= <user>
##$USERP3= <user>
##$USERP4= <user>
##$USERP5= <user>
##$WDW= 1
##$XDIM= 8192
##$YMAX_p= 0
##$YMIN_p= 0
$$ End of Bruker specific parameters
$$ ---------------------------------
##NTUPLES= NMR FID
##VAR_NAME=  TIME,          FID/REAL,        FID/IMAG
##SYMBOL=    X,             R,               I
##VAR_TYPE=  INDEPENDENT,   DEPENDENT,       DEPENDENT
##VAR_FORM=  AFFN,          ASDF,            ASDF
##VAR_DIM=   8192,          8192,            8192
##UNITS=     SECONDS,       ARBITRARY UNITS, ARBITRARY UNITS
##FACTOR=    0.0002004,     1,               1
##FIRST=     0,             0,               0
##LAST=      1.6414764,     0,               0
##MIN=       0,             -89286,          0
##MAX=       1.6414764,     70188,           0
$$ Real data points
##PAGE= N=1
##DATA TABLE= (X++(R..R)), XYDATA
0@%%%%%%%%%%%%%%qJ6j6J6j6J6j6K0k8L2l2L6m4M8n2O0o7P5q4R2j00J12j25J36
38G1j51J68j87K07k25K49k79L11l47L90m38M95n67O54p66R12j114J408j859K629
58A561m154Q132l3962o0863J55048m1154j06026J30937J712j27567P9753M3921
70D7338r2878M6282M7556p5817J2275L6512m1455K0008K6892m0610J0909J5479
82A2491l5101K1223K5564l4101O210J8050k8641M152K2924j0987o18J270r672
95g236Q874m548m855K5819j3666k5248L2245m428l3536L9322J1265m7670K1922
108a740K1615m1477J6016L0577l4259K668K1476k9060P306K3896k6098Q735J9055
121A8710l7975Q994L4740l7125P99M3111l9890j9329N1941k0030l0306M7707n861
$$ plain form
0 0 0 0 0 0 0 0 0 0 0 0 0 0 0 0 -8 8 -8 8 -8 8 -8 12 -16 16 -16 20 -24 24 -28 32 -35 40 -44 48 -52 60 -65 71
38 71 -80 88 -99 108 -117 132 -147 164 -183 207 -231 264 -303 351 -415 497 -617 791 -1068 1561
58 1561 -2593 5539 -28423 -89286 65762 24608 -81418 49519 51231 -76336 3417 47338
70 47338 -45540 742 48298 -27519 -15244 21268 -20187 -179 26713 -13897 -2988 12491
82 12491 -22610 -1387 24177 -9924 -3714 14336 -14305 -10153 12771 1784 1166 2436 -7236
95 -7236 1638 -2910 -7765 18054 4388 -20860 11385 6957 -26579 12743 24008 -23662 -1740
108 -1740 19875 -21602 -5586 24991 -9268 -6600 14876 -14184 -6878 17018 -9080 -345 18710
121 18710 -19265 -10271 24469 -12656 -11857 31254 -8636 -27965 23976 3946 -26360 21347 15486
134A5486m4389L1309J4641l3805J6835J8812k7396m89J5564r472J041Q064n310
147H91r65l138k798J1168j716p957J0366m129j3298J3788M933j2897Q869L445
161F562j5652O408Q582r571N609M867j3353L710P607r780N415Q579j3398k38R986
176E333r219J80J2067p771n867P789l502k632P205j918k432K183m657J445N407
191C611n499J969N924j0489q67J1771p346m212J2886o202j0515J1949R17j0290
205f393Q990L954j1889K425O833n815N22N539l745k988J992M46L83K91M63N59
221A567l557p91M855j264k276M399k310m998N089J299m324M168J057o400K216
236a270L280l699K215K798n025j76L085k406Q27L018k670j122J316j466R56K089
$$ plain form
134 15486 -28903 2406 17047 -16758 77 18889 -8507 -8996 6568 -2904 -1863 6201 891
147 891 -74 -3212 -6010 5158 3442 -4515 5851 1722 -11576 2212 7145 -5752 3117 6562
161 6562 -9090 -2682 5900 -3671 1938 6805 -6548 -2838 4769 -5011 404 8983 -4415 -4653 5333
176 5333 -3886 -3706 8361 590 -5277 2512 -990 -3622 3583 1665 -767 1416 -3241 -1796 3611
191 3611 -1888 81 6005 -4484 -5351 6420 -926 -5138 7748 1546 -8969 2980 3897 -6393
205 -6393 2597 6551 -5338 -2913 3920 -1895 -1373 4166 421 -2567 -575 -129 254 545 1008 1567
221 1567 -1990 -2781 2074 810 -1466 2933 623 -4375 714 2013 -2311 1857 2914 -3486 -1270
236 -1270 2010 -1689 526 3324 -1701 -1877 1208 -1198 -371 2647 -23 -1145 171 -1295 -339 1750
252A750j494q5l8k153J832J772k308J427J064m153J002L477k841L06L376l884
268i50j891M366j029j993L435p14l478J837J278j622J156J156j754j058Q05Q38
284C82j09j81Q15o94j918J446J471j867Q27J722l099o66L265j202j267K863j226
301E62k825K469P61k152J772J087k765K2J654q37J23J259q85j067M08M01J02J31
319B20K91j14j121j01J286j91m05J019p93j472J429P07j273Q93O96j932k8J531
337F42o96j35J252r78j174J068L52n56O29J87r55j26M62M1J29K90j99n54j99M92
357b8L38k16O6P2o29p2O96n9k01M47l32p40M68N47l41O4K55n72k35N31R8j86K50
380B21K5n61j19N42J86k69Q9N1n19K3O59j36l81M98j06q39M65P66o59r3O52o83
$$ plain form
252 1750 256 171 133 -2020 -188 1584 -724 703 1767 -2386 -1384 2093 -748 -442 2934 -950
268 -950 -2841 1525 496 -1497 1938 1224 -2254 -417 861 -761 395 1551 -203 -1261 -456 382
284 382 273 92 907 213 -1705 -259 1212 -655 172 1894 -1205 -1871 1394 192 -1075 1788 562
301 562 -2263 206 967 -1185 587 1674 -1091 -1069 585 -252 -129 1130 245 -822 -414 -13 89 220
319 220 511 397 -724 -825 461 270 -135 884 91 -1381 48 755 -518 375 1071 -861 -889 642
337 642 -54 -189 1063 85 -1089 -21 331 -225 404 591 -364 -490 -28 13 142 432 233 -321 -520 -28
357 -28 310 94 160 232 -397 -469 227 168 -33 414 82 -658 -190 357 16 80 335 -237 -472 59 157 -29 221
380 221 246 -315 -434 108 294 25 114 165 -354 -331 328 192 -189 309 203 -636 -171 595 -64 -157 495 -188
402a88m86J101j0q85O67L27j125K50R81o52k90Q35m80p61Q96L37q72K87N89p75
422b54k43Q71j91n79O64J10r69L75Q26p51k45R11m68p20R21J19r08O70M64j122
442e19J66R30o72k52Q41m23n91P41M2o34M71L05o38j4M56j64j42K63m6l22J31
463g1K85k23j45L56o5m30K93K26l87J72K49m80N8M57l70j13M50k84j80L76k29
484e5j43M59k06l08L91j15k28L96j20k94L77o1l77L52J01l18K18K1l43K99J62
505B08l33J36J33k74J20J12j95J59O2k42R0P9j03J73n3k29K42Qk79K96O5l67K57
528F5J26m72K71L67n00rM24l65j15M81k30l13M21l0l63K47K19k76m8J82r4j02
550a14J86O9k58K4K60j83j93L50rl27K04J29l33K00K83m29l8M09k49j52L67j20
$$ plain form
402 -188 -674 427 417 -468 199 526 -599 -349 632 -20 -310 525 45 -716 180 517 -355 -68 521 -254
422 -254 -497 374 183 -396 268 378 -591 -216 610 -141 -386 525 57 -663 258 377 -531 139 603 -519
442 -519 -353 577 -95 -347 494 71 -520 221 263 -371 100 405 -233 -247 209 45 -97 166 120 -202 -71
463 -71 214 -9 -154 202 137 -293 0 226 -161 11 260 -220 -162 295 -75 -188 262 -22 -202 174 -55
484 -55 -198 261 55 -253 138 23 -205 191 71 -223 154 93 -284 68 169 -149 69 90 -253 46 208
505 208 -125 11 144 -130 -10 102 -93 66 128 -114 -24 55 -48 125 72 -157 85 93 -186 110 175 -192 65
528 65 191 -281 -10 357 -143 -152 272 -93 -208 273 43 -270 151 121 -242 5 224 -52 -100 82 -12 -114
550 -114 72 141 -117 -93 167 -16 -209 141 132 -195 9 138 -195 5 288 -141 -179 230 -19 -171 196 76
572G6k59K69J5k95K44J72l22qK17j13n7J91p8j83J66Q8k26Q5K09k06j26K67j12
595A4j48K95p4l30L22J16m31K36K40m23J25L49n01L8N33m57j79N81l23l01O02
616B84k28m16O18p3n98N22J35n49L71J96n37K58K80m44J18L08l38L0J89k27J31
637C0J00k31J41nj98L34r9l46N04l7o05N68J58p22N38L01r64M72O45j004K52P92
659F24r96M9R30q98p3J044q59l47J086o39m21J105o04o16J137m33p43J117k45
678B18q35R79j48q59R69L2r44P70J45q59P34J56q57O62J87q45O13K43q01N81J85
699C26q03O49K08q39N92K16q56P21K02j060Q35L67j263Q14N95j458P04R32j601
718g19M30J353j600p5J575j250m10J610r62p83J499n06r00J243k51q99R34j01
$$ plain form
572 76 -183 86 101 -194 50 222 -100 -108 109 -4 -61 130 52 -131 35 123 -103 -18 191 -15 -141 126 14
595 14 -134 161 87 -243 79 195 -236 0 240 -183 -58 291 -210 -172 361 -96 -275 306 -17 -318 284
616 284 56 -360 258 185 -413 109 244 -305 66 262 -275 -17 263 -181 -63 245 -93 -63 126 -101 30
637 30 130 -101 40 35 -163 171 72 -274 230 193 -412 156 314 -408 130 431 -533 -61 584 -420 -168 624
659 624 -372 -323 607 -291 -364 680 -179 -526 560 -79 -500 605 1 -615 522 89 -654 463 218
678 218 -617 362 214 -645 324 356 -588 182 327 -532 202 358 -499 163 350 -495 118 361 -440 141 326
699 326 -477 172 380 -459 133 349 -507 214 416 -644 191 558 -705 109 704 -754 -50 882 -719
718 -719 -289 1064 -536 -611 964 -286 -696 914 -48 -831 668 162 -738 505 254 -645 289 188
736A88p25Q62o1p33O62n6n53O94r7n70O38j10n77P09p1n90P01j76o86Q77oq57
758e37Q15P8r87Q20L23j109O72N57j167L73P85r61J47P52q32j0P47n92r5N91n19
779a49QM97n94P8O29o98l4P65o92j81Q93n94m25R81l53o62P87n7o35O25P5o33
801c69M20J52m59K88J40l11K19j2k86L36L5l36K94j0l57L60P5l82L05R2m35K68
823B7J50l25K55R2m57K62K29m13J90K76m68P9L48l87K0M13l05j69K90j11o8J89
845A17r4p9Q6p4O3N3j80J78P2l70J72K84l37K1L04l18p2L64j94j68L06m4k20J34
869DM1o7O8k7rj8n0J08Pj52J55P3k92J21J85k40R9J87l18M0K87k97%L47k85j15
895a48L26k40j06M05j73k64L07l9k34K67Lk23J81k2j63J47M2q7Q3j19m1K02j16
$$ plain form
736 188 -537 325 264 -469 193 137 -416 278 181 -389 249 139 -438 271 200 -390 311 135 -551 326 320 -537
758 -537 278 356 -631 189 512 -597 75 632 -535 -162 623 -338 -191 561 -271 -281 466 -126 -221 370 -149
779 -149 -141 356 -238 -160 469 -229 -263 502 -190 -371 522 -72 -497 484 131 -531 256 199 -436 189 264 -369
801 -369 51 203 -256 32 172 -139 80 68 -218 118 153 -183 111 101 -256 104 179 -203 102 194 -241 27
823 27 177 -148 107 199 -258 4 233 -180 10 286 -182 -103 245 -142 -122 291 -14 -183 107 -4 -72 117
845 117 23 -56 30 -44 19 72 -108 70 142 -228 -56 228 -109 -88 216 -102 -174 190 -4 -172 134 90 -130 4
869 4 45 -22 46 19 10 -8 -58 50 57 -95 60 133 -159 -38 147 -93 6 193 -125 -85 202 -95 -95 252 -33 -148
895 -148 178 -62 -168 237 64 -200 107 68 -166 101 104 -119 62 40 -123 24 66 -21 62 -57 -98 104 -12
918a2o6K18j75j29K85j41j53L76j15l17L26j4k82L46Rl71K80Q4l66K62J59l59
940a55J80J46l92J97K87l71M6K73l16OK97k35n3K86k10j30K50q3r1J57j13m5J48
963G9q9l6J27j12JJ23j88K0K27j93o4K29j77p6K82j61j59L29j14k55K89jk31K42
987I2Mk74J92J29k52R4J46k02L7J20j50M2J46j44k8J03p3J1Q9r5K0P1j04nJ02
1012G1o5J3N1j23kJ52r9l3R3n4o4J01l4n8J13j9j05M3L4j9L0k3k8K1pj0J7JJ0
1041GL9r2k1J35k7q5P2Kj16R2P3j33L5J33j39p1J51k2p1Q6j2j12O6R3r5k1J26
1068I3o5j06O9O3m0J0L9r4k9J21pr2O7L9j23jJ09n5LP6p7j28J53O4j23L8P5j23
1096d4l3J21m1l8J10m9j61R8J06q7j1J04r0o9J09J1q4Q8O8j72k8J53k5p3J10l7
$$ plain form
918 -12 -78 140 -35 -164 121 -20 -173 203 88 -229 97 83 -199 147 156 -215 65 149 -217 45 204 -155
940 -155 25 171 -221 -24 263 -108 -62 211 -105 -99 198 -37 -90 196 -14 -144 106 23 -68 89 -24 -69 79
963 79 -10 -46 81 -31 -30 93 -95 -75 152 -41 -105 124 -53 -129 153 -8 -167 162 48 -207 82 81 -150 92
987 92 96 -178 14 143 -109 -15 131 -71 -34 86 -64 -22 124 -20 -48 55 -18 -7 82 -13 7 78 -26 -31 71
1012 71 6 19 70 -53 -55 97 -2 -35 58 4 -60 41 7 -51 62 43 -62 -19 15 -4 26 3 -25 -4 -11 -21 -4 -3 7
1041 7 46 -46 -67 68 41 -44 28 30 -86 6 79 -54 -19 114 -25 -96 55 33 -38 48 36 -76 -10 83 -12 -33 93
1068 93 28 -78 -9 54 14 24 63 -31 -60 61 54 -38 29 68 -55 -56 53 -2 1 77 0 -128 25 89 -34 4 79 -44
1096 -44 -77 44 3 -35 75 26 -135 -37 69 -18 -29 75 -15 -84 25 36 -48 40 108 -64 -92 61 36 -37 73 36
1122C6j38J16P0j23N9J08j50p5J20J3m1P0k3q6OQ5k5j6K6J7r9j3J06Mn3O1l6j25
1150a06R5J00j23K0R5j18m9J20j2l4P7m1j10M2R2k4l0L7rn7%N6J0k6N2o7q9J11
1178A2Q9j27L5P2j38%J42p5m8J53r3j45J53O0j26P2N1j59K3J33q5l1J04k2j33
1203h3L7J05l6j9M8k1j19Q5Q0j20mJ51j21j10J74oj17J31Nj80Q9J15j25J6J21
1228I6j06m9O2j4NO1l7m3QJ5L6j9k2M8k8n3O6J2n3Q4k8j21Q9P3j18O6O6j45L0
1257a9J02j33M0J41j51m3J12q9K6J15j23j5J02j22nJ58j30qJ61k02m8K74j38j24
1281a19K57j31j87K85n0k43K94j3k79K01P6k02J70N4k42J16Q8j74J25O6j59J08
1303D1pj59J94L5j91J69k7k13K39N1k93K55O5l70K45J49l68K42K02m86J49L28
$$ plain form
1122 36 -102 14 84 -39 20 128 -22 -97 23 36 -5 65 42 -44 -38 47 22 6 32 49 -50 -63 43 47 -6 55 19 -106
1150 -106 -11 89 -34 -14 81 -37 -86 34 22 -12 65 24 -86 -44 48 24 -6 31 22 -35 -35 21 31 5 57 -10 -99 12
1178 12 101 -26 9 81 -57 -57 85 10 -38 115 22 -123 30 90 -36 36 87 -72 -49 84 -1 -32 72 50 -83
1203 -83 -46 59 23 4 52 31 -88 -3 77 -43 -47 104 -17 -127 47 41 -76 55 60 -120 -31 84 -41 -25 96
1228 96 -10 -59 3 -11 -6 55 18 -25 -17 -2 34 15 -7 41 13 -40 26 38 -15 69 41 -80 9 82 -36 30 96 -49 -19
1257 -19 83 -50 -10 131 -20 -63 49 -40 -14 101 -22 -37 65 -57 -62 96 -34 -42 119 -83 -131 143 5 -119
1281 -119 138 7 -180 105 55 -188 106 93 -186 15 91 -111 59 113 -129 -13 75 -99 26 92 -67 41
1303 41 34 -125 69 104 -87 82 55 -158 81 132 -161 94 159 -211 34 183 -185 57 259 -227 -78 250
1325B50m12Q0L87m36k7M18l85m0M51l03j71L83k46j36M19k18k10L78j95k08L87
1346A66j29k07L48j38k78L52k8k53L03o1k71K83j3k45K93rk70K41l0k23L16l6
1368A11k78K65k1k82L19L2l29K88L6l99L15J41l92K51J57m54K16K81m48J53L37
1389B99m68J8M08l78k5M50l62j85M45k05k07L96j25k70L13n7k32K78K3k40J43
1410A9J3j44J45M0j33J07k0j14J41l5o9J61q8j44J89k6j25J98n3j85J99Kk22K38
1434I4M1k71J75Q3k88K15J52l29J05K10l10N3K85k77k4K79k52r8L17j29j67K62
1456A26r2k13K58j0j97J89J4j91J04N9j10R2K3j21N6M8q1P3jo3O4l7m2Q5Ro8Q7
1483F1n1p9J60n4j04J30rj39J31K7j57J47M8k08R0J18j80Q0J17j80K3J33j38K
$$ plain form
1325 250 -162 -82 305 -131 -158 260 -125 -165 286 -17 -188 195 -51 -187 232 14 -196 182 -13 -221 166
1346 166 37 -170 178 40 -238 114 86 -167 136 75 -196 87 74 -171 122 113 -157 84 54 -169 147 111
1368 111 -167 98 77 -205 114 146 -183 105 141 -258 57 198 -194 57 214 -240 -24 257 -191 -38 299
1389 299 -169 -151 257 -121 -146 304 -58 -243 202 -3 -210 186 61 -209 104 47 -185 93 116 -124 19
1410 19 32 -112 33 73 -60 47 27 -87 54 19 -50 111 23 -121 68 42 -83 115 62 -123 76 78 -144 94
1434 94 135 -136 39 122 -166 49 201 -128 -23 187 -123 -70 215 -62 -86 193 -59 -157 160 31 -136 126
1456 126 34 -179 79 69 -128 61 75 -116 -12 47 -63 29 52 -69 -13 35 -46 27 26 -37 27 -10 -52 33 42 -26 61
1483 61 10 -69 91 37 -67 63 54 -85 46 73 -84 63 111 -97 -7 111 -69 11 128 -52 -29 104 -34 -32
1507c2J30r0n0R0p8qJ06o3l9P1n0k1N5l2LN2n6k9M8j0NK1l2oJ2k0K9J1k0J6Mo0
1539d3N9M1p7L5K5p3K1Q5j01L3O2q3j5Q2l8qN1m4m4P4l2j1K8k4%K1l7LN3l8mK9
1571C0m0J1M5n6nM2m6j0M5k9RM0m8k6N9k3k1N7l2m2P0l1m4P3qn1K8ml1N4Rl8L2
1604A9k2mL8k3rM4k6n0O2j0k1M4j0n6M1J4n3L5M6n1pJ6rJ4K6l3k6L2k5J3J4k3
1636@K1j4l3QL8k4OQl3PK4lj1K2k3j1LJ1PK2l0j2LQJ2J4lk1J8j0j7K6J7k0%j0
1672@kJ4PRk1nPKjpM8l2l1J7J8k0J5Jk9RK3l2RL2j3l0NQpK5Pl2j4J4J0j8K9Ql9
1711a6J0j4MK1K1j0l6J1K1j4J9moMJk2L1K1k2j4onK2K0k1Jj7%%J9PKNm6PJ7JJ6
1749B8Nm6NJ8j6J2L0k1l1Rj4J0L3jm5J8Ok2L1J5k1pj4lK0J3Lk2j7MJ6J4j4K5m
$$ plain form
1507 -32 98 8 -42 48 -30 -38 68 5 -34 37 -13 -34 21 -11 -8 44 -12 -41 7 -3 2 23 -9 -15 -3 -23 6 17 -3 13 17 -43
1539 -43 16 57 -20 15 40 -33 -12 73 -28 5 67 -16 -31 51 13 5 56 12 -32 42 10 -1 27 3 3 24 -13 -10 43 5 1 30
1571 30 -10 1 46 -10 -15 27 -19 -29 16 -13 -4 36 -12 -38 21 -2 -23 34 2 -40 30 -1 -45 28 20 -31 -3 -7 -38 16 25 -13 19
1604 19 -3 -7 31 8 -1 43 17 -33 29 19 -2 42 32 -24 17 31 -22 13 59 8 1 17 8 22 48 15 -11 21 -4 9 23 0
1636 0 21 7 -26 -18 20 -4 2 10 -23 -16 8 5 -6 16 -7 -18 -15 -4 3 25 -5 -17 -14 -6 6 20 17 -4 14 4 -13 13 30 10 10 0
1672 0 -2 12 19 28 7 2 9 11 10 3 51 19 -12 5 23 3 18 19 -10 -1 22 -10 -1 31 18 -12 -7 1 -6 19 26 -6 -20 -6 4 -14 15 23 -16
1711 -16 -6 -20 -16 5 26 16 -20 -9 12 -2 17 13 7 11 12 -10 21 42 20 6 0 -5 17 37 16 17 0 0 0 19 26 28 33 -13 -6 11 12 28
1749 28 33 -13 -8 10 -6 6 36 15 -16 -7 -21 -11 22 21 -24 -6 0 -22 9 24 3 -4 -18 -21 -1 12 15 -7 -24 -20 -4 10 -4 21 17
1784A7m5K2J0mL5mo0RL0j7J4K7k2l6K6k0K0L8j1j5j9qK4J5j8Qnk9OK0KOLm1j9
1819d1M0J5j2J9l0k0L0noL7j4m1JJ2J2L2mk4j1rkM3nljk6j9M9J7j0Pm3j4M4J0
1854B8k2L7k2m9L0Pj2M8Np6J3M1m7L6K9k7l2J8k4J2L8rj2j6j9K6L4l4J5Mp4K3
1886c1M7l2L2K8o8l3O9k8LO2n7l6N1k8mP3l0n5L5k9mR3l2l8K4j4m5R4Mp3O5l1
1918A2p9Q9K5m9N8j8q9P0K6o6O6J4j06M9K9p7P5N0j17kO6q4N4P3q9JN9j00L2R9
1948G1p3j1N7j13K0J23j02MQ7j25j0J17o7oJ09q9p4J23l6m8J28o5r5J11l8o7J39
1975G0j6r4P7l9o9J36Lj04Q4k5j21J43K7j17J00Jj46R4O0j06Q6L2j60O1Q7j24
2001f0Q8N1j48L8P6j05M9J09j26k2R3r9K7J07q1m5J00j03j5J27n1k4P0q8l2J28
$$ plain form
1784 17 -28 -6 4 0 35 31 -29 -20 10 -7 7 34 12 -24 2 -18 2 40 29 14 -5 -13 11 26 8 16 11 -18 -12 8 10 16 19 -22 -41
1819 -41 -1 14 2 21 -9 -29 1 -4 -10 27 13 -28 -27 -15 -3 29 25 1 -10 -19 -21 22 17 14 13 -13 -32 17 34 24 31 -12 -26 18 28
1854 28 6 43 21 -28 2 9 -3 45 50 -26 -13 28 -19 17 46 19 -13 5 -19 -7 31 22 10 -6 -25 1 35 1 16 20 -54 -31
1886 -31 16 -16 16 44 -24 -57 12 -16 -13 49 -8 -44 7 -21 -25 48 18 -37 -2 -31 -35 58 26 -12 12 -2 -47 47 51 -22 43 12
1918 12 -67 22 47 -2 56 38 -51 19 45 -21 45 59 -47 2 31 -46 29 79 -38 -40 26 -58 -4 69 -20 -19 40 -60 -28 71
1948 71 -2 -13 44 -69 -49 74 -28 -24 63 -62 -72 45 -22 -28 81 -8 -82 41 5 -43 85 20 -75 36 -2 -69 70
1975 70 54 -40 37 -2 -71 65 68 -36 48 23 -98 45 72 -45 55 56 -90 4 64 -42 44 76 -84 -23 64 -60
2001 -60 28 79 -69 -31 45 -60 -11 98 -28 -50 43 -56 -29 78 -3 -48 52 -51 -66 61 10 -14 56 -32 -64 64
2027F4n0l9J10r5o5J29m7m1J18n9r4J02j3p6J38k7j11P9lr2J27J7j10N0Lp8Q6
2054B3N4j15N0K1j13O6P3q7L1L5j06K5Q3n4K4M8j15MP9m8lP7p1k8N2l6J5P8o1
2083Al6M7m3mQ0k9l0L3m7j0P8k0k5O2p0l7Q6j5k0N3l4o9Q3nn3Q2k3r0N4K5n7P6
2115D3J4q9L0J7n9N6L7n6J0Nm9K9N9m4J5k3k7K2K4k7K2J1p1M7J5l4N3J0q0K4L5
2146A9l9L8M2p6ML3o1L8N8o9K0K7p2K8O4n1MK4n0LO6l3mO1p2l7P2l4oN7p3k5O5
2179B1k8j0O6m0l9M4l2j0N5k2k5M3m3j4O0j1k5L1l7l7O3nj8N4m3l9N9rl2P8l3
2210B2o4O1%n1Q5oq5N8Rn3N6K6p4L4J3n5M4M4n5PJ3m7J3M1m6L3J1p0K7K7l0K9
2242A7L7p4rN9m0NN1n3k1M9l2nO1m8j8K6k9rO2k8k3L4k3j8N1j1j6K8l1k8N7ok9
$$ plain form
2027 64 14 -25 85 -10 -75 54 7 -34 84 25 -69 33 20 -56 82 55 -56 23 20 -72 55 72 -38 12 15 -63 23
2054 23 77 -38 12 33 -80 -14 59 -28 3 38 -68 -43 40 -14 10 58 -57 -53 26 -22 -25 52 -19 -47 5 -31 -16 62 1
2083 1 -35 12 -31 -35 45 16 -14 19 -28 -38 40 20 -5 57 -13 -50 36 21 1 54 20 -49 34 29 -24 58 35 -55 -1 24 -33 43
2115 43 57 -32 -2 15 -44 12 49 -7 3 8 -41 -12 47 3 18 -5 -32 -10 14 -13 9 20 -51 -4 11 -23 30 40 -40 -16 19
2146 19 -20 18 60 -16 -12 21 -40 -2 56 -13 7 34 -38 -10 54 3 7 31 -19 -16 50 17 13 74 2 -35 37 3 -3 54 -19 -44 21
2179 21 -7 -17 49 9 -30 14 -18 -28 27 5 -20 23 -20 -34 26 15 -10 21 -16 -53 10 5 -13 41 -2 -41 18 9 -23 55 22
2210 22 -42 19 19 -32 53 47 -38 20 29 -24 32 58 -16 18 31 -24 20 64 9 16 29 -18 -5 36 -10 23 34 -36 -9 18 -12 17
2242 17 54 -20 -29 30 -10 -5 46 -7 -28 21 -11 -16 45 -3 -21 5 -24 -33 29 1 -22 12 -11 -29 22 11 -5 23 -8 -36 21 15 -14
2275a4N6l8l6N6j4l3O4lo1L2K1m6M3K9n4kK0l2RM5m9MK3l6PL5k4Onl0OL6k4J2
2309CK4n5OM2l0jL6m1j0L1j0nM0k4k5L1ml1M2lk5J4j2nK1J3l7K9qk0K9Jj8J8%
2344A6l0K5Rk0K8om1K4J6k8J2L4n4J3J5l8K9L8m3j1K2k1J4%%oNj6QQnj0J1k8J1
2379a9K3j5JJ3j7j0L1pj0K7k3j3L1j2jQPk2J9lj2J0J4mqoJ0qJ2rRkj8J5mjJ3j2
2417Gj5J1OlRoj4QQk8J6K0j9j9J2%%RJk1PK6j5JPj1PqQ%j4J3Pj3P%jJJkmNJ1j5
2461@J2Kj2NJ2Oj7J4j2lJKj0J7mrj2J2%nPrjQPp%Onj2OjKJ%kj0LQrLJj1J2Qj3
2507iJ1j2PnJ3LnqJ1NrMrJ2J2j2j1J8JLj8J1Mkj0LRmjQj1N%LrpJ6j5J8j4j6PJ0
2550Gj9J2J2j8JJ6k5kJ5noJ9%rNj6K0mj1j1K3oJJ1l0NK6j3lK2k6NK6k1kL0k3j1
$$ plain form
2275 -14 42 4 -32 24 10 -23 41 38 -23 9 30 -16 27 56 2 0 20 -12 -3 42 -7 -3 20 -16 -9 26 2 8 3 -27 -21 15 -9 3
2309 3 27 -28 -22 20 -10 -11 25 -16 -26 5 -5 -10 30 6 -19 12 8 -23 19 16 -9 5 -7 -12 9 22 -15 14 6 -14 15 16 -2 16 16
2344 16 -14 11 20 0 28 22 -19 5 21 -7 5 39 -15 -2 13 -25 4 42 -1 -12 10 -11 3 3 3 -3 2 -14 -6 2 -3 -13 -2 -30 -19
2379 -19 4 -11 -10 3 -14 -24 7 0 -10 17 -6 -19 12 0 -1 7 14 -8 11 8 -4 6 20 16 8 2 12 4 16 7 16 14 -4 11 7 6 19 7
2417 7 -8 3 9 6 15 9 -5 3 11 -17 -1 19 0 -19 -7 -7 -7 2 3 -18 -11 15 0 1 8 -3 4 -4 4 4 -10 3 10 -3 4 4 3 4 5 3 -1 4 15 0
2461 0 12 14 2 7 19 25 8 22 10 7 8 10 0 17 13 4 -8 4 4 -1 6 -3 -4 4 11 4 4 10 5 -7 -1 -2 0 1 1 -1 -11 -8 0 -9 -6 -5 -16 -4 4 -9
2507 -9 2 -10 -3 -8 5 8 3 -5 6 11 2 6 -3 9 21 9 -2 16 17 20 2 13 17 15 5 8 17 13 12 20 9 14 14 17 8 1 17 2 20 6 -10 -3 7
2550 7 -12 0 12 -6 -5 11 -14 -16 -1 -6 -12 7 7 -2 3 -13 7 3 -8 -19 4 -2 -1 10 -20 -15 11 -2 -5 17 -9 -4 22 1 -1 29 6 -5
2588eJ7Ok6J9mrJ9mj2J6Jmj2Rj8J8jj1J2jj9J8Lk9K3j0pJ0pj5K5J2l1K3J4m2J1
2625a1L0k4%J7j1pK0j4rL0j7JJ6j9jJ7j7mL0l0J0J1oj4L8k3qK6j1j3P%j9J9J5
2660B9k7kJ8k7L1j2j8K1%k2RJ2k7K3%k1RJ3k8J6J5k3J3J0k4ROk2%L3j8pK0j1k
2695dJ2Lk4K6knJ0j2jJ4jj4PJ4j0Pj1QJpj9J8j3NJ6j6JJ7Lk9K1Mk3Rmj2J0J6k6
2734a1MK4l1LJ4lj5L4j6rJ1pJJ0j2MjpJ2Qj1j2J1omK6j0pJ2nOj1OJJjRLj5OLr
2776Fj9K4LnKNjJj4LokLJ0j6mLQj0J1krjNNrPJ8k0J1Jj4nJ9j7mK5j5MNOl3L0p
2820BNnJ8j7j8L8loJ0j4qQrJ4J3k5MK6l1%J2oJJ5k3lK6j5m%opJ5kj0PJl5L7mj1
2861a0J5jj9J7rj4K7Mk5J6Jj3K2%k9K2Mk1L6j9j9L0Lk8RL3k6RJ0k9QJ6j1%J2j8
$$ plain form
2588 -5 12 18 -8 11 7 -2 17 13 1 17 18 14 2 11 -7 11 10 -1 11 10 -9 9 12 -17 6 -4 -11 -1 -8 -23 2 14 -17 6 20 -22 -11
2625 -11 19 -5 -5 12 1 -6 14 0 -9 21 4 5 21 2 1 18 1 -3 27 -3 7 18 12 -2 36 13 5 31 20 7 14 14 -5 14 29
2660 29 2 0 18 -9 22 10 -8 13 13 -9 0 12 -15 8 8 -13 -4 9 -19 -3 12 -11 2 12 -12 -3 3 -19 -19 14 -4 -11 9 -2 -4
2695 -4 8 11 -13 13 11 6 16 4 3 17 16 2 9 23 13 20 9 17 18 11 -8 10 -3 2 18 2 3 20 23 -6 15 19 -4 5 1 -11 -1 15 -11
2734 -11 -7 17 -14 -11 3 0 -15 19 3 -6 5 -2 -1 9 -3 1 0 -7 5 13 2 -10 1 -5 -9 17 7 0 12 7 13 2 8 9 10 9 18 21 6 12 15 6
2776 6 -13 11 14 9 11 16 15 16 2 5 -1 -3 0 10 -6 -10 -7 1 -9 2 0 -9 -10 -5 0 -9 -2 16 -4 7 8 -6 -11 8 -9 -13 12 -3 1 6 12 -21 9 2
2820 2 7 2 20 3 -15 23 20 14 24 10 2 10 1 15 28 3 7 33 2 2 14 8 9 24 1 -2 24 9 5 5 -1 -8 7 5 -5 2 3 -32 5 1 -10
2861 -10 5 4 -15 2 -7 -21 6 10 -15 1 2 -11 11 11 -18 4 8 -13 23 4 -15 15 18 -10 -1 32 6 15 25 -4 4 20 9 9 21 3
2897CKJ7j6oK5k6oK2onJ8j8kK3j8j3K0j2kJ1qj2LJRj%j3J8Lk3K0Jpj7PJOJ0k4
2937a5J8Qk0J8J3k6PJ5k5PK3k8J1K3j9pK2pj4L1k0j6K2ppJ9rj5J0LoJ4ok5K0K
2973A4k1J8pk5K6moNJ0j4J3mk9J1J8j9J0Mj8J4KmqJ5j2K3J2k3OPrkK0j6JJ5j3
3010A0oJ9j7kJ8Rk2J4ppK0j6OJ2j3j3J7poRNrpnkJ6k0LRqPLonLMj7J5Kj6KOj5
3053a7J0%kMPljJ4j2N%LRlj1JJ0pKRlKlqOLMmRkk5J3Mj0J8j1kjmj0RlPJj4K0o
3100Hj6%J4j0J2Pk0J4lmj6J8lkLKrJ4olJ1Jjj%MkJ4j6%loQoOJ3k4J2J5k4K1Jp
3143A6qJ5Lk2oNRmkOlrO%j7J4Jj4J5Jj0J0J4m4QLRnKJ4j6NNoJjKQ%qJK3j0nPj1
3189BKPoKPkRqrQPj2Q%j0J1Rk2JK0l1NK2j2j8J8NoQj0JoMOj5MNjLrJoQJ7k8kK4
$$ plain form
2897 3 5 22 6 0 25 -1 -7 15 9 4 22 4 2 25 7 -6 14 2 0 11 3 -9 -6 -5 4 3 3 -10 8 11 -12 8 9 2 -15 -8 -7 -1 9 -15
2937 -15 3 11 -9 9 22 -4 3 18 -7 0 23 -5 6 29 10 3 25 18 4 35 15 -1 21 14 7 26 17 2 12 15 9 23 17 -8 12 14
2973 14 -7 11 4 -21 5 1 -5 0 10 -4 9 5 -24 -13 5 -14 -4 0 -18 -4 -2 -6 -14 1 -11 12 24 1 7 14 5 3 23 7 8 23 10
3010 10 4 23 6 4 22 31 9 23 16 9 29 13 19 31 18 5 22 15 9 18 23 14 7 2 0 16 -4 -1 8 0 7 10 4 -1 2 6 -11 4 6 -10 -8 -2 -17
3053 -17 -7 -7 -9 -5 2 -1 -2 12 0 5 5 8 17 14 3 4 14 7 9 18 15 17 14 6 12 15 19 15 24 22 -3 10 14 4 22 11 9 8 4 -6 3 0 7 8 -6 14 8
3100 8 -8 -8 6 -4 8 15 -5 9 6 2 -14 4 1 -1 2 4 -5 9 3 0 11 12 11 10 10 14 12 26 10 10 7 1 9 3 9 22 -2 10 25 1 22 23 16
3143 16 8 23 26 4 -2 3 12 8 6 12 9 0 6 6 -11 3 4 -10 5 6 -4 6 20 -24 -16 -13 -4 -9 -7 7 -9 -4 1 -5 -4 -5 -3 5 5 -3 -2 21 11 6 13 2
3189 2 4 11 5 7 14 12 21 13 4 12 19 7 15 15 5 16 25 3 4 24 -7 -2 20 8 -10 8 13 7 15 5 6 0 4 10 -5 -1 4 3 6 -3 -2 -8 0 17 -11 -13 11
3236A1mj3J7Kk9K0J2k8K6oj3OJ2k2J6J4k4J3Pj6QNj0OJkqK1j9J6njKRl0QJ5j5
3274BqJ7qj4L4j7k2L0k1j8L8nj9PJ1j8KJ4j2%J2j1Ooj0K1Pk6L4j6j0K3mk8K1K1
3310B7l6K1Nl1J8K6j1jKknOo%J3j6nRj2LQpJJ5k7KJ2j5nL5j4j7J1j7%K3nk9M5
3349B1k0j8K9Jl0nK4k4J5J8k3%J7mrJ6Pj3J0j1MJ7k7ROj3J2Nj2ORj8PJ5j5mK0
3386B2j5JK4j6j2lQj1PQMkj2k1J3J4j5J4poJ1j8J1nOj1J8j0j2J2MoJ9rqlK7k9
3424hJ4J3j9rJ9omJ6omMLOj0QpKRJ2j0qm%mjk%NJ3j9pOqMmK4j4q%J2j3J1%j0%
3469dpPLlk%JPkJ0j3j0J3Kj6J9Oj3J3kKj2OjKJ2pmJ0j7K4Nk6J7Pk1RJ7k6kJ8k6
3511dJ0J9j9lOpLJ6j4lRj9JNRrKnKQq%%j6PJ6j0j2K0jj6K8nj8%J2j0J2jrJ2Qj8
$$ plain form
3236 11 7 -6 11 13 -16 4 16 -12 14 8 -5 1 13 -9 7 21 -3 10 17 1 9 14 4 10 11 9 1 22 3 19 14 13 15 24 -6 2 17 2
3274 2 -6 11 3 -11 23 6 -16 14 -7 -25 13 8 -11 -4 7 -11 -9 5 -7 -7 5 -6 0 -6 -16 5 12 -14 20 4 -6 17 13 -15 6 27
3310 27 -9 12 17 -14 4 30 19 18 20 18 13 19 13 13 26 10 5 14 2 5 13 6 7 22 -5 -3 9 -6 -11 24 10 -7 4 -13 -13 10 5 -24 21
3349 21 1 -17 12 13 -17 -22 2 -22 -7 11 -12 -12 5 1 -8 8 15 2 12 1 5 22 -5 4 10 -3 9 14 2 8 17 -1 6 21 6 2 22
3386 22 7 8 32 16 4 1 9 -2 5 13 17 15 3 -18 -5 9 -6 8 1 -5 6 -12 -1 -6 0 -11 7 -3 -15 -3 1 -5 14 5 -3 -6 21 -8
3424 -8 6 19 0 -9 10 4 0 16 10 6 10 13 19 9 17 10 12 21 33 23 15 11 11 7 6 4 4 9 22 3 -4 2 -6 -2 -6 18 4 -4 -4 8 -5 6 6 -4 -4
3469 -4 -11 -4 -1 -4 -6 -6 -5 2 0 10 -3 -13 0 2 -14 5 11 -2 11 9 11 -1 5 4 6 18 11 7 17 0 24 29 3 20 27 6 15 32 6 4 22 -4
3511 -4 6 25 6 3 9 2 5 21 7 4 13 -6 -5 0 9 0 2 -3 -1 7 -1 -1 -1 -17 -10 6 -4 -16 4 3 -13 15 10 -8 -8 4 -6 6 5 -4 8 16 -2
3554bj0K9k4RK5rj2J6j7KJ9j8MNlj4mMLJ5j7kJ0j1N%moJNj2J8Lk8K1Jk8J9jqK2
3595Foj5J8j1j3J2%nK0lmPpk1K1jkjK3k4OJ5j5NLoMJ7j0%J0rj3J9j8PJ1oj2ON
3636A3j9ORj7Rmj7L2j0kKjj6QJ4k3RJk2K1J0pnjmJ7JrJ0qrJ0rlJ6Kj0QKj3K0m
3678GqJ4Jj1MRjj6J4qJJ7j5%Plomj2J5J3j5MrMkkJ0j0K%RrnNnpKMPPj1lRKj1O
3725@P%mpkJ2kj1J4Kj0K0rnNMLj1PPqQj3PnRKj8QnQnj3J4OqJj0PljmoRpLMkNr
3775fkOj8K1j1MJmRj8K0j7J3KrjKKnJ5KpjQKnJ4j3kJ3Nj6JlJ2jKj8NJ4mj5J2Q
3819A7j5J4plpMMj1PNk2NOjmMkPnljmJ4plNn%J9j7jPMkj0OJ0mj5J7J8k4J5lmJ
3865I%%oJ4lkLmkJ5k2MPNrqNpJ6k1OMlLopj3K6k2J1J1j1Olj1J3PrLJ2rnJ2npN
$$ plain form
3554 -2 -12 17 -7 2 27 18 6 22 5 7 26 8 12 17 14 0 -4 0 3 18 1 -1 9 -2 3 3 -1 -7 -6 -1 -13 5 8 -20 1 2 -26 -7 -8 -16 6
3595 6 0 -15 3 -8 -21 -9 -9 -14 6 3 -1 6 -1 -22 -1 -2 -4 -5 18 -6 0 15 0 5 8 2 6 23 13 13 23 14 1 20 2 9 20 14 2 8 13
3636 13 -6 0 9 -8 1 -3 -20 12 2 0 2 1 -15 -7 7 -16 -7 -6 -28 -7 3 -4 -9 -10 -14 3 4 -5 5 -3 -12 -2 -11 -14 2 4 -6 2 4 -9 11 7
3678 7 -1 13 14 3 7 16 15 -1 13 5 6 23 8 8 15 12 6 2 -10 5 18 3 7 -2 2 0 -2 8 -2 0 0 9 0 -5 0 -5 -12 -10 -6 1 8 -3 -6 3 5 -6 0
3725 0 7 7 3 -4 -6 6 4 -7 7 9 -1 19 10 5 10 14 17 6 13 20 12 20 7 14 9 18 20 2 10 5 13 8 -5 9 15 7 8 -2 5 2 1 -3 -9 0 -7 -4 0 -2 3 -6
3775 -6 -8 -2 -20 1 -10 -6 -5 -9 0 -18 2 -15 -2 0 -9 -10 -8 -6 -11 4 6 -1 -2 6 8 3 17 4 2 15 20 4 5 2 14 13 15 -3 2 16 12 -3 9 17
3819 17 2 16 9 6 -1 3 7 -4 3 8 -14 -9 -3 -4 -8 -4 -6 1 -4 -7 -8 -12 2 -5 -8 -3 -8 -8 11 -6 -7 0 4 2 -8 -2 8 4 -11 6 24 0 15 12 8 9
3865 9 9 9 3 17 14 12 15 11 9 24 2 6 13 18 9 1 6 -1 15 -6 0 4 1 4 -2 -9 -22 4 -18 -7 4 -7 -1 -4 -15 -2 5 -4 -1 11 2 -3 9 4 -3 2
3911BjmlJ4%qRKNjqLMj4J8j0rJ4Rk8J7LNj5J7l9K7Pj5MJ7j0j9J3%k0K3j1j3K2
3951Gj1nRj2lJ7j4rJ2Nj2RKrJ2Lj4J6jj4QmkMJ0j4KJ3%rPOLrJ3k5L0j4j4J7kL
3993A1Mj4LOJNqJ1j1J2k0rK1j5kJ2j7JLLj1J8Jj9O%rJ2QjkmmlOLoPj0NKj6J8J4
4037A2j6MJ1j0qL1k9J0NnnK2Jq%jJKLKj3j2POlQproK5j4j6J7jk8K1%rJ0Nj5OJ0
4080Dj2NJ0Jk4J4%j7ROj1MLmQJ0rj3J1nKNPK2rj1Lj5PMnoJ7Lj5J0J8k6jJ3j4l
4122dJ7jj2J7j0k3J4K%j0J3j0Rj1J3kj6RnKLjmnJ3Kk2J6J5kk4L1j5nK3j3kJ4j3
4161Cj8K7pkJ0nnJ1Ol0J5omJ0LJ4j8lMMoNKrJ0j4Oj0Pj0pJ6J3k3nL8m2J1J2j4
4201a1jJ0joJ6pk0J8Lj5J4oLnjoK7j5NJ0rmK7rk5L1nj9K4jk8K1%k0J5Pk0J7Mr
$$ plain form
3911 2 1 -3 -6 8 8 0 9 11 16 15 7 10 14 0 18 8 -1 13 22 -6 11 14 19 4 21 -18 9 16 1 5 22 12 -7 6 6 -14 9 -2 -15 7
3951 7 -4 -9 0 -12 -15 2 -12 -21 -9 -4 -16 -7 -5 -14 -2 1 -13 3 2 -12 -4 -8 -10 -6 4 -10 -8 5 5 -4 3 9 12 3 16 -9 21 7 -7 10 8 11
3993 11 15 1 4 10 11 16 8 19 8 20 0 -9 12 -3 -5 7 -10 -9 -6 -3 -14 4 5 -14 -8 -8 -17 -5 3 2 0 -4 -8 -11 -5 -2 -8 -1 -11 -6 -4 -20 -2 12
4037 12 -4 0 11 1 -7 24 -5 5 10 5 0 22 23 15 15 14 15 17 20 22 9 -3 4 10 7 15 8 -1 -7 18 4 -12 5 4 -24 -3 -3 -12 -2 3 -12 -6 4
4080 4 -8 -3 7 8 -16 -2 -2 -19 -10 -4 -15 -11 -8 -12 -4 6 -3 -16 -5 -10 -8 -3 4 26 17 6 9 -6 1 5 0 -6 11 14 -1 9 27 1 0 13 -1 -4
4122 -4 13 12 0 17 7 -16 -2 0 0 -10 3 -7 2 -9 4 2 -14 -5 -10 -8 -5 -6 -10 -15 -2 0 -22 -6 9 7 -17 14 -1 -6 17 4 2 16 3
4161 3 -15 12 5 3 13 8 3 14 20 -10 5 -1 -5 5 8 22 4 1 5 9 3 8 10 1 11 -3 3 -7 0 -10 -17 -1 12 -11 -16 22 -20 -9 3 -11
4201 -11 -12 -2 -3 -9 7 0 -20 -2 1 -14 0 -6 -3 -8 -9 -15 12 -3 2 12 3 -1 26 17 -8 23 18 -1 23 22 -6 15 15 -5 10 17 -3 14 18 9
4241InJ3opKJ3j8LJ2nj2kPqoJ4lj9J5Jj1LJ2j8KJ7k1j1L7j2j2J4j4j0J7K0j0k
4279aJqJ7jj3OJ6qKj0J6j4J5jnRj8OklK3j0k9K2J0j5rJ5oLkNj4Rrj4J4MrKRpk
4322fNLj1OLkkmJ1k2kK9k1RJJ3k3J3J6k5K1npJ0JrMQRj7nJ2qMrQkMn%%J2j1kj
4367CJMj1NnrK1j1j2J1j1NJ0Pj8J5omj1J8j2KOnmNJ2j2J1Moj5K1J3k7PJ2j0jP
4407A0Rj8K1j1mLJ6j8nJ7loPjj2LQroJ1kj7PJj8K4nnpJ1mj4J8J3j5KLj4nK3j2
4448dnjPj1MQj0RJ1j0j1QJ1j6PQLj6K1pqPJ1j1pK1nllJ3rlMLj5K%j3QJ5j3j9J9
4491@Pj8J1lpQKj1MOqN%LkmnJJ7k3J2j1J2jj1J1k%J2lJNkMJOJj2mQklNkk5K3O
4538A2%KMrJKpmMMjj5J1lKMj5jMPJj9J5%j0jK5l2JJ5rMMj2%MM%PpkPOpoJ2MkJ1
$$ plain form
4241 9 4 17 11 4 6 19 1 4 16 11 -1 -3 4 -4 -10 4 1 -18 -3 -2 -13 -10 2 -16 -14 3 -18 -29 8 -4 -16 -2 -16 -26 -9 11 1 -1
4279 -1 0 -8 9 8 -5 1 17 9 11 1 17 3 18 17 12 21 3 9 7 4 27 17 -12 10 20 5 -4 11 5 8 6 11 -3 6 -3 -17 -3 1 -8 -6 3 -4 -6
4322 -6 -1 2 -9 -3 0 -2 -4 -8 3 -19 -21 8 -13 -4 -3 10 -13 0 16 -9 12 7 0 10 11 2 6 14 23 6 1 13 5 9 0 8 6 10 5 5 5 17 6 4 3
4367 3 4 8 -3 2 -3 -12 9 -2 -14 -3 -14 -9 1 8 -10 5 -1 -5 -16 2 -10 -8 -2 -7 -11 -6 6 -6 5 9 3 -12 9 22 -5 2 14 4 3 10
4407 10 19 1 22 11 7 10 26 8 3 20 17 11 18 17 5 8 16 7 1 12 10 -7 0 1 -17 7 2 -3 -10 1 -3 -17 1 14 -1 1 4 -10 -15 8 -4
4448 -4 -9 -10 -3 -14 -10 -2 -12 -3 8 -2 -13 -5 6 -10 -3 5 8 -8 13 6 -2 5 16 5 -2 19 14 11 8 21 12 9 13 16 1 3 3 -10 -2 13 0 -19 0
4491 0 7 -11 0 -3 -10 -2 0 -11 -7 -1 -9 -4 -4 -1 -3 -7 -12 -11 6 -17 -5 -16 -4 -5 -16 -5 -7 -7 5 2 3 8 6 10 11 17 18 6 2 10 8 5 10 8 -17 6 12
4538 12 12 14 18 9 10 12 5 1 5 9 8 -7 4 1 3 7 -8 -9 -5 2 3 -16 -1 -1 -11 -12 13 -19 -18 -3 -12 -8 -4 -16 -16 -12 -8 -8 -1 -8 -10 -3 3 -4 -10 2 6 4 15
4587A5k1PJ2opJ0j5J5j6JJ3Nj1LJNpKlNJqJNopK0j8j4K7j6QpK0j7kLrRj2k%NO
4631empJ0J6k5JJ5oJ1jQj5J0Nk5K0kj2J0nKJ2p%nQPj2J3knqRJrqJ5rjoJ1k0PJ4
4675Fj7QMj2kK0l0OJ0onJ9pj8J7Kj2J8kpnJ1j5J3rK0k1PJ0nJ4j7J7j2KnJ7j8R
4714ENj2J5NOk1J9qj1QpjMkj5J1JJ4j3LrJ0j1PLj0RkJk2J7m%%Mj0jRlpLqK0qM
4759bJkJ4j9QpmJ2k%Oj%q%NJ6j2NJMoNj4LQoJJ2j1j8J3J0j1qJ8j3nJ0jqlO%Jj2
4805a4LOLj0RlLj0oRPomLkJ1pJ9j1kOJoJ0j6J9mMj0ROj9OjJ5pklKPjqRrnJ0om
4853AnkJJ3qnJ1j1MnJ1pMlqLm%J0mqKmJ6loj3PMOPJoJ0rnJ2j3NNo%J0jj0KK%R
4902A0JmKLj0J3kj1LpjJ3r%kkknRj4QNj4J2mkrJ3nKjjL%PJ1j3JKNj4ONlrJ0Kk
$$ plain form
4587 15 -6 1 13 7 0 10 -5 10 -6 -5 8 13 2 5 6 11 4 6 3 8 9 1 2 7 1 -6 14 -4 -18 9 -7 1 -6 14 -3 -5 -2 -11 -2 -14 -16 -16 -11 -5
4631 -5 -9 -16 -6 10 -15 -14 1 -5 6 5 13 -2 8 13 -12 8 6 -6 4 -1 1 13 6 6 1 9 16 4 17 15 10 2 11 12 3 -5 10 1 0 -6 5 -15 -8 6
4675 6 -11 -3 1 -11 -13 7 -23 -17 -7 -13 -18 1 -6 -24 -7 -5 -17 1 -1 -8 -13 -2 -17 -4 -13 7 -14 -7 3 -2 12 -5 12 0 2 -3 14 -4 5
4714 5 10 -2 13 18 24 3 22 14 3 11 4 3 7 5 -10 1 2 16 3 6 -3 7 -4 3 6 -4 5 3 4 -18 -1 -5 -5 -5 -1 -11 -12 -3 -6 -13 -10 -18 2 -6 -2
4759 -2 -1 -3 11 -8 0 -7 -11 1 -1 -1 5 4 4 -4 -4 1 17 5 10 11 15 9 14 0 3 11 5 6 18 7 -11 2 12 1 -7 11 -2 -7 3 2 -6 -9 -3 -3 -2 -14
4805 -14 -11 -5 -2 -12 -3 -6 -3 -13 -19 -10 -3 -9 -13 -10 -12 -1 -8 11 0 -2 4 5 -1 9 -7 12 8 12 2 11 17 -2 4 3 18 11 9 6 8 15 14 6 15 6 1 11 5 1
4853 1 -4 -6 -5 8 0 -5 6 -5 -1 -6 5 -2 2 -1 -9 -6 -10 -10 0 -4 -12 -10 -14 2 -1 -7 -20 -13 -9 -3 4 5 -1 9 0 -5 7 -6 -1 4 -2 -2 8 7 -3 -1 1 1 10
4902 10 11 7 9 12 2 15 13 2 5 -2 -3 10 1 1 -1 -3 -5 -10 -1 -15 -7 -2 -16 -4 -8 -10 -19 -6 -11 -9 -10 -11 -8 -8 -1 10 -3 -2 0 5 -9 -3 2 -1 -10 0 2 0
4950@J9k0POj0oJ5qQMojLj2RkLj5J1Rj3rN%jJ0ln%Pj8RMqpRnJ0j2KKqR%oJ6j1
4997ipK0j2JlKJ2oPoqJJ2nKmNoJ4ojJ1rjQnkJ2lj0lQkmNlMmrJ2mj7OQpO%q%Km
5048a0J0ppKQj3M%jJ3nKmj2J8p%J3j0LrJ4j0JJnJ0oJ7k%mMoQKrmNpJ3j7QKkJp
5095ePnKkOj8K3qmjrqJ3J0j4J0qmQnOJj%k%PMlnjrOJ0nLkMqPlJ0LnJ2j1Ml%Qo
5146INkLrjJmj0J6lJlkNqMoMnJ0Lj1nlQNknj2J5%jj4NJ2j2MqK7j4Oj6J2kkJ7j3
5193akONo%Ojj0kJ4JrJ5j2MNPj5lPj6OLJ%j1%J4krJ1lk0OJ8j5j1J5qlJ3mkklL
5239a0J1mkJpLLkj0J1J0oJLj0J3j0JMOj8J2J5j2J1j2MKklpmJ1nj0K1oQj4Oj1R
5281Ajkj1J7j7QqKkPKKj1%LlOLrlJ0lLJqJ2Nj9PkR%qPjkQQpmJ3rRJjj1LOqJ1K
$$ plain form
4950 0 19 -1 6 12 2 -4 11 3 11 15 9 8 11 -1 8 6 9 -6 5 14 1 -8 -3 -3 -4 6 3 -2 -2 5 -13 -4 0 -8 -15 -6 -11 -1 -13 -11 -9 -17 -8 -8 -14 2 -9
4997 -9 -16 4 -8 -7 -10 -8 4 -2 5 -1 -9 -8 4 -1 1 -3 2 -4 10 4 3 14 5 4 12 7 5 17 14 4 1 9 7 3 8 5 9 5 -4 8 4 -13 -7 1 -6 0 0 -8 -8 -6 -10
5048 -10 0 -7 -14 -12 -4 -17 -13 -13 -14 -1 -6 -4 -8 -20 -2 -9 -9 4 -6 -3 -12 2 -8 -7 -6 -11 -1 -7 10 8 8 4 8 2 10 12 3 -1 4 -3 10 -7 1 3 1 2 -5
5095 -5 2 -3 -1 -3 3 -15 8 0 -4 -5 -14 -22 -9 1 -13 -3 -11 -15 -7 -12 -6 -5 -6 -6 -8 -8 -1 3 0 -5 -6 -15 -9 1 -4 -1 -3 1 -7 0 -3 7 10 5 17 6 10 7 7 15 9
5146 9 14 12 15 6 5 6 2 -8 8 5 6 3 1 6 -2 2 -4 0 -5 5 8 -3 -8 -11 -3 2 0 -5 -17 -2 -2 -3 -17 -12 0 -12 -8 -16 11 -3 3 -13 -1 -3 -5 12 -1
5193 -1 -3 3 8 2 2 8 7 -3 -5 9 10 1 16 4 8 13 20 5 2 9 -7 -1 2 3 3 -8 -8 6 4 -5 6 3 -17 -11 7 -8 -19 -4 -12 -15 -2 -6 -8 -10 -13 -10
5239 -10 1 -3 -5 -4 -11 -8 -5 -7 -17 -6 4 -2 -1 2 -8 5 -5 -4 0 6 -12 0 15 3 14 2 6 8 6 3 -4 -8 3 -2 -12 9 3 11 -3 3 -8 1
5281 1 0 -2 -13 4 -13 -5 -13 -11 -13 -6 -4 -2 -13 -13 -10 -13 -7 -4 -13 -16 -6 -9 -6 -5 -13 -1 4 -15 -8 -10 -1 -1 -9 -2 -3 -5 3 11 4 0 13 4 13 14 13 2 5 11 3 14 16
5332A6j1jPj7J2RooRj1JOpkJJrLoJOkrJ0kMNj3kJ0pMmJ0j3J0%rJ2loQLj7K3j4
5378fLkNJOj0J0QoLlqMQpj1J7pNj7PjPJj0Rklj3J8qljmnJ1kj3kJ7j0PPj5NnJ8
5425ComqLPLOqJMkLPmnJ1okK%JMj0J1l%qmK0k0QnMlONpnLKnjrNKpLkoPm%LkMN
5481cj4J1kQnj8J3LRj6J0rJ4ljNmLlNRMj3KlORj6RKoKj3J6kKOj3RqPk0K2lmnM
5528Fj3Qj1kPjLLmj3RJkRj9J4pJ7j8PRpQj3j7K0ORpMj%j3NPNRrKmpJoJ4Nj3J1
5575A2j0MKqNnJ5j5KlJjnoJ2pJLlKJKmMj0J0%lJlnJNqNmjjJ8qOMlKNOJj8J1pQ
5626A1PoqLJoJpOkJ4rOj%J3k0J0j8qL2k8NOj0KJqJ5ppNJnK%LmmJ2rqJ0j%lNPM
5675Cjj0J6j2Nl%MKlkJ6j4J1rRj1J9j2oJ6j1qPQjpKNj9J0JKppkJ1lNj6J5j2Qj4
$$ plain form
5332 16 5 4 11 -6 6 15 9 3 12 1 2 8 1 -1 0 1 -8 -5 -11 -10 -4 -6 -15 -5 -7 -3 2 -11 -13 -3 -10 -6 -10 0 -13 -3 -3 -12 0 -3 -9 -1 2 -15 8 -6
5378 -6 -3 -5 0 1 7 -3 7 15 9 12 9 1 5 13 6 -5 12 5 10 -7 0 -1 6 7 -3 6 4 1 -12 6 -2 -5 -6 -10 -15 -4 -6 -19 -21 -4 -14 -7 0 -15 -10 -15 3
5425 3 -3 -7 -15 -12 -5 -2 4 -4 -3 1 -1 2 9 5 0 11 5 3 5 5 6 10 0 11 8 8 0 -4 16 -4 4 -1 3 0 6 11 4 -1 2 4 -1 -2 -11 -6 -4 -11 -8 -10 -16 -9 -13 -13 -10 -12 -8 -3
5481 -3 -17 -6 -8 0 -5 -23 -10 -7 2 -14 -4 -13 1 -2 -3 2 -2 1 -2 3 12 16 3 5 2 8 17 1 10 12 6 8 -5 11 9 11 17 4 13 5 12 -8 14 11 7 2 6
5528 6 -7 1 -10 -12 -5 -6 -3 0 -4 -17 -8 -7 -9 0 -19 -5 -12 5 -13 -6 3 -4 4 -9 -26 -6 0 9 2 6 5 5 -8 -3 4 9 18 9 11 7 0 1 -5 9 14 1 12
5575 12 2 6 8 0 5 0 15 0 2 -1 0 -1 -6 -12 0 -7 -6 -3 -6 -4 -3 -1 -5 -1 -11 -1 -1 -4 -3 -6 -11 -10 -5 -13 -8 -12 -13 -14 4 -4 2 6 3 5 10 16 17 -1 10 3 11
5626 11 18 12 4 7 8 2 3 -4 2 0 14 5 11 10 10 23 3 13 -5 -13 19 -9 -4 2 -8 -6 -5 -13 2 -5 -12 -7 -6 -11 -9 -9 -6 -10 -14 -2 -11 -19 -9 -10 -10 -13 -8 -1 3
5675 3 2 -8 8 -4 1 -2 -2 2 4 1 -1 15 1 12 3 12 1 20 8 2 18 7 -1 6 14 13 6 8 13 -6 4 5 7 0 -7 -9 2 -1 4 -12 3 -9 -1 -15
5719a5NLMNol%J5k0KJ1olnJ2j4J0OkN%j%kKPk2J5JPj5KNJjJmPPljqJ5k1K0j7k
5766ckKrJ5Mk1J9j6Nj0MMOpJ0j1J0kj0J3kpnKKJ%lKJ4j3%J2J1k2J6j3RqJ3LrJ
5809EkJmJ0Oj3qJ4NmNj3mJ8k2J3jj1lJ2JrOj1MkOrOqJNj%LMj4JOmJOnj2J0J5%
5856DonJ6Lj5nJPMJLqJ0j7J0jOMj2PJ2k3MNKoO%Kkj2J7j5Rkq%kOmQppJ5Mj1lp
5904a2nQkrPQ%rJj1J9LJOp%KJ1npQKnRj2J2kLKLj4KJMKk%J%j4NQj2JJ3rmLj0J1
5954Ej3%mnLP%mmJ0jqlNNOj4kJ0nljP%lK0j1J3kqJ2mlkJkpPK%RJj9J2lNJqNkj
6005DJ1konKKj1KMj2PoNLnKnRKomPkmPmJ1qlJmPqLRj6J8mLlj5J8Rj6LlJ1Kj1R
6055HnKJ3r%Mnj2J2kQpmNk1J5klj0J3kj1LLnMJnPOj5%MpOLj0K0%k1J4qLJPjKk
$$ plain form
5719 -15 -10 -7 -3 2 -4 -7 -7 8 -12 -10 1 -5 -8 -13 -1 -15 -5 1 -1 4 4 3 3 1 3 10 -12 3 4 11 -4 -2 3 4 3 4 0 7 14 11 10 2 17 -4 16 -1 -3
5766 -3 -5 -3 -12 3 7 -14 5 -11 -6 -16 -12 -8 -2 -9 1 -10 0 -2 -12 1 -1 -8 -13 -11 -9 -8 -8 -11 -9 5 -8 -8 4 15 -7 9 -4 5 -3 10 13 4 5
5809 5 3 4 0 10 16 3 -5 9 14 10 15 2 -2 16 -6 7 6 -5 -8 4 5 -4 2 -9 -5 -7 -1 -10 -4 -12 -11 -6 -7 -7 -4 0 -14 -13 -7 -11 -10 -4 -9 -21 -11 4 4
5856 4 -2 -7 9 12 -3 -8 -7 0 4 5 8 0 10 -7 3 2 8 12 0 7 19 -4 0 5 7 1 7 7 9 7 -5 12 -3 6 4 -4 -4 -6 0 -4 4 -3 -10 5 9 -2 -5 -12
5904 -12 -17 -9 -11 -20 -13 -5 -5 -14 -13 -24 -5 -2 -1 5 -2 -2 0 11 6 -1 7 9 4 13 1 13 11 14 16 19 5 7 8 12 14 12 12 13 13 -1 4 12 0 1 14 5 1 4 -6 5
5954 5 -8 -8 -12 -17 -14 -7 -7 -11 -15 -5 -6 -14 -17 -12 -7 -1 -15 -17 -7 -12 -15 -16 -9 -9 -12 8 -3 10 8 0 12 8 5 3 4 2 -5 2 4 4 13 14 -5 7 4 9 10 2 7 5 4
6005 4 15 13 7 2 4 6 -5 -3 1 -11 -4 -10 -5 -2 -7 -5 -10 -1 1 -5 -9 -2 -4 -8 -1 -5 6 -2 -5 -4 -8 -1 -9 -6 3 -13 5 1 4 1 -14 4 13 -3 0 -3 8 10 -1 8
6055 8 3 5 18 9 9 13 8 -4 8 6 14 7 3 8 -13 2 0 -3 -13 0 -2 -13 -10 -7 -12 -8 -7 -12 -5 1 -14 -14 -10 -17 -11 -8 -18 2 2 -19 -5 -13 -10 -9 -2 -3 -1 -3
6103cKJ1j0PkklJ4moOKoMPj3JJ7j0ljpRPjk3J9lj3OLmMrRpJlnJ1nnJ1j0%nJLn
6152a3mJ0KlPJ1pnRqqPmNJ3k1J7mnMPpMJ2j0kJ4mj0NQj6J3koJ2noKqrJ8orjJR
6199GmrJNjlnOlnMKJ0lqpJ9mj4J9%j6J4lNJLjrNjNjkkNlK1j3mPj3mJ4j0kLmM%
6249FpKKMrlKMLj2J2Jmmj1PpPJ0oj0Lj0J2JmjPorJ4qLJ5j2JPRj5J2M%j1Pj2K0
6295A4j9QJ4j0J2PqkmnJpJ0pk%jlJ6j6NlJ0Oj8J1j3jOrklJ4j1jkOj4J5kLMQqj
6340bRknJJnNPqOoJnRNQoj2J5rMLKnnJ8k6J4pJ6j5kLnOnMkj3ONm%Nj%oj5RpJ4
6391bj0NMlpNQNj3nQJ2mj3J4PqmKM%%MjKqKRjJ1roQnqmJ0MnjJ0j2LmJqPLlkjq
6443gKQlmQj7J7j2qQJ1j0KjqJ2nJ4j6J3rJ1kj1PPj6J7oJkoQoJ3Rj9OJ1j5J1jO
$$ plain form
6103 -3 -1 10 0 7 5 3 0 14 10 4 10 12 6 10 17 4 5 22 12 9 8 1 10 17 16 -7 12 9 -4 2 5 1 5 -4 5 -2 -1 -4 -9 2 -3 -8 3 -7 -7 -12 -11 -8 -13
6152 -13 -17 -7 -5 -8 -1 10 3 -2 7 -1 -9 -2 -6 -1 12 -9 8 4 -1 3 10 3 7 19 9 7 21 17 7 12 20 4 17 15 9 21 16 10 12 4 -5 13 7 -2 -3 -2 7
6199 7 3 -6 -5 0 -1 -4 -9 -3 -6 -11 -7 -5 5 2 -6 -13 6 2 -12 7 7 -9 5 2 7 8 11 10 1 6 5 10 9 7 5 10 7 28 15 11 18 5 1 15 5 3 6 2 6 6
6249 6 -1 1 3 7 -2 -5 -3 1 4 -8 4 5 1 -3 -14 -7 -14 -7 3 -3 -13 -10 -20 -8 -7 -11 -12 -5 -11 -20 -6 -14 -11 4 -8 -7 0 9 -6 6 10 10 -1 6 -6 14
6295 14 -5 3 17 7 19 26 18 16 12 7 8 1 11 4 2 2 1 -2 14 -2 3 0 10 16 -2 9 -4 -5 1 -8 -10 -13 1 -10 -11 -13 -7 -21 -6 -8 -5 -1 7 -1 -2
6340 -2 7 5 0 1 2 -3 2 9 1 7 1 2 -3 6 11 19 13 1 16 7 11 14 16 11 6 24 -2 12 5 21 6 4 7 2 8 3 7 5 -8 -2 3 -1 -1 4 3 3 -3 -18 -9 -16 -2
6391 -2 -12 -7 -3 -6 -13 -8 0 5 -8 -13 -5 7 3 -10 4 11 3 -1 1 5 5 5 9 8 10 2 4 13 12 23 14 8 16 11 3 -1 9 13 8 7 17 5 8 4 5 -3 4 7 4 2 1 -7
6443 -7 -5 3 0 -4 4 -13 4 -8 -16 -8 3 -7 -5 -6 -14 -2 -7 7 -9 4 -5 6 4 -7 0 7 -9 8 2 3 1 -5 3 -3 10 19 0 6 17 2 13 12 18
6486A8j3QJj1lJ1jj2J3j4QJnJ2mqLLqLj2PpmK0k0Qk%J1j7J5rNJj4PPMnNj2J2p
6530eRRpkLpkJ1JLmJ0j4%NoKJjkpJ1j5J6LpLoNMj1Kkk%LlNrLnPj6J0PqQqJ2j7
6580a3J7%lLjoKmkPJ2p%n%J0nl%J4lj0J2o%l%jmJ1jJMj3NLPkk5J9jlj0KNLkqk
6629fPjlpKoN%%RQj1kL%Oj1QmOj5J7j2J2oPrJ5pPjpjJ0oJk%lPlj1J4OrPnj6KL
6679bnJ4MqlnRj4J4nqnjQlJnQLlJLnMjpRj4K0mLOnLNj3NJ0kqJ0%%lMmNj0mJ9o
6730A5moMm%QlJkkjKnQlj2LJj1LkLljQjJnoJ0qJ6j4Qj0J1%j2LMnjJ2mLnJ1NpN
6780HoPJlJkMKjRqj5O%JKOqJ2lrNkrQmLnmJrMRJ3prQpMjLj0NnLOj7J7j2LkKK2
6833A7j4OlQKrpJ1mQj0LKrPQn%Monj3J8JMnlQ%%qJJj6QJmKOOj0oNKqpJKOKQk2
$$ plain form
6486 18 5 13 14 3 0 11 10 -2 11 -3 5 6 1 13 9 1 4 7 -1 2 -10 -3 -10 -14 6 -14 -6 -8 -8 3 -14 1 -8 -3 -2 -16 -9 -2 2 -3 2 -10 2 -5
6530 -5 4 13 6 4 7 0 -2 9 10 13 9 19 5 5 10 4 6 7 6 4 -3 8 -7 9 12 5 8 2 7 11 0 2 0 -2 -2 1 -2 3 -6 -3 -8 -1 -17 -7 0 -8 0 -8 4 -13
6580 -13 4 4 1 4 3 -3 -1 -5 -7 0 12 5 5 0 0 10 5 2 2 16 13 3 15 9 9 6 6 5 1 12 11 12 16 3 8 11 18 16 -9 10 9 6 -4 -2 3 6 4 -4 -6
6629 -6 1 0 -3 -10 -8 -14 -9 -9 -9 0 8 -3 -5 -2 -2 4 -7 1 -3 3 -12 5 -7 5 -1 6 -3 12 5 12 11 4 3 13 7 8 6 6 3 10 7 -4 10 16 7 14 9 -7 -5 -2
6679 -2 -7 7 11 3 0 -5 4 -10 4 -1 -9 -14 -15 -7 -10 -9 -14 -6 -3 -6 -5 -2 -7 -3 -4 -11 -2 -16 4 0 3 9 4 7 12 -1 4 14 12 4 14 14 14 11 15 11 16 6 2 21 15
6730 15 11 5 9 5 5 13 10 11 9 7 6 8 3 11 8 -4 -1 0 -11 -8 -10 -7 -10 -11 -3 -4 -3 -8 -14 -4 -12 4 -10 -2 -12 -1 -1 -13 -10 -6 -11 -12 0 -4 -1 -6 5 10 3 8
6780 8 2 9 10 7 8 6 10 12 11 20 12 -3 3 3 4 6 12 4 16 13 4 9 7 -2 6 2 5 0 -4 -3 -12 -8 1 14 7 -2 6 -1 3 2 5 -5 0 -5 -2 4 -13 4 -8 -5 -7 -5 17
6833 17 3 9 6 14 16 7 0 11 7 15 5 8 10 1 8 16 11 11 15 9 4 -9 9 10 14 9 6 14 14 14 6 7 8 -8 0 1 -3 -1 5 11 1 -5 0 2 -6 -13 -12 -10 -4 -2 6 -16
6885a6J4lOj0RJ0j3mKjjQMnLJ0kojKMl%qjRKKM%j0mMKK%Mj4Pp%m%%nJ6j1nNMm
6936eJ0kpPj6MNOnlrK2qqrK1oOLmoRkjQoRj2kPjMn%LRj3lNJ3p%lmJ1k4PkMqkm
6988a4J5mkMOjmj8J2jNOqLkjNnQrKJ1j5J2mNj0RqNPLllKrJ2oMj0J9mlKjKQpj3
7037BJ5k0J5kmLkKj1J4Jj3pPlJ2Jj1LpkMMoomOnJlRjjlLJ4lqkLJ3mJ1j6NKomJ3
7086IJ%Pj1oQQmqqJ0kOmjPj0JKLkj2J1ppJ6r%LjmKKMmNj3K3k3LlMmJ0%PplRMj
7137A1joQnLJ1jj0QqJ0qjKJMmjnOKpKPoONj2j1Pkj8J5o%MkjkRj7RJ2j1jO%Kpm
7187g%mjJ4j1MnmK1mjJ2mj0NQmK%j6J7olJLRj3Kj%J1kjKlj7J3J5j5j1MLj5QRj2
7233gL%Qlj0J3pkRj5OQpJ2mj1NpJ1j8J9j1NlkJ5jj3J2J0j1Oj1J5j1J5j9NLlpN
$$ plain form
6885 -16 -2 -5 1 -9 0 10 -3 -7 -5 -6 -7 1 5 0 3 13 11 5 4 6 10 7 7 -1 -2 7 9 11 15 15 5 1 5 7 9 9 13 -1 6 -1 -1 -5 -5 -5 -10 6 -5 -10 -5 -1 -5
6936 -5 5 3 -4 3 -13 -9 -4 2 -3 -6 -15 7 -1 -9 -18 3 -3 3 6 2 -4 5 3 2 10 4 13 1 -1 6 5 9 4 4 7 16 3 0 5 18 11 11 8 4 15 -9 -2 -4 0 -8 -10 -14
6988 -14 1 -3 -5 -1 5 4 0 -18 -6 -7 -2 4 -4 -1 -3 -4 1 -4 4 -5 -3 8 -7 5 1 6 -4 5 -3 2 9 12 9 6 8 -1 11 5 9 -1 18 14 11 13 12 14 22 15 2
7037 2 17 -3 12 10 6 9 7 9 -2 12 13 0 -7 0 -3 9 10 -1 2 -5 -7 -3 1 -5 -11 -15 -9 -14 -13 -16 -7 -8 -9 -12 -9 5 2 -6 -8 -5 8 4 15 -1 4 6 0 -4 9
7086 9 10 10 17 6 0 8 16 12 4 -4 6 4 10 6 5 12 2 3 5 8 6 -6 5 -2 -9 7 -2 -2 1 0 -4 -2 0 4 0 5 -8 15 -8 -5 -8 -4 -8 2 2 9 2 -1 8 12 11
7137 11 10 4 12 7 10 21 20 10 18 10 20 12 11 13 14 18 14 13 8 14 16 9 11 18 12 18 23 11 0 7 5 -13 2 -4 -4 0 -2 -3 -5 4 -13 -4 8 -3 -4 2 2 4 -3 -7
7187 -7 -7 -11 -12 2 -9 -5 -10 -14 7 3 2 14 10 0 5 13 9 11 11 -5 12 6 3 4 7 16 3 5 4 4 15 13 12 14 11 -6 7 22 7 -4 0 3 -12 -4 5 -7
7233 -7 -4 -4 4 1 -9 4 -3 -5 4 -11 -5 3 -4 8 4 -7 -2 -9 2 -16 3 -8 -3 -6 -8 7 6 -7 5 15 4 10 -1 14 3 18 -1 4 7 4 -3 2
7275BO%Nj4RNmlOjj0pkQjkJ5nj1MQjrQqlNj3LRnjrJ1J0oOmnMkORnj2LJPkj6J8
7326GrJ8oPk2PJ3%Okj3qJ1mJ8j1j7R%%rPlMjmMj2J7nkrRj2PKMjnkJrPKmPjj5K0
7375AJnmNORrNkJnLklPljj0QQPj0Kl%jR%rrJ0KrNLmNlnJRnrRj0kMQk0J1J2j3k
7428gKPjmj1J4oMJ2kqJ0j2mQKMPknN%j6PJ3noLJjkJ1j1RMk6RJ0j1lJLqPlQpJ7
7476A7k4KMqnJ3Mj6PmJ1j2MKmoJ8Lj7J2pNRj1j1J6J1j5KMqNnKK3j2%jPnjMJ0l
7520B0oJJ3j0j5OJj1J2qoQj0J0m%PKNj0llJjpJ2lj3PrJ3omLOkPrRlkOMj2JJ1m
7567Dj6K1rqJJ2QpmOJ0j9J6j2J1Oj4rNOqJ1j2J4oQj7NJLj2J1mnLRk6J6J1j8p%
7609a5P%Lj0K0rJ5j6OpJ0MnrJ3KqPkjnJ3j2%PqJ0KnjJ0moOmnOkjpjJ3pJkmOqQ
$$ plain form
7275 2 8 8 13 -1 8 13 9 6 12 11 1 -6 -8 0 -1 -3 12 7 -4 0 8 7 -2 6 -2 -5 0 -13 -10 -1 -6 -7 -16 -5 5 -1 5 1 -4 0 -2 4 13 8 -4 -1 0 7 5 -11 7
7326 7 -2 16 10 17 -5 2 15 15 21 19 6 -2 9 5 23 12 -5 4 4 4 -5 2 -1 3 2 -2 2 -10 7 2 0 -9 0 -12 -5 -3 1 0 -5 -7 -6 -15 -8 -6 -10 -3 -4 -19 1
7375 1 2 -3 -7 -2 4 13 4 9 7 8 3 6 4 1 8 5 4 -6 2 10 17 7 9 6 6 5 14 14 5 -4 6 8 -1 4 7 3 8 5 0 1 10 5 -4 5 -5 -7 -3 5 -15 -4 8 -5 -7
7428 -7 -5 2 1 -3 -14 0 -6 -2 10 8 0 10 -2 -6 2 4 8 15 13 8 13 13 -3 4 17 12 6 9 10 9 7 18 7 16 20 -6 3 13 2 -1 0 3 -5 2 -1 7 0 17
7476 17 -7 -5 -1 -9 -14 -1 3 -13 -6 -10 1 -11 -7 -5 -9 -15 3 6 -11 1 -6 -1 8 -3 -14 2 13 -2 0 4 -4 1 -4 -2 21 9 9 8 15 10 9 13 23 20
7520 20 14 15 28 18 3 9 10 -1 11 3 -3 5 -5 5 1 1 8 10 15 5 2 -1 0 -1 -8 4 1 -12 -5 -14 -1 -7 -11 -8 -2 -4 3 -6 3 0 -2 4 8 -4 -3 8 4
7567 4 -12 9 0 -8 -7 5 13 6 2 8 18 -1 15 3 14 20 6 -3 2 8 0 11 -1 13 7 15 -2 3 4 7 -5 6 2 -3 0 9 -17 -1 10 -8 -15 -15
7609 -15 -8 -8 -5 -15 5 -4 11 -5 1 -6 4 8 3 -6 7 9 1 8 6 5 0 13 1 1 8 0 10 12 7 6 16 12 6 12 8 3 9 7 6 -1 -2 11 4 5 3 -1 5 -3 5
7658ErJnJj1QmQj0KJJ5j3jPj2K2lj0JJMJ1j0Nnj1RKqMMoQJ5ojlJKNj1OKmloQN
7707A1mqJ4plo%NKpJ1lj3Rj7J1n%QkL%j4J7mJlK%Pj1QkKOj2LMjPrNnjPpKpJ3m
7757CRj1J6qmKKPj5LPnlkKLqJ4j0Rj0j0J1j0KJoMLqQJ0j0mPnnJ4j5oK4j0J1nr
7802gPJ0rj2K0j7%K1rJ2qj5LJ5J4j2KKnKj2NNJmNjqMKj7J7kMOj0Jlj5QNj6PP%
7847Cnj8J8qpK0pJ3oj0JjJ2NoqlJ7mojJLlPLLrlMKlJ3mjqL%%nmJ1pmJ0%njJ4n
7897A1RpnrNkmKmJ1k4MJ7mj1ljKJ6kj4MRpkJqJ1OlKpONmk%K0lj0JKkPj0J3nqQ
7946A1jjJMjpjj2K4Lj6rQJj6OJ0j7NKn%kjK0k1Oj5NJ3Jj1LJ1j3J3rmJ0lMLoMN
7991BKlmORqjJ4%mnkJ0nKlj4OjQnMkoMNmM%qoOJ1j1mK%jKj3P%NNnj3J3%L%Pj7
$$ plain form
7658 5 -4 -3 -8 -7 -18 -10 -14 -6 -16 -14 -13 2 -11 -12 -5 -17 5 2 -8 -7 -6 -2 9 -1 4 -1 -12 -3 -1 -9 -5 -1 -7 1 16 10 9 6 7 9 14 3 9 11 7 4 -2 6 11
7707 11 7 -1 13 6 3 -3 -3 2 4 -3 8 5 -8 1 -16 -5 -10 -10 -2 -4 -1 -1 -15 2 -2 -1 -4 -2 -2 5 -6 2 0 2 8 -4 -1 3 2 9 0 5 0 -1 6 -1 1 -6 7 3
7757 3 12 1 17 9 5 7 9 16 1 4 11 6 3 1 3 6 -2 12 2 11 1 -9 2 -8 -6 -5 -11 -7 -4 -12 -4 6 -4 -8 -1 -6 -11 3 -12 -18 6 -4 7 2 -7
7802 -7 0 10 1 -11 9 -8 -8 13 4 16 8 -7 -4 11 25 13 15 17 12 14 2 7 12 13 9 14 13 5 9 11 -6 11 9 13 19 9 10 7 -8 0 5 -11 -4 3 3
7847 3 -2 -20 -2 -10 -17 3 -4 9 3 -7 -6 -7 5 10 4 -4 -7 10 6 0 -1 0 3 0 7 10 13 4 1 5 7 4 17 13 12 4 7 7 7 2 -2 9 2 -2 8 8 3 2 16 11
7897 11 20 13 8 -1 4 2 -2 0 -4 7 -17 -13 4 0 -11 -14 -15 -13 3 1 -13 -9 0 -7 -9 -8 -16 -5 1 -2 0 -7 -1 4 0 -2 -2 18 15 5 6 8 6 13 3 16 11 3 11
7946 11 10 9 10 14 13 6 5 -7 17 20 4 -5 3 4 -12 -6 4 -13 -8 -6 -11 -11 -13 -14 6 -15 -9 -24 -19 -6 -5 -16 -13 -2 -15 -2 -11 -15 -5 -8 -4 -1 -7 -3 2
7991 2 4 1 -3 3 12 4 3 17 17 13 8 6 16 11 13 10 -4 2 1 9 4 8 6 0 4 9 5 9 9 1 -5 1 12 1 -3 -1 -1 -2 0 -13 -6 -6 -1 4 -1 -14 -1 -1 2 2 9 -8
8043hJJ7qqj0J5LkmKJ4j3J6ollJ0j3J1qJ1j8PRnJkQj7J5j7J5j3KJ8j6J1j5J5j6
8083dJ6mj5lOJlLnJ1j3PpRKMnj1QOj2KMmLLJ4j1%RokNLKjj2J2j0j%J3pJ6Lj2m
8130A0%mnJRrJ3j9RLkJrPj0KJ0k5MPoQLnLQj2j0ML%Jj3PPKLj1LJ1mMkQlKrJ3r
8179aJ1nnkJ3mkNJmjN
$$ plain form
8043 -8 -7 10 2 -6 -16 -1 2 0 -4 -2 12 -1 15 9 6 3 13 0 11 3 14 -4 3 12 7 8 6 14 -3 12 -5 10 -3 -1 17 1 12 -3 12 -4
8083 -4 12 8 -7 -10 -4 -3 -6 -3 -8 3 -10 -3 -10 -1 1 5 0 -11 -3 3 -9 -7 -3 -7 -4 -1 13 2 2 11 5 3 8 11 13 12 0 12 2 1 1 14 7 23 26 14 10
8130 10 10 6 1 2 11 2 15 -4 5 8 6 7 -2 5 -5 -3 7 -18 -14 -7 -13 -5 -2 -7 -4 4 -8 -18 -14 -11 -11 -10 -23 -16 -9 -7 -4 -15 -12 -1 -5 -1 -3 5 2 4 -5 8 -1
8179 -1 10 5 0 -2 11 7 5 10 11 7 6 11
8191A1
$$ Imaginary data points
##PAGE= N=2
##DATA TABLE= (X++(I..I)), XYDATA
0@%%%%%%%%%Qj6J6j6K3l1L2m0M8n6P2q1R0j06J22j45J68j91K17k43K77l16L54
32A86l95M43m97N57o21O88p61Q46r41J039j148J273j411J564j734J927k149K405
50A271k703L057l484M012m686N578o816Q671j1791J8294n1975P1537L9223j55093
64h4905J04620M8351j36116M1057R6090r9019Q668P2456o8432j8358O4333l4174
76e429m844L7659l5438r725L3274k7602M961L3845l1170j1206K9171k0902n563
89a2969K8908r780j2376P648p765N145M979q897J6099l123k9623K4234J3041l5773
103b0252K3386K5055m8158N472L8029l4887k150M0039k8992j5176L1332j8740
115e042p449L0980j9384r446K5998k6061o567M1256k4623j9641M3860k2148l4565
$$ plain form
0 0 0 0 0 0 0 0 0 0 0 8 -8 8 -8 15 -16 16 -24 24 -32 40 -41 49 -57 65 -80 88 -103 114 -129 148 -168 186
32 186 -209 234 -263 294 -327 361 -400 446 -495 544 -604 669 -742 822 -912 1015 -1134 1271
50 1271 -1432 1625 -1859 2153 -2533 3045 -3771 4900 -6891 11403 -40572 30965 70188 -84905
64 -84905 19715 68066 -68050 -26993 69097 -29922 -21254 51202 -17230 -35588 28745 -5429
76 -5429 -10273 27386 -8052 -17777 15497 -12105 -7144 26701 -4469 -15675 13496 -7406 -12969
89 -12969 15939 6159 -6217 1431 -6334 -1189 3790 -5107 10992 7869 -21754 2480 15521 -20252
103 -20252 3134 28189 -19969 -14497 23532 -11355 -13505 26534 -2458 -17634 13698 -5042
115 -5042 -12491 18489 -895 -10341 15657 -10404 -16971 24285 -338 -19979 23881 1733 -32832
128c2832N0443Km4588L6987J2330n0270K1141L1517l5433K657K7667k5429r172
141a4980K3452n964o515R991n184m682K015j844Q158J536j1146O095K384j3105
155i789R964J0441j4786K066Q786j3863J996J3730r060j528Q052j1027o85J2074
169F371p429j234J0221j0678n052J3062m897n138J1820m786r906Q732R82n509
183c441O452k4n674K661j435o82O166l682k433O347o692m055J2363l149q850J0849
199D721j177j2809R990O279j1972M540P423j1577n18J0094m585k973O085k843
213F78m432L273J594n45J86m39M2j978q93M662O5m026K918m8n201M121L635n131
231a519J501K844n933P39N420l244m95L531m202j611M563j257j099L056k163k332
$$ plain form
128 -32832 17611 17613 -26975 10012 22342 -27928 -6787 24730 -10703 -8046 19621 -5808 -14980
141 -14980 8472 2508 -4007 5984 800 -3882 -1867 -3711 4447 5983 -5163 932 3316 -9789
155 -9789 175 10616 -4170 -2104 6682 -7181 -5185 8545 -515 -2043 6009 -5018 -5703 6371
169 6371 -1058 -2292 7929 -2749 -7801 5261 364 -4774 7046 2260 -7646 1086 2068 -3441
183 -3441 3011 2987 -2687 -26 -1461 -2143 4023 341 -2092 4255 -2437 -6492 5871 2722 -6128 4721
199 4721 3544 -9265 725 7004 -4968 -428 6995 -4582 -5100 4994 409 -2564 3521 678
213 678 -3754 -481 1113 568 754 315 357 -1621 -2514 2148 2213 -1813 1105 1057 -4144 -23 3612 -1519
231 -1519 -18 2826 -3107 -2368 3052 -192 -687 2844 -1358 -2969 1594 337 -762 2294 131 -2201
247b201K305k70q8K147j538j321Q94j208J018K420k317l63J862l090p6M336k040
264D70j799L356k397k852M573N12l404K425N25l801J492K563j822P3J344j721
280d63j081J383R81k93n62K91k49j449J104J963j704m73J873k120j317L505k12
297A177k453K171n4l118K053J984k450N71J650k540m97K405m70p15J104o76j252
314a110P45P85p9j01j8j73p22k9J342M9r44N71k36j357J219J251j425O1J011j571
334g31l67J916l47q53J023n33j321J146Q28q32J70L19q99j28P69J18j08P9k44
353Em51K6N65L36l55k01J11l65q0P45M5m77K18r3o38M55P22m14k72K83l56k63
375d54O13K20l84M1R5m34o0N95J92m28p9J31l09%O35n2n74K87J51o97L11Q74n90
$$ plain form
247 -2201 104 -166 -254 1893 355 -966 -72 -1280 -262 2158 -159 -522 1340 -1750 -1826 2510 470
264 470 -1329 2027 -370 -3222 1351 1863 -1541 884 1409 -2392 -900 1663 -159 -86 1258 -463
280 -463 -1544 -161 820 527 -35 256 7 -1442 -338 1625 -79 -552 1321 -799 -2116 1389 1177
297 1177 -1276 895 841 -2277 -224 1760 -690 -119 1531 -1009 -1506 899 429 -286 818 142 -1110
314 -1110 -365 420 341 240 222 49 -673 -702 640 689 -255 316 80 -1277 -58 1193 -232 -171 840 -731
334 -731 -1098 818 471 -382 641 108 -1213 -67 761 -71 99 418 -481 -609 160 278 170 249 5
353 5 -446 -420 145 481 126 -75 36 -329 -409 336 381 -96 122 29 -609 -154 568 154 -118 165 -191 -454
375 -454 159 379 -5 36 131 -303 -363 232 424 -4 -83 48 -261 -261 374 322 -252 35 186 -511 -200 674 84
398H4m81O72l15o01R67K85j069L43O13r56j8J124m46o88P78j42q35P70N69r38
418b84qP37n79m15Q87L8p76M36L52q45J42R55n70n92Q61j09q72P61M61r76K85
439a11P14r64j42J108m65o19Q24j29p72O51L29p17K34M55n90j54N83q3l05K31
459G8K3k96Q2L30j54k56K87M9m16J97L65l65m3L47l63j07N07k00l19M30j07l29
481b60L68l0k90L98m3m28L19J04l51K99R6m12K63J43m06K23K72l93Q3J83l25J67
503b0K73l45J0K34k45J7K13j93N0J35k36K0J88j08L9N7k47J53J39k81J51J95l71
526a72R1K99m08O6M72m29k08N06j90k95M58o4m22L48J32m01J53L14k77j44K36
547F5j4j44J44R1k39k3K59r3k19K58J07l72J17K70l07L2L33l31j82M42j09k89
$$ plain form
398 84 -397 275 -40 -641 326 611 -458 -115 498 -458 -476 648 202 -486 292 150 -685 85 654 -284
418 -284 -292 445 -134 -549 338 376 -400 36 388 -457 -315 640 70 -522 339 230 -642 119 580 -396 -111
439 -111 603 -361 -503 605 140 -479 345 216 -556 95 424 -293 -59 396 -194 -348 235 152 -153 78
459 78 101 -195 -113 217 63 -193 94 143 -273 -76 289 -76 -119 228 -135 -242 265 65 -254 176 69 -260
481 -260 108 78 -212 186 143 -285 34 138 -213 86 182 -230 33 176 -230 -7 265 -128 -45 138 -187 -20
503 -20 253 -92 -82 152 -93 -76 137 -56 -6 129 -107 -87 101 -7 32 89 -158 -5 134 -147 4 199 -172
526 -172 -81 218 -190 -124 348 -81 -289 217 27 -268 190 126 -296 52 184 -217 -64 250 -27 -171 65
547 65 51 -93 51 142 -97 -120 139 46 -173 85 192 -180 -63 207 -100 -68 265 -66 -248 194 85 -204
569b04L21K5l48K13J45l10J43K33l10p4K84o2j40J54k3k10J51J37k06QK18j42
591Cj91K39J7j99K05N0l49K11K43m05O4L78l74o8M31l44j62N68k72l99N82p3m92
614c37M98N6n60M57J91o69L35L93n89J29M07n02M3M46m01n7M10k73j27K75j51
635b6j7J86k06J4J38j98J70R4m04L14J93o16L12M55p33J90N94q28P0R16q20k31
657d33R98o74m24J072n23n69J098m38q03J098j55q47R85j07r69R83J07j054Q66
676B11K88j113O94L95j036O35M99j091M38O06r43L57N63r02L02N88q68K52O25
695E00q23J97N66p85K37N94q32K06O17q43K89O05j013L50P96j160K15J069j261
714d76K2J352j264k81J606j105p75J758o62j098J584l14j326J393J27j329J016
$$ plain form
569 -204 117 142 -206 7 152 -158 -15 218 -92 -166 118 56 -84 70 47 -163 -12 125 -81 -73 145 3
591 3 -188 51 68 -131 74 124 -225 -14 229 -176 -112 266 -108 -176 255 -89 -251 317 45 -354 228 155 -337
614 -337 161 217 -343 114 305 -364 -29 364 -225 -96 311 -191 -148 298 -103 -160 250 -23 -150 125 -26
635 -26 -43 143 -63 -49 89 -109 61 155 -249 65 258 -358 -46 409 -324 -134 460 -368 -298 618 -202 -433
657 -433 565 -109 -533 539 16 -553 545 107 -696 402 247 -600 385 278 -691 292 399 -655 211
676 211 499 -614 80 475 -561 74 573 -518 -80 526 -417 -60 503 -399 -97 491 -377 -125 500
695 500 -323 -126 440 -345 -108 486 -346 -140 477 -366 -77 528 -485 -135 661 -499 -284 785 -476
714 -476 -454 898 -366 -647 959 -146 -921 837 175 -923 661 347 -979 414 541 -788 228
731B28L23j204O84M33r39N73L49r13M24L91o96M46K55p48M32K79p08M76K90p53
751c78M44K43p86N81L99r75M47N25j011M20P30j075J84R20j019r2J082p47l40
770d48R58n72m20Q88l54m36O68k72l10N85l45k50P04m32l78Q17l66n17Q72k18
790A74p53Q91K4r11O64L28q21M13L94p18K19M17n05J04L30l54N8J66k81J99J87
811B25m06J52J90l60J87K54l99J06K57m01J08L41l33L9K32m14R2M05l67m1L82
832B49l59j17M52k54j62M35k02l20L41K4j94J81l8j38J00qKR4j55M5J61k77J8
855a22L64k59j55L64j90k25L94p4k88K77M6k83J24J28j09L3Mn2K3k7M9N9j41O6
879FJ23k56L2K59j96n2K48k42j01L59j89j70L62j57k62L51q0k42L69m2l81K70
$$ plain form
731 228 551 -653 31 464 -475 98 447 -466 -42 349 -347 99 354 -394 38 317 -391 85 375 -378
751 -378 66 309 -477 104 503 -472 -25 500 -511 -91 639 -436 -252 668 -351 -443 639 -108 -448
770 -448 510 -62 -482 406 52 -384 284 12 -298 287 -58 -308 396 -36 -414 403 37 -480 392 174
790 174 -579 312 336 -575 89 417 -404 9 403 -315 -96 321 -184 -80 250 -104 -46 120 -161 38 225
811 225 -181 -29 161 -199 -12 242 -157 -51 206 -195 -87 254 -79 -40 192 -222 -130 275 -92 -133 249
832 249 -110 -227 225 -29 -191 244 42 -278 63 87 -107 74 36 -102 -2 -10 -8 86 -69 -24 137 -140 -122
855 -122 242 -17 -172 192 2 -223 171 97 -191 86 132 -151 -27 101 -8 25 29 -23 0 -27 22 81 -60 6
879 6 129 -127 -95 164 -32 -84 164 -78 -179 180 -9 -179 183 26 -236 115 35 -207 162 120 -261 9
901IJ36l07J96J06k76J07J14j96J11J06j34K3J0j08J82j6j59J97o6j94K42Pk44
924a54K82Ol80K52J70l23K08J36m02J60K53l58J12K74l45J1K88l22K7L81l33j15
946a72L51k10j41L34j38j88K89j09k00K50J7j65J29l8j22J75m3r5J36n4o9J31
968F8j12n0K29j13j72K53o9j63K46m7k46K64K8l05K04J49k72J15J39k73J00K17
990A90k59nK13j76n4J84j12k8J62j13j06J47m2k7R4p4n0J03p0l8J20m6n1O2o7
1015d3k0J36n4q9R6j4j00J06J0p2P8Jj25N7P0l3%Jl6K5K3k2K8ml2M4m2n6J21Q
1045F2j16N5M9j01N0R9j09nR9q8j01J71J1j16M7M3j05K2J19q3n2J01l2j09Q3P2
1071F6o8j8M2n1l5J07J4j06M1O2j04k0J31k8o5O9k9j21J20R5j26rJ01q6o0J46
$$ plain form
901 9 145 -162 34 140 -136 -29 85 -111 0 106 -28 -5 5 -103 79 63 -96 101 35 -159 83 90 -154
924 -154 128 134 -246 6 176 -147 61 197 -205 -45 208 -150 -38 236 -109 -98 190 -132 -105 276 -57 -172
946 -172 179 -31 -172 162 24 -164 125 16 -184 66 83 -82 47 9 -113 62 19 -76 60 6 -63 68
968 68 -44 -94 135 22 -150 103 34 -129 117 70 -176 88 116 -189 15 164 -108 7 146 -127 -27 190
990 190 -69 -74 139 -37 -91 93 -19 -47 115 2 -104 43 1 -26 68 -6 -56 47 -23 -61 59 13 -38 24 -43
1015 -43 -63 73 19 -70 26 12 -88 18 28 -44 34 35 -90 -33 37 4 4 5 -31 -6 17 -5 23 19 -13 31 -11 -67 54 62
1045 62 -54 1 50 -51 -1 98 -11 -16 83 -5 -106 65 76 -40 7 50 -55 -33 86 3 -49 52 20 -89 -6 66
1071 66 -2 -20 22 -29 -64 43 57 -49 -8 54 -50 -70 61 33 -32 37 8 -113 7 102 -24 -33 68 -18 -78 68
1097F8k2q1Q3Kj44P6J26q3n4P7m9p5J01M7r5L5R2j67k9J77lj25P2J3j44R6J11
1124A05j27oJ06j02r3J41M4q0K1Rr6L0R1j0n1K7K3q3j9J11J5r2L8Pr4O5J26j16
1152a0m6J16p4q9J40M6r2L9oj00M9J06l4n3J9j2k1J5N0Km3Mop1P9J03j21l6J08
1181F2q4n2J58m1r7J22l1j67J41R8j40QP8j15pJ35m4p5R2k0r9J2J10k1n4L1J0
1208A0q9M5J30j11m7J30n7j40J73N1j55O4O8j69M5J73j18o1J28o7p4R0jk1N9l6
1234B0m9QN1Mk2m0L9ln0N1L2m5K5K2j27O1J10j09qR7j12k5J36q6k8J41r2j20J44
1263B5ln9J24p9r0J33o2o1J68p4j10J72j19j06K71m6k34K40k5k34K39N5k85K02
1287D2J11l11J19J96k30O7J43k40L4J70j46K7J24j63L0R7j69J09J17k00N3J08
$$ plain form
1097 68 46 -35 48 50 -94 -18 108 25 -29 48 -1 -76 25 72 -23 12 104 -63 -92 85 82 -43 29 42 -102 -6 105
1124 105 -22 -28 78 -24 -117 24 68 -12 9 18 -78 -48 43 33 -18 9 32 -51 -70 41 56 -36 2 9 -85 -20 106 -10
1152 -10 -56 60 -14 -103 37 83 -9 30 24 -76 -27 79 45 -8 11 -1 -22 -7 43 45 2 6 0 -71 8 111 -10 -46 62
1181 62 -22 -74 84 43 -54 68 37 -130 11 109 -31 -23 55 -60 -67 68 24 -51 41 21 -78 -66 44 23 -31 0 10
1208 10 -79 -34 96 -15 -62 68 11 -129 44 95 -60 4 72 -97 -52 121 3 -58 70 3 -71 19 18 -3 56 20
1234 20 -29 -21 30 34 12 -28 11 8 -42 9 41 -4 21 43 -84 -23 87 -22 -30 67 -45 -70 66 -20 -48 93 1 -119 25
1263 25 22 -37 87 8 -82 51 -11 -72 96 22 -88 84 -35 -141 130 84 -150 90 65 -169 70 125 -160 42
1287 42 153 -158 -39 157 -73 -6 137 -103 -69 101 -45 -18 106 -57 -27 70 -99 10 127 -73 -20 88
1309H8k16J38J52k92J10J99l56Q6L04l48O2L21l91m8M49l20j43M70l01k16M70
1330B18k04k53M60j46l46L91m1l05L85m3l45L37Ll30L32N8l61K73M0l55K89J36
1352A93l47K06R7l26J91J50k91J64J16k98J36J27k48J91R6l27J70J32l03J88J74
1373A91l46J39K04l90J47L14m06N5L08l81J7M35l88p1M26l27j68M71k25k35M57
1394B27k02l27M45j6l54L33M0l80K75J05l29K12J40k91O8J47j69R8R4j85N6O5
1416E2j29R6N1j16Q7Kj70J44O5j66J34L5k10J35R9k36J29J59k84O9J88k50O5K52
1440B01k94m3K97k22p8L21j83j64L02j29k16L24j4k64K00L8k42J86J09k37J09
1461AJ17k12N6J47j36K4P9j29K5R7q6K4L8p2K7K9o9Q0J5r0N4Or7J18K3j46Q8M8
$$ plain form
1309 88 -128 10 162 -130 -20 179 -177 -91 213 -135 -73 248 -143 -191 258 -62 -205 265 -36 -252 218
1330 218 14 -239 221 75 -271 120 79 -226 159 116 -229 108 111 -219 113 171 -190 83 123 -232 57 193
1352 193 -154 52 149 -177 14 164 -127 37 153 -145 -9 118 -130 61 157 -170 0 132 -171 17 191
1373 191 -155 -16 188 -202 -55 259 -147 -92 216 -165 -148 287 -101 -172 254 -73 -241 230 5 -230 227
1394 227 25 -302 143 127 -227 106 146 -234 41 146 -183 29 169 -122 -54 93 -76 22 116 -69 -13 52
1416 52 -77 19 70 -46 41 43 -127 17 82 -84 50 85 -125 10 109 -127 2 161 -123 -54 134 -116 -51 201
1440 201 -93 -136 161 -61 -139 182 -1 -165 137 8 -208 116 102 -162 38 76 -166 20 129 -108 1
1461 1 118 -94 -38 109 -27 -3 76 -53 -28 69 -17 7 45 -27 0 29 -40 40 55 -35 19 25 -72 46 69 -77 11 59
1489E9j56Q8J03j76R0R7j92K0J75j51j7J57j49m0J71r7n6J47n8q7J01l7m6J06
1513E2k2r6P1j1m5O0J9n0M7k7m0N6RpJk2j1L0j5QK2k9lK8o0L6P0p5j2N6m5j0P8
1546F3p0k9R3n0o2R3j6n7O1k9n0P7Jn3L9j9k5M4j5j6N1k8m1L5k1OO2m1l1N5k8
1577am3P2j3l3N3m2m8Q4ko6O8j1n7N0J8o1N8K5p7K4K6k8K4Rm2J9Qk3K1Kl0L7q
1610A3n2O0Qm9L0Mo1K8M7n4RO6o2k9N0q%J8l1j6K6jnQmMMk1KN0j6k6K2l4J2K5
1646A7%k1J4lj4J5PNJ2k0l5K5J9oLrj6J8k4J5OK3k0j4j3NL6j5nj4j6LK9j1J0K2
1682B8l2k9K0L0j8J3Jn1QL6k3NK6j8k4J2J3j2K6Jk3j2K6jlNOj9kJ7J1mJ7j9l9
1717b8K8J8rLJ3k5j8K2MOK0k8k2%J0K4Jj1k6J9j8RJ8Jqrl1K1K7KqOm1jL6lk1L6
$$ plain form
1489 59 -97 -9 94 -82 8 105 -87 -67 108 -43 -60 97 -52 -92 79 -18 -74 73 15 -72 29 -8 -54 52
1513 52 30 -66 5 -6 -51 9 28 -22 25 -2 -42 14 23 16 17 -5 -16 14 -1 7 29 0 -3 25 -35 1 71 -4 -16 40 -5 -15 63
1546 63 -7 -36 57 7 -55 38 22 -35 26 -3 -53 24 25 -28 11 -8 -33 11 -4 -20 31 3 -38 -3 -24 -18 44 3 -28 27 -1
1577 -1 -44 28 15 -18 35 -7 -55 29 27 -39 29 18 -39 11 29 -32 26 51 -26 -2 24 -4 20 29 -13 6 14 -9 12 14 -16 21 13
1610 13 -39 21 29 -20 10 14 -47 -19 28 -26 -17 49 -13 -42 8 0 0 18 -13 -29 -3 -4 -9 -1 -5 -1 3 -18 -16 34 18 -8 14 -20 -8 17
1646 17 17 -4 10 7 -7 8 15 20 32 12 -23 2 21 15 18 9 -7 11 -13 2 8 31 11 -3 -16 -11 25 10 5 -9 -25 -22 7 -4 6 28
1682 28 -4 -33 -13 17 -1 12 13 -38 -30 6 -17 -12 14 -4 -28 -16 -3 -15 11 12 -11 -23 3 2 -1 4 10 -9 -11 6 17 13 30 11 -28
1717 -28 0 18 9 12 25 0 -18 4 8 14 34 6 -16 -16 -6 18 19 8 -18 1 -17 -8 10 11 3 -6 -37 -16 11 13 5 11 -30 -31 5 2 -19 17
1755A7j0l5J1J8J0K0j1l9jJ8pJ9K1k2k3PkK6K5j6k0k1NK6J4k4J9j6l4J7L0%Kn
1789A9m5KK9Lj0K4k2k6J2LJ1L1l1k9nJ4J4J9j8j6Pj2J5K0Knrk6j9O7Ol6J0k2k2
1824d5M9J0rJ3rm0J1J5J9J6j3m6J1K2j0L4Kk2pKl2N9jj9lj2l6N0K3m8K9Jo0K3
1858b3M0j9RK8q5PN3j9J0J8l0l9L9j6RN1l0l3Oj9L7N2l2k3J5m3NO8l6j9N8o0l4
1891e5Q4Nm2N5l1p1P3Km0O4k2o8M0J9m6Q1Jr9L8J8n0O8L0q0K7J1o8N5O4q5OL2
1923A6p8K5Q9q5L2L9r8QQ1o6J6P4r8k8R9m3nQ5q0m2Q7n4j2J11m9p9P9n3j7J24
1953G8n2o9R8p4o4J43k6p3J04n0j03J12L7j02R5j6j29Q1O5j07R2L5j50O5M0r0
1979f0Q7N0j42M3M7j02Q5P2j36M3O1j36M5J31j24K5N7j35L2J39j01j2J07j17m0
$$ plain form
1755 17 7 -28 -17 1 11 31 20 -19 -20 -2 -9 10 31 9 -14 -7 -9 17 42 26 6 -15 -10 16 30 6 25 9 -25 -8 22 22 24 19
1789 19 -26 -24 5 8 -2 22 0 -26 -14 -11 0 31 0 -29 -34 -20 -6 13 -5 -21 -14 -26 -11 9 11 6 -3 -29 -48 19 25 -11 -1 -23 -45
1824 -45 4 14 5 18 9 -31 -20 -5 14 30 17 -29 -18 4 -6 28 30 8 1 3 -29 30 29 10 7 -5 -41 9 32 -16 13 14 -46 -23
1858 -23 17 -2 7 35 -50 -43 10 -9 1 19 -11 -50 -11 -27 -18 33 3 -30 -24 -43 -6 46 14 -9 6 -37 -32 36 0 -19 39 -21 -55
1891 -55 29 34 -8 47 16 -55 18 20 -20 44 22 -46 -6 13 -33 48 49 -50 -12 6 -44 24 54 -26 1 12 -56 -1 63 -22 -16 16
1923 16 -62 -37 52 -33 -1 38 -60 -52 29 -37 -21 53 -45 -73 26 -17 -22 63 -17 -59 28 -26 -38 73 24 -55 24 -29 -46 78
1953 78 26 -43 55 -19 -83 60 34 -39 65 15 -88 24 61 -41 54 38 -91 -10 55 -52 40 75 -75 -10 30 -60
1979 -60 27 77 -65 -22 25 -77 8 80 -56 -13 48 -88 -43 88 -36 -11 46 -89 -57 82 -19 -31 76 -41 -81
2004h1J40p5j7J29j09q3J34l9l9J22p1q1J00l3m7J18k4p4N8l9n2J20qr0R0l7q9
2031g7J13J6r1R2k5j20R8N1r0Q0Kj34O5N6q4N6O9j34K5N0q2O9Q4j22oP4q6J7J04
2060G0q0k1P3r4j1J31n6l1O0o2l7J21k8l7N3o0m2P9j1j0O1m7p4O6qj8P3m0n1M6
2090A5k4k4Q3j1n1L0k9n3J02Qp7M9j0p3P1M0q2O0Mj02N1N9o4M2K3q9qP3k4JP1
2121F1p4k8M6l6K5N2m7kJ2l7K4M0l6qL6o2K2N3m2K1L4q4QP0n0J2M4p7%N7m5QO8
2154F5n6m1M9l2jP2n7l0N9o1NP2m0l1N5n5k7Q1rm4N2l0o4O2J3m0O3k2n7M6Nk2
2186b0M9j5m1L4kl8P3mo1L2lm3O0Rl9L0no1O6K3p1M7J3q4M3N0o6N2K2r9L1N1m1
2219hLN3o6j4N3l3kN9n5k7M1l7J5N1m3j9M3l4j3O5m1j2N8p2oO8k5j3N2m9k5N0
$$ plain form
2004 -81 59 -16 -33 96 -13 -96 38 -1 -40 82 11 -70 30 -3 -50 68 44 -30 28 -11 -63 57 49 -41 49 12 -77
2031 -77 36 52 -39 53 28 -92 6 57 -33 47 49 -85 -20 36 -48 8 77 -57 -32 18 -64 5 89 -33 -39 35 -51 -34 70
2060 70 -10 -31 42 -52 -63 68 12 -19 41 -21 -58 63 35 -2 51 -9 -51 28 17 7 68 21 -53 13 5 -13 60 20 -31 15
2090 15 -9 -33 50 39 -12 18 -11 -64 38 46 -31 18 8 -65 6 46 -36 24 28 -74 -23 36 -28 14 37 -52 -60 13 -11 -10 61
2121 61 -13 -41 5 -31 -6 46 -1 -3 9 -28 -4 36 0 -8 28 -34 -12 41 -1 20 54 -30 -22 48 -2 10 54 -23 -23 34 -11 -3 65
2154 65 9 -32 17 -15 -16 56 -1 -31 28 -33 -28 44 4 -27 28 -27 -54 27 18 -26 26 -4 -68 -6 7 -33 30 8 -49 -3 2 -20
2186 -20 29 14 -27 7 5 -33 40 36 -25 7 4 -39 21 30 -9 21 16 -45 21 44 -27 20 33 -51 -8 42 -24 28 50 -49 -18 33 -8
2219 -8 -5 48 -18 -32 21 -12 -14 45 -10 -37 4 -33 -18 33 -10 -29 14 -20 -33 32 -9 -21 37 -35 -41 27 2 -11 41 -8 -33 17
2251A7j2k5O3k4m1L3Ll0N1Ln5K8qj5L9jl3L3j3m5N0K1m1J4J0o1M3L2n5K8K6o6
2283c1K4L3m8K7L1n2j3N0m8J1M5l4j9J6j3qM9k8rJ0j6%L7j7j5K4j0k3M3Pl1M0
2315C2m0k7M6Nj5K5j1n1M0K4l4L1J2m9OK6k5K4K4o0J7J4l3L4jl2K0Rl7PK4j9J1
2348cK1m8K3L3m4J0L1m5rN5l3nK9j9k5L7j7qK5j2k7L2moJ8rokllK6Jj8J5rj2J9
2385Hnj2J2%k9K3J9j8J3Pl0RJ6Kk2J9j4LNj0pJ4k1J4Pj8LJ1j3OQk2%J4pMQmj5
2424b2K7j3mOlL%OpLLjjLjJ1oPqNrKJJ1jk3K2Qj7Rj0jLQjj4pJ4rrJ0Q%mlj2PJ3
2472Dj2Rlj2oOJ1kMlj0NJmmJ8j1j1J1J5mlj0LNJ1Jj3K%RqQj2MJ2oJJKLrJ2j0k
2517CKJlLrqQJnkK0j5Pj5J1jKnjNj0QplJ2Jj5MJ3k1J1Rj1KJ7j2j0J1noJ7JqNJ
$$ plain form
2251 17 5 -20 43 19 -22 11 14 -16 35 38 -17 11 3 -12 27 26 -7 26 13 -32 18 39 -2 12 22 -39 4 36 -19 9 35 -31
2283 -31 -7 26 -22 5 36 -16 -29 21 -27 -16 29 -5 -24 -8 -21 -29 20 -8 -17 -7 -23 -23 14 -3 -18 6 -4 -27 16 23 -8 32
2315 32 -8 -35 11 16 1 26 15 -36 4 28 -6 25 37 -12 -6 20 -5 19 43 -17 0 14 -19 15 14 -18 2 11 -26 -19 5 -14 -3
2348 -3 18 -30 -7 26 -18 -8 23 -22 -31 24 -9 -14 15 -4 -29 8 -9 -17 8 -4 -31 1 -3 -9 9 0 -6 -8 -11 -14 12 13 -5 10 1 -11 8
2385 8 3 -9 3 3 -26 -3 16 -2 11 18 -12 -3 13 15 -7 12 -2 1 6 -4 -11 3 -18 -4 3 -15 -12 -1 -14 -8 0 -22 -22 -8 -15 -11 -3 -7 -22
2424 -22 5 -8 -12 -6 -9 -6 -6 0 -7 -4 -1 -2 -3 0 -1 10 4 11 3 8 -1 1 2 13 12 -11 11 19 2 11 1 0 3 11 10 -4 -11 3 -6 -15 -5 3 3 -1 -4 -16 -9 4
2472 4 -8 1 -2 -14 -20 -14 -3 -5 -1 -4 -14 -9 -8 -12 -16 2 -9 -20 -9 6 2 -1 -11 -8 -3 8 9 -4 -2 -2 7 -1 7 -5 -1 11 5 6 7 9 12 3 15 5 3
2517 3 5 6 3 6 -3 -11 -3 -2 -7 -9 11 -4 3 -12 -1 -2 0 -5 -6 -1 -11 -3 -10 -13 -1 0 -15 -11 2 -19 -8 1 -10 -8 9 -3 -13 -2 -7 -13 4 5 -3 2 3
2562CmJ0Jj7L0j8j1J9j8%K8j7j7K5pqJ4qj3J3kpJ4ok3J9J5l5K0jrJ4Nl1J6Kj8
2599b2QJ5j3%Ok3L1j0k1K5Kj6K1Rk4lK3k7J5K3l3J0J7j0lJ4j2j5L3k3nK1Kk8K2
2634Ijj7K0j0nK4k6%PKj0K2j3j7L0j0l1L8rk8J9J2l0J7Ok8J4K2l3J1J5k0J0J2
2668Bk0LK4k6PJ6l0QL8l3KL2l1PJ9k9lL7j4j2K9j9j7L8j9j5J3Nj9K6qj9J9nnj
2704@J8k7nK1j1J5k1MMkrPJ0k1K0jk8J7J5k4RJ1j6mK0j0j5K8nrK2k5mK2%j6K0
2741A0oj1J1mMkJ2j1mJ7j7QQj4KMNnmoRrlJ2j2J3lnj8K3nj1J0%j2KPmJLqJ0%j0
2785a3J0j6J6Oj8nK5ppMLMj0RNj7NJ1jnPlj0J0J0j6KJ3k8K4rmoK1j4NOpjJ3oj5
2827iJ9j2olJ5k5K4qj2J8%mJ1%k4J5r%QmpJ0Mj6J4%j4J9J5m4L3lj3K4j0k3J9J7
$$ plain form
2562 3 -1 9 10 -7 23 5 -6 13 -5 -5 23 6 -11 14 7 -1 13 5 -8 5 3 -4 10 4 -19 0 15 -20 0 -1 -10 4 9 -22 -6 -4 -22
2599 -22 -14 1 -12 -12 -6 -29 2 -8 -29 -4 -2 -18 3 12 -12 -15 8 -19 -4 19 -14 -4 13 3 0 14 2 -13 20 -3 -8 13 15 -13 9
2634 9 8 -9 11 1 -4 20 -6 -6 1 3 -7 15 2 -15 15 5 -26 12 3 -25 -6 6 -24 -7 -1 -29 -15 7 -26 -15 0 -20 -10 2
2668 2 -18 -15 9 -17 -10 6 -24 -16 22 -11 -9 23 -8 -1 18 -11 -14 23 9 -3 26 7 -10 28 9 -6 7 12 -7 19 11 -8 11 6 1 0
2704 0 18 -9 -14 7 -4 11 -10 -6 -2 -4 -13 -6 4 -17 3 2 -26 -9 6 -18 -9 2 -14 -18 2 -8 -23 5 0 -9 13 -12 -16 6 6 -10 10
2741 10 4 -7 4 0 4 2 14 3 -1 16 -1 7 15 1 3 7 12 7 3 -3 6 -3 -6 6 -6 7 4 -1 -19 4 -1 -12 -2 -2 -14 -12 -5 -9 -8 -5 -13 -3 -3 -13
2785 -13 -3 -19 -3 3 -15 -20 5 -2 -9 -5 -2 2 -8 1 6 -11 -6 5 4 -1 6 3 -7 3 13 -3 -1 12 -16 8 -1 -5 -11 10 -4 1 7 0 -1 12 6 -9
2827 -9 10 -2 -8 -11 4 -21 3 -5 -17 1 1 -3 8 8 -16 -1 -10 -10 -2 -6 -13 -3 1 -15 -1 -1 -15 4 19 -25 8 5 -8 16 6 -17 2 19
2865A9j8NKj7J7J0j5J1Nl0K3J1m1K0K2k7OJ8l5LK7k3LK3k8j4K6j2rK4k4LK3j1
2899coK5j8k7L1j3rPJ4j7J5oj3J4Mj6%K8k8K1J2j2Kpj3J9JoJ0Rl2K7Pk2J4Mk7
2936a1J4J1j6mK5k3MJ6j8JK5k2mK3j9pJ5Kj7J4lj9NMj0J8Mk8J0J4k7J9mrRJ2j9
2973a5J4Pk0J1J1j8MJ6k5RJ7k2J1K3k2QjrPjqkJ1Rj2NoPjj7QPj3lJ0lj2K4j3m
3013hNlrJ2Kj9J1Pk9K9lj7K0qKJMj5J1KllQlJNpOOnqK3j5lJ3j1JJ0j1J4%%j1J5
3057A7j7jJ5nJqjLpJ9rjj2J5qj4J2LmOj1nML%kMlpLQqoQ%mjJ6j0LlLj7K3OpmK
3105aLoJ5k0%J5jroJ4nQJkj0%qJ5kKRj0okMnJ7j9J1KnpJ0mrJ8j7LMNk3LJ3nKL
3151eprLJ0RpJ1j8kOJ6prRj0LJ0Kj0MQj6J0J5j2lK0k0qJ1j1R%MlpJkRkj0QkJp
$$ plain form
2865 19 1 6 8 -9 8 18 3 14 19 -11 12 23 -18 2 24 -3 3 21 -14 -11 16 -7 -4 19 -9 -23 3 -9 -18 6 -18 -15 8 -3
2899 -3 -9 16 -2 -29 2 -11 -20 -13 1 -16 -1 -7 -20 -6 -2 -18 -18 10 -18 3 15 3 5 -2 -15 4 5 -1 9 18 -14 13 20 -2 12 16 -11
2936 -11 3 14 -2 -6 19 -4 0 16 -2 -1 24 2 -2 21 2 -5 10 12 -5 9 6 -13 -8 -4 -14 4 8 -20 -10 4 -23 -4 -8 -17 -8 4 -15
2973 -15 -1 6 -14 -3 8 -10 -6 10 -15 -6 11 -11 0 23 1 9 8 -1 6 5 -3 -5 6 15 3 8 2 9 8 -9 -1 6 -7 -10 0 -3 -15 9 -4 -8
3013 -8 -3 -6 -15 -3 -1 -20 -9 -2 -31 -2 -5 -22 -2 -10 -8 -7 -3 -18 -7 -5 -8 -11 -3 -6 -5 0 -7 -1 5 0 -8 15 0 -3 10 -1 0 10 -1 13 13 13 2 17
3057 17 0 -1 14 9 10 2 1 4 -3 16 7 6 -6 9 1 -13 -1 2 -2 4 -7 -12 -8 -5 -5 -7 -3 -6 -13 -10 -2 -10 -16 -8 -8 -12 -13 3 -7 -4 -7 -4 -21 2 8 1 -3 -1
3105 -1 2 -4 11 -9 -9 6 5 -4 -10 4 -1 7 8 6 -4 -4 -12 3 1 3 12 2 -4 -6 -2 -7 10 -9 2 4 -1 -8 2 -2 -11 7 -10 -7 -3 2 -21 -18 -5 -10 -8 -5
3151 -5 -12 -21 -18 -8 1 -6 5 -13 -15 -9 7 0 -9 0 -10 -7 3 5 -5 -1 7 -9 1 16 4 1 21 1 -7 4 -7 2 2 6 3 -4 -3 -5 4 2 -8 0 -2 -1 -8
3196hJMJ2j9nK0j9LPj0qK5rjJ9k1rROmNPk0J4Mj9QKOlJ5k7L1j4k0L0j2j2L3jl0
3237a0J9Mj1MJ5k7RJ2j5nK9k1%Mj9KK1j0OOj2jnj1MJ6j3j3K3k1mK4j7MK3k6qL7
3275A3k5j8L2j0j5K8Ml6K7K6n5K2KqJK0KnKqQkoJ7nj9J0J7k9QK4l8J0J9j6j3M2
3312B6k8j6K1qqK1j3j8K6j8oJ8lj5J8qnJ3rLn%lK2rrONj7K9j0k6M5k3j0J4J0k2
3350a2J5J1l1J2K7k8J6Pj0qJ7j1j4K7j0JlLkKj8QOj8LK7j3qJ4j1j0J3kk2J5J0
3386Ck0Ojj7K5qmqRqK1j0qJ0Nj1J4OrjnJ1nNNnJJ%J0pJ3Jj9MJ3j4NJ7k0jONj6
3430aN%Mj2J4Lj8J2qjrJ9rj4J1%j9J0J7rnOj%NJ0j5Jk2K1%kOj0QJ0j2lkQlJ8q
3473Ej1J2qmJ1J6j8Rj4J%J2j7J2J5k8J4Mj3kN%LJnORk6QMj3JJ7m0K9Rk3%J4Mj7
$$ plain form
3196 -8 -7 -3 9 -10 -15 5 -14 -11 -4 -14 -22 3 -6 -7 12 -9 -18 -9 -3 -7 -2 5 -15 -1 3 -16 -8 -6 0 -3 12 -15 16 2 -18 12 0 -12 21 20 -10
3237 -10 9 13 2 6 21 -6 3 15 0 -5 24 3 3 7 -12 -10 11 1 7 13 1 0 -5 -16 -12 4 -9 -22 1 -20 -24 0 -17 -13 10 -16 -24 13
3275 13 -12 -30 2 -8 -23 5 9 -27 0 26 -29 -7 -5 -13 -12 8 10 5 7 -1 7 5 -1 16 11 -8 2 19 -10 -2 22 -16 -6 13 -3 -16 26
3312 26 -2 -18 3 -5 -13 8 -5 -23 3 -15 -21 -3 -6 -21 -3 -11 -16 -3 -12 -9 -14 -14 -17 5 -4 -13 -7 -2 -19 10 0 -26 19 -4 -14 0 10 -12
3350 -12 3 14 -17 -5 22 -6 10 17 7 -1 16 5 -9 18 8 9 6 9 7 9 -9 -1 5 -13 -10 17 4 -4 10 -1 -11 2 0 -22 -7 3
3386 3 -17 -11 -12 -29 -4 -12 -16 -24 -15 -23 -2 -12 -20 -10 -5 -16 -2 4 -5 -6 -11 0 -5 0 5 0 1 2 2 12 5 18 19 0 4 17 3 8 25 5 4 10 15 -1
3430 -1 4 4 8 -4 10 13 -5 7 -1 -2 -11 8 -1 -15 -4 -4 -23 -13 4 -5 -10 -4 -5 -5 0 10 -5 -4 -26 -5 -5 -7 -1 -11 -3 7 -5 -8 -10 -2 -5 13 5
3473 5 -6 6 -2 -6 5 21 3 12 -2 -1 -1 11 -6 6 21 -7 7 11 -2 -4 1 1 4 5 0 6 15 -11 -3 1 -12 -11 6 -34 -5 4 -19 -19 -5 -1 -18
3514a8K0rkkJ2j0kMrPJqJ8oj2K6k3KJ7nqJ6opPJ3j9J1Qk5J7Lk1J4QqNJ7k3j4K5
3555A4ppJ2j0k1K1ppJ8j8oJ1MmmJ1j0PnpK%j2K2Ql2QJ2j4J6Jj4LJ2j9NJ7j2J0
3594bMj3J3Jj9K0JnOnlpJ1QoLnJJ2j6j4L1Jk5J6j6kJ2j2lK7j6j8K0oj6K1J7l5
3633a9J2kj8K4klKnoJ1Jj8J8Ok4J8Lj2QJ7l0QJ8%j1kOmJ0nK%lJ0jrMLj5OJ7j7
3675bkJ8k9J5K1j7k1L0j3j1Mjj5J5MqkQmkJ3j5Nj0J4j1OKJMnjMKmoJ0qQOKjMj0
3719bjKRqjKQqPqP%%jKmKlp%NOpqJ4lj4lqRJ0jj6K3j6Lj2J0NKJJokMMj0Pj7K0
3769cMkkj2J3Rj3lROj2J3lqOjm%lJ4j3LRooJ2rnJ4n%%Lj4J0Pj4jj%Nj7QMJ1kk3
3816b2QjJ2mJpNJ0rj2J6Mj0%Rj3JJ5pkJ4pj8J8J1jn%j4Q%nRJmj0QLPjk2J5Lj5
$$ plain form
3514 -18 2 -7 -9 -11 1 -9 -11 -7 -16 -9 -8 -16 2 -4 -16 10 -13 -11 6 1 -7 9 3 -4 3 16 -3 8 16 -9 8 11 -10 4 12 4 9 26 3 -11 14
3555 14 7 0 12 2 -19 2 -5 -12 6 -12 -18 -7 -3 -7 -11 0 -10 -3 -8 -15 -13 -13 -25 -3 5 -27 -19 -7 -21 -5 -4 -18 -15 -3 -22 -17 0 -12 -2
3594 -2 2 -11 2 3 -16 4 5 0 6 1 -2 -9 2 10 4 7 2 3 15 -1 -15 16 17 -8 8 -8 -10 2 -10 -13 14 -2 -20 0 -6 -22 -1 16 -19
3633 -19 -7 -9 -27 -3 -5 -8 -6 -11 -17 -6 -5 -23 -5 1 -23 -5 -2 -14 -6 11 -19 -11 7 7 -4 -6 0 -4 6 1 3 3 0 10 9 0 4 7 -8 -2 15 -2
3675 -2 -4 14 -15 0 21 4 -17 13 0 -11 -7 -8 -23 -8 -4 -12 -14 -6 -10 -12 1 -14 -9 -19 -5 -16 -10 -8 -7 -3 -8 -9 -5 -3 -7 -13 -3 -11 -3 3 5 4 8 -2
3719 -2 -3 -1 8 0 -1 1 9 1 8 0 7 7 7 6 8 4 6 3 -4 -4 1 7 0 -8 6 3 -11 -14 -22 -13 -3 -4 -20 3 -13 -10 -22 -12 -7 -5 -4 -3 -9 -11 -7 -3 -13 -6 -23 -3
3769 -3 1 -1 -3 -15 -2 7 -6 -9 0 6 -6 7 4 -4 2 1 -3 -3 -6 8 -5 -2 7 1 -5 7 -2 -7 7 2 2 2 5 -9 1 8 -6 -7 -8 -8 -3 -20 -12 -8 3 1 -22
3816 -22 -14 -15 -3 -7 -6 -13 -8 2 -7 -19 -3 1 -9 -9 0 -13 -12 3 -4 -6 8 1 -17 1 12 11 6 6 -8 0 0 -5 4 5 1 -9 -1 2 9 8 -14 1 4 -11
3860a1J2Rj2PQk1%KKj0J2%j6K3pnNojJ1kj3Ln%J1kMKlrJ0%kJ0j4OQk4K3PpJOo
3905Fj2J3Lj5NjrK0J1j2j8J8rLQj7J6qnlNj7J1%jlOJnKj0QJ5rmjplQLj1K5j3N
3949aOn%Pj0oK1qj3J0J3j6J8pj1J5nj8J3Qj1LKJpRoj3J9Mj9ROjlj0J2rOnj2OL
3992eolKOonJ9oj0J2mnPrKRmlQKm%Oj8J4J1j4jJ4Kpj2MLJ0%njoJKMrK2j6rK1n
4040Hj2J5mj1NJ2j0J0nj3lOj4J1J9k0KNj9K2JmllqJ2LnoQj7QJ4%jj0J4j3J4j2
4080dNMj0J2QnrQjqJ2NplPjj2NpNoPj6J4k1K0Qj0kqj1J1KkQRj9pJ2m%%J3j8MR
4126cj7J8JJj2MMJ6j6Qj5QRj0PnJ1Nj9MJ5k1J7KnJJ3j2LLJj1P%k0J7Nk8J7J4l3
4167a6J3J4k3NJOooJ3j4OkLJ%Qk1J0J0j3jJ3J6m4K2Qj%Oj7nL1j7pK1Jk7K3j3J2
$$ plain form
3860 -11 1 10 -2 5 13 -8 -8 -6 -4 -14 -2 -2 -18 5 -2 -7 -2 -8 -9 2 0 -13 -10 -15 -15 -4 -6 -2 0 -3 -12 -2 -2 -4 6 -8 -2 6 -18 5 12 5 6 12 6
3905 6 -6 7 10 -5 0 -1 -10 10 21 9 -9 9 0 3 11 -6 10 2 -3 -6 -1 -18 -7 -7 -8 -11 -5 -4 -9 -7 -17 -9 6 -3 -7 -8 -15 -18 -10 -7 -18 7 -6 -1
3949 -1 5 0 0 7 -3 -9 12 4 -9 1 14 -2 16 9 -2 13 8 -10 3 11 0 3 5 6 -1 8 2 -11 8 12 -7 2 8 7 4 -6 6 -3 3 -2 -14 -8 -5
3992 -5 -11 -14 -12 -6 -12 -17 2 -4 -14 -2 -6 -11 -4 -13 -11 -2 -6 -9 -1 1 -3 -3 3 -15 -1 10 -4 -5 9 11 4 -8 -4 -1 9 9 4 3 -3 -2 0 4 -5 17 1 -8 13 8
4040 8 -4 11 7 -4 1 13 3 13 8 -5 -8 -2 -16 -5 14 -6 -4 1 -18 4 5 1 -2 -5 -13 -1 2 -3 -9 -1 -18 -10 4 4 3 -7 7 -6 8 -4
4080 -4 1 5 -5 7 15 10 1 9 8 0 12 17 10 7 14 13 1 6 -1 4 -2 5 -11 3 -18 2 10 0 -2 -10 -21 -10 -8 -10 -2 7 -12 -19 -7 -11 -11 -11 2 -16 -12 -3
4126 -3 -20 -2 -1 0 -12 -8 -4 12 -4 4 -11 -3 6 -4 3 -2 9 14 -5 -1 14 -7 10 12 7 8 21 9 12 15 16 5 12 12 -8 9 14 -14 3 17 -16
4167 -16 -3 11 -12 -7 -6 0 -6 -12 1 -13 -7 -9 -6 -5 -5 3 -18 -8 2 -11 -12 1 17 -27 -5 3 2 2 8 -9 -14 17 0 -7 14 15 -12 11 -2 10
4207A0jRj4MKj3J4KKjnoK%JknoRklRQk3ROmj2K4j6nK2j7mKQj7QKLRMk6Pj4K5J
4254Fj3PnqJ0K1l0J0K2k2j0K9oj5K3Kj9PK0k7pK1j1j1J7j6JJ3rkQLj5J8k0J4o
4291@j1Rj0nPQj1J1J9l4JNJj5J2J3j3OKj1J7jj3%J2%KkNj4PPpK%J1j0ONj5J3L
4333A2%j0K3j3j4J2Rk2PJ4k7J6OqmJ1oj9J0MpJOpkoOPnJjlNJ1j3mJ0j1LKomNN
4377fj0J5KkNlj2J3J2Kj4qJ5j1J0jnMJNj4J0Rj6JJ0pjLJ1k3KRk2J5Rj2pJ0noJ5
4419Ckj9LJ2rlJ2qnJJ7r%J6j8j5J4NqJ6qQj3K0plPj2oJ8J1j7J6j5J6qJMpQqjM
4462A1lkpLL%mJ0k5J2J0omlJ1k0J5rllJ2pnNooJ1J4j8lJ0Kj8J1PqOL%%LMoMNq
4508boJ6j1LNJrJ9mlkMpnMLqJJ2jj7J9nrJ1Kk3K4Lk5J0okkPoqJ5mMlq%kJ2j3O
$$ plain form
4207 10 9 18 4 8 10 -3 11 13 15 14 9 3 5 5 6 4 -1 -7 2 0 -3 6 14 -9 0 6 2 -10 14 -2 -7 15 -2 -6 -4 4 -13 -5 -3 0 9 13 -13 -6 -20 5 6
4254 6 -7 0 -5 -13 -3 18 -12 -2 20 -2 -12 17 11 -4 19 21 2 9 29 2 -5 16 5 -6 11 -5 -4 9 0 -2 6 9 -6 12 -8 6 0
4291 0 -11 -2 -12 -17 -10 -2 -13 -2 17 -17 -16 -11 -10 -25 -13 0 -13 -7 -5 -16 1 0 -13 -13 -1 -1 1 -1 4 -10 -3 4 -3 -1 -1 10 0 6 11 -4 9 12
4333 12 12 2 25 12 -2 10 19 -3 4 18 -9 7 13 5 1 12 6 -13 -3 1 -6 -5 1 -6 -8 -14 -8 -1 -6 -5 -6 -9 -4 7 -6 -10 0 -11 -8 -6 -12 -16 -11 -6
4377 -6 -16 -1 1 -1 4 1 -11 2 14 16 2 -6 9 -2 8 7 2 6 7 12 -2 8 17 1 2 12 5 4 7 18 -5 -3 6 -16 -1 8 -4 -11 -1 -6 -12 3
4419 3 1 -18 -15 -3 -12 -15 -3 -11 -16 -15 2 -7 -7 9 -9 -24 -10 -5 -13 3 -5 3 -10 10 3 0 7 -5 -11 7 18 1 17 2 18 10 11 15 8 16 8 7 11
4462 11 8 6 -1 2 5 5 1 11 -14 -2 8 2 -2 -5 6 -14 1 -8 -11 -14 -2 -9 -14 -9 -15 -21 -10 4 -14 -17 -7 -5 -23 -12 -5 -13 -7 -4 -4 -4 -1 3 -3 1 6 -2
4508 -2 -8 8 -3 0 5 6 -3 16 12 9 7 11 4 -1 3 6 -2 -1 11 10 -7 12 7 -2 9 11 -12 12 15 -10 0 -6 -8 -10 -3 -9 -17 -2 -6 -2 -5 -13 -13 -15 -3 -16 -10
4555a0mJ7j5JJ0Rj9J9nNj1Qj3OK2j6kjLj2%K3oRrKlKqmJJ1rJ0k0PjlPpqJ2%j7
4599a9K1nk2ROj8RJ0k%PKj3J0lj2J6Rk4%J2OkOjlrJ3QpMnnLJ0llJ2j0%%lmPPj1
4645CKK3k6pK4rkj1K1j0nLj4Rj3kJ4rMoPrKJ6k3OpJ8J2k5nJ1rPPQj7J5%rONj2
4688gJ9LmoJlnP%nQmpNMnRJMj4MqJ6k0nJ7ppQLj8jJ8j6RkqJ3Kj3O%ooJ1MPomJ
4738gMMJ0j5nJJ1j0J1kllR%lRm%Nj3J2KJNj4J1j2J4j4nNLjnK%qPoKnkQj0J6qp
4785a0KOroKJ2r%JRPrj3J4qNkJkJJ2LojMp%J1knNlJNk0NJ7m%lnnJ5Kk2L2k3Kj0
4834a0J2%lPqLKj0NrmQK%k0K0j5jMJ1%OpnQnOLmPOpNj1J1j0KNMJk%J3kokkPRj7
4884GQRj4mJ1j2PJrpMnqJ0J1j2oQoKj1nMKJ4j3JLoJ3j2J4pj5J3J0llNLj6OLOK
$$ plain form
4555 -10 -14 3 -12 -11 -1 8 -11 8 3 8 -3 5 -8 -2 20 4 2 1 4 -8 -8 15 9 18 9 11 8 10 2 -2 -1 10 1 11 -9 -2 -3 -6 1 -6 -14 -2 -2 -19
4599 -19 2 -3 -25 -16 -10 -28 -19 -9 -11 -11 -4 -2 -15 -5 -8 -20 -4 5 -19 -19 -7 -1 -3 3 2 -1 -10 3 11 4 8 3 -2 1 11 8 5 17 7 7 7 4 0 7 14 3
4645 3 5 28 2 -5 19 10 8 -3 18 8 3 6 -8 1 -12 -14 0 -9 -5 -11 -4 -13 -11 5 -18 -12 -19 -1 11 -14 -19 -8 -17 -10 -3 5 -12 3 3 -6 0 5 -7
4688 -7 12 15 11 5 6 3 -2 5 5 0 8 4 -3 2 6 1 10 11 15 1 5 -3 13 -7 -12 5 -2 -9 -1 2 -16 -17 1 -15 -6 -8 -16 -3 -1 -14 -8 -8 -14 -20 -9 -5 2 -4 -8 -7
4738 -7 -3 1 11 -4 -9 -8 3 -7 4 2 -1 -4 5 5 2 11 7 7 12 -1 11 13 14 19 5 16 4 18 4 -1 4 7 6 1 3 3 -5 2 -4 -2 -7 -9 -1 -11 5 -3 -10
4785 -10 -8 -2 -11 -17 -15 -3 -12 -12 -11 -2 5 -4 -17 -3 -11 -6 -8 -7 -9 -8 4 7 1 0 4 -3 -3 8 6 1 6 3 4 9 -11 -6 11 7 7 4 -1 -6 9 11 -11 21 -2 0 -10
4834 -10 2 2 -1 6 -2 1 3 -7 -2 -11 -15 -7 -5 -5 -25 -5 -20 -21 -17 -6 -6 0 -7 -12 -4 -9 -3 0 -4 3 9 2 7 -4 7 -3 -1 4 8 9 7 7 20 18 12 10 8 15 24 7
4884 7 15 24 10 6 17 5 12 13 4 -3 1 -4 -12 -2 9 -3 -9 -1 -7 -5 -16 -21 -17 -15 -1 -14 -13 -10 -16 -3 -15 -1 -8 -23 -10 0 -3 -6 -1 2 -14 -8 -5 1 3
4929CojJ0j1JJ4%%KkrJ1loJ3jj2J0%JlLplNrkJ4j4MmlQQj7kJ0j0OJ0polJ9k3M
4975hJJMOj1mJ7k2JJ2Jj1J7oj0J1J2lRj7J7jjj2JLnJ4j3jLmJ0J1j6PKk4J4NpJ4
5017A7ppKoPj3PPj5J1j1NJ4k6LnK2j7MKOmOJjKj2mJ4okPL%J1lmjkNj1Mj2K2Lr
5063GL%mPj5J2Nj3MLnlJ2j3OJ2j4j0JRkMpqmRjMjj3J3KOj4J0j8kQQj3JJ5pJjM
5109boj1K6Mj1Lj3J1jJ1nlNmMkPMpLlJ0j1Mj5J3LOrJk3J2PkmPk3K5Kk7jJ5mj1
5153a5J9qlj4J0MJnRj0jJ0lKJOknP%jJ2rmPPMpjRnnnoJ1J0%Rj8Oj0JLpQjj4J7
5201A4j5Kkj7NQqJ7j8RqJLNkkRk1MK1j3%LnMqMOPlkLlLRj1J5kj5JPLnJ4j6%KJ
5249DJJ3jooNoPkrJ6rqQjj9QJ0qj1J8j4mRRk2J7mQonLKj0MQnj4J2KMQqoJ1LpR
$$ plain form
4929 3 -3 -4 6 -5 -4 10 10 10 12 10 1 12 9 3 16 15 3 13 13 14 11 14 7 4 9 0 -2 12 -2 2 -2 -5 3 11 -6 -8 2 -8 -2 8 1 -5 -8 11 -12 -8
4975 -8 -7 -6 -2 4 -7 -11 6 -16 -15 -3 -2 -13 4 -2 -12 -1 11 8 17 0 17 16 15 3 4 7 2 16 3 2 5 1 11 22 6 13 15 -9 5 10 3 17
5017 17 10 3 5 -1 6 -7 0 7 -8 3 -8 -3 11 -15 -12 -17 5 -12 -8 -6 0 -4 2 3 2 4 -8 -12 2 -4 -6 1 4 4 15 12 8 7 5 10 -1 3 -9 13 16 7
5063 7 10 10 6 13 -2 10 15 2 6 9 4 1 13 0 6 18 4 -6 -5 4 2 6 -1 -9 -13 -4 -5 -1 -2 -15 -2 0 6 -8 2 -16 -18 -10 -2 -15 -14 1 -6 -5 -6 -2
5109 -2 -8 -19 7 11 0 3 -10 1 0 11 6 3 8 4 8 6 13 17 10 13 10 20 9 13 -2 11 14 20 11 12 -11 1 8 6 2 9 -14 11 13 -14 -15 0 -4 -15
5153 -15 4 -4 -7 -21 -11 -7 -6 -11 -2 -12 -13 -3 -6 -4 -3 3 1 -4 3 3 2 14 5 1 8 15 19 12 11 20 15 10 5 -1 10 20 20 29 11 17 7 8 11 4 12 11 -3 14
5201 14 -1 1 -1 -18 -13 -5 -13 4 -14 -5 -13 -12 -9 -4 -6 -8 1 -20 -16 5 -8 -8 -5 -10 -6 -14 -10 -4 3 0 -2 1 -2 1 10 -1 14 12 -3 -2 5 8 3 17 1 1 3 4
5249 4 5 18 17 11 5 10 4 11 9 0 16 7 -1 7 6 -13 -5 5 -3 -14 4 -10 -14 -5 4 -18 -1 -5 3 -3 -8 -5 -3 -13 -9 -1 -6 -20 -8 -6 -2 6 -2 -8 3 6 -1 8
5297HLj6J8mrMJ3k0NK0j1p%%RLrj3J2LPk1J1rJllJ0rJJ0k1J4jj2RJ5qmmj1JJ1
5340glNrJ3kj0J0KmLpJ3Mj2OKj0J3kj0NJ0j2QLqJ4mpmkJ4j3J3j9K0Lj4ooRJ0r
5383@Pj4MkJKrNkmjQlJrJ0%oKoKPJJ2j3NlJ4nj7J5mmJ1pJ%J0rLPJ0j9J5JqkLP
5432A7j2jpJ3J4qj6kM%krOJ2oj3POk%jJlqjjJ0j0%lOlPrnPKKMnkKJLKjPJ2j7J1
5482Imj0J5pkLNmMJoMpNLLj5NPrm%j2J3Lj1J1jlj9PPjMnprJ2rJ6KJpJ1noJ2pL
5531dlqRjLQMmrPNnOj0J5mj8K3k0JMRnQJkloNpkjLJ2k3J5qmJmQjj5K0pjj1J1N
5580crLpJ2j1OljmRJ0nqNQqoJ6lPJj0j0J1Oj0J0Kj4OJ6j4J2nJj1MlJ0jor%PlR
5626Gq%Rj3RJj2QJqMoLoOnoQ%oRpJRmKLnoPjLmJ1NLoKPoQpJjOj3NnP%qLJqRj1
$$ plain form
5297 8 11 -5 13 9 0 4 17 -3 2 22 11 4 4 4 13 16 7 -6 6 9 16 -5 6 -3 -2 -5 -8 2 -7 -6 4 -17 -3 -4 -16 -7 8 0 -4 -8 -19 -18 -7
5340 -7 -10 -5 -14 -1 -3 -13 -3 -1 -5 -2 -9 4 8 -4 2 4 -6 7 5 -5 0 10 -2 6 9 1 15 11 4 0 -2 12 -1 12 -7 13 16 2 -4 -10 -1 9 0
5383 0 7 -7 -3 -5 -4 -2 -11 -6 -8 -12 -13 -5 -8 -7 -16 -6 -6 -12 -10 -16 -14 -7 -6 6 -7 -2 -5 9 4 -13 2 -2 -6 5 -2 -1 -1 9 0 3 10 20 1 16 17 9 7 10 17
5432 17 5 4 -3 10 24 16 0 -2 2 2 0 -9 -3 9 3 -10 -3 3 1 1 0 1 -2 -10 -11 -12 -2 -12 -12 -15 -9 -12 -5 -14 -19 -12 -10 -8 -4 -9 -11 -9 -8 -5 -3 -4 3 15 -2 9
5482 9 5 -5 10 3 1 4 9 5 9 10 4 8 1 6 9 12 -3 2 9 0 -4 -4 -16 -3 0 -11 0 -1 -4 -23 -16 -9 -10 -6 -11 -18 -27 -15 -24 -8 -6 -5 -12 -1 -6 -12 0 -7 -4
5531 -4 -7 -15 -6 -7 -4 4 8 4 -5 2 7 2 8 -2 13 9 -9 14 -6 -5 -1 8 3 11 12 10 7 1 6 -1 -3 -4 -1 11 -12 3 -5 -9 -8 -12 -4 -5 -20 0 -7 -8 -19 -8 -3
5580 -3 -12 -9 -16 -4 -15 -9 -12 -13 -17 -8 2 -3 -11 -6 2 -6 -12 4 1 8 9 -1 -11 0 6 -4 6 8 -6 0 16 2 14 9 10 -1 3 0 10 9 3 -6 -6 1 -2 7
5626 7 -1 -1 8 -5 4 5 -7 1 2 -6 -2 -8 -5 -11 -5 -10 -16 -8 -8 -14 -5 -12 -11 -2 -6 -4 -1 -6 -12 -5 -6 -3 -7 4 9 12 6 8 15 9 17 10 11 10 16 3 8 3 10 10 2 5 6 -2 7 -4
5682dJ1nmOpJ5k0J9j5QlkJ0qqNj2J6j6Qj3J3j9K2lpj%NMkjjRoKjrJ0lJ0qKRqJ0
5728HNnkPj5JJ2lMrJ2j8Q%mL%%mJjJjqJ1j4Nkj0j1K7mnnKKOnmJ7j5JQnJ3prPj0
5777a5K2j4NPJNjqJOp%RkMLk0MOKNprlJ2mKMloJ1j0MkKq%lORj4J0k2J3j3ORoo
5826a5oLRJ0Jj0nK0rjPj3J9j3J0%j5J1QoK%RpjlLPq%%j4K1jj7RqJ5k0J5j0nJ5
5869GKkrjpMoNJ1k5K1o%rJ0LljopKJ9k4%J0pNJ4qjj2PNNKJ1j2JOmOJpJ4Oqj2J1
5917A1j0J4Nj5mJ1jonOJj0J0j7QRkkj1J2j2qJ7klj3J6oj2J4pQj1PPj2PPnjMj0
5959a1ROoMJ2pj5K1klJkjK%KPj7kPkN%jMLj8K0k1OKj1jJ1ljLlj0LR%j3KojRlM
6008hqmJ1RnlpJ1Ln%nJ0j4MJ5nnRoJ0nOKPjqLj2J5j3J1Lj1%J0k1K3Lj4qjJ5j1
$$ plain form
5682 -4 7 2 -2 4 -3 12 -8 11 -4 4 1 -1 9 1 -7 -2 -14 2 -14 -6 -19 -6 -25 -3 -6 -13 -14 -14 -9 -5 -7 -8 -9 0 -6 -4 -5 -14 -4 -7 3 -5 -3 6 -2 8
5728 8 13 8 6 13 -2 -1 11 8 12 3 15 -3 5 5 1 4 4 4 0 1 0 1 0 -8 3 -11 -6 -8 -18 -29 -2 -6 -11 -16 -14 -12 -6 -11 -15 2 -13 -12 -4 -9 4 -3 -12 -5 -15
5777 -15 7 -7 -2 5 6 11 10 2 3 9 2 2 11 9 13 16 -4 0 6 8 13 6 -3 -6 6 2 4 8 5 -1 10 0 4 2 4 -4 -4 -7 -1 8 -6 4 -18 -5 -18 -12 -3 -9 -15
5826 -15 -21 -18 -9 1 2 -8 -13 7 -2 -3 4 -9 10 -3 7 7 -8 3 11 5 7 7 16 9 8 5 8 15 7 7 7 -7 14 13 -4 5 -3 12 -8 7 -3 -8 7
5869 7 9 7 -2 -3 -10 -6 -12 -7 4 -21 0 -6 -6 -15 -5 -2 -5 -6 -12 -19 -17 2 -22 -22 -12 -19 -14 0 -8 -9 -21 -14 -9 -4 -2 9 -3 -2 4 0 6 7 0 14 20 12 0 11
5917 11 1 15 20 5 1 12 11 5 0 6 7 -3 7 -10 -2 7 5 3 -8 4 -8 -16 1 -1 -4 -17 -1 -7 -19 -5 -12 -4 -15 -8 -1 -13 -6 1 -4 -5 -1 -11
5959 -11 -2 4 -2 2 14 7 -8 13 11 8 9 7 6 8 8 10 17 0 -2 5 3 8 8 7 11 14 -4 16 -5 1 3 -8 -9 2 -1 -2 1 -2 -12 -9 0 0 -13 -11 -17 -18 -9 -12 -8
6008 -8 -16 -20 -9 0 -5 -8 -15 -4 -1 -6 -6 -11 -1 -15 -11 4 -1 -6 3 -3 7 2 8 10 17 16 8 11 -1 14 1 12 15 4 4 14 -7 16 19 5 -3 -4 11 0
6052@lJj2J8nnkjpKOmj0K0j9KJ0qPj5J3J1j0jmJ5j4J0jrRKj0LJ4mJ0j5J9jJll
6095GnRkokLJ0j3MKlNPk0k%LnNKojRlj2QnkLn%K%mJ3j0jRjpJ2rpJ1OLmrRlnkM
6148hJ3j6J0MJ9j9klKKlQMlrQrLJ0Lmj3J2pNLj6jLqLjlQj3JpJ6pMJ6rj5J6kol
6195a4JJoJ3onJ1MLpnRnkJ2J%pJ0j3PkQonK1qRrLj6J4j1nJ1qLMKj0jNjnKnjPj0
6244a2J0pJ3k2NJJNJ0rplKJ0nNj2J3j2PoJ5jJ0j6mJ2K%%RjkrJ4pnjPrJ3r%J6q
6289A3mOk1J0LPj3j2RLj2J0j7rK1oLOKj0j0PKPkj1QrJ2JoKJ1qKORj3MkLknQjM
6335Fm%%L%lLLjPnq%%%QlOj2LKKqpKQpPj3%mPjpQqNjOr%J1o%jKPmMk%j1J9lrk
6391a0J3jJ1j5J0j5J1jrJ0MoJJ2nKj1KNLqjNqPlKj1J1j3Rj0j0J1j6RJ3lpmJ0m
$$ plain form
6052 0 -3 -2 -14 4 -1 -6 -8 -9 -16 -14 -8 -12 -22 -2 -21 -19 -9 -17 -10 -25 -12 -1 -11 -12 -16 -1 -15 -5 -6 -15 -6 -4 -14 -11 3 -1 9 -6 13 12 13 10 7
6095 7 2 11 9 3 1 4 14 1 5 7 4 9 16 -4 -6 -6 -3 -8 -3 -1 -7 -8 1 -2 -14 -6 -11 -13 -10 -15 -15 -13 -13 -17 -4 -14 -15 -6 -7 -14 -2 -11 -18 -7 -1 2 -2 -11 -2 -5 -10 -12 -8
6148 -8 5 -11 -1 3 22 3 1 -2 0 2 -1 7 11 8 -1 7 -2 1 11 14 10 -3 9 2 7 10 -6 -7 -4 -12 -9 -10 -13 -5 -18 -17 -24 -8 -15 -11 5 -4 -19 -3 -5 -11 -14
6195 -14 -13 -12 -18 -5 -11 -16 -5 -1 2 -5 -10 -1 -6 -8 4 5 5 -2 8 -5 2 0 8 2 -3 18 10 19 10 13 -3 11 0 -5 6 -2 1 5 7 -3 -4 1 0 -5 -3 -8 -9 -2 -12
6244 -12 -2 -9 4 -18 -13 -12 -11 -6 4 -5 -12 -15 -13 -3 -8 -3 -15 -2 -14 -7 -13 2 1 11 -5 -9 3 5 5 5 14 13 11 2 16 9 4 3 10 1 14 5 5 21 13
6289 13 9 15 -6 4 7 14 1 -11 -2 1 -11 -1 -18 -27 -6 -12 -9 -3 -1 -11 -21 -14 -12 -5 -7 -18 -10 -19 -7 -6 -12 -10 1 -7 -5 1 10 -3 1 -1 2 0 -5 3 2 6
6335 6 2 2 2 5 5 2 5 8 7 14 9 1 1 1 1 9 6 12 0 3 5 7 -1 -8 -6 2 -5 2 -11 -11 -15 -8 -9 -16 -8 -16 -11 -12 -6 -15 -15 -4 -10 -10 -11 -9 -2 -6 -2 -4 -4 -15 4 1 -8 -10
6391 -10 3 2 13 -2 8 -7 4 3 -6 4 8 2 3 15 10 12 1 3 8 11 3 2 7 -1 6 3 5 -6 5 -8 1 -9 -19 -8 -24 -15 -2 -5 -12 -16 -6 -10
6433a0j0K1j8mQNOnJlkoJ2Jj2QPJ7%j6kpQjLJ5qkJkNj5RLlJnOrROj7jNNJrJ0k
6482Dm%%lnNkqNkLnkOmRnj1K6j4%NLj4K0j4KRqP%oJ0lJoM%lOJ3j3j0K3pnkRj1
6531CJ4j5mKjJ3qqQjnNnnJ1pMLj4MNj1nJ6j5QoPrJ3jj3J0J%nK2j5OlMoRrQOqR
6579A2qJ2j3j6J7KlJoNJ4j9KNLj5nkJ8lj5J0J0pnJ6j1j0J0JlMj0Pjj0OmJ1j1o
6620a7J2qNMmJ0rrJ9pJMjJ%Nj5J2%PkljoJ3j7J5mmPrJ2Mj1jKJ1j5KjoJMqNQj5
6667iMRj4Qj0QlNlnQj3QKLj2J7qj5J3jLRj4J0jj5PJ3Jj1J5Jj0KjMJ0k0J2%JOj
6711A3j3%K0j4J2j1kmOkj5Q%lPoj2J7qLOj7J3kk%mnLNlJlJ5pJMjj4RK2k0J1rL
6756BJ0k2NJ5jMrROkpnmQj0J0rOMLpJ0ooj1KNqMNlPj2NKj8K0j0p%NJ0jKj3jJR
$$ plain form
6433 -10 -20 1 -17 -21 -13 -8 -2 -7 -6 -9 -11 -17 -5 -4 -16 -8 -1 16 16 0 -2 -9 -1 -2 1 16 8 6 7 5 10 -5 4 7 4 5 0 6 -3 6 12 -5 -6 -1 4 5 -4 6 4
6482 4 0 0 0 -3 -8 -3 -5 -13 -8 -10 -7 -12 -14 -8 -12 -3 -8 -19 7 -7 -7 -2 1 -13 7 -7 -5 4 -4 3 3 -3 7 4 5 -1 3 3 0 6 19 6 -4 19 12 7 5 14 3
6531 3 17 2 -2 0 -1 12 4 -4 4 3 -2 3 -2 -7 4 -3 1 4 -10 -6 -1 -12 -17 -1 -16 -8 -14 -7 -16 -3 -4 -17 -7 -6 -6 -11 11 -4 2 -1 3 -3 6 -3 5 11 3 12
6579 12 4 16 3 -13 4 6 3 4 -2 3 17 -2 0 5 8 -7 -12 -14 4 1 -14 -4 6 -1 -6 10 -1 -11 -1 0 -3 1 -9 -2 -3 -13 -7 -11 0 -11 -17
6620 -17 -5 -13 -8 -4 -8 2 -7 -16 3 -4 -3 1 0 1 1 6 -9 3 3 10 8 5 4 -2 11 -6 9 5 1 8 -1 11 15 4 3 5 16 1 3 2 -4 -3 1 -7 -2 6 -9
6667 -9 -5 4 -10 -2 -12 -4 -7 -2 -5 -10 -2 -15 -7 -5 -2 -14 3 -5 -20 -7 -8 -5 4 -10 0 -1 -16 -9 4 5 -6 9 10 0 2 1 5 15 -5 7 7 8 14 13
6711 13 0 0 20 6 18 7 5 1 7 5 -10 -2 -2 -5 2 -4 -16 1 -7 -4 2 -15 -2 -4 -6 -6 -10 -15 -12 -7 -10 -9 -12 3 -4 -3 1 0 -14 -5 17 -3 8 -1 2
6756 2 12 -10 -5 10 9 13 4 13 19 17 10 5 1 9 -1 9 0 6 10 13 6 16 10 4 -7 -5 0 -8 -4 1 -2 5 -7 -2 0 -18 2 -8 -15 -15 -10 0 -1 1 -12 -13 -12 -3
6804cnj5PP%JKRpJ2j0jJNKlJ5j4MPqKjmkJ2oLpRkooQrKOlLpLlKj1J1jKKrRk0J1
6856fOj7LQkj5K2rJ4rj5J4mKNPnmJMLrNNj4J8JRj8%J1j1KPqKMMooMJ3nnj1lJ4
6903Fmk%m%%JnPrjnnMJ8j3lLJ1oo%RppJ9j4J5j2QnNJ4j2nOOpkJ5j8QMJjJjJoJ2
6953A4Jjj1Nj7J5%j1J1%j6OJ3j4RoKrL%KLMj1J2j0mNJ0qj5J7rJ0Nk2PJ4pqkR%
6996dLJ0j4%OoJ6j0mPnKJ3lj0RmLj0JQJ3qj5MMlmJ3j1qKJ4jjj4R%jJoj3PLJ2j3
7042hMj4NOoM%RKj5J3lJ6j3j5J1RKkkJ6mpOnkmRj0OrjJ0PljMj8J2nKj1J1oJKr
7089fMoJ3rnjkLjmRljqJ9Kj8KMrkJ3mNKLnKLJKQpKJJ0j1jNj1J5Jj%%pKpJ2j2p
7140eOJj0J1oJj%MlqJ7j2oR%lkj1K2rpO%jlOnqJ2MJJj0jQNrJ5j4jMJ2qJ6r%Mq
$$ plain form
6804 -3 -8 -23 -16 -9 -9 -8 -6 3 -4 8 -2 -3 -2 3 5 2 17 3 7 14 6 8 7 3 1 13 7 10 3 12 10 4 -2 6 -3 -1 5 2 5 -2 1 -2 0 -11 0 -1 1 3 -6 3 -17 -6
6856 -6 0 -17 -14 -6 -8 -23 -1 -10 4 -5 -20 -6 -10 -8 -3 4 -1 -5 -4 0 3 -6 -1 4 -10 8 9 18 0 0 11 0 2 9 1 3 7 11 5 -1 3 16 11 6 -5 -8 6
6903 6 2 0 0 -4 -4 -4 -3 -8 -1 -10 -11 -16 -21 -17 1 -12 -15 -12 -1 -7 -13 -13 -4 -11 -18 1 -13 2 -10 -2 -7 -2 12 0 -5 1 7 0 -2 13 -5 3 7 8 7 8 7 8 2 14
6953 14 15 14 3 8 -9 6 6 -5 6 6 -10 -4 9 -5 4 -2 0 -9 -6 -6 -4 -1 3 -8 4 -6 -10 -5 5 -3 -18 -1 -10 0 5 -17 -10 4 -3 -11 -13 -4 -4
6996 -4 -1 9 -5 -5 1 -5 11 1 -3 4 -1 1 14 11 1 10 6 9 -1 0 8 21 13 -2 2 6 3 -1 12 1 -7 -5 9 8 7 -7 2 2 1 2 -4 -17 -10 -7 5 -8
7042 -8 -4 -18 -13 -7 -13 -9 -9 0 2 -13 0 -3 13 0 -15 -4 5 7 5 3 19 15 8 14 9 7 3 12 2 8 -1 -2 8 15 12 11 15 -3 9 4 6 -5 6 0 1 3 -6
7089 -6 -2 -8 5 -4 -9 -10 -12 -9 -10 -14 -5 -8 -9 -17 2 4 -14 -12 -8 -17 -19 -6 -10 -5 -3 0 -5 -3 0 1 3 11 4 6 7 17 6 5 10 -1 14 15 14 14 14 7 9 2 14 2 -5
7140 -5 1 2 -8 3 -3 -2 -3 -3 1 -2 -10 7 -5 -11 -2 -2 -5 -7 -18 4 -5 -12 -6 -6 -7 -10 -4 -9 -17 -5 -1 0 1 -9 -10 -2 3 -6 9 -5 -6 -2 10 2 18 9 9 13 5
7189EJ6j0kkLJMnLJ5k5RMomjllk%J1oQk6K3%j7%OplLOnJ8j5PqMjOj2PkRj1ppJ7
7238eOjQqQnpRqJ2k%jLRj0oQK%jrJ5Jj9KJ0l%qkmQlpJ1jq%loJ2krnJ1%KJqJjm
7291a7J0j0J5mj%Oj2J7j7J1K%pMjOoJ2jjLpQoJ0%loQnJ1k2mJ2%KrLK0k8jJ7j3
7335dj%l%NnoKP%j4J7rnJ5j3MmROpLjj3K8j6J1qJ1mmN%Kj1K0kJrPj3QjMjrPlm
7384BJ5j1kJ2qj2JkJPp%j2Lj6J2N%LnoPPmk%LqR%lN%nNMJ0pj5J3OrJmMMrJ6On
7434IkQrkQoKlkKrJ3kj4L3k5lJ2j0LOqqQnpLn%J4j2KKjoPj6QJlJ1pMj0J6j1Q%
7482fmnK2JJpjoNOKJJ1mnqj2J0Qkj5K3rMqRj0KLOJj1nLrKJ2nj0QopJ3mmjJPlK
7532dKnlJoQlKLnKJ2j3RLjPJnPpKNLj2J6j5LKkRj7NJ%Qqj2J9j6J8qj0jJOKj2N
$$ plain form
7189 5 21 11 9 7 10 11 15 10 13 28 3 12 16 10 6 5 2 -1 -3 -3 8 2 10 -16 7 7 -10 -10 -4 -11 -14 -11 -5 -10 8 -7 0 -8 -4 -5 1 -11 -4 -6 3 -8 -15 -22 -5
7238 -5 1 0 8 0 8 3 -4 5 -3 9 7 7 6 9 18 8 2 10 12 12 11 2 17 18 -1 1 11 8 8 0 -2 -6 2 -1 -8 3 2 -6 -6 -9 -15 -3 -5 -14 -19 -8 -8 -6 -5 -13 -12 -13 -17
7291 -17 -7 -17 -2 -6 -7 -7 -1 -13 4 -13 -2 0 0 -7 -3 -4 2 -4 8 7 6 9 2 10 4 14 14 11 5 13 8 19 -3 -7 5 5 7 -2 1 21 -7 -8 9 -4
7335 -4 -5 -5 -8 -8 -3 -8 -14 -12 -5 -5 -19 -2 -11 -16 -1 -14 -10 -14 -5 1 -6 -3 -4 -17 11 -5 6 -2 9 5 1 6 6 8 -3 17 15 16 7 14 1 9 8 12 11 2 9 6 2
7384 2 17 6 4 16 8 -4 -3 -5 -4 3 -4 -4 -16 -13 -29 -17 -12 -12 -9 -14 -20 -13 -6 -10 -12 -12 -9 -17 -8 -8 -11 -6 -6 -11 -6 -2 8 1 -14 -1 5 -4 -3 -7 -3 1 -8 8 14 9
7434 9 7 15 6 4 12 6 8 5 3 5 -4 9 7 -7 26 1 -2 10 0 3 9 1 -7 1 -4 -11 -8 -13 -13 1 -11 -9 -7 -8 -14 -7 -23 -15 -14 -17 -6 -13 -9 -19 -3 -14 -6 -6
7482 -6 -10 -15 7 8 9 2 1 -5 0 6 8 9 20 16 11 3 -9 1 9 7 -8 15 6 10 2 11 1 3 6 12 13 2 -3 0 -9 -7 5 0 -10 -2 -8 -15 -2 -6 -10 -11 -10 -3 -6 -4
7532 -4 -2 -7 -10 -9 -15 -7 -10 -8 -5 -10 -8 4 -9 0 3 2 9 10 5 12 5 7 12 15 3 19 4 7 9 7 16 -1 4 5 5 13 5 -7 12 -4 14 6 -4 -5 -4 2 4 -8 -3
7581cOj0jQj0%pJ2J1j6Ljj3K3lrNoKKlKjJNN%jnNMplMJ4rJ0Nj2OQqrJ4j2oLMk
7630ELKoJ2k4J1rjqJ2kjnLjPJj0J6j4LjKjKlLqJ5noOj2RQLnkqJ7Lj0PkJ0Mj2m
7678DqPNjKkQj2J0j1JkJ2j2JmJ2ppJ7j5Oj2KMnRj0KKQj3njOjnNJ3j0lJ8j9Mj3
7723b0K6j4%nK3mp%MOmqJ4Pj2Mj0MLKPj2RlMj1%J1j1lmJ7k1K2rLj1Mkj1J5rop
7767a9RM%mRrpMJ0lLljj%j4J1MJQj0Pj0J1M%%lqLJ0NrKJ0LrJrJ1j2J1OrJ1j9O
7814EjmlPlKkKmkNMrj1KOqJMQqjk%Rlmj%PjJ1pJLoJMMjMJMmKoL%KKrK3j4K%pJ
7871I%JpJ6j8KKQj2kPp%MjpLKNnj5PMpJ6j6mKJ0qlRMjpoJ4Qj6QJnKJ8jNmj5%O
7921FQj2OJ3j7kNojjlJ4RlqJoRqkolmOOj2J8j3jQj2KpNlMPJ0j0k%MkloJ4rMJ3
$$ plain form
7581 -3 3 -7 -8 0 -10 -10 -17 -5 6 -10 -7 -8 -21 2 -1 -10 -5 -11 -9 -7 -10 -8 -9 -8 -3 2 2 1 -4 1 5 -2 -5 -1 13 4 14 19 7 13 21 13 4 18 6 0 3 7 5
7630 5 8 10 4 16 -8 3 -6 -7 -15 -3 -5 -6 -11 -8 -9 -2 -1 -11 5 -9 -6 -7 -5 -6 -4 -7 -4 -12 3 -2 -8 -2 -14 -5 3 6 1 -1 -9 8 11 1 8 6 16 20 8 4
7678 4 -4 3 8 7 9 7 15 3 13 2 3 1 13 1 2 -2 10 3 -4 13 -2 4 -8 -6 -2 -7 2 -8 -6 -4 4 -9 -14 -15 -9 -10 -15 -10 3 -7 -10 8 -11 -7 -20
7723 -20 6 -8 -8 -13 10 6 -1 -1 3 9 5 -3 11 18 6 10 0 4 7 9 16 4 13 10 14 3 3 14 3 0 -4 13 -8 14 5 8 -3 1 -1 -12 3 -6 -12 -19
7767 -19 -10 -6 -6 -10 -1 -10 -17 -13 -3 -6 -3 -6 -7 -8 -8 -22 -11 -7 -6 2 -8 -1 -11 0 4 4 4 1 -7 -4 6 11 2 4 14 17 8 9 0 11 -1 10 16 7 18 -1 5
7814 5 4 0 -3 4 1 3 1 3 -1 -3 2 6 -3 -14 -12 -6 -14 -13 -9 -1 -9 -10 -12 -12 -3 -6 -10 -11 -11 -4 -5 6 -1 0 3 -3 -2 2 6 5 9 10 14 10 12 6 9 9 11 13 4 27 13 15 15 8 9
7871 9 9 10 3 19 1 3 5 13 1 -1 6 -1 -1 3 2 -5 -2 0 5 0 -15 -8 -4 -11 5 -11 -15 -13 -3 -11 -14 -5 -1 -2 -9 -15 -1 7 -9 -1 0 -5 -3 15 14 19 15 0 0 6
7921 6 14 2 8 21 4 2 7 1 0 -1 -4 10 19 16 8 9 3 12 4 2 -4 -7 -11 -5 1 -11 7 -6 -7 1 -11 -9 -16 -11 -14 -10 -3 7 -3 -5 -5 -1 -3 -6 -12 2 -7 -3 10
7970A0k2J3Pj8J8qQj2J7opk%NQKKJj3J2rJnkJ1j0QmmNkKoj3QmRjj0RKjoOpnKL
8018hqOJ0k5RQLomJ8lnNoJ7mOmPj3OOnqRjqJ0nJ1JJj3Rj8J1mMNpk%LqPkj4J4o
8067a%ljnJM%Jn%NojjLpJ6jlJ2j3JlNkJ0j0J0jlloPJ4jrlJ0joMrPpOQj2J4k0k
8117gJ0kPoj0MJ4qoMoPm%Lj4jkJ1JJ5j2MkpPljJQnLj1J1Nj5PKLmJj5J7KJMmJ0
8165A7j4J0nKJqRoMNj1NnlOKj9OkJ2r%oOml
$$ plain form
7970 10 -12 1 8 -10 8 0 8 -4 13 7 0 -2 -2 3 11 13 15 16 3 15 6 7 2 0 11 1 9 5 1 6 4 6 0 -13 -5 -9 0 -1 -11 -2 0 -1 -7 -1 -8 -13 -11 -8
8018 -8 -16 -10 0 -25 -16 -8 -5 -11 -15 3 0 -5 0 -6 11 7 13 9 16 3 9 15 10 2 11 10 2 12 7 18 19 20 7 16 -2 9 5 9 14 7 5 5 8 0 7 5 -9 5 -1
8067 -1 -1 -4 -5 -10 -9 -5 -5 -4 -9 -9 -4 -10 -11 -12 -9 -16 0 -1 -4 8 -5 -4 -7 -2 -4 6 -4 6 5 2 -1 -7 0 14 13 4 1 11 10 4 8 -1 6 -1 5 13 1 15 -5 -7
8117 -7 3 1 8 2 -8 -4 10 2 -4 0 -6 1 -3 -3 0 -14 -15 -17 -6 -5 10 -2 2 0 -7 0 -3 -4 -3 5 0 3 -8 3 8 -7 0 2 5 1 2 -13 4 6 7 11 7 17
8165 17 3 13 8 10 11 3 12 6 10 15 4 9 4 1 7 9 -10 -4 -6 6 -3 -3 -9 -3 -7 -10
8191a0
##END NTUPLES=NMR FID
##END=
