##TITLE=1H_LY-823.24
 CCl4, 8 sc, 
 28.5.2019
##JCAMPDX= 6.0         $$ Bruker NMR JCAMP-DX V2.0
##DATA TYPE= NMR FID
##DATA CLASS= NTUPLES
##ORIGIN= UXNMR, Bruker Analytische Messtechnik GmbH
##OWNER= root
$$ XWIN-NMR		Version 3.5
$$ Wed May 29 13:57:24 2019 Russian Standard Time (UT+4h)  she@DPX200
##.OBSERVE FREQUENCY= 200.13155
##.OBSERVE NUCLEUS= ^1H
##.DELAY= (6, 6)
##.ACQUISITION MODE= SIMULTANEOUS
##.ACQUISITION SCHEME= undefined
##.AVERAGES= 8
##.DIGITISER RES= 18
##SPECTROMETER/DATA SYSTEM= spect
##.PULSE SEQUENCE= zg30
##.SOLVENT NAME= CDCl3
##.SHIFT REFERENCE= (INTERNAL, CDCl3, 0, 15.7039)
##AUDIT TRAIL= $$ (NUMBER, WHEN, WHO, WHERE, WHAT)
$$ ##TITLE= Audit trail, XWIN-NMR		Version 3.5
$$ ##JCAMPDX= 5.01
$$ ##ORIGIN= Bruker BioSpin GmbH
$$ ##OWNER= she
$$ F:/spectra/data/she/nmr/H-F/1/audita.txt
$$ ##AUDIT TRAIL=  $$ (NUMBER, WHEN, WHO, WHERE, WHAT)
(   1,<2019-05-29 13:56:20.56 +0400>,<she>,<DPX200>,
      <created by zg, POWCHK disabled, PULCHK disabled
       configuration hash MD5:
       00 E9 B6 7A A2 85 ED C7 34 08 36 98 17 FE 4E 26
       data hash MD5: 16K
       6F 63 F0 AD 0C 86 42 F9 F2 11 E3 7D 11 93 2A E0>)
$$ ##END=
$$ 
$$ hash MD5
$$ 9B 8A DE 94 47 2C FD 17 08 19 34 13 97 0D 35 34
##$RELAX= 
##$RELAX= 
##$RELAX= 
##$RELAX= 
##$RELAX= 
##$RELAX= 
$$ Bruker specific parameters
$$ --------------------------
##$DU= <F:/spectra>
##$EXPNO= 1
##$NAME= <H-F>
##$PROCNO= 1
##$TYPE= <nmr>
##$USER= <she>
##$AMP= (0..31)
100 100 100 100 100 100 100 100 100 100 100 100 100 100 100 100 100 100 
100 100 100 100 100 100 100 100 100 100 100 100 100 100 
##$AQSEQ= 0
##$AQ_mod= 1
##$AUNM= <au_zg>
##$AUTOPOS= <>
##$BF1= 200.13
##$BF2= 200.13
##$BF3= 200.13
##$BF4= 200.13
##$BF5= 200.13
##$BF6= 200.13
##$BF7= 200.13
##$BF8= 200.13
##$BYTORDA= 1
##$CFDGTYP= 0
##$CFRGTYP= 5
##$CHEMSTR= <none>
##$CNST= (0..31)
1 1 145 1 1 1 1 1 1 1 1 1 1 1 1 1 1 1 1 1 1 1 1 1 1 1 1 1 1 1 1 1 
##$CPDPRG= <>
##$CPDPRG1= <>
##$CPDPRG2= <>
##$CPDPRG3= <>
##$CPDPRG4= <mlev>
##$CPDPRG5= <mlev>
##$CPDPRG6= <mlev>
##$CPDPRG7= <mlev>
##$CPDPRG8= <mlev>
##$CPDPRGB= <>
##$CPDPRGT= <>
##$D= (0..31)
0 1.2 0 0 0 0 0 0 0 0 0 0.03 0 0 0 0 0 0 0 0 0 0 0 0 0 0 0 0 0 0 0 0 
##$DATE= 1559123780
##$DBL= (0..7)
120 120 120 120 120 120 120 120 
##$DBP= (0..7)
150 150 150 150 150 150 150 150 
##$DBP07= 0
##$DBPNAM0= <>
##$DBPNAM1= <>
##$DBPNAM2= <>
##$DBPNAM3= <>
##$DBPNAM4= <>
##$DBPNAM5= <>
##$DBPNAM6= <>
##$DBPNAM7= <>
##$DBPOAL= (0..7)
0.5 0.5 0.5 0.5 0.5 0.5 0.5 0.5 
##$DBPOFFS= (0..7)
0 0 0 0 0 0 0 0 
##$DE= 6
##$DECBNUC= <off>
##$DECIM= 24
##$DECNUC= <off>
##$DECSTAT= 4
##$DIGMOD= 1
##$DIGTYP= 9
##$DL= (0..7)
0 120 120 120 120 120 120 120 
##$DP= (0..7)
150 150 150 150 150 150 150 150 
##$DP07= 0
##$DPNAME0= <>
##$DPNAME1= <>
##$DPNAME2= <>
##$DPNAME3= <>
##$DPNAME4= <>
##$DPNAME5= <>
##$DPNAME6= <>
##$DPNAME7= <>
##$DPOAL= (0..7)
0.5 0.5 0.5 0.5 0.5 0.5 0.5 0.5 
##$DPOFFS= (0..7)
0 0 0 0 0 0 0 0 
##$DQDMODE= 0
##$DR= 18
##$DS= 0
##$DSLIST= <SSSSSSSSSSSSSSS>
##$DSPFIRM= 0
$$ [...]
##$SUBNAM2= <"">
##$SUBNAM3= <"">
##$SUBNAM4= <"">
##$SUBNAM5= <"">
##$SUBNAM6= <"">
##$SUBNAM7= <"">
##$SUBNAM8= <"">
##$SUBNAM9= <"">
##$SW= 24.9336996594482
##$SWIBOX= (0..15)
0 0 2 0 0 0 0 0 0 0 0 0 0 0 0 0 
##$SW_h= 4990.01996007984
##$TD= 16384
##$TD0= 1
##$TE= 0
##$TE2= 300
##$TE3= 300
##$TEG= 300
##$TL= (0..7)
0 120 120 120 120 120 120 120 
##$TP= (0..7)
150 150 150 150 150 150 150 150 
##$TP07= 0
##$TPNAME0= <>
##$TPNAME1= <>
##$TPNAME2= <>
##$TPNAME3= <>
##$TPNAME4= <>
##$TPNAME5= <>
##$TPNAME6= <>
##$TPNAME7= <>
##$TPOAL= (0..7)
0.5 0.5 0.5 0.5 0.5 0.5 0.5 0.5 
##$TPOFFS= (0..7)
0 0 0 0 0 0 0 0 
##$TUNHIN= 0
##$TUNHOUT= 0
##$TUNXOUT= 0
##$USERA1= <user>
##$USERA2= <user>
##$USERA3= <user>
##$USERA4= <user>
##$USERA5= <user>
##$V9= 5
##$VALIST= <valist>
##$VCLIST= <CCCCCCCCCCCCCCC>
##$VD= 0
##$VDLIST= <DDDDDDDDDDDDDDD>
##$VPLIST= <PPPPPPPPPPPPPPP>
##$VTLIST= <TTTTTTTTTTTTTTT>
##$WBST= 1024
##$WBSW= 4
##$XGAIN= (0..3)
0 0 0 0 
##$XL= 0
##$YL= 0
##$YMAX_a= 36445
##$YMIN_a= -46280
##$ZGOPTNS= <>
##$ZL1= 120
##$ZL2= 120
##$ZL3= 120
##$ZL4= 120
##$ABSF1= 10
##$ABSF2= 0
##$ABSG= 5
##$ABSL= 3
##$ALPHA= 0
##$AQORDER= 0
##$ASSFAC= 0
##$ASSFACI= 0
##$ASSFACX= 0
##$ASSWID= 0
##$AUNMP= <proc_1d>
##$AZFE= 0.1
##$AZFW= 0.1
##$BCFW= 1
##$BC_mod= 2
##$BYTORDP= 1
##$COROFFS= 0
##$CY= 11.3945322036743
##$DATMOD= 1
##$DC= 2
##$DFILT= <>
##$DTYPP= 0
##$F1P= 18.9103706918063
##$F2P= -1.10871071338519
##$FCOR= 0.5
##$FTSIZE= 0
##$FT_mod= 4
##$GAMMA= 1
##$GB= 0.15
##$INTBC= 1
##$INTSCL= 1
##$ISEN= 128
##$LB= 0.24
##$LEV0= 0
##$LPBIN= 0
##$MAXI= 10000
##$MC2= 0
##$MEAN= 0
##$ME_mod= 0
##$MI= 1.114404
##$NCOEF= 0
##$NC_proc= 0
##$NLEV= 6
##$NOISF1= 3.799351
##$NOISF2= 2.8
##$NSP= 1
##$NTH_PI= 0
##$NZP= 0
##$OFFSET= 15.70392
##$PC= 1
##$PHC0= -8575.301
##$PHC1= 15.00025
##$PH_mod= 1
##$PKNL= yes
##$PPARMOD= 0
##$PSCAL= 0
##$PSIGN= 0
##$REVERSE= no
##$SF= 200.130013532006
##$SI= 16384
##$SIGF1= 3
##$SIGF2= 2
##$SINO= 400
##$SIOLD= 16384
##$SREGLST= <1H.CDCl3>
##$SSB= 0
##$STSI= 0
##$STSR= 0
##$SW_p= 3612.71676300578
##$SYMM= 0
##$S_DEV= 0
##$TDeff= 0
##$TDoff= 0
##$TI= <>
##$TILT= no
##$TM1= 0
##$TM2= 0
##$TOPLEV= 0
##$USERP1= <user>
##$USERP2= <user>
##$USERP3= <user>
##$USERP4= <user>
##$USERP5= <user>
##$WDW= 1
##$XDIM= 8192
##$YMAX_p= 0
##$YMIN_p= 0
$$ End of Bruker specific parameters
$$ ---------------------------------
##NTUPLES= NMR FID
##VAR_NAME=  TIME,          FID/REAL,        FID/IMAG
##SYMBOL=    X,             R,               I
##VAR_TYPE=  INDEPENDENT,   DEPENDENT,       DEPENDENT
##VAR_FORM=  AFFN,          ASDF,            ASDF
##VAR_DIM=   8192,          8192,            8192
##UNITS=     SECONDS,       ARBITRARY UNITS, ARBITRARY UNITS
##FACTOR=    0.0002004,     1,               1
##FIRST=     0,             0,               0
##LAST=      1.6414764,     0,               0
##MIN=       0,             -46280,          0
##MAX=       1.6414764,     36445,           0
$$ Real data points
##PAGE= N=1
##DATA TABLE= (X++(R..R)), XYDATA
$$ [...]
604E74p12m65J205m14r12J155k04j006J413j12j719J424P37j908Q77J036j850
621h81O44J361j960K75J893j725n21J824j101m88J660j102q22J660n50q54J170
638D83m17m88R32p73k39J283q94l39J164j259j6J868j685o87K438j473j291K700
656A307j124j691K899q79k505K966Q3k751K422L02k850K445P01l207K206J335
672A659l315J612J598l172J546K003l495R21K630l088K42K662k727NK757k579
688g41m74K871j952p94K417j737n91K464j803q46K506j423q98K146j495n92K365
705A423j728q40K564j697q95K760j960j097L468k062k112L992j223k828L883p24
721I24l622L920N12m306L047J655m249J875K236l609J255K444l384L72K594k396
$$ plain form
604 574 -138 -603 602 188 -724 431 227 -779 634 522 -1197 227 964 -944 -67 969 -881
621 -881 -237 1124 -836 -561 1332 -393 -914 910 -191 -679 981 -121 -943 717 167 -687 483
638 483 66 -422 510 -263 -502 781 -113 -452 712 -547 -563 1305 -380 -1067 1371 -102 -1393 1307
656 1307 183 -1508 1391 512 -1993 973 1056 -1695 727 1029 -1821 624 1325 -1882 324 1659
672 1659 -1656 -44 1554 -1618 -72 1931 -1564 -643 1987 -1101 -859 1803 -924 -919 1838 -741
688 -741 -1215 1656 -296 -1090 1327 -410 -1001 1463 -340 -1186 1320 -103 -1001 1145 -350 -942 1423
705 1423 -305 -1145 1419 -278 -1173 1587 -373 -1470 1998 -64 -2176 1816 593 -2235 1648 924
721 924 -2698 1222 1734 -2572 475 2130 -2119 -244 1992 -1617 -362 2082 -1302 -930 1664 -732
737g32J11K051k244J12K098k107q0K206j826l68J880j682j54K111j703o13J973
754A033j321m24J833j545l99K169j693q08K459j349j121K484j317j516K814p55
770E44k180K436j8k106J926Q7k009J838L63k061J487M66j858J504L38k074J761
787D44P88k648J260J518k381P31J753k381J09K201j719o29J974r25q70J241n36
804g0l66J042n77m49O51m84J57P15j018P5J048j093k41J320p44l84J072q85n10
823g41J409m38p63R28m15n01J025m81n84J181l79r78R71L0p20Q32m9r83P32L48
843D24p24K82K27l10K33j80k39N33j41k83M35l74k93Q76l13p61Q90J19q57M01
863e5K56m69M11J36n40J61J65j07J88k75j4N35n09l50P72j94l96P04m51o19J043
$$ plain form
737 -732 -621 1430 -814 -702 1396 -711 -791 1415 -411 -779 1101 -581 -735 1376 -327 -940 1033
754 1033 -288 -712 1121 -424 -823 1346 -347 -1155 1304 -45 -1166 1318 1 -1515 1299 544
770 544 -1636 800 782 -1324 602 689 -1320 518 881 -1180 307 773 -1085 419 757 -1317 444
787 444 1232 -1416 -156 1362 -1019 -288 1465 -916 -807 1394 -325 -954 1020 95 -775 466 -70
804 -70 -436 606 29 -420 231 -253 -96 619 -399 -324 724 -369 -610 710 -34 -418 654 -231 -741
823 -741 668 230 -533 395 -20 -521 504 23 -561 620 241 -737 234 264 -456 376 327 -656 76 424
843 424 -300 -18 209 -101 132 -48 -287 246 105 -178 257 -117 -410 466 153 -608 282 401 -456 -55
863 -55 201 -268 143 279 -261 -100 65 -42 146 -129 -143 392 -117 -467 305 111 -285 419 -32 -651 392
884C92p6q50P70Q1p85O34J7p12Q93J07j076O24L33q37P27K90j168O20O54j156
904e18K77Q82q25J2N51p76J97P72o69j46M85m55J66L72o36K71N19q13Q1N78n98
925b73K81N56j024J10R46q25j13Q91p47j11R13r42k20J314o91o91J117m75o52
944f36J225l72r90J186P0j186P64L69q52N64K72r15M20N43o65R8L29l66K39P0
964A67n10M16K72n75K17J85m99M48K82q09L12N57p12N0N38n22Q6N24o90j08P74
985D03l39l23M52k45j50M76l35k45N82j51l77L32j28j18M76k70l85N14l4m04L78
1006A09pl42M62m4o19M35M00n45M4L04l69J01L54l88j01M82j57l66K07J43q0K9
1028E2m4j02N1J21J8j90k6L01p1l82K15K89k95K2J91l71N7N30l60l65N69Jn45
$$ plain form
884 392 316 -534 236 317 -468 166 183 -529 364 471 -605 19 352 -485 242 532 -636 -16 638 -518
904 -518 -241 641 -184 -172 379 -397 -200 572 -97 -243 242 -213 -47 325 -311 -40 479 -334 -253 325 -273
925 -273 8 564 -460 -350 596 -229 -342 549 -198 -309 604 -338 -558 756 65 -626 491 16 -636
944 -636 589 217 -773 413 483 -703 61 430 -422 142 414 -501 -81 462 -203 -105 224 -142 97 167
964 167 -343 73 345 -230 -13 172 -327 121 403 -406 -94 463 -249 -199 339 -183 -97 427 -263 -371 403
985 403 64 -259 193 -52 -202 274 -61 -306 276 125 -252 80 -48 -166 310 40 -345 169 135 -269 109
1006 109 102 -240 222 178 -441 -6 394 -151 -107 197 -172 -71 283 -105 -206 276 119 -247 -40 103 23 52
1028 52 8 -94 -43 78 96 -94 -120 181 110 -272 -57 232 -63 -41 150 -221 -164 366 6 -359 210 211 -334
1051c34L19K36m23K28K70n77j9O41k12m07L30Q2l08J55J65k42P5K65k70l10L69
1072C3K71l35j03K47j45j38L52q0l34L58J55n86R2N49k47k33K81j95k00M63Mm52
1094b43K22L00l89j40L63K2j53Q0r4j97K00K84k33k29K81M0l23J18K61j56l9J51
1116A26l17p8N13j9m29J72J60k57L9K23j27k9J73j87k62K89L21k60k33K07jj93
1138a69K42J21l48J42K78m85j22P03j11n25L12N4l94L68K98n45J6M89l76l35N28
1159A41J41l73P9Q3k85J01M23k28l55K97J95m49L4M66j83k57K93j58l20N48J76
1180C69o34J26M21m31n7M65k34j56L44k25l48M38K49l90l2J44r2j4J40j8r6R0
1202E9O2k51j11M46P2m62J23K25l56J50L75m61r9N89l75m40O52P5m61K64jl95
$$ plain form
1051 -334 -15 221 -202 26 296 -281 -300 341 129 -278 52 134 -174 -19 146 -96 -21 244 -26 -336 33
1072 33 304 -31 -134 113 -32 -170 182 102 -232 126 281 -305 -213 336 89 -144 137 -58 -258 205 209 -243
1094 -243 -21 279 -110 -250 113 135 -18 62 -32 -229 -29 255 22 -207 74 114 -209 -91 170 14 -25 126
1116 126 -191 -269 244 225 -204 -32 128 -129 -90 133 6 -23 150 -37 -299 -10 311 51 -182 25 24 -169
1138 -169 73 194 -154 -12 266 -219 -341 362 251 -274 38 92 -302 66 364 -181 -165 324 -52 -387 141
1159 141 282 -91 -12 71 -214 -113 310 82 -273 24 219 -230 -196 270 87 -170 123 -35 -355 193 369
1180 369 -265 -139 282 -149 -206 259 25 -131 213 -12 -360 78 327 -63 -95 49 -43 -57 83 65 -31 59
1202 59 121 -130 -241 205 277 -185 -62 163 -193 -43 332 -129 -228 361 -14 -454 198 273 -188 76 75 -320
1224c20L54K42m14O6K03j71%l2J0K96j84k63K75r5j67N13k10n35O29O6p21M89
1246C1L64o71L08K61p33L33O28o85l9N11m56J0L93m05J06L99m96k8L03k84L04
1267A54J77p15L31M57p99L36O20r59K69Q15j240R3J398j074m99J343q16o44J489
1286G36n49j008J363j72j199J038K12r14P97Rr64P52K63p66N82O4o63O58q9p24
1306e74R04Q5r27O92L4q46R86J29j176Q67L54j231P69N16j193P77N49j525O15
1325a95J024j298L10R08j313K66J093j264J01J267j182k29J151j009l8J356j167
1342b19m76J461r04n94J528p34q57J533n87j220J602N2j356J035J47j200R34M36
1360E81j147N94M92r46L00L95n35M70J34p84M36K35n74N96O8q45P27K14j085P47
$$ plain form
1224 -320 34 276 -138 -72 131 -40 -40 -72 -62 234 50 -213 62 -33 -200 313 103 -432 197 263 -458 31
1246 31 395 -276 32 293 -440 -107 521 -164 -203 308 -148 -138 255 -150 -44 355 -141 -169 134 -150 154
1267 154 331 -384 -53 404 -395 -59 561 -398 -129 686 -554 -461 937 -137 -636 707 -109 -753 736
1286 736 187 -821 542 370 -829 209 421 -493 304 313 -651 101 364 -402 180 244 -419 239 150 -574
1306 -574 330 415 -512 180 214 -632 354 483 -693 174 528 -703 66 582 -611 166 715 -810 -195
1325 -195 829 -469 -159 749 -564 -298 795 -469 -368 899 -283 -512 639 -370 -408 948 -219
1342 -219 -695 766 -138 -732 796 62 -795 738 151 -1069 533 585 -771 264 411 -789 145 581
1360 581 -566 28 520 -426 -126 269 -266 204 338 -446 -10 225 -349 247 315 -530 197 411 -674 73
1380G3O23j181M58N96j276N77J063j416R4J237j250j63J416j042l92J508j005
1397h0q61J599l79j004J282k83j135J241M3j167J013K89j151O34K82q69P75K99
1415E28j075N00M49q52M77M26q66M40M18r55L49O66o92J38L56p21L12N34o78K07
1435c9M23o70K06L66p01M81N70j069J84P56q91K44Q53j092j5J126r97l26J298
1454G07o63o03J113n73p22J303j83j056R10J53r41O47K97p85M59L69p82J27N11
1473B88k98k9J33j97N2R0p4Q7q4K6J91l45j06N59j63l56L87j53l31N35l5n00M77
1496A54J23n94K48K55l19K36J35m94J30L40k51kJ65j49K7K6j82J60J67j24n8q5
1518i2l6K61k1k17J53K7j84J19J3j12K31j6l09Q9J50l0O4j17j09K13o7j51K26
$$ plain form
1380 73 696 -485 -27 569 -707 -130 933 -483 -389 848 -402 -565 851 -191 -583 925 -80
1397 -80 -941 658 279 -725 557 274 -861 380 423 -744 269 558 -593 41 323 -546 229 528
1415 528 -547 -47 402 -450 27 453 -413 27 445 -510 -161 505 -187 -49 307 -414 -102 432 -246 -39
1435 -39 384 -286 -80 286 -415 66 636 -433 -249 507 -384 -140 713 -379 -394 732 -265 -591 707
1454 707 44 -559 554 -19 -741 562 379 -677 233 386 -555 92 389 -396 63 432 -350 -223 288
1473 288 -10 -39 94 -103 -51 39 -35 52 -32 -6 185 -160 -266 293 130 -226 161 8 -323 212 177 -323 154
1496 154 277 -317 -69 186 -133 103 238 -256 -126 214 -37 -39 126 -23 4 30 -152 8 175 51 -7 -92
1518 -92 -128 133 112 -105 48 75 -109 10 23 -89 142 126 -183 -94 56 26 90 -27 -136 77 10 -141 85
1541H5k2j59K48j91k81N13P2n14K53J67m16K51K66m71J46L66m48j21M30j20r1
1562c7J98k45q4L02j09j02J74p8qN1k22J09L10k50j08J87j95M2K93k96r0L89k38
1585gk36L53p3j49L59k46l51M83P5m40K77J42l90K05J47l71J98L35l90j24K68
1606F5p0LJ20j88K2J08j27M9P5j06J67mm05K33L40l47l3L16l56l6M47l16j86N00
1630B71j42m28L18R5k12K42k0l63K13J57k32J15Q7j31P0o4j66K63J29k49K1J4
1652a2j33K33N1k93J76J28l24Q4J92j67J43J16m15L2L99k15p9K33j76j22K62j46
1674c3j47L56Ol46N7J42k8M8L5j34j0N1J7l2k0J81j1k85OK65o8l4J38k16j30L29
1700A37n0k68K73J20l52j0K10r0O8J52k53j57K64K9j49R7Q9j35n1RJ4R3J30j27
$$ plain form
1541 85 63 -96 152 -39 -320 193 265 -249 4 171 -245 6 272 -199 -53 313 -135 -256 174 54 -37
1562 -37 161 -84 -168 134 25 -77 97 19 11 62 -160 -51 259 9 -99 88 -107 -65 228 -68 -158 231 -7
1585 -7 -243 110 37 -112 247 1 -350 133 208 -232 45 187 -203 2 149 -222 -24 311 -79 -203 65
1606 65 -5 -2 118 -70 -48 60 -67 -18 57 -49 118 114 -291 -58 282 -65 -98 218 -138 -174 273 -43 -229 271
1630 271 129 -299 19 114 -98 144 124 -239 -26 131 -101 14 101 -30 40 -24 -190 73 202 -47 -26 -12
1652 -12 -145 88 139 -154 22 150 -174 -90 102 -65 78 194 -221 -189 210 -5 -84 149 -27 -149 113 -33
1674 -33 -180 176 182 -164 -107 35 7 55 90 -44 -54 -3 14 -18 -38 143 132 -153 -147 118 50 16 154 -62 -192 137
1700 137 87 -181 92 212 -140 -150 60 -30 38 190 -63 -220 44 73 -76 21 110 -25 -76 -67 -53 40 170 43
1724D3k04K6J72K6p2N5j4r5MK9OJ40N4k29j30J64J14m1K1m1j18M3P9q2Q7J68j41
1751F4k58P8J81nO1k9k04J5J64r1j8K08m4k44J2Q6K9J54nk61o2J53O5n5M6O9j12
1778cj30K8J02P8Q6q3k80K2K71l1j02J63q5k24J40O3q0K38O0l94p5K66K7OP7j51
1804a1r7R6k1qJ62N5j45j82k6K04J43r0n2n3j38J24J44j32R1J54l34j55L05L1
1828F5KJ38k62k14L03L7j42K19mk79N1J1m9K87P9l21q0Q8kJ65M6j38K5o3j56J54
1854d0J47j6R1k43k77L33J91k28J70L3m02J23K55k97K16L59n16k10L62o7J4L25
1876C23k97k66K57l0j01K57Nj25jk68O5M43j35j52J39l12o4M86j77j77M48k80
1898C8m64M52P7k25M48j82o10M14K11l51L68J07n45K27R5m16M43L67n88jJ95l71
$$ plain form
1724 43 -161 -135 37 63 -9 46 32 -63 -59 -30 -24 116 170 -59 -189 -25 89 48 69 28 -90 -47 32 -50 37 205 64
1751 64 -194 -116 65 60 121 92 -112 -97 67 -24 -42 166 122 -122 -110 -24 5 159 154 -107 -169 -16 49 -6 40 109 -3
1778 -3 -133 -105 -3 75 161 78 -202 -180 91 60 -42 121 36 -188 -48 15 -65 173 233 -161 -236 30 57 63 140 -11
1804 -11 -108 -12 -33 -41 121 176 31 -151 -177 27 170 80 28 -25 -163 -39 105 -27 64 218 -116 -271 34 65
1828 65 67 205 -57 -271 32 69 -73 146 142 -137 -86 -75 -124 163 242 -79 -159 -71 -73 92 138 0 25 -38 -194 -40
1854 -40 107 91 182 -61 -338 -5 186 -42 128 161 -241 -118 137 -160 56 415 -101 -311 51 -16 -2 323
1876 323 26 -240 17 -13 -114 143 148 23 22 -246 -181 262 127 -25 114 -198 -262 224 47 -130 318 38
1898 38 -426 26 103 -122 326 144 -466 -52 159 -192 176 283 -262 -35 60 -356 87 454 -134 -135 60 -311
1920c11L31L48m50L0K30m62J36M07k97J76J54o97J31O10m07Q5M15p08p0O95m90
1941a44p5Q12n22n63O22j87j99P32k75o10M80o7l16N76n3m03L87k89m25P43Q7
1962C11m92M09k20n76P25J64o20N22R8q28L84L42m77M93K29r05J99M92m90L23
1982H3L98p27P3M09n90K39O76n58j65L28n28J79P07n10j45M25n70l2O87l95n8
2003g4O06p60l61R19k38l14P66n34o64Q75o2n94Q34Jr03M30J83n11O56K57q53
2024c41J77K74m35L97L17n27J62R9n76L86M28l83J54j4o36M23M58n15K76K27p45
2045c94K06M37n28L98N27r67q2O70n04J58P29p69k64O86n11j41Q87l51m50M83
2065B20m60k19R19j94n13M70l08m02P25o6l70N87k86o90O04J69l27M84j70o72
$$ plain form
1920 -311 20 368 -82 -52 178 -284 -148 259 -38 138 292 -405 -274 336 -71 14 429 -279 -349 346 -144
1941 -144 -219 593 71 -492 130 -57 -256 476 201 -409 71 4 -312 264 211 -192 195 -94 -519 224 311
1962 311 -181 228 8 -568 157 321 -299 223 321 -507 -123 219 -258 235 464 -441 -242 250 -240 83
1982 83 481 -246 -173 236 -354 -115 561 3 -162 166 -362 -183 524 14 -131 294 -276 -308 379 -16 -74
2003 -74 532 -228 -589 330 92 -222 544 10 -654 221 159 -435 399 400 -503 -73 110 -401 255 512 -341
2024 -341 -164 110 -325 72 389 -138 24 123 -453 -67 361 -22 132 118 -518 -95 363 -152 124 351 -394
2045 -394 -188 249 -279 119 646 -321 -403 267 -237 -79 650 -119 -383 303 -208 -349 538 187 -263 220
2065 220 -240 -459 460 266 -247 223 -85 -487 238 172 -198 389 103 -587 17 186 -141 343 173 -499
2085d99M42K02l63M34P7n12J61kk49N51J22n04J38r9k52N72N2m63L87q9o16N39
2107B9K39m40M73l2q90M89N21o03L51L27q73J83N46o18K54O73p45k55N27l55R3
2128a06O06m79l00L93k61m6M70j76r2J36m39J9N16j77mJ72n34L9N21l72L2N25
2150D43n57k46N12l01J8O56m95m46N49k08j76O72k75m18M75k68l80P42%m93L91
2171A95k20m95P34J43o02M07K7o44M39K81m71M13J45p64K20M21l68K73K34o50
2191b82J15L56m16J90M51m73r0K33l67J98N13m36j37K75l72R1M27l25J8L42n54
2212b43j03N85k42l7M25n68k32O80k41k54O05k95m60N29j53l04P02j13o56M02
2232B7L7l61N58M4n93L72P5n67M52L26n16K25R8o20L81M67n20J11K46n35J29M19
$$ plain form
2085 -499 -57 145 -218 216 293 -219 -58 -60 -309 242 364 -140 -2 -101 -353 219 271 -192 195 106 -510 29
2107 29 268 -172 301 269 -621 -132 389 -214 137 464 -409 -226 320 -298 -44 629 -116 -371 156 -199 -106
2128 -106 500 21 -279 114 -147 -193 277 101 9 145 -294 -275 241 64 60 232 -302 -263 258 -114 -82 443
2150 443 -114 -360 152 -149 -131 525 30 -416 133 -75 -251 421 146 -272 203 -65 -445 297 297 -196 195
2171 195 -25 -520 214 357 -245 162 189 -455 -16 265 -206 207 352 -412 -192 229 -139 134 368 -282
2191 -282 -167 189 -227 -37 414 -59 -149 84 -283 -85 428 -8 -145 130 -242 -151 276 -49 -31 311 -243
2212 -243 -346 239 -3 -40 385 -183 -415 265 24 -230 375 80 -380 149 -4 -308 394 281 -375 27
2232 27 64 -297 261 305 -288 84 159 -408 44 370 -146 79 177 -443 -62 405 -115 -4 242 -293 -164 255
2254B55m11J63L81n91q8M48k63J03L83n23j32M74l12o8N12k92k32L48l24j06N97
2275C22j68l26K64j99j38M54j15k35L67k19l36M02K1j77L72k41m33M49R0l09L40
2296A85lm32K85N0l48M04J97n01R2J40k96K93K57m56N7K55l65L8L64j99l8J72
2318A51l51j4L73q7p3R9k18k6K26j21j1K39j83j53J21n7O2K70k37k17K40l9r0
2341i6K28m9j50J26r4j71K75J09j68Jo5o6J73O8j45Q6j2j38N8L1OJ63q6k29R2
2366e3J01o7J20j0j83R9M8j72J14J71j41q3N6j13Q6J90j27j34R9j4o9Q2M3j2J7
2391D8r5n8O3J05L2r1r1N9M8o3N6P9j03pL8j07N4J98r6j74P5N1m5P6Kp8L3L3r6
2420e4RJ12K7p5q7J9Q5j2qQn8K0O3q8l3J72j8j76N4L7m4J20j7j57P1R3j18mJ02
$$ plain form
2254 255 -156 7 388 -203 -291 157 -106 -3 380 -143 -275 199 -113 -181 331 39 -193 155 -169 -275 322
2275 322 154 -172 92 -107 -245 209 94 -141 226 7 -329 73 94 -83 289 48 -385 64 154 -155 185
2296 185 182 -250 35 85 -263 141 338 -163 -71 69 -227 66 323 -133 -76 179 -186 -148 216 17 -21 151
2318 151 -200 -214 159 72 -1 98 -120 -146 80 -41 -52 187 4 -149 -28 -85 -23 247 10 -207 33 -6 -96
2341 -96 132 83 -67 59 -35 -206 69 178 10 11 -54 -120 53 121 -24 62 50 -88 -30 1 7 170 84 -145 -53
2366 -53 48 -19 101 91 -92 7 55 -117 -3 168 27 -56 0 -113 -27 163 36 -98 1 -13 -82 0 43 31 48
2391 48 -47 -105 -42 63 95 4 -87 -28 20 -43 13 92 -11 -18 20 -87 -33 165 69 -105 -30 21 -24 52 54 -24 9 42 -54
2420 -54 -45 67 94 19 -68 -49 36 24 16 24 -34 -14 49 -39 -72 100 82 -94 -40 -3 -47 73 56 -101 -30 63 -55 -59 43
2449D3j4l6Pq0L6J22j8q0m5L6N1k2l4Q0oq3M0j7k6J52k9j96R7J29j33J6J05j42
2477d7J7J43j57o1K09j6j36L3J6j6P6l4n9J4L9J0m6m9J20N2j97K4J43j01%J20
2503I7j71l2K38j25j63K32J1j95J19pj08J64M3k02M0J23n6j1lj8P3l8p8R2j8o
2529AJ03j38r8K54l7k15J83L7k07J81L6k52J83J81l16MK33j61jJ51j88j0K10j27
2553Gr7J45l7k1L5j07O4J18j41OO0j18J10J07k69P1K58k54o5K71j87o4K98k27
2577c7j87L83n4l16K71M8k48K05K1k44J81J29k38M6Q2p4R3m1j28J81J0j70J41
2600E4j7j59K29Pl26K31J92l46Q8K17k79N9K50k98k3L24j98j40K04o8n7J75j64
2623d5p5K12q7p2J47j34J2J97k48n5L16j67j60K76j40j50L77j63k90L86kl52K83
$$ plain form
2449 43 29 -7 0 -80 -44 78 60 -20 -65 -29 22 0 -34 46 40 -43 -3 -20 -46 106 77 -119 -22 107 -26 -10 95 -47
2477 -47 -30 113 -44 -105 104 88 -48 -15 1 -15 61 27 -32 -18 21 31 -15 -64 56 108 -89 -65 78 -23 -23 97
2503 97 -74 -106 132 7 -156 76 87 -108 11 4 -104 60 103 -99 -59 64 8 -3 -6 -24 49 11 -67 25 7 1
2529 1 104 -34 -132 122 85 -130 53 90 -117 64 100 -152 31 212 -104 -100 133 -28 -29 122 -66 -76 134 7
2553 7 -90 55 18 -3 32 -75 -11 107 -34 -28 32 -86 24 131 -138 -67 191 -63 -128 143 -44 -108 190 -37
2577 -37 -224 159 105 -211 60 108 -140 65 86 -158 23 152 -86 -40 42 -32 61 20 -108 73 83 -87 54
2600 54 37 -122 107 114 -212 19 211 -135 -47 170 -109 -50 200 -98 -121 203 5 -135 69 1 -56 119 -45
2623 -45 -120 92 5 -67 80 -54 -42 155 -93 -148 168 1 -159 117 -23 -173 204 41 -249 137 135 -217 66
2646F6N8l30L00J04m50K21K91l82M2K69k68K6K18k58MK41j25p8R0q7Q4Q2k26J18
2670A0J35k53J03J46l21J73K88m54qM52l13j45L99k45j89M32j63l00L78K5l22
2691a72J92K7j74K09kk22J71L3j63J45l3j22K37p4k35K16P9j86J42j8k05K13N3
2714A11k46J50J26k19P9O2j82J58J36k59K7J50j36K9J15j42L0J05j72lJ57n5o
2737A5J3j44R8J25j64L1J25j53kJ30j41LK38j47k00J73O3j00N6M1j13K1P3n6n0
2762f5J10P0j51r8J76Jp7J26l8j99J65Q5k11Q7J86j75p7J19p6L1J57j42r8J21
2786B7j3m3O1Nk0Pp7pQ9L2Op3r2Q8O2r1O5N1j52N3N7j57J14J97k57q0K03r8l0
2815g3K02j32j13J92q2j41J99K5j14Q0r9q7K37kj73J39l9j47J80J7j89K38K3l21
$$ plain form
2646 66 124 -206 94 198 -252 -31 260 -122 -80 189 -79 -53 165 -93 -89 152 27 -51 39 -48 36 118 -108 10
2670 10 145 -108 -5 141 -180 -7 281 -173 -181 271 -42 -187 212 -33 -222 210 47 -253 125 150 -172
2691 -172 20 47 -127 82 80 -142 29 62 -101 44 11 -111 126 52 -183 33 112 -74 68 50 -155 58 111
2714 111 -135 15 141 -78 1 63 -119 39 175 -84 -57 93 -43 -14 101 -41 -11 94 -78 -81 76 21 15
2737 15 28 -116 -18 107 -57 -26 99 -54 -56 74 -67 -64 174 27 -173 0 63 -37 19 60 -53 -32 41 -15 -65
2762 -65 45 115 -36 -134 42 43 -34 92 54 -145 20 105 -106 -19 167 -8 -85 34 -42 -11 146 4 -94 27
2786 27 14 -29 32 37 17 24 -53 -60 29 61 67 -6 -98 -10 52 -39 26 77 -75 -22 35 -122 -8 189 -68 -148 55 -43 -73
2815 -73 129 -3 -116 76 -6 -147 52 77 -37 43 -56 -143 94 92 -81 58 19 -128 52 69 -120 118 141 -180
2839a80J07K03j95J01J33k95M9K14k00LK03j21q1J07j32L0K30j45j17J25r7MJ57
2862A03j38%J72j95q4K00m4k5J59k30r2K87r7j28K44j06j68K24j05j52L39ql36
2885a80J81N9k15K60L2k93J85Q1k83J53J78k03R4N1k89J58K29k51L8J69k83P2
2907e7K22k68O4K68k86j04K70j36k1K32k21j28K65r4j28K21o6j03J42j35q6K71
2929A22m0j68J32j11n0K15p9j25J98o8k03K09j4q5K21j09k48K34N1j84J78J8k22
2952a28J69L0k31K11J28k38K4R6j79J51J48k64L7J74k01qK00j40K5J22k09l5K38
2975A20p8o7J11j30k6J40q3l6J52p0r1N9n7M3J36j11j00J01k9m0J20o6k8J05j07
3000c2p7J55K3p3N6r7l9J52k7r8J09j7j04J03n1k6J53k0j88R0N3p1R0rj30J16
$$ plain form
2839 -180 -73 130 -65 36 169 -126 -77 137 -63 -60 143 22 -59 48 -84 -54 176 31 -86 39 -58 -54 103
2862 103 -35 -35 137 -58 -142 58 14 -11 148 -82 -174 113 16 -112 132 26 -142 82 -23 -175 164 156 -180
2885 -180 1 60 -155 105 137 -156 29 110 -173 -20 158 -45 49 100 -189 -31 198 -53 -15 154 -129 -57
2907 -57 165 -103 -39 229 -57 -161 109 -27 -48 184 -37 -165 100 6 -122 99 33 -70 72 -63 -149 122
2929 122 82 -86 46 -65 -115 100 21 -104 94 26 -177 32 18 -67 154 45 -203 31 82 -102 76 94 -128
2952 -128 41 71 -160 51 179 -59 -35 61 -118 33 181 -83 -46 128 -73 -81 119 -21 4 126 -83 -118 120
2975 120 42 -25 86 -44 -70 70 -13 -49 103 33 -58 1 -56 -13 123 12 -88 13 -16 -56 64 -2 -30 75 -32
3000 -32 -109 46 69 -4 52 -45 -84 68 41 -57 52 35 -69 34 -17 -43 110 90 -98 -8 45 -26 64 55 -75 41
3026D1L4j74Q7J16j17K7K0j33Q0J40j42j7R4p4j5N0k7K6N7q4n8M8M0J9%r9N1K7
3054A7n2K7N4p5L3L8j48O3J54j06o4R2o9j2J23p3o2J39o1r9Q2K4rN7j03n5J28
3081D3j4n2P5m6l9J05q1p8J73Jj42P3jp8J31Lj65J04P3j42J4R7p4N2Qj11K6J11
3109F6n7j5Nk4M3j6o6P3M8q6J7Qr2J38O0k05O8J22j29rJ40j22K1J22j51o4J77
3136G2j9p7N9l4l0Q6m8n1Q4jl9J4o3M5J14j18n7J20o1l5J21j02n6J96q3j80J81
3163C8L8j48J14j3j62J45R9k02M8J30j10k4N7m0K8N4o6j3J1KO1n8p1J53j4j69
3189a12J27P3j70J27N7k50J04K12k29l7K18j34q2J82j00p1K19p4j72J25K2o5Q9
3212E9m2o1J01m1q1R9k4rP8j20m5J81p0j06J49o7r8K03r3j66K53lk56J44J08k16
$$ plain form
3026 41 75 -99 -12 104 -13 14 34 -99 -19 121 -21 -38 56 -18 -33 17 -10 16 73 -11 -69 -21 19 38 38 -61 -10 17
3054 17 -35 -8 46 -29 4 42 -106 -43 111 5 -59 33 -36 -48 75 2 -60 79 18 -81 1 25 16 73 -30 -85 43
3081 43 29 -23 52 6 -33 72 -9 -87 86 87 -55 18 17 -61 70 73 -92 12 85 -57 -43 54 -20 32 40 -71 -45 66
3109 66 9 -6 -1 -25 18 2 -64 9 57 -29 -12 -4 -96 42 102 -103 -35 87 -42 -51 89 -33 -12 110 -41 -105 72
3136 72 53 -24 35 1 -29 57 9 -42 42 41 2 16 -47 -2 112 -6 -63 57 -4 -39 82 -20 -76 120 37 -143 38
3163 38 76 -72 42 29 -133 12 111 -91 -43 87 -23 -47 10 -30 -2 52 -14 -27 -16 -14 47 -11 -82 71 57 -112
3189 -112 15 88 -82 45 102 -148 -44 168 -61 -98 120 -14 -96 86 -14 -85 134 60 -112 13 35 -30 59
3212 59 17 -44 57 16 -65 34 10 1 79 -41 -86 95 25 -81 68 1 -97 106 13 -153 100 97 -159 -15 93 -123
3238a23J41J19k70P2J94j94k9J68q9j6O2j07L7J01r0L1J3j09J29O8k49J34K06
3261A99k85j0K56k08l0K79k18j61L26p8k34K49oj82J79k4j93J83O2j84O9M1j02
3284g2J29k5j29J52Rj44R5Kr1J53l4j92J88L2k07J69M9k26J82R0l39J69K47l08
3308a01LK32k23rK65j94j22K65p8j52J46Pl3O5r2m8J33r0JJ16j63J9K00j81j00
3333a34K82p3j89J84l2j55K06Pk22J20J09j65L7O0n9M8K2j45Q4N3o2M3j9q7R9
3358A2L1j21O8Q1j12K5L7j02J09O5j67K7J25j29J2J25j23j5J68j25j23J94M9j87
3382g6P4N5j10M9R2r0n5J24Pj44L3J20l3r7O3L3r7P2P7j48k7J72n8j37J24N6j26
3409d7K7M1o6L5Q6p8n9N6L8o2%L2Klqm5L4O1j8o3K2K1j9L5k1m0O4M4j23MJ15m7
$$ plain form
3238 -123 18 137 -133 -61 133 -61 -90 78 -11 -27 35 -72 -35 66 -24 7 20 -89 40 108 -141 -7 199
3261 199 -86 -96 160 -48 -78 201 -17 -178 148 70 -164 85 79 -103 76 52 -141 42 104 -80 -11 30 -72
3284 -72 57 32 -97 55 64 -80 15 17 -74 79 45 -147 41 73 -134 35 84 -142 40 130 -209 -40 207 -101
3308 -101 -98 134 -89 -98 167 -27 -149 116 38 -114 32 39 6 71 -21 -69 64 -26 -25 91 -72 -53 147 -34 -134
3333 -134 148 75 -114 70 38 -117 89 96 -126 -6 103 -62 -25 35 -24 24 46 -99 -15 38 -24 19 0 -87 12
3358 12 43 -78 -10 71 -41 -16 21 -81 28 93 -74 -47 78 -51 -39 86 -37 -52 116 -9 -132 62 111 -76
3382 -76 -2 53 -57 -8 84 -6 -61 63 70 -74 -41 79 46 -51 12 45 -52 20 97 -51 -78 94 36 -101 23 79 -47
3409 -47 -20 21 -45 -10 76 -2 -61 -5 33 -29 -29 3 5 2 -6 -51 -17 44 26 -37 -15 6 -13 22 1 -39 25 69 -54 -50 65 18
3441A8l5M1k9j8Q5m8n4M7K9k8pl1L2Q8j15k6J09n5m0J15p9j03J94j8k11J48J04
3468A13j81K3J20j41L0J35j20n5J22k8p0L8k0P1J3j09N4L0q2Q5K7j59R3J44k22
3493h9RJ98j41j9J39j54k1K19j42j15K17r3q1J89j17j04K40r4j65K05k4j60J89
3516H6m2j77K06J9k19J57O5j69J13J3j88J94O1k28J12Q6j91J00J05k31J06J75
3538A53k50J3J96j47j8J43j51l7K00j06o2J17m9j7O7j23N2J25j47j5J45j39LK03
3562A56k07p0K78j35j73K68o7j59K27o5k18K42N4k37J12Q6j75J10O4j96J33R8
3584A26k02M0J12j31P5Q4j87L8J63j62nJ37j10rR4j33J6J53j03o8J12o0k0J20
3608H0j12m4J52o9r5J30k8n7R8n4q9J28Pr3O6Jn2R0n2r3J54j7j17J07jj06J40
$$ plain form
3441 18 -17 24 -5 -23 62 14 -40 7 36 8 1 -30 2 90 -25 -51 58 3 -37 78 -1 -104 90 72 -139 9 113
3468 113 -68 -45 75 -66 -36 99 -21 -76 46 18 -52 -14 -34 37 50 -59 -5 25 -57 28 55 -104 -11 133 -89
3493 -89 -80 118 -23 -42 97 -57 -78 141 -1 -116 101 8 -73 116 -1 -105 135 41 -124 81 57 -103 86
3516 86 44 -133 73 92 -127 30 95 -74 39 52 -136 58 119 -109 3 89 -102 -2 103 -128 -22 153
3538 153 -97 -84 112 -35 -53 90 -61 -98 102 -4 -66 51 2 -15 52 -71 -19 106 -41 -56 89 -50 -47 156
3562 156 -51 -121 157 22 -151 117 50 -109 118 53 -165 77 131 -106 6 92 -83 27 91 -105 28 126
3584 126 -76 -36 76 -55 20 104 -83 -45 118 -44 -49 88 -22 -31 63 -70 -54 99 -4 -72 40 -20 -40 80
3608 80 -32 -76 76 7 -88 42 14 -43 55 1 -88 40 47 -46 20 21 -31 59 7 -86 68 51 -66 41 40 -66 74
3635G4kk01J52Q9j86M4J21j51L6J15j52KJ52q6q1J17l9k1P9r4l7J34p2o2R2l1
3661hj8P7p3m8J18kr6M7J0m9P7j5p6P7J2n8K1OqO1m2p2Q6Rm5K8nm4Q7k8p7P9K1
3694E2o8M0pn5J05jj38Q1O0j15M2N6r8M0P8j20k0J34l7p5M7nk6N6k3m6L5L5k8
3723ak2QL8Kn3qL3NJ6j5m5L3L5l9rL4lRk7k0L6L8l2m0K4oJ9L0m9lN5l2n1L8K6
3758B4j0J7m2k5N8Lk6pJ3J0nk1j1N4nm1j8NM2Qk8j3QNJ1l3j4O1jp0J5N8k3J8J2
3793B9p2K5N5m3l3N6Lm3K5l2K5O2m1n4L7%kL7m5j2P0k9q5O9M7n7K1Jo6O3N6p9
3825a2qL5Jl8QJ6J9ll2j8MK6N0o0m3O6J5q7L9M7n3M4Qj06N2J01r6k4P7m4j4P1
3857D1n5j6R4n2p5Q3mj8N1m2o6R2J2q2M1M4n5K2k0l6P5K6q3J4K2l5O1nr6Q1M6
$$ plain form
3635 74 72 -129 23 112 -74 -30 91 -60 -24 91 -61 -59 93 7 -74 43 4 -17 62 -32 -69 65 -7 -69 23 -8
3661 -8 -26 51 -22 -70 48 46 -50 -3 7 -42 35 20 -56 21 33 -25 -4 2 -6 55 13 -59 27 36 -9 19 14 -30 57 29 -48 31 52
3694 52 -16 24 17 -38 67 66 -72 9 69 -46 -4 52 -46 -6 72 -48 -68 66 29 -46 1 -4 -30 26 3 -43 -8 27 -1
3723 -1 -23 -15 23 25 -28 -36 -3 2 18 3 -42 -9 26 -13 -22 12 9 18 -9 -29 7 45 13 -27 -3 -9 10 40 -9 -12 43 11 -40 -2 24
3758 24 14 31 -11 -36 22 25 -1 -8 5 15 10 -11 -22 32 27 -14 -32 -27 15 23 -5 -18 -10 -5 6 -27 -41 20 19 -51 -36 22 -1 17 29
3793 29 -43 -18 37 -6 -39 17 20 -23 2 -30 -5 57 16 -38 -1 -1 -3 34 -11 -23 47 18 -67 2 49 -8 13 14 -52 11 67 -12
3825 -12 -20 15 16 -22 -14 2 21 18 -14 -32 -28 -2 48 -12 -55 11 26 -61 -22 25 -28 16 24 -82 -30 71 -25 -49 28 -16 -30 41
3857 41 -14 -30 64 12 -63 20 16 -2 49 7 -59 33 45 -37 4 48 -7 15 -5 -41 34 60 -23 -9 13 -22 39 34 -62 19 65
3888F5j14J4Q2o0J1M3j13K4J13n9o5Q3l4j1L1l9pQ0m3m4K4j2J8P1r5j5J16p5n0
3917f1R5k3n4J15p5j11J80Rj55J00L7j12P8M8j39Q0Q0j33OQ4n3K1M0j07M3P3p9
3944a3rQ0p3J8M7j21M5J22j04m0Q7n7j3R7p5n0J14n6o5R0k5l6Q6p1o7J16Jo6O9
3973C1l1n5P2Lr0R9L2j08L5K0m8R4jj06M7O8r9K7O6p8K3O9j34J0J62p8r4J00j2
4002B4p3R1j3p9P1K7q4j5O4K0j4l3qK8k3L2K7q5%R7o7q4J39L5j64O4O0j05N8J05
4032I5j45k2J32n9q0J10Oo3L8k4o2J00L0p1J4J6m5M0J1m5N0J3q0J2N7oK2l7m5
4061c8K7L9m8L5K4o0L8K0j02M9J24j29m4R8n3m1J24m6r2R4L0j28K2J07m1n4L6
4088iqj3K8L4l6m0J7P3r3l3J59l6j49R6N4j13R8O4j75K1J65j42n4J83n2j27J44
$$ plain form
3888 65 -49 -35 47 -13 -2 41 -72 -48 65 6 -59 24 -10 -21 10 -29 -36 44 1 -43 -19 -31 -13 58 -37 -52 64 -11 -61
3917 -61 34 11 -43 72 -3 -114 66 75 -80 20 57 -55 23 71 -68 12 92 -41 -35 49 -4 17 57 -50 -7 66 -13
3944 -13 -22 58 -15 3 50 -71 -26 96 -8 -48 39 -18 -31 66 -9 -59 55 -1 -66 24 -1 -37 49 -22 -89 27 28 -38 31
3973 31 0 -55 17 20 -70 29 61 -47 -12 8 -40 54 53 -53 -6 62 -37 -10 56 -22 1 70 -64 -54 108 30 -64 36 24
4002 24 -49 42 29 -50 21 48 -36 -51 13 33 19 -14 -22 6 -17 15 42 -43 -43 54 -13 -97 42 77 -87 -23 37 -68 -10 95
4032 95 -50 -72 60 1 -79 31 37 -26 12 -12 -74 26 56 -15 -1 15 -30 10 21 -24 26 39 -41 -29 28 22 44 7 -38
4061 -38 -11 28 -20 15 39 -21 17 37 -65 -16 108 -21 -65 33 -20 -61 63 17 -75 19 49 -79 -57 50 9 -45 -9
4088 -9 -17 -30 -2 32 -4 -44 -27 46 -47 -80 79 43 -106 -10 44 -69 29 93 -82 -61 104 -38 -92 91 39 -88 56
4115E6m7j07J60L3j62N5O8j00M3N8q2K3N0q6qP5%j6l4j7M7Nm6N8rq3Q5Jj40J39
4145A9R7k05K0J50j42mJ95j59j00K18p6j52J83L9j51O2L5r4N7O9q3J4jqN1o1q
4172c5J44j12r2J59m8r5K05n1k37K03P2k48J30J60k38L9J59k06J8K37j61j13J67
4195E7n0r0J48k8r6R1j0q4N2L3plp1K6O8q1K8Q5j40K6J37j58l4K37j08j76K06
4222E8k5j72K14K8k37J30J24k10L5J57j06k0O6q3LR9l7k7Nl4O7j8o9R2M1j42M6
4249a5O8j17P4J11j98j5J92j29n8J83p2j07J31m4j35J64O8j68K5Q0q1J6P1m6k7
4274b9M5j9m0%Q4Qj00rJ07o4l1J22o7r8J44qj61J41J01j95K6J13j25K4J48j17
4300@p6J38k1j11Q9M5p0mJ3m1L2M1lm3k2N8jo9M3N5q0pN9n6pJ24p6j02J07K8j12
$$ plain form
4115 56 9 -98 62 95 -67 -12 56 -44 -1 57 -25 -2 48 -38 -46 29 29 13 -21 -38 9 14 -32 26 17 -66 19 20 -120 19
4145 19 116 -89 -69 81 -61 -65 130 -29 -129 89 13 -139 44 83 -68 -6 29 -65 -8 61 -22 -8 -9 -17 34 -27 -35
4172 -35 109 -3 -95 64 16 -79 126 75 -162 41 113 -135 -5 155 -83 -44 115 -91 -73 164 3 -110 57
4195 57 7 -83 65 37 -59 32 22 -62 -10 23 16 13 -58 -32 36 -45 -17 68 -72 -46 91 -67 -101 136 28 -148 58
4222 58 33 -139 75 103 -134 -4 120 -90 -55 102 -4 -24 42 -41 -38 61 24 -3 2 -32 35 17 -52 40 81 -61 -15
4249 -15 53 -64 10 121 -77 -92 100 -29 -87 96 24 -83 48 4 -131 33 101 -67 -42 38 -43 -27 44 -2 -29
4274 -29 16 -3 -43 -43 41 49 -51 -60 47 -17 -48 74 7 -91 53 45 -116 25 126 -69 -43 70 -55 -31 117 0
4300 0 -76 62 41 -70 19 64 -6 -10 3 -38 -6 35 32 -11 -33 25 24 -45 -2 53 -27 -34 25 -31 -38 86 10 -92 15 43 -69
4331f9P0O1j10L4L5p9J0R7k0q8K9M5l1ML2om4M4Nn9M2Q0q4o0Q5om9Q1J1j20O7
4362GO4j13LJ18n5o5O3j5l8N9K1q5j4Q4k0o8N1N1o5j5M9m4qR4k9j25Q5O1r2J7
4392b4P2n8k9O9n2l9Q4J9r3J2O2ro1N2K5m2RL5o2j3J02j1j12N8O4r8K8P8q9j5
4422c8J15r3o0J38Qj15M8L9p5M0M0o0j1N6k3n9K8P4m9l0J6lj7N6J6r2J8P4p2n1
4452h2J26oj03Q7j9p7Q3M7j09J1R3o2k7N3j0j9M8o1j8L8M0j6k5j4M4Jo6N8M1p1
4482a5L1J5q4M2R8r1m5J01l6o3R7j7p7Q1kr8M4O1n6KMj1%K6j2pj1J8J3n7K5P2
4514D8m9n4O0pn4R3j7r7Q7M6j33M4J00j00mQ1r1oJ31n8p4O4J5n3L2K%J7k6j2R
4545fML7Np8J4P7p4l3J11n3n1J04n5q2J36Pj44O6O9j00L7M7q5J5P7r0jM5J3lj3
$$ plain form
4331 -69 1 62 -48 -14 21 -58 -48 49 29 -59 -30 15 -16 -12 20 14 -30 14 19 -40 2 82 -2 -62 23 17 -32 49 60 -60 7
4362 7 71 -42 -39 79 24 -41 22 7 -31 28 49 -36 -50 34 14 -54 -3 48 -17 -32 17 -27 -35 59 30 -95 -10 51 -41 -24
4392 -24 48 -10 -39 30 -22 -61 23 42 -51 -39 23 14 -47 5 30 -12 -3 32 -30 -43 59 48 -64 -6 58 -40 -12 66 -23 -38
4422 -38 77 -16 -76 62 70 -45 3 42 -33 7 47 -13 -24 32 9 -50 -22 52 3 -27 -11 -14 -31 25 41 -51 -33 41 -31 -82
4452 -82 44 38 -65 22 3 -74 9 56 -53 -42 51 -11 -38 15 5 -14 34 -27 -45 -7 33 17 -8 -22 22 23 -43 15 56 -15
4482 -15 16 31 -53 -11 87 -4 -49 52 16 -47 50 33 -44 37 35 -63 -19 42 -14 -12 -8 -19 -19 7 -5 -12 -23 -5 8 -49 -24 48
4514 48 -1 -55 5 -2 -56 37 20 -77 10 56 -77 -33 67 -33 -37 44 -47 -53 78 20 -54 10 25 -28 4 6 6 23 -3 -15 -6
4545 -6 -2 35 40 -38 -24 53 -21 -54 57 4 -47 57 2 -80 56 63 -81 -15 54 -46 -9 38 -47 -32 45 -45 -46 -1 12 9 -4
4576dl5K8K5l4J1J1l5N1lp3O7N1j16L8N2p8L9Q1j09k5J50j05o6J28j6q3J01k4
4604B7j16J19M8j17J5P1n7jL2k7JK4k9j1QJ6N2n0p2R6Kr7O7M2j04N8N3j28L5J24
4634H1r6n6Q6k3k6O4k7m7N9k4m1M5J4j2K5m3j7N7rl8N3l0k1O0k8m3R7rq8O3ro2
4666d5Q7J0j15P6N8j26L6R6q5qP2q6k6J41l7j01O2J3o2N0pj8L2Km6kL3RNo5J2
4697c5M9m0j2O1l5k6O2m2m9J00K0r9K8J9m9N7K0o5L1M5o9K1M1l9K4J5o1NO9l1
4727A5k1M0l3j2N1m2l1O5pn9J2M0k6L4j1n3K4L5n1J6K5rlqk2K4L3j7l3OJ7Pkj1
4761gMjpk0J8J4K1Lo5J5N9k4qK5k1k9M7l2rO2%q1J8M1l8K7M2p6PN2n3j2P9k7l7
4796a3K7l8mQ1k5o9M6Jm9N1Om5M7oo5L0L3j9J3nn9M7L9n6OM2k8jlj4L7J7l8k4
$$ plain form
4576 -4 -39 -11 14 -20 -9 2 -33 18 15 -58 9 60 -56 -18 34 -44 -5 76 -33 -58 92 -13 -79 49 33 -50 51 27
4604 27 -89 30 78 -39 -24 47 -10 -11 21 -6 -5 19 -10 -21 -13 3 55 5 -67 29 31 -66 1 43 -61 -3 50 -78 -43 81
4634 81 -15 -71 15 -8 -34 30 3 -44 15 -9 -50 -5 9 -3 22 -21 -38 19 10 -28 25 -5 -26 34 6 -37 60 51 -37 26 17 -45
4666 -45 42 52 -63 13 71 -55 -19 77 -8 -16 56 -30 -56 85 48 -53 9 22 -40 10 3 -15 17 19 -27 -29 4 13 18 -47 -35
4697 -35 14 -26 -38 23 -12 -38 24 -18 -67 33 53 -46 -18 1 -48 9 29 -36 -5 40 -29 -8 33 -6 18 33 -28 -23 46 15
4727 15 -6 34 1 -11 40 -2 -33 32 25 -34 -22 18 -8 26 15 -38 -14 21 -30 -14 11 2 -1 -9 -31 -7 26 9 -24 -18 -1 6 4 -7
4761 -7 -3 -4 -11 -31 -13 1 22 25 -40 -25 34 10 2 27 6 -23 24 -8 -17 45 45 -36 -18 23 -15 12 54 -22 -15 37 -16 -28 51 24 -13
4796 -13 14 -24 -28 53 28 -41 5 6 -43 8 14 -31 16 10 -55 -25 8 -11 2 -3 -62 -15 24 -32 -26 16 -12 -13 -16 -30 7 24 -14 -38
4830c8L2j4L1Nm5L2J7n8K6N9n6JO0j00J8J05n7n0O8k4n8Q3k0p5J04Qj17N9L5n0
4860a9L1K1p8L5M5o5RN9n1j8J9l0K7M6l3k3K2k2RL1m2J5M2o8qP2k5j3L9o3rR1
4892D6k8l9L5ql0L5k1j4N6mn7J1J4NK1k5k5N6l3l6O7Pn3N7k1p0O8M5q2MN7p4K9
4925gN7q9K0P8p1m6P6pl2M2j5n5N0Mm6J1L4k1j0j0J5K2jrj7lJ5M3m7LN5k6n0M1
4959DRk3M0k1n4N2L2m4mL7l5J2Oj8K1K4k7k2MlK2Nk6KK4k5pK8Mj3Pl5j6N8ml0
4995a6J0kk7K9Qm5L5L9p2j6P0kk0J4k4l2N3J1n0L2K9l8k0L9rLK1k8k6L6M0m2j2
5028a2M4k3k1J1mJ1J6ol3oN2nk6J0opPpj4J9L4m4l0M9j8%J3j6j4N6l5k8M3ok4
5063b0J1Ll0N7Lo0J6K3k5J8J7m0J6L5o3OO9j5k6J5j7rN0k6k8M1%l3J1J6j4K2j
$$ plain form
4830 -38 -6 -20 11 16 -29 3 20 -38 -12 47 -9 -8 52 -48 -30 75 18 -32 36 12 -46 37 17 -58 46 54 -63 -4 31 -19
4860 -19 12 33 -45 -10 35 -30 -21 38 -13 -31 -12 -42 -15 31 -2 -25 -3 -25 -16 15 -27 -12 30 -38 -46 26 1 -12 27 -36 -45 46
4892 46 18 -21 14 6 -24 11 -10 -24 32 28 -29 -18 -4 1 22 -3 -28 28 -5 -41 26 33 -20 37 16 -54 14 59 -23 -19 38 -36 -7
4925 -7 50 -39 -19 59 -12 -58 18 11 -21 21 6 -49 1 5 -41 -30 4 -17 -27 -37 -22 0 -1 -10 -27 -30 -15 28 -19 -16 39 13 -37 4
4959 4 13 -10 30 9 -45 7 39 -5 -9 28 -7 5 11 -7 14 38 11 -11 -7 -10 12 17 -9 -7 17 -8 -15 13 17 4 11 -24 -40 18 14 -16
4995 -16 -6 -8 -35 -6 2 -43 -8 31 -41 -57 13 11 -9 5 -19 -51 2 13 -37 -5 24 -14 -34 5 -4 -1 20 -8 -34 2 42 0 -12
5028 -12 32 9 -12 -1 -5 6 22 16 -17 -23 29 24 -2 8 2 -5 2 -5 -19 0 34 -10 -40 9 -9 -9 4 -12 -26 30 -5 -33 10 4 -20
5063 -20 -9 -6 -36 21 24 -36 -20 3 -22 -4 13 -27 -11 24 -39 -33 36 21 -5 10 -7 -16 34 8 -20 21 21 -12 -1 15 1 23 22
5096B2m1KM1Ml5lJ3MpnJ0mJ9lo3L0M4l0l7L5j3k0M3ll3M4J2q6M6M4m5jM7p1J1
5131b9O1m7l1P4pm3K6Jk8M6Qo9L1L8k9PQj3%J3k0jL0mk0lJK7lj8kOk1J1Ml6O0
5168B8K2q9K5L0k5JL8o0KN7m3l8N6j1oPj4oN0k5k7K2oKJ8l1j6O2l3l5N2jk3M3
5202B6k7m1P0mm7K4K0m3K6K3n9M5L5o1j5N4k5lK6l5oM1k5k5L9oj1Qk4jL6k5j4
5235b4L1k4lK7m3J1N1l9m1O9k0k5N0l8m3O3K2p5K6K6k4RJ9l3K4K9l8kJ8OJ0ml4
5268a9K8K4n7J0L0l3K9J5n3ON6m9j4O1l6j0M1m5k1P8l0o1L8K7l0K0Mm7K1K1l1
5299b7jL4opj0lK9k0j4K2j1mL5k7l8N6Ro3K6M2n7M1L1p0OO9n7k3P7k5k9K8j0l5
5333c2N8Pm4J9KnMqj5K7Pl3MJ4J0jl0j7L2qj0K2k0j6M6j5l8L6J9m4PK2j0OJ0k8
$$ plain form
5096 22 -19 -17 24 28 -7 -10 3 7 0 -5 5 1 20 17 -46 -16 28 -2 -39 -4 -17 -37 6 3 -30 14 26 -60 -14 30 -15 -16 31 -40 -29
5131 -29 32 -15 -46 28 21 -22 4 5 -23 23 31 -38 -7 31 2 9 17 4 4 17 -3 -4 26 22 2 -1 0 27 24 6 4 10 -11 0 4 -32 28
5168 28 50 -39 -14 16 -9 -8 30 -30 -28 29 -14 -52 4 -7 -13 -6 -20 -26 24 -1 -28 -6 -12 -10 8 -23 -39 23 -10 -45 7 6 -17 26
5202 26 -1 -42 28 24 -23 1 21 -22 4 27 -32 13 48 -13 -28 26 1 -2 24 -11 -17 24 -1 -26 13 7 -4 4 -20 -21 15 -10 -24
5235 -24 7 -17 -20 7 -36 -25 26 -13 -54 15 -5 -30 20 -18 -61 2 24 -51 -25 1 -23 -14 5 -28 -4 25 -13 -15 3 9 19 15 -19
5268 -19 9 33 -24 -14 16 -17 12 27 -26 -20 36 -13 -27 34 -2 -12 29 -16 -37 41 11 -50 -12 15 -15 5 9 -38 -17 4 -27
5299 -27 -28 6 0 -7 -17 -20 9 -11 -25 -3 -14 -18 17 -10 -48 8 17 -46 -20 22 -35 6 37 -33 -27 42 -15 -38 39 14 -15 13 3 -32
5333 -32 26 33 -11 8 10 5 9 1 -14 13 20 -13 -9 5 15 14 -16 -33 -1 -9 -19 3 -17 -33 13 -2 -40 -4 15 -29 -22 0 -10 -4 6 -22
5369b2%M2j4k9J2PPprLK3j3lqj1K6J8m0RK9rl7K0PMJ6nm5K6K8k9j9L9%l6K3rn
5407a1K3pl9J9L0k9J0Qk4J5J1k8qK8J1l5NPOMnj1j0K8J0l1nL1Nl2MK7j0nLk0J
5444b4M8k2l2M1Jk3J1%j4M2qm4K7K3k4oK1k6L5J0m7LL1j5j4J0k0PK6k8k1M2qk3
5478b1K9k0rM0k6l2L1J1k1K0qj8K9rl2J5L1l2RkoL3Nm2J4K5k2jJ3k5M6mm5J2N1
5513C9m6LK7m4J3O0p2lN1j5k0L5m1j8P4m0m2N5qk7L3k5l5O5mn6M4lk1J7jl8M6
5546CJ1n7QM1k3Rnj5J9K8m3J2K0k3J9mk6J2L2m2lM7k4rL1m0K4K4l4j7M7j7j6K0
5580Il1OM9k4l0J8J5k1J7j0k5L8Om6J1J1j6K5j4j4K7jl5J2K0k4K1nj7J1L2l7K
5613b0L2j5klj8LL0pk8K6opL0l0kM2j2k6J7Pj2J4qrK5j7j7J0JMJ4j6k0L1Kk8O
$$ plain form
5369 -22 -22 20 6 -23 -11 -4 3 -4 -13 -10 13 0 -3 -11 -22 4 22 -18 -9 20 11 -26 -6 1 5 21 16 -29 -3 25 -4 -23 16 16 -20 3 -6 -11
5407 -11 12 5 -34 -15 15 -14 -4 4 -20 -5 6 -22 -30 -2 9 -26 -21 -14 -8 -4 -9 -20 -30 -2 8 -23 -28 3 8 -24 -20 7 -3 -8 -5 -25 -24
5444 -24 24 2 -30 11 12 -11 0 0 -14 28 20 -24 3 26 2 -4 17 -9 26 36 -11 -8 23 8 -6 4 -16 -9 17 -11 -32 10 2 -21
5478 -21 8 -12 -21 19 -7 -39 -8 3 -18 2 -6 -24 5 -4 -36 -21 10 -22 -13 -15 -21 12 17 -25 -11 14 -8 -9 4 -21 25 21 -24 -12 39
5513 39 -7 -4 23 -21 -8 52 -20 -23 28 13 -7 28 -13 -31 43 3 -39 16 8 -19 14 -11 -46 19 15 -41 3 0 -21 -4 -5 -43 3
5546 3 14 -43 -35 6 -17 -8 -13 -28 -9 19 -24 -12 8 -15 4 0 -26 -14 18 -24 -27 20 -4 -13 18 -22 2 26 -8 -25 22 5 -11 9
5580 9 -22 -16 33 9 -21 -3 12 -9 8 -2 -27 11 17 -29 -18 -7 -23 2 -12 -26 1 0 -35 -23 -3 -27 -6 -11 -28 -17 15 -22 -20
5613 -20 12 -3 -5 -8 -26 -23 7 0 -28 -2 -8 -15 15 -15 -17 25 13 -13 4 11 -1 13 5 -4 21 4 -13 -3 -2 2 16 0 -20 11 13 -15 -9
5650iPj0K2lm0L7K7l8j4K1mpPj0j4K0J0k4J3J1j0Ml0K8LPk6OJ5nRk0JK3%j8kJ4
5688AQJmqRJ2j7nJ1OqkjlQJ1k7lJ6MroJ1Noj2pJ0Rj3j2NJ3%j0ONomj9PJ6J4l2
5732b6J2pJ7mOj2KJ7k0KJ6J1j7mnKJ2Lk5J3J4J5k9jK0KJ1rk4K0Rj5NqNjOk5jK6
5772A3j1k3J9J2qLj3nMlj3mL3j0j0j0NJ5rJ2j2kK3nk0LK6j8j7L1k2QJ4j8k0L0
5808bK0j9PJlNj8j6L3K1k8%LLRkl4J7K8k9J4pMOml2QK7j9NMk4K2jj6rL4ol0K0
5848hkkJ1j2oJ2K%nmJK1k2j0J8J3j7J7j5qM0rm9M6K7n4J8J7k5J4J8l6J3K2j8k3
5884a5L2k3PK7k7jOOk0%jJ2J0l1LK5k3K5pk6J7L5o5lN1j3j5J9j1k8M8j1m5L7K3
5919A8l0jJ4k3J3K8k7j2K5jmj6J5J9rl3J6L0j8J1ml6M1kl2J5K6k9mK2l2J2L3k9
$$ plain form
5650 -9 -2 -12 10 7 -33 4 31 -7 -21 0 -4 -11 -4 -14 -28 -8 2 -22 -9 2 -8 -4 -34 -6 -3 4 -22 -16 -1 -6 3 -17 -16 7 7 -11 -13 1
5688 1 9 10 6 -2 7 19 2 -3 8 14 6 4 3 0 8 19 -8 -11 5 9 0 -6 5 10 4 -8 -15 -5 4 -9 -21 -16 -3 -3 -13 -7 -2 -8 -12 -31 -24 -8 6 -26
5732 -26 -14 -21 -4 -8 -2 -14 -12 5 -15 -13 3 14 -3 -7 -12 -10 2 5 -20 -7 7 22 -7 -8 12 14 25 16 -8 12 21 6 11 3 8 7 13 -12 -13 13
5772 13 2 -21 -2 10 2 5 -8 -13 -9 -12 -25 -29 4 -6 -16 -26 -21 -6 -15 -3 -15 -17 6 1 -19 -16 10 -8 -25 6 -16 -8 6 -12 -32 -2
5808 -2 18 -1 6 7 4 9 -9 -25 8 29 1 1 4 7 16 14 -20 -3 25 -4 10 3 7 13 9 -23 -15 12 -7 -2 2 -22 0 -1 -17 -26 8 2 -28 -8
5848 -8 -10 -12 -1 -13 -19 -7 -5 -5 -10 -14 -13 8 -14 -24 -6 7 -10 7 -8 -16 24 15 -34 12 39 -15 3 20 -5 9 27 -9 4 26 8 -15
5884 -15 17 -6 1 28 1 0 6 12 -8 -8 -9 3 13 -18 -15 10 -13 12 5 -21 -4 31 -34 -37 14 1 -14 5 -6 -34 14 3 -42 -5 18
5919 18 -12 -13 1 -22 -9 19 -8 -20 5 4 0 -16 -1 18 9 -24 -8 22 4 15 11 -25 16 14 -18 -3 23 -6 -10 12 -20 -8 25 -4
5953dj7L3pj3K2j2k3K5Ol3J6Rj5olj2M0j0k1K4j7ORj5j8N5j8m0L9J3j8J2J2m2
5987b3K9J0k1kK2j6pkJJ1J0mj9LJ0K2k4j3L4j6qoJ6j0J8kk8pM6k0l2K3Mj3K2K
6023A0l1K9Rm2kL3j9qL2k3pQNk1J3L6m0j4K4Lj1K2j6j5J1K8k3LJ5mk0OJ2qJ4R
6059A8l4%L0Jl7K9K5l5KK0l1J6K6l8k7M3Lk3J0kLjNk4J3J7j1j2JJJ2mj9J8mj2
6095b1QMj3K5j0k9QL1j4%%rMK1k0jK2j0j5jKK6nOk6K2KoLkJ3Nk0j0J9n%J2k9j4
6135b7N0pm1K8J8m1OK6m8L3K5n7J8J9j3oJ6j3nK8j6j1J1Qj6J2j8NJ7%j1Pj5J7
6169aj8JK4Pk2oK0qRKj6MK8j9k0L7%l6K3kl0N0%m1PK9k1%J0j7NRj9pK2Nj4Qk6
6208b3K2Lj7j1K1lj1Oj0JK5k2j7K0J0Qlj3nMNj4J7J4k2J6j7OJ6Jj3OLLKj7jK2
$$ plain form
5953 -4 -21 12 5 -8 14 2 -21 4 10 -23 -7 2 -13 -19 -22 -34 6 -4 -25 -1 -18 -12 -3 -18 -36 19 1 -39 0 13 -5 7 19 -23
5987 -23 6 16 -5 -7 15 -1 -8 -10 -9 2 12 8 -11 -8 2 24 0 -13 21 5 -3 -9 7 -3 15 13 -15 -22 24 4 -28 -5 -1 -14 8 10
6023 10 -21 8 17 -25 -27 6 -13 -21 11 -12 -19 -11 -6 -27 -14 22 -18 -32 -8 -5 -16 6 -10 -25 -14 14 -9 -6 9 5 -15 -9 3 -5 9 18
6059 18 -16 -16 14 15 -22 7 32 -3 -1 19 -12 4 30 -8 -35 8 11 -12 -2 -4 -1 -2 3 -21 -8 9 -2 -14 -13 -12 0 -4 -23 -5 -9 -21
6095 -21 -13 -9 -22 3 -7 -36 -28 3 -11 -11 -11 -20 -16 5 -15 -16 6 -4 -19 -20 -18 8 3 9 -17 5 7 1 4 2 15 20 0 -10 9 4 4 16 -13 -27
6135 -27 23 16 -25 3 21 -20 -14 12 -36 -3 22 -35 -17 2 -11 -17 -1 -14 -19 9 -7 -18 -7 1 -15 -3 -21 -16 1 1 -10 -3 -18 -1
6169 -1 -19 -18 6 13 -9 -15 5 -3 6 8 -8 -4 24 5 -15 22 22 -14 9 7 -23 27 27 -14 -7 22 1 1 11 -6 -1 8 -11 -18 4 9 -5 3 -23
6208 -23 -1 2 -15 -26 -5 -8 -19 -13 -23 -22 3 -19 -36 -16 -6 2 -1 -14 -19 -15 -10 -24 -7 7 -15 1 -16 -10 6 7 -6 0 3 6 8 -9 -10 12
6246A2jj4jPLJ0j4pJ1J0j5j8L8k1kJ1k4KK6j0j4lJ1lMlpJ7j5j6QK8j9J0rkPmP
6285@j6LQj3KJ5Mjj6j6J9K5mj0JmJ7j3KLQlj9mJ3KJ1mk5K0p%RJnJ1k8kK4Ok5l
6327a4OlNmMomPj3ML0j4j6qK7pRqqmK9k0j7J5K1j4ml%J1J2k1j2M0j7j5J8MjMj2
6368AqJ2K2k9j1J7lj3J4lKQmk7PK6j7j3J3lj8K1Kk4J4K7k4j3J4jj9J0J2j6QP%
6405inK1mk6J1RKRj2k0J7L3k3j1J0Lj2J6k5J1K4k3j3K0%J0mj5JJ8mj8J6rrJ5j9
6442a5%J4Ok7K2Lk7K7j6oJ8mj2nQMRk4MJ4mmJ3k0jL1k4j9L7Jl6L1Ll3L2K3l9M
6480a2M7l0j0J7qJRj6k1M3j4j3J0j1%J3k1QK7j8Nkj5NK1l2oL8jm5K6j4j3L9pl3
6516c3K9K0l6RJ6l1J6J3k4JL8j5j8Oj1K0Kmj1J5pKJ1k4K8lk7K0J6ok5J9j5NJ7
$$ plain form
6246 12 11 -3 -4 3 6 16 2 -5 6 16 1 -17 21 0 -2 9 -15 -13 13 3 -11 -14 -3 -6 -2 -5 -12 5 -10 -26 -18 10 -9 1 -8 -10 -3 -7 0
6285 0 -16 -13 -5 -18 -16 -1 3 2 -14 -30 -11 14 10 0 1 -3 14 1 3 6 14 11 -8 -12 1 3 14 10 -15 5 -2 -2 7 8 3 14 -14 -16 8 14 -11 -14
6327 -14 -8 -11 -6 -10 -6 -12 -16 -9 -22 -18 12 -2 -18 -26 1 -6 3 -5 -13 -17 12 -8 -25 -10 11 -3 -7 -10 -10 1 13 -8 -20 20 3 -12 6 10 9 13 1
6368 1 -7 5 27 -2 -13 4 1 -12 2 -1 1 9 5 -22 -15 11 -6 -19 -6 -9 -27 -6 -4 -28 -14 13 -11 -24 -10 -11 -30 -20 -8 -24 -16 -9 -9
6405 -9 -14 7 3 -23 -12 -3 -1 8 -4 -24 -7 26 3 -8 2 5 -7 9 -16 -5 19 -4 -17 3 3 13 9 -6 -5 13 9 -9 7 -2 -11 4 -15
6442 -15 -15 -1 5 -22 0 3 -24 3 -13 -19 -1 -5 -17 -22 -14 -10 -1 -25 -21 -7 -11 -15 -2 -22 -23 8 -16 -35 2 3 -33 -2 1 -32 0 23 -16 -12
6480 -12 35 5 -5 12 4 5 14 -2 -23 20 6 -7 3 -8 -8 5 -16 -8 19 1 6 4 -11 -6 15 -17 -23 15 14 -31 -5 -19 -32 7 0 -33
6516 -33 -4 16 -20 -11 5 -26 -10 3 -21 -20 18 3 -15 -9 -20 0 2 -2 -13 2 -5 -3 8 -16 12 9 -18 2 18 12 -13 6 -9 -4 13
6551A3j3qL0rk1K2j1pK2%m1K1Rj9J7j2j3J5jj8K3lj3J2%k6L4Lm9K5J7l1K2Pk3
6586b6QK6k9J3J1Lj6o%LJ4oJOqRjj5K5Ok1JJ8k0J2Qk4J1Oj6J1J0rj1J6j0pK4J
6625A8l0J1Nj1KQk3L2ql2J3LRkj1JJ0L%M%j5J6l0RJ7J0l2K6j1QPkj3J7ljrkJ3
6665GPrj6K2Kkj4NJKMk0K7%%j3kj1J4Oj6JJ3qKqpK4qk2Oj2QK0k6MK3j4j8K0jj3
6707b2K6k0j1K0J6k5j3K4kJJjmK7j7j9J6J0%oj6J8L%NKj1Mjj7JK4j3mJ4k9J8J9
6745A8k9j1K9j0k0K1%j3J3qj6K6KkJom%JqK0Kj3j5MJ7jpk9M0Rk3J1LqJ9nj6NK6
6785B3k6PJ9k2QRj8oK8rj9J4k3K8Jj2j3J7Mj9J3oj1J2lj1QJ8l6J6J5qQQl5PJ7
6822Cj4QrrJ8pqK1JlPj8j1J8J3k7J5NqNPj5J7J1l6RK6j7qK3j7oK4pk7K4J5l5J2
$$ plain form
6551 13 0 -8 22 13 -8 14 3 -4 18 18 -23 -2 7 -12 5 -7 -20 -5 -6 -24 -1 -4 -17 -5 -5 -31 3 6 -43 -18 -1 -32 -10 -3 -26
6586 -26 -18 8 -21 -8 3 6 -10 -16 -16 -13 1 -5 -4 2 -6 3 2 -13 12 18 -3 -2 16 -4 8 16 -8 3 9 -7 4 14 5 -6 10 0 -7 17 18
6625 18 -12 -1 4 -7 -5 3 -20 12 4 -28 -15 -12 -3 -5 -16 -15 -5 -2 -2 2 2 -13 3 -27 -18 -1 9 -23 3 -8 0 7 5 -8 9 6 5 -4 -6 7
6665 7 14 5 -11 11 13 11 -3 2 3 5 9 -11 16 16 16 3 1 -10 4 10 -6 -5 8 0 2 -6 -13 11 3 -19 -13 -25 -17 3 -23 -19 4 -10 -28 -8 -9 -22
6707 -22 4 -16 -27 -7 9 -16 -29 -5 -7 -6 -5 -6 -10 17 0 -19 -3 7 7 1 -15 3 6 6 11 13 2 6 5 -12 -11 13 0 -4 10 -19 -1 18
6745 18 -11 -22 7 -3 -23 -2 -2 -15 -2 -10 -26 0 2 0 1 -5 -9 -9 -8 -16 4 6 -7 -22 -18 -1 -2 -9 -38 2 11 -12 -1 2 -6 13 8 -8 -3 23
6785 23 -3 4 23 1 9 18 0 -6 22 13 -6 8 -15 13 14 2 -11 6 10 -9 4 -2 -13 -1 -4 -15 -7 11 -25 -9 6 -2 6 14 -21 -14 3
6822 3 -11 -3 -12 -21 -3 -10 -18 3 4 1 8 -10 -21 -3 10 -17 -2 3 -5 0 7 -8 9 20 -16 -7 19 2 -6 17 0 -6 18 11 -16 8 23 -12 0
6861@lRPj2oJNnJkKJ7j2k3J9oJ4Pl4NK3jk6J2NpPJ7l6L3J2m0nK5onJ4j2NK6l0
6902epJ4J5j1k2L1mLMr%o%mjOJ3kj3RqRmKj7K8qk8J3Kjj7JO%J7j4j3MJ5oOj0R
6946cjj6j3J9J7mj0jNMQj7K0nlMlQMj6mJNJMJ4k3mJ5%pJ7pj2LRlpJ7j2j6K1kj5
6990hJ6pqNknJ3KpnkJ3j3j5J2J6j4J3k1PJ4j0j3lJ1OjPJ0l2J9koRkrOJ9qJ0lo
7032FjK5k5lPJ0k1nnJ4J3mKj3J1Nj5mK0j2Nk4J8j0J2j0kpJ3Rj7QLqJ0qj7J3J0
7071Cj6JLNJ4j5PqPjMpJ0J0lk7J1J8j3nJ6Nk0K0j4lK2j0k3POkJJ3j7MPj7MMJ0
7112A1Jmj4J1J3j3Nj8J1mmnNjj4J6ooJ7J3k8nL1j6j5K0j1qJ8kj2J4J4k0lJ2jo
7150dQRjNkLqMorj1K5JrJ6j6j1K0Ok5QJ2l0OJ9l1J3K2l0j1L8pqkJ1j5Mj8NK5o
$$ plain form
6861 0 -3 6 13 1 -5 -4 1 -4 -3 -5 -3 14 2 -21 -2 -8 6 13 -21 -16 7 6 -20 -8 -3 -10 -3 14 -22 11 23 -17 -22 3 -3 -8 6 -6 -1 25 -5
6902 -5 -12 2 17 6 -16 15 11 14 18 9 9 3 3 -1 -2 4 17 15 2 11 3 12 8 10 -7 21 13 -15 -2 0 -1 -18 -17 -11 -11 6 -8 -21 -17 -2 -8 -2 -12 -3
6946 -3 -4 -20 -33 -14 3 -1 -11 -12 -7 -3 5 -12 8 3 0 4 1 9 13 -3 -7 -6 -1 0 4 18 -5 -9 6 6 -1 16 9 -3 0 9 6 -1 16 4 -12 9 7 -8
6990 -8 8 1 -7 -2 -4 -9 4 6 -1 -6 -8 5 -8 -23 -11 5 -9 4 -17 -10 4 -6 -19 -22 -11 -5 -6 1 11 -21 -2 -4 -10 -1 -3 -12 -6 13 5 15 12 6
7032 6 5 30 5 2 9 19 -2 -7 -12 2 15 11 13 0 11 16 1 -3 17 5 10 -14 4 -6 6 -4 -6 -13 0 9 -8 0 3 -5 5 -3 -20 -7 3
7071 3 -13 -12 -9 -4 10 -5 2 -6 1 0 4 -3 7 17 14 -13 -2 16 3 -2 14 19 -1 19 5 2 24 14 -9 -2 4 2 3 16 -1 3 10 -7 -3 1 11
7112 11 12 8 -6 5 18 5 10 -8 3 -1 -5 -10 -5 -6 -20 -4 -10 -16 1 14 -14 -19 12 -4 -19 1 -10 -18 0 -2 -14 0 14 -6 -9 3 2 -4
7150 -4 4 13 12 17 15 18 10 14 8 -1 -12 13 14 5 21 5 -6 14 20 -5 3 15 -15 -9 10 -21 -8 14 -16 -27 11 4 -4 -6 5 -10 -6 -24 -19 6 0
7191@kj7%LJ2j5J0J5j1nQj2%K0j8qL5j3mQKqJ0Pj8%J5J0j6nlJ6pj7J3Mqj2JNJ
7232dOk6J3K3k0J3Kj7KJ0j5oK2Qk4MKmJ0kj2J9Krj3J3NmpnJ3kJ2j2j1J5J9k3M
7271AJ7j0j8J2Nj6J6Qk5KJ6M%NnKqj0JkJ7j8ojJ0LjLpj1RNj8J3Mj4MQpLOj2KN
7315hKmjPkjkLj0J7Ml3K1K4k3kK2lj6K2mk9L5j5j8J5NPpJ0j1LJ0j8NqJ5J2j1j5
7355bJ9j7rJ1Jj2K1lk5QRpj2J9j5JNj5K5JrqJ4lJj3MJ7Nj0pQj3JK1j2JL0l2lK3
7396A8lj8K3j7j2NK1k9J1J6k1RJ2j6O%pllJ1molPpjJ3k0NKJ0j2K0mk7K0J5k7J4
7435bNk1pL0qnMOmlOk1K0J1j1lJ2NJ0k1pK4lrkOmPpqJ7Rk4LQj7J0J1j2j2J4qk
7478cRnqPkMnJ4lj5jnJ1k2K1J2k0J1Lk5J6Qk3J1J9pj4J6%k4K7Kk2J3J5j2Pmkj
$$ plain form
7191 0 -2 -19 -19 -16 -4 -19 -9 6 -5 -10 -2 -14 -14 6 -12 -20 15 2 -2 6 8 0 10 17 -1 -1 14 24 8 3 0 16 9 -8 5 9 1 -11 -10 -5 -4
7232 -4 2 -24 -11 12 -8 5 7 -10 -8 2 -13 -19 3 11 -13 -9 -7 -11 -1 -3 -15 4 6 -3 -16 -3 2 -2 -9 -14 -1 -3 9 -3 -14 1 20 -3 1
7271 1 18 8 -10 2 7 -9 7 15 -10 -8 8 12 12 17 12 14 6 -4 -3 -5 12 -6 -12 -13 -3 0 -1 2 -5 -16 -7 -2 -20 -7 -3 -17 -13 -5 -12 -9 -3 -15 -13 -8
7315 -8 -6 -10 -11 -4 -6 -7 -9 -6 -16 1 5 -28 -7 17 -6 -8 14 11 -5 17 13 -16 19 4 -14 1 6 13 6 16 5 8 18 0 5 -3 12 24 13 -2
7355 -2 17 0 -9 2 3 -9 12 9 -16 -8 1 -6 -18 1 -14 -13 -8 -23 2 3 -6 -14 0 -3 -2 -15 -11 6 11 1 -6 2 -11 -10 11 -1 0 30 -2 -5 18
7396 18 15 -3 20 3 -9 -4 17 -12 -1 15 -6 3 15 -1 5 5 -2 -5 -8 3 -1 -7 -10 -3 -10 -11 2 -18 -13 -11 -1 -13 7 3 -24 -4 11 -16 -2
7435 -2 3 -18 -25 5 -3 -8 -4 2 -2 -5 1 -20 0 11 0 -3 9 14 24 3 -4 20 17 8 6 12 8 15 8 0 17 26 2 5 13 -4 6 17 5 -7 7 -1 -3
7478 -3 6 1 -7 0 -2 2 -3 11 8 -7 -8 -13 -2 -24 -3 9 -11 0 3 -22 -6 2 -21 -10 9 2 -12 4 4 -20 7 9 -13 0 15 3 10 6 4 3
7518CKO%Jn%k2L0Mk0MjjJRj1rJ4%j5mJ9j2kJ4r%J7k0j4L5j4p%OMj2KjJ2kJ3j8
7561cj2K9j2JJnjQJKoK2j9j5J1J0j2J4mLnMKk8K1J7k9JK5j8j0K0pj4K1Lj8pJ5
7600Fj5OqOOoMnjJ5pk8J1J2qJLj3J6J6j7LmJ0k0%J2KJ2Jmj2Rk%jRj7J1%j2J8J2
7643B1k6kJ9oOomQj0J7k3J8rRlrJ0pj0mQmkjj0KK9j2k5LK1%JkoJ9k0M%lJ4j3k
7686a0QMkJlpmK4j1j0K0Lj8OOj7J9Nk6J3J3j4LJ2k5K3nqkJ8j3j5K6k4QJ8k5lP
7725ekj3J1LkJ5l1%L4k4oJ9k4%J7qoJ6J2k3JJ2nKNj1J2J7k0RlLRj1pJ1J7j9mJ0
7765A1j0PJ5k3j0L0j7jKQqJ6j5k4K8kj2J9j4j1K3j5j5L1j0k0NJ6j9KJ1j5J6lj9
7800b3K3j1pK1kk1J9Rk3K0jj9J5J2j2JJ8l2J4OqOJ3j8j6L8j9rJ0lMJ4j2k3M4k2
$$ plain form
7518 3 5 11 11 12 7 7 -15 15 19 -1 3 2 1 2 11 0 -9 5 5 -10 -14 5 -7 -9 5 -4 -4 13 -7 -21 14 0 -7 -7 -1 3 -9 -7 -8 4 2 15 -3
7561 -3 -15 14 2 3 4 -1 -2 6 7 9 3 25 6 -9 2 12 0 14 10 13 8 12 14 -14 7 24 -5 -4 21 3 -7 13 6 -8 13 16 -2 -9 6
7600 6 -9 -3 -11 -5 1 -5 -1 -6 -7 8 1 -27 -16 -4 -12 -11 -8 -21 -5 11 -6 -3 -7 3 -17 -17 -5 -3 9 10 6 -6 3 1 1 0 9 -8 3 3 -9 9 21
7643 21 -5 -7 12 6 12 6 2 10 0 17 -6 12 3 12 9 0 10 3 -7 -11 -3 -7 -9 -10 -20 -18 11 -1 -26 -23 -2 -2 -1 -3 -9 10 -10 -6 -6 -9 5 -8 -10
7686 -10 -2 2 0 1 -2 -9 -13 11 0 -10 10 13 -5 1 7 -10 9 14 -12 1 14 0 3 15 -10 13 8 0 -2 16 3 -12 14 -10 -2 16 -9 -12 -5
7725 -5 -7 -20 -9 -6 -8 7 -24 -24 10 -14 -20 -1 -25 -25 -8 -16 -22 -6 6 -17 -16 -4 -9 -7 -2 -13 -1 16 -4 5 2 5 14 3 -4 7 24 5 1 11
7765 11 1 8 23 0 -10 20 3 2 4 12 4 20 5 -19 9 7 -5 14 0 -11 12 -3 -18 13 3 -17 -12 4 -15 -13 -2 -17 -1 -4 -23
7800 -23 0 -11 -18 3 1 -20 -1 8 -15 5 4 -15 0 12 0 1 19 -13 1 7 -1 5 18 0 -16 22 3 -6 4 1 5 19 7 -16 28 6
7836Fj1J8l0QJ9lk0K2pk1K4pj9K9qj8J7Qk9K3p%Pnk4K0OnKKj2J4Kj8J5J3j1Pm
7875Cj0RK1l9QL2l1LK9j4j1J8k0MJ5k2PQppK1qj7J5orQj1LOnj8K2j0R%jj4J8k
7915coJ2j1nK5j6k6K9mj3J2KmJ7j2rJ6kkJPpqJ4j9J2NkRpKNMj5J2jjnMjmQpOr
7960CJ%pKoMNqJ6j7LMmj4J8nlQJj1JKm%KMjqROjmKoLJ4kokkNJoj0K3NqrmNJ5j2
8012BnK7j4mpJ1k0J9Jk0K0knj2Pj5J7J3k8MJ3nj0LmOKlj1NMJ3j9PNJ1j1nLKNK
8054BqQJ5k5lJ9mj0Rj0MJ9mj6OJkOnnJ1J4j4npQjj1MpJ1JRpj0OQj4Mo%NLj1MK
8100fmjJ3k2J3lnJ6rKjJ1j1MLj2K1p%jJ9j7krMQLjj6K2j0kpJ2LqLKrRJ1k3QK0
8144B1k0j1J0nQ%nJJOjk2J8%rJ5j1j1K2j0lj3K5qj3J0nKKKnJJ9j8jJ0J3j7NJK
$$ plain form
7836 6 -5 13 -17 -9 10 7 -13 9 2 -19 5 -2 -21 8 0 -18 -1 7 -22 1 -6 -6 1 -4 -28 -8 -2 -7 -5 -3 -15 -1 1 -17 -2 11 0 7 3
7875 3 -7 2 23 -16 -8 24 -7 -4 25 11 0 18 -2 2 17 -5 2 10 3 -4 17 9 -8 7 1 -8 0 -11 -8 -2 -7 -25 -3 -13 -4 -4 -5 -19 -1 -3
7915 -3 -9 3 -8 -13 12 -4 -30 -1 -5 -18 -6 -4 -8 9 -3 -12 4 2 0 1 8 1 -7 7 -12 0 5 3 12 5 7 12 16 1 13 12 11 6 10 9 5 13 6 12 3
7960 3 4 4 -3 -1 -7 -3 2 -6 10 -7 -4 0 -4 -18 0 -5 -8 0 1 -10 -9 -7 -11 -11 -9 -5 -6 -14 -5 1 0 -4 -2 -8 -5 9 7 1 -1 -3 2 3 -3 -13 10 15 7 -2 -6 -1 14 2
8012 2 -3 24 10 6 -1 10 -10 9 10 -10 10 8 3 -9 -2 -17 0 13 -15 -11 2 -3 -13 -10 -14 -8 -6 -9 -20 -15 -11 2 -17 -10 -5 6 -5 -10 -7 -5 0 2
8054 2 -6 2 17 -8 -11 8 4 -6 3 -7 -3 16 12 -4 2 3 1 7 2 -3 8 22 8 3 -4 4 3 -8 -4 -11 0 1 10 3 -7 -1 7 -7 -3 -9 -9 -4 -1 -12 -8 -6
8100 -6 -10 -11 2 -20 -7 -10 -15 1 -8 -6 -7 4 -7 -3 0 -12 9 2 2 1 20 3 1 -8 -4 4 7 6 -10 12 2 0 -7 5 8 0 3 5 -4 5 16 -7 1 21
8144 21 1 -10 0 -5 3 3 -2 -1 0 6 5 -17 1 1 -8 7 -4 -15 7 -3 -6 -19 6 -2 -15 -5 -10 -8 -6 -4 -9 -8 11 -7 -8 2 15 -2 3 4 6
8185FLkJ2j4J9o
$$ plain form
8185 6 9 7 19 5 24 18
8191A8
$$ Imaginary data points
##PAGE= N=2
##DATA TABLE= (X++(I..I)), XYDATA
0@%%%%%%%%%%%Qj6J6j6J6j6K4l2L2m0M8n6O5p3Q8j01J10j22J42j65J85k06K30
34A21k58K90l22L54l92M37m84N35n92O55p27Q06q94R95j108J239j394J577j797
53i59K068k414K874l513M471o082R441k6900L6841K0618p9839N3482K5092p0534
67c5354K0881N0559n1318L914L8405l5840j0599L3993j7180k378J9645j9355m968
80i595J7881j5329L436J8900j8254n817J6961j3100l121J8197o350q098N539m953
94c703K118M442n267Q211r32j7392J3226Q543k1044J3545J5905k9611K087K4308
108A4436k0975k105K5571j8064j0655K0408j1562n568K0680j2067p103J7144j7186
121g046m914K8835j6303j4885L0601j4524k5453L5809J473l3140K6132J0598l7810
$$ plain form
0 0 0 0 0 0 0 0 0 0 0 0 0 8 -8 8 -8 8 -8 16 -16 16 -24 24 -32 33 -40 48 -53 57 -65 77 -88 97 -109 121
34 121 -137 153 -169 185 -207 230 -254 281 -311 344 -383 423 -471 524 -584 655 -739 838 -959
53 -959 1109 -1305 1569 -1944 2527 -3555 5886 -21014 15827 36445 -43394 10088 35180 -35354
67 -35354 -14473 36086 -15232 -11318 27087 -8753 -19352 14641 -2539 -4917 14728 -4627 -9595
80 -9595 8286 -7043 -3607 15293 -2961 -8778 8183 -4917 -8038 10159 3809 -4289 1250 -3703
94 -3703 -1585 2857 -2410 5801 4869 -12523 703 9246 -11798 1747 17652 -11959 -9872 14436
108 14436 -6539 -8644 16927 -1137 -11792 8616 -2946 -8514 12166 99 -7004 10140 -7046
121 -7046 -11960 16875 572 -14313 16288 1764 -23689 12120 13593 -19547 6585 17183 -20627
134b0627J4332K5403k6220K25K1729j8808q226J8731l887o101P916l513m138J481
148a703j444O840J752r920M654L100j1495P758J0267j3229M52R474j1990m42J3644
163G718o982l598Q082q622k792J1613m929l276R209p769o033J1441k954n669J0627
178F066l137j0176P537K038n517N965M17o145K851p44j827O388k577l706O622
193D055n470o031J2567p31j0812R907J397j4190Q532Q950j2673K615R824j1614
207c674l090J1668l372m554O516k240n527L426K249p07J46o51L53j793k209N160
223A701J877n462K171J721o502L154O254n814n57N061n832j779P014j982k298
238a273M257l483l508M992K57j924K830j723k789K311l24j78L045j770k046J517
$$ plain form
134 -20627 -6295 19108 -7112 -6887 14842 -3966 -12192 6539 2652 -3449 4467 954 -3184 -1703
148 -1703 -3147 3693 5445 -4475 179 3279 -8216 -458 9809 -3420 -2968 6506 -5484 -5926 7718
163 7718 736 -2862 5220 -3402 -6194 5419 490 -2786 6423 -1346 -7379 4062 1108 -4561 6066
178 6066 2929 -7247 290 2328 -3189 2776 3193 -2952 -101 -845 -2672 3716 1139 -2567 4055
193 4055 -1415 -7446 5121 4390 -6422 3485 4882 -9308 -776 8174 -4499 -1884 7940 -3674
207 -3674 -6764 4904 1532 -3022 3494 1254 -4273 -847 1402 695 841 190 543 -1250 -3459 1701
223 1701 3578 -1884 287 2008 -4494 -1340 4914 -900 -1457 3604 -2228 -4007 3007 1025 -1273
238 -1273 2984 -499 -4007 985 1242 -682 2148 425 -2364 -53 -377 -555 2490 720 -1326 191
254A91j917N47M415k695k217L444k891k186N944q79l966M278j101n531M789L169
270C394m752J497K132m811M96M183j777r32K166j507k124J126J753L90r57l04
286b7J76j780M44L376j398k161K827j212l573L850K126l794J390J547m405R45
302a669M329k439j256K837k014k183K711P20j184J055l02j964K16J406P07l25
318F45p62J36m24r08J522J251j518Q2O07k249L60L096j011j617J497r00j638K225
336C94Q97j670P50L63k108K79J963j69n02Q9p88m03Q16N86Mk74k66j46n31J58
356e58J393J36j242k8J45o52Q66J072j089n10Q67p20p05J460N78j104m8J70q20
375g89M26J356m73j034N25J91r38L73J244m33q20M66k63p76J276R56j601m05J324
$$ plain form
254 191 -1726 -1179 3236 541 -1676 1768 -1123 -3309 2635 1756 -2210 2068 967 -4564 225 3394
270 3394 -1358 139 2271 -2540 -2044 2139 362 -570 1596 89 -2035 -909 844 1234 277 -27
286 -27 149 -1631 -1187 2189 791 -1370 1457 245 -3328 522 2648 -1146 244 1791 -2614 -1669
302 -1669 2660 221 -1035 1802 -212 -2395 316 1036 -148 907 605 -1359 -1143 263 970 645
318 645 -117 19 -405 -1313 209 1460 -58 24 631 -1618 -1258 1838 827 -790 707 -193 -1831 394
336 394 1291 -379 371 734 -1374 -1095 868 699 197 286 -502 -905 -89 497 501 227 -39 -185 -716 -558
356 -558 835 971 -271 -299 -154 -806 60 1132 43 -467 400 -320 -1025 435 1013 -91 -139 31 -789
375 -789 -363 993 520 -514 11 202 -736 -363 881 448 -372 94 -169 -945 331 1287 -314 -719 605
394F05q32p75J786P2j647R16M55j863R14K062j690j067J731n99j252J798L72j848
412h62Q16R67j817M6K059p20j338J080Q4j233R84J001j463k31J502q81j181J636
430D49M97j566N21P67j473L39J649j252q43J670m39j366J260M42j133O38L75j295
448g60L68J124o49l78M86j99k11K23qQ0J13j75j33j64J27O07j98o63L68K18m15
469b39K78K02l83K21J12n22J46M20q3l8k73j63N89j08n40O04L1o86O34M3r58R34
491B21O57j495J80J145r89j09J141q81n05J280n28r39J138K52r27K78K43m72L76
510F6L37n03j65L34J00k63j49M67J17o49J39M19n35K75O82j045k83J339n04r35
530g56J181J7j160Q50M01j253O45J052j333m10J343l46p89Q48M3q94N80N44r37
$$ plain form
394 605 -227 -1002 784 856 -791 125 580 -1283 -369 1693 3 -1064 667 68 -1184 614 986 -862
412 -862 -46 921 -896 -850 1209 489 -849 231 315 -918 66 1067 -396 -627 875 -6 -1187 449
430 449 946 -620 -99 668 -805 -466 1183 -69 -912 758 319 -1047 213 655 -478 160 535 -760
448 -760 -392 732 83 -295 191 -8 -219 4 -4 76 189 14 -119 -283 -156 451 253 -410 -42 176 -239
469 -239 39 241 -142 79 191 -331 -185 235 152 114 -159 -322 267 159 -381 223 254 -432 202 245 -713 221
491 221 878 -617 -437 708 -281 -390 751 -130 -635 645 117 -822 316 568 -359 -81 162 -310 66
510 66 403 -100 -265 69 169 -94 -243 224 341 -308 -169 250 -285 -10 672 -373 -656 683 179 -756
530 -756 425 442 -718 132 533 -720 -75 977 -356 -766 577 231 -558 290 333 -561 19 563 -374
549c74l9J053m43q54P09L66p34L04M91q76K5J005o14o62R97L9q73M48L22n90L61
570F1L72p84j4P48k45l94L12K7j88J13J5j29J12J91j66l33K03M18k57k68K72q6
592b0o2L10k99k10N97j79m95M70m2l26O43l05p30J034N8j163Q45M38j235Q71N38
613G38j716Q01J371j821N5J631j514k32J809j427o22K124j120j312J969l47j269
630h82J556l73j385J563J31j415J031J89r65Q22j68p07J189l40r94J207m77p36
648g54J771q50j497K267l85k107K304J58k484K221M80l002K124J443l194J332
664a73J725k996J183K040l161Q10K552l099J59K780k700n6K938k820o20L417k250
681b71j324L248j697j488L094j464j814L088q86k040K517n76j725K413p05j877
$$ plain form
549 -374 -413 640 197 -657 52 418 -316 -12 479 -397 -372 633 19 -643 354 393 -480 -32 290 -300 61
570 61 433 -351 -365 383 138 -256 56 83 -105 8 23 -106 6 197 31 -302 -99 319 62 -206 66 -20
592 -20 -82 228 -71 -281 316 137 -358 112 70 -256 387 82 -648 386 444 -719 126 564 -671 200 738
613 738 -978 -177 1194 -627 -572 1059 -455 -687 1122 -305 -927 1197 77 -1235 734 387 -882
630 -882 674 301 -1084 479 610 -805 226 415 -550 272 104 -603 586 246 -748 459 -18 -754
648 -754 1017 167 -1330 937 552 -1555 749 907 -1577 644 1124 -1878 246 1689 -1505 -173
664 -173 1552 -1444 -261 1779 -1382 -572 1980 -1119 -960 1820 -880 -936 2002 -818 -1438 1979 -271
681 -271 -1595 1653 -44 -1532 1562 98 -1716 1372 486 -1554 963 387 -1338 1075 370 -1507
697a507K463l47j954K080l67j596K239o17j874K447m52k009K542n35k258L019
713A274m42l161L340N49l811K819J203m193K574K313m552J424L253m061J85L581
729B295l092m82L360k643j093L333j620j320K528j392j102K493j277j213K452
744A227j027j451K126p61j167K158q86j533K099m34j365J838o32j324K096p00
760B64j681K335k89k025K145q2k262K310M20k771J785J178k523J104J233k242
776a101J004J338k219O61J429j931O08J290k035P37J644k447K33K333k019m22
792h97K291j760q84K529j036j520K063k64j529J251J27q80R40j79q53P48m6l23
810b22P42o54m25J173o42p15J348k97r56J030k82q87J294K0j198P86J55q04Q25
$$ plain form
697 -1507 956 609 -1345 735 368 -1228 1011 394 -1480 967 515 -1494 1048 513 -1745 1274
713 1274 832 -2329 1011 1560 -2251 568 1771 -2422 152 2465 -2087 -663 2590 -1471 -1286 2295
729 2295 -797 -1279 2081 -562 -1655 1678 58 -1262 1266 -126 -1228 1265 -12 -1225 1227
744 1227 200 -1251 875 114 -1053 1105 219 -1314 785 351 -1014 824 192 -1132 964 264
760 264 -1417 918 629 -1396 749 667 -1595 715 1135 -1636 149 1327 -1196 -92 1141 -1101
776 -1101 -97 1241 -978 -317 1112 -819 -211 1079 -956 -219 1425 -1022 -789 1544 -475 -897
792 -897 1394 -366 -1250 1279 243 -1277 786 522 -1007 244 371 -509 431 252 -601 147 101 -222
810 -222 520 -134 -559 614 -28 -743 605 308 -648 382 100 -787 507 527 -671 115 270 -534 291
829B91K3r03R27R8j231P88N73r61M80L50j029M53P33q04pN15l73L1J02l04M22
850A74Q0n05L36l0m48P08Rr01O66M45r51J86O00n12J22L40n56L1L93j92N6p5j50
873a74M30k42m92P14J08o85N02j7p58Q40L23j059M73M94q88L47M60p70N01M49
893E56j125L17Q01q34K25O30j068J80J019r84j77J125o59m51P79m68j85Q81n18
912D4m89O64k40j60N05m46q7O63o10k67Q23m06j86O68p18k76J095n13n82R61l74
933F9n75R28m07o74J260k54j119J005J08r80R41J73j228Q43N82j306M07Q52r09
952b84J18O31q44J13P96o34j89N57l23l5K81m36J93M52n74l0M38m05J37M39o83
973b82KP57n76k72P10l32k41N73m06l67Q02j29o07M64K2l63M42j00m17N09M3n31
$$ plain form
829 291 314 -589 338 436 -795 -7 566 -395 85 435 -594 -141 592 -212 -219 296 -77 -46 56 -248 174
850 174 254 -251 85 55 -393 315 324 -577 89 534 -417 -231 369 -143 -21 319 -237 -206 187 -5 51 -24 -174
873 -174 256 14 -478 236 344 -341 161 144 -614 226 549 -510 -37 457 -431 -84 376 -394 107 556
893 556 -569 -252 549 -285 -60 570 -498 -318 701 -283 -460 665 6 -445 334 -134 -319 562 44
912 44 -445 219 -21 -181 324 -122 -209 454 -156 -423 400 -6 -192 476 -242 -518 577 64 -518 443 69
933 69 -506 422 15 -659 601 347 -772 233 341 -639 302 475 -753 90 672 -634 -227 625 -284
952 -284 -166 465 -379 -266 530 -104 -293 264 -59 -94 187 -249 -56 396 -178 -208 230 -175 -38 401 -282
973 -282 -280 477 -99 -371 339 7 -234 339 -67 -434 368 239 -368 96 118 -245 197 97 -320 189 232 -299
995b99K76J46k73L38n8m99M32K15n22K32K33m34K59J89n92K67N46n42j81M67k45
1016d5j20M09k58k48M63l9m51K06K71j71k5Nr0P5J21k9j51l3K33j3l45J58L44
1039B67k81j25K57k13p7M89k27m65M81J87n72J60M23l94j1L57m23j51O52j09n59
1060c34K89K32l31O8K40j99n0K60j87k89L23L20l60k23L14l0j96K68M5l67J87
1081b0K91n10l7O35j87m26K71J9k55L72J30n00J00L85l37j93M06O7k84M1K7j41
1103a46J53K63k22k86K53J47l15O2L15j70j44J60j74j09M60L7n23R2L10k20n1
1124a08K58r6j46J49p9k06K62K85k71l15K35J27j85J21J73l14j5L40l24k12O35
1145C14J7o65J94L28l68J70L76m81j67N44j99m21M75K36m69n3K38j76J1L76j57
$$ plain form
995 -299 -23 123 -150 188 130 -369 63 278 -244 -12 221 -213 46 235 -357 -90 456 -86 -267 200 -45
1016 -45 -165 244 -14 -262 201 162 -289 -83 188 17 -8 -3 -93 -18 103 74 -77 -110 123 110 -235 -77 267
1039 267 -14 -139 118 -95 -172 317 90 -375 106 293 -279 -119 304 -90 -101 256 -167 -318 334 225 -334
1060 -334 -45 187 -144 -76 164 -35 -85 175 -12 -301 22 342 -18 -241 73 43 -153 115 160 -207 -20
1081 -20 271 -239 -276 359 172 -254 17 36 -219 153 283 -217 -117 268 -69 -262 144 211 -73 -32 -5 -146
1103 -146 7 270 48 -238 15 162 -153 -91 224 54 -90 70 -104 -213 247 284 -239 -147 163 -57 -108
1124 -108 150 54 -92 57 -22 -228 34 319 48 -267 -32 95 -90 31 204 -110 -125 215 -109 -321 314
1145 314 331 -334 -140 188 -180 -10 366 -115 -282 262 63 -358 117 353 -116 -169 69 -107 -96 280 123
1166A23m21K43L01l75q5M92j16m10K47O9l30L88K80o56k8N60k97k37M83r6l48
1187b13K96l9l73L93L05m38j49K65n0n1J28j3j16L8P8j72p6L66J08m91J3L59k38
1210g0l8M09l38k65N68j59n36N48K77n96J12K46l89K16L61m36q8L36j67q7J07
1231A1k4J83j01l36K54J37k72L32mn72M18L41p31K47O02o51m3N19n73L2P79n69
1253b1l74O62k68k63M98k41j66M44l41k35M78j68j8L01n79L6O87o14q8Q15p13
1274a68k47R95q03m12J448o28j051J326j64j108J289M8j385J080M25j418P16P48
1292F91j088L57M97j007M32P04q80K12M43p20L49L52p89N35M77j053L52N50q67
1311d53N20N81j224L92Q68j184K37J004j113J26R77j263K6J420j057l87J222r23
$$ plain form
1166 123 -298 -55 246 -129 -214 278 162 -248 -1 68 -262 126 406 -250 -278 282 -15 -252 231 135 -213
1187 -213 83 44 -329 64 369 -69 -218 47 -3 -54 74 61 -55 -17 61 -111 -187 179 287 -204 -191 168 -70
1210 -70 -108 301 -37 -302 266 107 -429 119 396 -200 -88 158 -231 -15 346 -90 -178 158 -9 -96 11
1231 11 -13 170 69 -267 -13 124 -148 184 180 -392 26 367 -364 -117 485 -166 -209 310 -263 -231 548 -21
1253 -21 -395 267 -1 -264 234 -7 -173 271 -70 -305 173 5 -13 288 -291 -255 432 -182 -270 545 -168
1274 -168 -415 580 -223 -635 813 185 -866 460 296 -812 477 525 -860 220 645 -773 -57 691
1292 691 -397 -40 457 -550 -118 586 -294 -82 361 -359 -10 342 -447 88 565 -488 -136 414 -453
1311 -453 67 648 -576 -184 684 -500 -263 741 -372 -246 731 -532 -506 914 -143 -530 692 -231
1329b31l74J365q65n49J426p31q34J329m46o92J351o16j051J477k45j168J382
1346E28o1j350J259J51j526J229O78j637N66Q04j247M59R28j181J02Q80q76o2
1364c56P77n12O2L91p42J80O05o16K05M02q34L31O43j009K77R79j095j02R94r58
1384c78k3J318j087n66J471p54p85J509m80j022J416l38j314J449K70j443R29
1401A72L80j344Q69O38j335N56P82j226K21P94q36K88O55j053J15Q54p68M3P29
1420E34p86j3P35p80k7R13n91k82N82n06k4P25n55k08O47n27j25O42n49O2P17
1441E84q62k19J007n84l01R87p26n07J222n35p97J274j90j054R77K2j025J035
1459C08L06j282O12O37j035L03O85q06J03O14o95r5O97k47k72K46j31k4J66j02
$$ plain form
1329 -231 -605 760 -105 -654 772 41 -793 536 90 -602 749 133 -918 559 314 -854 528
1346 528 467 -883 376 527 -999 230 908 -729 -163 641 -606 -147 781 -400 -298 582 -294 -356
1364 -356 421 -91 -29 362 -380 -200 405 -211 -6 396 -438 -107 536 -473 -196 783 -312 -414 580 -378
1384 -378 -401 917 -170 -736 735 -19 -804 705 225 -797 619 281 -1033 416 686 -757 172
1401 172 552 -792 77 715 -620 -64 718 -508 -287 507 -329 -41 614 -439 -324 530 -238 -195 534
1420 534 -252 -265 470 -310 -337 576 -15 -297 285 -221 -245 480 -75 -283 364 -163 -288 354 -195 -133 584
1441 584 -278 -497 510 -74 -375 612 -114 -621 601 66 -731 543 353 -701 276 298 -727 308
1459 308 614 -668 -56 581 -454 -151 534 -272 -169 445 -250 -345 352 105 -167 79 -52 -76 90 -12
1479a2K1J1p6J46j69j73N07k7n16K89J28m04L91J60n65K67L26n84P9M80l19pK46
1502A99m09nM56k01j60K22j15p8J30j26O0K08j61j18L0oJ75L9k56Q0J24j91O7
1525c6J19j27J20M9l00O8K47r2k0l4j25J85K8k00J71O0k27J51qk85L87K03n70
1548b36Q9L71l65M6L83l96p3M75l52k69M97k0k71J73r4j51L29l9k12J51mj01Q7
1571A8j04J7L07k04k40K44l4j06L00j76k35L82r7l21L21R4k97K27k1m02M00K36
1593C09m95J05K92l59N2K85k98QL97l22k43L56Nj35J08j16n9J84p1n1J32j10M3
1616A7O8l10J08M19k87k34L67j89j90M36j23l43M27J5n19K86K89l20J05R9l45
1637b24J44K77k45j5J81j60j5M3j14J90J61l11l2J43j03J22J29k94M6K40k86n
$$ plain form
1479 -12 9 20 -56 90 -79 -252 255 228 -288 1 129 -275 116 276 -289 -22 304 -280 -201 279 -40 -47 199
1502 199 -210 -215 241 40 -120 102 -13 -91 39 -87 -27 181 20 -98 -68 -74 101 140 -116 -36 88 -103 -36
1525 -36 83 -44 76 125 -175 -107 140 48 28 -6 -131 54 82 -118 53 113 -114 37 29 -256 131 334 -236
1548 -236 -147 224 -141 -95 288 -108 -181 294 -58 -327 170 150 -121 52 -42 -193 136 97 -115 36 32 -69 18
1571 18 -86 -69 238 34 -206 38 4 -102 198 22 -213 169 72 -249 72 166 -131 96 75 -327 73 309
1593 309 -186 -81 211 -148 -96 189 -109 -101 296 -26 -269 87 92 -43 65 -51 -110 74 3 -48 84 -26 17
1616 17 85 -225 -117 302 15 -219 148 -41 -231 205 82 -261 166 181 -338 -52 237 -83 22 121 -224
1637 -224 -80 197 -48 -63 118 -42 -57 -14 -128 62 223 -88 -120 23 -80 42 171 -123 -77 163 -123 -128
1659a28K89j54k7J55l08l5M34j24k55K54p5k10K55j5k15K78O6l89M4K51n4j3J7
1682D1j08k2R4J8j7j6P7Ok36mL15l1j72J06r4j44K96M1k99J76J95l59o3L12n0
1707F2m8J15j84j68K82J06k10L5R9j28p0R5L3M6M2j14j85Q2K24qj22J1Qp5J4P7
1733A9MN9Pk01q5K03J27q3n6l5o7N9J01n1J5R9j10k14J12K27m0n4k4j56K0K29
1759A05m6j15J52j2k50K9J83L1L8m8k17l2K15Q8j11JK8q2r0P6J28M1k0q8j95L5
1785a56L20k0j96P6jk04J26J65r9O7O8l30q1L51O6j39L7r8j18J43N3k9J01Nj89
1810h2r8P2K07J04j73j14Pn9J14J79j29m6J35k33j60L60J15j79N9j51k00L06J61
1833A95k22O3P4k68K3J75m6J60M7l41r3K32L7P0K2j83k5M0q9J32J77j06n0j11
$$ plain form
1659 -128 161 7 -20 135 -173 -208 226 102 -153 101 26 -184 71 56 -159 119 185 -204 -160 91 37 24 41
1682 41 -67 -89 5 23 6 -10 67 73 -163 -167 148 117 -55 51 -43 -187 109 150 -149 27 222 -137 -200 112 62
1707 62 14 129 -55 -223 59 165 -45 -10 89 -39 -109 -14 19 65 107 -7 -192 -110 114 106 -16 -5 3 -72 -58 19
1733 19 23 82 89 -112 -197 6 133 50 -6 -41 -108 -49 52 1 16 115 5 -209 -97 130 90 36 12 -144 -124 105
1759 105 59 -56 96 84 -166 -137 46 77 115 67 -150 -182 33 121 10 11 39 -43 -133 -57 71 112 92 4 -191 -156
1785 -156 164 144 -52 24 23 -181 -55 110 11 78 146 -184 -265 86 152 13 50 -48 -166 -23 30 1 102 107 -82
1810 -82 -180 -108 99 203 30 -84 -77 -136 -22 157 28 -18 117 -116 -276 84 199 20 79 -72 -272 34 195
1833 195 -27 36 110 -158 -135 40 -6 154 201 -140 -233 -1 36 106 128 -55 -80 -40 -129 3 180 74 24 -87
1857h7k15L10K70k85l3J28l15O2L77k27j0L31m21k99M81P9j67K28j84l50K98J35
1879A06j79K07J8k48K5p9M6M12j18l34J28q7j17M73o1l75L31n5n12M13L21l88
1901g3J96K9o11L35M60m02J07K32n37O6L88l66K09M32o08k00M53k31J03M30m59
1922d7k18L97k68n6N15k52j51K54m83qP26k86k96M53m53k86P83j93m36P11k56
1943A50p60O37K20m61N29n0p64M17L04m45M03J32n82K49P4m50N84K95p13J77J41
1964H7n43N38M46p63J92L75p70J92O77n10Q4L96p98j7P90l76q6N03o22j88O54
1985B61l69p8P14m63m85N10k02p9P11l97n02N26k41k53P18j75m55N54l95n42R55
2006C13R8o88N34j31q06Q15L36q11M85L21r85K54O21n26K85L96q72k3O24l36R0
$$ plain form
1857 -87 -302 8 278 -7 -40 88 -227 -165 212 -15 -25 306 -115 -414 67 146 -21 207 23 -327 -29 106
1879 106 -73 134 152 -96 -71 -150 -104 308 190 -144 -16 -103 -220 253 192 -183 148 93 -419 -6 315 -73
1901 -73 123 152 -459 -124 336 -66 41 273 -264 -198 190 -176 33 465 -143 -343 110 -121 -18 412 -47
1922 -47 -265 132 -136 -192 323 71 -80 174 -309 -317 409 123 -173 280 -173 -459 324 131 -305 406 150
1943 150 -610 27 247 -214 315 265 -499 -82 222 -223 180 312 -270 -21 53 -397 187 482 -231 -54 87
1964 87 -456 82 528 -235 -43 332 -438 -246 431 -79 5 401 -397 -414 376 0 -86 417 -205 -393 261
1985 261 -108 -186 528 65 -420 90 -112 -191 520 123 -379 147 -94 -347 371 196 -259 295 -100 -642 313
2006 313 411 -277 257 126 -680 135 471 -340 145 466 -519 -265 356 -170 115 511 -361 -384 240 -96 -6
2027fM43n42j25L56m08J94N68m46j67K14m60K48O38n28j16M20o05j4P08l82n0
2048f0N63p61l45R11k17k73P04n36n93Q12j17m42Q09j34p79M65%l92P96J1q25
2069d03L75R9n01O30K07o39L43M0p14N13N02n30J68R3o63L26N19m36J25K35n58
2090b69O1L13k53L41J96o11oK58k46M03K01n97J54J91n42L59N25n91J10K44p59
2111e18K82P90o01p8N12p06r3Q24m48j53P22n93n06P04o2k05N50l41n23M97Mk43
2133a85M64j05l51K05j89q1N61j04l06J79l09q3O22k13k82M79l34m26N94j2k74
2154a50N53l09o50N88J44l85N00o4o33M22J08m99N87K43p32J89J71m93N47L72
2174E09p60J50L32n95K43N34m87O1L28o80M7O85l36p4L43n52m9N77k95r9M96l89
$$ plain form
2027 -6 437 -105 -230 126 -282 -88 480 34 -133 81 -379 -131 507 -21 -137 283 -322 -336 372 -10 -60
2048 -60 503 -258 -603 308 91 -182 522 -14 -607 205 88 -354 455 321 -458 7 7 -385 411 422 -403
2069 -403 -28 71 -430 200 407 -232 111 151 -563 -50 452 -78 90 183 -480 -154 365 -71 54 289 -269
2090 -269 -208 105 -148 193 389 -222 -228 30 -216 187 388 -209 -55 136 -406 -47 478 -113 -3 241 -518
2111 -518 -236 554 -47 -125 387 -319 -412 412 -36 -189 533 -60 -566 138 76 -129 421 80 -443 54 58 -185
2133 -185 279 174 -177 28 -161 -242 319 215 -91 88 -221 -304 318 105 -177 302 -32 -458 136 124 -150
2154 -150 403 94 -556 32 176 -209 291 227 -406 16 124 -375 212 455 -277 -88 83 -410 137 509
2174 509 -251 -101 231 -364 -121 413 -74 -13 315 -365 -318 367 31 -43 300 -252 -301 276 -19 -118 378 -11
2196a1l22M26j64k4N12l55l75L73j13j01M75k48k70L80l15k25O47q8l64L78l00
2217h4l79P08Mn21M81l9o24M74K03m77M74J25p83K72M04m30L10K39o60J61L69
2238B27m96K14N01n54n6L33m70J74O03m94k00M17l78o5N53k89j48M21m22k51N80
2259B00r6j93L75l46l14N43q8k84M61j39m16L54n5k43N21m0n21K37P9k55M08O
2281A94l94K65J2l97L53K14l46K02l1m63L80L04m15J64J54m74J75K85l44K09L01
2302C48n30o0L80k37R5L37m32j32L94k40q9M06j48k24K04j77j03M28n3k67J20
2323B0p2r4K59m5j30K00j39k20K17N9n5J77j68k62K52Q8j46J36K8k39Q6N6j45
2346a37J95J51k46p1P1n3J53P1j86J4O5j11L4J11m1Q0o6k06Q7K00r4PK5j64N7
$$ plain form
2196 -11 -333 93 -71 -95 417 62 -313 60 -53 -154 321 73 -197 183 -132 -357 290 202 -162 216 -84
2217 -84 -463 245 249 -272 209 170 -454 20 223 -254 220 345 -438 -166 238 -192 118 357 -303 -142 227
2238 227 -269 -55 446 -108 -164 169 -301 -127 476 -18 -218 199 -179 -244 309 20 -128 293 -129 -380 200
2259 200 104 -89 286 -60 -374 169 81 -203 258 119 -297 57 2 -241 280 240 -281 -44 35 -220 188 194
2281 194 -200 65 77 -320 33 247 -99 103 72 -391 -11 293 -122 42 196 -278 -103 182 -162 47 348
2302 348 -182 -242 138 -99 -4 333 -99 -231 163 -77 -166 240 92 -132 72 -105 -208 220 167 -100 20
2323 20 -52 -146 113 68 -62 138 -1 -221 -4 55 0 177 9 -253 -1 87 -59 77 105 -134 -48 8 -137
2346 -137 58 209 -37 -108 -37 -90 63 134 -52 -38 27 -84 -50 61 20 100 34 -172 -85 115 21 28 53 -111 -54
2371e4J41j50L6K08j62j47J14j1J4J73j21j86J32N1q5O8N0o0k1l7l8Q3R7k2r4
2396b1q4P2R8p0lO7p1n3P6n3K2J55p1k01Q5J07p1L0K6r1L3M2p9QJ12Mj03n9M5
2425d8J00%n0Mo0J7R1p1n3J46Mj87M5J04l4L3J6j46K7J45r4n1J11qp7J3k3L0R7
2454H1m5r0k0O8N6m1o0O9J9q0J5M1m3R4Jj98N7J82j07o1J26q4m8J52r8r9J94J3
2482I4j89M0Q0k0L7k3p1M6M0k0k3m6R8M7j76rJ93o3p5J14r9r2K34n0k18J93Q3
2509A25k21N7J10j28P3Q6j88KJ67o2n0K5j9N2k2q6P6M1o5P5n9j27K09M6k52J13
2535b2J45k16O0J52k51R1K45l03o8L12j21j22J86j08q9K14p0j70J80J5q4L4m8
2558c8J2J15j03p3J31p6J7J38k09l1K86j69j88L03n7j88K44o2k78L26O6l76J90
$$ plain form
2371 -54 87 -63 -27 181 19 -128 -14 -25 -11 162 41 -145 -13 38 -47 21 71 11 -10 -47 -85 -2 95 73 -21
2396 -21 -105 -33 65 -5 -8 59 -12 -65 11 -42 -20 135 64 -137 -52 55 -16 14 40 -51 -18 24 -55 -47 65 69 -34 -93 -48
2425 -48 52 52 2 6 -54 -37 54 -17 -70 76 80 -107 -62 42 8 41 57 -89 -62 83 -11 -62 49 41 -36 -23 -46 -16 81
2454 81 36 -54 -74 -6 50 9 -51 18 37 -43 -28 13 -30 64 65 -133 -76 106 -1 -62 64 -20 -68 84 -14 -113 81 94
2482 94 -95 -55 25 5 42 19 -52 -6 34 14 -9 -55 43 90 -86 -95 98 35 -40 74 -25 -117 117 67 -151 42 125
2509 125 -96 -39 71 -57 16 102 -86 -84 83 21 -29 -4 -23 29 7 -79 -3 38 -27 48 -11 -138 71 117 -135 -22
2535 -22 123 -93 -33 119 -132 -41 204 -99 -167 145 24 -98 88 -20 -109 105 35 -135 45 60 -24 10 -38
2558 -38 -26 89 -14 -87 44 -32 -15 123 -86 -117 169 0 -188 115 58 -130 114 52 -226 100 166 -210 -20
2581b0J77k67R6J24k39R3J85k20k3J63q6J3L0j28J13J01k03O9J06j85J23J05k97
2604a70J18K85l26m1L00k06q4K89j99j51L48r7k49K39J7j49J46o2j37K11k4j66
2626a08J47l0q0J96j43j52L08o0k60K48Rk48K86Ol77K95J74m11J53K27l35J22
2648c3K46m00O3L78l19j38L60j76j16K68j64j17K80o8j85J37l1jJ05j67QK02j76
2671d4m3K33k43RL36l36j79N06j52l35M02o4l32L59K4m00L13J81m10J16J98k32
2693i3J31Q9k57J02J52j93N7P6j49J34L0k60J72J73k38M4J07k07J30J42k52O0
2715e0K01k11k7J72j48M4J73k36n9K40q8o4J50j21l8J43j17n4J72l3o4K7j04O1
2739c1J58j39o6J64j12n0J57q2p5K06q7k23J54J28j21%O8r2j5R8l2o1P5P7j42
$$ plain form
2581 -20 157 -110 -14 110 -129 -36 149 -71 -94 69 -17 -4 26 -102 11 112 -91 -22 84 -101 22 127 -170
2604 -170 -52 233 -93 -134 166 -40 -124 165 -34 -185 163 66 -183 56 73 -76 70 8 -129 82 58 -108
2626 -108 39 9 -71 125 -18 -170 138 78 -182 66 75 -173 113 119 -258 37 211 -200 -47 180 -155 -33
2648 -33 213 -187 -124 254 -65 -203 157 -19 -135 133 -31 -148 132 64 -121 16 -15 -16 89 -78 -70 132 -44
2671 -44 -87 146 -97 -88 248 -88 -267 239 87 -248 154 90 -242 117 141 -259 54 235 -175 -59 139 -93
2693 -93 38 127 -130 -28 124 -69 -12 64 -85 49 79 -181 -9 164 -74 -30 77 -130 0 142 -110 -50
2715 -50 151 -60 -87 85 -63 -19 154 -82 -141 99 11 -53 97 -24 -62 81 -36 -90 82 49 -15 12 -92 -31
2739 -31 127 -12 -78 86 -26 -76 81 -1 -76 130 43 -180 -26 102 -19 -19 49 -43 -58 40 8 -53 22 99 -43
2764d3r7J76M3j24N7K6j62J00J47j90jK13j54j36J68pk5J11j12j22J33M8p3M4
2788B0J5m5J5n1kJ06Om6n2o3R1R7r9%Q5j36jJ26j13L6J98k09j65K50Rj30J51m7
2816D6j81J75Oj70J72P4j81K2K3r8J87P2k27N1P0j52J28Q4k18J51J03l12M6K90
2840A61j70k0J49k11n1K69j18j23K25p3j73J39k2m2K10j06j83J43Rp3J49o5j09
2863h5J69r6j35K31J8j39J18j12j50K83J0k40K03Qk48J89O2k20K48P0l79J06K20
2886A31k19J05J54l25P7K14k46K5K49j88m7J58k40P8K94k47r8K28j78m5K89j86
2908a7j10K95j88k08L09j3j58K13j20k08K84J0k19J98J8j99J30Jj35K29J5k40
2930a13R1M1j04J81j5j93J59J2k20J49J15j62J39k2k57J88J70k35P3J24k45P9
$$ plain form
2764 -43 -140 36 79 -45 12 38 -124 -24 123 -67 -68 145 -9 -145 23 16 -9 102 -10 -132 1 49 -24 20
2788 20 35 -10 5 -46 -48 58 64 18 -34 -97 -6 91 -8 -8 77 -59 -60 66 -47 -11 187 -22 -187 63 72 -58 93 46
2816 46 -135 40 46 -124 48 122 -59 -37 -14 -112 75 147 -80 -29 41 -111 17 101 -117 34 137 -175 -129 161
2840 161 -9 -29 120 -91 -142 127 9 -114 111 38 -135 4 -18 -60 150 44 -139 4 13 -60 89 24 -85
2863 -85 84 -12 -147 84 102 -37 81 -31 -181 102 112 -128 75 83 -165 24 86 -134 114 184 -195 -89 131
2886 131 -88 17 171 -154 -77 137 -109 -84 165 -23 -70 88 -152 -74 220 -27 -125 103 -75 -120 169 -17
2908 -17 -127 168 -20 -228 81 68 -90 123 3 -205 79 89 -130 68 86 -113 17 18 -117 112 127 -113
2930 -113 -22 19 -85 96 81 -112 47 59 -161 -12 103 -59 80 58 -199 -11 159 -76 -3 121 -124 -45
2952d5J50k18Q9K10k50o2J92j35L9J88k26n4K29j36q7K06p1q8J44j33q5K54n0
2975F1j45R4k0p4J51l3r8J31j7j52P8K5pJ10q8j33J23L9r1R3rq9J00m8j22J74
3001E3M9j26K3l0m4J27K2j48Q7M3j53P2N2p7J31qk06P5J30r7K6N3j47P7J04j62
3027g4K8J69j42n2R8r7M1J50j36q3J20mp0O5J0m5O4o3p2Q6N6j7j9q0L9P9p4J2
3055a1P6o2l5O0q7J2J62q6j28J06j0l7J01n1q6J07Pj31Q4O5o1K5m7n7J13L1j07
3082d7O0Ko2O0lj07J43M2j59L4P7p9P3M5j70N3J32j35k9J43n6l0M7q5jJ28n0o1
3110c5K6%RK2n7L7O6q7k2M9o2P0Q8j78lJ78j08p1J44o7n8J34q8j10J76L8j56M1
3138b4L3o9P9pp7Q1J0o0J3k0NJ24r1j01J29Jj06J29m1q5J40j3j98J47J06j76M8
$$ plain form
2952 -45 105 -113 -24 186 -64 -126 66 -69 -30 158 -68 -122 107 -29 -116 90 19 -69 75 -58 -143 111 61
2975 61 -84 10 -10 -84 67 34 -64 67 50 -102 -24 1 -6 104 16 -117 6 45 -46 47 38 -51 49 1 -121 53
3001 53 102 -24 -1 -31 -75 52 74 -74 13 56 -97 -25 27 -50 81 73 -133 -58 72 -25 1 54 -93 -16 88 -74
3027 -74 -46 123 -19 -71 27 -70 -29 121 -15 -98 22 18 -52 13 23 -22 42 -21 -93 -7 49 32 13 -67 -28 51 -23 -11
3055 -11 65 3 -32 28 -59 -47 115 29 -99 7 -3 -40 61 10 -76 31 38 -93 -9 56 -5 20 -27 -84 29 60 -47
3082 -47 13 15 -47 13 10 -97 46 88 -71 -37 40 -39 34 79 -91 -38 94 -41 -70 73 17 -13 34 -51 -52 76 26 -35
3110 -35 -9 -9 0 22 -35 2 68 -19 -41 8 -54 16 104 -74 -77 101 -7 -78 66 -1 -59 75 -13 -123 53 91 -65 -24
3138 -24 9 -60 19 12 -65 16 26 -34 -21 -41 -36 88 -3 -104 25 26 -80 49 8 -77 63 50 -148 -1 105 -71 -23
3165b3R2j62P9J38j76j6J67j00p5R1pj6N2o1l1N1jK8j2r8J14L2j81R5J36j62J4
3192c2J23j86oK65j66j36K38q3j51J76j8j31J77mk03J12J06j26M4L1j03Q8Qr6
3216g3Q2L2p7O6m6p4J57oj68J28K6j38J43Nj94J79J03k83Q3K00k15L0J78k18k9
3241a09K64j55j14J99m2j18R3n0rJ09q4l3N8p6N4J19j99K2K33k08j15K75r5j51
3265a32K70j16k40L17L6l04J70J11k32J07Q6j87J09J31j85RJ03r2O0M1j46J00
3287A6Q6k01O4J00j17Q9M2k13J28J32j99O5J22k15Q6J61k77L7L15k54j31K95j29
3310Bj26K61r7k16K52Jk10J38O9j14O3m3n7J17j7p2J08r6n9K02j19j51K59Nk56
3335a56J52Q8k02J45J05k45N2J71j58j1J17o5qM4j02M3J08q9j1L8o5M5Q0j44K3
$$ plain form
3165 -23 69 -93 -14 124 -52 -68 99 -1 -76 15 8 -8 44 -17 -48 3 2 30 18 -80 34 66 -115 -20 116 -46 -32
3192 -32 91 -95 -101 164 -2 -138 100 17 -134 42 24 -107 70 66 -137 -25 81 -45 -1 30 -73 15 23 -73
3216 -73 9 41 -36 30 -16 -90 67 61 -107 21 47 -91 52 57 -137 42 145 -138 -55 145 -70 -40 138 -80 -109
3241 -109 155 0 -114 85 43 -75 18 -32 -41 68 -16 -49 9 -67 -13 106 -93 -71 162 -46 -161 114 19 -132
3265 -132 138 22 -218 99 135 -169 1 112 -120 -13 73 -114 -5 126 -59 -50 53 -39 21 62 -84 16
3287 16 102 -99 -35 65 -52 37 79 -134 -6 126 -73 -8 114 -101 -15 146 -131 -94 221 -33 -164 131 2
3310 2 -124 137 40 -176 76 77 -133 5 74 -40 23 -20 -77 40 23 -49 59 -37 -96 106 -13 -164 95 100 -156
3335 -156 -4 84 -118 27 132 -113 -61 110 -48 -59 58 -7 -15 29 -73 -30 78 -11 -22 16 -49 -4 76 -68 -45
3360d5J23r2m2Q5m8K9P9j44l4J70q2n6J32p6q2J65o4j60J79Q9k00J2J18r1JJ18
3386H4q7p6J05L6j27J9J22l5j20L8P5o5J4Q8j09o1J78l0j51R4J03j23rQ3o6KR2
3413G4o8o1N6M7n6k5N2Kk4j0j0J2N4k0n7J3L5j8J0j1l0L7M1q1k0J06k1o9L9Rm5
3444c9P9k2q1O5M2n4j3PK4N1p2o7J15j2q7J02j5j31J48N6k25Q9J69j67m1J76j15
3471a8m1J57r6j07J57Jr1K4L2%K4q0RQ9q6J8P3j31K3J62j55o5K01q2j18J78r2
3498a4q7K18q6j83K02J6j65J42j6j50J91Ok27J60R9j95R9P1k19J49J14k44P4J73
3522A28j96M0R0j54Q2J48k34L5J79j77KJ71j86KK42k12j00K51p9j26J71p7j00
3545a00K02o4j33J36j0r5Q2n2k2J62j10j01J60n0p6J76j10j48K56m3k28K18M7
$$ plain form
3360 -45 78 -14 -56 29 -19 10 89 -55 -89 81 -1 -57 75 -1 -83 82 18 -142 37 126 -74 -62 56 -35 -34 84
3386 84 -3 -79 26 62 -65 -46 76 41 -79 -41 34 -31 -17 71 -38 -99 79 49 -102 -8 95 -28 -37 46 -20 -18 74
3413 74 6 -55 1 48 -8 -33 19 21 -3 -13 -23 -11 43 23 -34 -21 14 -4 6 -5 -35 2 43 -38 -58 48 27 -42 -3 6 -39
3444 -39 40 18 -63 2 44 -10 -23 -16 8 59 -13 -80 35 23 -64 38 23 -108 40 96 -129 -40 129 -38 -79 97 -18
3471 -18 -59 98 2 -105 52 53 -38 -14 18 18 42 -38 -29 60 -26 -8 65 -66 -43 119 -36 -101 100 18 -100 78 -14
3498 -14 -101 117 31 -152 50 66 -99 43 27 -123 68 74 -153 7 106 -89 10 81 -138 11 125 -119 -45 128
3522 128 -68 -28 62 -92 -10 138 -96 -61 118 -59 -57 114 -72 -70 172 -40 -140 111 32 -94 77 0 -100
3545 -100 102 38 -95 41 31 -64 18 -34 -56 106 -4 -105 55 5 -71 105 -5 -153 103 60 -168 50 97
3568I7k33J60N3k36J69J41k52L3J80j66J1J46j74M0J60j99j8J83j07l0J37j53
3590e8j6J94j22q3J44l7p8J07o8n4J71p1j24J29ko7R7o5p9J47j5j34J04M3j08
3615d5O4Oj09R7O0j35L7P8q9N2%r5R9M0j52Q1N0j08R0M9j81O7J71j93pJ68j08
3642a3m1J35j06o1J70n4j24J21Lo4P7l8o9J09j2r9Q1J6m9O5m0p9J08L0j24M4M9
3669C5n7M0Mq5O0N5q5J3M1k4K5j3p4O2N9q1PK9l3M4Jq0N3M7p7J3M3n9O6L2j28
3700f7K6J14q8k1Q6p3j4J07r3m6J39j5j20O6K1l3L4Po4K2M5m1rK1J8km3NL7Lj7
3731EPn3J5N2k7l1M8qj9Lj8J3O1n1m7N2%oK3l4k3P4l5m0K8L2j4rl6MN4J2l5j3
3765a6K2j2R%nK3Qo7QL2J6Jl7nJ3K6jk3NL0po2J9O4j3j6mm6J5N9l6l7M2L3o3K5
$$ plain form
3568 97 -136 24 77 -159 10 151 -101 -68 112 -54 -43 103 -71 -31 129 -70 -88 95 -12 -42 95 -58
3590 -58 -74 120 -2 -85 59 22 -56 51 -17 -71 100 29 -95 34 32 -35 62 -3 -82 65 50 -84 20 63 -45
3615 -45 19 25 -84 13 73 -62 -25 53 -36 16 16 -79 20 60 -92 -11 39 -69 21 70 -111 -44 127 -66 -73 95 -13
3642 -13 -54 81 -25 -86 84 30 -94 27 30 -34 43 5 -64 45 33 -66 15 31 -18 47 7 -72 36 66 -58 -14 35
3669 35 -22 18 22 -63 -3 52 -33 -20 21 -3 22 9 -65 -3 56 -25 -18 11 -22 22 23 -57 -4 43 -34 -21 22 -37 29 61 -67
3700 -67 -41 73 -15 -36 50 -23 -37 70 -23 -69 70 55 -65 1 22 -11 23 30 -34 -12 33 -8 -17 4 22 20 -23 -18 19 22 5
3731 5 12 -41 -26 26 -1 -32 16 8 -11 -8 -26 -13 48 -3 -50 2 2 -4 19 -15 -38 36 1 -39 -11 21 7 -2 -38 -34 20 32 -3 -16
3765 -16 6 -6 3 3 -2 21 29 -38 -30 2 18 19 -18 -23 -10 16 15 -8 -3 27 20 -42 -23 41 28 12 8 -38 -23 36 0 -37 5 38 -25 0
3801@k7J2N2k2o3K6L8k1K1k4k6P0k2p7O2O1p0rJ5m2M5N3o4l3O0mm4K7J9oQk3k6
3834c4L1PM3m7o1O8L1o5RO0m3JK9q8L4J06q1n6Q0k0l4N4j8n1R5k3j16R9L5o2K1
3865Drn9O6N1q7J2O4n1k3K4l1M9M4q7%M1j5J8K3q6M7P0r6k0J08l9n0P5p7rJ24
3896H1m5q4P1J4o5N6k0l0P6k5q2N4J2j8N7n1o6J15l0r2J06Or7Q2Kj41J51N9j66
3925g0L8R7j24L9R2j22J6J16j24l4J21l7k5N1o8oJ08o4n0Q6n1l3Q4p1j8J26o4
3952A3r0J01qn6R2l4q8J00J2j11O7N1p0M9j7r6J15L0r8M3K4p9M7L5r4P2O7j24
3980d7OQ7n6OM7r7K0J03q9j3P8o0k7Q8q3l0J49m1j44J05M5r8N7M7r4K9P1r3rO8
4010B5J8m3l1RN3j7j3L5m5k4Q9m3r0J13O4j51nJ11p4j1J13j06o8J39j6j05R6L5
$$ plain form
3801 0 -27 -15 37 15 -48 -22 16 -5 16 -8 -34 36 14 -63 -1 60 -10 -19 -4 -46 -1 52 -12 -45 15 11 -33 -6 13 7 15 -8 -34
3834 -34 -3 4 47 0 -61 7 38 -27 -18 42 -1 0 29 -59 -25 81 0 -56 24 4 -30 24 6 -45 50 27 -89 10 45 -17 4
3865 4 -5 -64 2 53 -34 -22 42 -9 -32 -8 -39 10 54 -33 -33 8 -7 11 34 -52 -5 65 -31 -51 57 18 -32 43 -34 -43 81
3896 81 36 -48 23 37 -28 28 8 -22 54 29 -53 1 13 -5 52 1 -65 50 20 -72 34 40 -57 25 27 -114 37 96 -70
3925 -70 -32 65 -59 -20 72 -50 -34 82 -42 -76 45 8 -17 34 -34 -40 68 4 -46 40 -11 -44 40 -31 -49 77 13
3952 13 -77 24 16 -40 52 18 -70 30 42 -69 -2 49 -21 28 11 -85 30 60 -38 5 29 -50 -3 32 -62 10 77 -47
3980 -47 -41 46 -10 -4 43 -54 -34 69 -20 -33 45 -15 -42 46 -37 -67 82 41 -103 2 47 -51 6 53 -41 -12 59 -34 -43 25
4010 25 43 0 -31 -22 31 14 1 36 -9 -33 56 13 -77 36 100 -51 -56 55 -19 -30 83 -23 -91 48 32 -73 23 58
4038E8r4RK6o1Q3L7q5rL1k4L2K0m8K5M0p8%N1%nj3m5L2O2n2j0M9n6NN0p3K2J24
4071A03r2j12J20J0q8J06J2j31O4Q2j35K2J35o8p1L2K3%MJ8l0m1K6N3m9l6J03
4098F0lj44P7R3j16K6J03j62j9J98r9j15J59K0j69R4L5j18J15O1j72RJ18p0j2
4123c1Q5n8j9P6p0l6R7pm0j1j8M6J8m3J3L2q7O0L7j12P1J26j87m5J98q0r1J86
4151A10p3j82K06Nj84J28J04j71J5Q7q6L7P0q7j7M4k7M2k2l0R6n4j18J18M8j37
4177g8J28L0k20J27J53k43M1K12j99n7K17j38p2K33r8j92J96J4j37J24K1j40P6
4200bM9j11O5N9l3k5n3J6R8o5l5J05r0m9J46p2j08K17l0k41J75Q0k02J26R6k21
4226a05N1J75j73l9J89q0r2R1k8l3J02m1n3L0j7K0K8n5M7N6j37OJ25r4J1J08j24
$$ plain form
4038 58 -36 -27 -1 -62 21 58 -27 -36 -5 -29 3 23 -25 0 40 -38 -38 13 13 8 -5 -50 -18 44 -8 -18 31 -25 -20 30 -43 -21 103
4071 103 11 -101 19 29 -59 47 59 -72 -8 74 -61 -39 96 28 -43 -11 12 12 16 34 4 -37 -11 42 -7 -43 60
4098 60 57 -87 -10 83 -33 -7 96 -66 -85 113 14 -101 58 78 -91 3 38 -80 35 96 -76 -67 51 -19 -31
4123 -31 54 -4 -23 53 -17 -53 44 37 -3 -14 -32 14 32 -11 2 34 -53 7 44 -68 3 129 -58 -103 95 15 -76 110
4151 110 37 -145 61 66 -118 10 114 -57 -42 45 -41 -4 66 -21 -38 6 -21 21 -1 -31 65 11 -107 11 59 -78
4177 -78 50 80 -140 -13 140 -103 -62 150 -49 -106 111 -27 -99 134 36 -156 40 54 -83 41 62 -78 -2
4200 -2 47 -64 1 60 27 2 -51 -35 63 -2 -37 68 -22 -71 75 3 -105 112 82 -159 16 96 -106 20 116 -105
4226 -105 -54 121 -52 -91 98 18 -74 17 -11 -44 58 17 -36 -6 -23 -3 25 -30 17 73 -64 -58 67 -27 -16 92 -32
4253c2r1K21o1j46J68J0j74J25M3j50J14R0j75k5J32n1j6N8j4o2N0k3j7J8N2Q
4279E2r4k0J05j0p9R6j6j25J27K3j54R4J29j98k1J75j00m8J53o9j39J46L4j47
4303h6P5Q0r0l2O3l5J5N6k7n2j7O9Qn6K0P9p4n3P9j1l0Q0k6j29R3P8j15J7Q3p7
4333a5k9P5m1k8J00k2j02J7P5ol2L0j5l1K4K2n5J2Q2n5q8Q0L9q3N3M0r8J8J04
4362G1r4n5J40k1j05N9L2n7K6M5p5k2Q9j5o2N3N6p1k7N2k5kN2oj03O1P6q8j5Q9
4392E8m1n4N3mm3O5J3q2OP1k4l0J3L0k7j8L2l0l0Q2J0j22M4Q4p9j1R0o9l8R4l9
4423Dp5J16K5j24K0P0o7J1O5n0k8O4j5m6J7P1m5m4L7J8l1K5K8q4QQ8o2o8J31j0
4453D9r0M0L4p7M1P2j01j6J07o1m8P4j0k1J3j3l8M7L2k2l0oM0Qn4K5M6o1KM5n3
$$ plain form
4253 -32 -123 98 37 -109 59 69 -105 20 63 -87 27 117 -58 -83 49 -2 -18 40 26 -36 14 -9 -26 -8 44 52
4279 52 -42 -62 43 33 -46 50 34 -91 36 59 -95 -1 128 -70 -91 84 -16 -64 89 20 -119 27 61 -86
4303 -86 -11 69 -21 -53 10 -25 -10 46 19 -33 -50 19 27 -29 -9 70 -4 -57 22 11 -19 61 35 -94 -1 77 -38 -21 62 -15
4333 -15 -44 31 -10 -38 62 40 -62 -45 30 24 -8 22 7 -24 0 22 -33 -21 61 6 -82 -2 37 -46 7 47 -51 -33 71
4362 71 -23 -78 62 41 -64 -5 27 -30 -4 41 -34 -56 33 18 -44 9 65 -6 -33 19 -6 -8 44 38 -65 -4 72 -16 -31 58
4392 58 17 -37 16 12 -31 34 47 -35 -29 42 18 -12 1 31 4 -14 18 -12 -42 40 50 -72 -28 56 -23 -34 56 -13 -51 43 4
4423 4 -71 45 70 -54 -34 36 -31 -20 45 -5 -33 31 16 -30 -13 58 13 -31 6 24 -7 18 46 -38 -30 58 -4 -72 59 49
4453 49 -41 -1 33 -44 -3 69 -32 -48 59 -2 -50 24 14 -7 6 -7 -45 2 34 12 -18 -24 16 24 -30 -5 41 -20 -18 27 -26
4484b6LJ01q5p2J06J4r8P0J5p5N1N1j05L4O8m6l9K8Oj0K4nmpJ1J5l3jP6m4p6O9
4516A6K0o6N2K4j16P1O0j12J5J19p1p1J01n6m2J18k9j09P9K6n9J4M0k3Lj0l1L5
4544bJ0JJ5n9oR6n4n9R9j6r4R5qr7J20L4j43K8J15j01lP6o5rP7l4o1P8Lm2kj9
4576b7J9M4l7qK3k8J9J0n2L9O7j00k3R3m8j7J06r4n2J28m0j09J18K2j19O5L5j05
4604g1P8P7j19k3J01m6j2L2rk1L3l1%J2KL5l6m7O3M2j04N2N7j06J7R6j03lJ23
4633H9o5r8J02Lo6O4mo2N7K0p4L3L8k5Ql1k8O4J0p1M5Lm5M5mn1P5K1j11M4M0o1
4665c5N5J9j00L2J02j02k4J15o8m1R2o2l7J23j0j23N0M8o0L1K8k8jJ9m7J1K1K0
4693B8mm9kO3k6k9M5j2m3N4mn7P1J4r6NO5m4K9L5o7kN9m8k0O7l5PNl0oP7l3n5
$$ plain form
4484 -26 -23 78 -7 -79 27 41 -57 13 28 -47 4 55 -50 -16 52 6 -33 -5 1 -9 15 10 6 -1 10 25 -8 -9 67 23 -53 16
4516 16 36 -30 22 46 -70 1 61 -51 -36 83 12 -59 42 -14 -56 62 33 -76 3 29 -30 -16 24 1 4 -6 -37 -2
4544 -2 8 9 24 -35 -41 55 1 -58 41 25 -69 26 18 -79 41 75 -68 -40 75 -26 -29 47 -18 -27 50 16 -45 33 36 -6 -8 -27
4576 -27 -8 36 -1 -9 14 -14 5 15 -37 2 69 -31 -54 39 -9 -26 80 -14 -66 62 22 -87 31 53 -66 -1 34 -71
4604 -71 7 84 -35 -58 43 -3 -15 17 8 -13 20 -11 -11 1 3 38 2 -45 18 60 -44 8 65 -41 -24 72 -31 -34 89
4633 89 24 -74 28 31 -35 29 25 -37 20 40 -34 -1 37 12 20 -11 -39 25 35 -36 9 12 -33 12 8 -43 32 53 -58 -14 26 -35
4665 -35 20 39 -61 -29 73 -29 -53 62 -6 -47 45 -17 -54 69 59 -64 -14 34 -26 5 33 5 4 23 -24 -13 8 28
4693 28 24 -25 -27 36 10 -19 26 14 -29 25 21 -36 35 49 -47 -42 23 -21 8 43 -24 -26 33 -15 -35 32 -3 4 9 -21 -27 50 17 -38
4727c8M6ol3M9qk8L3J8p7K3O0l2Rj1m4L2K7k4j7M7j5l5K4j3K5L5j8o4K9K1%mj0
4760AJJ5j6j6K1J8Kj3m1J1N0om8K8qk4M3ql6M5K8r2K0O4m4jL8p2J2O7n0k3P1j7
4794B0o5M2jl2Q0op8L0N0n4K2J7m0K2K4o1K2N9l5l5L4m1K0N6n1k1O1k8l2K1mJ9
4826A5J4m3j2L0mJ3Rn0J3L9o5J9O0m0k1M8n2j9J16n4q3R4op6N9L5q0N0L2j12M7
4857b4P8o5jM8o2%Q3o2l4Q8m8j9L4k7J1L4l1m8M9OoK1l4J3L8n7l0O9Nm5M0m2m1
4890e9R3Lo9L9L0n9K1J8k7K1J9o9J7K7j6K3ql4L4J5o7N5L3n7J2K0p5N4P5r1k1
4921d3Q4m8j8O4m2k9Q3m2q4R0L5p6M0kn2M1M4n9NM6k3k7RJ3J8j4k9%KJ6K8l2k8
4954c0M5j0n4M5M0m0J3j0m2L8M7m0j9J8lk1L0j8RK7k4m8L3K7%rj8PL4k7j9L8%
$$ plain form
4727 -38 8 2 -31 18 10 -18 15 33 -44 -21 39 7 16 5 -39 -7 20 -4 -21 26 11 -24 0 -13 12 47 29 -35 -6 15 15 11 1
4760 1 2 17 1 -15 6 24 26 13 -28 -17 33 27 -21 7 -1 -25 18 10 -26 19 47 -45 -25 39 -5 -6 32 -40 -28 39 -11 -34 37 20
4794 20 -45 -3 -4 -36 44 38 -40 -10 40 -14 8 25 -15 7 31 -30 -8 51 16 -19 15 -26 -6 50 -1 -22 39 11 -21 0 -4 15
4826 15 29 -14 -26 4 0 13 22 -28 -15 24 -41 -22 38 -2 -23 25 -27 -46 70 16 -67 27 21 -55 4 39 -41 9 41 -71 -24
4857 -24 54 -11 -12 36 -26 -26 57 -5 -39 49 1 -18 16 -11 0 34 3 -45 4 10 4 25 -9 4 42 -15 -45 24 29 -16 24 -18 -59
4890 -59 34 37 -32 7 37 -22 -1 17 -10 11 30 -39 -22 5 -11 12 4 -30 4 19 -48 7 40 -17 -5 15 -60 -6 69 -22 -43
4921 -43 41 -7 -25 39 -3 -32 51 9 -75 15 50 -26 14 12 -40 1 45 -14 -9 37 14 -13 -4 9 27 13 -16 -16 -14 2 30 -2 -30
4954 -30 15 5 -49 -4 36 -4 9 -1 -43 -5 42 2 -17 1 -2 -23 7 -11 -2 25 1 -47 -14 13 13 4 -14 -7 27 0 -19 19 19
4987A9k1kok5O6Ro0J5K2k5K6J8n2J3M2m8k5N5K2n7J9ll8M1L3o0J3M9n1l4N7Jk0
5020gK7k1l7L7L7m1j5L4ql4J8K5j4Kkl2PM5Kl2kJ5j1JJ5plK9m3j8N0kj5J0j5o
5056a1J8Rl5L4K3n6J2J7j3J2L4o3J8K8l0kJ5j8KL0l5j2N7j7k7LJ1j7M0mn5L8J2
5089A8m3J1K6j8J3Ll4NM1Jl1pJ8Qj1nJ3Jlj2pjM0jo9M3K0m2L3Jl5L7J7o2J7N5
5125D0k8l7M6m1qO8k0n7N1K8p2J6L1m6M4Qn2NM4j4k2K7j7rK4j6j3L7%m1oJ9J8
5158GJ4l5J0J2j9J1J1m1M6J8n5jM8k3j0K6l4nO0j8n2M7Ml5K7%l3N3j1m8K7J0p
5191DK0k7j4M1j3l3L0K4l6K1j1n1O0K6o4J0N0n2J0K7m2ON8o6j1O2j6m1L7k8oO4
5223C9l1m5M9Kl0K4mj8L8m0j9N2k3%L1l9kO0l4m5N0J4n3M6mn3L8M4o2lN0l0j6
$$ plain form
4987 19 -2 -4 -10 -35 31 40 -20 -5 17 -8 18 36 -16 -3 39 -9 -34 21 43 -14 5 2 -36 5 38 -22 -9 40 -11 -45 12 13 -7
5020 -7 20 -1 -38 -1 36 -5 -20 14 6 -28 -10 15 1 3 1 -31 -24 21 23 -9 -11 4 -7 -6 9 2 -1 28 -15 -33 17 15 0 10 -5 -11
5056 -11 7 16 -19 15 38 -18 -6 11 -2 10 44 -19 -1 27 -3 -5 10 -8 -6 24 -11 -23 34 17 -10 -7 4 -13 27 23 -32 6 18
5089 18 -25 -14 12 -6 7 10 -24 -19 22 23 -8 -15 3 11 0 -5 8 9 6 -6 -13 -14 26 25 -44 -1 19 -23 10 11 -24 13 30 -32 -15 40
5125 40 12 -25 21 -20 -28 40 20 -37 14 42 -30 -14 17 -29 15 23 -29 -24 20 6 -16 11 -6 -15 9 -7 -20 17 17 -24 -30 -11 7
5158 7 21 -14 -4 8 -11 0 11 -30 16 34 -21 -22 26 3 -7 19 -15 -20 40 22 -30 17 21 -14 13 13 -20 33 22 -26 1 11 4
5191 4 24 -3 -17 24 11 -22 8 32 -4 17 6 -45 15 41 -23 -13 37 -15 -5 22 -20 -14 44 -22 -33 29 13 -28 9 -19 -25 39
5223 39 8 -37 12 14 -16 8 4 -14 24 -16 -35 17 -6 -6 25 -14 -16 44 10 -35 15 29 -24 22 18 -35 3 47 -15 -18 32 2 -14
5256a4K2j1JL1m5j0M0j3ONm2K6K6l5j9M6j4j3K8l5lO2l7m7P1k0l8N2k1k7N4J2
5288C8p2L4L0l2J0J2k6ML6m2rL5%k1qJL1oj9J2qqL8j6m9M5L3p1J6N7n9LM1m7k3
5323d0Q5m0n4P0pm0L0Jk5M3jn4J7K9k3J7lj1K3oj6j3K7kJqj1L1nl6K4MpJ0jk9
5359b0K5L2o4J2L3j1mL4l3j6L6k5o%K8pj2rLJ7Jk2J1j1J7J6k5j7M4j0l7K6J1k3
5393fQMk8J7M4m5k7M7kj9PQk3J9K3n3J7L6j6k3J7rjL2k2k2M0J5m9LK3Mj8%pmK7
5430A7nj6jK2Ql9J0J8j3%J3l0pM6j5n0M7J7l9J6Qk1OL0n1K2K3pk3K8k3OL1l0j7
5465a9M8j4k5J4mj0L6j3m2M1K3m4J3Mj6L1pm5M5K0m2KJ0j6J8J9l3PL0k5oPj9K7
5499A5J2m7K0J7j7oJ5j5OK9o0PN4l3mK0l4J2L5l3l8O9j4k3L3k6j3L8Jn1M3K2m9
$$ plain form
5256 -14 8 -3 -2 29 -16 -26 14 1 7 12 -30 -4 22 -13 -32 14 0 -13 15 -20 -23 39 2 -45 26 6 -32 20 -1 -28 26 38
5288 38 -34 0 30 -2 8 20 -6 -2 34 -8 -17 18 18 -3 -11 -10 21 15 -4 8 0 -8 30 14 -35 10 43 -28 -12 45 -14 -11 30 -17 -40
5323 -40 45 5 -49 21 14 -26 4 5 -20 23 22 -32 -15 14 -9 8 5 -6 17 11 -5 -18 9 7 8 0 -11 20 15 -21 3 7 0 10 9 -20
5359 -20 5 37 -27 -15 18 7 3 37 4 -12 24 -1 -7 -7 21 14 2 -7 -4 13 14 -8 3 -8 9 25 0 -17 27 17 -20 6 17 -6
5393 -6 2 6 -22 -5 39 -6 -33 14 12 -7 0 8 -15 4 27 -26 -9 27 11 -12 5 -4 -5 27 5 -17 23 38 -11 -8 15 19 1 1 -6 -10 17
5430 17 12 -4 -5 17 25 -14 -4 14 1 1 14 -16 -23 23 8 -42 5 22 -17 -1 7 -14 -8 22 -29 -7 16 9 -14 14 -9 -3 28 -2 -19
5465 -19 29 15 -10 4 0 -10 26 13 -29 12 35 -9 4 8 -8 23 16 -29 16 36 -6 -4 6 -10 8 27 -6 1 31 6 0 7 -12 15
5499 15 27 -20 0 17 0 -6 9 -6 0 29 -31 -24 30 -3 -7 13 -21 -9 26 -7 -45 24 10 -13 20 -6 -19 19 20 -31 12 34 -15
5532a5K0Kl4M2J0n5K9L8l2%Rl5L2Nl2kM2k0nJ0k0J0L0m3mL3j7j5K9j5kM5m3k2
5566b5M4j8%Mk3PM1k7l8M1%k2J9j1j7M2rm0K6K7l4J3J2l1L3Ol6J3K3j4lNl1M2
5600A9J7m0mK9j2oJ2k4J5K0m3kL2Ok2OnnL9j2l1J3J0j3Rk2jK4Pk7JJ2lrn%K1r
5638ck3J4J1jJmk4K8Qk2pL3k3PMj4OJ8j3lJ5j1j0J3m%K0kk4J8Qj1lOnJ3oj0OO
5678A2jpjmJ6Mk2j5K5lj2jqRK4l0nK2J3j8qOlJ3j0nlK5j3pjLJ7j6j%K1jj3nmK1
5720A4j1rQJ2j0lj0PJ2Oj8JJ0PnkrnK4k0j0NL1k7j0OMJ1Mk4nK0qqONpNkj0J0J2
5762Gkk4K0lJlj6J7J6j9rQK7k3jKj2QJ3kqJ8Mj6j6J7OqmLjJ3Rk3rK3nj1%J6k2
5803iJ1mj6K5Mj5j2J6oN%j8J4J4j8j2J5LQkk7J3J1j4PJ5k1QJ7k6KL5j8k5L2j2
$$ plain form
5532 -15 5 7 -27 15 25 -30 -1 37 5 5 14 -21 11 16 -16 -18 24 4 -1 9 -11 -1 29 -14 -18 15 -2 -17 12 -3 -5 40 -3 -25
5566 -25 19 1 1 5 -18 -11 30 3 -35 6 6 -16 3 -8 -25 17 8 -32 -6 21 -13 0 12 -19 14 20 -16 -3 20 6 3 8 -23 19
5600 19 36 -4 -8 21 9 3 15 -9 6 26 -17 -19 13 19 -3 3 -2 -7 32 20 -11 2 12 -1 8 -14 -15 9 16 -11 -10 2 -1 -10 -15 -15 6 -3
5638 -3 -26 -12 -1 -2 -1 -5 -29 -1 7 -15 -22 11 -12 -5 -1 -15 -9 9 -4 -7 8 -3 -13 0 -4 -4 16 14 -10 8 16 5 2 8 3 16 10 0 6 12
5678 12 11 4 3 -1 15 19 -3 -18 7 4 -8 -9 -17 -8 16 -14 -19 3 16 -2 -10 -4 -7 6 -4 -9 -12 13 0 -7 -8 -5 12 -4 -5 -5 16 15 2 -3 -7 14
5720 14 3 -6 2 14 4 1 -9 -2 10 16 -2 -1 9 16 11 9 0 -5 19 -1 -11 -6 25 -2 -12 -6 -2 9 13 -11 -16 4 -4 -12 -6 -1 -8 -3 -5 -15 -5 7
5762 7 5 -19 1 -2 -1 -4 -20 -3 13 -6 -15 -7 20 -3 -4 -2 -14 -6 7 5 -3 15 19 3 -13 4 10 2 -2 1 0 13 22 -1 -10 13 8 -3 -3 13 -9
5803 -9 2 -2 -18 7 11 -4 -16 0 -6 -1 -1 -19 -5 9 -9 -21 -6 -3 5 3 -24 -11 0 -14 -7 8 -13 -5 12 -14 -12 23 5 -20 12 0
5839@j1J9j2j9M1nl0J2K0r%lj3MJ7j0krQJ7j2j6L0j2k0K4j5j4L2km8K7L2m1kK5
5875Cj2LK0l1j2M6k2k4K3J4k1K2j1j7K0J1l5J4oK7Mk4rK7j5lK1k6ML1l1k4M2J6
5909B5m0J2Rj7L0%l9J5L5l6pJ9oJ2Ll4J4J5rLLk1K1Jk7J5K0k7OJ8m3K4L7n1oM8
5945B2l9j0L3k0MK1j8l9M9K4k9J1qk1J9Nj5J3J2j9NjqK5%k9J6Oj5J2J0k2K2Kl9
5980b1J9K6j6oK7m5J1L2k2k7K6mj4NRQkpj4JJ8Jlk1J8J5l6J7K1k3Qmj6oL0J8n3
6017c0K9J7l1J7OoKjk7ML4jj4mQj8J5J3k3K0J5k4k4K1K3j0j8Qj3MK6ml5K2Ol0
6053b3OK9lj7J4k0j9N6%n4J5L0k2nJ5j9KL7l1k6K2K5j9jK4k9RK3k5RJ7qk1RjP
6089FLj4%K3j0lOpOjk7K0K2j3Jnrj0L5k8j1L6j2k2JRLJ6k2pJ3J2qolJ2Kk1j1L9
$$ plain form
5839 0 -11 8 -4 -23 18 13 -17 -5 15 6 6 3 -10 -6 11 1 -1 -10 -2 15 3 -13 17 5 -15 9 -6 -20 12 10 -38 -11 21 -20 -22 3
5875 3 -9 -6 14 -17 -29 17 -5 -29 -6 8 -13 9 -2 -19 1 12 -23 -9 -15 12 16 -8 -17 10 -5 -8 13 -13 -9 22 -9 -33 9 25
5909 25 -15 -3 6 -11 19 19 -20 -5 30 -6 -13 6 0 12 15 -19 -5 10 1 4 7 -14 7 8 -19 -4 16 -11 -5 13 -30 -6 31 -20 -26 22
5945 22 -17 -27 6 -14 -10 11 -7 -46 3 27 -2 9 1 -20 -1 4 -11 2 14 -5 0 -1 -9 16 16 -13 3 9 -6 6 16 -6 16 18 -21
5980 -21 -2 24 8 2 29 -16 -5 27 5 -22 4 0 -14 -9 0 8 6 -1 -15 -14 4 5 2 -19 -1 14 -22 -5 16 -7 1 -3 -19 -25 5 23 -30
6017 -30 -1 16 -15 2 8 2 4 3 -24 -20 14 13 -1 -5 3 -15 0 13 -10 10 25 1 -23 -2 21 11 -7 1 -12 -8 18 14 -21 1 7 -23
6053 -23 -17 12 9 -8 6 -14 -33 23 23 -31 -16 14 -8 -13 2 -17 -15 22 -9 -35 -13 12 -7 -8 16 -13 -4 19 -6 3 20 12 -9 0 -1 6
6089 6 9 -5 -5 18 8 5 11 4 10 9 -18 2 24 11 12 7 -2 -12 23 -5 -16 20 8 -14 -13 -4 -1 15 -7 -14 -1 11 3 -3 -6 6 8 -13 -24 15
6129A5j4pJ6l3LL1rk7L3J3l3jJ8k1RL1l6j3N5j7k3J8%j4K2k8%L1Lk6nJ6kRj4j3
6165a3J0J3pNj4RJ5l0nJ8nLRj2j0J3ll1L4K2l0R%j6K0J5k8mK6qk3K9j8NlkKJ5
6203A0Rk0Pj6J4Nj2lJ4Rk6ON%J5qj6NJ1lMj0%Oj5oK5%j4Oj4jK3%j8%J2j1Rj4m
6244a6J9ok0QMK1k7JnK6kk3RJ0%j2J2jJK7j1l2MJ6J%j1Qj7K6j7J0J9rj6NqJ1Q
6283A3j0jJ2j0oLjK0j5j0lkK0Mj8%KkMKqJ9k8mKJ8Noqj8K3Rj3%MJ2%j9%K4kk3
6325a1nNJ0lJ4nlLj3j3RM6j5k4lK1j2MlqLJ0qj3K0J4j9lMPk3K3j6j0J5J5k0%J5
6364HrpJ9k1MJ2j2j2K2Nj5K0j5lJ6Nl3RK1j4nJ1pK%Lj0OJ4j5j5J9J5j6j2K4pp
6402@J7j8oK9j4pmJ4j6J2prJ3Pj9MJ8mnMl3NK9l1KJ8Oj0Oj0KJ5j5j5J8J6j7J5
$$ plain form
6129 15 1 -6 10 -23 -20 11 2 -25 8 21 -12 -13 5 -16 -7 24 -12 -25 30 13 -10 8 8 -6 16 -12 -12 19 22 -4 -9 7 5 14 0 -13
6165 -13 -3 10 3 8 -6 3 18 -12 -17 1 -4 -1 8 -4 -14 -1 -4 -35 -1 21 -9 0 0 -16 4 19 -9 -13 13 5 -18 11 -7 -2 -5 -7 -5 10
6203 10 19 -1 6 -10 4 9 -3 -6 8 17 -9 -3 2 2 17 9 -7 -2 9 6 10 0 0 6 -9 -15 10 10 -4 2 -12 -13 10 10 -8 -8 4 -7 2 -12 -16
6244 -16 3 -3 -23 -15 -11 10 -17 -16 -21 5 3 -20 -11 -1 -1 -13 -1 -2 -1 26 15 -17 -13 3 4 4 -7 1 -16 10 -7 3 22 13 -3 2 -6 5 13
6283 13 3 2 14 4 -2 1 0 20 5 -5 -8 -10 10 14 -4 -4 -2 -4 0 2 -6 13 -15 -19 -17 1 6 0 -8 -26 -3 6 -7 -7 -3 9 9 -10 -10 14 12 -11
6325 -11 -16 -11 -1 -4 10 5 2 5 -8 -21 -12 34 19 -5 -8 13 1 5 2 -6 -3 7 -1 -14 6 20 1 -2 2 9 -14 9 -7 -17 -2 13 -7 -7 8
6364 8 -1 -8 11 -10 -6 6 -6 -18 4 9 -6 14 -1 -4 12 17 -16 -7 14 0 -5 6 -1 1 1 4 -6 0 14 -1 -16 3 18 2 -10 14 7 0
6402 0 17 -1 -7 22 8 1 -3 11 -5 7 0 -9 4 11 -8 -4 14 10 5 9 -24 -19 10 -21 -19 -1 5 -5 1 -9 -7 8 -7 -22 -4 12 -5 10
6440A0rk1L0Ml0J2J0j2K0nj6K3J1l4MLOjNj7K2j1j0QJkPPm1L7Mk7mL0j4qK1k1
6478hj0L5j9k9L3Pk2K1%l6L9J3k9JMRj0pKJ9oqLq%K5j1k9L7Ll2K7rj4L0ol5K3
6516CL3m0kM2l5J0J8l8j2L4Jl2K4OmJ2k3j4K1krJ3kl%mj1M1l1pJ4j6j3L6j4k4
6552b8M1rk5J4J2j1J5j4k5L7J2k4MJ6j8J6j0j6QK1j9PKmL2j5l0RK1k0%K3k7RL0
6587C4l6mK5l1RKkjJ0Jj8J8%oMj9K5Nl2mJ9mnJ2j4j3L6j3j3J5Kj6K1j0rK3lk2
6625a4oK3k5J5KpJ1J4l2QK3Mnj0KJ0Jk0J5JoK%k1K3J1k4%J4Lqj0oJ6J1j9jKNJ1
6665A3j6j6K0Kmpn%KJ2j6KJ2Nk1PRLoJ0j3RjpLKJ2j0pJ6%KpllJ4Pl5K7Jj1jQj3
6709dJ0J6k2QrRj1J6j0LNqj2PJ2j2qoRlJ3nj0%%J3k1JL9j8k2K3jj4K0qk2K9nj9
$$ plain form
6440 10 1 -20 10 14 -16 -4 6 -6 14 9 -7 16 27 -7 -3 0 6 5 10 -7 15 4 -6 2 3 1 8 15 -26 11 15 -12 -16 14 0 -8 13 -8
6478 -8 -18 17 -2 -31 2 9 -13 8 8 -28 11 24 -5 -4 0 9 -1 -8 -6 13 7 -1 2 -6 -6 19 8 -21 16 19 -13 14 5 -9 21 15 -20 3
6516 3 36 -4 -6 36 1 11 29 -9 -21 13 14 -18 6 12 8 20 -3 -17 4 2 -7 6 4 1 1 -3 -14 27 -4 -11 3 -13 -26 10 -4 -28
6552 -28 13 4 -21 -7 5 -6 9 -5 -30 7 19 -5 -1 15 -3 13 3 -13 -5 16 -3 4 6 2 34 19 -11 -2 19 -1 -1 22 -5 4 34
6587 34 -2 -6 19 -12 -3 -1 -3 -4 6 7 -11 7 7 1 5 -14 11 16 -16 -20 -1 -5 -10 2 -12 -25 11 -2 -15 0 2 -14 7 -3 -12 11 8 -14
6625 -14 -20 3 -22 -7 -5 -12 -1 13 -19 -11 12 16 11 1 3 13 14 -6 9 10 4 6 6 -15 8 19 -5 -5 9 12 4 -6 -12 4 15 -4 -5 -3 2 13
6665 13 -3 -19 1 3 -1 -8 -13 -13 -11 1 -15 -13 -1 4 -17 -10 -1 2 -4 6 -7 2 1 -6 -3 -1 11 1 -6 10 10 12 5 2 -1 13 20 -15 12 13 2 1 9 -4
6709 -4 6 22 0 8 -1 8 -3 13 3 6 11 3 -9 -2 10 -2 -10 -16 -7 -10 3 -2 -12 -12 -12 1 -20 -19 20 2 -20 3 2 -12 8 0 -22 7 2 -17
6749a7J0K5k3PJ9l5K1J2k3rJ9j1J3kj3J0kknOjOjk3J3K3j6kJ8j6mJ6l3K6K0l5
6785ij0J9j3J3Jk0LK4j7lLNkQrj2L3j7pLRmNkj9J6K1l6J5njJ2J3l1J6NnqRj6J5
6826BLp%J1j4qRj2J8Mj3NJ5l3%L5l4PK2k5pL2jj9J8j0j8K8pj7K4Pl0nK5j5J9r
6864@mj5J8j6J4pJ0J8qj6J3J2j2mj1PNNqJ0Qlj9lNJ1J0l2RQMj6J2Nj3J2j7lJ7
6903FJ1j7j3oJ1J4pjKKMooL%Jj2OJ0ooJkQJ0j9J2KJj4PjJ6Mpj9K3qj1MJ0o%J1
6947A2j3J2Qj2mojJ6poJ0J3j5j2J7j1Nlk8J5K1%k2J4k0J0KJj2J4J9l2RNoQLj3
6985imJ0Nj2K3rj0lLK3rQnk0J4J6j6qJ8rj7J1J2KJ3k5qLK7l5J1KNmMj4lK1Lk0
7025fpK1j1J1kj0KLj3NJ1%pLj2LQ%kj1mJ6J7k7J1J8k4kLLJ0rjoPK4j9j2K2rMo
$$ plain form
6749 -17 -7 18 -5 2 21 -14 7 19 -4 -13 6 -5 8 6 -7 3 1 -1 -6 0 -1 5 4 -19 -6 17 1 -1 17 1 -3 13 -20 6 26 -9
6785 -9 -19 0 -13 0 1 -19 -16 8 -9 -12 -9 -4 -6 2 -7 -19 14 -3 -10 -7 2 -2 3 1 -18 -2 19 -17 -2 -7 -8 4 17 -14 2 7 2 -6 3 -13 2
6826 2 5 -2 -2 9 -5 -13 -4 -16 2 6 -7 -2 13 -20 -20 15 -19 -12 10 -15 -22 10 9 -10 8 -2 -20 8 1 -16 8 15 -15 -20 5 -10 9 0
6864 0 -4 -19 -1 -17 -3 -10 0 18 10 -6 7 19 7 3 -8 -1 4 9 1 11 19 16 -3 -6 -1 10 20 -12 -3 5 9 -7 5 10 -3 9 -8 -11 6
6903 6 17 0 -13 -19 -8 6 -1 -2 0 2 6 0 -6 -3 -3 -2 -14 -8 2 -4 -10 -9 -11 -3 7 -12 0 2 3 -11 -4 -5 11 15 8 -11 12 4 -7 -3 7 1 1 12
6947 12 -1 11 19 7 3 -3 -4 12 5 -1 9 22 7 -5 12 1 6 3 -25 -10 11 11 -11 3 -17 -7 -5 -4 -16 -2 17 -15 -6 -1 -7 1 4 -9
6985 -9 -13 -3 2 -10 13 4 -6 -9 -6 17 8 16 11 -9 5 21 5 -3 15 6 -11 0 12 14 27 2 -6 -3 24 -11 0 2 7 3 7 -7 -10 11 14 -6
7025 -6 -13 8 -3 8 6 -4 -2 1 -12 -7 4 4 -3 0 -12 -9 -1 -1 -3 -14 -18 -2 15 -12 -1 17 -7 -9 -6 -3 7 -2 -3 -9 -2 22 3 -9 13 4 8 2
7067BkPJjj7KK4oMkjnrJ2mlOnk6NL3mk4J1nj0K3j6oJ9J1l3OOnJ5kj6NQnoJ5Kj2
7112hPMj0J8mj4RPjPj6J2pj3J3Rj5J6q%k4K4Lj0LQk9J7Kj2J5J2k9oL1j0JMJk1
7152a4QKKKjOj3j7K0Qj2Qpj0J4Ql0J4L1l0j0K9j2qJ9pj1J4LJJKolPj1J2NoplN
7194CNpORrj0NPj3L2k6k3K6Rj8J5nj7NMj4J2K2j6j4LOLNk0QJ%mJ%KJ7k2jJ7nk
7237cJ1j2lK0k1OJ0Nk2J4jrPMqmJ6Mk7J5Oj1nJ2Mj5K3kl1jL5k5pJ5%k0K0jj8J6
$$ plain form
7067 2 0 7 8 7 -10 -8 16 10 14 12 11 6 -3 9 5 2 8 3 -23 -18 15 11 -13 -2 -7 -17 6 -10 -16 3 14 -19 -13 -7 -12 3 1 -15 -10 -2 -7 -13 2 4 -8
7112 -8 -1 3 -7 11 7 -7 2 9 8 15 -1 11 4 -9 4 13 -2 14 6 6 -18 6 9 -1 2 10 -19 -2 0 -12 3 15 -14 -20 11 1 2 6 7 -14
7152 -14 -6 -4 -2 0 -1 5 -8 -25 -5 3 -9 -1 -8 -18 -4 4 -26 -12 19 -11 -21 8 -4 -12 7 0 -11 3 6 7 8 10 4 1 8 -3 9 14 8 1 -2 3
7194 3 8 1 7 16 7 -3 2 9 -4 28 2 -21 5 14 -4 11 6 -11 -6 -2 -16 -4 18 2 -12 -9 -3 0 5 -15 -7 -6 -6 -10 -9 -9 -7 10 -12 -13 4 -1 -3
7237 -3 8 -4 -7 13 -8 -2 8 13 -9 5 4 -5 2 6 -2 -6 10 14 -13 2 8 -3 -8 4 8 -7 16 14 -17 -18 17 -8 -15 0 0 -20 0 -1 -19 -3
$$ [...]
8191b
##END NTUPLES=NMR FID
##END=
