##TITLE=1H_LY-823.1
 CCl4, 8 sc, 
 28.5.2019
##JCAMPDX= 6.0         $$ Bruker NMR JCAMP-DX V2.0
##DATA TYPE= NMR FID
##DATA CLASS= NTUPLES
##ORIGIN= UXNMR, Bruker Analytische Messtechnik GmbH
##OWNER= root
$$ XWIN-NMR		Version 3.5
$$ Tue May 28 15:33:56 2019 Russian Standard Time (UT+4h)  she@DPX200
##.OBSERVE FREQUENCY= 200.1315
##.OBSERVE NUCLEUS= ^1H
##.DELAY= (6, 6)
##.ACQUISITION MODE= SIMULTANEOUS
##.ACQUISITION SCHEME= undefined
##.AVERAGES= 8
##.DIGITISER RES= 18
##SPECTROMETER/DATA SYSTEM= spect
##.PULSE SEQUENCE= zg30
##.SOLVENT NAME= CDCl3
##.SHIFT REFERENCE= (INTERNAL, CDCl3, 0, 15.7039)
##AUDIT TRAIL= $$ (NUMBER, WHEN, WHO, WHERE, WHAT)
$$ ##TITLE= Audit trail, XWIN-NMR		Version 3.5
$$ ##JCAMPDX= 5.01
$$ ##ORIGIN= Bruker BioSpin GmbH
$$ ##OWNER= she
$$ F:/spectra/data/she/nmr/H-F/1/audita.txt
$$ ##AUDIT TRAIL=  $$ (NUMBER, WHEN, WHO, WHERE, WHAT)
(   1,<2019-05-28 15:32:48.92 +0400>,<she>,<DPX200>,
      <created by zg, POWCHK disabled, PULCHK disabled
       configuration hash MD5:
       00 E9 B6 7A A2 85 ED C7 34 08 36 98 17 FE 4E 26
       data hash MD5: 16K
       23 D2 C2 36 84 BF CC B6 6E E2 6D 75 52 9D 6A 43>)
$$ ##END=
$$ 
$$ hash MD5
$$ 38 90 5D 2F F8 74 71 A1 46 04 BE 37 64 57 31 09
##$RELAX= 
##$RELAX= 
##$RELAX= 
##$RELAX= 
##$RELAX= 
##$RELAX= 
$$ Bruker specific parameters
$$ --------------------------
##$DU= <F:/spectra>
##$EXPNO= 1
##$NAME= <H-F>
##$PROCNO= 1
##$TYPE= <nmr>
##$USER= <she>
##$AMP= (0..31)
100 100 100 100 100 100 100 100 100 100 100 100 100 100 100 100 100 100 
100 100 100 100 100 100 100 100 100 100 100 100 100 100 
##$AQSEQ= 0
##$AQ_mod= 1
##$AUNM= <au_zg>
##$AUTOPOS= <>
##$BF1= 200.13
##$BF2= 200.13
##$BF3= 200.13
##$BF4= 200.13
##$BF5= 200.13
##$BF6= 200.13
##$BF7= 200.13
##$BF8= 200.13
##$BYTORDA= 1
##$CFDGTYP= 0
##$CFRGTYP= 5
##$CHEMSTR= <none>
##$CNST= (0..31)
1 1 145 1 1 1 1 1 1 1 1 1 1 1 1 1 1 1 1 1 1 1 1 1 1 1 1 1 1 1 1 1 
##$CPDPRG= <>
##$CPDPRG1= <>
##$CPDPRG2= <>
##$CPDPRG3= <>
##$CPDPRG4= <mlev>
##$CPDPRG5= <mlev>
##$CPDPRG6= <mlev>
##$CPDPRG7= <mlev>
##$CPDPRG8= <mlev>
##$CPDPRGB= <>
##$CPDPRGT= <>
##$D= (0..31)
0 1.2 0 0 0 0 0 0 0 0 0 0.03 0 0 0 0 0 0 0 0 0 0 0 0 0 0 0 0 0 0 0 0 
##$DATE= 1559043168
##$DBL= (0..7)
120 120 120 120 120 120 120 120 
##$DBP= (0..7)
150 150 150 150 150 150 150 150 
##$DBP07= 0
##$DBPNAM0= <>
##$DBPNAM1= <>
##$DBPNAM2= <>
##$DBPNAM3= <>
##$DBPNAM4= <>
##$DBPNAM5= <>
##$DBPNAM6= <>
##$DBPNAM7= <>
##$DBPOAL= (0..7)
0.5 0.5 0.5 0.5 0.5 0.5 0.5 0.5 
##$DBPOFFS= (0..7)
0 0 0 0 0 0 0 0 
##$DE= 6
##$DECBNUC= <off>
##$DECIM= 24
##$DECNUC= <off>
##$DECSTAT= 4
##$DIGMOD= 1
##$DIGTYP= 9
##$DL= (0..7)
0 120 120 120 120 120 120 120 
##$DP= (0..7)
150 150 150 150 150 150 150 150 
##$DP07= 0
##$DPNAME0= <>
##$DPNAME1= <>
##$DPNAME2= <>
##$DPNAME3= <>
##$DPNAME4= <>
##$DPNAME5= <>
##$DPNAME6= <>
##$DPNAME7= <>
##$DPOAL= (0..7)
0.5 0.5 0.5 0.5 0.5 0.5 0.5 0.5 
##$DPOFFS= (0..7)
0 0 0 0 0 0 0 0 
##$DQDMODE= 0
##$DR= 18
##$DS= 0
##$DSLIST= <SSSSSSSSSSSSSSS>
##$DSPFIRM= 0
$$ [...]
##$SUBNAM2= <"">
##$SUBNAM3= <"">
##$SUBNAM4= <"">
##$SUBNAM5= <"">
##$SUBNAM6= <"">
##$SUBNAM7= <"">
##$SUBNAM8= <"">
##$SUBNAM9= <"">
##$SW= 24.9337058887773
##$SWIBOX= (0..15)
0 0 2 0 0 0 0 0 0 0 0 0 0 0 0 0 
##$SW_h= 4990.01996007984
##$TD= 16384
##$TD0= 1
##$TE= 0
##$TE2= 300
##$TE3= 300
##$TEG= 300
##$TL= (0..7)
0 120 120 120 120 120 120 120 
##$TP= (0..7)
150 150 150 150 150 150 150 150 
##$TP07= 0
##$TPNAME0= <>
##$TPNAME1= <>
##$TPNAME2= <>
##$TPNAME3= <>
##$TPNAME4= <>
##$TPNAME5= <>
##$TPNAME6= <>
##$TPNAME7= <>
##$TPOAL= (0..7)
0.5 0.5 0.5 0.5 0.5 0.5 0.5 0.5 
##$TPOFFS= (0..7)
0 0 0 0 0 0 0 0 
##$TUNHIN= 0
##$TUNHOUT= 0
##$TUNXOUT= 0
##$USERA1= <user>
##$USERA2= <user>
##$USERA3= <user>
##$USERA4= <user>
##$USERA5= <user>
##$V9= 5
##$VALIST= <valist>
##$VCLIST= <CCCCCCCCCCCCCCC>
##$VD= 0
##$VDLIST= <DDDDDDDDDDDDDDD>
##$VPLIST= <PPPPPPPPPPPPPPP>
##$VTLIST= <TTTTTTTTTTTTTTT>
##$WBST= 1024
##$WBSW= 4
##$XGAIN= (0..3)
0 0 0 0 
##$XL= 0
##$YL= 0
##$YMAX_a= 46712
##$YMIN_a= -54032
##$ZGOPTNS= <>
##$ZL1= 120
##$ZL2= 120
##$ZL3= 120
##$ZL4= 120
##$ABSF1= 10
##$ABSF2= 0
##$ABSG= 5
##$ABSL= 3
##$ALPHA= 0
##$AQORDER= 0
##$ASSFAC= 0
##$ASSFACI= 0
##$ASSFACX= 0
##$ASSWID= 0
##$AUNMP= <proc_1d>
##$AZFE= 0.1
##$AZFW= 0.1
##$BCFW= 1
##$BC_mod= 2
##$BYTORDP= 1
##$COROFFS= 0
##$CY= 11.3945322036743
##$DATMOD= 1
##$DC= 2
##$DFILT= <>
##$DTYPP= 0
##$F1P= 18.9103706918063
##$F2P= -1.10871071338519
##$FCOR= 0.5
##$FTSIZE= 0
##$FT_mod= 4
##$GAMMA= 1
##$GB= 0.15
##$INTBC= 1
##$INTSCL= 1
##$ISEN= 128
##$LB= 0.24
##$LEV0= 0
##$LPBIN= 0
##$MAXI= 10000
##$MC2= 0
##$MEAN= 0
##$ME_mod= 0
##$MI= 1.114404
##$NCOEF= 0
##$NC_proc= 0
##$NLEV= 6
##$NOISF1= 3.799351
##$NOISF2= 2.8
##$NSP= 1
##$NTH_PI= 0
##$NZP= 0
##$OFFSET= 15.70392
##$PC= 1
##$PHC0= -8934.552
##$PHC1= 13.80025
##$PH_mod= 1
##$PKNL= yes
##$PPARMOD= 0
##$PSCAL= 0
##$PSIGN= 0
##$REVERSE= no
##$SF= 200.130013532006
##$SI= 16384
##$SIGF1= 3
##$SIGF2= 2
##$SINO= 400
##$SIOLD= 16384
##$SREGLST= <1H.CDCl3>
##$SSB= 0
##$STSI= 0
##$STSR= 0
##$SW_p= 3612.71676300578
##$SYMM= 0
##$S_DEV= 0
##$TDeff= 0
##$TDoff= 0
##$TI= <>
##$TILT= no
##$TM1= 0
##$TM2= 0
##$TOPLEV= 0
##$USERP1= <user>
##$USERP2= <user>
##$USERP3= <user>
##$USERP4= <user>
##$USERP5= <user>
##$WDW= 1
##$XDIM= 8192
##$YMAX_p= 0
##$YMIN_p= 0
$$ End of Bruker specific parameters
$$ ---------------------------------
##NTUPLES= NMR FID
##VAR_NAME=  TIME,          FID/REAL,        FID/IMAG
##SYMBOL=    X,             R,               I
##VAR_TYPE=  INDEPENDENT,   DEPENDENT,       DEPENDENT
##VAR_FORM=  AFFN,          ASDF,            ASDF
##VAR_DIM=   8192,          8192,            8192
##UNITS=     SECONDS,       ARBITRARY UNITS, ARBITRARY UNITS
##FACTOR=    0.0002004,     1,               1
##FIRST=     0,             0,               0
##LAST=      1.6414764,     0,               0
##MIN=       0,             -54032,          0
##MAX=       1.6414764,     46712,           0
$$ Real data points
##PAGE= N=1
##DATA TABLE= (X++(R..R)), XYDATA
$$ [...]
228d247O82Q399l919l701O823k982p197O296K986n546L828L020p450k68N239k788
$$ -4247 -3565 4834 915 -2786 4037 1055 -6142 154 3140 -2406 1422 4442 -3008 -3276 1963 -825
244h25l16M614k429k891J945j305o26L526k28j128J030l077j245M457p75k123
$$ -825 -1141 3473 1044 -1847 98 -1207 -1833 1693 1465 337 1367 -1710 -2955 1502 727 -1396
260a396M474j240n971L514K697m937K998N219o214k979N463j808k974N682Q15
$$ -1396 3078 1838 -4133 -619 2078 -2859 139 5358 -856 -3835 1628 -180 -3154 2528 3343
275C343n321J120J963l158N16L697l26j860m86l70jJ91J121J805j553k393J839
$$ 3343 -1978 -858 1105 -2053 -1537 2160 1834 -26 -512 -882 -883 -692 429 2234 681 -1712 127
292A27J60k888K719L408l715j401L073k468k107M903P55m090J626J627l804M0
$$ 127 287 -2601 118 3526 -189 -1590 1483 -985 -3092 1811 2566 -1524 102 1729 -2075 -2035
308b035L607p27j078J566j084k198R02J535K91nm13l06m93j049Q92J937o36o25
$$ -2035 1572 845 -233 1333 249 -1949 -1047 488 779 774 361 55 -438 -1487 -595 1342 706 81
326H1R37j687j818K653J585j992N27J142k617p60K580j38q98J811k53k716K13
$$ 81 1018 -669 -2487 166 1751 -241 286 1428 -1189 -1949 631 493 -405 1406 1153 -1563 -1350
343a350J640j83K48Q39r63j132K92L47J86N00L18j58p77r37M48J123j3j10L67
$$ -1350 290 107 355 1194 231 -901 -609 -262 -76 424 742 584 -193 -1130 -682 441 428 318 685
362F85q53r04Q89N16o64O02R05j161j062P27L57k45P52M08j143o01P16J03m84
$$ 685 -168 -1072 -183 333 -331 271 1176 15 -1047 -320 37 -208 544 952 -191 -792 -76 27 -457
381d57O03R20o68j108K69L81l82O78J054j098j291J053M05j257Q21J588j362j128
$$ -457 146 1066 398 -710 -441 -60 -442 236 1290 192 -1099 -46 359 -898 -77 1511 149 -979
399i79J298l92j268J882J228k269n23J746q65j102J941M83j894M35J155j540n39
$$ -979 319 -73 -1341 541 1769 -500 -1023 723 -142 -1244 697 1180 -714 -279 876 -664 -1203
416a203K123J58j781M34R40j186k82J622k33j440R41R38j705m09J911k39j394
$$ -1203 920 1078 -703 -269 671 -515 -797 825 592 -848 93 1031 -674 -1083 828 589 -805
433h05J138M77j776M28J627j243p80J822j64j730P73P91j048M29J068j070p27
$$ -805 333 810 -966 -538 1089 -154 -934 888 724 -1006 -233 558 -490 -61 1007 -63 -790
450g90R27P2n27M07K93k70j92j95J3L09J02J69j3p30j12Q78j21n30N51P3p02K46
$$ -790 137 209 -318 89 382 112 -80 -275 -262 47 149 318 305 -425 -537 341 220 -310 241 314 -388 -142
472a42L26m85K92N41n10l20K26n0K69J31n69K14N22o53r7P10o12k30J226n48j211
$$ -142 184 -301 -9 532 22 -298 -72 -122 147 278 -291 -77 445 -208 -305 405 -207 -437 789 241 -970
493i70J166M91j370N21J008j191j26J218q94p80J431J83j164M05L32o97L51O06
$$ -970 196 687 -683 -162 846 -345 -471 747 -147 -927 504 687 -477 -72 260 -437 -86 520
511E20n56j93L91j36k00L4J35L68j54n71K63K24m35M86M70j102q2J213o43q35
$$ 520 -36 -229 162 26 -174 -140 -5 363 209 -362 -99 125 -310 176 646 -456 -538 675 32 -803
531h03J247J34j266O85O46j337K10J519q90j045J183K31j115N03P18q86j22R59
$$ -803 444 578 -688 -3 643 -694 -484 1035 145 -900 283 514 -601 -98 620 -266 -388 571
549E71m03q58O40O33o19k73N23j28m64M53L25o22m8P50l16p73N29N80n54j05M46
$$ 571 168 -690 -50 583 -36 -309 214 86 -378 75 400 -222 -270 480 164 -609 -80 500 -54 -159 287
570B87m49k93P76J04p69J79N32m54k78N06P0l07K40j5n26J39O33j61l76J74ok05
$$ 287 -162 -455 321 425 -344 -165 367 -87 -365 141 211 -96 144 129 -397 -258 375 214 -162 12 6 -199
592a99K95L8m23L47L60o09j29O00l38k55P68k97q27R05M24j277K30J075q70j84
$$ -199 96 134 -289 58 418 -191 -320 280 -58 -313 455 158 -669 236 660 -617 -387 688 -182 -366
612c66J137q12q82J397O3j291Q70N92j260L43Q47j142J47J313r81p70J183k44
$$ -366 771 -41 -923 474 537 -754 116 708 -552 -209 638 -504 -357 956 -25 -795 388 144
630A44o66J017j57j032P58L53q05M20K93n50M18o8q68R39N01j263O36O88j736
$$ 144 -522 495 338 -694 64 417 -388 32 325 -225 193 125 -743 196 697 -566 70 758 -978
649i78N25J833j813o80K438r97j813K167M8k150J796R63k502P73J639j986J60
$$ -978 -453 1380 -433 -1113 1325 328 -1485 682 730 -1420 376 1339 -1163 -390 1249 -737 -577
666e77J760j741j30K150j773j085K584r18j672K519l14k598K243R98k996J217
$$ -577 1183 -558 -688 1462 -311 -1396 1188 270 -1402 1117 803 -1795 448 1446 -1550 -333
682c33K067k548J2K219j949n47K491j292j375K108n72j420J979l05j855J832M06
$$ -333 1734 -814 -802 1417 -532 -1079 1412 120 -1255 853 281 -1139 840 535 -1320 512 918
699I18k119J252R19j859Q95R73j989P33J502j994L05J796k169l7K731k260j474
$$ 918 -1201 51 970 -889 6 979 -1010 -277 1225 -769 -464 1332 -837 -874 1857 -403 -1877
716a877L610j001k985L264O21l937K168K498l866J84L670k481j731L076p49j976
$$ -1877 1733 732 -2253 1011 1632 -2305 -137 2361 -1505 -1321 2349 -132 -1863 1213 464 -1512
732a512K346R7k153J341N32j516J101M55j548J108O64k023P72J553j761R2J617
$$ -1512 834 931 -1222 119 651 -865 236 691 -857 251 915 -1108 -336 1217 -544 -452 1165
749A165j690m39K090j024j117J828n28j335J691k26j641J795M91k295J071J362
$$ 1165 -525 -964 1126 102 -1015 813 285 -1050 641 415 -1226 569 1060 -1235 -164 1198
765A198k107L77J950j859o91K235p66j451J505J12j138R03K4r00R04J6r64J060
$$ 1198 -909 -532 1418 -441 -1132 1103 337 -1114 391 503 -635 268 292 -608 296 312 -652 408
783D08Qj428J370P56k298N91K123j865q13K340q52j782J971M73k068Q17J353j374
$$ 408 416 -1012 358 1114 -1184 -593 1530 -335 -1148 1192 340 -1442 529 1002 -1066 -249 1104 -270
801b70l65R90l43j66M64l09j31K10l11K58L69o86J21Q04p89m92R65q7n17O16j88
$$ -270 -635 355 12 -154 310 1 -130 80 -231 27 396 -290 -169 635 -154 -646 319 232 -285 331 143
822A43o81O45J94o39M70J96p38M41L71r56L34J004q14n27Q44k05n20O60R0n85
$$ 143 -538 107 301 -338 132 328 -410 31 402 -554 -220 784 -30 -557 287 82 -438 222 312 -273
842b73K06K26j56p0j52K67M44o36l47Q83k55p33R24K03j199N58R37j176l21J209
$$ -273 -67 159 3 -67 -219 48 492 -144 -491 392 137 -596 328 531 -668 -110 827 -349 -670 539
862E39k88o30N80l6m87L32J10j89J56j30K4L41n95k20R60k04p19P37k7r19P85
$$ 539 251 -379 201 165 -322 10 120 -69 87 -43 -19 322 -273 -493 467 263 -456 281 254 -665 120
883A20M53j151M53R07j100j28J007q30k22J332p57r57J357m6j267J021M68j330
$$ 120 573 -578 -125 782 -318 -446 561 -269 -491 841 84 -873 484 438 -829 192 660 -670
901f70N59R16j274j05J226n41m95O79l15l19O52k49l42N44k57k73O13m52m38J083
$$ -670 -111 805 -469 -574 652 111 -384 295 -20 -339 313 64 -278 266 9 -264 349 -103 -541 542
921E42j57j045P96K99j084O88P26j285K12J146j106m20J269n30n79J182m37j072
$$ 542 385 -660 136 435 -649 39 765 -520 -308 838 -268 -688 581 51 -528 654 217 -855
939h55J125K52j211P17O44j104K80P86j083q6J169n12n39P58l02m86P15j43n45
$$ -855 270 522 -689 28 672 -432 -152 634 -449 -535 634 122 -417 341 39 -447 268 125 -420
958d20O68Q5o54L69N1n42O23L35r12K44O32p57l3P63n40k51Q55m06p30P47K04
$$ -420 248 333 -321 48 99 -443 180 515 -397 -153 479 -278 -311 452 -88 -339 516 110 -620 127 331
979C31o05M00J43o30L17L90n65P3M46l31n3K50m06N7N98l55l17M38k05l04N69
$$ 331 -274 126 269 -361 -44 346 -219 -146 300 -31 -84 166 -240 -183 415 60 -257 181 -24 -328 241
1000B41q2n15N49K13q15J56N53m26L5N67n46m21O88jn42L82L16m50l2K36k90j7
$$ 241 159 -356 193 406 -409 -253 300 -126 -91 476 -70 -491 197 196 -346 36 352 -98 -130 106 -184 -201
1022b01M41%l49j7J29J0q4L4J43j3j47Q8m7k61K53M36l95l23M15ql91L50K54m99
$$ -201 240 240 -109 -126 3 13 -71 -37 106 93 -54 34 -13 -274 -21 415 20 -303 112 104 -287 63 317 -182
1046a82Q4M71m89l72O98J78n66J38K61m50k1N55j66m12L78J86n10q5M57J4k07
$$ -182 -98 373 -116 -488 210 388 -178 -40 221 -229 -250 305 139 -273 105 291 -219 -304 153 167 -40
1067d0J28J1l73N0M64q7l73K65K52m67j62M94m0k81L66K6o33J32O38k87l50M40
$$ -40 88 99 -274 -224 240 153 -220 45 297 -170 -332 162 122 -159 207 233 -400 -268 370 83 -267 173
1089A73M1n16K03K83l19M4M58k37m97K18L55k02p8K61q6l09J62K01k91OM88j39
$$ 173 214 -302 -99 184 -135 -91 367 130 -367 -149 206 4 -74 187 101 -208 -46 155 -136 -130 358 219
1111B19n55J90L08k44M5L73l20l35M16M3m40K34M46k91l02J81J7j45K43K01k93
$$ 219 -336 -146 162 -82 -37 336 16 -319 97 140 -300 -66 380 89 -213 -32 -15 -160 83 284 -9
1132ik46K78J30l31K8M59j36m16K50R1m36L18N68n70m06O27jo05L99M10n14l0
$$ -9 -255 23 153 -178 -150 309 173 -243 7 98 -338 -20 548 -22 -428 199 198 -407 -8 402 -112 -142
1154a42M43l99l47O08K32m87n8K88j52j95K39J67k20o1K97j66m69L37N29m28k69
$$ -142 301 -98 -445 163 395 -92 -150 138 -14 -209 30 197 -23 -84 213 47 -422 -85 444 16 -253
1175b53M68j69m61N24K41o56K31N64o26l32O62j4l91L98L6n71J95M32l21j33L32
$$ -253 215 46 -415 109 350 -306 -75 489 -137 -469 193 179 -212 186 222 -349 -154 278 -43 -176 156
1196A56mk51j5N1P3J0O8O8k73j86M48Q2n27K85M59o01j60O18l32m02Q28Rr21L86
$$ 156 152 -99 -114 -63 10 20 88 156 -117 -303 145 227 -300 -15 444 -157 -317 301 -31 -433 395 404 -517 -131
1220a31N58o43oO09l67k64M74k02l60L63J66j58K5j72m9L10j65j75M42j60l93
$$ -131 427 -216 -222 387 20 -244 230 28 -332 31 197 39 64 -108 -157 153 -12 -187 255 95 -298
1241b98M86o2o46O07M87q48N6O05o23j00Q10m50m50P87j59p13N25K12m61L95J01
$$ -298 188 126 -520 87 574 -274 -218 387 -236 -336 474 24 -426 361 202 -511 14 226 -235 160 261
1262B61o33K89L03m37K76K01n54L61K90q68L15Q36q51q4R61q96n21J469m07j194
$$ 261 -372 -83 220 -217 59 260 -294 67 357 -511 -196 640 -211 -295 666 -230 -751 718 311 -883
1282h83J295K80j546P53Q78j389L09J291j207n30J297m58o73J019j71p85P56j3
$$ -883 412 692 -854 -101 777 -612 -303 988 -219 -749 548 90 -583 436 265 -520 236 223
1300B23p59O17K25n70N02k9q14O71L98r26N01N46j079K88Q52j144M3J352r36o74
$$ 223 -536 81 306 -264 238 209 -605 66 464 -462 39 585 -494 -206 646 -498 -455 897 -39 -713
1320g13J319n73r09J492p2j458J162M88j598O84R97j361L14J202j416k96J531
$$ -713 606 33 -876 616 544 -914 248 736 -862 -178 819 -542 -228 974 -442 -738 793
1337G93q50o19J447n95j057J412j32j403J317N50j604O70Q74j546L12J470j229
$$ 793 -57 -676 771 176 -881 531 399 -1004 313 863 -741 -71 803 -743 -431 1039 -190
1354a90n09J455o56r25J213q2q88R31J23j064N00M07o31M64K12p56M23L11q56
$$ -190 -699 756 100 -825 388 306 -582 349 472 -592 -92 315 -316 148 360 -396 27 338 -518
1373e18M43O63r55K63Q20j229j15J485q34p78J475m53j286J431K49j665J095J030
$$ -518 -75 588 -367 -104 716 -513 -628 857 23 -755 720 267 -1019 412 661 -1004 91 1121
1391A121j846J92J487j338l41J767r01j179J617j05j446J162N47j353N84P61j310
$$ 1121 -725 -533 954 -384 -725 1042 141 -1038 579 474 -972 190 737 -616 -32 729 -581
1408e81J49J158p91k92Q62o03l63Q60l81m55Q69k09o50O14j06n82Q17J28r11M94
$$ -581 -432 726 -65 -357 505 -98 -461 399 18 -437 432 223 -427 187 81 -501 316 444 -467 27
1428B7L23q15L92N39q09K59O94r50j45R61n72k50R98o48p01J152j90j034J078
$$ 27 350 -465 -73 466 -343 -84 610 -340 -485 476 -96 -346 652 4 -697 455 265 -769 309
1447C09L04j278P05O47j392L53J307j144m41J313o25q49J257p3j118R11M65j186
$$ 309 613 -665 40 687 -705 -352 955 -189 -630 683 58 -791 466 393 -725 186 651 -535
1465e35K63P71o94j9O62n35k67N84j34k83K93n7r9J73k35k8L41j96o5L18m09j88
$$ -535 -272 499 -195 -214 448 -87 -354 230 96 -187 106 49 -50 123 -112 -140 201 5 -60 258 -151 -339
1487c39O67k18m97O30Q1p52M23L19p39L27P12p32l10P41l11l96O63l2n46M14J57
$$ -339 328 110 -387 243 324 -428 -5 314 -425 -98 614 -118 -428 313 2 -394 269 237 -309 105 262
1508B62n75J28M06k10qJ65k66n1K44j15j6J38p9%O2k27J8K73m9j61J12p1j11J96
$$ 262 -313 -185 221 11 3 168 -98 -149 95 -20 -36 102 23 23 85 -142 -124 149 100 -61 51 -20 -131 65
1532F5K0j71R8Q4r9l8lM2J18o5j50P4J8k8J75m4k40J47J54k85MK78j03r9J88j72
$$ 65 85 -86 12 96 -3 -41 -44 -2 116 51 -99 -25 -7 -35 140 96 -144 3 157 -128 -124 154 51 -48 140 -32
1558c2k25K95J33k18L3J15j29m8Q2o5L8J45j2j36p1K5J14K4r3P6L8j36J1M6j34
$$ -32 -257 38 171 -47 -14 101 -28 -76 6 -59 -21 124 112 -24 -95 -70 44 68 -25 51 89 -47 -36 10 -124
1583a24J14K64k20k02K11J3j83K03O2k83J33K34l20j06L45j5k31J43J8k02J38
$$ -124 -10 254 34 -168 43 56 -127 76 138 -145 -12 222 -98 -204 141 126 -105 38 56 -146 -8
1604hJ72j77r8J63J1j09j7N5P9l7n3K4m2o5J94O6k65J7K57j72k03K67M5j88J45
$$ -8 164 -13 -111 52 63 -46 -63 -8 71 34 -19 5 -37 -102 92 158 -107 -90 167 -5 -208 59 104 -84 61
1629F1P5l39P0L20j34j55J88l1j48J00K1j21J36J15j69o3K1J4J02K6j03J4N8r4
$$ 61 136 -203 -133 187 53 -102 86 55 -93 7 28 -93 43 158 -11 -74 -53 -39 63 89 -14 0 58 -36
1653c6j4N4m1R6Q0j95q7J73jo6J48o2j70J44P1k33N8K58j05j67J13m7j02J93J02
$$ -36 -50 4 -37 59 139 -56 -143 30 29 -37 111 49 -121 23 94 -139 -81 177 72 -95 18 -29 -131 62 164
1678A64k11l8J64n1j49P2J37k8n5Ro9q4J42J73j31j64J53L7j83L6J79p2m7J42
$$ 164 -47 -85 79 28 -121 -49 88 60 5 14 -55 -139 3 176 45 -119 34 71 -112 -76 103 31 -16 126
1702A26j49j84K10J84j82o3J43r2j07J24M8j02J02J03k12j35J82R7o9L2Lj30k3
$$ 126 -23 -207 3 187 5 -58 85 -7 -114 10 58 -44 58 161 -51 -186 -4 93 24 56 59 -71 -94
1725i4J24k5p8J49N4j77q7P0P3L8O9n9j31rQ8%n6R5Q7j01j36M5K2L1J34Ok21k7
$$ -94 30 5 -73 76 130 -47 -134 -64 9 47 116 57 -74 -83 5 5 -51 44 131 30 -106 -61 -39 -8 126 132 -89 -116
1753a16J62n9q4J65O9j70nK3j16P9K50q1j94L4L9q1P8J03m9j9K2r7r8P6J80N3
$$ -116 46 -13 -97 68 137 -33 -38 -15 -131 -52 198 117 -77 -43 -4 -85 -7 96 47 28 50 -47 -145 -69 111 164
1779A64j44j07M8k7MJ49K6j39O5L8k61QL31qj78Q6p2k00J82J86j72jJ65j41j72
$$ 164 20 -87 -39 -66 -62 87 113 -26 39 77 -184 -176 155 147 -31 55 -17 -217 -35 151 -21 -22 143 2 -170
1804a70R4J01L7Q6q3j50m2O7R6N4n4j3M9j43j16J91J04p0J00p9k83R3K55j10j0
$$ -170 -76 25 62 148 65 -85 -127 -60 36 90 36 23 72 -71 -187 4 108 38 138 59 -224 -131 124 14 4
1829DJ72j46j72J24m2n7K83N6k89m5P8q6J31J49j14m5M3j40n3J44P2O9J4k45q5
$$ 4 176 30 -142 -18 -60 -117 166 222 -67 -112 -34 -120 11 160 46 1 44 -96 -149 -5 67 136 150 -95 -180
1854a80J52%L2J95j58j87J91p5k44L37K40l43k6J45k97K9M32j23k35K11m5k77
$$ -180 -28 -28 4 199 41 -146 45 -30 -274 63 303 -40 -66 79 -218 -189 243 120 -115 96 51 -226
1876b26J64J29o4J54jk95JJ07l1K19L4k91O7J29l28Q8M11j82j51K59l13k63N01
$$ -226 -62 67 3 157 156 -139 -138 -31 -62 157 191 -100 -33 96 -232 -144 267 85 -66 193 -120 -383 118
1899A18J06l46K57M2m51J61K55l15J84L88m43k15L22j75l7M69j80l56K91n7l23
$$ 118 224 -122 135 177 -274 -113 142 -173 11 399 -44 -259 63 -112 -149 320 140 -216 75 18 -305
1920c05L35J78k60J72Mm71K11L22k59J52K24n33mM49l56r8O76k43n26M26n5m74
$$ -305 30 208 -52 120 124 -347 -136 186 -73 79 303 -230 -234 215 -141 -239 437 194 -332 94 39 -435
1942d35N79L15o53J16L20n12O1M87k92j3L65m50k46M64q8j28M76k62n02M77K0
$$ -435 144 459 -194 -78 242 -270 -209 278 -14 -27 338 -112 -358 106 18 -110 366 104 -398 79 99
1963I9m75N31K55o23J73K58o32J93P02m57j96M70m32k82O53j31l53N72j02o81
$$ 99 -376 155 410 -213 -40 218 -414 -221 481 24 -172 298 -134 -416 237 106 -247 325 223 -458
1983d58L91K19m22M23L07p13K4M30m63Q0N71l73j71M24m55k98P52o1m12M94j61
$$ -458 -67 152 -270 153 460 -253 -229 201 -262 -182 389 16 -155 269 -186 -484 268 207 -205 289 128
2004A28o88N64L43o71L81N07q09j00O17m50q4Q07l46o00M87m4m29N29J83n00K53
$$ 128 -560 4 347 -324 57 564 -245 -345 272 -178 -262 545 199 -401 86 42 -387 142 325 -175 78
2025G8R1n77K46M35l18J27K22n77k7M93k79l3N29l75l37M55k59l16P72J4o56L49
$$ 78 169 -408 -162 273 -45 82 304 -273 -300 193 -86 -119 410 35 -302 153 -106 -422 350 364 -292 57
2047E7Q2o48M73N34o68R2N04o84j93P26k47k09O52l56o42N64J04m40N16J53o63
$$ 57 139 -509 -36 498 -170 -78 426 -258 -451 275 28 -181 471 115 -527 37 141 -299 217 370 -293
2068b93K40K50n98K81O22n19j06L86n08j50P17j76l47M82j69n25M01J49l29M13
$$ -293 -53 197 -401 -120 502 -17 -123 263 -245 -395 322 146 -201 281 112 -413 -12 137 -192 221
2088B21J16o02J11K29k93K63L05m40%K70m55J8N76k85j24M28m99l47P07k6m39
$$ 221 337 -265 -154 75 -218 45 350 -90 -90 180 -275 -257 319 34 -90 338 -161 -508 199 173 -266
2109b66N75m6p29M06L12o18L77N79p34j76N55m34j22P91k78n03M81r3n12M72K30
$$ -266 309 263 -466 -60 252 -366 11 590 -144 -320 235 -199 -321 470 192 -311 170 77 -435 37 267
2130B67l66K65M7n49J60L39k43J85J94m66K0L06l73Q1N17l44j75L42l78k18O88
$$ 267 -99 166 213 -336 -176 163 -80 105 299 -167 -147 159 -214 -133 384 40 -135 207 -171 -389 299
2151B99r4m24M05o3n24L94K40m75L39K97o60MM59l72P7N57m74l20N41k43l49O53
$$ 299 205 -219 186 123 -401 -7 233 -242 97 394 -266 -262 197 -175 -98 459 -15 -335 206 -37 -386 267
2173B67Kn19M02Ro27L93M51m73O9L33n33n9N18k50j41N04k52l98L39l4k42M72
$$ 267 269 -250 152 161 -466 -73 378 -95 -26 307 -226 -285 233 -17 -158 346 94 -304 35 1 -241 231
2195B31M7m99J86J18l47K64K47l42J32J87m89L8M32k33nL59m09k60N21j43l06
$$ 231 278 -221 -35 83 -264 0 247 -95 37 224 -265 -227 205 -28 -33 326 -83 -343 178 35 -271
2216b71N21Kn45L03J36n02L41M55n35o5L79m03q0N46k26k37M47k07m24M05R2l02
$$ -271 250 252 -293 10 146 -356 -15 440 -95 -160 219 -184 -264 282 56 -181 266 59 -365 40 132 -170
2238a70L63P6n75J90L22l93J36L97m00j09L57l17j66N45p2l43K71q8l38L73J46
$$ -170 193 269 -306 -116 206 -187 -51 346 -54 -163 194 -123 -289 256 184 -159 112 24 -314 59 205
2259B05l47K01J66m15M4K65k47J21L29l72j63K99j45r3L85j40k64K90q0l53L59
$$ 205 -142 59 225 -190 -146 119 -128 -7 322 -50 -213 86 -59 -152 233 93 -171 119 39 -314 45
2280D5J71l19J79Q4m45J57L65l09%L32k88j89L31j52j58M19l7l84J86O3k60K76
$$ 45 216 -103 76 160 -285 -128 237 -72 -72 260 -28 -217 114 -38 -196 223 186 -198 -12 51 -209 67
2302F7J60l35R2J83l21j1L29j65l9K62k51k27L29K3k08K34Mk65J27R6k39J52K25
$$ 67 227 -108 -16 167 -154 -165 164 -1 -40 222 -29 -256 73 96 -112 122 126 -139 -12 84 -155 -3 222
2325B22k23o1J12j81M0K64j40q8J44r8j31J69qp5J83l2k54R9J08r7J01P1j98J4
$$ 222 -1 -62 50 -131 -91 173 33 -55 89 -9 -140 29 21 -54 129 97 -157 -58 50 -47 54 125 -73 -59
2349e9J42j58j4J93n3r2J17j25j15K34L9j47N8L9j40O6P5j12O8J19j61n6Q9m8
$$ -59 83 -75 -89 104 51 -41 76 -49 -164 70 109 -38 20 59 -81 -15 60 -52 16 135 -26 -82 7 -41
2373d1M0J32j00j16J22k2j05J15N6q7N2K4j98L5J67m2k6M7q3k8P3l3j0R4j8p6
$$ -41 -1 131 31 -85 37 15 -90 25 81 -6 46 70 -128 -93 74 32 6 53 -30 -58 15 -18 -28 66 48 -28
2399b8jl1OJ09Rq8J0K6o6M8L5o6K9O0p8n9J05nl0L8m3m0P6L0p3K6L2m5L6l3m7
$$ -28 -29 -60 -54 55 64 -24 -14 12 -54 -6 29 -37 -8 52 -26 -85 20 15 -15 23 -20 -60 16 46 -27 -1 31 -14 22 -11 -58
2430e8O9O6p3j3J6m3L4M8n8k0Q4k1r3L8RJ0Q2j9j12OP3m0RL3k3rL8n9l8Q2L0k5
$$ -58 11 77 4 -9 7 -36 -2 46 -12 -32 52 31 -62 -24 -15 -5 77 58 -54 -48 25 -15 -6 27 4 -5 33 -26 -64 18 48 23
2462B3k8n0L1M8k1l3M9k9k4N6l3n8J12L3j18J4N1m4NQ1q2l5R6j3o8K5L4nJ3l0
$$ 23 -5 -55 -24 24 3 -30 19 -10 -34 22 -11 -69 43 76 -42 -28 23 -21 -16 65 -17 -52 44 31 -37 -12 22 17 30 0
2492@m3M0L6l1J5j7l8O8mr8P0Q3q3j2O2j07K0J19n9r8Q4K9p1K5K5m3M2L3q1k3
$$ 0 -43 -3 33 2 17 0 -38 30 26 -72 -2 81 -2 -14 48 -59 -39 80 21 -77 7 36 -35 -10 15 -28 14 47 -34 -57
2522e7O1KJ1j9m5M9L5p9L2N1p5K2Q4j31l3J87n3j27J21Rj40J25N0j52L2J51j23
$$ -57 4 6 17 -2 -47 2 37 -42 -10 41 -34 -12 72 -59 -92 95 42 -85 36 45 -95 30 80 -72 -40 111 -12
2549a2p1J08j9m1R4n3q5Q8K5n1K5j8k6Q6n6p4J06J3q5R0Kj66J24J36j97j3J86
$$ -12 -83 25 6 -35 59 6 -79 9 34 -17 8 -10 -36 50 -6 -80 26 39 -46 44 46 -120 4 140 -57 -70 116
2576A16j30r0J96p3j36J91K3k30J07J26j38J1R2j13OJ16q6k8O9m3JP8j09k8J55
$$ 116 -14 -104 92 19 -117 74 97 -133 -26 100 -38 -27 65 -48 -42 74 -12 -40 29 -14 -13 65 -44 -72 83
2601H3p0j10J54k3j20J40K9k14J23J50j91k5J60j07n3J75q3j17J57jj30J01Or7
$$ 83 13 -97 57 34 -86 54 83 -131 -8 142 -49 -74 86 -21 -74 101 18 -99 58 57 -73 28 34 -63
2625f3J11Pj72J08J01j36L4R3j73M4J70j73m7K01p7j41J80k4j82K06O3k76J12
$$ -63 48 55 -117 -9 92 -44 -10 83 -90 -46 124 -49 -96 105 28 -113 67 43 -139 67 130 -146 -34
2648c4J74k19J0J89j65p3K38p4j84J58M4j36N6N8q6L9N9j02L0M1n1P9nj69J14
$$ -34 140 -79 -69 120 -45 -118 120 46 -138 20 64 -72 -16 42 -44 -5 54 -48 -18 23 -28 51 46 -123 -9
2673iJ26j83K7J80j86o1K44j26j84K73M7l00J24J66k38O0K13k18p4K21p4j25J33
$$ -9 117 -66 -39 141 -45 -106 138 12 -172 101 148 -152 -28 138 -100 -40 173 -45 -119 102 28 -97 36
2696C6j6q6J24l2j07R4M1j11P7J9r7R3K8j43M4J08q5kP3j23LJ46p2r6J58k4j35
$$ 36 20 -66 58 26 -81 13 54 -57 20 39 -58 35 63 -80 -36 72 -13 -15 58 -65 -62 84 12 -84 74 50 -85
2723h5J14J0j26J15Q7j55k2J07n5j3R0o5m7Q4l5m4P0j1j6N7p1p6J25J9q8N1L2
$$ -85 29 39 -87 28 115 -40 -62 45 -10 -23 67 2 -45 39 4 -40 30 19 3 60 -11 -87 38 57 -31 20 52
2750E2j02K1R5r9l2J25J4j43L0P8m5qN7rp8M0M6q1m0J31J4j00OM5n7K0Q9o2n2
$$ 52 -50 -29 66 -33 -65 60 74 -69 -39 39 -6 -14 43 34 -44 -4 42 -39 -79 52 66 -34 -28 17 -40 -20 69 7 -45
2779d5P8lp6J6M7J5Pl3l8j3N0L6nm8QK5n5k1Q2%k6N0m0j19J15R5j14J1Q8j15l8
$$ -45 33 30 -46 -30 17 32 39 6 -32 -45 5 41 36 -12 -4 21 -34 -55 27 27 1 51 11 -108 7 102 -12 -1 87 -28 -66
2810f6J27n7p7J56Nj65L2P3o1M6O7j05kO5p2j1Q2l2oP9j36o3J63jr3J07rj51R5
$$ -66 61 4 -73 83 88 -77 -45 28 -33 13 80 -25 -27 38 -34 -45 37 5 -1 78 -58 -121 42 41 -52 55 46 -105 -10
2839a0O4j28M5J60j15q2J03m6l8J26k3j10P5j1p0O8L8q0Q4J6j52L8R5n9L7O2j27
$$ -10 54 -74 -29 131 16 -66 37 -9 -47 79 56 -54 21 10 -60 8 46 -34 50 66 -86 -48 47 -12 25 87 -40
2866d0j4J18q8m5J59k7j18J01n3j25J75Q6j90M1R4j63K7J54j03m0J66j04j44J39
$$ -40 -54 64 -24 -69 90 63 -55 46 -7 -132 43 129 -61 -20 74 -89 -62 92 -11 -51 115 11 -133 6
2890FK8q2J23k3j51Q7N4j07N5J02j39L4R6j78RK07q4r1J23n3j18J53J8j42J08
$$ 6 34 -48 75 52 -99 -12 42 -65 -10 92 -47 -13 83 -95 -86 121 37 -54 69 16 -102 51 69 -73 35
2915C5P7j70J2J06q6K1J21j45l1J07n9k8R5l8m0R5q6r4J26L3p9R3j4j59R9Q9j53
$$ 35 112 -58 -46 60 -26 -5 116 -29 -60 47 -12 -40 55 17 -23 72 -14 -108 18 51 -28 65 51 -108 -9 80 -73
2942g3O2J37j54l4J25j13k5J91o6j42J11J7j28J16M6j27N4R3j54jJ23o9MQ6j18
$$ -73 -11 126 -28 -62 63 -50 -75 116 50 -92 19 36 -92 24 70 -57 -3 90 -64 -65 58 -11 -7 79 -39
2967c9m1J40l5p7R1j3p1Q3jj10R2P5j25K7M0q3L9P3q7RQ5q4l8O7l1LR1p0q8P9
$$ -39 -80 60 25 -52 39 26 -45 38 37 -73 19 94 -31 -4 36 -47 -8 65 -22 -13 72 -12 -50 17 -14 -11 80 10 -78 1
2997AOn0Q6lr1P8Oj16M5J02p1PN1j20mJ38n0n9Q5k2p2O3Qq9Q2N1j00lO2o0K6M8
$$ 1 7 -43 43 40 -51 27 33 -83 -38 64 -7 0 51 -69 -73 65 15 -44 41 19 -53 10 18 -71 11 62 -38 -41 21 -39 -13 35
3029C5n8j3Q2l5n8N7Jk5N4j0q3M7L7l9NJ6k6L3nn8M0M5l7JJ3p5L0Q6p8k7P8k7
$$ 35 -23 -36 46 11 -47 10 11 -14 40 30 -53 -6 31 -8 -3 13 -13 20 15 -43 -3 42 5 6 19 -56 -26 60 -18 -45 33 6
3061Fn4O2Mo2P4Qj04J7P4l9J2M9n7k1O3l0n7P3Om1M0k7m6Q1Jn7J2L3o3M5K4p2
$$ 6 -48 14 18 -44 30 38 -66 -49 25 -14 -2 47 -10 -31 32 2 -55 18 24 -17 23 -4 -50 31 32 -25 -13 20 -43 2 26 -46
3093d6K6Q6o7l4L9l3J7O5l8o0O8J7n5J4K3k4K6Km7%N2l9K8qm7M0K5n8mP0l8k5
$$ -46 -20 66 -1 -35 4 -29 -12 53 15 -45 23 40 -15 -1 22 -2 24 26 -21 -21 31 -8 20 12 -35 5 30 -28 -32 38 0 -25
3125b5P0o5m6J08kr6M3O6q8K0M9o6QP5m2l9L1OoL1l5l0O6k9l0L7j0k2O5k6q4P3
$$ -25 45 -20 -66 42 40 -56 -13 53 -35 -15 34 -32 -24 51 9 -30 1 7 1 32 -3 -33 33 4 -26 11 1 -21 44 18 -66 7
3157GL9o9K9L9p9J7R5r2m3J15k7q6O8Np2P1L3q2J1N3k3k9J8j9M5J2n6MK4m2K9
$$ 7 46 -23 6 45 -34 -17 78 -14 -57 58 31 -55 13 18 -54 17 50 -32 -21 32 9 -20 -2 -21 24 36 -20 -16 8 -34 -5
3188eN6r4oJ11o0j01J17K1j07Q4M5j32L5J09r3l4R7m2n6P2j4n4Q1J6p3L3Kl5N3
$$ -5 51 -43 -49 62 2 -99 18 39 -68 16 61 -71 -36 73 -20 -54 43 1 -55 17 3 -51 30 46 -27 6 8 -27 26
3217B6j6n4O8J8p9J6M7p4O4O7j23NJ16j00l5J18m8q5J28j6j46R4J06j30oJ05q5
$$ 26 10 -44 24 42 -37 -21 26 -48 16 83 -40 -35 81 -19 -54 64 16 -69 59 43 -103 -9 97 -33 -39 66 -19
3244a9l4R4l0m6M4J3k8Rl3nR4n9o3Q8k1p0R0K8j35P7J03j72oJ59q4p5J45m1j15
$$ -19 -53 41 11 -35 9 22 -6 3 -30 -35 59 0 -63 25 4 -66 24 52 -83 -6 97 -75 -81 78 -6 -81 64 23 -92
3273i2J30K6j28N4O4r3L0N5q1RR2n5m0O0m6oN5n2k0J04m8o5P0m1n1J19oj34J04
$$ -92 38 64 -64 -10 54 -39 -9 46 -35 -26 66 11 -29 31 -15 -21 34 -18 -38 66 18 -47 23 -18 -69 50 44 -90 14
3302A4P0j69N0J47j62k3J80j09j24J63L4j50Q4N3j18L4O5o8%O1l8rK0n6M4N6q0
$$ 14 84 -85 -35 112 -50 -73 107 -2 -126 37 71 -79 5 58 -60 -26 39 -29 -29 32 -6 -15 5 -51 -7 49 -31
3329c1kR1q3l5J35o7r2J42J2j50N7Q0r8L6P9j05%R1p1l8Q0j3m4N4l1n6P3K5n6
$$ -31 -33 58 -25 -60 75 8 -84 58 70 -80 -23 57 -41 -5 74 -31 -31 60 -11 -49 31 18 -26 28 -3 -59 14 39 -17
3358a7J7Pn2M4J8n3L7M4p2nN3o7K5R7q4o4R9J0j08P6L0p2L1P3r1n2R7J8n8OJ6
$$ -17 0 7 -45 -1 17 -36 1 45 -27 -32 21 -46 -21 76 -8 -72 27 37 -71 5 35 -37 -6 67 -24 -76 21 39 -19 -13 3
3389Crj0J0J5jl1M2nn8J1J01m5p5O7Ro3M2M6p7JP8m3m5N4J0k9J6pj9jK6j5k2L5
$$ 3 -6 -16 -6 9 8 -23 19 14 -44 -33 68 23 -52 15 24 -39 3 49 -28 -27 51 8 -37 17 27 -2 14 7 -12 -13 13 -2 -24 11
3423A1Oj9rRn%K1ln0K0M5k6k6M9nm4L9Om4J9M4l1l6K6J4k7pK2lJ6j8LJ0k1J2M6
$$ 11 17 -2 -11 -2 -7 -7 14 11 -39 -19 26 0 -26 23 18 -26 13 19 -25 -6 38 7 -29 -3 11 -16 -23 -1 -4 12 -6 -3 7 -14 -2 44
3459D4l2o3P0L1r0L6M7o5OP3o2n3P6L4q2J5L9l3J3J5l0PK0j5o%k4L7K8o1NM8n0
$$ 44 12 -51 19 50 -40 -4 43 -22 -16 57 -5 -58 18 52 -30 -15 24 -9 4 19 -11 -4 16 1 -5 -5 -29 8 36 -25 -20 28 -22
3492b2%O1n8k9R7l4p7P6L0r3O2K9j12N4R3j04k5J13m7o0R4m2p8J09J6r8M4N0q0
$$ -22 -22 39 -19 -48 49 15 -62 14 44 -49 13 42 -70 -16 77 -27 -52 61 14 -46 48 6 -72 37 53 -45 -1 49 -31
3521c1L4L4n4NO4p2j3O2n8K5Q1r4m2J14k2q9R0L1j21P2N3j30K0J04o1l7N9l0k4
$$ -31 3 37 -17 -12 52 -20 -33 29 -29 -4 77 -17 -59 55 33 -56 34 65 -56 16 69 -61 -41 63 2 -35 24 -6 -30
3550c0N8l7k2O5m1l0O6m6l5J13l2j01P5L5j03O8P0j26K2J29j10o7J40l4q6J11
$$ -30 28 -9 -31 34 -7 -37 29 -17 -52 61 29 -72 3 38 -65 3 73 -53 -31 98 -12 -79 61 27 -59 52
3576E2j5j11R5N9j18K1Q4r3J0O3p4k2J23m5q0O7%m3N0no0M5L0o2K8K9m0L6J0r0
$$ 52 37 -74 21 80 -38 -17 67 -26 -16 47 -27 -49 74 29 -51 16 16 -27 23 18 -42 3 33 -29 -1 28 -12 24 34 -56
3606e6M2O5n7k0P7o1l2O6j1o8P1K9p7J5K5m1K5K8m4lO4l4pK4m6J1P1n7n4R2qo7
$$ -56 -14 51 -6 -26 51 -10 -42 24 13 -55 16 45 -32 -17 8 -33 -8 20 -24 -27 37 3 -4 20 -26 -15 56 -1 -55 37 29 -38
3638c8O5jo9M8N9q7%P7m4m4P0l9l6O7Op9L6L5n0J8K8m5PN2m6j9L9lj6J6nk6L1
$$ -38 27 26 -43 5 64 -23 -23 54 10 -34 36 -3 -39 28 34 -45 -9 26 -24 -6 22 -23 -16 36 -10 -29 10 7 -9 7 2 -24 7
3671G%k7K1lpK4j5l3L7K1m4J1K1m1J7L6n5qN8j6l1L3nk9M7j2l6J6L8l7J4J6m0
$$ 7 7 -20 1 -2 -9 15 0 -33 4 25 -19 -8 13 -28 -11 25 -30 -38 20 4 -27 6 1 -28 19 7 -29 -13 25 -12 2 18 -22
3704b2K6L7n0l0N9ml3L6j6l1M3J0l5pM3j4k3Pj6LJ5Qk3J4J3j9Lpj5L8J3k9oLJ0
$$ -22 4 41 -9 -39 20 16 -17 19 3 -28 15 25 -10 -17 26 12 -11 -4 -20 -17 -2 6 -17 -3 10 -9 -6 -13 -28 10 23 -6 -12 -9 1
3739AoqlJ5Qj3qJ1mK5kk6pK6qJOJk1J8ll2K0K4oj0J1j5OK4k5lJ6Kj6j3K0OjOk3
$$ 1 -5 -13 -16 -1 7 -6 -14 -3 -7 18 16 -10 -17 9 1 2 8 9 -12 6 3 -29 -9 15 9 -1 10 -5 1 25 0 -3 13 15 -1 -14 6 12 11 17 -6
3780fk4K6K4k5jK2k0j1J7j7j5N0Lm6nJ7NLOj0j1J6Mj3J9J3j2Rk7j5L5Rk1MJ1l1
$$ -6 -30 -4 20 -5 -6 16 -4 -15 2 -15 -30 20 23 -23 -28 -11 -6 -3 3 -7 -18 -2 2 -11 8 21 9 18 -9 -24 11 20 -1 3 14 -17
3816a7J2J8k7J5K2ol7RMlK1oj2J7kj4J7j7NM3k9m4K7Rj8K9Rn3J9L4m7ML9pl3K7
$$ -17 -5 13 -14 1 23 17 -20 -11 -7 -10 11 5 -7 10 8 -6 11 -6 -1 42 13 -31 -4 5 -13 16 25 -28 -9 25 -22 -18 21 14 -19 8
3852Hj3k8L1L0m6KL1l1qL3j4j6K8%m1RL4qlJ4l4J0J6m%Qj9K6Lm1PM7j9k3K0j2
$$ 8 -5 -33 -2 28 -18 -16 15 -16 -24 9 -5 -21 7 7 -34 -25 9 1 -2 12 -22 -12 4 0 0 8 -11 15 18 -23 -16 31 12 -11 9 -3
3888ck1M5j6m2M4M3n5jK2k1KM2l7j7L9j1k0J1oj2L6j7l8L0Pk4L8j9k8J2M8o3%
$$ -3 -24 21 5 -37 7 50 -5 -6 16 -5 -3 39 2 -15 24 13 -7 4 -2 -14 22 5 -33 -3 4 -20 18 -1 -29 -17 31 -32 -32
3921c2N6l1k9L3J5o3O3J4o9J2N5l9kL2k6j3L7Jm4L4J9k3PQk8L5ok7RJ7j9J1J6
$$ -32 24 -7 -36 -3 12 -51 12 26 -43 -31 24 -15 -17 15 -11 -24 13 14 -30 4 23 0 7 15 -13 22 16 -11 -2 15 -4 7 23
3954B3n2J5M6l4j4K5j3j6L3kl2L5K7p2QN1l8OL8m3k3O0k1l9L0J7l7L1mk5K8Qj8
$$ 23 -29 -14 32 -2 -16 9 -4 -20 13 11 -21 14 41 -31 -23 28 -10 -4 34 -9 -32 28 7 -32 -2 15 -22 9 5 -20 8 16 -2
3987b%Jk8K7K8m6mN2l0l3M8Ro1N9K6p1QM2j9j9K5oMokJlJ8J2qk4j3L6k5k6M5j
$$ -2 -2 -1 -29 -2 26 -20 -24 28 -2 -35 13 22 -39 20 46 -25 -17 25 6 -13 12 6 10 4 2 3 0 18 30 22 -2 -15 21 -4 -30 15 14
4024A4m5K7L1o4K2M5k9l6M6jl4M5ll8J0L9n4rN0ml0K3nl0L2K1l2JJ7j2k8L1Lj
$$ 14 -31 -4 27 -37 -15 30 1 -35 11 10 -24 21 18 -20 -10 29 -25 -34 16 12 -18 5 0 -30 2 23 -9 -8 9 -3 -31 0 3 2
4058BJ3%k4pJ6J7%l6J5L3k5l8O4ll6K4J7o6MP2m3k0M8Kn7K0L2m1J8L3k9l0J5L
$$ 2 15 15 -9 -16 0 17 17 -19 -4 29 4 -34 30 27 -9 15 32 -34 -30 42 -1 -21 27 29 -28 -8 24 -17 1 34 5 -25 -10 -7
4092gK4j9pJJ5j5LK0k2%M2l5m3L5L6n8K0M4o1ON0m3k2P8l0m5L5J5l9J9M5n6j5
$$ -7 17 -2 -9 -8 7 -8 -5 15 -7 -7 35 0 -43 -8 28 -30 -10 34 -27 -21 29 -14 -36 42 12 -33 2 17 -22 -3 42 -14 -29
4125b9O0j9n0M6J0j5%Kj0%K3JJ2l4rM2l2k7O2Ro9L3K5p9MR9n3n6Q6Jp6L6M2p2
$$ -29 31 12 -38 8 18 3 3 5 -5 -5 18 19 31 -3 -12 30 -2 -29 33 42 -27 6 31 -48 -44 55 2 -54 32 33 -43 -7 35 -37
4159c7K7N0n7l9O0mk0L4j2j3J6nmK0j8nL0k5m1O9Po4L3L6p6J0Q7q1j6R4m7p1O8
$$ -37 -10 40 -17 -56 4 0 -20 14 2 -11 5 0 -4 16 -2 -7 23 -2 -43 26 33 -31 2 38 -38 -28 59 -22 -38 56 9 -62 6
4192FK3p2M6M9q5jP2m4l0N2Jk4QmpRMM%m4K0M8l4l5Q0k9o5N5K1q2M2P2q9k3R3
$$ 6 29 -43 3 52 -33 -34 38 -6 -36 16 17 -7 1 -3 -10 -1 3 7 7 -37 -17 31 -3 -38 42 13 -52 3 24 -58 -16 56 -33 -56 37
4227C7m9m6Q7lp9N1M2p4lO4qm4L3k7J0K4j4KJ1k1J4Rl5%O4l5m1O1j9n9O0L6p9
$$ 37 -12 -58 29 26 -53 -2 40 -34 -37 27 19 -25 8 -19 -9 15 1 3 14 -7 7 16 -19 -19 45 10 -31 30 11 -48 12 48 -31
4260c1J6P5o5n0Q2k0l3M6mn0K4M1l5JJ5lj2j2jJ6pkK1k4l4L8M5p4J0O6n5l8O5
$$ -31 -15 60 -5 -55 27 7 -26 20 16 -34 -10 31 -4 -3 12 9 -3 -15 -16 0 -7 -9 12 -12 -46 -8 37 -37 -27 39 -16 -54 11
4293A1j8l7P2Rq3PP2l8j2M8j2m3L2J4n6J7M2qk7mK2MmJJ2l5OL2k4l0N1Ql9kK2
$$ 11 -7 -44 28 37 -46 -39 33 -5 -17 31 19 -24 8 22 -34 -17 25 17 -10 -14 8 12 8 9 21 -14 -8 24 0 -30 21 29 -10 -12 10
4328A0l5MM8k7k7L1J5l8PK9j7j1K4k9NJ0J8k0k2J7J4j6mJK0qoJ8m4J1M0j2l7L2
$$ 10 -25 -21 27 0 -27 4 19 -19 -12 17 0 -11 13 -16 -11 -1 17 -3 -25 -8 6 -10 -14 -13 7 -1 -7 11 -33 -22 18 6 -31 1
4362AK0m1J5J5j9lM1j9k2J5L2l3KJ2j8j1J4Rrj1K6Jl5LL1j3pJ3jk9J3K3m8K6L6
$$ 1 21 -20 -5 10 -9 -12 29 10 -12 3 35 2 4 16 -2 -13 1 10 1 -10 16 17 -18 -15 16 3 -4 9 8 -21 -8 15 -33 -7 29
4397B9k7k9L0Rl7K6J0k6qL8k0knJ2Lr%J1qj0K8j8j7J2L2l2j4L5nj9J9j0k6K8L0
$$ 29 2 -27 3 12 -25 1 11 -15 -23 15 -5 -7 -12 0 3 -6 -6 5 -3 -13 15 -3 -20 -8 24 -8 -22 13 8 -11 8 -2 -28 0 30
4432C0k7j3J9rllJ9mJJ2j7j4KJ9ok1J1J1k2RRKk2L8lm4J1L3l4OK0j6k7N3j2l6
$$ 30 3 -10 9 0 -3 -6 13 9 10 22 5 -9 -7 12 6 -15 -4 7 -15 -6 3 5 -17 21 18 -26 -15 18 -16 -10 10 -6 -33 20 8 -28
4468b8L5J0qj5OmlJ0nQnnnJj2K3K0l8J2L5l9%L1j7j4J4J5l9PK6j7mK7k0j1J4P
$$ -28 7 17 9 -6 0 -4 -7 3 -2 6 1 -4 -9 -8 -20 3 23 -15 -3 32 -7 -7 24 7 -7 7 22 -17 -10 16 -1 -5 22 2 -9 5 12
4505A2k2jK0pLqJ1Oj8MJj8pM2j6k6K9kl4K5K5l6PJ8k2l2L7K6l8RK0k6mK8qk0M2
$$ 12 -10 -11 9 2 5 -3 8 14 -4 0 1 -17 -24 18 2 -24 5 3 -31 -6 19 -17 -10 8 -14 -46 -9 17 -21 -12 8 -18 -22 6 -2 -22 20
4542B0mj5j0Q%Mj0NKmj0L7l0k4O5j0m4K0J9k7QK7l9KL5j8k3K4J6l6QRk8K6lkO
$$ 20 16 1 -9 -1 -1 3 -7 -2 0 -4 -14 23 -7 -31 34 24 -20 0 19 -8 0 27 -12 -10 25 7 -16 8 24 -12 -4 5 -23 3 0 -2 4
4579Dj4J%J4j8NK0l3LJ2k3J1L4k3l9O9k2m2M7J8m7RM7n3mO6l4l3M2jl3J7Rj0O
$$ 4 -10 -9 -9 5 -13 -8 12 -21 -18 -6 -29 -18 16 -7 -46 23 1 -41 6 24 -23 -14 33 -20 -24 42 8 -25 17 16 -17 0 9 -1 5
4614EJ3k1K0k7J8J0kk8J2K3l4JK5k6lL8k5j5K8Qk4K4ml2KM3k9jK5k9pQKk8L6Q
$$ 5 18 -3 17 -10 8 18 16 -12 0 23 -11 -10 15 -11 -14 24 -1 -16 12 20 -4 20 16 -16 -14 29 0 -1 24 -5 -12 -4 -2 -30 6 14
4650A4m8K4Rj8K2J3l4J3K6k5j7L2k0QJ9j5k5L9jl0N0qm4K6K4o8K0N0k7k8L5Nk4
$$ 14 -34 -10 -1 -19 3 16 -18 -5 21 -4 -21 11 -9 -1 18 3 -22 17 16 -14 36 28 -16 10 34 -34 -14 36 9 -19 16 21 -3
4683cQJ1j4mK0l7J0mJ6Mj4j2K6kk2J7J7m0ML7m2j3N9j9l1K8ll6L2L3m7QM0m7p
$$ -3 5 16 2 -2 18 -19 -9 -13 3 7 -7 -19 7 5 -17 0 17 -23 -19 18 -24 -37 22 3 -28 0 -3 -39 -7 26 -21 -13 27 -20 -27
4718b7L8k7lK9kl7J5K2pMNj1j1L1k2nJ5Qoqj9J7J4MpjlqJ3pkJ0Mk6RNj1OOj5j
$$ -27 11 -16 -19 10 8 -29 -14 8 1 5 10 -1 -12 19 -3 -8 7 15 9 1 -18 -1 13 17 10 9 6 -2 11 4 2 12 16 -10 -1 4 -7 -1 5 -10 -11
4759a1J5j2mJ2pnK1j0l8K9L1k6NMk0KJ8nmJ3Nl4J2J3j7OK6k4j4K0Rl3K4J0Mj3
$$ -11 4 -8 -12 0 -7 -12 9 -1 -39 -10 21 -5 0 4 -16 -14 4 -1 -5 8 13 -21 -9 4 -13 -7 19 -5 -19 1 10 -23 1 11 15 2
4795BJj0J7QJk3kJ2LQjopK3l8J3qJ1NRj8j8J8Mj7QllK2k8PJ8j5J0j0n%K0jj7J0
$$ 2 3 -7 10 18 19 -4 -6 6 9 17 16 10 3 26 -12 1 -7 4 9 18 0 -18 0 4 -13 -5 -8 -11 11 -17 -10 8 -7 3 -7 -12 -12 8 7 -10 0
4836@Oj7lJ5nlL8l3j6J9Mk3K1K3k4oK9l6k0N2nj9J1oj5J8J8j5lKjj5J1Oj3J7%
$$ 0 6 -11 -14 1 -4 -7 31 -2 -18 1 5 -18 3 26 2 -4 25 -11 -31 21 16 -3 8 2 -13 5 23 8 5 7 6 -9 2 8 -5 12 12
4873A2k3RKNokkJ3pk5J3J6k1K3j0k0J3J6j0oJ5j5lJ5kj8J8Pkj1jKMJ2j8J1J1k0
$$ 12 -11 -2 0 5 -1 -3 -5 8 1 -24 -11 5 -16 7 -3 -23 -10 6 -4 -10 5 -10 -13 2 0 -18 0 7 5 -6 -7 -5 -1 11 -7 4 15 -5
4911eoK2k3J4J9k6j3J7Nj2J8Ll2L7oj1j9L0jk1J7Kk9K3J5k3j0J5nj7J1K1oj4M
$$ -5 -11 11 -12 2 21 -5 -18 -1 4 -8 10 13 -19 18 12 1 -18 12 11 -10 7 9 -20 3 18 -5 -15 0 -5 -22 -11 10 4 -10 -6
4946frmOJ7jl2K1Pj4mJ6mpJ4%k5L7jj7qK7j9mL1j1j7J4J3k3j3J8NoJ5k1j3J4P
$$ -6 -15 -19 -13 4 3 -29 -8 -1 -15 -19 -3 -7 -14 0 0 -25 12 11 -6 -14 13 -6 -10 21 10 -7 7 20 -3 -16 2 7 1 16 -5 -18 -4 3
4984CqJ0jJj5Rj4J0RoOj1%NOj1OJ5j1j3PLmlJ3j2pK1j9lJ3Oj0jJ3k1nK7nj2QJ
$$ 3 -5 5 4 5 -10 -1 -15 -5 4 -2 4 -7 -7 -2 4 -7 -1 14 3 -10 -3 0 -4 -7 6 -6 -13 8 -11 -14 -1 5 -5 -6 7 -14 -19 8 3 -9 -1 0
5026@Lj6K2mkjJ2k1kK8j5KmPkj2K1pj9J2Ql0RL7l5JK4k0j6L1Jl4J3J1j2qK3j1
$$ 0 3 -13 9 5 3 2 14 -7 -9 19 4 6 2 9 7 -5 16 9 -10 2 10 -20 -11 26 -9 -8 16 -4 -20 11 12 -22 -9 2 -10 -18 5 -6
5064fJJ3qk1NJ8j2kOmOMj7RJ8j3Mj8QOLnpNJ4mmOj2J2Mk0lJ4J0pJ6rj2J2Pk0P
$$ -6 -5 8 0 -21 -16 2 -10 -12 -6 -10 -4 0 -17 -8 10 -3 1 -17 -9 -3 0 -5 -12 -7 7 3 -1 5 -7 5 9 -11 -14 0 10 3 19 10 -2 10 17 -3 4
5107Dj0J6Qk4lJ8lj6J3j5pJ0J0j2kK0qj3K0j6MNMj2OJ3j3nJ2j6QJ1j2j2RK6k5
$$ 4 -6 10 18 -6 -9 9 6 -10 3 -12 -19 -9 1 -11 -13 7 -1 -14 6 -10 -6 -1 3 -9 -3 10 -3 -8 4 -12 -4 7 -5 -17 -8 18 -7
5144gMMlrJ1Mk0K0ljj0JK1mjpLj4J8jj7jL2lk3J8Nj9NJj0lK4j1j4K1j0rjRqlK9
$$ -7 -3 1 -2 -11 0 4 -16 4 1 0 -10 -9 12 8 7 0 3 -11 7 6 -11 -12 20 17 -6 12 17 -2 3 4 -6 -9 15 4 -10 11 1 -8 -9 0 -8 -11 18
5187A8k9MLolOlPJ5j6j4J3OnOj0jJ9j3j4K2n%OPj7mPKqK0j3j2J6Kj5PPj0KKKk
$$ 18 -11 -7 -4 -10 -13 -7 -10 -3 12 -4 -18 -5 1 -4 2 -8 -9 10 -3 -17 5 0 0 6 13 -4 -8 -1 1 -7 13 0 -12 4 6 -9 -2 5 -5 -3 -1 1 -1
5230aJ1j3LJj4ROj1RL3k9oQjj3J5j2mJ0Kk4J2J2j9jK0j1j2K7nj4mJ8j8KK4j8J1
$$ -1 10 -3 0 1 -13 -4 2 -9 0 33 4 -2 6 5 -8 7 -5 -9 1 3 -21 -9 3 -16 -17 3 -8 -20 7 2 -12 -16 2 -16 -14 10 -8 3
5268CPj6NPmkjnJ1Pj3j0K1k1lK9pk6K6Jj8kJ6j1LK2k5%LJ5k0Oq%kNj2J5oPM%j8
$$ 3 10 -6 -1 6 2 0 -1 -6 5 12 -1 -11 10 -11 -14 15 8 -18 8 9 -9 -11 5 -6 -3 19 -6 -6 -3 12 -8 -2 -10 -10 -12 -7 -19 -4 -10 -3 1 1 -17
5311a7J3Nj4JRoJJ0j8j4L0Nk5J1K3k1PNk6J7QJj3Q%OmJ0rPnJ1j4kJ4pj4RPnkl
$$ -17 -4 1 -13 -12 -3 -9 -8 2 -16 -30 0 5 -20 -9 14 -7 0 5 -21 -4 4 5 -8 0 0 6 2 12 3 10 5 16 2 0 14 7 -7 2 9 4 2 -1
5353aNj4J0K4l7kL3rk0JQj7J4NrmJ9Mk1OrJ9mLj2J%KlpQQkOj2OlnOnJ5Rok1RJ2
$$ -1 4 -10 0 24 -13 -15 18 9 -11 -10 -2 -19 -5 0 -9 -13 6 10 -11 -5 -14 5 1 4 -8 -7 -7 -5 -8 -15 -7 1 -1 5 -7 -1 -4 -9 -3 -8 7 16 10 -11 -2 10
5399A0qNoJ%RnjKM%j8J4Nj0JjrMJ5j7qJ1J6j5LQj3j4K7jj6RKj4NPLj0%Ojj5K7
$$ 10 2 7 1 2 2 11 6 5 7 11 11 -7 7 12 2 3 2 -7 -3 12 -5 -13 -2 14 -1 2 10 -3 -17 10 9 -7 2 4 -10 -5 2 5 -5 -5 1 0 -15 12
5443A2nj0qK0j2j6K7j5jK2Mk7J2J9j8jJ7j2nJ1Oj3kKkk%Rj8J0qJ0nLRj0mMNpj7
$$ 12 7 -3 -11 9 -3 -19 8 -7 -8 14 18 -9 3 22 4 3 20 8 3 14 20 7 5 7 5 3 3 12 -6 4 -4 6 1 4 13 3 -1 3 8 1 -16
5484a6J3lOJ4j9j9L6j2j6J3KlOkk0J9J8rj8LRKMj4nQLpQPj0KOj5J0QoL%j1%K0
$$ -16 -3 -6 0 14 -5 -24 12 0 -16 -3 -1 -4 2 0 -20 -1 17 8 -10 -7 2 4 8 -6 -11 -3 0 -7 1 8 -2 0 6 -9 1 9 3 6 6 -5 -5 15
5526A5j2rK1kj2LLj2OQqjJ2nj1LJ0j0Mj4kLQpNqmK0j6pMQPOlj7JK0npj0J7Qjo
$$ 15 3 -6 15 13 1 4 7 -5 1 9 1 0 12 7 -4 -1 9 -1 3 -11 -13 -10 -2 -9 -4 -12 -16 4 -12 -19 -15 -7 0 6 3 -14 -13 7 2 -5 -15 2 10 9 3
5571Cj0j0K5j3LK0j6MNj3lJ3oj1J5Lor%oJ8Pj1J2k2J0lNlJj%km%J2pMj4%J2rK
$$ 3 -7 -17 8 -5 -2 18 2 6 11 -2 -5 8 2 -9 6 9 3 -6 -6 -12 6 13 2 14 -8 2 -1 4 1 2 1 1 -1 -5 -5 7 0 4 -10 -10 2 -7 -5
5614eJ8k1JPoOJPj0qOqJ8qp%L0k7NQj2J6j1%Qj1J5%j2koJ7olONoJ0j0j2oK0j4
$$ -5 13 -8 -7 0 -6 0 1 8 -2 -10 -4 -12 6 -2 -9 -9 21 -6 -1 7 -5 11 0 0 8 -3 12 12 0 -2 -8 9 3 0 6 11 5 15 5 -7 -13 7 -7
5657gm%PRKj3PNKNj5kQlPj4kJ1j3RLj3jJ8rj5J2LqQjlmkJ3oJ3Mj2NqJ3qJrKJ0
$$ -7 -11 -11 -4 5 7 -6 1 6 8 13 -2 -4 4 1 8 -6 -8 3 -10 -1 2 -11 -12 6 -3 -18 -6 -3 -11 -3 -4 -7 -11 -13 0 -6 7 11 -1 4 -4 9 1 2 -7 -5 5
5704EkJ0qMJ%jnQLj4JnNJ3j9MQj7lJ7j8PoJ2qKMNomPrK0oplmNNj0Kj2RKkRJJ0
$$ 5 3 13 5 9 10 10 9 4 12 15 1 2 -3 2 15 -4 0 8 -9 -12 5 -13 -6 -12 0 -8 -6 -2 3 -3 -7 0 -9 11 5 -2 -5 -9 -4 1 -9 -7 -19 -10 -8 -10 -1 0 10
5753A0j0jj1J3J1jj3OMJoJ1oJJMj9RRJqjJ3j4Mo%%%Pj2KLJqnjJpJ0J6oJpJpKL
$$ 10 0 -1 -12 1 12 11 -2 4 8 9 3 14 8 9 10 14 -5 4 13 14 6 5 18 4 8 2 2 2 2 9 -3 -1 2 3 -5 -10 -11 -10 -17 -7 9 3 4 -3 -2 -9 -7 -4
5801dpkNNLkKpQkoOKoJ0o%lMJ2mLrjQj5KMQnlnNMPj7lK4k2J1Jj7J5%oJLnj5J4
$$ -4 -11 -13 -8 -3 0 -2 0 -7 1 -1 -7 -1 1 -5 5 -1 -1 -4 0 12 8 11 2 1 9 -6 -4 0 8 3 0 -5 0 4 11 -6 -9 15 -7 4 5 -12 3 3 -3 -2 1 -4 -19 -5
5851eOj3J0j1MrK1rPmj0J2LmoMK%j0%NK0j0%%pJLjoOkQJkj1nK2j1JJ4oj3lJ5j1
$$ -5 1 -12 -2 -13 -9 -18 3 -6 1 -3 -13 -1 2 -2 -8 -4 -2 -2 -12 -12 -7 13 3 3 3 -4 -3 0 -1 -7 -1 -3 5 6 4 -7 -12 10 -1 0 14 8 -5 -8 7 -4
5897dPMqnMR%j0jJ3qj6J9%%okjjKLj2J2pRpLj0KJ3nKnKMRoqJ2mL%rJ0Lj0pJ1O
$$ -4 3 7 -1 -6 -2 7 7 -3 -4 9 1 -15 4 4 4 -2 -4 -5 -6 -4 -1 -13 -1 -8 1 -6 -3 -13 -11 2 -3 -1 -6 -4 0 9 3 -5 7 3 6 6 -3 7 10 0 -7 4 10
5946A0j0J1oj2MJ0nj1RJ5k1J5Pk7K6j0%k2J2JLQj6J7qMmjKOpj0kKOkJ2j3MKj0
$$ 10 0 11 5 -7 -3 7 2 -9 0 15 -6 9 16 -11 15 5 5 -17 -5 -4 -1 7 -9 8 0 4 0 -1 1 7 0 -10 -12 -10 -4 -6 6 -7 -3 -1 -11
5987a1j3RJ6j0PjPnJ1pqQlj3J4J4pmmj4J4OqMmQmlLJLlnJ3j2qQQj3KJKJ1j1Mp
$$ -11 -24 -15 1 -9 -2 -3 4 -1 10 3 -5 3 0 -13 1 15 8 4 0 -14 0 6 -2 2 -2 6 2 -1 2 3 6 3 -2 11 -1 -9 -1 7 -6 -4 -3 -1 10 -1 3 -4
6033doJ3k3J8QknnkJ4j6LPmPNj9N%J1klJrKJ9j8KJ1r%jQrPJ1oqrJ7lj2L1j3j6
$$ -4 -10 3 -20 -2 6 4 -1 -6 -8 6 -10 -7 0 -4 3 8 -11 -6 -6 5 3 0 1 -8 -6 13 -5 -3 8 -1 -1 -2 6 -3 4 15 9 1 -8 9 6 -6 25 12 -4
6078dOJjP%j9oK2onJ1j2OkJrPMJ4j6j9J2ljJ3kj0J7kpj1J4J3k6jNmK1j2JnJ0K
$$ -4 2 3 2 9 9 -10 -16 6 0 -5 6 -6 0 -2 -1 -10 -3 1 15 -1 -20 -8 -11 -12 1 -1 -11 6 4 -3 -14 0 13 -13 -14 -9 -13 8 -4 -3 -8 2 4
6121Dj3NMqJ5llOlKPjj2OJ2j1JmJjNj2P%momP%LpKRRj5j0PNOj4JRjmMoJ2jlpJ
$$ 4 -9 -4 0 -8 7 4 1 7 4 6 13 12 0 6 18 7 8 4 5 4 9 -3 4 4 0 -6 -10 -3 -3 0 -7 -5 4 13 -2 -12 -5 0 6 -8 -7 2 1 -3 1 -5 7 6 3 -4 -3
6172cLplLK1omppOJ2lj0JLj0K4nnj0J4mj0J7Oj3%OoqJ2%rLmJ0nnMLj6NlKJ2j2
$$ -3 0 -7 -10 -7 14 8 4 -3 -10 -4 8 5 -5 -4 -1 -11 13 8 3 -7 7 3 -7 10 16 3 3 9 3 -5 7 7 -2 1 -3 7 2 -3 1 4 -12 -7 -10 -8 4 -8
6218hRlkklJ1j3LQjm%nJ4jlKj3J6KmJLoPMlloJ0jkKkj1J0nKLpKqMJ5rj1QlRj3
$$ -8 1 -2 -4 -6 -9 2 -11 -8 0 -1 -5 -5 -10 4 3 0 2 -11 5 7 3 4 7 1 8 12 9 6 0 10 9 7 9 7 -4 6 1 3 6 -1 1 -7 -3 12 3 -8 0 -3 6 -7
6268gMRj0oJ1mmMpQj1QmLkkPmj6J2RqQNLj1PjMJMj4KQnLJJ9j0pJJ3j4mJ8lj3j3
$$ -7 -3 6 -4 -10 1 -3 -7 -3 -10 -2 -13 -5 -9 -6 -8 -10 -3 -7 -23 -11 -2 -10 -2 3 6 -5 2 1 5 6 10 -4 -2 6 1 4 5 24 14 7 8 21 7 3 21 18 5 -8
6316hJ9rjJ5j2Nj9J8oML%mkJj0J3j2Jj1J2J2j3RlnrJ3rOrNJKJmJ1j6J3j4PRnk
$$ -8 11 2 1 16 4 9 -10 8 2 6 9 9 5 3 4 -6 7 -5 -4 -15 -3 9 -4 5 2 -3 -12 1 -8 -2 -11 -6 -5 -3 -2 -6 5 -11 2 -12 -5 4 -1 -3
6360coQJNnNj0J0mnjOOMoJrLRj5%J2NrnKmj7RRj1qJ8Pj0J3Lj3lNNj2Rq%J5Jj7
$$ -3 -9 -1 0 5 0 5 -5 5 1 -4 -5 1 7 11 5 6 -3 0 9 -6 -6 6 11 2 -3 -1 -5 -22 -13 -4 -15 -23 -5 2 -8 5 8 -5 -8 -3 2 -10 -1 -9 -9 6 7 -10
6408a0mJ8llOokPOj8j0K4j0mOmJ1oJ3j2MKK0l1K0ljjjMrNJ1j5MJMj2Nmj3J0Rj2
$$ -10 -14 4 1 -2 4 -2 -4 3 9 -9 -19 5 -5 -9 -3 -7 4 -2 11 -1 3 5 25 -6 14 11 10 9 8 12 3 8 19 4 8 9 13 1 6 2 -11 -1 8 -4
6452dpJ2mmJ5j2pmJ0pJ5Lj0OrNnPpPOj9OJ1nMKLk3J8jOkLpj2J9j5OJ6kj3J2Oj6
$$ -4 -11 1 -3 -7 8 -4 -11 -15 -5 -12 3 6 -4 2 -7 -2 -7 0 -7 0 6 -13 -7 4 -1 3 5 8 -15 3 2 8 6 9 2 -10 9 -6 0 16 14 1 13 19 3
6497CMNnJpPj3J1oMQj5JnqQJ5j6j2K7qj8JK4k6KK6j4rJ8Mj0Pj7j1K5o%KQJqNj0
$$ 3 7 12 7 8 1 8 -5 6 0 4 12 -3 -2 -7 -15 -7 8 -8 -20 7 -1 -19 -18 6 -20 -18 8 -6 -15 3 7 -3 4 -13 -24 1 -5 -5 -3 5 6 -2 3 -7
6541gLJ1j8J3KqJ5Jj0j0K3k4mK1m%mJ5j3%J5j5JQJj7R%oPLpjQqJj8nJ3Rj%Nk2
$$ -7 -4 7 -11 2 4 -4 11 12 2 -8 15 -9 -13 8 4 4 0 15 2 2 17 2 3 11 12 -5 4 4 -2 5 8 1 0 8 0 1 -17 -22 -9 0 -1 -1 4 -18
6585a8J6Ql0J0QjJPomRJnJ3%qJ0%ooRoOjLj1K1j1Nj2KpJ3pJPnrJ9Jj8J7no%Kn
$$ -18 -2 6 -24 -14 -6 -7 -6 1 -5 -9 0 1 -4 9 9 1 11 11 5 -1 8 2 8 7 10 -1 20 9 14 2 4 -3 10 3 4 11 6 -3 16 17 -1 16 11 5 5 7 2
6632BOj3J6j1Ok%kLj8RKrN%JPjj4PNj1MJrJ8J1k2RLJ4j4%J6j9OkMjjKM%j4OJ2
$$ 2 8 -5 11 0 6 4 4 2 5 -13 -4 -2 -11 -6 -6 -5 2 1 -13 -6 -1 -12 -8 -7 -16 2 13 -9 0 3 17 3 3 19 0 6 4 8 7 6 8 12 12 -2 4 16
6678A6j4Qlj1J2Lrj1J4%NjNj9J1rONmkJ1j0j3K2pj6RRnlJpMOKJmlpJ8nj2J5pl
$$ 16 2 10 7 -4 8 11 2 -9 5 5 10 9 14 -5 6 -3 3 8 4 2 13 3 -10 12 5 -11 -2 7 2 -1 0 -7 -3 3 5 6 2 -1 -8 10 5 -7 8 1 -2
6723bJ1j0NLj3J3%RqrPMqJ0j3LJ5j0KLOl1K7qj1J0OkpRj0KLjqJ0Mj0kJ3nnJ4j4
$$ -2 9 -1 4 7 -6 7 7 16 8 -1 6 10 2 12 -1 2 17 7 9 12 18 -13 14 6 -5 5 11 9 2 11 1 3 6 5 -3 7 11 1 -1 12 7 2 16 2
6767BNKpMmRj5M%mQnmJ7nj2J0PrJOj2lJ4j4OJ4Nj4QLp%j0OQj5J0j0MKmJ2k2J1
$$ 2 7 9 2 6 2 11 -4 0 0 -4 4 -1 -5 12 7 -5 5 12 3 4 10 -2 -5 9 -5 1 15 20 6 14 17 10 10 0 6 14 -1 9 -1 3 5 1 13 -9 2
6812BRj0jkqLJ0%k1L0k4jJ2OnN%pQpkJ0j1J1OOj3j0J2mlJ1prJ4Kj3MJ0orPRj3
$$ 2 11 1 0 -2 -10 -7 3 3 -18 12 -12 -13 -1 5 0 5 5 -2 6 -1 -3 7 -4 7 13 19 6 -4 8 4 1 12 5 -4 10 12 -1 3 13 7 -2 5 14 1
6856AQq%QLjpKjJ7qj4mRRpj3NPJOj4KnJ0mMpMj1J2j0%LmJ2Oj5KJpMJ4j1J3kpo
$$ 1 9 1 1 9 12 11 4 6 5 22 14 0 -4 5 14 7 -6 -1 6 7 13 -1 1 -4 6 2 6 -1 3 -8 4 -6 -6 -3 -7 5 11 -4 -2 -1 -8 -4 10 -1 12 10 3 -3
6904cQqKjQJlOj3J0kK%nKJ7j3MQj2pPoJJ9mk3J6pkJ8rKmjPl0RJ0kj1njQqJ6Mm
$$ -3 5 -3 -1 -2 6 7 4 10 -3 7 5 7 7 2 4 21 8 12 20 8 1 8 2 3 22 18 -5 11 4 2 20 11 13 9 8 15 -15 -6 4 2 -9 -14 -15 -7 -15 1 5 1
6952AMkj4LlMJLmmJ4JRj2PQqjLj4J0Opj4MKJ0kqpJ5%J0j7ROnKj0%RjnqJ3kj2J3
$$ 1 5 3 -11 -8 -11 -7 -6 -3 -7 -11 3 4 13 1 8 16 8 7 10 -4 6 12 5 -9 -5 -3 7 5 -3 -10 5 5 15 -2 7 13 8 10 0 0 9 8 3 -5 8 6 -6 7
7000Gj2J1Qj4j0K4k4JJ5nj0J4pj1J0MoLMnjJ2Nj9LNkOmQj4O%J5j7J2Nmk%mklM
$$ 7 -5 6 14 0 -10 14 -10 -9 6 1 -9 5 -2 -13 -3 1 -5 -2 2 -3 -4 8 13 -6 -3 2 0 6 2 10 -4 2 2 17 0 12 17 13 11 11 7 5 2 6
7044Fj1Lj1QOnO%kLJj4J5qj2K8j0%KpJ3j6Oj3J1n%jOmpJ3k0PKQJLj0P%Oj4RJ4
$$ 6 -5 -2 -13 -5 1 -4 2 2 0 3 4 -10 5 -3 -15 13 3 3 5 -2 11 -5 1 -12 -1 -6 -6 -7 -1 -5 -12 1 -19 -12 -10 -2 -1 2 -8 -1 -1 5 -9 0 14
7089A4j5J%LnLJ4j4mJ4kqJ3jj5Plj1KK7qj0J4k6J2j1PJ1j0J4k3PR%ooK2j6m%o
$$ 14 -1 0 0 3 -2 1 15 1 -3 11 9 1 14 13 -2 5 2 -9 -7 20 12 2 16 -10 2 -9 -2 9 -1 13 -10 -3 6 6 0 -6 16 0 -4 -4 -10
7130a0NRjrLJ1JlqOj6lJ7pj0K0lM%qJ5j5QNLqnKRj0Qj2rJ7nJ6j3MLlKjjj1J0k1
$$ -10 -5 4 3 -6 -3 8 9 6 -2 4 -12 -15 2 -5 -15 5 2 6 6 -2 13 -2 6 11 14 6 1 3 12 2 10 -2 -11 6 1 17 4 8 11 8 10 9 8 -3 7 -14
7176a4J6kj0J2kjqMkj3NK0j3kOljnJ4Mj1oRJ2pkJ0k7K4Qj0j1R%pQrJLRj2jJ5n
$$ -14 2 0 -10 2 0 -1 -9 -5 -7 -20 -15 5 -8 -10 -4 -7 -8 -13 1 5 -6 -12 -3 9 2 0 10 -17 7 15 5 -6 3 3 -4 4 -5 -4 -1 8 -4 -5 10 5
7220Ej5J1LOpMRmj6J4kllJ3rqJ4poMnllJ0rj7K4mj5K1kqJ3pj0PJNloj%Q%Nj2m
$$ 5 -10 1 4 10 3 7 16 12 -4 10 8 5 2 15 6 -2 12 5 -1 3 -2 -5 -8 2 -7 -24 0 -4 -19 2 0 -8 5 -2 -12 -5 -4 1 -2 -8 -9 -9 -1 -1 4 -8 -12
7267a2J2lJ6j3PKmoJ0j4LK0k0MO%mNnLrKQpPnrJ5J3j7Kpmj1J9JqNJ%mjJMj1pJ5
$$ -12 0 -3 13 0 7 9 5 -1 9 -5 -2 18 -2 2 8 8 4 9 4 7 -2 0 8 1 8 3 -6 9 22 5 7 0 -4 -15 4 5 -3 2 3 3 -1 -2 -1 3 -8 -15 0
7314@pjJ8j9rK8qJQj7J2j1J9nj7J6oMj3PmJ0Oj0oJ0J3j2j1MPKOrpqJ6j3NLK0j3
$$ 0 -7 -8 10 -9 -18 10 2 3 11 -6 6 -5 14 9 -8 8 2 6 -7 0 -4 6 12 2 -4 6 19 7 -4 0 7 9 15 6 -1 -9 7 -6 -1 2 22 9
7356Ij3J3oJj1J0olQjroJ5jrJ1j3qK4j0j9J6NrMRnlKJ2n%Lj2PlJNLoJ7k6J8oP
$$ 9 -4 9 3 4 -7 3 -3 -6 2 1 -8 -14 1 0 -9 2 -11 -19 5 -5 -24 -8 -3 -12 -8 1 -4 -7 -5 7 2 2 5 -7 0 -3 -2 3 6 0 17 -9 9 3 10
7401A0NQkj9PNj6mNJlJ9rj0Rqo%NkJ4j2j0J6mj1J3%j3J0LJkLrj6J3J0j5K1lk2
$$ 10 15 23 21 2 9 14 -2 -6 -1 0 -3 16 7 -3 6 -2 -8 -8 -3 -5 9 -3 -13 3 -1 -12 1 1 -12 -2 1 2 0 3 -6 -22 -9 1 -14 7 4 -18
7443a8J9ppNJ1qNlLoRNqQkjRj0QNroJ3lj0PLj1NJ1j0j9K1Lk6J3%k%Qj8MmJ6k4
$$ -18 1 -6 -13 -8 3 -5 0 -3 0 -6 3 8 0 8 6 5 14 4 12 17 8 2 15 12 2 9 12 1 6 17 7 -12 9 12 -14 -1 -1 -3 -3 5 -13 -9 -13 3 -21
7488b1PJRnQlj1J3okj5J1J2Kj0OmpJ7koPj1QkLOj3J3j1NQKj3J2rOOrjNqNJJkJ1
$$ -21 -14 -13 -4 -9 -1 -4 -15 -2 -8 -10 -25 -14 -2 0 -10 -4 -8 -15 2 0 -6 1 -10 -2 -4 -1 5 -8 5 -6 -1 7 9 -4 8 -1 5 11 2 1 6 -2 3 4 5 3 14
7535A4mJoKMqjj2lQJ3j4KLljj4L2rmoJQrJ8k0LJ9j0nJoJK%MmNRmj3J7j5lPQoj0
$$ 14 10 11 5 7 11 3 2 -10 -13 -5 8 -6 -4 -1 -4 -5 -19 13 4 0 -6 -5 3 -6 12 -8 -5 14 4 -1 0 -6 -5 -3 -3 1 -3 2 11 7 -6 11 -4 -7 0 8 2 -8
7583hJ0j4J2OPkqjPpMrkP%qJ1Nj2PnnLnPLj0Mj3J0Oj3OqJ4nrRPqj0J2J0oJJKj
$$ -8 2 -12 0 6 13 11 3 2 9 2 6 -3 -5 2 2 -6 5 10 -2 5 0 -5 -2 -7 0 3 -7 -3 -16 -6 0 -13 -7 -15 -1 -6 -15 -6 1 -7 -17 -5 5 -1 0 1 3 2
7631BlNjqRLj7J1MoJPj3MQqKJqJ7oMknmJ%%JmJ1kQj5%jKMrlJJ2j0nJ0Kj0lKJ2
$$ 2 -1 4 3 -5 4 7 -10 1 5 -1 0 7 -6 -2 6 -2 0 1 -7 10 4 8 6 1 -3 -2 -2 -2 -1 -5 6 4 12 -3 -3 -4 -2 2 -7 -10 -9 3 -7 -12 -2 0 -10 -13 -11 1
7681Anj1J5j3%OJ5j1jJ2j8J0J5j5J3j1pJ2j2OJ1Jj8OJ7j6LJ4j3pnRoRq%lQjkJ6
$$ 1 -4 -15 0 -13 -13 -7 8 -3 -4 8 -10 0 15 0 13 2 -5 7 -5 1 12 13 -5 1 18 2 5 19 6 -1 -6 3 -3 6 -2 -2 -5 3 2 0 16
7722A6j1JLolJ2j4JJ0j6J1J2j5LjJLMk2OkLjLNJj0j1J3rJ0MMkJmJlPkNqkJ0lo
$$ 16 5 6 9 3 0 12 -2 -1 9 -7 4 16 1 4 3 4 7 11 -11 -5 -7 -4 -5 -2 3 4 -6 -17 -4 -13 -3 1 5 3 4 0 1 -2 5 3 8 0 -2 8 5 -1
7768aNJjOj3%NKpJ0Nj2O%j1L%jlQPj5JjqJ3knNnMONj6LRqoNKqJ7j4oJ1J0o%J4
$$ -1 4 5 4 10 -3 -3 2 4 -3 7 12 0 6 6 -5 -2 -2 -3 -6 2 9 -6 -5 -6 -14 -1 -3 -8 -3 -8 -4 2 7 -9 -6 3 -5 -11 -6 -4 -12 5 -9 -15 -4 6 0 0 14
7817A4k0J3JqkQj6J2J6Jk3K2rj0J4qoJ3Mj0J2j7kOKj3MJ1j2j0RQllJ6l2K5k1L
$$ 14 -6 7 8 0 -2 6 -10 2 18 19 -4 18 9 -1 13 5 -1 12 16 6 18 1 -1 5 7 -6 -2 9 -3 -13 -4 4 1 -2 14 -18 7 -14 -11
7856a1Mkj1J3LoMQroJ6nnK2j6j7K0jlKPk0K3j4J0mQj7J0Lj3J0Np%PJnMKj7RJ3
$$ -11 -7 -9 -20 -7 -4 -10 -6 2 -7 -13 3 -2 -7 15 -1 -18 2 1 -2 0 7 -13 10 -4 6 2 10 -7 3 6 -7 3 8 1 1 8 9 4 8 10 -7 2 15
7899A5k2kJ2mjJ4j5jQqJpMpJ3j3lJ4Nj6NPj1KJ2mjmKjnJ3mNoj7K2Ok3K5qnjKR
$$ 15 -7 -9 3 -1 -2 12 -3 -4 4 -4 -3 -10 -6 -13 0 -13 -16 -2 3 -13 -8 -1 -12 -10 2 -2 -3 -7 -5 -6 -11 2 -2 3 -3 -20 2 8 -15 10 2 -3 -4 -2 7
7944Gq%LqPKj2K1j1jNlLmLrJ8pJj2K0pKmlNqKj1OJno%mLQlnK%NkPlj1J7j2PJ8
$$ 7 -1 -1 2 -6 1 3 -9 12 1 0 5 2 5 1 4 -5 13 6 7 -5 15 8 10 6 3 8 0 2 -9 -3 -2 -7 -13 -13 -17 -14 -6 -9 -14 -12 -12 -7 -9 -2 -5 -16 1 -11 -4 14
7994A4k2kJ0m%JKKjMJ1k6J5LLnkkOnJ3nj0lK0j2lNmNj5J4oqJ0lj1J6pRj1nPlL
$$ 14 -8 -10 0 -4 -4 -3 -1 1 0 4 15 -11 4 7 10 5 3 1 7 2 15 10 0 -3 17 5 2 7 3 8 -7 7 1 -7 3 0 -11 5 -2 7 -4 -9 -2 -5 -2
8039b%kj6NJ3mKj4J5LLj2NRj0Qj6J4KMmK%j0J6prJ1Lj2J4KqKQk4J1Nj0Opj1K4
$$ -2 -2 -4 -20 -15 -2 -6 -4 -18 -3 0 3 -9 -4 5 -5 3 -13 1 3 7 3 5 5 -5 11 4 -5 6 9 -3 11 13 5 7 15 -9 2 7 -3 3 -4 -15 9
8082Ij4OrJ1Oqj0J7j3OlmqJ9MloLkpPj3J9oOj5JnPPmjkMoPmMJLnJ5pJMjJkJlq
$$ 9 -5 1 -8 3 9 1 -9 8 -5 1 -2 -6 -14 5 9 6 0 3 1 -6 1 -12 7 1 7 -8 -7 -12 -5 2 -2 -3 -5 -1 -7 0 -4 0 1 4 -1 14 7 8 12 11 12 10 11 8 0
8133@L0k0jOj3OllqJ0KjnmN%Kk4PPQJ5k6OoR%oPlNrMlrJ7p%J3llmmKpJMqK4j5
$$ 0 30 10 9 15 2 8 5 2 -6 4 6 5 0 -4 1 1 3 -21 -14 -7 1 16 -10 -4 -10 -1 -1 -7 0 -3 2 -7 -3 -6 -15 2 -5 -5 8 5 2 -2 -6 -4 -11 -10 -6 -14 10 -5
8183eKJ5olPojJ4
$$ -5 -3 12 6 3 10 4 3 17
8191A7
$$ Imaginary data points
##PAGE= N=2
##DATA TABLE= (X++(I..I)), XYDATA
0@%%%%%%%%%%%Qj6J6j6J6k4L2l2M0m8N3o1P2q1Q9j04J20j36J53j75J99k23K47
$$ 0 0 0 0 0 0 0 0 0 0 0 0 8 -8 8 -8 8 -16 16 -16 24 -24 29 -32 40 -41 48 -56 64 -72 81 -94 105 -118 129
34A29k74L06l42L82m24M70n21N77o39P09p86Q69r63J071j194J338j505J700j938
$$ 129 -145 161 -181 201 -223 247 -274 303 -336 373 -413 456 -507 564 -630 708 -797 903 -1035
53a035K235k611L108l804M851o622J0356l0155L7905L1349q9590M2845M7880p1162
$$ -1035 1200 -1411 1697 -2107 2744 -3878 6478 -23677 14228 45577 -44013 -1168 46712 -24450
67b4450j1415P0493l1727k8686M7448o538m0809K6112P806k0010J8270O752k3490
$$ -24450 -35865 34628 2901 -25785 21663 15125 -25684 428 8234 -11776 6494 13246 -10244
80a0244J0821M326j9229J4191J5379k0605K448J3135j6940l846J6581l346k299
$$ -10244 577 4903 -14326 -135 15244 -5361 -2913 10222 -6718 -10564 6017 2671 372
93C72M384p945J137M088j1284J0026J4615k1287k606K3047j9693j4674L4076j669
$$ 372 4756 -3189 -2052 2036 -9248 778 15393 -5894 -8500 14547 -5146 -19820 14256 12587
107A2587k8544K0580Q510l0329J0856K1038j9566K269J6040k0405k280J8437j6075
$$ 12587 -15957 4623 13133 -17196 -6340 14698 -4868 -2599 13441 -6964 -9244 9193 -6882
120f882M70K6733k1351j7491L2246r345k9427L5361J3001m2566J2861K9304l5917
$$ -6882 -6412 20321 -1030 -18521 13725 4380 -25047 10314 23315 -19251 -6390 22914 -13003
133a3003p191M1424j2720k6021K4876K976k6168J1381J5895j2489r73P119o577
$$ -13003 -20194 21230 8510 -17511 7365 10341 -15827 -4446 11449 -1040 -2013 5106 -1471
146a471k200J569k80Q069p04j0329O209K726j3030P420J3104j2868k734J2474
$$ -1471 -3671 -2102 -2382 5687 4983 -5346 863 3589 -9441 -2021 11083 -1785 -4519 7955
160G955j0811p564J5958j335r203J0926k264j4019J0182N987j1931P610Q686j5645
$$ 7955 -2856 -10420 5538 4203 -5000 5926 3662 -10357 -175 5812 -6119 1491 10177 -5468
174e468r30J2637q962l597J4754l896j1117P065J084o713N934L293m507K055j789
$$ -5468 -6398 6239 -2723 -6320 8434 4538 -6579 486 1570 -5143 791 4084 -423 1632 -157
189a57m711O156K39n780Q871J847j4263M588J0473j1987o41J5899q376j1547J2916
$$ -157 -4868 1288 1527 -4253 4618 6465 -7798 -3210 7263 -4724 -5365 10534 2158 -9389 3527
204C527N40j3127R202R214j1422j733P533n522k995P308N63l152N30j263o46O57
$$ 3527 4067 -9060 142 9356 -2066 -3799 3734 -1788 -4783 2525 3088 -64 466 -797 -1443 -786
220g86r30L589K655o084j059M599m346j078Q505k309o703N510J90p496N231N657
$$ -786 -1716 1873 4528 -1556 -2615 1984 -2362 -3440 5065 2756 -3947 1563 1753 -5743 -512 5145
236E145o285M37M353o342j695P009j248k785M034j507m246K469Q69j262K932J65
$$ 5145 -1140 -703 3650 -2692 -4387 2622 1374 -1411 2623 1116 -3130 -661 208 -1054 1878 2043
252B043k844O25j084j330M316N70l644K642L69n750K533M899m306J74N282n125
$$ 2043 -801 -176 -1260 -2590 1726 2296 -1348 1294 1663 -4087 -1554 3345 -961 -787 4495 -630
268f30m479O231P51m243M131J796o045R2L803k212m03L740o87l023j76N78M28
$$ -630 -5109 1122 1873 -2370 1761 3557 -2488 -2396 1407 -805 -1208 2532 1845 -1178 -1354 -776 -348
285c48O33O05P77j446k450J608J568k297J406L369l499k772L510n05k589M072
$$ -348 285 890 1667 221 -2229 -621 947 -1350 56 3425 -74 -2846 664 159 -2430 1642
301A642J537m869L45K871k898o37M095m20k501J115k46j987J267K064k86p41n51
$$ 1642 3179 -1690 -1345 1526 -1372 -2009 2086 1666 -835 280 34 -1953 -686 1378 1092 351 -200
318b00l97pk63Q18J714p69j552O66n78j400K454J930k444o95J498j752r41K902
$$ -200 -597 -604 -867 -49 1665 896 -656 10 -568 -1968 486 2416 -28 -723 775 -977 -1918 984
336I84M56j817R46J63k499L36K403j21o39M59q47j086P02Q49P1J70j5m90o32m27
$$ 984 1440 -377 569 732 -1767 -1431 972 851 212 671 -176 -1262 -560 289 360 530 515 25 -607 -1034
356a034P03J227j65p07J04m75p07R76Q66p41K7P35j023j052J024Q11m28K31K64
$$ -1034 -331 896 731 24 128 -347 -1054 -78 788 47 74 809 -214 -1266 -242 569 141 372 636
375F36j082n51R59M37n15L09O52p45j105M57Q53k36J90O94r73j293J073R72j116
$$ 636 -446 -997 -38 399 -116 193 845 100 -1005 -548 305 69 259 953 -20 -1313 -240 732 -384
394c84K54J463j205j507J364M46j268J244J289k244r87K076j25j418J506Q15k048
$$ -384 -130 1333 128 -1379 -15 431 -837 407 1696 -548 -1535 541 416 -1002 504 1319 -729
411g29q5J567j007q13J949L40k064J02J364q10n58J463M7j602N54J210j363o79
$$ -729 -814 753 -254 -1067 882 1222 -842 -740 624 -186 -744 719 766 -836 -282 928 -435 -1114
429a114J902J45j754O87R38j516j5J811q46j271J607K71j894N25J345r33j66J095
$$ -1114 788 933 -821 -134 804 -712 -727 1084 238 -1033 574 845 -1049 -524 821 -112 -278 817
447H17q36r73J049M40p18K16L99m23k46N1J04L24O8j29q0m89o8Q76N2p37L24K99
$$ 817 -19 -992 57 497 -221 -5 394 -29 -275 -224 -120 204 272 143 63 -426 -494 382 434 -303 21 320
469C20p05J13N50l55JN38m76m68M27J28K8J35m53j0O05m63l37P56k50n26R55j54
$$ 320 -385 -272 278 -77 -76 462 -14 -482 -55 73 101 236 -217 -227 378 -85 -422 334 84 -442 513 359
491C59j302Q79R52j330kJ285r40o25J288m03j041J267M77j403J35P77n79N2O99
$$ 359 -943 -64 888 -442 -444 841 -99 -724 564 161 -880 387 864 -539 -404 373 -206 -154 545
510E45n32m12N04j0k90J41J57J60j36n28J95M89l77J22M68q26l30J227k59j081
$$ 545 13 -399 105 95 -195 -54 103 263 127 -401 -206 283 -94 28 496 -330 -660 567 308 -773
530g73R89N12j339K81J021j058k19J500n96j341J074O60j197J79R52p33m30R35
$$ -773 216 728 -611 -330 691 -367 -586 914 318 -1023 51 711 -486 -307 645 -88 -518 417
548D17j56r27N66P68o55m60N70M8m74L01M02n40k03P00j47p77M48O97n37l74M94
$$ 417 261 -666 -100 668 13 -447 123 171 -303 -2 400 -140 -343 357 210 -567 -119 578 41 -333 161
569A61j74l78O51K09p95QO68l42l90N29J52m25P8J42m12J04O32j66n36J75J65
$$ 161 -13 -391 260 469 -326 -318 350 8 -382 147 299 -126 -48 94 -318 -214 418 252 -284 -109 56
590E6j93J75J32l54J25M15m99k87O54p3m66N63Pq54O22O63j149j01J257n76o66
$$ 56 -137 38 170 -184 -59 356 -143 -430 224 151 -315 248 255 -599 23 686 -463 -564 693 117 -549
611e49J046l41j081J188N30j444M36J013j173j52J180p90l82J312o24j110J168
$$ -549 497 156 -925 263 793 -651 -215 798 -375 -527 653 -137 -519 793 169 -941 227
628B27K78r89O93K45j119N21P44q61Q2N98o01P8L24p31N22P90j181mJ078j245
$$ 227 505 -484 209 454 -665 -144 600 -261 -179 419 -182 -104 220 -511 11 801 -380 -384 694 -551
648e51j38J947j204j380K260j67k292J697J026k333R50J674k346r8K247j508p76
$$ -551 -689 1258 54 -1326 934 767 -1525 172 1198 -1135 -185 1489 -857 -955 1292 -216 -992
665i92K072j061j070K137q86j775K385J20k322J842P75k809J370J957k811J12
$$ -992 1080 19 -1051 1086 200 -1575 810 930 -1392 450 1225 -1584 -214 1743 -1068 -956
681i56K733k055j100K598j077j505K443m46k102J894M16j950J436N86k112J190
$$ -956 1777 -278 -1378 1220 143 -1362 1081 635 -1467 427 843 -1107 329 915 -1197 -7
697gJ223k156M94J660j758j4J608j615j64J975j492p26K122j325j071K674j138
$$ -7 1216 -940 -446 1214 -544 -558 1050 -565 -729 1246 -246 -972 1150 -175 -1246 1428 290
714B90k316L134L23l563K272J926l864Q29L466l222j218M009j478k852L025M57
$$ 290 -2026 1108 1431 -2132 140 2066 -1798 -969 2497 -725 -1943 2066 588 -2264 761 1218
730A218k713J763J043k468P36J437j594L55J131j525L40J241j713O6J962j372
$$ 1218 -1495 268 1311 -1157 -421 1016 -578 -223 908 -617 -277 964 -749 -683 1279 -93
746i3q00J829r81j131K069k98j748J557L13j754J219O49j834J053J201k230L04
$$ -93 -893 936 -45 -1176 893 595 -1153 404 717 -1037 182 831 -1003 50 1251 -979 -675
763f75J997j731n27K193j213j432K202m7j976J267Q01j467M98O25j050N20N44
$$ -675 1322 -409 -936 1257 44 -1388 814 767 -1209 58 859 -608 -110 515 -535 -15 529
780E29j084N65O02j367O78J205j935r9K347j308j567K240k3k187J520J153k123
$$ 529 -555 10 612 -755 -77 1128 -807 -906 1441 133 -1434 806 783 -1404 116 1269 -854
797h54K35J772j212q56J284n4n90M93j36l58L31j18oM29n03j71P83m68o84R57
$$ -854 -619 1153 -59 -915 369 315 -275 218 82 -276 55 -63 -69 360 -143 -314 469 1 -683 274
817B74K18q11L85J67p43M86N01p11J51M58o76J02O32p44j8J057o28q35Q84J77
$$ 274 492 -319 66 233 -510 -24 477 -234 -83 375 -301 -199 433 -311 -329 728 100 -735 149 326
837C26p32M89L18o83P4M18k17j22L6J31L30m54m56Q09P0q48O16N11j156J74J151
$$ 326 -406 83 401 -282 -208 210 -7 -129 -93 38 368 -86 -542 267 337 -511 105 616 -540 -366 785
858G85r23o45J276lr67M66K72n84K58L23l09O0K5j26K65k99l21Q41L8r22M79L89
$$ 785 -138 -783 493 490 -477 -11 261 -323 -65 258 -51 9 34 -92 173 -126 -447 394 432 -490 -11 378
880C78r14M41P84j039j7J096q57n61J155l73o66J176k82j252J114N01j396N91
$$ 378 -536 -95 689 -350 -367 729 -128 -689 466 93 -573 603 321 -931 183 684 -712 -121
898a21R32j289N6J196j004n18J366k67r40P09M4n50N77L0n59M63L6m85M97n5n97
$$ -121 811 -478 -422 774 -230 -748 618 351 -589 120 164 -386 191 221 -338 125 161 -324 173 118 -479
919d79Q13J84j176M82P70j007K04J000j085k82J305p14q46J302m1j016R14O0j226
$$ -479 334 518 -658 -176 594 -413 -209 791 -294 -576 729 15 -831 471 430 -586 328 388 -838
938h38Q46P40j266K64R95r97j99J012p45m39J233k67r29P11R0o87N92J91o70M39
$$ -838 8 748 -518 -254 741 -256 -455 557 -188 -627 606 339 -590 121 211 -476 116 307 -363 76
958G6L31p58J64L89m84L13N02q41p3Q36n42l71Q56k82n62P76j00q55O33M93p33
$$ 76 407 -351 -187 202 -282 31 533 -308 -381 455 -87 -458 398 116 -446 330 230 -625 8 501 -232
979b32J29L96n65R4N61m76j56N57k52k79L41k06j11N72k33n12M33N9m15M44J36
$$ -232 -103 293 -272 -178 383 -93 -249 308 56 -223 118 -88 -199 373 140 -372 61 120 -295 149 285
1000B85n89L22L77p39k2P40k91k69N16l26n43O51K40o42K22M40m72j68L58j38
$$ 285 -304 18 395 -344 -366 374 83 -186 330 4 -539 112 352 -290 -68 372 -100 -268 90 -48
1020d8j15M03j0m32qK28M2q6K2J17n0j79N0Q4j73J56L61l34m23M24J76m20J86
$$ -48 -163 240 230 -202 -210 18 60 -26 -4 113 63 -116 -66 18 -155 1 362 28 -395 29 205 -215 -29
1043b9L65m51j10M81k82m19O36K89o71l8M09l04j21N47q8m94K66K94m78j18N18
$$ -29 336 -115 -225 256 -26 -445 191 480 -191 -229 180 -124 -245 302 214 -280 -14 280 -198 -316 202
1064B02O6l53L5R5k62M2M41n0m45J56L02l68k15N22P5l90J87J45n26N6O87k09
$$ 202 268 -85 -50 45 -217 -175 266 216 -229 -73 229 -139 -354 168 243 -147 40 185 -341 -285 402 193
1086A93n28L84J66m91R1M35k50j24L86j67n04K49M60k11k04K18k2k94J36K64k27
$$ 193 -335 49 215 -276 -185 250 0 -124 262 95 -409 -160 300 89 -115 103 81 -213 -77 187 -40
1107d0q4L84q3n43J48M66k00j33L24k07l80L78K14m35J04M57k89m06K46J74j62
$$ -40 -124 260 177 -366 -218 248 48 -85 239 32 -348 30 244 -191 -87 370 81 -325 -79 95 -67
1128f7J32J74k99k45K91J95k87k8L97r2m76J80K78l32J12N23m63n24O16K16o30
$$ -67 65 239 -60 -305 -14 181 -106 -134 263 171 -305 -125 153 -179 -67 456 -7 -531 85 301 -329
1149c29K29N45m96k51N00j93m11N55K97n84j52L85m0k30K13J83k28j37K37m4l69
$$ -329 -100 445 -51 -302 198 5 -406 149 446 -138 -290 95 55 -175 38 221 -7 -144 93 49 -320
1170c20K59N14l73m47M60N9m77L62L75o12j0O05m55m65P10J70n56K15J90n12Q9
$$ -320 -61 453 80 -367 93 152 -325 37 412 -200 -210 395 -60 -525 185 355 -201 14 204 -308 -219
1191b19N53k68k95L36M4l06nJ67O7j1l0J1j67j48L75J58m86Q1N21m60l51O45n9
$$ -219 334 66 -229 107 151 -155 -160 7 74 63 33 44 -123 -271 104 262 -224 -143 378 -82 -433 212 153
1214A53n32O11K04r33K07P65n28k86O77k01m83M55K1m40L42K73l11o5Qr0K71j8
$$ 153 -379 232 436 -497 -290 475 -53 -339 338 137 -346 109 130 -310 32 305 -6 -71 -63 -153 118 100
1236A00k72L11K3m62L24J94n97L59O09p83k54P86l63l62P74j78p16O68J45q03
$$ 100 -172 139 162 -300 24 218 -379 -20 589 -194 -448 338 -25 -387 387 209 -507 161 306 -497
1256d97M08M83n36J02L08n78J04N20l98mL53m71O9M66o41j7R53o29n27R81m36
$$ -497 -89 394 -142 -40 268 -310 -206 314 -84 -88 265 -206 -137 329 -312 -329 624 -5 -532 449 13
1277A3p90J285P2j435R12P87j537K54J316j125l13J430q24r87J346M0j044Q20
$$ 13 -777 508 580 -855 57 844 -693 -439 877 -248 -561 869 45 -942 404 444 -600 220
1295B20K50j007N17M19q41L82N37o83J54L27p59L75P04q62K3Q14q61j85J092p57
$$ 220 470 -537 -20 399 -442 -60 477 -206 -52 275 -484 -109 595 -267 -244 570 -291 -476 616 -141
1315a41m64J371n36j130J219Q0j217J124M85j619O45J060j494J11J423j115l91
$$ -141 -605 766 230 -900 319 399 -818 306 791 -828 -183 877 -617 -506 917 -198 -589
1332e89J400r41q20J618k88j179J255K1j396J095N12j529Q14J054j594M1J348
$$ -589 811 -130 -950 668 380 -799 456 477 -919 176 688 -841 -27 1027 -567 -526 822
1349H22j207k74J642q44j074J451j07j280J058M28j138N60N18j098K41Q01o35
$$ 822 -385 -659 983 139 -935 516 409 -871 187 615 -523 37 555 -543 -302 499 -136
1366a36N7M79p17R8O25p13O5Q58p67k62R67p71n38J491l59j244J231J58j503J028
$$ -136 -79 400 -317 -219 406 -307 -242 616 -151 -413 554 -217 -755 736 377 -867 364 522 -981 47
1386D7Q60j637M26J450j596m73J813q05r85J689l25j592J358N69j644P07J082
$$ 47 907 -730 -304 1146 -450 -923 890 85 -900 789 464 -1128 230 799 -845 -138 944
1403I44j410L8J146j042l07J359n36p69R10k20o58Q23lp28O88J31q64M81K94o57
$$ 944 -466 -428 718 -324 -631 728 192 -577 333 113 -545 278 275 -453 235 366 -498 -17 277 -380
1423c80N22L82r56J95O67p30O6P94o92k01Q47o56m79J064k38o68Q75k16r61R79
$$ -380 142 524 -432 -237 430 -300 -234 560 -132 -333 514 -142 -621 443 205 -463 412 196 -765 214
1443B14L02j183P01P22j299K09J036j124j38J469q19r51J317j09j164J043M16
$$ 214 516 -667 34 756 -543 -334 702 -422 -560 909 90 -861 456 347 -817 226 642
1460F42j273N09Q58j146p9J052n36m07P37l06m99O16N9m58K50J08k38J48o9j19
$$ 642 -631 -122 736 -410 -489 563 27 -380 357 51 -448 168 227 -231 19 127 -111 37 -32 -151
1480a51L37q1k48K62j69k77N69K4o37M43L11p67J86O06o24%P69n70n59P92j6o02
$$ -151 186 105 -143 119 -50 -327 242 266 -371 72 383 -384 -198 408 -216 -216 553 -17 -576 216 200 -402
1502d02N47K16o76K31L66n44KN57k08j90J92j89r5K84l3j40J58l9q9P0j15j9K69
$$ -402 145 361 -315 -84 282 -262 -260 297 89 -101 91 -98 -193 91 58 -82 76 37 -52 18 -97 -116 153
1525A53k6k52J16K2j14J52N7k04O7J33j25n4O4L5N6m6j45N7R0n6J09j0k37R1K20
$$ 153 127 -125 -9 13 -101 51 108 -96 -29 104 -21 -75 -11 24 80 34 -111 -54 36 -20 89 79 -158 -67 153
1550A53k24p8L09o1k16J47l4k20K43K06k63p5J89j06p8J15qrJ13n9j42k9O9J33
$$ 153 -71 -149 160 99 -117 30 -4 -224 19 225 -38 -113 76 -30 -108 7 -1 -10 103 44 -98 -127 -58 75
1574G5mr9J8O3j18k2J18o9K1K14j61k69K33J06j78R5J27k64K7K63k21j79L64M3
$$ 75 71 -28 -10 53 -65 -87 31 -38 -17 197 36 -233 0 106 -72 23 150 -114 -87 176 -45 -224 140 183
1598A83k98P5J25j86O5K04j68j47J88M7j38k3Q6O3o2p0K9J1m6J22Q1k33n0K78
$$ 183 -115 -40 85 -101 -36 168 0 -147 41 88 -50 -73 13 76 14 -56 -27 -16 -62 60 141 -92 -142 136
1622A36j02k45K41J47k45N5J15k58mL65j03k44J65M1j71P3R0j13Q0R8j57r7R2
$$ 136 34 -211 30 177 -68 -13 102 -156 -160 205 102 -142 23 64 -107 -34 56 -57 23 121 -36 -133 -41
1645d1N1M9J9j16oP9o4k9R0oJ5O4j73j00K13O3j29O9mj66R5J36j93mK64q2k38
$$ -41 10 59 78 -38 -44 35 -29 -58 32 26 41 105 -68 -168 45 108 -21 48 44 -122 -27 109 -84 -88 176 94 -144
1672a44J04N8q8J33R2j90j02J87j0j59R2J40n6j08J8qn5R8J57j22j89J32J00j74
$$ -144 -40 18 -70 63 155 -35 -137 50 40 -119 -27 113 57 -51 -33 -41 -96 2 159 37 -152 -20 80 -94
1696i4J0K04o3j30J14m3j78J86K07j93j54J63%j36J32P0j10K4Q2j48j25K10J15
$$ -94 -84 120 57 -73 41 -2 -180 6 213 20 -134 29 29 -107 25 95 -15 9 91 -57 -182 28 143
1719A43j20m6M4r0qJ41j8q0Q8M6j78p6J32R0oln7r8OJ24Nn9M8O2j19j22Q4J07
$$ 143 23 -23 21 -69 -77 64 46 -34 54 100 -78 -154 -22 68 62 59 2 -96 -90 34 39 -20 28 90 -29 -151 -67 40
1747D0j1N9j4k01l0K10Jj13J14O1j75m9J03n7L7K14r3k49N6J20n7L2J02o6p5L4
$$ 40 29 88 74 -127 -157 53 54 -59 55 116 -59 -108 -5 -62 -25 189 96 -153 -97 23 -34 -2 100 34 -41 -7
1773gm0o3J07J49j7j74r2J06L4k0J07J8j63J7P3j75J1L33k4k67L8M0j53J44K26
$$ -7 -47 -110 -3 146 129 -45 -137 -31 3 -17 90 108 -55 -38 35 -140 -129 204 180 -87 -49 -9 -162 -18 208
1798B08j95r9J68j04j69J44J65l4j6o2j63K9J31P1J3p7n4M3q5o5J91J43j47j5
$$ 208 13 -86 82 -22 -191 -47 118 84 68 6 -157 -128 3 74 87 10 -44 -1 -86 -151 40 183 36 21
1822B1j9k14J06K98j03j39J50q9j97J43Q9q2J73M6l12o2J93pL8J43j57j23Q5l7
$$ 21 2 -212 -106 192 89 -50 100 11 -186 -43 46 -36 137 183 -129 -191 2 -5 33 176 19 -104 -19 -56
1846e6m9J67O8m9m1j74p7K27P8o5J08j17k26J74P7k06K20K64l77j68K52j49l6
$$ -56 -105 62 130 81 40 -134 -211 16 94 29 137 20 -206 -32 45 -161 59 323 -54 -222 30 -119 -155
1869a55M15q6l80J90Q2k86J54K49j33qJ7k50J3K21%O7M7k95j7K46j99k6M26j40
$$ -155 260 174 -206 -16 66 -220 -66 183 50 42 59 -191 -178 43 43 110 157 -138 -155 91 -108 -134 292 152
1893A52l23K16q7k73M55K12m72Q2J89l88P1M12k54m2L54l54l30M38J8j73L52r0
$$ 152 -171 45 -42 -315 140 352 -120 -38 151 -237 -166 246 -8 -50 304 -50 -380 58 76 -97 255 165
1915A65m63K45J52l23K47K79l37j2J11l52J32M54k56q9K44l78j52N49j60l04N78
$$ 165 -298 -53 99 -224 23 302 -35 -47 64 -288 -156 298 42 -47 197 -181 -333 216 56 -248 330
1936C30j03o62L38K66m70L72M32o89j20N20l42j30N87j99l00L39k19l59N38J08
$$ 330 227 -435 -97 169 -301 71 503 -186 -306 214 -128 -258 329 130 -170 169 -50 -409 129 237
1956B37l33L07r5n53M08K98n03K83L97o42p8M79m24j4P35l60m94M74j23m21O24
$$ 237 -96 211 116 -437 -29 269 -234 49 446 -196 -274 205 -219 -233 502 142 -352 122 -1 -422 202
1977B02J11n74L80J34p06K62N12m20J22L72o39j46O16k52j68N60k61m31M44j56
$$ 202 313 -261 119 253 -453 -191 321 -99 23 395 -244 -390 226 -26 -194 366 105 -326 118 -38
1997c8l93P01J26o46K85J38o62M10N83o73L8N98o44l45P91j80l76P01j58p76M38
$$ -38 -431 270 396 -250 35 173 -489 -79 504 -169 -131 467 -177 -522 269 89 -287 414 256 -520 -82
2018h2L08m90L43L50n93K3L01m44Q8N93k98j88K76m01j41O08j14l09M65k01n17
$$ -82 226 -264 79 429 -164 -141 160 -284 -196 397 99 -89 187 -214 -355 253 139 -170 295 94 -423
2039d23M57O1l95N64J90q17J60M16n31K22O59o30k32N94m31l66P97j1n19M68r8
$$ -423 34 95 -300 264 454 -363 -203 213 -318 -96 563 -67 -299 295 -136 -502 295 284 -235 233 135
2060A35p01M89M37n31K49L00o64K8M83m29N5O65m45m21M74k16k65O87j3n74L20
$$ 135 -566 -77 360 -171 78 378 -286 -258 225 -204 -149 516 71 -350 124 -92 -357 330 317 -257 63
2081F3R0n56L29L66l76J63K17n79rM65k08L2L35m28j68L95k56j13N97j93l78L55
$$ 63 153 -403 -74 292 -84 79 296 -283 -292 173 -35 -3 332 -96 -264 131 -125 -238 359 166 -212 143
2103A43k00m30O59K03o20L15J95p16K58N82n59O3O35o22m30O99j47l26O80q4p18
$$ 143 -57 -487 172 375 -245 70 265 -451 -193 389 -170 -107 528 -94 -524 175 28 -298 382 298 -420
2124d20L87K06n22L43M05m59OK09m49P1N18k31p3K34l81j14M34j91j08M89k41
$$ -420 -33 173 -349 -6 399 -60 -54 155 -294 -223 295 64 -9 225 -156 -270 164 -27 -135 354 113
2145A13l92L53r1l15N94P6n97K46J86n13K77M43n02O6L98n50j64O18j99j99N12
$$ 113 -279 74 -17 -332 262 338 -259 -13 173 -340 -63 380 -122 -56 342 -208 -372 246 47 -152 360
2166C60l21m94N48N4m64N03J71o30J97K71n49K16O04m63k25M29l45k08N95r5l60
$$ 360 39 -455 93 147 -317 186 357 -273 -76 195 -354 -138 466 3 -222 207 -138 -346 249 154 -206
2187b06M13p7n18L37K14k91K81J41n37O4L26k80R7L44l54o0K71l37q5N14j33k59
$$ -206 207 130 -388 -51 163 -128 153 294 -243 -179 147 -133 -36 308 -46 -106 165 -172 -257 257 124 -135
2209a35L49k42l51N02Q4m42L65J62n92J43L78m24J20N39m99k82M77k01k18N39
$$ -135 214 -28 -379 123 207 -235 130 292 -300 -157 221 -203 -83 456 -43 -325 152 -49 -267 272
2229B72q8m35L65%m76L40K94l68J24K05n23Q5M68l08q2M25l01k98M17j01k73M88
$$ 272 184 -251 114 114 -362 -22 272 -96 28 233 -290 -205 263 -45 -127 298 -3 -301 116 15 -258 230
2251B30L5m83J80J20l26K72K72l92K3K68l50m5L84j62q1L05k69k90L68K9k20L04
$$ 230 265 -218 -38 82 -244 28 300 -92 -69 199 -151 -196 188 26 -55 250 -19 -309 59 88 -132 172
2273A72k5l72K23J01l39K56K80l66MK01l53M8M74k61k14L42j68k85L55L7k71L00
$$ 172 147 -225 -2 99 -240 16 296 -70 -66 135 -218 -170 304 43 -171 171 3 -282 73 110 -161 139
2295A39N8m39J21K44k48J40K31l34o2K91k37r4L78r0k20K35j28k55L25J41k70
$$ 139 197 -242 -121 123 -125 15 246 -88 -150 141 -96 -190 188 98 -122 113 -15 -270 55 196 -74
2316g4J00J20l02O6K10j80K0K53j96j73J67n6k4K46q9k02J43kj71J55R7j47R9
$$ -74 26 146 -156 -90 120 -60 -40 213 17 -156 11 -45 -69 177 88 -114 29 27 -144 11 108 -39 60
2339F0J5k45P8K08j14QJ03j84m7J91q5o4J99m6j65R3j9j06J71Q2j88NJ00j15K8
$$ 60 75 -170 -92 116 2 10 113 -71 -118 73 -12 -76 123 77 -88 5 -14 -120 51 133 -55 -50 50 -65 -37
2364c7J10r8J0J05j26r8J32K4k6J05p0j45J15K6r6Q0Q7j04rL7j21L1J84l9j09
$$ -37 73 -25 -15 90 -36 -134 -2 22 -4 101 31 -114 1 27 -69 11 98 -6 -15 22 -99 -68 116 77 -32
2389c2M0k3m6P6K7n9N9J5j01j0J9K0O8J5j35K0N9k8KN4o0oQ2q0o2J04L8n9J5l3
$$ -32 8 -15 -61 15 42 -17 42 57 -44 -54 -35 -15 53 68 -67 -47 12 -16 -14 40 -20 -26 56 -24 -86 18 56 -3 12 -21
2419b1l4O2L6o8MM4l4MJm8O6O4q1m1L3OpO6n0l5O7oq9K9O4l6L3%j00K5R3k7l6
$$ -21 -55 7 43 -25 -21 23 -11 -7 -6 -54 12 76 -5 -46 -13 -7 -14 52 2 -33 34 28 -61 -32 32 -4 29 29 -71 -46 47 20 -16
2452a6N0k6l6L4k4k4P2K4m8k8j8K4N6j2m7K1Ol3K0km1P8L2j24jR8l0k3O4n4n9
$$ -16 34 8 -28 6 -18 -42 30 54 6 -22 -40 -16 40 28 -19 2 8 -25 -5 -7 -48 30 62 -62 -63 35 5 -18 46 -8 -67
2483f7Q9K6j03L5L7pj7nl9N7L1k8j6pk3O2Rr0M7R1q4n4Q0l6k8J25m8j26Q5N5q8
$$ -67 22 48 -55 -20 17 10 -7 -12 -51 6 37 9 -7 -14 -37 25 34 -56 -9 82 -2 -56 24 -12 -40 85 37 -89 -4 51 -37
2514c7K1M3k7PL3p2j1O9Kj3j0m0K8N7p6j0R5n9l3Q5p9o4J62Kj63P6P2j24N6R2
$$ -37 -16 27 0 7 40 -32 -43 26 28 15 5 -35 -7 50 -26 -36 59 0 -33 52 -27 -91 71 73 -90 -14 58 -66 -10 82
2544H2j40rJ62q7j04J28Lp3O9qr2P1N5p0mK4k4L6Jq0P1N8j00K2N2j28O3J61j71
$$ 82 -58 -67 95 8 -96 32 35 -38 31 23 -69 2 57 -13 -17 7 -17 19 20 -60 11 69 -31 -9 43 -85 -22 139 -32
2573c2q3K15p2j52J79J9j81J40Q0k15M2J81j29n8J36j00k7J28n3p5P4Nm6N1n3
$$ -32 -115 100 28 -124 55 74 -107 33 113 -102 -60 121 -8 -66 70 -30 -57 71 18 -57 17 22 -24 27 -26
2598b6n0J42l6j21R9N4j62J11P2j97O2J95j66j00K01p0r8J64j4j76J42O2j62O2
$$ -26 -76 66 30 -91 8 62 -100 11 83 -114 -52 143 -23 -123 78 8 -90 74 60 -116 26 88 -74 -12
2622a2P7j06O5M1j53N0J54j28l3J21j18j4J77j12j19J92j5j85J62K8j95J52J08
$$ -12 65 -41 24 65 -88 -38 116 -12 -45 76 -42 -56 121 9 -110 82 67 -118 44 72 -123 29 137
2645A37k62K9K59j76r9K24q7j61K40k1k28J27J26j67J4J09r4RO8q5kP7m9K7K7
$$ 137 -125 -96 163 -13 -112 112 25 -136 104 83 -145 -18 108 -59 -45 64 -30 -21 47 -38 -40 37 -12 15 42
2670D2j45P7J60j74m9K00j12j29K42m2k47K25J33l12M7K47j99n0K25j34j46K27
$$ 42 -103 -26 134 -40 -89 111 -1 -130 112 70 -177 48 181 -131 -84 163 -36 -86 139 5 -141 86
2692H6lj87J25N9j42R1K5j30Q3P8j29J8P9r3K6P7j22NJ43p7o8R8p6m7J57l7j34
$$ 86 83 -104 21 80 -62 29 54 -76 7 85 -44 -26 53 -40 -14 63 -59 -54 89 12 -56 42 -34 -81 76 39 -95
2719i5J30K3j58Q6Q5j29O4J03j63m9J59k6o7P4k3p6Q2Np1O3K2m3L2l7p0J01O4
$$ -95 35 58 -100 -14 71 -58 6 109 -54 -103 56 30 -37 37 14 -62 20 25 -46 17 39 -4 28 -9 -79 22 86
2746H6j21J7Q3r3j0R9n4o4J18K6j51J5J01k8m4O1j8p0M3M7o0l2J06J4j10rN2j6
$$ 86 -35 -18 65 -28 -38 61 7 -57 61 87 -64 -49 52 24 -20 41 23 -47 -4 43 -17 -49 57 71 -39 -48 4 -12
2774a2MO7m1p8O7J5o4KQ2j4l2k5j4K2M0L5k4m3mL1l0k4Q2Mo7K9Pj01J01J04j22
$$ -12 -8 59 18 -60 7 22 -42 -40 42 28 -4 -29 -43 -21 19 54 30 -13 -17 14 -16 -40 42 46 -21 8 15 -86 15 119 -3
2805cm5J07n7r5J50mj20J18N3j82J6J32n2j6O6r0l9R4m2k0P9k9l5L9l7q5J51L9
$$ -3 -48 59 2 -93 57 53 -67 51 104 -78 -62 70 18 2 68 -22 -61 33 -9 -29 50 21 -14 25 -12 -97 54 93
2833I3j37M2M9j42O5J11j20j7J58q9j31J30Qn8J02kj49N8O7r1N1O2q2L0L4j16
$$ 93 -44 -2 47 -95 -30 81 -39 -56 102 13 -118 12 20 -38 64 62 -87 -29 38 -53 -2 60 -22 8 42 -74
2859g4J0J56o2l4O8j08m0J42l6q8J37J0j60Q6K3j21J29J15k03oJ29j07m4J85p3
$$ -74 -64 92 30 -4 64 -44 -84 58 22 -66 71 81 -79 7 30 -91 38 153 -50 -56 73 -34 -78 107 34
2884C4j23J62k6j85J35R7j28O1L4j57N3J13j04OJ06r5m2J09r0m8K07o4j45J10
$$ 34 -89 73 47 -138 -3 94 -34 27 61 -96 -43 70 -34 -28 78 -17 -59 50 -40 -88 119 55 -90 20
2908B0Oj16J17O9j65M2J45j54m5J60p7j4R3r9p7J23Rq0R6or4O8k3q8J13Q3j10
$$ 20 26 -90 27 96 -69 -27 118 -36 -81 79 2 -12 81 -18 -95 28 37 -43 53 47 -47 21 -2 -90 23 106 -4
2935dJ0M8j51O2J46j26k1J48j21r8J52l1q6J68rk13J09Q0j17N5Q8j35J2J18j20
$$ -4 6 54 -97 -35 111 -15 -36 112 -9 -107 45 14 -72 96 87 -126 -17 63 -54 1 89 -46 -34 84 -36
2960c6m7J36m8m1P7o1n9J13Nj01Q6J7p9L5K7r5O0J01j05j8O9n8PQ3o5m7Q4l3p2
$$ -36 -83 53 5 -36 41 -20 -79 34 39 -62 24 41 -38 -3 24 -71 -11 90 -15 -33 36 -22 -15 68 3 -44 40 7 -65
2989f5Q1J2n1P7j8j20P1P1p6M3M3j20L7N7q3RJ20o8n5O7p2l7J50j6j09P4K5j14
$$ -65 16 28 -23 54 36 -84 -13 58 -18 25 68 -52 -15 42 -41 -32 88 20 -35 32 -40 -77 73 57 -52 22 47 -67
3017f7O3M2p1L9N9r5l6R9k7j0M0l2m0R0m0o1O1J5n0M1no4L7O2m7j2L2l6NL2n2
$$ -67 -4 38 -33 6 65 -30 -66 33 6 -4 36 4 -36 54 14 -47 14 29 -21 20 15 -49 -12 50 3 -9 23 -13 -8 24 -28
3048b8J7N7m3j8K8l6J3P9n0o9P1Mp1M8M8o9K9M6j03j9J09k9k4L7n5k3P8k8m8O8
$$ -28 -11 46 3 -15 13 -23 -10 69 19 -50 21 25 -46 2 50 -19 10 56 -47 -66 43 14 -10 27 -28 -51 27 -1 -49 19
3078A9K5o6K3mm5N9M0p5qN6m7J7L7n8lR4n9n4N2Pl2N0Jp6M9M1o5J4L7k0nK5n1
$$ 19 44 -22 1 -3 -48 11 51 -24 -32 24 -23 -6 31 -27 -30 64 5 -49 3 10 -22 28 29 -47 2 43 -22 -8 29 9 4 29 -22
3111b2nO0k0j4J3k1mN4o2j9P6po3O1j4n8O2M4j10QQ7p0lM6l5oO2l7n7N4K0k9J8
$$ -22 -27 33 13 -1 12 -9 -13 41 -21 -40 36 29 -34 27 13 -45 17 61 -49 -41 46 -24 -27 19 -16 -22 40 3 -54 0 20 -9 9
3144Ij0k4K8J1m8K9Oj0K8rp5N5P7p9k8R1o9k0R3n4p7J16Pj05L8N3o0K5N4p5mO9
$$ 9 -1 -25 3 14 -34 -5 1 -9 19 10 -65 -10 67 -12 -40 51 -18 -38 55 1 -76 40 47 -58 -20 33 -27 -2 52 -23 -27 42
3176D2j6n2L1%J7Jk9j2L7l7J6N7n9m7J10m2r9R7O0j09K1O8j13J1J24q0p6J24q
$$ 42 26 -26 5 5 22 23 -6 -18 19 -18 -2 55 -4 -51 59 17 -82 15 75 -34 -13 55 -58 -47 77 -3 -79 45 37
3205C7r1O7lo5O7K6p8K4K6l0L0K1o8K8M2m9kM1m0J9P3q6n6J26n2p0J05Jj10Q9
$$ 37 -54 13 10 -55 12 38 -40 -16 10 -20 10 31 -37 -9 33 -16 -18 23 -17 2 75 -11 -67 59 7 -63 42 43 -67 22
3235B2N0j54M9J42j15p6J27l5p9J08oq4N6K3m9K2mj0P0m7p0P3L1j05Q1N2j42L3
$$ 22 72 -82 -33 109 -6 -82 45 10 -69 39 33 -51 5 28 -21 1 -3 -13 57 10 -60 13 44 -61 20 72 -70 -37
3263c7J26j21q1J82l1j26J26%j25Q8P8j42K6J00q4k0P3o4k2J21n2o7Q5j9m6N7
$$ -37 89 -32 -113 69 38 -88 38 38 -87 1 79 -63 -37 63 -21 -41 32 -32 -54 67 15 -52 33 14 -32 25
3289B5qp0Q7oq9P2J4o4Q6K4j62O6J17j34j2J50j01q3J65m2j59J34R8j71K5J16
$$ 25 17 -53 34 28 -61 11 25 -39 47 71 -91 -25 92 -42 -54 96 -5 -88 77 35 -124 10 108 -63 -38 78
3315G8j06j1R0n9l4P3j7m2M0l9J1P6q3k5Q7k5q8J15j4j03Q5P1j43J9J19q1l0R7
$$ 78 -28 -39 51 -8 -42 31 14 -28 12 -27 -16 60 -23 -48 39 14 -74 41 27 -76 9 80 -63 -44 75 -6 -36 61
3343F1p0m8R9rp3P8kp3N1Oo6N4O4p9j1M3k8nN5p3J8O1p4j8O6l5qQ4n5r7J12K4
$$ 61 -9 -57 42 33 -40 38 36 -37 14 20 -46 8 72 -7 -18 25 -3 -8 47 -26 -8 53 -21 -39 27 -8 -16 68 13 -84 28 52
3375E2j13N6P4q6j0Q1o6n7J07K3q2oL8mj4QLkj1K3Kn7J1R1l0q1N4L1p6L8N9o2
$$ 52 -61 -5 69 -17 -27 54 -12 -69 38 61 -21 -27 11 7 -7 1 4 2 -9 14 16 -41 -30 61 31 -50 4 35 -41 -3 56 -6
3407fk0P4l3n7M3L2l3OJ9l0NK9j7j3LK1k7nRLkJ8On4J9L8k8j9L7J0m9J2K7k8j6
$$ -6 -26 48 15 -42 1 33 0 6 25 -5 0 29 12 -1 2 23 -4 -9 0 3 1 19 25 -29 -10 28 0 -19 18 28 -21 -9 18 -10 -26
3442b6O8l2o6N7K8l1OpMokJ2mj1kN0l4m5N7L2o3mO4n2l6Q3j9q3P9L7q1kO0l9%
$$ -26 42 10 -56 1 29 -2 4 -3 1 -5 -7 5 1 -10 -12 38 4 -41 16 48 -15 -19 45 -7 -43 40 21 -62 17 54 -27 -29 31 -8 -8
3477hL1k5jJ6j2nOj4J6L2m9oN3l3k6N8l3l6P0qq4N3N3r1L4N0q8J3J00p3n9J12
$$ -8 23 -2 -3 13 1 -4 2 -12 4 36 -13 -19 34 1 -25 33 0 -36 34 26 -58 -5 48 -43 -9 41 -47 -34 66 -7 -66 46
3509D6j5r6R5%q5P4N6j17OQ4n6nO0o0qP9o1l4P3l0k7P3m5o9R5L6j14N1P1j10J5
$$ 46 31 -65 30 30 -55 19 75 -42 -36 48 -8 -13 47 -13 -21 58 -3 -37 36 6 -21 52 7 -62 33 69 -45 6 77 -33 -18
3540a8Q9j10kJ13n0o2O5j3m5P0ro1N6ln9M6Km8P5J3j17M4R0j17J9J03j10j7J23
$$ -18 71 -39 -41 72 22 -40 25 12 -33 37 28 -33 23 20 -39 7 9 -39 36 49 -68 -24 66 -51 -32 71 -39 -56 67
3569F7o6r0J19J9j08O6L6j15N7R6j06j9J05o3m7R1m3l9Q2qr5P9J6p0N6J2o7M4
$$ 67 1 -89 30 49 -59 7 43 -72 -15 81 -25 -44 61 -2 -49 42 -1 -40 42 34 -61 18 34 -36 20 32 -35 9
3597IL4o8J4L5l2LL5n9j2R3l4m9O7l1m8P5op6N6M1p2oM9k9jM8n0j0M5j2k6L7k6
$$ 9 43 -25 -11 24 -8 -5 30 -29 -41 52 18 -31 36 5 -43 32 26 -50 6 47 -25 -31 18 -11 -12 36 -14 -24 21 9 -17 20 -6
3630fj2N9l8n9P2L0r6M8N0q9J8Q4p6l2R2l5m7N3nn4N7L7r1K1N9m0j5M9l4k3O0
$$ -6 -18 41 3 -56 16 46 -50 -2 48 -41 -23 61 -15 -47 45 10 -37 16 11 -43 14 51 -40 -19 40 0 -15 34 0 -23 37
3661C7l7l3M6Kk5J0jj1J8Rk4qJ5lJ1kl9L6K1l7lM0j5k0L8k4k6M8j2m4K7K2k4K4
$$ 37 0 -33 13 15 -10 0 -1 -12 6 15 -9 -17 -2 -5 6 4 -35 1 22 -15 -18 22 7 -13 25 1 -25 23 11 -33 -6 16 -8 16
3695A6om2J6M1k6qK6j6jM8m2m9O8ll4J4K0m1L5K2m4kM0rk4J4nlJ3qj0RPj5pPN
$$ 16 10 -32 -16 25 -1 -9 17 1 0 48 6 -43 25 22 -12 2 22 -19 16 38 -6 -8 32 23 -1 13 8 5 18 10 0 9 16 1 -6 1 6
3732FJ2jk3pJ4NnpK1j0Pj6Ll%J0Ok8j1M2J0l0J5rj4J4Mj0RQMm5K8%LKnmlK6k3
$$ 6 18 17 -6 -13 1 6 1 -6 15 5 12 -4 -1 -4 -4 6 12 -16 -27 15 25 -5 10 1 -13 1 5 -5 4 12 16 -29 -1 -1 2 4 -1 -5 -8 18 -5
3773eJK3k1Nnnk2L1L6l1j8K3j3rK3lrJ3Rl9nL7j7oJ6j3j1J0Kj3J2J1%nk6nL0J5
$$ -5 -4 19 -2 3 -2 -7 -29 2 38 7 -11 12 -1 -10 13 10 1 14 23 -16 -21 16 -1 -7 9 -4 -15 -5 -3 -16 -4 7 7 2 -24 -29 1 16
3811A6j9jJ5k5PK8k8MK5j1l2J5ROlMk0J1Kj6J5Nk2M3j5m6J5L7k1rK4l7K2K6j8
$$ 16 -3 -4 11 -14 -7 21 -7 -3 22 11 -21 -6 3 9 6 10 -10 1 3 -13 2 7 -15 28 13 -33 -18 19 -2 -11 13 -24 -2 24 6
3846Fl0M3Ql3J0Nl2J7L4m2j4M3j7k6L7jk6K6J2n3J1M6k1j1J6k8KJ5NjoqjK0l5
$$ 6 -24 19 27 -6 4 9 -23 -6 28 -14 -28 15 -2 -28 9 8 -18 8 20 -33 -22 24 3 -8 8 -20 -18 -3 2 1 -5 -13 -14 6 -29
3881b9RM7j8m3M5qj8J1L1n7K8L6n3j6L8Rk3J5Rl9K0Qj6K0J0k1LNl3K8L9l2%K4
$$ -29 -20 27 9 -34 11 3 -15 -4 27 -30 -2 34 -19 -35 3 12 -11 4 13 -26 -6 2 -14 6 16 -5 -2 3 -30 -2 37 5 5 29
3915B9n4NN2l9k9O7oo8L7K2m6L7L2o7j3O4j8l6N4pl9M6k4j4QK3j5rJ6l1K4K5l4
$$ 29 -25 -20 32 -7 -36 31 25 -43 -6 16 -30 7 39 -28 -41 23 5 -31 23 16 -23 23 -1 -15 -7 16 1 -8 8 -23 1 26 -8
3948hkL1rj7J7k1J0L7k5m2M3lm3M1Pm4L0L4p4J6N5k6j9M2m3j6N5qn0K8K5k4mJ2
$$ -8 -10 21 12 -5 12 -9 1 38 13 -29 14 11 -32 9 16 -28 2 36 -38 -22 33 7 -12 30 -13 -29 26 18 -32 -4 21 -3 -7 5
3982Ek8L1J8m1jL3m2K0L5m2j0N6k4n9M9K6l8J4L0o2KP0k6k9J9Pk5J3noK0lPkk2
$$ 5 -23 8 26 -15 -16 17 -25 -5 30 -12 -22 34 10 -49 0 26 -12 2 32 -30 -28 42 16 -13 6 13 -12 1 -4 -10 10 7 14 12 -10
4017a0j0L9j5j8K4J0m1kN4n1K5N3n6m5M7J2k8K3J0l5KJ7k2rL6J3m2K1nj8L1L2
$$ -10 -20 19 4 -14 10 20 -21 -23 31 -20 5 58 2 -43 4 16 -12 11 21 -14 -12 5 -17 -26 10 23 -19 2 -3 -21 10 42
4049D2o3j1M3j7k4K1J3j1KKKj4J3J3j3qj0L7j0l4L2L0n7J8K9n6%P7j2o7M5J6m3
$$ 42 -21 -32 11 -6 -30 -9 4 -7 -5 -3 -1 -15 -2 11 -2 -10 -20 17 7 -27 5 35 -22 -4 25 -31 -31 46 34 -33 12 28 -15
4082a5mM5k1j8M3k2l1K4J7pjk0J4Pj8kK3jl3M4k0m4L9M8o6QM4l7l6P1k1m4N8J5
$$ -15 -19 26 5 -13 30 8 -23 1 18 11 10 -10 4 11 -7 -9 14 13 -20 24 4 -40 -1 47 -19 -11 33 -4 -40 31 10 -34 24 39
4116C9p5J9L5l9K0M2m2l4O0Lm4J6L2l9%Nj5QK6j0kj5lM6k0m3M5L2p1J1N0n9mQ6
$$ 39 -36 -17 18 -21 -1 41 -1 -35 25 28 -16 0 32 -7 -7 -2 -17 -9 17 7 5 -10 -13 33 13 -30 15 47 -24 -13 37 -22 -26 60
4150F0m8o4O3L2r1M1N4o9lP5n0m0N9Kl5J0J2k5K6j2j6K7%l1M0j5m2N7K3p7K3N4
$$ 60 12 -52 11 43 -48 -7 47 -22 -25 50 0 -40 19 21 -14 -4 8 -17 9 -3 -19 8 8 -23 17 2 -40 17 40 -37 -14 40
4182D0o7kO5l2m6P1np6M8N2o3ON5o1k5Q4k8o1O2Om1K8%j4J8Jn%k5K0L4l0l3N1
$$ 40 -27 -29 36 4 -42 29 24 -52 -4 48 -15 -9 46 -15 -40 44 16 -45 17 23 -18 10 10 -4 14 15 10 10 -15 5 39 9 -24 27
4216B7J0q2M2N7r4K3R2p6p7J11Kq5O6K1p0J5O6p1k2Q5k0n8M2Lk6L0nj3J8j3j6
$$ 27 37 -45 -3 54 -40 -17 75 -1 -78 33 35 -50 16 37 -33 -18 48 -23 -45 40 20 -38 4 7 -19 11 6 -7 11 -2 -18
4247a8L2k2QL5j7m8K9K5o8N9L0o7J8N6o0l3O6Mn5L6K4n9J1N6n0k1M7%k3LlJ2%
$$ -18 14 -8 0 35 18 -30 -1 24 -44 15 45 -22 -4 52 -8 -41 25 29 -26 10 34 -25 -14 42 -8 -29 18 18 -5 -2 -5 7 7
4280Gj1J0j0k8M7K5m7j2N3l3l1M3Qo0M3L7o8mN8j4l9M0Rm9K7K2l6J1L4k2j9J2
$$ 7 -4 6 -4 -32 15 40 -7 -19 34 1 -30 13 21 -39 4 41 -27 -31 27 13 -26 14 23 -26 1 23 -13 -2 32 10 -9 3
4312CJ1%mPok3PJ5Kk8K4K5l6JK0j5j7N2k3m8K4M2m7j2M7j3k0K4lk8K6K6k9k1K2
$$ 3 14 14 10 17 11 -12 -5 10 12 -16 8 33 -3 -2 18 3 -14 38 15 -33 -9 33 -14 -26 21 8 -12 12 9 -19 7 33 4 -17 5
4347ERj8qJ6Rk1LJ6k6lL8pk6RK1l3%L2j1j0J2K2n2J7M2l8J3j2J2k7J6K3j8j9K5
$$ 5 14 -4 -12 4 13 -8 -5 11 -15 -18 20 13 -13 -4 17 -16 -16 16 5 -5 7 29 -23 -6 36 -2 11 -1 11 -16 0 23 5 -14 11
4382A1Nk9RL2j1k1MKjmL8m4kL5jm1J4J0j6J8%qoK6j6j9OJ4J0j7j3K5jj3Rkj3j
$$ 11 16 -13 -4 28 17 -4 0 2 1 -3 35 -9 -11 24 23 -18 -4 6 -10 8 8 0 -6 20 4 -15 -9 5 15 -2 -15 10 9 -4 5 3 -10 -11
4420a1K2qk3L6kj5lJ4k9RL4l5pL5pj8PK2k5NRmqOK1pk4KL3k5k1L0Pk4K7pl9J4
$$ -11 11 3 -20 16 14 -1 -4 10 -19 -10 24 -11 -18 17 10 -8 -1 21 -4 1 10 6 -2 4 25 18 -6 -4 29 4 -17 13 20 -4 23 16 -23 -9
4458iL9k9j4M1j6m9M3J4m1L0K4m2NkJ1JNj3Qj6RJ3k3NQJ9j6k5K8rLJ3Ml8K1J8
$$ -9 30 1 -13 28 12 -37 6 20 -21 9 33 -9 -4 -6 5 6 11 -2 6 -10 -1 12 -11 -6 2 21 5 -20 8 -1 2 15 19 -19 2 20
4494B0m0J1M6j9k3K2jk5K4Ol1jJ8m%jlK2jj5J3mj9K9pl1RL0m1QK3k1j2L4nm7M4
$$ 20 -20 -9 37 18 -5 17 16 -9 15 21 -10 -11 7 3 3 2 -1 21 20 5 18 14 -5 24 17 -14 -5 25 -16 -8 15 -6 -18 16 11 -36 8
4531HL2n5j1L3j4MK0j2j6K0J0k8kJ6lPj7%K5k2mJ8rk0K9J8n1J1L9l7kL2j5l8N7
$$ 8 40 -15 -26 7 -7 -3 17 5 -11 9 19 -9 -11 5 2 9 -8 -8 17 -5 -9 9 0 -20 9 27 -24 -13 26 -11 -13 19 4 -34 23
4566B3Jn3L4K3l5PNj5J2J4nk9RRLjj6J5J4l2NK7j7j6L9rm3N1Mm8J7L5o2J2M8k3
$$ 23 24 -29 5 28 -7 0 5 -10 2 16 11 -18 -9 0 3 2 -14 1 15 -17 -12 15 -2 -18 21 12 -31 20 24 -24 -7 28 -34 -22 26 3
4602Cl3M6Ro2K4L6l0nJ8oj6K6Lk7K5k0K9j0qlO%qL0k9k1M4ql6L0K6m4PJ9l6NL9
$$ 3 -30 16 25 -37 -13 23 -7 -12 6 0 -16 10 13 -14 11 -9 20 10 2 -1 5 5 -3 27 -2 -23 21 13 -23 7 33 -11 -4 15 -21 -16 23
4639B3j1l3L0ll1K3J0j9K0lk8QJ9j4mK8k1kK5k9PK1j5j6K2k6j5M9Rl5QL3m7J5
$$ 23 12 -21 9 6 -25 -2 8 -11 9 6 -22 -14 5 -9 -13 15 -6 -8 17 -12 -5 16 1 -15 7 -19 -34 15 24 -11 -3 30 -17 -2
4673bK1k3j0N4k2m0L7pj4PK7k7lQmj6K1%noj6K4%jKJj7lJ6j3j9M2Pm0J7J1l6K4
$$ -2 19 -4 -14 40 18 -22 15 8 -6 1 28 1 -2 6 2 -14 7 7 2 -4 -20 4 4 3 5 6 -11 -14 2 -11 -30 12 19 -21 -4 7 -29 -5
4711eL9m1j8M0k6j2K7J1k6K2jl6K2K7k2JlNk0L3j0k3K4mmj5J8qJ2Mj1Rj0jJ2O
$$ -5 34 -7 -25 15 -11 -23 4 15 -11 11 10 -26 -4 23 1 2 -1 4 -16 17 7 -16 8 4 0 -15 3 -5 7 11 0 9 -1 -2 10 16
4747A6j9QJ1k7j0K7NqLnj0NJ1j9K4j1j4J1mj3J0K2j6rPj3%K0Qj6QJ6l5NK2oqJ5
$$ 16 -3 5 16 -11 -21 6 11 3 6 1 -9 -4 7 -12 12 1 -13 -2 -6 -19 -9 13 -3 -12 -5 -18 -18 2 10 -6 2 18 -17 -12 10 4 -4 11
4785A1j5j2J8J3k6K2kqm%kOJ0Ok8LJ8j4jJ8j3nJ5j0nRjJ3lk3PJPqMjJ1j3qLK1
$$ 11 -4 -16 2 15 -11 11 9 1 -3 -3 -5 1 11 17 -11 -8 10 -4 -5 13 0 -5 10 0 -5 4 3 16 13 -10 -3 -2 5 -3 1 0 11 -2 -10 -7 14
4826A4on%j7qL2oj0JPrj1J8pmK3Ol4J8J1k6kK5j7oL7k4qJ7%k6J6Rl0K3J7j6j4
$$ 14 8 3 3 -14 -22 10 4 -6 -5 2 -7 -18 0 -7 -11 12 18 -16 2 13 -13 -15 10 -7 -13 24 0 -8 9 9 -17 -1 8 -22 1 18 2 -12
4864a2K3rmORk0K0j3jmQPMrnJ6j9JJ4J4k8J1j0k4J1K6k0j0K4qJLjj9J8J2k0JP
$$ -12 11 2 -2 4 13 -7 13 0 -1 -5 3 10 14 5 0 16 -3 -2 12 26 -2 9 -1 -25 -14 12 -8 -18 6 -2 -1 2 1 -18 0 12 -8 -7 0
4903@Qj0J0r%J3k6J1Rjj0J3j4j7K3J4qMoomJ4k1qL9Kl6J6J8l1K0L1m7j4J8QnK
$$ 0 8 -2 8 -1 -1 12 -14 -3 6 5 -5 8 -6 -23 0 14 6 10 4 -2 -6 8 -13 -21 18 20 -16 0 18 -13 7 38 -9 -23 -5 3 -2 0
4941@JjmKj2OJ3Pj3j4RJ0Nj4K0nj1JLk7K2J0j7j3K6lj3PPqPJ2j9j6K8mMmRl4K8
$$ 0 1 0 -4 -2 -14 -8 5 12 -1 -15 -6 4 9 -5 15 10 -1 0 3 -24 -2 8 -9 -22 4 1 -12 -5 2 -6 1 13 -6 -22 6 2 6 2 11 -23 5
4982EKqQj2J6ppjRLqj0jjJ5Kj2MNnpPMj0PJ7k8j3K1J4j8jJ2jrQj7J2RQk4RMrJ
$$ 5 7 -1 7 -5 11 4 -3 -4 5 8 0 -10 -11 -12 3 5 -7 -3 2 -3 -10 -3 1 -9 -2 15 -13 -26 -5 9 -9 -10 2 1 -8 0 -17 -5 4 12 -12 -3 1 -8 -7
5027gJ2Jj3nJ1k1PL0Jk3kQJ0lJ0qj7J6Kk6OL8k1j4O%j0J0K0l5ML2j0k5J5Mj0J3
$$ -7 5 6 -7 -12 -1 -22 -15 15 16 -7 -9 -1 9 6 16 8 -9 7 9 -17 -11 27 6 -8 -2 -2 -12 -2 18 -17 -13 19 9 -16 -1 3 -7 6
5065FLk0OK8k2%j3lLJ9rj0oK9k7J0j0J7NJj9Rl%JQq%J3j5QpPkPpjj1RJQljlj3
$$ 6 9 -11 -5 23 1 1 -12 -15 -12 7 -2 -12 -18 11 -16 -6 -16 1 6 7 -12 -3 -6 -6 -5 3 -5 -5 8 -7 1 -6 1 -1 6 -1 -2 -13 -4 -3 5 2 1 -2 -15
5110a5pL3mj0jJ3j6J8lj5oK7j1j1J0Pj3J2Ol3OK4j9j1J5Lj8RRj1NQjk0K0olJ5
$$ -15 -22 11 7 -3 -4 9 -7 11 8 -7 -13 14 3 -8 2 9 -4 8 14 -19 -13 11 -8 -19 -4 -1 -19 -10 -1 -12 -7 1 0 -20 0 -6 -9 6
5148FoKqOMk1J4J0Mk1OqMJ1Oj1%J4kk0nK8k0JJ8j2j1K2j3nPPj4kRmlJ7qk0J5R
$$ 6 0 2 -6 0 4 -17 -3 7 11 -10 -4 -12 -8 3 9 -2 -2 12 10 -10 -15 13 -7 -6 12 0 -11 11 -2 -7 0 7 -7 -9 0 -4 -7 10 2 -18 -3 6
5190Fljj0RlKLpjnJ9j3kJ3Nk4MJj3K2J5l4oL3nj0jNjOJ0k4JJ6rpQRlmK%jPpJ8
$$ 6 3 2 -8 1 -2 0 3 -4 -5 -10 9 -4 -6 7 12 -12 -8 -7 -20 2 17 -17 -23 10 5 -5 -6 -1 -2 4 14 -10 -9 7 -2 -9 -1 8 5 1 3 3 2 9 2 20
5236B0j9%K0k6QOJ0l1J9Lk3J4J1j5qJ8j1j3J8mkONj2qK0pnOlpJ3lmMn%J0j4rJ3
$$ 20 1 1 21 -5 3 9 19 -12 7 10 -13 1 12 -3 -11 7 -4 -17 1 -3 -5 1 6 -6 -14 6 -1 -6 0 -3 -10 3 0 -4 0 -5 -5 5 -9 -18 -5
5277emNK2rj8K3lj7J4Kpj5K6j7j0RMj6J4J4j2pJ9j0%Oj9J1mmPOj7J1J3k4nL2k0
$$ -5 -9 -4 18 9 -9 14 11 -6 8 10 3 -12 14 -3 -13 -4 0 -16 -2 12 0 -7 12 2 2 8 -11 0 -4 -8 -1 5 -12 -1 12 -12 -17 15 -5
5316epK9k4pK6%l5J5J5j9NQj2rK7pj0NJ3olLmOjpNKQJ5m6OK6jk1QRk1J1J5j3j0
$$ -5 -12 17 -7 -14 12 12 -23 -8 7 -12 -7 1 -11 -20 7 0 -10 -5 8 2 -1 2 -2 4 3 -4 1 3 11 26 -20 -14 12 11 -10 -2 7 -14 -3 12 -1 -11
5358a1K0ok3K0J0k1J1jj2JJ1%%jJ5k6OJ0jj0JK1j6R%j2MjNnrJ2plJ0J0mj0%LJ2
$$ -11 9 3 -20 0 10 -11 0 -1 -13 -12 -1 -1 -1 -2 13 -13 -7 3 2 -8 -7 14 -2 7 7 -5 -1 -2 3 -2 -11 1 -6 -9 1 11 7 -3 -3 0 12
5399A2k1J5mnOmoOj4J4j9K1Pk2J3oOpJ4jl%koMNJj5K0mj9J2LRk1%J1mlMKj8K2
$$ 12 -9 6 2 -3 3 -1 -7 -1 -15 -1 -20 1 8 -14 -1 -7 -1 -8 6 5 2 2 0 -6 -2 3 4 -11 9 5 -14 -2 1 10 -11 -11 0 -4 -7 -3 -1 -19 3
5442CnlJQKrk%KOPk9PK8k0mLNj2J4Nj0jPo%J1j2%MKj9J8%Lj4JkJJ2j4NLLnNk0
$$ 3 -2 -5 -4 4 6 -3 -5 -5 -3 3 10 -19 -12 16 -4 -8 -5 0 -12 2 7 -3 -4 3 -3 -3 8 -4 -4 0 2 -17 1 1 4 -10 -9 -11 -10 2 -12 -7 -4 -1 -6 -1 -21
5489b1K2mjPKj4lJ2j0J2KJ0l0J1oOR%k4K5JjKj9RpK3k1OJ4mk2J5jj2K1j1k6K1
$$ -21 1 -3 -4 3 5 -9 -12 0 -10 2 4 14 -16 -5 -11 -5 4 4 -20 5 6 5 7 -12 -3 -10 13 -8 -2 12 8 -14 1 0 -12 9 -2 -28 -7
5528gK1j7j2K3rORk2%OPj2NNlJqkJ3Nrj2QjkQoPMnrojlJ7jj5K6j5kMJ1qrOmkJ6
$$ -7 14 -3 -15 8 -1 5 14 -8 -8 -2 5 -7 -2 3 0 1 -7 -9 4 9 0 -12 -4 -5 -7 1 -5 2 6 1 -8 -14 -15 -18 -1 -2 -17 9 -6 -8 -4 7 -1 -10 -4 -8 -10 6
5576Fn%nMj0K1Jj4lJ0nojJQ%qJPKj2K2k4jJ3m%kKLmnmQJ9j1j1J0j1JK4k2j2K1
$$ 6 1 1 -4 0 -10 11 12 -2 -5 5 0 -6 -7 -6 2 2 -6 -5 2 4 -8 14 -10 -11 2 -2 -2 -4 -2 1 -3 -8 -12 -4 15 4 -7 3 -8 -7 17 -5 -17 4
5620DrqLMLm%j2J0KlpJ1J0j4JJ2j3MklJ5%oLOk4PJ8kj1Mj4QKLmPlk0J6j0QKOj8
$$ 4 -5 -13 -10 -6 -3 -7 -7 -19 -9 -7 -10 -17 -6 4 -10 -9 3 -10 -6 -8 -11 4 4 -2 1 7 -17 -10 8 6 -5 -1 -15 -7 -5 -2 -6 1 -2 -22 -6 -16 -8 -6 0 -18
5666a8MJ9qJplMOLj3KmRQnj1RJ2k1lOJ1qJmRJ1j3j7ONNMLj4J3mLKlKnLpQnNJr
$$ -18 -14 5 -3 -2 -9 -12 -8 -2 1 -12 -10 -14 -5 3 -2 -13 -4 8 -13 -16 -10 1 -7 -6 -10 -1 10 -3 -20 -14 -9 -4 0 3 -11 2 -2 1 3 0 2 -3 0 -7 1 -4 1 2 -7
5715grJ3J1jj8Mj%j2LOjPjjjOlJ0lj1jOj1lJ3JLKj4K0oj4J1jmJ3lj2MMnJjkkM
$$ -7 -16 -3 8 7 -11 -7 -8 -8 -20 -17 -11 -12 -5 -6 -7 -8 -2 -5 5 2 -9 -10 -4 -15 -18 -5 -4 -1 1 -13 7 1 -13 -2 -3 -7 6 3 -9 -5 -1 -6 -5 -6 -8 -10 -6
5762foNKlNj1OKkJ3j9LJ2LOj8QklPqQm%nnLNJ2mj2%MRj6OMNqj0kLNK1k2RrjJ3
$$ -6 -12 -7 -5 -8 -3 -14 -8 -6 -8 5 -14 -11 1 4 10 -8 0 -2 -5 2 -6 2 -2 -2 -7 -12 -9 -4 8 4 -8 -8 -4 5 -11 -5 -1 4 -4 -14 -16 -13 -8 13 -9 0 -9 -10 3
5811Ckj0%QJmjJ0jj3Kj%kJ4j6OMPj2LkOonJ0oJ2j2%OmMlqROpLKj8J1MrNJ0Kj1
$$ 3 1 -9 -9 -1 0 -4 -5 5 4 -9 -7 -8 -8 -10 4 -12 -6 -2 5 -7 -4 -6 0 -6 -11 -1 -7 5 -7 -7 -1 -5 -1 -4 -12 -3 3 -4 -1 1 -17 -6 -2 -11 -6 4 6 -5
5859epLKKQl%Rj6qKJ6jj5J1j2J4qOLj0J2Lj4NjL%J6j1j1PJ3lkj5J1mrnRMjMj4
$$ -5 -12 -9 -7 -5 3 0 0 9 -7 -15 -13 3 2 -13 -2 -14 0 -8 -2 1 -9 3 6 -8 -3 -4 -1 -1 15 4 -7 0 13 10 8 -7 4 0 -9 -14 -5 -1 -2 2 -12
5904a2RqJ3nOJkoLoN%Nj2J3qkOkj4NJ4jj0J4j4jJ6olJ0kkjolL%JKJkj4J3j5J9
$$ -12 -3 -11 2 -3 3 4 2 -4 -1 -7 -2 -2 3 -9 4 -4 -6 0 -2 -16 -11 3 2 -8 6 -8 -9 7 1 -2 8 6 4 3 -3 -6 -3 -3 -2 0 1 -1 -15 -2 -17 2
5950BRk3LJ3LmKKj7QNlrJ0Jj%rmPLoMKRnj2J1%o%%kj0K2j0j1J5J3j2j1J0J3j9
$$ 2 11 -12 -9 4 7 3 5 7 -10 -2 3 0 -9 1 2 1 1 -8 -12 -5 -2 -8 -4 -2 7 2 -10 1 1 -5 -5 -5 -7 -17 5 -5 -16 -1 12 0 -11 -1 12 -7
5994gMJ3k5J0MqJ7Mj3oPn%QOlkj3PPloJ1j4J0j1J0oPLj1%J1j4%J6k5PJ0qJ0N%
$$ -7 -3 10 -15 -5 -1 -9 8 12 -1 -7 0 -5 -5 3 9 6 4 -9 -2 5 2 -4 7 -7 3 -8 2 -4 3 6 -5 -5 6 -8 -8 8 -17 -10 0 -8 2 7 7
6037GJj1NqNjoNqPOqrJ9Jj6QkOpRmj1JJ7n%Qnq%JkmK3j5JJ0%j5QKj4PRj2jJ4J
$$ 7 8 -3 2 -6 -1 -2 -8 -3 -11 -4 2 -6 -15 4 5 -11 -3 -5 1 -6 3 -1 -12 -11 6 1 1 9 4 -4 -4 -3 -5 -9 14 -1 0 10 10 -5 3 5 -9 -2 7 -5 -6 8 9
6086Ij8JPL%j2mJ2MJoJKkopK2j9LRPk8J6QJrjj1J4QmpPJ0k5OOQLj5j3J6J2j6J0
$$ 9 -9 -8 -1 2 2 -10 -14 -2 2 3 -3 -2 0 -2 -8 -15 7 -12 -9 0 7 -21 -5 3 4 -5 -6 -17 -3 5 1 -6 1 11 -14 -8 -2 6 9 -6 -19 -3 9 -7 3
6131ClJpJ2qjJ0j0Qj4J8j1PJk1J1M%j2J5knJ3j0j4J5Jj1J1oj6J6mNQj1QKqJjM
$$ 3 0 1 -6 6 -2 -3 7 -3 5 -9 9 -2 5 6 -15 -4 0 0 -12 3 1 -4 9 -1 -15 0 1 -10 1 -5 -21 -5 -9 -4 4 -7 1 3 -5 -4 -5 -1
6173aqPKlnJ5j0LmJj4J1O%Ol%j1J6pnJ1j1%MJ3pj2J5opjKJ1rqNQoJ0j9RJ0oMj1
$$ -1 -9 -2 0 -3 -8 7 -3 0 -4 -3 -17 -6 0 0 6 3 3 -8 8 1 -4 7 -4 -4 0 13 6 -6 9 3 -4 -5 -3 8 -1 -9 -4 4 -2 8 -11 -2 8 2 6 -5
6219ePj0J4jom%QoMJMj3nJ9j5mJ5j0NNpKJ4pOj1%jNkpOj1J1KKj0mQkJ0jj1RJ1
$$ -5 2 -8 6 5 -1 -5 -5 3 -3 1 2 6 -7 -12 7 -8 -12 3 -7 -2 3 -4 -2 12 5 11 0 0 -1 4 2 -5 1 -10 1 3 5 -5 -9 -1 -3 7 6 -5 4 15
6265A5j5Jpj3K0PjpJ1LqNmllmMkjQqJ0k0K1j1kjLjoMJNJKk2K0kM%qjOJ3j5jJ0
$$ 15 0 1 -6 -19 1 8 7 0 11 14 6 11 7 4 1 -3 1 -1 -2 6 -2 8 -12 9 -2 -4 -5 -2 -3 -9 -5 -4 1 2 4 -18 2 0 4 4 -4 -5 1 14 -1 -2 8
6312HmnoJ9j5NRNnj2RomjJ1Jj5jQJ1Jk0J1orJ2rjJ0kjL%j2J5onjMPjMpQj5J9k1
$$ 8 4 -1 -7 12 -3 2 11 16 11 -1 8 2 -2 -3 8 9 -6 -7 1 12 13 -7 4 -2 -11 1 -8 -9 1 -1 -2 1 1 -11 4 -2 -7 -8 -4 3 2 6 -1 7 -8 11 -10
6359a0OjJ1j2LlQJLj0%%J7j6J3Pj0jnMj1MNMj2J4j6PjkNkk%mNRk8J5J9j9pJ1j3
$$ -10 -4 -5 6 -6 -3 -6 2 3 6 -4 -4 -4 13 -3 10 17 7 6 1 5 -6 -2 3 7 -5 9 -7 0 -1 -3 2 0 -2 -2 -6 -1 8 -20 -5 14 -5 -12 -1 -14
6403a4OMLopK1J0k6J4pKlJ1j8PK2j5j5K0j0MkqJ1j2jJ2jJmQoLmJ3j7J7oj7J9p
$$ -14 -8 -4 -1 -7 -14 7 17 -9 5 -2 0 -3 8 -10 -3 19 4 -11 9 -1 3 1 -7 4 -8 -9 3 2 3 -1 7 1 4 0 13 -4 13 7 -10 9 2
6444Bj0RJ1k2KJ3Mj6J1J2j5%KLljrOmlJ1jj9J0QpKJ6j6oK0Lj2OKk1oK1r%qRNJ5
$$ 2 -8 1 12 -10 -8 5 9 -7 4 16 1 1 3 6 3 2 -7 -1 -5 -8 3 2 -17 -7 1 -6 -4 12 -4 -10 10 13 1 7 9 -12 -18 3 -6 -6 -14 -5 0 15
6488A5k0LPRoLoj3NkRMkj3KLJ1plKj3J6mMQkj6OJ3k2J5oKJ4mqqRknmJ4mj4QjR
$$ 15 -5 -2 5 14 8 11 5 -8 -3 -5 4 8 6 -7 -5 -2 9 2 -1 1 -12 4 0 4 12 10 -6 0 13 -9 6 0 2 16 12 4 -4 5 3 -2 -6 8 4 -10 -2 -3 6
6535FMj9K0lj4RJrJ9Lk4ONoPLqkJ8mjrJj4oK4k5J7OlrJ7j2lJ4j1%Nj0lJ1JpJk
$$ 6 10 -9 11 8 -6 3 4 -5 14 17 -7 -1 4 -2 5 8 0 -2 16 12 11 2 3 -11 -17 7 -18 -1 5 2 -7 10 -2 -5 9 -2 -2 3 -7 -10 1 2 -5 -4 -6
6580fkJ6oqQpjQLrJKpPOOk3J4nlJ0Rj3nKnoJ7j2RJnQKj2QJ1j1nP%moOjj0J9lk1
$$ -6 -8 8 2 -6 2 -5 -6 2 5 -4 -3 -1 -8 -1 5 11 -12 2 -3 -6 4 13 0 -5 -3 -8 -14 3 -9 0 1 -4 4 6 -6 2 13 2 -3 4 4 0 -6 0 -1 -11 8 5 -16
6629a6J7JjQokkkqN%LLnoJ0OkJKj9KK4j8rMlJ7j1L%RKj6OpQj0J7knOj2NMkj3J7
$$ -16 1 2 1 9 3 1 -1 -3 -11 -6 -6 -3 0 -5 -11 -1 5 3 4 6 -13 -11 13 -5 -14 -10 -13 4 -7 -4 -4 5 7 -9 -3 -10 -2 -12 5 3 -2 4 -8 -3 1 -1 -14 3
6677CMj1jJPm%KkJ1j5n%NJ5rj1OJ2j6J3j7OJ0np%kJ3mnqJ1JpQpJ3j4J0nOnPkr
$$ 3 7 -4 -5 -4 3 -1 -1 1 -1 10 -5 -10 -10 -5 10 1 -10 -4 8 -8 5 -12 -6 4 -1 -8 -8 -10 3 -1 -6 -14 -3 -2 -9 -1 -8 5 -9 1 -4 2 -3 4 2 -7
6723gNOoKMqJkLJ6j7J1MnLjj4JJ0kMokNj4OJ2j9PJ7j0rlkPj7J4o%LQNj6RkMjn
$$ -7 -2 4 -2 0 4 -4 -3 -5 -2 14 -3 8 12 7 10 9 -5 -4 6 4 8 2 0 5 -9 -3 9 -10 -3 14 4 -5 -8 -10 -3 -20 -6 -12 -12 -9 -1 4 -12 -3 -5 -1 -2 -7
6771gRMqj3JK2lj4K0j4j3J5Nj2PRq%J0ojJnqK1oqJ3omLKqLjJ3Jrmj3J4pO%mJ1
$$ -7 2 6 -2 -15 -14 8 5 -9 11 -3 -16 -1 4 -8 -1 8 0 0 10 4 3 4 -1 -9 12 6 -2 11 5 1 4 6 -2 1 0 13 14 5 1 -12 2 -5 1 1 -3 8
6817HmJrJ5jj8KkqK0kj4KJ2mnJ3k0J8Lj2lJJ3pmjoJKj1J9lJ5j3J0JrOlqnK1j9
$$ 8 4 5 -4 11 10 -8 -6 -8 -16 4 2 -12 -10 2 -2 -7 6 -14 4 7 -5 -8 -7 6 -1 -5 -6 -12 -11 -9 -20 -1 -4 11 -2 8 9 0 6 3 -5 -10 11 -8
6861hQk%KKkjPjlKjj6K2j5nJ3mMlj1jQOjj0J3j2J3Qj4j3J6Oj1nMLJj2KPLJ0lK
$$ -8 0 -2 -2 0 2 0 -1 6 5 2 4 3 -13 9 -6 -11 2 -2 2 -1 -12 -13 -5 1 0 -10 3 -9 4 12 -2 -15 1 7 -4 -9 -5 -2 -1 -13 -11 -4 -1 9 6 8
6907HLj5NpLnR%lOoJ3mj0RlKJ0j5JNJ0k2MJ2kj0OJj8K0j6POJkoo%mPRj7J2j3P
$$ 8 11 -4 1 -6 -3 -8 1 1 -2 4 -2 11 7 -3 6 3 5 15 0 1 6 16 -6 -2 10 8 -2 4 5 -13 7 -9 -2 4 5 3 -3 -9 -9 -13 -6 3 -14 -2 -15 -8
6953hpNjJ1Lq%kJ4krqJ7Jj5J5opNO%j9J2KMkQj6J4JpmR%mmmlJ2mKLj0KKqJ6Nj1
$$ -8 -15 -10 -11 0 3 -5 -5 -7 7 5 -4 -12 5 6 -9 6 0 -7 -2 4 4 -15 -3 -1 3 1 9 -7 7 8 1 -3 6 6 2 -2 -6 -9 3 -1 1 4 -6 -4 -2 -10 6 11 0
7002@j3J1Opj3K3j7pJ6Nk0J2K0j7jRj1%%LJrJ3p%jjJ1k%mpJ3oj3R%LmK0mkRj7
$$ 0 -13 -2 4 -3 -16 7 -10 -17 -1 4 -16 -4 16 -1 -2 7 -4 -4 -4 -1 0 -9 4 -3 -3 -4 -5 6 4 4 0 -7 6 0 -13 -4 -4 -1 -5 15 11 9 18 1
7046ArJ0jOqLQj9J3lNKnLj5OJ5oknLmjRJj1RqkJ1Ljj3OjMNrLJJ4j5MqloJ5jJr
$$ 1 -8 2 1 7 -1 2 10 -9 4 1 6 8 3 6 -9 -3 12 6 4 -1 2 -2 -3 6 7 -4 5 -3 -5 6 9 8 -5 1 0 4 9 0 3 4 18 3 7 -1 -4 -10 5 4 5 -4
7096dJ2%j2%J4Kj2Nj0MQNj9OKJ3j9PKLJJ1k3jNLj1Qj1LKqJ0j1J1J5j3lJ1KqqP
$$ -4 8 8 -4 -4 10 12 0 5 -5 -1 7 12 -7 -1 1 14 -5 2 4 7 8 19 -4 -5 0 3 -8 0 -11 -8 -6 -14 -4 -15 -4 11 -2 -5 6 8 0 -8 -1
7139aMoOpJQJ1j6oJ6mMoMmoKkOoMn%jJ1j5LJ1Nk7K8j1qJ3lj2J2lQpPMj5mK0k0
$$ -1 3 -3 3 -4 -3 5 16 0 -6 10 6 10 4 8 4 -2 0 -2 4 -2 2 -3 -3 -4 7 -8 -5 6 11 -16 12 1 -7 6 3 -9 3 0 8 1 8 12 -3 -7 13 -7
7185gMjlJ1k1J6lQmMj9J5kJ8k2K0j5kjRrLJ5pj7OJ0qmK1j4j1J8nMmkkN%Mj2lR
$$ -7 -3 -4 -7 4 -17 -1 -4 4 0 4 -15 0 -2 16 -6 14 -1 -3 -4 5 -4 -1 14 7 -10 -4 6 -2 -6 15 1 -10 8 3 7 3 1 -1 4 4 8 -4 -7 2
7229BQj5OpK1j3LJ%j2K0j3KJLj2J1lojJ1nMljj6J0J1ojj1LNQjj9J4MqJ0lLlJ0
$$ 2 10 -5 1 -6 15 2 5 6 6 -6 14 1 3 4 7 -5 6 3 -3 -4 7 2 6 3 2 -14 -4 7 1 0 -11 -8 -3 5 4 -15 -1 3 -5 5 2 5 2 12
7273A2rmRnJ0j7LJ6Jk0kJ4Kj0MkNpNLqJ1nnpMnJ2rnJ0nOmLQloJ8k4kJ3J4j7Ko
$$ 12 3 -1 8 3 13 -4 -1 15 16 -4 -6 8 10 0 4 2 7 0 5 8 0 11 6 1 -6 -2 -7 5 -4 -9 1 -4 2 -2 1 9 6 0 18 -6 -8 5 19 2 4 -2
7319bRKj1J1qQJqKrNKmJ0j6RoMjpK3k2J0J1onjJ2mj4J0%LkpOj8%K9mqLj3LJ2j
$$ -2 7 9 -2 9 1 9 10 2 4 -5 0 2 -2 8 -8 1 -5 -1 -2 -9 14 -8 2 13 7 2 1 13 9 -5 5 5 8 6 -1 5 -13 -13 16 12 4 7 -6 -3 9 8
7365Hj4PkJ1k0J6j0%MNpPpNj2J4Jk2J3MPpjlRNqJ5j6j3J4LjMjqmJ3pj1L0rj0K
$$ 8 -6 1 -1 10 -10 6 -4 -4 0 5 -2 5 -2 3 -9 5 6 -16 -3 1 8 1 0 -3 6 11 3 18 2 -11 3 6 5 9 8 0 -4 9 2 -9 21 12 2 4
7409DpPQ%p%NMoj0%qJ9okM%J1k0PlJ2j3pK1Jj9QKqMJ1j6QJ0j2nMOrLRj0P%j4J2
$$ 4 -3 4 12 12 5 5 10 14 8 -2 -2 -10 9 3 1 5 5 16 -4 3 0 12 -1 -8 13 14 -5 3 5 -3 1 12 -4 4 14 2 -3 1 7 -2 1 10 0 7 7 -7 5
7456ELkjjJ3oqMk%rKJ3qrJ3roR%knJ0Oj2Kj1MK7j3j0JlPj1J0lJ3j6kK0k2MJ8p
$$ 5 8 6 5 4 17 11 3 7 5 5 -4 -2 11 3 -6 7 -2 -8 1 1 -1 -6 4 10 -2 0 -11 -7 20 7 -3 -2 -5 2 -9 1 -2 11 -5 -7 13 -9 -5 13 6
7501FoNQk0jK2qjnRjmPj0J0roJ1m%J0qj0J6pNMj0PnlOKql%jNjKO%oMmqJ3l%pR
$$ 6 0 5 13 -7 -8 14 6 5 0 9 8 4 11 1 11 2 -4 7 3 3 13 5 -5 11 4 9 13 3 10 5 2 8 10 2 -1 -1 -2 3 2 4 10 10 4 8 4 -4 9 6 6 -1 8
7552Hj6RpKkJ2Jj5PrMLj1K2j3LQj0j0J6j2K3okJ4k4PMOrJnKNLNpjJnLj5J3lQj0
$$ 8 -8 1 -6 -4 -6 6 7 -8 -1 -10 -6 -3 -14 8 -5 -2 6 -4 -14 2 -10 13 7 5 19 -5 2 6 12 3 4 -1 1 6 9 14 7 6 7 2 5 -10 3 0 8 -2
7598bnJ0MJj2J2J0njqnJmK2j4OMj1%mLJ2j7OoMmmJ1O%m%lpjJ4Rk5J4NppQJpQj2
$$ -2 -7 3 7 8 -4 8 18 13 12 4 -1 0 -4 18 4 10 14 3 3 -1 2 14 -3 3 -3 1 -3 -7 4 10 10 6 6 3 -4 -5 9 18 -7 7 12 5 -2 6 7 0 8 -4
7646dLKOj0NRkmoJ3nLklo%kPj1MJ4nmqJ5oPj2nKJ2LKmKqpJ3l%j1NJ2k3%nJ6JJ1
$$ -4 -1 1 7 -3 2 11 9 5 -1 12 7 10 8 5 -1 -1 -3 4 -7 -3 11 6 2 -6 9 3 10 -2 -7 -5 7 10 12 8 10 2 -5 8 5 5 -6 -1 11 -12 -12 -17 -1 0 11
7695A1oj1J1Pj3OOkOpk%L%j5lJ5oPMplJ3j6mKPPqj0OKkLoP%kmK%J0oOqj0J4ln
$$ 11 5 -6 5 12 -1 5 11 9 15 8 6 6 9 9 -6 -9 6 0 7 11 4 1 14 -2 -6 -4 3 10 2 -8 -2 0 -2 1 -5 2 2 0 -4 -2 -2 8 2 8 0 -10 4 1 -4
7744dMQojqJ1K%j8kMJ1qnK0qNJlj1RKqM%%PJoNk%nJ3Jj4QrMJ1qrRroRKpK4k0Q
$$ -4 0 8 2 1 -7 4 6 6 -12 -14 -10 1 -7 -12 8 0 5 6 3 -8 1 3 -5 -1 -1 -1 6 7 1 6 4 4 -1 12 13 -1 7 -2 2 13 5 -4 5 -4 -10 -1 1 -6 18 -2 6
7795FpjoLQkJRj4MMj9NJ8%j1QNj3%K1j8j5L7j8oMNrNnj1J5JjNj0JlRpKQooJ1j0
$$ 6 -1 -2 -8 -5 3 1 2 11 -3 1 5 -14 -9 9 9 -2 6 11 -2 -2 19 1 -14 23 5 -1 3 8 -1 4 -1 -12 3 4 3 8 -2 -1 -4 5 -2 0 8 2 -4 7 -3
7842cJ0Orj0J2oLMJ3k1%Qk3OK0nj8K2j0%jlpK3noOj1rJ9Jj4QKj4MJ2%j0K2j4q
$$ -3 7 13 4 -6 6 0 3 7 20 -1 -1 7 -16 -10 10 5 -13 9 -1 -1 -2 -5 -12 11 6 0 6 -5 -14 5 6 -8 0 2 -12 -8 4 4 -6 16 2 -6
7884fPQoJ3rj3RoqJ3KMj1Jj0J1J9j8RJj6NKQj9J4Lk4J4Oj2OLrMMJKmQLj7oJ9j4
$$ -6 1 9 3 16 7 -6 3 -3 -11 2 4 8 -3 -2 -12 -1 18 0 9 10 -6 -1 1 9 -10 4 7 -17 -3 3 -9 -3 0 -9 -5 -1 0 2 -2 6 9 -8 -14 5 -9
7929iJ1oPnlJ3rjPKj0%QkrKJ5j4J1Kj2J1kqjoJ2j2QoJ0Pj5PNrJ2orNlJ1j1KlK
$$ -9 2 -4 3 -2 -5 8 -1 -2 5 7 -3 -3 5 3 -6 -4 11 -3 8 10 -2 9 7 -1 -2 -8 4 -8 0 -6 4 11 -4 3 8 -1 11 5 -4 1 -2 9 -2 0 -3 -1
7975aJK%oJ5rPj0JjkkkNLmqK0kpJ0j7J4oMrlJ6pLj2J5moqJ8oNJ5j9QokOMoKj6
$$ -1 0 2 2 -4 11 2 9 -1 0 -1 -3 -5 -7 -2 1 -3 -11 9 7 0 10 -7 7 1 5 -4 -7 9 2 5 -7 8 4 -2 -10 8 2 7 22 3 11 5 3 9 13 7 9 -7
8023gKRkMnkklJ9rqrJ5m%J%PKqLkj0J9j4QKKj1Lj3K1k1J0MLOMj2nkKjJoNJ2mm
$$ -7 -5 4 2 6 1 -1 -3 -6 13 4 -4 -13 2 -2 -2 -1 -1 6 8 0 3 1 -9 10 -4 4 6 8 -3 0 -13 8 -13 -3 1 4 10 14 2 -3 -5 -3 -4 -3 -9 -4 8 4 0
8072@J0oNmp%njJ7rnQM%j4J2lj%loJ3oJnKmOLKrLPlj4LlpK5mlKOj4jMQrKJjJ0
$$ 0 10 4 9 5 -2 -2 -7 -8 9 0 -5 3 7 7 -7 5 2 1 1 -2 -8 5 -1 0 -5 -3 -7 -1 2 4 -5 -2 5 2 -12 -9 -12 -19 6 2 -1 1 7 -7 -8 -4 4 -5 -3 -2 -3 7
8124GnLNj6J2KnkRnj2J2%kKNj7NOj3%J3Kok%NnKNj4oJJ7j3ORkj6MMj5K4Lj1j3
$$ 7 2 5 10 -6 6 8 3 1 10 5 -7 5 5 3 5 10 -7 -2 4 -9 -9 4 6 0 -2 -2 3 -2 0 5 -9 -15 -14 3 -10 -4 5 3 -13 -9 -5 -20 4 7 -4 -17
$$ [...]
8191A2
##END NTUPLES=NMR FID
##END=
