##TITLE=1H_LY-822.60
 CCl4, 8 sc, 
 28.5.2019
##JCAMPDX= 6.0         $$ Bruker NMR JCAMP-DX V2.0
##DATA TYPE= NMR FID
##DATA CLASS= NTUPLES
##ORIGIN= UXNMR, Bruker Analytische Messtechnik GmbH
##OWNER= root
$$ XWIN-NMR		Version 3.5
$$ Tue May 28 15:30:11 2019 Russian Standard Time (UT+4h)  she@DPX200
##.OBSERVE FREQUENCY= 200.1315
##.OBSERVE NUCLEUS= ^1H
##.DELAY= (6, 6)
##.ACQUISITION MODE= SIMULTANEOUS
##.ACQUISITION SCHEME= undefined
##.AVERAGES= 8
##.DIGITISER RES= 18
##SPECTROMETER/DATA SYSTEM= spect
##.PULSE SEQUENCE= zg30
##.SOLVENT NAME= CDCl3
##.SHIFT REFERENCE= (INTERNAL, CDCl3, 0, 15.7039)
##AUDIT TRAIL= $$ (NUMBER, WHEN, WHO, WHERE, WHAT)
$$ ##TITLE= Audit trail, XWIN-NMR		Version 3.5
$$ ##JCAMPDX= 5.01
$$ ##ORIGIN= Bruker BioSpin GmbH
$$ ##OWNER= she
$$ F:/spectra/data/she/nmr/H-F/1/audita.txt
$$ ##AUDIT TRAIL=  $$ (NUMBER, WHEN, WHO, WHERE, WHAT)
(   1,<2019-05-28 15:29:11.78 +0400>,<she>,<DPX200>,
      <created by zg, POWCHK disabled, PULCHK disabled
       configuration hash MD5:
       00 E9 B6 7A A2 85 ED C7 34 08 36 98 17 FE 4E 26
       data hash MD5: 16K
       6C F7 2C D6 A7 E7 2B 9E F5 BF 4B D5 06 4F 9E 2B>)
$$ ##END=
$$ 
$$ hash MD5
$$ 78 1C 00 F9 41 43 ED 91 53 BD 2F 7F 64 DB EF 09
##$RELAX= 
##$RELAX= 
##$RELAX= 
##$RELAX= 
##$RELAX= 
##$RELAX= 
$$ Bruker specific parameters
$$ --------------------------
##$DU= <F:/spectra>
##$EXPNO= 1
##$NAME= <H-F>
##$PROCNO= 1
##$TYPE= <nmr>
##$USER= <she>
##$AMP= (0..31)
100 100 100 100 100 100 100 100 100 100 100 100 100 100 100 100 100 100 
100 100 100 100 100 100 100 100 100 100 100 100 100 100 
##$AQSEQ= 0
##$AQ_mod= 1
##$AUNM= <au_zg>
##$AUTOPOS= <>
##$BF1= 200.13
##$BF2= 200.13
##$BF3= 200.13
##$BF4= 200.13
##$BF5= 200.13
##$BF6= 200.13
##$BF7= 200.13
##$BF8= 200.13
##$BYTORDA= 1
##$CFDGTYP= 0
##$CFRGTYP= 5
##$CHEMSTR= <none>
##$CNST= (0..31)
1 1 145 1 1 1 1 1 1 1 1 1 1 1 1 1 1 1 1 1 1 1 1 1 1 1 1 1 1 1 1 1 
##$CPDPRG= <>
##$CPDPRG1= <>
##$CPDPRG2= <>
##$CPDPRG3= <>
##$CPDPRG4= <mlev>
##$CPDPRG5= <mlev>
##$CPDPRG6= <mlev>
##$CPDPRG7= <mlev>
##$CPDPRG8= <mlev>
##$CPDPRGB= <>
##$CPDPRGT= <>
##$D= (0..31)
0 1.2 0 0 0 0 0 0 0 0 0 0.03 0 0 0 0 0 0 0 0 0 0 0 0 0 0 0 0 0 0 0 0 
##$DATE= 1559042951
##$DBL= (0..7)
120 120 120 120 120 120 120 120 
##$DBP= (0..7)
150 150 150 150 150 150 150 150 
##$DBP07= 0
##$DBPNAM0= <>
##$DBPNAM1= <>
##$DBPNAM2= <>
##$DBPNAM3= <>
##$DBPNAM4= <>
##$DBPNAM5= <>
##$DBPNAM6= <>
##$DBPNAM7= <>
##$DBPOAL= (0..7)
0.5 0.5 0.5 0.5 0.5 0.5 0.5 0.5 
##$DBPOFFS= (0..7)
0 0 0 0 0 0 0 0 
##$DE= 6
##$DECBNUC= <off>
##$DECIM= 24
##$DECNUC= <off>
##$DECSTAT= 4
##$DIGMOD= 1
##$DIGTYP= 9
##$DL= (0..7)
0 120 120 120 120 120 120 120 
##$DP= (0..7)
150 150 150 150 150 150 150 150 
##$DP07= 0
##$DPNAME0= <>
##$DPNAME1= <>
##$DPNAME2= <>
##$DPNAME3= <>
##$DPNAME4= <>
##$DPNAME5= <>
##$DPNAME6= <>
##$DPNAME7= <>
##$DPOAL= (0..7)
0.5 0.5 0.5 0.5 0.5 0.5 0.5 0.5 
##$DPOFFS= (0..7)
0 0 0 0 0 0 0 0 
##$DQDMODE= 0
##$DR= 18
##$DS= 0
##$DSLIST= <SSSSSSSSSSSSSSS>
##$DSPFIRM= 0
$$ [...]
##$SUBNAM2= <"">
##$SUBNAM3= <"">
##$SUBNAM4= <"">
##$SUBNAM5= <"">
##$SUBNAM6= <"">
##$SUBNAM7= <"">
##$SUBNAM8= <"">
##$SUBNAM9= <"">
##$SW= 24.9337058887773
##$SWIBOX= (0..15)
0 0 2 0 0 0 0 0 0 0 0 0 0 0 0 0 
##$SW_h= 4990.01996007984
##$TD= 16384
##$TD0= 1
##$TE= 0
##$TE2= 300
##$TE3= 300
##$TEG= 300
##$TL= (0..7)
0 120 120 120 120 120 120 120 
##$TP= (0..7)
150 150 150 150 150 150 150 150 
##$TP07= 0
##$TPNAME0= <>
##$TPNAME1= <>
##$TPNAME2= <>
##$TPNAME3= <>
##$TPNAME4= <>
##$TPNAME5= <>
##$TPNAME6= <>
##$TPNAME7= <>
##$TPOAL= (0..7)
0.5 0.5 0.5 0.5 0.5 0.5 0.5 0.5 
##$TPOFFS= (0..7)
0 0 0 0 0 0 0 0 
##$TUNHIN= 0
##$TUNHOUT= 0
##$TUNXOUT= 0
##$USERA1= <user>
##$USERA2= <user>
##$USERA3= <user>
##$USERA4= <user>
##$USERA5= <user>
##$V9= 5
##$VALIST= <valist>
##$VCLIST= <CCCCCCCCCCCCCCC>
##$VD= 0
##$VDLIST= <DDDDDDDDDDDDDDD>
##$VPLIST= <PPPPPPPPPPPPPPP>
##$VTLIST= <TTTTTTTTTTTTTTT>
##$WBST= 1024
##$WBSW= 4
##$XGAIN= (0..3)
0 0 0 0 
##$XL= 0
##$YL= 0
##$YMAX_a= 70548
##$YMIN_a= -84500
##$ZGOPTNS= <>
##$ZL1= 120
##$ZL2= 120
##$ZL3= 120
##$ZL4= 120
##$ABSF1= 10
##$ABSF2= 0
##$ABSG= 5
##$ABSL= 3
##$ALPHA= 0
##$AQORDER= 0
##$ASSFAC= 0
##$ASSFACI= 0
##$ASSFACX= 0
##$ASSWID= 0
##$AUNMP= <proc_1d>
##$AZFE= 0.1
##$AZFW= 0.1
##$BCFW= 1
##$BC_mod= 2
##$BYTORDP= 1
##$COROFFS= 0
##$CY= 11.3945322036743
##$DATMOD= 1
##$DC= 2
##$DFILT= <>
##$DTYPP= 0
##$F1P= 18.9103706918063
##$F2P= -1.10871071338519
##$FCOR= 0.5
##$FTSIZE= 0
##$FT_mod= 4
##$GAMMA= 1
##$GB= 0.15
##$INTBC= 1
##$INTSCL= 1
##$ISEN= 128
##$LB= 0.24
##$LEV0= 0
##$LPBIN= 0
##$MAXI= 10000
##$MC2= 0
##$MEAN= 0
##$ME_mod= 0
##$MI= 1.114404
##$NCOEF= 0
##$NC_proc= 0
##$NLEV= 6
##$NOISF1= 3.799351
##$NOISF2= 2.8
##$NSP= 1
##$NTH_PI= 0
##$NZP= 0
##$OFFSET= 15.70392
##$PC= 1
##$PHC0= -8931.791
##$PHC1= 10.80025
##$PH_mod= 1
##$PKNL= yes
##$PPARMOD= 0
##$PSCAL= 0
##$PSIGN= 0
##$REVERSE= no
##$SF= 200.130013532006
##$SI= 16384
##$SIGF1= 3
##$SIGF2= 2
##$SINO= 400
##$SIOLD= 16384
##$SREGLST= <1H.CDCl3>
##$SSB= 0
##$STSI= 0
##$STSR= 0
##$SW_p= 3612.71676300578
##$SYMM= 0
##$S_DEV= 0
##$TDeff= 0
##$TDoff= 0
##$TI= <>
##$TILT= no
##$TM1= 0
##$TM2= 0
##$TOPLEV= 0
##$USERP1= <user>
##$USERP2= <user>
##$USERP3= <user>
##$USERP4= <user>
##$USERP5= <user>
##$WDW= 1
##$XDIM= 8192
##$YMAX_p= 0
##$YMIN_p= 0
$$ End of Bruker specific parameters
$$ ---------------------------------
##NTUPLES= NMR FID
##VAR_NAME=  TIME,          FID/REAL,        FID/IMAG
##SYMBOL=    X,             R,               I
##VAR_TYPE=  INDEPENDENT,   DEPENDENT,       DEPENDENT
##VAR_FORM=  AFFN,          ASDF,            ASDF
##VAR_DIM=   8192,          8192,            8192
##UNITS=     SECONDS,       ARBITRARY UNITS, ARBITRARY UNITS
##FACTOR=    0.0002004,     1,               1
##FIRST=     0,             0,               0
##LAST=      1.6414764,     0,               0
##MIN=       0,             -84500,          0
##MAX=       1.6414764,     70548,           0
$$ Real data points
##PAGE= N=1
##DATA TABLE= (X++(R..R)), XYDATA
0@%%%%%%%%%%%%%%%%pJ5j6J6j6J6j6K1k9L2l2L6m4M8n3O1o8P6q4R2j01J13j26
39f6J38j52J69j88K09k32K57k86L20l61M09m65N36o26P41r00J131j485K088l288
59b051O457k7850o1056J16113K580r1922P6021N2256j07426o567P7604l8622k5305
72b9768O1639j3522m4460K7935N101k2509K5764K709l1765J7023J6334k4254Q659
85a114K0107k4482j3532J9432O817l635k021R4M747j5523j2842L5985J0346m5731
99b1352J2852L8721m6009j5118O7338j7846o1029M5571K5451n6342K1814M7632
111D1683n0238j9734M2319k0675j2059M9241j5653l7840L2769r065m0247N2497
123A2998K7810o2312J1831M3960n7130j6108P3411j4340n2074M2391J5642n3918
$$ plain form
0 0 0 0 0 0 0 0 0 0 0 0 0 0 0 0 0 0 -7 8 -8 8 -8 8 -8 13 -16 16 -16 20 -24 24 -29 32 -36 40 -44 48 -53 60 -66
39 -66 72 -80 89 -99 110 -122 135 -151 169 -192 217 -248 288 -338 403 -497 634 -851 1237 -2051
59 -2051 4406 -23444 -84500 31613 34193 -57729 18292 70548 -36878 -43445 34159 -4463 -29768
72 -29768 31871 18349 -26111 1824 6925 -15584 10180 12889 -18876 -1853 14481 -9773 -1114
85 -1114 18993 -5489 -19021 411 7228 3593 1572 1666 6413 -9110 -21952 14033 24379 -21352
99 -21352 -8500 30221 -15788 -30906 36432 18586 -42443 3128 28579 -27763 -5949 41683
111 41683 -8555 -28289 14030 -6645 -18704 30537 14884 -22956 9813 748 -39499 12998
123 12998 40808 -21504 -9673 34287 -22843 -38951 34460 20120 -31954 10437 26079 -27839
135b7839J2780M1027k6019j5972K4785k527j3369P655K606l212k334m508J0054
148C127P428j4966Q89J1420j5872j903K2758r454j1728J8244j1068j7980K9635
161A0530L524l1314K1322J4951m2788J0694M4955l4043k2268M6797j3316m4341
173c5297M0486K4642m6006O492L3357l2610j3654L7675n296k1632J7986K38j8574
186a2193J1928O299j1765R001L652j4959P164Q672j4628K781J3043j1232l282
199e519J2923o156p337P678k773j892R779n050o201Q857o584q352J7731K186j7490
214h200R439O964k0134N101J9906j2528o133J4375j1055j0336J8402m08j2047
227f654J3411j163j9026J3223J1068j9582N579J8083k0028q121K4423o257j8120
$$ plain form
135 -27839 -15059 25968 -51 -16023 8762 6235 -7134 521 3127 -85 -2419 -6927 3127
148 3127 10555 -4411 -3522 7898 -7974 -9877 12881 3427 -8301 9943 -1125 -19105 10530
161 10530 14054 -17260 4062 19013 -23775 -13081 31874 -2169 -24437 22360 9044 -35297
173 -35297 5189 29831 -16175 -9683 23674 -8936 -22590 15085 9789 -11843 6143 6381 -12193
186 -12193 -265 6034 -5731 3270 6922 -8037 -873 7799 -6829 -4048 8995 -2237 -5519
199 -5519 7404 1248 -6089 1589 -1184 -3076 6703 1653 -4548 4309 -2275 -10627 7104 9290 -8200
214 -8200 1239 8203 -11931 -6830 13076 548 -5585 8790 -2265 -12601 5801 5393 -6654
227 -6654 6757 5594 -13432 -209 10859 -8723 -3144 14939 -5089 -13210 11213 4956 -13164
240a3164J7634N427k0656P056J5410j3199n708J1348l522n573P712J296n074j32
254a145j183N43M205j266l87K477o288l165Q444P31l688N263l394r641P124N930
270D560o961N087N339j4255j906J3561n454m832J4234m122j6710R045Q694j0967
284d687M021J0858j1897o794J1156j116n565P944J90q485L021K946m052L737K763
299D040o615K51M525l443L94N074m463m239M986J211k562K579K06m296q7K087
315c52J010J952p15k969l12r14k23N500J835n499r01J244l694K425P061k803m359
332a714K506k701l581P163L634n532M17J074o367J604Q326k290m018L525k545
347d99n137N702M390m492r6K100m697j045N758P50k669N88j194k429K301K795
$$ plain form
240 -13164 4470 9897 -10759 -3703 11707 -1492 -7200 4148 626 -4947 2765 4061 -1013 -1145
254 -1145 -2328 -1785 2420 1154 767 3244 -3044 -6209 2235 2966 -722 4541 1147 -8494 -1370 4560
270 4560 -2401 2686 8025 -6230 -8136 5425 -29 -4861 9373 5251 -11459 -2414 6280 -4687
284 -4687 -666 10192 -1705 -8499 2657 1541 -4024 3920 4110 -4375 -1354 1592 -2460 1277 4040
299 4040 -2575 -2324 2201 -1242 -848 4226 -237 -4476 510 1721 -841 1738 1944 -2352 -2439 -352
315 -352 658 2610 1895 -1074 -1386 -2300 -2523 2977 4812 -687 -1588 -344 -4038 -1613 5448 2645 -1714
332 -1714 792 -1909 -5490 1673 5307 -225 192 1266 -5101 -3497 4829 2539 -1479 2046 -499
347 -499 -5636 66 4456 -36 -132 1968 -2729 -3774 1984 2734 65 653 -541 -2970 -669 2126
363B126p49r05q71j428O88J906O50j24j234j836J65J540J322J025j233l090l33
380b381J827J041J800N94l773k375K007R58Q02L100j190n038k70K050%K750K621
397D523m190l992J785J080N49L622q7n071j163K032j5J673K987k110m073L6J492
414i22R03K084P86k927k734P10K252J336K72n91j989j902J246K972M11j037m08
431D62j924j650K893L159j289j603n42k058K93M193J150k544j016q36j415K161
447e66L336n47j923j195j600M37L171J603r34j832k285l02K652J848n4m93k176
464h60k068J689K405R6K56n26k984o44K806J267j83N5j953j948J669K054Q7Nj113
483A10j983N75J667L22O61j93k549n57J954M43N02R97k361k234K090J441n69J255
$$ plain form
363 2126 1377 472 -399 -1827 -1139 767 1417 1293 59 -1777 -1612 -72 1250 2275 1042 -2048 -2381
380 -2381 -554 487 2287 2881 -892 -3267 -1260 -302 500 3600 2410 -2628 -2898 -848 -848 1902 4523
397 4523 333 -3659 -1874 -794 -245 3377 3290 -1781 -2944 -912 -927 746 3733 1623 -2450 -2414 -922
414 -922 -19 2065 2851 -76 -2810 -2100 152 1488 1760 1169 -820 -2722 -1476 1496 1907 870 462
431 462 -1462 -3112 -219 2940 1651 48 -494 -2552 -2259 1934 3084 540 -476 -1312 -2727 -566
447 -566 2770 2223 300 -895 -2495 -2058 1113 2716 1782 -50 -2335 -2637 15 1863 1809 1316 -860
464 -860 -2928 -1239 1166 1262 1518 992 -1992 -2636 170 1437 1254 1309 -644 -2592 -923 1131 1218 1223 110
483 110 -1873 -1298 369 691 1352 1159 -1390 -1947 7 450 952 1949 -412 -2646 -556 885 316 1571
501A571m69l355N18K712o70J11J586k393k262K382J163q04J340l63l099L44K361
518F73j5K05K13k071o27J572K47M66R01j882j335J585o6l19K249o76l084J207
536g57J618j520J087J414l071o42L117p26j166K146j412k732K668J549k088J410
552H95Q98l923j96L534o20n33K050k163k804K512J462j184J113k08k559R14J702
569H90r72P78O27k958k61K847l49j50J699k576k952K591J874n82J502n32l632
586b156K71J789m83J808J382l398q57K252j601mL789k155l842L459J651l014J963
603H54J426m986l17M554n18n14K314k913l488K403J039k8L630q11n216P55J894
620G8k098K617L556m471k519L726o43j836L385j75m022J104K098o28J507K80l636
$$ plain form
501 1571 1102 -2253 -1735 977 307 418 2004 -389 -2651 -269 894 90 1430 1067 -2032 -1688 673
518 673 658 863 1076 -995 -1622 -50 197 663 1564 -318 -1653 -68 -134 -453 1796 1120 -1964 -757
536 -757 861 -659 428 1842 -1229 -1871 1246 520 -646 1500 88 -2644 24 1573 -515 895
552 895 1793 -2130 -2326 1208 588 55 2105 -58 -2862 -350 1112 -72 1041 833 -1726 -812 890
569 890 -82 696 1323 -1635 -1896 951 602 452 2151 -425 -3377 -786 1088 506 2008 1476 -2156
586 -2156 -1885 -96 -579 1229 2611 -787 -1644 608 -993 -997 2792 637 -3205 254 1905 -1109 854
603 854 2280 -2706 -3023 1531 1013 499 2813 -100 -3588 -1185 -146 -174 3456 2645 -2571 -1816 78
620 78 -2020 597 4153 -318 -2837 889 246 -1590 1795 1620 -2402 -1298 800 172 1679 1959 -1677
637a677n95J361k60K935K635m226k911K028r87k50M878M16m159LL47j758K134
654h6K074j886K9J44k187K322K610m369j054M011k578j501O693o63p351K204L027
671A439m762K156O793l634m649K523r61j995M524J675l104K16m90k250K735J798
687B014l045Q52J876l396K81M294j947k923J989m45j346L089J108k023l63j664
703a649j108L750Q42k620K569L57n999J464N683l525j914N509k178n387M411K740
719B945m458N73K514k579K15K398j510o5O79l011J092L873k894j079M624l134
735A83n042N465K591n272J992L695n283j451N011j155k191K796o52k142J930m32
751D3j235K848q67l279L056J311l932J870K991m195q06M133j514j916K587o63
$$ plain form
637 -1677 -2272 -911 -1171 1764 4399 173 -2738 -710 -1697 -1947 2931 3347 -812 -809 -462 -2220 -86
654 -86 1988 102 131 275 -1912 410 3020 -1349 -2403 1608 -970 -2471 4222 3559 -3792 -1588 1439
671 1439 -3323 -1167 5626 1992 -2657 -134 -1095 -3090 1434 3109 5 221 -269 -2519 216 2014
687 2014 -1031 -179 1697 -1699 -1418 2876 929 -1994 -5 -450 -1796 1293 2401 378 15 -1649
703 -1649 -2757 993 1835 -785 1784 2141 -3858 -2394 3289 -236 -2150 3359 1181 -4206 205 2945
719 2945 -1513 -940 1574 -1005 -790 1608 98 33 712 -2299 -1207 2666 -228 -1307 3317 183
735 183 -4859 606 3197 -2075 -83 3612 -1671 -3122 1889 734 -1457 1339 687 -1455 475 43
751 43 -1192 1656 789 -2490 566 1877 -2055 -185 2806 -1389 -2195 1938 424 -1492 1095 432
767D32j532J765j049p50L151j813k865M519r6n597M204L958p194r9P444m186m726
784d434O795M14o464L294L633m750r3L609k041r65J748j294L22J645k470J75L052
801B176k746j593M205j206l486L735J041m300J598K389k903O82K133k797L86K499
817A813l127J1M111l196k350N232j380m938M933K352o262J290M616m125j190M733
833B523j820k793K858m52j757K484n19j697K742j181l410L913J494m901K224L741
849C449n204p85N580k742l546M782L76m035K438J513l338R33J558k247J306J929
865A967k588K82J732l167j6M020j777j848L299j172l230K655P08k512K415J189
881A957l221J225J465l504J135L268l526l07M900k873l735M504j04m675L787L189
$$ plain form
767 432 -1100 665 -384 -1134 2017 204 -2661 1858 1762 -3835 369 4327 -2867 -2966 4478 292 -4434
784 -4434 2361 2775 -3689 -395 3238 -1512 -1605 2004 -37 -1002 746 -548 -226 1419 -1051 -876 2176
801 2176 -570 -2163 2042 836 -2650 1085 2126 -2174 -576 1813 -1090 -408 1725 -1072 -686 1813
817 1813 -1314 -1303 2808 -388 -2738 2494 1114 -3824 1109 3461 -2801 -1511 3105 -1020 -2210 2523
833 2523 703 -2090 768 316 -1441 1043 524 -1173 1569 388 -3022 891 2385 -2516 -292 3449
849 3449 -1755 -2540 3040 298 -3248 1534 1910 -2125 313 1826 -1512 -579 979 -1268 38 1967
865 1967 -621 -339 1393 -1774 -1790 2230 453 -1395 1904 732 -2498 157 865 -1647 768 1957
881 1957 -1264 -39 1426 -2078 -943 2325 -1201 -1508 3392 519 -3216 1288 1184 -3491 296 3485
897C485m724K12L541l529j760L847l83j514K414o62k323J442j36j487K220N37
913A180k018J720N93l322P99K261k241K67K964j842j390K229j516j981K854L80
929I37j891K246L50l345J152J645k896P19L383j848j238K357j661k366K449O65
945F58j515J897P43k383J61K94j724J506K088j640J28J380k604r64K741q48j322
962a404L104J04l162J114J077k578P68K576j473n32J999j397j898J465K64p94
978g67J649M69j710J50L26j114N58J062n57K77M04j261J4R73q70n9J194r63m36
997f61J884o33j806J329K86j853J372J822j832l74J561j701j337K346O24j344
1013c17R44K82j956J32J298n73p7J086l75o89J82k54j55N46J%M44m10l64L78n49
$$ plain form
897 3485 -1239 -1027 2514 -1015 -2775 1072 689 -825 1589 927 -1396 46 -90 -1577 643 1180
913 1180 -838 882 1475 -1847 -1048 1213 -1028 -761 2203 361 -1029 1200 -316 -2297 557 937
929 937 -954 1292 1642 -1703 -551 1094 -1802 -1083 2300 452 -786 1571 -90 -2456 -7 658
945 658 -857 1040 1783 -600 -439 -145 -1869 -363 1725 85 213 1593 -1011 -1975 766 -82 -1404
962 -1404 1700 1804 -1358 -244 833 -1745 -977 1599 126 -406 1593 196 -1702 -237 27 -767
978 -767 882 1351 -359 -209 117 -997 -439 623 66 343 747 -514 -500 473 -397 -456 738 -225 -661
997 -661 1223 590 -1216 113 399 -1454 -82 1740 -92 -466 1095 -606 -1943 403 1027 -317
1013 -317 627 909 -1047 -915 383 -190 -267 819 444 -245 -63 -317 -472 74 75 75 519 109 -255 123 -426
1034d26m15J291L93r85L51J33j355L72J455o55m49J148o84j377J027P71p84M14
1052B25N44j247l85J118P5l57L70k06n89J97K16Q5L56j37m32Q1k22j27Q84J67
1072F16r42J65M85p31J7R64m61o31Q97J8j045M59P14p01j39P14k63m70M51M0n56
1093c99J78N64L5m20j94J55l3j26N25L19p59k17O29n00m92J321L75j413J43P37
1113D28j121M8J739n22j388J006L10j497N74J446r14n82J024m72j082R82Q05q60
1131g6k40O56k65n68L94M34l82k07N66K3q59J45R16n02n57R24M7j078N44O67j099
1152e17Q2J352o95r52R50j5r02Q89N40j072J75O44q76r5R51l04k38N60o42n25
1172f90R04M1n08O76r1r65N67M25q72M54R11r50m06P78m25l67R87l6q44L76K61
$$ plain form
1034 -426 -841 450 843 -142 209 342 -1013 -641 814 159 -290 858 174 -1203 -176 595 -189 225
1052 225 769 -478 -863 255 330 -27 343 137 -452 -255 -39 46 402 265 -167 -86 -308 -435 449 616
1072 616 -326 -161 324 -407 -390 574 113 -518 379 397 -648 -189 525 -176 -315 399 136 -334 117 157 -399
1093 -399 -221 343 378 -42 -236 -81 -114 -240 285 604 -155 -372 257 -243 -735 586 961 -452 -309 428
1113 428 -693 -645 1094 572 -816 190 500 -997 -423 1023 109 -473 551 79 -1003 -21 784 -76
1131 -76 -316 340 75 -493 -99 335 -47 -254 312 335 -524 -379 537 35 -522 402 449 -629 -85 582 -517
1152 -517 -435 917 222 -730 220 205 -697 192 732 -340 -165 479 -397 -492 459 155 -83 477 -165 -690
1172 -690 214 255 -253 423 332 -633 -66 359 -513 -59 852 -98 -504 274 -151 -518 469 433 -411 -35 226
1193B26m97R3L10p9J00j30j90K48k76j56R03k75j045J043M74j701N36J602j608
1212d22m44K212j138j952K351O14k618J247J859k539l34K569j402j490K532K8
1228A073k402J175J111j749M05J508j197o05J145m12o46P43J54k46J00l53k5L16
1246I5l47L12O63j050k41J307q77r37J829r5j754J484O01k367R57J992k213l33
1264i74K507j580j491K625n31k251K408P09k929J265J755k690L82K658k264j022
1280a423K979j242k226K726L64k656J714J291k820M77K310j768o92K082q68j322
1296a074J436jj036R24K97p63K03j55j78Q76n22n31J303o75j323J890J13k351
1314a567J901J481l327M98L150k823j177M105j658l312L949O45m511K479K952
$$ plain form
1193 226 -271 -178 132 53 153 23 -167 81 -195 -351 552 277 -768 275 749 -952 -416 1186 -422
1212 -422 -866 1346 208 -1744 607 1221 -1397 -150 1709 -830 -1164 1405 3 -1487 1045 1073
1228 1073 -1329 -154 957 -792 -387 1121 -76 -681 464 52 -594 149 303 57 157 -196 -221 95
1246 95 -252 60 723 -327 -568 739 -138 -1075 754 659 -1095 389 990 -1377 -420 1572 -641 -974
1264 -974 1533 -47 -1538 1087 556 -1695 713 1422 -1507 -242 1513 -1177 -795 1863 -401 -1423
1280 -1423 1556 314 -1912 814 1178 -1478 236 1527 -1293 -816 1494 -274 -966 1116 248 -1074
1296 -1074 362 361 -675 249 546 -217 -14 -169 -347 529 7 -524 779 104 -1219 671 784 -1567
1314 -1567 334 1815 -1512 -1014 2136 -687 -1864 2241 583 -2729 1220 1865 -2646 -167 2785
1329B785m400J64M118l211j950M571j027l531L363R37l889J688K329l095K25K856
1345A933k075j283K323o93j305J800p5j314R73l7r76R09N7o19J091m23j350J381
1363C17K13j599J521P43k480J017J797k719J43L088k296j464L498j381k951L795
1379A242N88m302K511K614m579M90M274l572j748N042j581l984M080R31m619K330
1395b83K922m074J30L771k801j837L619o89k500K486N08k611J196J325j823J31
1411e30J237q02q3M97m87L57J7r61R57L46j599J401J391k879J3K839k364j346
1429a996M061r03l478L309Q64m685J970L621l860k97M309k983k742M329o55l724
1445b860L737J729m313J324K593l941k78M066j904j734L518p34l290J935R36k323
$$ plain form
1329 2785 -1615 -1451 2667 -544 -2494 2077 1050 -2481 882 1819 -2070 -382 1947 -1148 -923 1933
1345 1933 -142 -1425 898 205 -1100 700 625 -689 284 247 -729 180 237 -382 709 286 -1064 317
1363 317 530 -1069 452 1195 -1285 -268 1529 -1190 -1047 2041 -255 -1719 1779 398 -2553 1242
1379 1242 1830 -2472 39 2653 -1926 -1436 2838 -734 -2482 2560 979 -3005 1075 2006 -2613 -283
1395 -283 2639 -1435 -1305 2466 -335 -2172 1447 758 -1742 744 1252 -1359 -163 1162 -661 -530
1411 -530 707 -95 -178 319 -168 189 206 -755 202 548 -1051 350 1741 -1138 -1125 1714 -650 -1996
1429 -1996 2065 1162 -2316 993 1857 -2828 -858 2763 -1097 -1394 2915 -68 -2810 1519 864 -2860
1445 -2860 877 2606 -1707 -383 2210 -1731 -2009 2057 153 -1581 1937 1203 -2087 -152 784 -1539
1461a539J457J968j928l99J131j252m11J165k75K37Q90r28l54N38j193J1J653
1478G71p69l51J952j090k009J663j48j888K551J411k957Q08J864l503m51L812
1494A666j592j614L973q09m269K516J594l889J489L868k944j163L295k145k993
1509c017L205R69k375K023J495l007m09J513j553n7K490j52j029N59q06j138P60
1526e29M07P4R62j39o21J44r88o49J486J45p20J639J49k346N53R33k175O72L037
1545B034j385j353K133j249k638K312J149k150J638J881k914p11K036j650p96
1560a663K965k78j814J803m5k695R00J442j448Q23J938j658j102J230r49r74J852
1577C27N85q45P08j71j600K46P03l24O50O45p47o0Q2j016J99R26m52L08R34j086
$$ plain form
1461 -1539 -82 1886 -42 -441 690 -562 -973 192 -83 154 1044 116 -238 300 -893 -882 771
1478 771 2 -349 1603 513 -1496 167 19 -1869 682 2093 -864 -56 1808 -1695 -2146 1666
1494 1666 74 -1540 2433 1624 -2645 -129 1465 -2424 -935 2933 -11 -1174 2121 -24 -3017
1509 -3017 188 1157 -1218 805 2300 -707 -1116 397 -1156 -1213 1277 1125 96 655 -151 -1289 -529
1526 -529 -122 -48 914 775 154 298 -690 -1339 147 292 -428 1211 1360 -986 -433 500 -1675 -1003 2034
1545 2034 649 -704 1429 180 -2458 -146 1003 -1147 491 2372 -542 -1253 783 -867 -1663
1560 -1663 1302 1024 -790 1013 968 -1727 -827 615 -833 -10 1928 270 -832 398 -551 -1525 327
1577 327 912 67 775 604 -996 -750 -47 -371 279 924 177 117 199 -817 -618 308 -144 164 1098 12
1597A2o16J028p95q47J770K78j303J097K68k193N46J661j434p5K104j123j506
1614a128J653k34j779J611J106j853L95J370j560m88J527p38p39J574j7j263O73
1631A10J86j059N59O66o53L14N00q95j12N16m66K50P70p39k82P98o00m76J038
1650D25k26p77J035P2j270O85P38j185K20J047r85k60J184p06p87J199l3r30Q67
1669C13J09j144O58O84j078K84R32j007k44J001o93m41J308k78j099Q65K12j070
1687f88O64O57j041J95R05q94l51R51l87m73Q55j62o77O63J08p60L66K96n03M17
1707A41L05p24J64M72o83O1P13n70j29Q84o24o79R82n5q90Q40L80j079M70O92
1727F71j164q6J165n63m45J016l88q66Q14J16r08O97N81q58J24M62p80L3Q45m71
$$ plain form
1597 12 -604 424 -371 -1218 552 830 -473 624 892 -1301 -755 906 -528 -603 1501 378 -1128
1614 -1128 525 291 -1488 123 1229 -624 -229 1141 -419 -907 620 -118 -857 717 700 -563 110
1631 110 296 -763 -204 462 -191 123 623 -272 -384 132 -334 -84 686 -53 -335 463 -137 -613 425
1650 425 199 -578 457 529 -741 -56 682 -503 -283 764 -221 -481 703 -3 -790 409 376 -554 313
1669 313 422 -722 -64 620 -458 -174 758 -249 -493 508 -185 -626 682 404 -695 170 382 -688
1687 -688 -24 633 -408 -213 692 -202 -553 398 11 -462 393 231 -446 217 325 -435 -69 227 -276 141
1707 141 446 -278 -114 358 -325 -264 449 -121 -250 634 10 -669 313 258 -632 208 588 -491 -21 671
1727 671 -493 -579 586 23 -422 594 206 -660 154 270 -638 59 640 -218 -94 368 -412 -379 466 -5
1747ek75P05l60n06O24j47n03P49J40p99L58L15o80K77N68o74k1P29n45l90O90
1768B50j56l77N78j09o09M89J96n31L60J89n97L25L51p24J85P48o87k11P65n43
1788a08m77J050j37r63Q03L64j084L61P76q92j4R77o95n92R48q1o80O56J20p36
1808d04L79L58o61J53N50m02p3K68m05oN16k64j03L76l82j99N30l06k83Q22j32
1829C32p98N30J66q31O17P11r93m4R48p96n35J076j32o90Q24K8j040M90N53p25
1849c09K21N90o73p1N88n88j67Q24k89m18O09l04n84P94Q3p44N50L14q36K59N14
1870C63p16K16P57p51l17Q09m64l61R66k79p73Q46N8j074O91O15r37L04P15j092
1890d24j33J143n98m64J062l83q11Q71m7r15R17M88j113K98N99j010J65J058p74
$$ plain form
1747 -5 -280 425 65 -441 183 36 -467 282 422 -377 -19 296 -384 -107 461 -213 -234 495 -50 -440 250
1768 250 94 -283 295 186 -423 66 262 -269 91 280 -317 8 359 -365 -180 568 -119 -330 435 -108
1788 -108 -585 465 328 -635 168 532 -552 -191 585 -307 -321 656 -39 -631 317 236 -444 212 332 -404
1808 -404 -25 333 -328 -175 375 -27 -100 168 -237 -243 273 9 -94 282 -100 -299 231 -75 -358 464 332
1829 332 -466 64 230 -601 16 727 -266 -310 638 -158 -693 383 251 -439 385 413 -627 -137 416 -309
1849 -309 -88 502 -171 -242 346 -242 -409 415 126 -292 317 13 -571 223 306 -438 112 426 -410 -151 363
1870 363 -353 -137 620 -131 -448 361 -103 -464 502 223 -550 296 354 -720 -29 586 -351 -47 668 -424
1890 -424 -557 586 -12 -476 586 203 -608 263 216 -699 218 706 -407 -109 490 -520 -355 703 -71
1909g1l26R78n42p02Q94p8n58Q12m8r28N82K47p74O45M57j068L99P43j258M9J389
1930H42r10n56J449p04j267J575K46j621J075R08j775K58J375j371k36J789q74
1947B03j141J473k25j303J294M54j437P11P74j437J42J150q36q7J009q50n28J029
1965C95m35m33J070l82p69R82l14j062J281L87j385Q06O38j734N11J517j488k32
1983f47J813j215j147J882l71j473J832L35k184J020J151j966N28J817j747m95
1999h67K022j239j296K153j15j699J541M05k066R26J243j703K81J585j371m89
2015f89J406r29o82J638l08j073J120j76j216J096L11j184R76N33j567M99R23
2032F78j397M85J433j632l68J808j193r25K197n97j851J964K20k376J617J539
$$ plain form
1909 -71 -397 581 39 -663 231 153 -405 407 359 -569 13 260 -514 131 588 -480 -81 662 -596 -547 842
1930 842 -68 -624 825 121 -1146 429 675 -946 129 1037 -738 -480 895 -476 -712 1077 203
1947 203 -938 535 310 -993 301 755 -682 29 803 -634 -492 658 -178 -265 744 -106 -634 395
1965 395 -40 -473 597 215 -554 428 114 -948 333 720 -665 141 779 -955 -444 1073 -415 -647
1983 -647 1166 -49 -1196 686 315 -1158 674 1009 -1175 -155 996 -970 -442 1375 -372 -867
1999 -867 1155 -84 -1380 773 658 -1041 500 905 -1161 -235 1008 -695 -414 1171 -200 -689
2015 -689 717 -212 -894 744 436 -637 483 307 -909 187 498 -686 290 823 -744 -245 678
2032 678 -719 -234 1199 -433 -801 1007 -186 -1111 1086 489 -1362 602 822 -1554 63 1602
2048A602k516L27J993k215n25K833j146j675K343l33k385J808R56k127J109J504
2064A553k264j71J807j362m66J987p62j088J516m92j419J296K93j055J170L11
2080H54j581O45N47j459P65J317j372J52J200j782m33K099r02r74K105o53k005
2097a477J916M33k331J525J473k593L63K260k100o11K653j486j849K707L0k294
2113a381J983P91k869Q61J851k115J72K438j603j249J866q17j325K041K43j599
2129g12J103L58j688O59P65j180P48J011j333Q6Q23j424Q4J520j061j48J790j297
2147A04j403J814m43j454K282M54k546J183J214k620N88K513k021o83K597j544
2163C5j874K747K0k507J910R87k674J030J963k358k78K286j536j068K352m73j605
$$ plain form
2048 1602 -914 -587 1406 -809 -1334 1499 353 -1322 1021 688 -1697 111 1067 -1060 49 1553
2064 1553 -711 -882 925 -437 -903 1084 322 -766 750 258 -1161 135 428 -627 543 854
2080 854 -727 -82 465 -994 -229 1088 -284 -132 1068 -714 -1147 952 50 -924 1181 528 -1477
2097 -1477 439 872 -1459 66 1539 -1054 -691 1569 -531 -1142 1511 25 -1824 883 913 -1381
2113 -1381 602 1393 -1476 -615 1236 -879 -707 1731 128 -1121 745 -72 -1397 644 887 -712
2129 -712 391 749 -939 -280 485 -695 53 1064 -269 -183 640 -784 -700 820 -241 -389 1401 104
2147 104 -1299 515 72 -1382 900 1354 -1192 -9 1205 -1415 -827 1686 -335 -1018 1579 35
2163 35 -1839 908 928 -1579 331 1318 -1356 -326 1637 -721 -999 1287 -249 -1317 1035 562 -1043
2180a043J660J8j935J182R72j410N87R02j464P6J030j051N0J260q91l18J122r95
2198b48o03J517n59r63J642j75j619J360L04j997J254J499k077J94J848j969p31
2215a323K531r90j566K415j19k558J627J160k344Q89J913k249m60K242j239j143
2231a214K160l60j696J503K82j780J091J021j577L06J060j313l6J334r01m17J250
2248G13o61p58J113l12p38J188r4j171R07K45j190Q85O78j436M64J088j490j06
2266f75J648j030p41J712o98j409J712K27j792J166R21j892M63J505j664k89J949
2283A113j065j102J808k87j588J429M49j716Q85J143j587n4J306r97l50J369n92
2300A64q31J023j97p95R15J61q44N72Q6r66O65O95q66K40M90j156R1J231o73l12
$$ plain form
2180 -1043 617 635 -1300 -118 854 -556 31 933 -531 -455 575 -476 -426 834 -57 -375 747 -248
2198 -248 -851 666 107 -856 786 611 -1008 352 656 -1341 -87 1412 -665 -471 1377 -592 -1323
2215 -1323 1208 218 -1348 1067 948 -1610 17 1177 -1167 -278 1635 -614 -1074 1168 -71 -1214
2231 -1214 946 586 -1110 393 675 -1105 -14 1007 -570 -264 796 -517 -553 781 -120 -537 713
2248 713 52 -706 407 95 -643 545 451 -720 187 432 -758 127 805 -631 -167 921 -569 -675
2266 -675 973 -57 -798 914 216 -1193 519 746 -1046 120 1041 -851 -388 1117 -547 -836 1113
2283 1113 48 -1054 754 467 -1121 308 757 -959 -74 1069 -518 -572 734 -263 -613 756 164
2300 164 -667 356 159 -636 279 440 -404 168 254 -712 -47 648 -218 22 512 -644 -553 678 5 -307
2320c07J124p73j001J173N2r22J189L59j641M00R57j175J82J358j048o22J394
2337F99n05j055J171R7j199Q86O69j181L59P35j273j51J251m35k49J023p05j056
2355i19Q86J77o74R09L72j116J51M58p73K72Q92o46l08O43l62k32P38m54o61P03
2375E6J08l82P77J9j100K24L19o74O58J067q37m86M69q12k75J403N0q16O47p4
2395C41j141N60O84q39K50Q69q08k79Q99m89p26O89Qm19Q89K88r80j00J46n14
2415f72M84Q36l45j57J54p86k45Q01O4r1N56m26p46N46J89n45M18L08o33K74N70
2436E54o26k03M72n02k15Q92M2l88L79l67q86N39O10k81L45K54r11k16N57k56
2456b07j4P74k34n81L53p9m17M75J72n36K67L76l92N0K03n73m3N89j24n5M39l50
$$ plain form
2320 -307 817 44 -957 216 268 -654 535 894 -747 -347 610 -565 -383 975 -73 -695 699
2337 699 194 -861 310 407 -792 94 763 -418 -59 676 -597 -748 503 68 -181 842 137 -919
2355 -919 -33 144 -530 379 751 -365 -214 244 -529 -257 635 -11 -319 324 -38 -270 468 14 -647 56
2375 56 164 -218 559 578 -522 -298 21 -653 5 1072 235 -251 218 -594 -869 534 584 -232 415 341
2395 341 -800 -240 444 -395 -145 724 -84 -363 536 47 -679 10 18 -401 488 776 -204 -304 -158 -672
2415 -672 -188 648 303 146 300 -486 -731 70 134 43 599 173 -573 -27 162 -383 35 343 -290 -16 554
2436 554 -72 -275 197 -305 -520 372 414 26 405 38 -848 -309 301 20 365 619 -292 -508 49 -207
2456 -207 -221 553 319 -262 91 12 -405 70 242 -294 -27 349 -43 7 210 -363 -406 183 59 4 443 93
2478I3m84K93k4j80O39J40o36O6J61m62K89N18m59j19N23l64l59N57p5m53M71
2499A35J32n34K88L75n62q6M05k54k4M87k34l53K91n2k50K87J08k01J57nl23J18
2521i5J88j50J27J05l15O2K17l05K5L79k23j40L10k70k49N25L4m39K65J37n03
2542c15K39L86m40PM46m28k68N70o6l37M24o2n71L65M16m57nL49l88j73N11l1
2564A72k84K34j1l78R8K92J5j5q1j83k6P1J79J94k24k43J88Kk06L45J98n07j4
2587a84L15l25M7O32l50o01M19J18l44N24K99q53q5N31l20l5P52k22o80K33Q2
2608d7k98N01M10n79k65K06j20J28M25j64l13L7p5J5L24N0j75n5k36o7M16J92
2630C10j89m2k22k56L93L12k20L7m9m49J28M96j54m8K93n35l91O77J95l46L33
$$ plain form
2478 93 -391 -98 -122 -302 337 477 -159 -93 68 -394 -105 413 -46 -165 358 -6 -365 192 117 -336 135
2499 135 267 -267 21 396 -166 -252 153 -101 -125 362 128 -225 66 14 -236 51 159 -42 115 110 -213 -95
2521 -95 93 -57 70 175 -140 -78 139 -166 -141 238 15 -125 185 -85 -334 191 225 -214 51 188 -315
2542 -315 -76 310 -130 -123 323 -105 -373 197 131 -206 218 156 -415 -50 366 -91 -96 253 -135 -308 203 172
2564 172 -112 122 111 -267 -169 123 138 123 42 -141 -167 -96 83 277 53 -190 -2 0 -206 139 337 -170 -184
2587 -184 131 -194 -147 485 135 -466 -47 71 -273 251 550 -303 -388 143 -177 -212 540 318 -362 -129 -47
2608 -47 -345 156 566 -13 -278 -72 -192 -64 361 197 -116 -79 -154 -139 185 235 60 5 -231 -298 118 310
2630 310 121 79 -143 -399 -6 306 86 123 74 -375 -247 249 95 47 340 -195 -586 91 286 -60 273
2651B73r1q24L35P77m12j28M79n96n01Q19K16m70L92O5r08J31P51j55p1K86n08
2672a40m49N28L01j27J31j23m10L1K26J17K29r0l77m4J5O1M78N2o07k7K47k77
2694b55K55N87n21m50M81j73l49Q04K07r12J00L74n59K99Q46o25n92N30j30l15
2714c98P62J28p95J61K26n06L41O93n06l65K98l19r2Q11mo29J36Pl59M62M21m47
2736B6q9J50l87M7N43p2j89N2l33o4M88M9j79J30l16k51N35R5l66L68lp59L22
2759b03O07m96N4N87p80m82J010M0o55O19M5j038M42P78o82j3P59p42n16Q96k6
2780B04n22O61K8r68L39O13m77N5M83n41k77N64r7k22L58q2l18J95j8q9L56j14
2802A31l88K96P0l49M09J73o72J65N15m92o8O20m26l67O29j70m84O95L9p71M54
$$ plain form
2651 273 182 -642 -307 470 58 -70 409 -187 -688 131 347 -123 269 334 -574 -443 308 153 82 368 -140
2672 -140 -589 -61 240 113 244 121 -289 -258 -32 85 314 224 -153 -197 -182 -121 357 409 -198 -225 22 -255
2694 -255 0 587 66 -384 97 -76 -425 379 586 -326 -226 148 -411 -112 734 109 -483 47 -83 -398
2714 -398 364 492 -303 -142 84 -422 -81 612 106 -259 39 -280 -372 439 435 -194 -58 -51 -410 52 473 26
2736 26 -63 87 -300 -253 290 218 29 81 -252 -316 172 221 42 172 -144 -395 140 235 -131 237 234 -525 -203
2759 -203 404 -92 -38 549 -231 -713 297 337 -318 301 346 -692 -250 528 -154 -167 592 -150 -666 230 204
2780 204 -318 343 371 -597 -258 355 -122 -67 416 -125 -402 162 65 -157 201 119 -199 -4 -22 -111 245 131
2802 131 -257 39 109 -240 169 342 -330 -165 350 -142 -210 410 -16 -383 246 76 -408 287 326 -445 9
2823IL29p51L50O80r05j94R92m83o31R90j9r64O63M37r62J86P95o52k06O99l64
2844al68N99j66m22N59M0n28L07J17m82L92L81n68l3L29l51L2M67k40j13K44m54
2866b59q8O51j73k48N88m65p95Q63M47q50M11N99j107j71J061m32m68R53k37r29
2886f49O67L53o88L74L07q62K43Q04n70j61N98o77m68J022R0o09N52J0j009K13
2906d60P06j86J26K58o39k45M05o9K00L50n94k29N94k34k15P35l03q81N26M01
2926B46m04N42L41j127k93O52j78L37Q62p26q30N32k64l96J250L23j155J93M10
2945C15r85K49J170o30o54P78n1m98O13j8q34K03L75j34N42K36q20k56J12l72
2965f59N78J021m47o27R4m84j94R79K91m75J27j72n48M56L31m67K28K29o91L40
$$ plain form
2823 9 338 -413 -63 617 -288 -482 510 27 -604 386 367 -597 66 503 -459 -273 522 -130 -336 363 -1
2844 -1 -369 230 64 -358 201 241 -287 20 137 -345 47 428 -140 -173 156 -195 -163 304 64 -49 195 -259
2866 -259 -347 304 131 -117 471 6 -789 74 521 -329 82 681 -426 -597 464 32 -436 517 280 -649
2886 -649 18 371 -317 57 364 -498 -255 549 -21 -182 416 -261 -729 293 383 -226 326 336 -673 -460
2906 -460 246 60 186 444 -195 -440 -35 -104 96 446 -148 -377 217 -17 -232 503 200 -681 -155 246
2926 246 -158 384 725 -402 -695 -43 -221 116 978 252 -578 -46 -310 -706 544 867 -288 -95 315
2945 315 -670 -421 749 119 -535 243 192 -306 307 289 -545 -342 33 -101 441 677 -143 -399 -287 -659
2965 -659 -81 940 493 -134 -40 -524 -718 261 552 77 204 32 -516 -60 271 -196 32 261 -430 -90
2985i0Q71o69n14M88m91l15J311L57r59K6o0r01M87J083k61n2K25r77l91Q81K6
3006G5j55O92l41q57O09L43p75K15M89o02J04Q19l52m47J96m05k29P42L18r9J72
3027E12o28p41N54M04j54N67J24j005m8N27m15R7P73m34m46N35j35l83N40j42
3047A02o93N99M38n31L05K74j027j09R26k75j37Q43l62r53M04K20m15N85M21p01
3067h6q5L17m25P5M83l78r6N53k95l06M74k06n10N11J94l87L71J82o87j0L54k47
3089b04K65M18n33j85M46m07j51P29k22n09O16j3p54M98M61p57Q6O32n19j52O62
3110D07l85m64O33j7m29M60J0n91L81K89n54K22M39n79j10N68l25j88N57k08m84
3131c68M04J18l18K96K3m47K56K33l64J87K51n05QM58l28l9N40l72m90M77M6k64
$$ plain form
2985 -90 781 112 -402 86 -405 -720 591 948 -11 15 -45 -946 -459 624 363 311 536 -441 -832 49 75
3006 75 -80 612 271 -586 23 366 -409 -194 295 -307 -203 616 264 -183 13 -392 -621 121 439 340 512
3027 512 -116 -857 -303 101 -53 514 638 -367 -415 112 -303 -206 567 133 -313 222 87 -296 244 102
3047 102 -591 8 446 -85 220 494 -533 -642 284 9 -128 715 353 -600 -196 24 -391 194 615 -86
3067 -86 -171 146 -279 -204 279 -99 -195 358 63 -243 231 25 -485 26 220 -167 204 386 -301 -311 43 -204
3089 -204 61 479 -54 -239 207 -200 -351 378 156 -353 263 250 -504 -6 455 -302 -216 416 -103 -255 407
3110 407 22 -442 191 174 -255 205 215 -376 5 294 -260 -38 401 -178 -288 280 -45 -233 324 116 -368
3131 -368 36 154 -164 132 155 -292 -36 197 -167 20 271 -234 -226 232 -96 -135 405 33 -457 20 66 -198
3153a98M93J1o55K30K47m18L11M45o19o5N36m87j99Q26k23p10N68J91o24M11M33
3174E04q15o3O34k64j10N33l13m56L08lj64M95P2m87O2kk67L90L44m37m6J93l47
3197b39J05M31k96j54L50l33j62O12j09m95L92n7n61N66N29o68j13M14n22r3Q10
3218D07j49m52L62j31m87M60K84l65K00O2o10K59N32m23k9L91n09k20P37p6m92
3239b49M20qn97L39M06l50J03K03n50l1N17j55m6K87m08k60M92k4k50M08p0n33
3261c56K65K21l07L12K22n99pM12l21Q2N44n31l90O43r0m85O39J69q22K26M91
3282C18n58O8O78m42m62M59j8k16M29l1m55J91N4k23L51J27m28J52J43m50J99
3303a14N38m43j86M14l20k14O49q3n56L74P0m91M11L53n82O6L96n41p5P18k15
$$ plain form
3153 -198 295 306 -349 -119 128 -290 21 466 -153 -218 318 -169 -368 458 235 -475 93 284 -340 71 504
3174 504 -311 -374 260 -4 -114 419 106 -350 -42 -45 -209 286 358 -129 -67 -69 -336 54 398 -39 -85 108 -239
3197 -239 -134 297 1 -153 197 -136 -298 314 205 -290 102 45 -516 50 579 -89 -202 212 -310 -403 407
3218 407 258 -194 168 37 -450 10 294 -71 129 191 -419 -160 372 -51 -80 311 -198 -418 319 243 -249
3239 -249 171 163 -434 -95 311 -39 64 267 -283 -314 203 48 2 289 -119 -379 113 89 -161 247 177 -356
3261 -356 -91 130 -177 135 357 -242 -249 163 -158 -76 468 -63 -453 190 100 -385 254 423 -399 -173 318
3282 318 -240 -172 506 64 -398 61 43 -173 256 225 -230 -39 15 -208 143 270 -158 -6 137 -313 -114
3303 -114 424 -19 -205 209 -111 -325 324 241 -315 59 129 -362 49 402 -180 -114 282 -259 -334 384 169
3324A69m13M03j64m29N07K43m45J46J35m24J57L16l07R6K99m63r5N02k33j89M92
3345C03k30n10N15K29n35K21K85m94K4M73l02j09L79k68k58L95n3j81L44j32m26
3366c30L41J85l74K67J74n46J32M18l91m2N37l82l62N27q7l87N61R1p16K39M10
3387B65m67P3N22m37k77M94j42l23M44P4m03J70P8k69K23J83k96N7J25k49J37
3408a8K28l37J6L45l10j36M42j84l10M36o3m22M11K03n16J36L08l99N2M44l67
3429d1k26M63j63l01M25Ql89K91R0m53K44L51m08kL31l77r5N13k02l05M11m5l92
3452b72K87J63l59J82K37l86rL24j99o8K67j80j57L06r4j87K35k5j84J96j2k42
3474a77K32Q2k90J72J45l41J48K76m19l2N25k94l07M80q0m61M12K19n34J57M12
$$ plain form
3324 169 -244 159 -5 -434 73 316 -129 17 152 -272 -115 201 -106 -10 289 -174 -269 233 0 -189 303
3345 303 73 -437 78 307 -228 -7 278 -216 -192 281 -21 -130 249 -19 -277 118 65 -116 228 96 -330
3366 -330 11 196 -178 89 263 -283 -151 267 -124 -166 371 -11 -373 154 67 -320 241 332 -384 -145 265
3387 265 -202 -129 393 -44 -321 173 31 -292 152 226 -177 -7 71 -198 25 208 -88 -31 94 -155 -18
3408 -18 210 -127 -111 234 -76 -212 230 46 -264 172 109 -313 98 301 -215 -79 229 -170 -118 326 -41
3429 -41 -267 196 33 -268 157 165 -224 67 157 -296 -52 299 -109 -111 220 -157 -252 261 59 -246 165 120 -272
3452 -272 15 178 -181 1 238 -148 -157 167 -32 -100 167 -13 -170 136 42 -145 90 65 -119 77 65 -177
3474 -177 55 137 -153 19 164 -177 -29 247 -172 -204 321 27 -280 200 120 -341 71 290 -244 -87 325
3495C25m48j10M15j91j59L58j05l17K67L1k57K37J02l07J55J76l60K2L20j74r2
3516a12K56j65j27K35r3j23J97l6j15K00p7k23K62P1l59J74K48l13K6L16l22j39
3538b19L81j17k42L45j1l00K51L3m18K76K93m14P5L72l96j73M71j91l64N05J46
3559C03m75J32J84l56N2L35j80k7J93j86j33J42r5L5K85j32j96K08q6k15K46P6
3581A10k38K11J07l30N6K02k61O9K98k99m9M14k51l33M20j5l89L82K10m99J01
3602h4L72m04j53M47j20j84L39j19l11K60J6k85K65J76l16J37J87m60j0M23j78
3623bj40L72r5l25J71K4k04K17J50j70O3k7k42J73J51k74J57K78l58p3L03k33
3645h4j57M40m0l63K77Q3l70J90K06l59J52L00l89m7M21k75k34M67j20m18M28
$$ plain form
3495 325 -123 -233 182 -9 -168 190 85 -232 35 66 -191 46 148 -159 -4 172 -188 -166 154 -20 -112
3516 -112 144 -21 -148 87 -6 -129 68 32 -83 117 40 -183 79 150 -209 -35 213 -100 -74 242 -80 -219
3538 -219 162 45 -197 148 137 -163 88 121 -297 -21 272 -142 -67 305 -91 -264 207 16 -348 157 303
3559 303 -172 -40 144 -212 -160 175 -5 -32 161 -25 -158 -16 -111 -76 209 77 -119 89 3 -212 34 110
3581 110 -128 83 190 -140 -84 118 -143 -74 224 -75 -124 290 39 -294 126 111 -278 104 314 -185 -84
3602 -84 288 -116 -269 178 58 -126 213 94 -217 43 59 -226 39 215 -101 36 223 -237 -247 176 -2
3623 -2 -142 230 135 -190 -19 5 -199 18 168 -2 61 34 -208 -35 116 -158 -1 277 -81 -154 149 -84
3645 -84 -241 199 159 -204 73 156 -214 -24 182 -177 -25 275 -114 -161 260 -15 -249 218 98 -320 108
3666A08J98m98Q5L35l38o7L42j45j34K51j04j74J52l6n4K30r6k32K59Pl09K01
3688a9J83l08J03K48l02q8L25j55j37K84r6j77K67p3l43L55J29l74J88K39m64
3709b15J8M70k76k24M51r2l98K80J14k94K21J83l48%K10k00M5K55k34r2K91j84
3731a9k19L38M1k71J63P1k75J18K01k05PJ12j45N5J60k46J0K68k21j20L65j29
3753E9l08L40M2m23K75K99l86m8K98k37p4L70j18k38K46o6k73K89J05k67J92J29
3775B06m47N0L98j89j18L25j84k74K71O3j97J49O9k15O6N9j15J69O3l01N0K04
3797A02j77N5K73k89k02L04m3j98K84N2l03J13P2k45J84K28l19J1K72k62n1L72
3819B33k41l43M18J31l57K51J84m73o9L12j14K8L76j63l36K1l5M3L38L2k14L7
$$ plain form
3666 108 306 -192 -107 228 -110 -177 165 20 -114 137 33 -141 11 -25 -79 151 55 -177 82 89 -220 -19
3688 -19 164 -144 -41 207 -95 -183 142 -13 -150 134 38 -139 128 55 -288 67 196 -178 10 249 -215
3709 -215 -197 273 -3 -227 224 132 -266 14 128 -166 55 238 -110 -110 100 -100 -55 200 -34 -126 165 -19
3731 -19 -238 100 141 -130 33 104 -171 -53 148 -57 -50 62 -83 -28 132 -114 -104 164 -57 -177 188 59
3753 59 -249 91 133 -290 -15 284 -102 -150 148 -89 -163 207 89 -149 97 31 -242 47 152 -115 77 206
3775 206 -241 -191 207 18 -100 225 41 -233 38 101 -96 53 122 -93 -27 32 -83 86 149 -152 -102 102
3797 102 -75 -20 253 -36 -238 66 23 -175 109 161 -142 -29 43 -202 -18 210 -109 -98 174 -88 -139 233
3819 233 -8 -351 67 198 -159 92 276 -197 -266 46 -68 -40 336 173 -163 -142 -177 -134 204 236 22 59
3841E9j25k20K56K14j98P3J32l31l9L22j14j38J68j06p9L22l0k77P5m3k05L15
3863C1K73k59m5J13l92n6M68L6j69J78j69l16K64J54j74R5O5k63J40K40k56n2
3885i4J81k70r9N03O0k83J07j24m38K54M98j01o6N3l68j60K92J14M9J38j69k52
3907a75R5L0QK11p3k61J02J75j00N6Rk92J9K97l7L1J44l15k57K47O0m1L66k6n22
3932b49NK74j55J28L00l14k53K86K3j38K20k0l01J05J55j03J63R0l63j12K42Q
3954iP5K63k44l42J17J32k8J95P6k49r2K4oJ59J22j57q7lq2J64K05k24j65J40
3978a6m1k3K69m2k97P7O2j43K15J86k80q9J10j40O0L81j78l09J63K1j68K89J69
4001B76l61q1K20j41j2L06o9k52M2K4k0J71N5j97m5NJ9J71O1k04m5N5q1J07J87
$$ plain form
3841 59 -66 -286 -30 184 -14 59 191 -140 -179 143 29 -109 59 -47 -126 196 166 -111 -36 -79 -284 31
3863 31 304 45 0 113 -279 -335 133 169 0 178 9 -307 -43 111 -63 32 97 -166 -26 214 -42 -94
3885 -94 87 -183 -282 221 281 -2 105 -19 -457 -203 295 194 128 181 -187 -347 -55 59 108 246 77 -175
3907 -175 -80 -50 -42 169 96 -165 -63 112 12 68 77 -215 -196 101 64 95 239 -76 -333 -86 -26 -67 299 273 -249
3932 -249 -244 30 -125 3 303 -11 -264 22 45 -93 127 107 -194 -89 66 -37 126 216 -147 -259 -17 -9
3954 -9 66 329 85 -257 -140 -8 -36 159 235 -14 -106 -82 -88 71 193 36 -51 -54 -136 28 233 9 -156 -16
3978 -16 -57 -80 189 147 -150 -73 -11 -154 61 247 -33 -122 -12 -152 -92 289 111 -198 -35 -14 -182 107 276
4001 276 -85 -166 54 -87 -99 207 138 -114 -72 -48 -68 103 158 -39 -84 -79 -60 111 172 -32 -77 -22 -103 4 191
4026A91j12j25J4j09O1K66l4j67K4j23p1L27N7k69M3P5k46J40L20k23j84J99j37
4049h3j51M00R3l47NM7k01J98L53k13k29J02j05m5L18O7k32k4oj07J48J67n8j07
4073a0j00m5J84J43r1m3r9k08K01L01j25q6Q2k70j40L89J54k19R6o7l86J73M28
4096B62j44j13J16k74j29M02R3k32P1n0k78J79K82j16qJ0l02KL30L8p3M8k65j50
4120c01L45J20j53J21p0l42J23K96p8OR0k90j33K86J11j0L0k22j68J79J22L6J35
4143B33j92k85J79Q0q2K68R5m98l8L32j54M2L94k96m69L63J63k71K65J86n19n4
4165b58M05j65j10L87j45m33K13J89j19J30Q8l03r1J86M9O9K6j68l3L7q0J82J86
4188B42k71r9J89j86m0M45p6m05J72J04k70K23L08l81j22K95j90j22L94n6l01
$$ plain form
4026 191 79 -46 -32 -141 -80 186 152 -15 9 -114 -185 142 199 -70 -27 48 -198 -58 262 39 -145 54 -83
4049 -83 -234 166 259 -88 -83 -36 -237 -39 314 101 -128 -26 -131 -176 142 209 -23 -47 -53 -160 -12 155 97 -10
4073 -10 -110 -155 29 172 81 38 -61 -269 -68 233 108 22 104 -166 -306 83 237 18 114 47 -339 -166 262
4096 262 118 5 121 -153 -282 120 213 -19 52 2 -276 -97 185 69 61 71 -231 -229 101 139 66 114 -151 -301
4120 -301 44 164 11 132 62 -280 -157 139 61 67 157 -133 -266 20 131 121 151 -71 -239 -60 62 98 233
4143 233 41 -244 -65 15 -67 201 296 -202 -240 92 -62 -20 374 78 -391 -28 135 -136 129 315 -204 -258
4165 -258 147 -18 -128 259 114 -319 -106 83 -36 94 182 -121 -212 -26 23 92 118 -50 -83 -46 -126 56 242
4188 242 -29 -128 61 -125 -165 280 204 -201 -29 75 -195 28 336 -45 -167 128 -62 -184 210 154 -147
4209a47J52J3k12K33J87k83RR6j94J20K34k48n5K28k22j00L66r2k66K78Ql90K39
4232d6L15l57m5K83k16j28L33k9k49J52M4j75Q1J02o7M7j9j26J02M3r1J33K0k61
4256a54J13K24k70JL27k46k14L90q4l49L79J63n17J21L67l59o9M60k13l44L65
4277I1N4l49J98K21k77l4J71j29k7J78o5p1M4q7O4J41j63k3J81j72r5K77m5k23
4301a40K06M5l30J58K79k51n6K00j95p8L16o0k19J79lk04J80J07j95Q7O4k27O6
4324g1K20j38k2J33k38n3L34o3k09K31o1l22K65K08l21R9K42l40j24L62l8k16
4346a22J99Nk55J06K09j44o1N5m4K4P5l7M0n8j49R1J41j06Q4J47l29j06L20l0
4370E5j60K55l2l75K10K21k72M1K39k55j13L45n5j94J76m6k86J91K73j49m8N4
$$ plain form
4209 -147 5 18 -194 39 226 -57 -48 48 -146 -26 208 -40 -95 133 -89 -189 177 85 -181 97 105 -285 -46
4232 -46 269 -88 -133 150 -66 -194 139 110 -139 13 57 -118 -37 65 -2 45 26 -100 2 45 -46 87 107 -154
4256 -154 -41 183 -87 -86 241 -5 -219 171 87 -262 117 280 -237 -116 251 -108 -177 283 70 -274 91
4277 91 145 -204 -6 215 -62 -96 75 -54 -81 97 32 -39 5 -82 -18 123 -40 -63 118 -54 -149 128 83 -140
4301 -140 66 111 -219 -61 218 -33 -89 111 -84 -162 154 94 -125 54 51 -153 27 134 -61 26 90 -137 -71
4324 -71 149 11 -11 122 -116 -169 165 102 -107 124 63 -259 6 214 -107 -8 234 -106 -230 132 94 -122
4346 -122 77 82 -173 -67 142 -2 -63 -8 -52 -28 47 10 50 -8 -157 -66 75 -31 53 200 -129 -235 85 55
4370 55 -105 150 118 -257 -47 174 -98 -57 182 -73 -186 159 104 -90 86 40 -246 -55 218 69 21 75
4392G5k36j7K39J6j3O3j65j04J24j4JJ96r8k07J29R3j36P2O3k54K6K74k9o5M1
4417G4j85j24J77J14L6J11j47k47L1Q5K4K41L5l17l1J50j24N8K25j98j60K63K2
4440A13j94J93Ll64Q7L04q7N7J55l27k89K28J75J0J72l8l26o5J11L6J08Q7j05
4463D4r0k9LJ29N0j74n0R4j4J45J36k24k62R6P5L0K88M1l43j19J7p4K26L10j46
4488A59k32J5r5j7L01K6k34N7N4j21J36J27k41r7J43l2N0K80j19l03k2J7K7K96
4512A75J44k67j75Ll9J11K23j7j50n4n8K1J33M1m7q1r6N3K12j2j36j7j01q6K71
4537E1J89j92p9K9k22%L59N3j76M2j12k11K07K45j27p5K3j37M0K23l7j24L1o9
4561f9m4J70R2j06k5p8j38J64J98n0o2p5j50N2K30J2q6J5j25j16J76J20o4K3n6
$$ plain form
4392 75 -161 -178 61 77 64 127 -38 -142 -18 -32 -31 165 67 -140 -11 82 -54 18 81 -173 -147 127 98 33 74
4417 74 -111 -235 -58 56 92 203 56 -191 -160 -75 -51 190 225 -92 -123 27 -97 -39 186 -12 -172 91 113
4440 113 -81 112 115 -249 -162 142 55 112 267 -60 -349 -121 54 64 236 198 -128 -193 -82 -46 62 149 44
4463 44 -46 -75 -72 57 107 -67 -117 -23 -37 108 244 20 -242 -146 -71 -41 247 288 -55 -174 -157 -231 -5 305 159
4488 159 -73 -58 -153 -170 131 157 -77 -20 34 -87 49 176 -65 -162 -19 -51 -1 279 160 -143 -165 -148 -121 175
4512 175 319 52 -123 -120 -159 -48 175 158 8 -46 -104 -83 50 91 44 -37 -133 -80 132 120 -16 -33 -134 -220 51
4537 51 240 48 -31 -2 -224 -224 135 188 12 54 -58 -269 -62 183 56 -19 4 -133 -93 130 93 -31 0 -69
4561 -69 -113 57 149 43 18 -60 -198 -34 164 114 52 -23 -173 -121 109 121 35 50 -75 -191 -15 105 41 64 8
4586Hj61L3J79K4j3l9j62KJ58K0lRj47m4J67J4p0J21p0k35J07K11r2K8Q0k33j35
4613b43K78P5j11J00k7k38N1K04q0j4J17j23r6J13M1nlo0n6Q9M5NL2j41j06J27
4639b6O7l5J20j3k43KJ51p0M7K06j78k06J57N5j04J24M6j98L1J38r3j8J10j03
4663c3q3J30J3m3J03o6j59P9O3qR6Oj89K3J01q7M2J25j22p3J34m4q2J45j2j61
4689a02Q1J04j06N4Q5j77m1J29moQ2q1r7O8k5k0J38rj16N2k3j10J27J17j76mJ54
4716I4j42m5J86j00j11J78J8j85R0R7j61L8J20j18j0J45r4j04J21Qp5R5j2j14
4740h1N8O4p8N5M5r6K1N8j16K4J37r2l2Q9p4n8J51l5j11J15L9j64M3J06j14K6
4766b0J48j35j04J38j4p8J21oj16N8L4j12P2R9r2k5L2r2N0J40r2m7P3o6o1J40
$$ plain form
4586 8 -153 -120 59 83 70 31 -131 -129 29 49 46 55 -92 -136 31 45 -25 96 26 -209 -102 109 17 45 125 -108 -243
4613 -243 35 110 -1 99 72 -166 -115 89 9 -5 112 -11 -107 6 47 42 39 -21 -77 12 57 62 94 -47 -153 -26
4639 -26 41 6 126 113 -130 -128 23 -47 0 206 28 -178 -21 34 -70 54 100 -98 -67 71 -22 -40 70 -33
4663 -33 -116 14 27 -16 87 21 -138 -59 4 -4 92 98 -91 -68 33 -54 -12 113 -9 -82 52 8 -74 71 59 -102
4689 -102 -21 83 -23 31 116 -61 -102 27 23 17 99 18 -79 -11 -36 -56 82 73 -43 9 -14 -124 3 120 -56 -60 94
4716 94 -48 -93 93 -7 -118 60 78 -107 -17 80 -81 -43 77 -41 -51 94 0 -104 17 25 -50 45 33 -81
4740 -81 -23 41 -37 18 63 -33 -12 46 -70 -46 91 -1 -33 56 -18 -76 75 40 -71 44 83 -81 -38 68 -46 -20
4766 -20 128 -7 -111 27 13 -65 56 50 -66 -8 26 -86 -14 85 -7 -32 0 -92 -42 98 6 -41 32 -34 -95 45
4792D5Oj20J06J7j45P3R6j06QJ03j16l3J76o8j37J16rp5J17L9j40kQ2j00L7J33
4818A03o7o1K8p3j8J48K3p9J2p2o6J42O6q2J2Jj20L3J40o5%P4j38r0J77N9j28
4845d1O6k3j29Q5J19p4k0N3q5nR1rk9M8p0o0J11K0k0K8p4r4J05J06q2J9Qj40n
4874a01J80l0m1R6j02j62J33J06m6L2J0j72j6J53K1l4K1p3o2N3M0L6L4o9p5L1
4900c7JK9J02m6j60N5Q3o1O0O6j66n4J50jn0J17k8j88O6J13m6L9P1j59j02J33
4926a3O5%M2p7j02L2N2N2N1n5q7J1j8%J51L2j86j2O7p3P4J51j19j62J16J6o1J07
4954E4M6j57k4Q9m9K2J14o6j10K6L8M1N6n6r4J0J0N1J04n0j19L0J0p1J44J14j74
4981a1n2N5q2J2K40l3k17N8M3r7J13J31j45r4R5l3k9J25K1j12n2J3K4Q0J7m6m2
$$ plain form
4792 45 51 -69 37 54 -91 -18 78 -28 -20 83 -33 -66 110 42 -95 21 12 -63 54 93 -47 -49 33 -67 -30 103
4818 103 36 -25 3 -70 -88 60 83 4 16 -56 -122 20 86 4 16 17 -103 -70 70 5 5 79 -59 -149 28 87 -41
4845 -41 25 2 -127 -42 77 3 -17 36 -49 -54 37 28 -1 47 -23 -83 28 48 28 56 -18 -112 -7 99 17 36 44 -96 -101
4874 -101 79 49 8 104 2 -160 -27 79 33 65 75 -97 -113 40 61 27 48 -25 -87 -34 6 42 76 7 -68 -37
4900 -37 -36 -7 95 49 -111 -56 27 -34 26 92 -74 -128 22 21 -29 88 60 -128 -62 51 5 44 115 -44 -146 -13
4926 -13 52 52 94 17 -85 -53 -1 51 102 47 -40 -29 -47 -47 104 136 -50 -62 5 -68 6 157 38 -124 -8 8 -53 54
4954 54 100 -57 -81 8 -41 -19 95 29 -81 -55 -17 24 80 24 -70 -60 -50 1 105 55 -64 -34 -24 -95 49 163 -11
4981 -11 -63 -8 -90 -78 162 129 -88 -30 13 -84 29 160 15 -79 16 -17 -46 79 100 -12 -64 -51 -27 53 70 24 -18
5008a8n6J0J33J0j04M4Jj27Q8J32j20m9J19j16p2K16K4j82J2N7j03R0J60j12j21
5033h4O6l1l5J43M7q6j8n2m3R0O8k4mn3q5R1J02q7pN4r8oJ39l1r6P1j0j15Q6J40
5063A32j11m0M1q5k3J49L5j00Kj6k7M8L2j5Om5m6O9K8m8N4k0j47P9J53q7l7Q7
5091F8j36q7K01N0j47Q4N4j96MJ79o0n0J20o3j47J26Q8j03J0L8n9jP4nn9lJJ7
5119bL3j8M0jj15qJ05qk8Q8p9j22J14O8r2L1Q1j54qJ30n8n8J27l1j40P5P0o5N0
5148B5J3q4l7J12nk8K8l0l9O1j6k2O5j4p8N2J1n7P3M6j30J5R7o1l0R7l7j03J06
5177C0J9q4L3O6q8k3P3l3QL9l3o3O0LoL9m9j9N1l8k5Q5k9n7N9Qj10M8J20j04l9
5208e9J09o0q1J26jj37J20P0j42JJ08o6m0J05l3q2O7L9q3K6L4k7J5Nk4L7Lk7O
$$ plain form
5008 -18 -74 -64 69 79 -25 19 20 -107 -19 113 -7 -56 63 -53 -125 91 115 -67 -55 2 -101 -11 149 37 -84
5033 -84 -18 -49 -84 59 106 20 2 -50 -93 -3 65 41 37 -16 -101 -10 92 5 -2 52 -46 -52 87 56 -40 31 21 -94 -8 132
5063 132 21 -19 22 -63 -86 63 98 -2 0 -16 -43 5 37 22 28 -17 -63 6 34 -14 40 20 -127 -48 105 18 -19 68
5091 68 -68 -155 46 96 -51 33 87 -109 -105 74 14 -36 84 21 -126 0 88 -15 -5 33 -26 -27 47 42 -17 -20 -19 -2
5119 -2 31 13 53 52 -63 -71 34 26 -2 86 7 -115 -1 67 -25 6 87 -67 -75 55 -3 -61 66 35 -105 -30 40 -25 25
5148 25 38 -46 -83 29 24 -4 24 -6 -45 16 0 -22 43 29 -49 3 14 -43 30 76 -54 -39 58 -3 -33 64 27 -76 30
5177 30 49 -35 -2 64 -24 -47 26 -7 1 40 7 -56 4 7 1 40 -9 -28 23 -15 -40 45 16 -41 18 26 -84 -36 84 -20 -59
5208 -59 50 -10 -91 35 34 -103 17 87 -55 -54 54 -12 -52 53 20 -62 5 44 -39 -13 21 -6 9 14 -10 27 30 3 9
5237IK5o8L7O2q4k5R5m5n5J04j5j09P1O1j22M0R7q0n7R4m7n0J10kr0K8L0n0K6
5266a0M2n5J6K3m9J7L7n0J5M2p3kJ26n8j00J06k3j09J40Q0j67K6J11j33o5J88
5292G5j0j12R5Kj38N9R7p6k0P3k9l2M8l4j8MRK9L3o5J3M0j05k4J33on8Q6m1j68
5322a40J00J11j32L5J50j28r9J47m5j26J66M3j66O6J13j34l1Q9n8l9J46j1p9M3
5346B1l1n3N9PlO0Lj00J5L9o7N9P7r9J2P6p0p4P8nl5Q3Ko5K4j5p2N7M2k6N5K5
5378G9j46j1J11r6K2J37q7r7J50n3j43J33Q2j52O3J20j73j7J66j19j02K04J6j54
5402f7P4M8j44K8J35o4o2Q9Mp4jM5Rk6J5L7l4m8N9L1j18J1J56q0q5J46k5j92J35
5431BJ11j93L6J86j58j03J81l2j41J69K5j95P7J36j45k2J44r9o1J33k2r6Q2K2
$$ plain form
5237 9 34 -34 3 65 -19 -44 51 6 -49 55 40 -69 2 63 -59 -19 78 -2 -59 35 -12 -62 48 46 -44 -16 14 -36 -10
5266 -10 32 -23 -7 16 -33 -16 21 -29 -14 28 -45 -47 79 21 -79 27 4 -105 35 115 -52 -26 85 -48 -113 75
5292 75 65 -47 48 50 -88 -29 68 -8 -28 45 16 -16 32 -2 -20 -16 -7 22 55 -10 3 43 -62 -86 47 41 -17 69 28 -140
5322 -140 -40 71 -61 -26 124 -4 -103 44 -1 -127 39 82 -84 -18 95 -39 -70 19 -39 -78 68 57 -22 21
5346 21 -10 -63 -4 3 0 60 63 -37 -22 17 -50 9 86 -13 -1 75 5 -69 9 4 -31 52 54 -11 13 -2 -74 -17 25 -1 54 79
5378 79 -67 -78 33 -63 -41 96 9 -88 62 9 -134 -1 81 -71 -8 112 -61 -78 88 -31 -133 71 87 -67
5402 -67 7 55 -89 -61 74 10 -52 37 41 -33 -34 11 20 -6 9 46 12 -36 23 54 -64 -53 103 23 -62 84 59 -133 2
5431 2 113 -80 -44 142 -16 -119 62 30 -111 58 83 -112 -35 101 -44 -66 78 -21 -82 51 29 -67 15 37
5455C7r3J8O7n0K9Qm3lK5OK2J0p9K4M8m9J7O0n1k5M9n8k2J32m2p3N9lj00J25L5
5486H0j44N9J03j48%J53j15q5J78m0j61J64O5k03L1J35j32j0J94r2j44J30Oj25
5510a01Q7Q7j10kO7o4k5P9J7n2%J1K2k1j3N7k9p6R0N7j10OJ18j02j11J78oj20
5538f6J23M3k21N4J83j32n4J86j01j35J57K0j66J28R2j80J0J39r8m2J34o8r2J28
5562D2J3j02M5K6p6K7M8l9QK1l2k5L5j9L4M1o7j8M8n0L6M7n5k5R7o7m7J04lj03
5592e6P6L6j39R2J05j40k5J18r2o4J80k2j62J36M1j69N0J36j17k1J25j02r0J58
5616E4Nj16O0M7j08M3P2p6j6N3k1l6M7Qj8Jj2nJ6mJ5J4o2nR5n5m1R2k1r4Q3K4
5648C9j00P0P5j23k5J32o0n9J31l7j39J14O8j45M9J16j37l2J20m6p0J21mj40P5
$$ plain form
5455 37 -56 -38 29 -21 8 16 -27 -30 -5 1 23 33 -46 -22 26 -23 -6 54 3 -22 27 -31 -53 79 37 -36 23 20 -80 45 80
5486 80 -64 -5 98 -50 -50 103 -12 -97 81 41 -120 44 109 -94 -63 72 -60 -70 124 32 -112 18 24 -101
5510 -101 -14 73 -37 -39 28 -36 -61 18 35 -17 -17 -6 16 -5 -18 39 10 -66 24 81 -29 -23 95 -7 -118 60 54 -66
5538 -66 57 100 -121 -67 116 -16 -70 116 15 -120 37 57 -109 19 111 -69 -59 80 -18 -60 74 6 -86 42
5562 42 55 -47 -2 24 -52 -25 23 -16 -8 13 -19 -44 -9 -28 6 47 -20 -38 10 -40 -4 43 -12 -37 60 -7 -54 50 47 -56
5592 -56 20 56 -83 9 114 -26 -51 67 -25 -89 91 69 -93 43 84 -85 -35 101 -16 -37 88 -14 -104 54
5616 54 59 -57 3 50 -58 -15 57 -19 -35 18 -3 -39 8 16 -2 -1 -13 -18 -2 -6 9 23 -39 -44 51 -4 -45 47 26 -68 15 39
5648 39 -61 9 84 -39 -64 68 8 -51 80 43 -96 18 86 -59 -10 106 -31 -63 57 11 -59 62 58 -82 -7
5673gN8q3K0O4o0k9P1l7l9N2Qk0Llk3K8J3j9qJKL7k2m5N2%n8O2Qp5M3O6r2rJ12
5708G1o3n7P7j4q7J13M3j43M2Q9j01mJ13p7m9R2j4j00Q5M3q9K8N7q7LR4n8n3Q4
5737C8j5n0K8K1n7L6L2l8j4QmQJ1k7J7J2j9J0Ql8L2L8o0j0N9l2l1P6k5n0O5J3
5769D2r8N1P6r3rR0n9o1J28k6j07P6M3r1L3N9p1rJ00n7o6N6J8p2M0N3o0J5L6n1
5799a4k2N3Lj9Rj6k1K3rJJ3pj0K4k1l1O5j6l1L3Nn6M5K6o1J4N5m5j0L3pm0O1p
5833B0m6L6M2p7L5J6n5J1N7m6l3Q2k5n1N9J6q7P0L1p9K6M6o9k4P4l8k2R5j9j04
5863e9L6K6m2L7M3l4k7K6k3k5J9L5Oj8j9oL8k8rL9k3j9Q2m2q9P9K1q1N9N9p0j1
5895b0Q1p7q0J36J8p6M1K5r2L3M5n7pP8k2n1M0j4l4L9jk3N1J7m3pj6l6L7N4n1
$$ plain form
5673 -7 51 -32 -12 52 -8 -37 34 -3 -42 10 18 -2 1 -2 -25 3 16 -3 -11 -10 -8 29 7 -38 14 14 -44 18 26 -49 -6 60 -32 -41 71
5708 71 8 -49 28 14 -73 40 83 -60 -18 71 -30 -34 79 2 -47 45 31 -69 16 59 -30 -2 55 -32 -29 65 7 -46 38
5737 38 23 -27 1 22 -35 1 33 -5 -19 -11 -15 -7 4 -23 -6 6 -13 -3 5 -33 -1 37 -23 -33 26 -6 -37 39 14 -36 29 42
5769 42 -56 -5 71 -22 -31 59 0 -61 67 41 -66 10 53 -38 -5 54 -17 -26 74 17 -49 7 25 -47 -7 46 -14 1 37 -14
5799 -14 -36 17 20 1 10 -6 -27 -4 -13 -12 1 -6 -16 8 -13 -44 21 5 -26 7 12 -44 1 27 -34 -20 35 -10 -20 13 6 -34 27 20
5833 20 -26 10 52 -25 10 26 -29 -18 39 -7 -40 42 17 -34 25 41 -46 24 55 -24 2 48 -21 -45 29 -9 -31 64 45 -59
5863 -59 -23 3 -39 -2 41 7 -20 6 -17 -42 -23 12 18 0 -19 -25 13 -15 -24 15 -8 -27 55 13 -76 3 24 -57 2 61 -9 -20
5895 -20 61 -16 -96 40 58 -18 23 48 -44 -11 34 -23 -30 48 26 -25 15 1 -33 6 5 -18 33 50 7 0 -16 -52 -15 39 -12
5926a2QL0l8n3O0lk9R3j3q3J9J3l4J2N9l7pM8m6k3PKQN1k6pL7m7m5N5Ok6P4J3
5960F6j18J8O5p0OJ12o6o4R8j5j00N5O4q6J9Q7o4l4O5l8n5N6L5l5J5Jm3J4rmM0
5991A5oj1J6l2m0M0N1n5%P1o5k5Q4m4q8J13L4j01L6O8q4k4P2k6l4R2j2o7K2Ok9
6022b3M5npJ5ql5K4Rl2M3K3q1PO5m1l3P1k7q0J01Mr3L6Q9r6j6P2m7k0P9j5o5M6
6055EL0o1LK3JJOk7J2J7l4K9J3n4K4O5o6k7P9n3n4R2Lq2O1O3j15j1J01m1k2O7
6087D8l1p1O6J9n6J6J8oLJ7j7QKm9J9L2l0L7L8q9m9Q3jm7R5j4j01M6M5r6L8J16
6119H9r3n1P3k7m6Q2K7j06K1N4k2rL0m5NRJ0K2Ol3J2mn6L2R1m5m9N5m9n0Q6M9
6151F8r9K7N7q0k5J07k0o4M8pp6P3P4r3k2K5l1J3O9j9k9ml0MK8J4J9Qo8l5P2J0
$$ plain form
5926 -12 -4 26 -12 -65 -5 -8 -37 56 43 -40 -21 -8 -42 -30 29 -8 -15 33 -13 -36 -29 -27 -19 32 6 -1 36 -11 -56 -1 5 -21 53 66
5960 66 -52 -34 31 -39 -33 79 13 -51 47 32 -68 -13 51 -35 -16 71 7 -27 38 0 -55 1 36 1 16 17 -26 -12 -21 -25 15
5991 15 9 -2 14 -18 -58 -18 33 -22 -22 49 -16 -41 43 -1 -89 24 58 -43 -7 61 -23 -47 25 -1 -35 57 45 -22 0 6 -23
6022 -23 22 17 10 25 17 -18 6 15 -17 26 49 -32 -25 40 -1 -34 37 10 -70 31 35 -58 -22 67 -29 -45 27 -20 -40 39 24 -41 5
6055 5 35 -26 -23 0 1 2 8 -19 -7 10 -24 5 18 -36 -12 53 -13 -40 39 -14 -68 24 27 -55 6 69 -46 -57 44 3 -19 48
6087 48 17 -54 12 31 -25 -9 9 3 6 23 6 14 16 -33 -14 18 -12 25 63 -26 -75 8 7 -40 55 41 -60 -14 31 -65 -27 89
6119 89 -4 -55 18 -9 -55 27 54 -52 -31 23 1 -8 22 -23 -18 -9 1 23 29 -4 8 4 -52 -20 71 26 -23 32 -17 -67 19 68
6151 68 -31 -4 53 -27 -52 55 35 -29 19 12 -64 9 83 -10 -32 -7 -38 -25 44 25 -4 -8 -38 -34 -6 8 27 35 -33 -68 4 14
6183A4k1M6k0q8N3O9o8oN8m8n7P7J8m5N2k4n5J3N0LQj8m3KK8J3J8Qo6JN2o5L5
6216fQ8n1r4N2J8l6O7L7j14j4P5l4k5R3l4q1L2L8m8L5N6p0l7J5L0KK8j1k9k8K3
6247b3L8J5l3J6mo8K6Q2m1l3M1j5p5P6O0p6KM2o3j2P8qn4L4J6o7M1M1k2j4Lm1
6279c8OO6qk6Nl4lM9j6j2L5k5m3J7K0JK7j1m9OL7qrK1k1k3K9J0l5L3Lk2J0oLK9
6315A8j8j1J1jj3L0J5o7J6O3n0l5P9j1o7N9K2q0K4O9n5m1P2j0n4M2J9p9M8M8n7
6346a4j8L8Mj8MOj3rL3j0nrK1j5m1L8K5k9mJ8l2j6O6K8p7J5K7m7J3P3m1m1L9j7
6380hn1N5O8n6l0J1j9NO2J0m3loj9L1J0lpk1j7RM8Jrj8m2J4M0J6k7%k1l7L4M5
6415B2rJj3n1%N0K8j5Lm2l0M3L9J8j0n2m5L9K2K1J8j2q0NM7jL6L6o8p7M8L6%N3
$$ plain form
6183 14 -7 39 19 -69 -16 53 -15 -21 37 -11 -68 9 27 -18 34 10 -45 -32 18 21 29 11 -32 -30 -2 11 29 37 -29 -28 24 -41 -6
6216 -6 82 31 -63 -11 7 -29 38 75 -39 -53 22 -12 -37 56 22 -59 -27 11 -37 -2 54 -16 -53 -38 -8 -6 22 11 -18 -46 -23
6247 -23 15 30 -3 13 9 -59 -33 49 8 -25 16 1 -74 2 62 -14 -12 30 -33 -45 33 25 -29 5 21 -46 -5 36 14 0 3 -38
6279 -38 -32 34 26 0 5 -29 -32 17 1 -11 24 -1 -44 -27 -7 -6 21 10 -39 -33 4 -4 -13 8 -13 -36 -7 3 -32 1 4 -18 -8 -14 -11 18
6315 18 0 -11 0 -1 -14 16 31 -36 -20 43 -7 -42 37 26 -41 18 40 -40 -16 53 -2 -43 29 19 -35 7 26 -53 -5 43 -14
6346 -14 -32 6 10 -8 -4 2 -11 -20 13 3 -2 -11 10 -5 -46 -8 17 -12 -16 2 -30 -46 20 48 -29 -14 13 -34 -21 52 11 -30 9 -8
6380 -8 -59 -4 64 8 -22 -11 -30 -25 37 47 4 1 -5 -24 7 17 14 7 -14 -31 -22 26 27 18 0 -42 -28 12 28 1 1 -20 -57 -23 22
6415 22 13 14 1 -50 -50 0 28 13 16 -26 -56 -13 26 44 34 -18 -63 -24 -2 19 37 25 -55 -50 -3 -4 32 68 0 -77 -29 7 7 60
6449F0qj00rO0QKM0l2q0K6L6J0L5Jp8l3M4L0K2kk1m1j4J9M8J2j9k8j5k6K8Q3k1
6482C7n7j8Rj6P1M3o3n0K2pLR5jq2j4jk5M9R0o0o2J2j7K0P6Jn4rk5j0N9L9k8j7
6516A0k7m5N4O4k9j6j1n6J3R7j8m0K0l5n8P3M4l4J1Nq5J2R1l1j2K2o2k6P2K2k3
6547BJ2j7m5L9L2l6L9Np9%O3knM4o2p2Q3K8m6N6Rr8K5M3k7K0N1o5k4L0qNM0j3
6581B7o4L2Nk3L3J6n8L0K4o2K7N3n0j4L8l5j9P5j6p5O0J7o4L4M5p3JO3m8j3O9
6612C5l0l7N0rn0O8No3K6L6o7K9L4m8J4M5m0k7M7k0j3N9k6m9K9J6m7N2K3p1J9
6643a0L3o2J1O7k9l3L5k4k0P3j3m8L9j8o6M8M7n5M5K2j03nQ9pk3M6n1n5P2L3o5
6674b7M0J2p2RO4l4J2L4o3k9N4J6pK7k6n4L1K8mK7rn7KJ0mN8K5p4k8K0lK6P0m1
$$ plain form
6449 60 52 -48 -57 3 11 13 53 21 -59 -33 3 13 48 49 -29 -62 -18 12 34 32 11 -30 -44 -25 23 35 16 -12 -27 -53 -25 58 37
6482 37 -20 -38 -29 -45 26 69 6 -44 -22 -29 -26 69 68 -14 -28 -29 -54 -5 85 25 -37 -25 -42 -22 54 55 1 -8 -33 -43 16 55 27 10
6516 10 -17 -62 -8 56 27 11 0 -56 -43 54 36 -4 16 -19 -77 -4 40 6 17 22 -63 -51 40 9 -3 19 -43 -69 3 25 2
6547 2 14 -3 -48 -9 23 -13 26 31 -48 -48 15 13 8 52 -10 -82 1 29 -17 39 48 -50 -25 18 -9 11 62 -3 -27 3 -5 0 40 27
6581 27 -37 -5 0 -23 10 26 -32 -2 22 -40 -13 40 -10 -24 14 -21 -40 35 19 -56 4 21 -43 -9 36 -37 -36 27 -21 -34 35
6612 35 5 -32 18 9 -41 27 32 -31 -5 31 -36 -7 27 -21 -7 38 -2 -29 18 -2 -15 44 18 -31 -2 14 -33 19 42 -29 -10
6643 -10 23 -39 -28 39 10 -23 12 -12 -32 41 28 -20 19 1 -65 -17 30 -25 20 42 -61 -66 23 16 -7 39 -12 -67 5 38 -27
6674 -27 13 25 -47 -38 26 -8 4 38 -25 -54 0 16 9 36 10 -44 -13 15 11 38 29 -28 -26 -16 -20 38 63 -11 -39 -19 -22 4 74 33
6708C3q3L1Qk4Q4J9q5nJ5n3N3Q7n3n3Pj8k6J12J6q9MQn0M1Q7m3m3Lj1qP0J3l3
6741A4k0l7lO6K7k4j1m0k7O4K6q%j5n7J9O9j4Qjr0k8R6K8j6L3o4q6M8O8j1L0J5
6774E9j04k8N7K5NM8m8p7NO2oL9j0n7j5L9RK4J8n5m4K5MM5L7l3o6oOM5M9jo2k5
6808c6Oj5O3M3m9k5Lj3J1Q5m3m6Mk1KR3J0q3j6J0m8N6Q7l3n1Lm4k6R9N2p1j6j9
6841b8m2M3O0kl3j6lmJ9L3kqm5lL5J3J9j3n4k2O5J1Ljj1p0M1N1k5j2N4o4m5N5
6875aK3l1L7Qr3M3N4k3j5J7l8j9L4M0m0K9k4n1K9K5j0K5On9QL1rOK7m0k2J8J3
6908bk2L1Jl2J8Rk9K9Qm0J7L0k2JNl3J3N3k5j4K4k5l4O8%l0K4J7r0K0P5l0j8M1
6942C8m2n0N6M7p5L1K0n0RM7rn0M3k1j2K8Pkj3j0j4J0L4kjk9k8J9M8l6K8j6l9
$$ plain form
6708 33 -50 -19 -11 -35 49 68 -17 -22 -7 -60 -7 80 27 -26 -19 -37 -63 49 65 -24 -20 -12 -62 -21 66 23 -20 -17 -28 -36 34 47 14
6741 14 -6 -43 -46 20 47 23 12 -28 -55 9 35 27 27 12 -45 -26 43 29 37 36 -54 -82 14 42 26 59 -5 -91 -43 25 14 44 59
6774 59 -45 -73 -16 9 14 62 14 -63 -58 4 -2 37 27 -30 -45 -6 3 27 45 -10 -54 -29 -25 20 57 24 -42 -48 -42 3 52 51 -11 -36
6808 -36 -30 -45 18 61 12 -13 -10 -23 -12 73 30 -16 -12 -33 -31 62 72 -11 -27 -17 -65 -9 78 45 -6 -3 -47 -73 26 78 7 -9 -28
6841 -28 -70 -27 33 31 -2 -18 -21 -25 -6 27 25 17 -28 -31 4 17 36 23 -31 -53 12 23 26 25 14 -56 -15 36 11 -1 53 -11 -56 -1
6875 -1 22 -9 28 36 -57 -14 40 17 2 19 -19 -38 -4 36 -4 25 1 -50 -21 4 -6 19 25 -34 -26 5 -4 2 29 -11 -33 -15 -2
6908 -2 -24 7 8 -24 -6 3 -26 3 11 -29 -12 18 -4 -3 2 -31 -18 35 10 -4 20 -5 -39 29 29 -1 23 40 -50 -30 45 15 -3 38
6942 38 -4 -54 2 49 -26 5 25 -25 -16 31 22 -28 15 -6 -18 10 17 15 2 -8 -22 -12 22 20 19 -10 -38 -19 29 -7 21 5 -34
6975c4PN0j6J2L2p0n2P3L3j0K4k3q2pR2mKL0n2o5M6J6K6K2j1q5RL7oK4L8q5qL0
7009gJ9QNj2m7KK9QK6K3q0k8K5K3M9Qn2n6J2K9L0K0ln4j4PK2N0pk4m5k0J5P7L5
7044G3n6n0Nj7K6R6k4o1Jj0l6N4Q3o2m1K3m8LR2Rp3MOk9M3M4m0l5Pj0KM8jk3l5
7079c2kjN1K8l0k5l3PN4J4lj9l3l7M0M9moln8l9P8L2k6Rj4n4K3N6J4k6Rl2k3L2
7114dJ5kJ5j3n2K3L4NQj5n0kM5JpJ8k6k7L5J5j8K0Jm6pM8mj5J7k4k3K0L6k4Rj6
7150a0lj6RK6J3nj1pj6OL6J2m8oL0j5qN2k2m4L5Qm1K7M6m3j5K4mk9L9Km2PL6l1
7186h%K1lk2K0jk1J8Mppj5J6J4k5NK1j1j2RRl1J9K7k0k0J9RroJ5k4J0K1k7J1L
7223BOk1NKRQj7jMj1J5K5j7k1K2Rm5K7K3m0J4L7n5j2M9Rl5J6J5m4JM6k7rK1qk9
$$ plain form
6975 -34 -27 23 7 19 51 -19 -71 2 35 25 49 26 -56 -63 29 25 27 57 5 -60 -14 2 28 50 39 -46 -37 0 -6 18 56 -29 -37 -7
7009 -7 12 20 25 13 -34 -32 -3 5 31 54 -26 -54 -29 -6 43 51 -1 -57 -45 -16 14 34 31 -23 -37 -30 -8 42 35 11 -34 -54 -39 38 73
7044 73 17 -33 -28 -45 -19 77 53 -8 -7 -17 -53 1 84 22 -19 4 -44 -41 51 60 -13 -9 -3 -32 11 55 15 -20 -13 -23 -21 27 26 3 -32
7079 -32 -34 -35 16 44 14 -11 -44 -37 17 31 28 9 -24 -61 -21 28 24 18 15 -43 -82 -4 28 2 11 -3 -57 -34 22 36 10 19 -13 -36 -4
7114 -4 11 9 24 11 -41 -18 16 21 29 14 -36 -38 7 8 1 19 -7 -34 1 16 -2 18 19 -27 -34 14 10 -5 12 -12 -35 -15 21 -3 6 -10
7150 -10 -13 -29 -20 6 19 14 3 -4 -20 -14 22 34 -14 -20 10 -5 -13 39 17 -27 8 16 -25 2 48 5 -10 14 10 -19 20 22 -20 -13 23 -8
7186 -8 -8 13 10 -12 8 7 -14 4 8 1 -6 -21 -5 9 -16 -11 10 -1 -13 -4 5 -26 -7 20 0 -20 -1 8 -1 -7 8 -16 -6 15 -12 -1 2
7223 2 8 -13 -8 -6 3 11 -6 -7 -3 -14 1 26 9 -12 10 19 -26 1 24 -16 -2 35 -20 -32 17 26 -9 7 22 -22 -21 25 -2 -11 10 2 -27
7260b7J0K9j2KLnj0LK0ql5J8K6l2j5L9J1k8RK0m1K0M4l9k7K9J0m0M3J0m6JL8k9
7294iqL4%l6J6kj6K7J7k0j5Jj6K4L4l3OJ4m2J3K8Jj2J8m1k6L5L4k9J4j3k4kM3
7328A5j2j1J8j3k9K0PJ3J5m5jK0lmL2k6l5L7J3k7L0K2n6j8O2k9KN5k8o1J2M3k5
7361gJ4M2n7k3L1Oj0J7Ll3nPM0J9k8k8J0l1J7O0j6m4Prk8N0M0k6k7K2l4j0O3J1
7395D3m6Jqk5L2L9l0j1nj8L0K2j7j0ok2J1M5Rl2jj7k8M0N6l3j8J3m0NM2Lk6J1
7429Irk6J2L2Kqk2l4L2K6mQk2m5J8M6pNJ5l9l7M5Rj6L5Rp5OM7pk3L4k6k1L6J7
7465B2j6qLk4J4J8J2%ol1kOJ6L1on6PK6k4J8M5l8l9M0Mk4K9K2m7k0L6q%L3l0k6
7501b3PK0rK1ll5J2MLNJ4m0PJ1qJ6J7k2k0J4J6j0L5k0k0oJ3MKJ6k2j2Qj2K7J7
$$ plain form
7260 -27 -17 12 0 2 5 0 -10 -7 13 5 -30 -12 14 -18 -33 6 17 -11 -2 18 -23 -3 41 2 -25 4 14 -26 17 27 -19 -18 20 -9
7294 -9 -17 17 17 -19 -3 -5 -21 6 23 3 -12 -11 -27 -3 31 -2 4 18 -24 -11 17 18 6 24 -17 -43 -8 26 -3 11 -2 -26 -28 15
7328 15 3 -8 10 -3 -32 -12 -5 8 23 -22 -23 -3 -6 -10 22 -4 -39 -2 11 -16 14 36 -20 -38 24 -5 -3 52 24 -37 -25 18 -7
7361 -7 7 49 -8 -31 0 6 -4 13 16 -17 -22 -15 25 44 16 -12 -2 -33 -16 44 28 -16 -9 -18 -46 4 44 18 -9 13 -21 -31 32 43
7395 43 -3 -2 -10 -35 -3 36 6 -5 -10 -28 2 24 7 -3 -9 -31 -20 25 34 2 1 -16 -44 -4 52 19 1 14 -26 -21 21 24 -2 9
7429 9 0 -26 -14 18 20 12 -10 -44 -12 14 10 18 -4 -49 -31 15 8 13 28 -11 -48 -3 6 -10 25 34 -41 -35 12 5 -18 16 -10 -31 5 22
7465 22 6 -2 1 -23 -9 9 21 21 15 -16 -18 -12 4 35 29 -27 -20 6 -18 0 45 7 -32 8 12 -12 17 39 -8 -28 8 0 0 33 3 -23
7501 -23 -16 4 -5 16 13 -22 -10 -6 -3 2 16 -24 -17 -6 -14 2 19 -3 -23 -9 7 -3 32 12 -8 -14 -1 3 5 21 -1 -13 -5 -17 10 27
7537B7l1j2J1NKL5l6j1J1lk0L5K2m1RK7m8RL9pl1NJ4l0K5J3l0qK5%qQj3j1lJ6
7573eJ1lLlj2k7K5K5mk2J6j7j2M8Mk8jJ8k5j0N6k2k7J5qj0L2K3m4j8J7j2ML5j2
7608A0j4J4j1k1L2Jj7J3ml1K2J7j2mlMmK8j0l6J9NnLK0qoj0MmQK4j5j5j7K4Oj0
7646cJ9j7k5K4K7k7pK2ol1L3J1k1J2Qm7jM5Qm0J3J6k3LK9l6JJ7j4qPK6Jk4Olr
7683a4J8pmmlNJ0mKRnj9O%PJ1qj4PJ8llj2pJ6J0j8J3rQ%J0j3%K2k0j3J7Kk1J1
7724AK3l5J5K9k9j7L7ql6K3J9l7PL9l8nK7j0k7J4KNJOjj3PPQk4%K3rlL%j7J2J5
7763A4l1RL1k6jJ6Lj3K1ml1PJ8k4LL4j6l4M1Kl8M1Rm0KK0k2J7K7m6jK6j4j1K5
7798A4qj8J5Rk4OK4j6j1K0j8K1Rj9pJ4j1oK3k3mJ9j8lK5qk4L0ql6M3J8m1oL7k4
$$ plain form
7537 27 -4 -16 -5 0 2 37 1 -10 1 -2 -22 13 35 -6 3 30 -18 -9 30 23 -8 -3 11 -19 6 19 -11 -19 6 6 -2 6 -7 -18 -21 -5
7573 -5 6 3 6 3 -9 -36 -11 14 10 -12 4 -13 -25 23 27 -1 -2 16 -9 -19 37 15 -12 3 -5 -15 17 40 -4 -22 -5 -17 -13 22 10
7608 10 -4 10 -1 -22 10 11 -6 7 3 -28 -6 11 -1 -5 -8 -4 -8 20 10 -26 -7 -2 -7 -4 16 8 2 -8 -4 -8 0 24 9 -6 -23 1 7 -3
7646 -3 16 -1 -26 -2 25 -2 -9 13 7 -24 9 20 -1 11 19 -28 -29 16 24 -16 -3 13 -10 -7 22 -14 -13 4 -10 -18 -11 15 16 -8 -2 -5 -14
7683 -14 4 -3 -7 -11 -14 -9 1 -3 -1 8 3 -16 -10 -10 -3 8 0 -14 -7 11 8 5 -7 -14 2 12 -6 7 -2 6 6 16 3 3 25 5 -8 9 11 -10 1
7724 1 24 -11 4 33 4 -13 24 16 -20 3 22 -15 -8 31 -7 -12 15 5 -22 -8 -6 -1 0 6 5 -8 -1 6 14 -10 -10 13 4 1 4 4 -13 -1 14
7763 14 -17 -8 23 -3 -4 12 15 2 23 19 -12 -5 13 -11 -8 26 10 -24 17 19 -19 22 31 -9 -7 13 -9 8 35 -11 -12 14 0 -11 14
7798 14 6 -12 3 12 -12 -6 18 2 -9 11 -7 14 23 4 -3 11 0 -6 17 -6 -10 9 -9 -12 13 5 -19 11 3 -33 10 28 -13 -19 18 -6
7834fj1M7ql5K1Qm9M1K8m5kL6l4%M5nm4K3j8qL4lk7J1Pl1K7J8k8MK1k6oK4qj3
7870a2K3k3KK2nj6K0j2k3L6K3n0K0J4l3rM9rl4L4k7j0L5Jk5K6Km1L0K4l3mK9j7
7904Gl0L0plJ8pl3K6J9l2K2Pl7J6L3j4j9K0k7mJ8Nl1L9Om8K3J6k1PK3m4RK1j6
7939hkK1j4j6K0Rk5L3km0J1K2j1J3J7l5k3N7k3k0K9ql3L0J3l4J8K2l1lL0j9JK4
7973B3k3k1L6mj7K2jk3K0mk0J9J6k3j2J6kpL1k6j3J8Kj5K4j1k3J8J9m3J7J3j9
8006a3OJ8k6kL5j7j5J5Mj4K4Ml9J8K3k1mK9m0RK2k2nM0j6k0QJ1k7K9J4l3mRoj
8042gJ3rlK3rk8L2Lj8OMk8K7J4k5nJ1j5QK4k6j1L0j5j7K9J2j7j1Qj5K0J1j0j0
8077dNj4NJ2j2%PQj1K6or%Jj4PLJKOj7mJ4LpLJ3lk4K8k5%J1rkORj3Q%MJLj3jP
$$ plain form
7834 -6 -17 30 22 -13 8 16 -33 8 36 -9 -11 25 -9 -9 36 31 -13 10 -8 -16 18 15 -12 -1 6 -25 2 20 -8 -4 17 -9 -15 9 1 -12
7870 -12 11 -12 -10 12 7 -9 11 -1 -24 12 35 -15 5 19 -14 -23 26 17 -17 17 -10 -20 15 16 -9 17 19 -22 8 32 -1 -5 24 7
7904 7 -23 7 0 -3 15 8 -25 1 20 -12 10 17 -20 -4 29 15 -4 16 -11 -15 3 8 -23 16 22 -26 -3 13 -8 -1 22 -22 -13 8 -8
7939 -8 -10 11 -3 -19 1 10 -15 18 16 -24 -13 9 -2 11 28 -7 -30 27 4 -16 13 5 -28 2 15 -19 -1 21 -10 -13 17 -2 -1 23
7973 23 0 -21 15 11 -6 16 15 -8 12 8 -12 7 23 0 -12 4 2 -5 26 0 -13 5 7 -8 16 5 -18 0 19 -24 -7 6 -13
8006 -13 -7 11 -15 -17 18 1 -14 1 5 -9 15 19 -20 -2 21 0 -4 25 -15 -6 16 -6 -11 29 13 -7 1 12 -15 14 28 -5 -9 0 -6 -7
8042 -7 6 -3 -6 17 8 -20 12 15 -3 3 7 -21 6 20 -5 -10 1 -14 -6 18 -8 -19 11 -4 -21 8 20 3 -8 0 -15 5 16 6 -4
8077 -4 1 -13 -8 4 -8 -8 -1 7 -4 22 16 7 7 8 -6 1 4 5 7 13 -4 -8 6 9 2 5 18 15 -9 19 -6 -6 5 -4 -6 0 9 -4 4 4 8 9 12 -1 -2 5
8123ENj4lOROk0NOLLj1kpJ0JJ0j8J2lPlqkOOqMLKoqMQl%lNj4J1Qj0rJ6kj1OMl
8172Cj0J2j0JJ4%j9J6Pj9lJ4qmJ1Oj3LN
$$ plain form
8123 5 10 -4 -7 -1 8 14 -6 -1 5 8 11 0 -2 -9 1 2 12 -6 6 3 10 7 -1 -3 3 9 1 5 8 10 4 -4 0 8 5 5 2 7 -7 4 12 2 -7 9 7 -4 2 6 3
8172 3 -7 5 -5 -4 10 10 -9 7 14 -5 -8 6 -2 -6 5 11 -2 1 6
8191F
$$ Imaginary data points
##PAGE= N=2
##DATA TABLE= (X++(I..I)), XYDATA
0@%%%%%%%%%Qj6J6j6J6k4L2l2M0m8N6o6P5q9J04j20J37j55J79k03K27k58K90l26
33a73L67m10M56n07N64o27O96p70Q54r48J046j158J285j424J584j767J977k223
51a178K515k868L306l865M606n644P214r884J5581m6512M8386N8299j18542M7231
65a355O6850r5209l4094J01800k0025m8866N2439M930n9508K5142K4101k6201
77i996J1811J4720l2890R050K5363k1801m555K3549j9359j6346K4115J0550j1709
90B502l585r61K451o206q771K6164J4125m2907j038M4329k9451k8827N9472j056
104B6241o8113L3282M6301n3420j408N4397m0169l5961N0622J2k8226L8538l121
117A8975m9352K5352J6819l8033L3854L7463o2042j0778N5354l6157l0486P0390
$$ plain form
0 0 0 0 0 0 0 0 0 0 0 8 -8 8 -8 8 -16 16 -16 24 -24 32 -34 41 -48 56 -64 73 -82 97 -106 121 -137 153 -173
33 -173 194 -216 240 -267 297 -330 366 -404 450 -498 548 -610 675 -749 835 -932 1045 -1178
51 -1178 1337 -1531 1775 -2090 2516 -3128 4086 -5798 9783 -36729 11657 69956 -48586 -1355
65 -1355 65495 -29714 -63808 37992 17967 -30899 21540 26470 -33038 -7896 16205 -9996
77 -9996 1815 16535 -16355 -7305 18058 -3743 -8298 15251 -4108 -20454 3661 14211 2502
90 2502 -1083 -2044 407 -5799 -14570 11594 25719 -17188 -18226 26103 -3348 -32175 27297 26241
104 26241 -41872 -8590 37711 -15709 -17117 37280 -2889 -38850 11772 11784 -16442 22096 18975
117 18975 -30377 -5025 11794 -26239 7615 45078 -16964 -27742 27612 -8545 -39031 31359
129C1359J113o6455K9388L3954n1140L45N0186k1302k8706K7060N134j9832O644
142b252P090o244r67p16N842P148j3455m735J4217q366p128K1250l778j9471J4520
157B955Q76j9682K1887J2559l2967Q284K5007l3565k531M6992k3260l6376M2081
170A2260M784m7700K9178L6558m6108r654M1248k1414k3765L8265L750l1506J2791
183a313J0489k0095P475J3669j3206J867Q370j3641J776J3046j1768l003J5156
196H822p716q773J3011k114j0965Q086K467n349P233j799r503P448M40r224J3161
211E225O056j9252L172J3006j5542n96K1881r554j4319J4110k958j3194J6495
224D530N713j6641P152N723j7728P701J6715j7293l154J9909j3745j4018K3669
$$ plain form
129 31359 32472 -33983 -4595 29359 -21781 -21436 28750 7448 -21258 5802 10936 -8896 -2252
142 -2252 4838 -1406 -2373 -3089 2753 9901 -3554 -8289 5928 -2438 -9566 11684 7906 -11565 2955
157 2955 3831 -15851 6036 18595 -14372 -6088 18919 -14646 -17177 29815 6555 -29821 12260
170 12260 17044 -30656 -1478 35080 -11028 -20682 20566 -848 -24613 13652 17402 -14104 -1313
183 -1313 9176 -10919 -3444 10225 -2981 -1114 7256 -6385 -4609 8437 -3331 -6334 8822
196 8822 1106 -7667 5344 3230 -7735 351 2818 -2531 4702 2903 -6600 848 1288 -7936 5225
211 5225 11281 -7971 -4799 8207 -7335 -7931 13950 4396 -9923 4187 1229 -11965 4530
224 4530 10243 -6398 754 6477 -11251 -3550 13165 -4128 -7282 12627 -1118 -15136 8533
237H533J057k2423J2764J2198k0313J267J8885j1156j0837J3139P15q566O470
250A733L045p211l71J959K92L490q75l071J817l090l002Q243K486o770K029K0
266G24q149N851Q996p378r00O254j0566m006J5268j274r728J0086l8j6735P113
281d482J3864j0242k274J1249r022r414J2482L100q612N084K653r133J686O235
295C174l812O28L686n821j383O102j941k203M554k775m969N209K973m018P55J185
311A344l889J35L666N78J1j076l114J55J490L31L533J072o231j881L627j141R79
328d11N934k930o571K514R56k921N676L981p015k175L327l528O24Q159k036o835
344c251K750O22m437M747N233n484k606L234k550j384N863R21m552k60N59j554
$$ plain form
237 8533 9590 -12833 -69 12129 -8184 -6917 11968 812 -10025 3114 3829 -4737 1733
250 1733 4778 -2433 -2804 -845 -553 2937 2062 -1009 808 -2282 -5284 2959 5445 -1325 704 724
266 724 -7425 -1574 7422 44 -856 5398 -5168 -9174 6094 4820 -4908 5178 5140 -11595 -4482
281 -4482 9382 -860 -3134 8115 -907 -10321 2161 5261 -3351 1733 4386 -4747 -3061 3174
295 3174 -638 -10 3676 -2145 -3528 2574 633 -1570 2984 209 -4760 449 3422 -596 159 1344
311 1344 -2545 -2410 1256 1834 1845 769 -2345 -2190 -700 -369 3164 4236 -1995 -3876 -249 -1390 -411
328 -411 5523 2593 -3978 -1464 -508 -3429 2247 6228 -787 -2962 365 -3163 -2539 5620 3584 -3251
344 -3251 -501 121 -4316 431 5664 180 -2426 808 -1742 -3126 2737 3658 -894 -1154 -595 -2149
360b149K173K895j710k064k34l47J020K000q4j192j144j031Q92K073O52m04j549
377b03k360N06K942R57q7m55l227j709L268K188m85R96j381m617M76M074N30M60
395A873J201m071l748L263L044l32J382o27m987o96L940R97M2J473k359l979J160
412b424L185P33M46k93k985j938K023K879N76j084j357j389o32J899K790l53k337
429b61p08n16m96K794K675k312k814K09j68P05L545M55l808j408P95l5J941K654
447C247j584l058n61J66J152K873O29k460k098q04R12K953J357j542j524j349
463a691q47K260K673p78j320n82j853L5L341J160j652q05j138j108K132K303q11
480A319j191q11j185J008K175p5o12m03j845j87K599O59q05J64j639j782K471
$$ plain form
360 -2149 24 2919 1209 -855 -1089 -1436 -416 1584 1500 308 -836 -1867 -975 1098 1750 1346 -203
377 -203 -2563 -2057 885 1842 1755 1300 -1927 -3636 -368 1820 1335 2331 950 -3667 -3191 883 1413 1873
395 1873 3074 -997 -4745 -1482 1562 1230 2612 1985 -3002 -3698 242 1239 1281 2754 395 -3584 -2424
412 -2424 761 1494 1940 1647 -1338 -3276 -1253 1626 2202 1118 -239 -1628 -2260 -361 2429 2076 -261
429 -261 -969 -1485 -1981 813 3488 1176 -1638 -1429 -1597 -892 2653 3108 -700 -2108 -1313 -1348 593 3247
447 3247 1663 -1395 -1956 -1790 -638 2235 2864 404 -1694 -2498 -1586 1367 2724 1182 -342 -1691
463 -1691 -2538 -278 2395 1617 297 -285 -2138 -2103 1238 2398 746 -59 -1197 -2305 -173 2130 1319
480 1319 128 -683 -1868 -860 1315 1240 628 225 -1620 -1807 792 1451 646 810 -829 -2611 -140
497a40K160j381j72j07k557N61L386m79j410J041j482k070K688J980j671K5P4
514D46k475M76L061j34j158K1j374m72K132N63o04L18j363j325J934Q47r84J191
532A100k46k933R76K614j393k96J531k269j114L384j3k346J482j62k586K262K407
549B398k558j98J474k919m79M154j32k202J306j058k614K637K388j928j97M22
565D94k093O45K414j003n63Q15k047m28L259L1j724R44j415k493K960K822j654
582I64l06k13k999M69L184k00K9R70k977j432L093k48j167K929j148m130K994
599a88K991l459N4K233l740p44N328m7k780J328j613l209L159K774j191J346o40
616A602n096P22M005j246N60L031l986l414M335J039k862K210P83m006Q56L361
$$ plain form
497 -140 2020 639 467 360 -2197 -1636 1750 1271 -139 902 -580 -2650 38 2018 347 372 446
514 446 -2029 -1553 1508 1374 216 237 -1137 -1609 523 1086 482 800 -563 -1888 46 893 -91 1100
532 1100 854 -2079 -1103 1511 118 -178 1353 -916 -2030 1354 1341 -1005 477 315 -2271 -9 2398
549 2398 -160 -358 1116 -1803 -2282 1872 1740 -462 844 -214 -2828 -191 2197 269 72 494
565 494 -1599 -954 1460 457 -106 709 -1338 -1766 1493 1524 -200 744 -671 -3164 -204 2618 964
582 964 658 445 -2554 -2085 1099 899 928 1898 -1079 -2511 582 334 -833 2096 948 -3182 -188
599 -188 2803 -656 -602 1631 -2109 -2853 2475 2428 -352 976 -637 -3846 -687 2087 896 2242 1602
616 1602 -3494 -2772 1233 -13 547 3578 -408 -3822 513 1552 -1310 900 1683 -2323 -1467 1894
632A894r92l37L25l019m45L048M53Q65J453m180l315L354J349q78L333K19n157
649b030m47K347q61J252K247k264j218J139j272J041K642l540k084M566n17k889
665a888M800K50p646J363N675l321j65O079l426o353L147J980k096L329J952m360
681f80r45J312j403J879K409l118n99K644k282q41M097j297l913K161J362j648
697h62K101J198l090q62K64m16L125J374l499N75J467m577N76O429k431m054M650
714A968k98n805L579M305m718j003L685j817j093K766j118j483J305j539J84L878
730B796j992k872L803j089n098M646M190n618l74M602m015k641N582J34l762K205
746D97O27k771J534R74j819J815K63l350K053K543l710K48L678l287j970M481
$$ plain form
632 1894 902 565 890 -2129 -2574 474 927 1792 3245 -935 -4250 -896 453 -425 2908 3127 -2030
649 -2030 -2477 -130 -991 261 2508 244 -974 165 -1107 -66 2576 -964 -3048 1518 1001 -1888
665 -1888 2912 3162 -4484 -3121 2554 -767 -932 5147 1721 -4632 -1485 495 -1601 1728 3680 -680
681 -680 -1625 -313 -1716 163 2572 -546 -1145 1499 -783 -1624 2473 1176 -2737 -576 786 -862
697 -862 1239 2437 -653 -1515 -1251 -1667 1458 2832 -667 -92 1375 -3202 -2626 3803 1372 -2682 1968
714 1968 1670 -4135 -556 3749 -969 -1972 1713 -104 -1197 1569 451 -1032 273 -1266 -1082 2796
730 2796 804 -2068 1735 646 -4452 194 4384 -1234 -1608 2994 -1021 -3662 1920 2054 -1708 497
746 497 1124 -1647 -113 861 -958 857 1120 -2230 -177 2366 -1344 -1096 2582 -705 -2675 1806
762A806m35l180K263N49k330J479L06j513K306l96l370L255J657n361K141N156
778D333n985k224P727k135o392N803K631p004J632N296m366j810M446j245k356
793a649K192l17q48J769j500r54L017j489k559L701K75m126K636K408m343L55
809a432L607k469q93K787j977j009K955j858j432L937j632l566M457O04n421L333
825iL886n968n49N765k899l007M765m86m056K634J189k534J766P09k465J728L93
842H62l371K707K775m666K82M583l984k444N756j026m783M074K010m735J167K894
858B101l237j79K721j758q5K332k241j047K381j830q98L992q86l211K623K39l559
875b542K154K227k742R86K011l223q9K589k556j83L803k394j995M428j415m728
$$ plain form
762 1806 1371 -1809 454 1003 -1327 152 458 -1055 1251 855 -2515 740 2397 -2964 -823 4333
778 4333 -1652 -3876 3851 1716 -4676 1127 3758 -3246 -1614 3682 -684 -2494 1952 707 -1649
793 -1649 543 226 -622 1147 -353 -1307 1710 221 -2338 1363 1638 -2488 148 2556 -1787 -1432
809 -1432 2175 -294 -1187 1600 -377 -1386 1569 -289 -1721 2216 584 -2982 1475 2079 -3342 -9
825 -9 3877 -2091 -2640 3125 226 -2781 1984 1498 -2558 76 1265 -1269 497 1206 -1259 469 862
842 862 -2509 198 2973 -1693 -1411 3172 -812 -3256 2500 1474 -3309 765 2775 -1960 -793 2101
858 2101 -1136 -1315 1406 -352 -437 1895 -346 -1393 988 -842 -1740 2252 1366 -1845 778 1017 -2542
875 -2542 -388 1839 -903 83 2094 -1129 -1218 1371 -1185 -1368 2435 41 -1954 2474 1059 -3669
891c669L901K020m748K191M193m654j668M296k101k682M134P51k830J524K68k752
907a826J199J265j563J432J211k401N06J320k780J19L132j509r99K816j252k498
923a828K140p5k228K519J404k578R45J099l151L80K761k041l79L434j434k599
939a631K114l47k498K381J781k056O82J063k542l79J502r22P94K233j718j227
955g70J482j562j287L002K56k073K095O40l483M31K257j884j2K860j200j724J748
972G76o26k102J633J265j116Q25N98j951k38J049o62K50J295o09m76M86r08k81
990g92J267m32n35J169m39r23J472j46k026J011J194j619O51J972j766j276J704
1007D86p07j461K296J101j977J03P31j632j7J812k97o58Q94k89j017L02K05j47
$$ plain form
891 -3669 232 2252 -2496 -305 3888 -766 -2434 1862 -239 -2921 1213 1964 -866 658 926 -1826
907 -1826 -627 638 -925 507 1718 -683 -177 1143 -1637 -1518 1614 105 -894 1922 670 -1828
923 -1828 312 237 -1991 528 1932 -646 299 1398 -1753 -1373 1388 -653 -1032 2402 968 -1631
939 -1631 483 136 -2362 19 1800 -256 426 1489 -1053 -1432 70 -852 -58 2175 457 -770
955 -770 712 -850 -2137 865 1121 -952 1143 1783 -1700 -1269 988 -896 -908 1952 752 -972 776
972 776 150 -1952 -319 946 -170 655 1253 -698 -936 113 -549 -299 996 387 -89 397 -511 -792
990 -792 475 43 -492 677 238 -685 787 641 -1385 -374 820 -799 -148 1824 58 -1218 486
1007 486 -221 -1682 614 1715 -262 -159 572 -1060 -1077 735 438 -220 674 385 -632 -330 -125 -272
1025b72N27J34l17K17k76n26M27j6l87J022M67j272j16N61q91J75J575n15j035
1044e18Q81j93j340R59J194r24k00O38r51m43J296K65p77J64J4n49K60M59l8R5
1064B92j56m90R5J67q9O08J81r98p3P69m46k53R39k52q54O81L29j005K34R32n99
1085A2m34P43q6o30L77K49n06J22N76j09n06j45K71J46j00K61K26o83l61P38r2
1106F9n27R42M37j466j89J121o00l27J555l16j699P36Q92j268J96J567p97j095
1124g69R78K2j080Q13J014r71n54P58o7n98L71N23l82l23M33J09p22O2R05k84
1144B38p67P11L23j056K45R43q58k97J309m37j233Q66N00r74N15P81j093k13R10
1163D13n46l70J015j41o54M51k45o04Q92L47p61L14J93r06L63P71p42K5R22p81
$$ plain form
1025 -272 255 389 72 289 13 -513 -86 -102 -489 533 1000 -272 -388 173 -718 -543 1032 517 -518
1044 -518 363 170 -1170 -211 983 59 -141 497 -454 -897 399 664 -113 51 65 -484 -224 235 197 292
1064 292 136 -354 -259 -92 -181 427 608 -390 -463 306 -140 -393 546 294 -560 121 450 -555 -321 611 12
1085 12 -422 321 235 -395 -18 231 -275 -153 423 314 -192 -337 -66 80 -20 241 467 -216 -577 161 69
1106 69 -458 484 921 -545 -734 387 -213 -540 1015 699 -1000 -264 628 -640 -444 1123 326 -769
1124 -769 209 231 -849 -36 978 7 -547 211 144 -454 -83 440 58 -265 168 277 -445 -383 522 238
1144 238 -529 182 505 -551 -306 637 -221 -518 791 354 -879 -13 487 -487 28 809 -284 -497 413
1163 413 -133 -503 512 371 -283 168 -77 -681 211 558 -203 111 304 -602 -239 532 -210 -185 737 -44
1183d4p08R36rn96P88J54j005K29N57m63k7M39j35q7l8k06K19J0k41O19l1j046
1205f85O29Q35j436K1J776j093j138K006l47k230J842J409k605L03K359k024j177
1222a555K742n54k143K106P62k642O24J878j573l16J745r33j118J254P1r14O78
1239A12L71n51Mq3j32M38j34n8N68p21n65J254k61j212J448M87j936P72J295k045
1259i49J61K355j659j258K516o87k158K267N37k597J566J601k908K93K536k116
1275e00p29K890j423k003K796j25k777K153J397k890P17K082k450l94K778j222
1291C00j578K063j78j812J281O96j338N85O64r91J6L20k53O10j16q46R54j2j478
1310a113J345Q78k266Q63K103k780n85L486j709k347L667k22l962K937K145m492
$$ plain form
1183 -44 -752 184 175 -421 367 521 -484 -255 302 -161 -188 251 116 29 -9 -215 4 14 -227 392 361 -685
1205 -685 -56 779 -657 -636 1140 47 -1091 915 568 -1662 180 1589 -1016 -713 1646 -378 -1555
1222 -1555 1187 633 -1510 596 1358 -1284 -660 1218 -355 -671 1074 141 -977 277 348 -566 112
1239 112 483 -68 -64 -147 -279 159 25 -33 535 -186 -751 503 242 -970 478 965 -971 -199 1096 -949
1259 -949 -788 1567 -92 -1350 1166 479 -1679 588 1125 -1472 94 1695 -1213 -920 1616 -500
1275 -500 -1229 1661 238 -1765 1031 906 -1871 282 1679 -1211 -494 1588 -862 -1256 1522 300
1291 300 -1278 785 607 -1205 76 772 -566 19 683 -308 -292 28 -225 385 269 -577 377 365 -1113
1310 -1113 232 1110 -1156 -293 1810 -970 -1555 1931 222 -2125 1542 1320 -2642 295 2440 -2052
1326b052R65M001l681j503M538j802l226M193M74m331K347K343l885M59L337k583
1342d06j067L160j320k207K405K81j918J432N79j728O14O80j115N88O13q98N51
1359B44J55j403R63R44j618O62J310k172N0K345j946r25L124j258k523L091P7
1376A120l452K757J943m326R75L699l780j162M754k133l196M572O9m837L018K627
1392B648m636P95M037l453j474M174j642k951L480N74l251J761J530k755M43K062
1408A342j681n23J649o05o29P60l56q2L70p74M70Q32j358M41J640k265q63L073
1426A441j154k220L431K68m092K142K315m225O41M487l054k131M297j530l786
1441c170L933J177m229K410K873m366k77L636k828j435M369q20l086K834L95l710
$$ plain form
1326 -2052 -1087 2914 -767 -2270 2268 466 -2760 1433 1907 -2424 -77 2266 -1619 -1160 2177 -406
1342 -406 -1473 1687 367 -1840 565 846 -1072 360 939 -789 -175 505 -610 -22 591 -307 244
1359 244 399 -1004 -41 903 -715 -53 1257 -915 -865 1480 -466 -1391 1733 475 -2048 1043 1120
1376 1120 -2332 425 2368 -1958 -983 2716 -1064 -2226 2528 395 -2801 1771 1840 -2997 21 2648
1392 2648 -1988 -1193 2844 -609 -2083 2091 449 -2502 978 1552 -1699 62 1592 -1163 -720 1342
1408 1342 -339 -862 787 182 -447 313 -43 -125 245 -529 -59 773 -585 -144 1496 -769 -1632 1441
1426 1441 287 -1933 1498 1766 -2326 -184 2131 -2094 -1453 3034 -20 -2151 2146 616 -3170
1441 -3170 763 1940 -2289 121 2994 -1372 -1649 1987 -841 -2276 2093 1273 -1813 1021 1416 -2294
1457b294J485K272k173M27K274j968j289J567n48p22J474Q0n05O61p50q28Q19
1474a8m08k72J680l11j160J381m74k253J477J134j795J505J833l031n40K510k292
1491a034j197M068m52k906K893K95m536J713L210l271R8M181k426k817L175o23
1507C71l288L027K232k876N74J894k905j053K443n54o08K316j41k015K79n1r10
1524a265J022R58k85L53k11j056N4j82m14J460O46j174P18L87k302R0J835j308
1542f74k3K881j114k480J709l6k537K020K187k270K54K049k614j479K652m31j355
1559a261K596L00k660R94Q30k487O03K351j152k59J784j495j754J489J00j049
1575a070J678Q86j504rK02j334K90J355k31P2N42q94n02M32n50J29J183k80l43
$$ plain form
1457 -2294 -809 1463 -710 -283 1991 23 -1266 301 -247 -969 505 585 80 741 -9 -837 -18
1474 -18 -426 -698 982 671 -489 892 418 -1835 -358 776 -1019 486 2319 -712 -1252 1258 -1034
1491 -1034 -2231 1837 1385 -1521 1372 1667 -2869 -1156 2054 -1217 -1119 3062 636 -2181 994 371
1507 371 -2917 110 2342 -534 40 1934 -971 -2024 419 -135 -743 1573 1432 -583 -304 -355 -1265
1524 -1265 -243 715 430 783 572 -484 -430 -612 -1026 434 1080 -94 624 1011 -1291 -1201 634 -674
1542 -674 -697 2184 1070 -1410 299 263 -2274 -254 1933 -337 -83 1966 -648 -2127 525 94 -1261
1559 -1261 1335 1635 -1025 -31 799 -1688 -1085 1266 114 -145 1639 144 -1610 -121 -21 -1070
1575 -1070 608 1494 -10 -19 183 -1151 -861 494 263 335 877 -17 -519 -87 -637 -508 675 395 52
1594E2P00q24r46J124m4r34J453O57j696L47P81j811J66K145r68r19J879o37j978
1613a453J435O88j773J060J572j870l99J666j105r91J692j00j162J276L28j572
1629g08L72P35r30K85R75o77j97N99p17l56Q24j55j42P07n40o31P97j55o82R10
1649C14J67j005O70M59j257L17J107r94k63J191o66p02J159k50j049J043L93j149
1667e15M80N48j092L04J013r46k08J082p31o53J117k39p73J092Q8j313O09O81
1685E44j028K76R45r44k48J046o03o76J014k1p63O96J56q36M39M01p88J83N90
1704C83m69N4M47o42r7O64m57k00P54l18m81P64k69q32Q45L64r92M97O71j053
1724c67K6R47q80m02J269k62q43Q50rj039O64N25r12L48P99q60k62O90m89k19
$$ plain form
1594 52 752 -72 -1018 106 62 -872 581 1238 -458 -111 670 -1141 -975 1170 202 -717 1162 525 -1453
1613 -1453 -18 670 -1103 -43 1529 -341 -740 926 -179 -1170 522 422 -740 536 864 -708
1629 -708 -336 399 -531 -246 729 52 -145 454 -263 -619 205 50 -92 615 75 -556 241 86 -596 314
1649 314 481 -524 146 605 -652 -335 772 -222 -485 706 40 -662 497 247 -802 241 634 -515
1667 -515 -35 513 -579 -275 738 -208 -416 666 -65 -718 399 160 -613 479 567 -746 -137 544
1685 544 -484 -208 737 -207 -455 591 -12 -688 326 305 -458 238 394 -442 -3 398 -390 -207 383
1704 383 -86 -32 415 -227 -324 340 -117 -317 437 119 -362 402 133 -699 146 510 -482 15 686 -367
1724 -367 -341 606 -274 -676 593 331 -512 338 329 -710 -46 479 -433 -85 714 -146 -408 282 -207 -426
1744d26R15k69o06O20o3o86N64K06n86M69L59q56J05O09n51k4P09n31l19P46k94
1765I1n90O83J15n92M07J43o57L50M29n60R2M04n13L2N28n58q3P97m67n40P78
1786B89j73o77Q75K06j091M74P17j020qJ028o75m24R96l77q44Q90K63q68M29M09
1806D19p78J59O02n79p5O54l29l42L72j87j55N40j44l47L36j50l25N01k4m21N97
1827C24O6q87L29N47p28K39Q62q63m36J012l97p89J032K19r28N09L44j038K66
1846c17Q77o39j60P15n32l73O87k66l93P82p0o94M74N8o47O02L84q36K39N76p66
1867b99l8P61n17j73Q11n37o06Q53o2o32P69O1r64N93M46j023L61R21q72j91Q89
1888E51p64m67J221k19q62Q91L0j044O73M51r60N27P56j099j33R24p11k16J128
$$ plain form
1744 -426 489 220 -386 234 171 -515 49 255 -331 138 497 -359 -254 355 -196 -220 489 -42 -361 385 91
1765 91 -499 184 299 -293 114 257 -400 -50 379 -181 -89 315 -198 -166 362 -196 -279 518 51 -489 289
1786 289 116 -561 314 520 -571 -97 620 -400 -408 620 -55 -479 517 140 -704 186 449 -419 10 419
1806 419 -359 -200 402 -177 -252 402 73 -269 103 -84 -239 301 157 -190 146 -4 -329 172 148 -273 324
1827 324 390 -497 -168 379 -349 -110 752 -111 -547 465 68 -721 311 530 -398 111 455 -583 -317
1846 -317 560 -79 -239 476 -56 -429 258 -8 -401 381 311 -383 91 149 -498 104 488 -348 -109 467 -299
1867 -299 -337 424 -93 -266 545 8 -598 255 193 -439 330 391 -573 20 466 -557 -196 725 -147 -338 551
1888 551 -213 -680 541 322 -540 351 381 -663 10 461 -499 28 784 -315 -448 476 -235 -451 677
1907F77n02p63R38j30r13P92L70q00M82K80j000L39O80p26K21O81r49o6R86q87
1927b90l82J464m95j085J251o8j471J218Q49j696M27J347j538l68J705q60q65
1944h57J705l37j601J244M95j475Q49R57j484J25J167j181l00J421n40o41R73
1961E20m51q34J036O2p92Q28L3j048P14K86j101Q56Q24j449J74J095j361p5J776
1980A093j033r66J749n37j609J673M50j783J169R83k204L62J808j598l22K054
1996A289j217j276K012m19j759J853O46k086R03J088j976L16J808j405m87J748
2012A038r31j131J513k38j130J439K00j492P62M58j293P45Q62j251L73R34j438
2029e80l1J387j022k47J556j139j049J873m05j480J824J92k202J335J163k321
$$ plain form
1907 677 175 -588 350 220 -693 99 469 -331 151 431 -569 -230 450 -276 -55 626 -323 -389 597 -290
1927 -290 -672 792 297 -788 463 395 -1076 142 991 -705 -278 1069 -469 -837 868 8 -857
1944 -857 848 511 -1090 154 649 -826 23 980 -504 -379 788 -393 -693 728 188 -453 520
1961 520 69 -765 271 333 -459 369 402 -646 68 354 -747 109 933 -516 -342 753 -608 -683 1093
1980 1093 60 -906 843 306 -1303 370 820 -963 206 1189 -1015 -653 1155 -443 -765 1289
1996 1289 72 -1204 808 389 -1370 483 1129 -957 -54 1034 -942 -626 1182 -223 -710 1038
2012 1038 107 -1024 489 251 -879 560 760 -732 30 488 -805 -60 802 -449 -76 858 -580
2029 -580 -611 776 -246 -493 1063 -76 -1125 748 343 -1137 687 879 -1323 12 1175 -1146
2045a146P42K118k231o94K424j358j327K740l23k448J855O68k544J204J850k112
2061e82Q8J911j879q95K221o35j182J848j93j703J223K68j596J048R90j301M88
2078A19P26j580J39J209j104J53J558j189p07J377j056r15K174j86j668J590J60
2095H00k278J386J327k259O01K067k207o34K584j309j565K552m57k412K288J016
2111A500k688J018J620k639Q0K574j576q68K447j037k031J881K30j690J652Q48
2127A321k008M50R95j564K22J383r93M3J210j210n75J174q37l89J708n73r51J496
2145I02o43j792J684O11j732J485J030k644L07K001k021k80K793j361j760K437
2161A017m76k407K311J024k808J045J872k488K6K507j868j194K507o93j767K136
$$ plain form
2045 -1146 -404 1714 -517 -1211 1213 -145 -1472 1268 945 -1503 352 1020 -1524 -320 1530 -582
2061 -582 -494 1417 -462 -1357 864 229 -953 895 702 -1001 222 490 -1106 -58 932 -369 119
2078 119 845 -735 -596 613 -491 -338 1220 31 -676 701 -355 -1270 904 718 -950 640 800
2095 800 -1478 -92 1235 -1024 -423 1644 -563 -1197 1387 78 -1487 1065 608 -1804 484 1500
2111 1500 -1188 -170 1450 -1189 -1109 1465 -111 -979 1468 431 -1600 281 511 -1179 473 1321
2127 1321 -687 -237 758 -806 -584 799 -194 -151 1059 -151 -726 448 -389 -778 930 357 -594 902
2145 902 259 -1533 151 762 -970 515 1545 -1099 -792 1209 -812 -1092 1701 340 -1420 1017
2161 1017 541 -1866 445 1469 -1339 -294 1578 -910 -884 1623 -245 -1439 1068 375 -1392 744
2177G44L05k178J158Q21j952P26J589j419j88J225j192m35J397o05n17J316n32
2194B63r24J097l88r68J422O3j343J186M25j815P85J083j786N11J916j797p38
2211a008K088j183j388K454q9k198J790P60k701R52K012k100j38K255j704j277
2227a475K416m24j779J854L71k100J027J055j776M98J499j459l94J412q96n79
2243g50J481m94r42J177j61j107R83K75j024Q25L55j311N37P91j141L48J040j265
2261c83j54J382j062o57J713m75j295J441M7j690J285Q98j885M99J458j656k36
2278g70J822j139r66J943m15j632J537M22j825R28J114j697K53J508j336o34J561
2295F74n21q80J303j76j199Q90L34r67O29N36j018K12N43q42L35R26q47k93P25
$$ plain form
2177 744 1049 -1129 29 850 -1102 -376 1213 -206 -394 831 -361 -796 601 -4 -521 795 263
2194 263 -661 436 48 -920 502 565 -778 408 833 -982 -197 886 -900 -389 1527 -270 -1008
2211 -1008 1080 -103 -1491 963 874 -1324 466 1226 -1475 -523 1489 -611 -749 1506 -198 -1475
2227 -1475 941 517 -1262 592 963 -1137 -110 945 -831 -333 1166 -293 -687 725 -171 -750
2243 -750 731 237 -705 472 311 -796 187 462 -562 263 618 -693 -156 635 -506 -158 882 -383
2261 -383 -537 845 -217 -874 839 364 -931 510 557 -1133 152 1050 -835 -336 1122 -534 -770
2278 -770 1052 -87 -1053 890 475 -1157 380 802 -1023 -95 1019 -678 -425 1083 -253 -887 674
2295 674 153 -727 576 400 -799 91 425 -542 87 623 -395 -183 360 -482 -147 779 -68 -361 364
2314C64p35k12J328l76q57R16k63j155J068O17j098N93O57j543j6J408q14l75
2332d93J347o44j101J297N3j328R15O47j286M58J000j148j91J009q77m62J425
2349F21j28q10P30k87j153Q88P11p89M13N37j144j61Q54m83q3R38m96o50P05p8
2369A35m78O04j18p61O60M58o01L52J93j088Q9Q17m00K14R54q81r17O79j58l43
2389e90J263K20j227K61L39r87L47J044p24j94R03n93o55Q93j51q58O73M44n63
2408a55M75L35j079k43O11j72K64P97m85o15K02l82j84R32K38m60K08k17p45N06
2428a69N35n61J46M87n59l9O12m92m60O04j37l30P97J42p19J01l3o74N44Q87l96
2449B86j59K15p41k89Q33J5k51N79j52p68K91K44l99L29L34n42O4M78l83j97L04
$$ plain form
2314 364 -371 -583 745 369 -488 428 165 -990 78 695 -403 190 847 -696 -712 696 -118 -493
2332 -493 854 210 -891 406 459 -869 46 693 -593 -135 865 -283 -474 535 -342 -804 621
2349 621 493 -317 413 126 -1027 -139 572 -217 196 733 -411 -572 282 -201 -284 654 158 -492 213 135
2369 135 -343 261 143 -618 42 500 -101 251 444 -644 -555 262 -138 76 1030 149 -768 -89 -247 -590
2389 -590 673 893 -334 -73 266 -721 -374 670 -54 -248 655 62 -593 300 149 -709 -36 408 -155
2408 -155 320 655 -424 -667 -56 -228 36 833 348 -267 -65 -447 -631 301 539 79 287 70 -675 -169
2428 -169 366 -195 -49 438 -121 -160 452 -40 -500 104 -33 -363 434 576 -143 -42 -75 -749 -205 682 286
2449 286 127 342 -399 -688 145 160 -91 488 336 -432 -141 103 -296 33 367 -175 -111 367 -16 -213 91
2470I1l30j11O79l4l66K82j97n38L79L03k37L68J62p19p5M30k76R8N60m02l60
2491b93N34j72m64N05J66n33K84L32n51P5M71m73k29N24p2k25L97j39m53K67J65
2512A16k69J91K15l06L2J08k85O8L17j50l9J49k60l4K89j87j04L76j47k85K69
2533F4n1l02M28J65n44J38L04m06O4M80l67k11M71k29l85N45J24m87K43J45n25
2554c36K23N44m30k27M17k11k64M93P2m46J43J18l20J02L52n8j61p2j07L7J63
2575C2J19N1k09k66K14J61j98J71K12m56j31M47j33j52N01k24o84M13M25l97K17
2596A13L32p69k23P51r9k67N67j31p98K58M24k83K67L74o10l89M30Q8mL11j98
2617A44m12R8J35NK63Jl14n7j3j0L68J60l62j34l7j02L61L20l43j71O5k60J07
$$ plain form
2470 91 -239 -350 329 295 -71 211 14 -524 -145 158 -79 289 451 -268 -343 87 -189 -91 469 67 -293
2491 -293 241 69 -395 110 276 -257 27 359 -192 -117 354 -119 -348 176 104 -121 276 137 -316 -49 116
2512 116 -153 38 253 -53 -21 87 -198 -130 187 37 -2 147 -113 -147 142 -45 -149 227 80 -205 64
2533 64 13 -289 139 304 -240 -102 202 -204 -140 340 -27 -238 233 4 -381 164 288 -199 44 189 -336
2554 -336 -113 431 1 -226 191 -20 -284 209 281 -165 -22 96 -224 -122 230 172 11 -61 -168 -131 32
2575 32 151 202 -7 -273 -59 102 -96 75 287 -169 -300 147 14 -138 363 139 -545 -132 293 -104 113
2596 113 445 -324 -547 204 105 -162 405 274 -524 -266 158 -125 142 516 -94 -483 -53 35 31 342 144
2617 144 -268 -170 -35 -30 233 234 -80 -137 -150 -160 208 368 6 -128 -165 -267 94 414 71 -100 -35 -295 -188
2640a88N44j47l10K16k68l50O52L44n69N6J23o23K39R03l90n12M61k85n15P91
2660A72M16o91N6K45p01P9R31j50m56J99k54l80N73M23l35r0m5l28J08L91N6K
2682B21j33l65K4K44R0K34oo03p9M82j13L1M66m48o01N32J84m11N22K90r43q5
2704d67O85l11k1P56n23q18O19K83m25M96K23q87%N70l37Q4O75n05o08M59J9j78
2726b11O28M2q18P0L43k53K79M44n10l20L19j56k1N21p7m12N8r0o6M80O1l69L0
2749b8q5k19M89K32n10J24J88o16J99P66m51l25N75m53n93R78L26q93K75L47q85
2770e59K13J015o08m11P49m33o72Q99K76p33L48K63q88J90Q62m30k85N03l55m01
2790d57O05J17m21K57O2l88J53J84j71K05km14K30K50l63J78L00n82j9O46l46
$$ plain form
2640 -188 356 209 -101 115 -153 -503 149 493 -76 -20 103 -520 -281 622 232 -280 181 -104 -619 172
2660 172 588 -103 -47 198 -503 -424 507 357 -99 100 -154 -534 39 462 127 37 -8 -336 -228 163 219 221
2682 221 88 -277 -253 -9 81 315 309 -294 -373 109 -4 27 493 45 -556 -24 160 -251 271 561 -382 -467
2704 -467 218 -93 -114 642 119 -699 -80 203 -222 274 497 -390 -390 180 -157 -73 602 97 -511 -52 -33 -211
2726 -211 417 459 -359 -289 54 -199 80 524 14 -306 13 -143 -164 357 280 -132 -74 -164 -230 250 311 -58 -28
2749 -28 -113 -332 157 389 -121 3 191 -425 -226 540 89 -236 339 -114 -707 271 597 -296 -21 326 -559
2770 -559 -346 669 61 -350 399 -34 -706 193 469 -264 84 347 -541 -351 511 81 -204 299 -56 -457
2790 -457 148 265 -156 101 163 -225 -72 112 -59 146 144 -270 -40 210 -153 25 325 -257 -276 370 24
2811B4l04N80j93n20N64J12n95M58K70p93K00O20o18k4P78o72m87J019j50q52
2831e83P83L13j033L48P49q68j19R37m70n30P26r8n52N30R2n38M01K51o08J40
2851a29L71m31J57M70n40k18M78j66j42M57j75l36K62j79j80O28j6n15L55j01
2871E0p42P10P09q88n2P51q32m19J195j09q31P34J06j025M92P10p52K1N38o76
2891c10j9R12m46n50O21k77n67R63L21q87J96K96q52J44R74k06l16K22m70k79
2911e30O02J19j03K32m22l43O25K3m31N01o3q67M74P43n02M4L59r63l22J009J21
2932C06j32N48o35r99O53L73m31Q55L87j346j45Q09o07l6J184m89r57P48K98p06
2952c22L72K28q05J70P12j76J04J54q20l10N63ML12P66n98r74K13R1q4Q69L00
$$ plain form
2811 24 -280 300 107 -413 151 263 -332 126 396 -397 -197 423 -195 -219 559 -113 -600 419 269 -583
2831 -583 200 513 -520 -172 577 -291 -410 527 57 -473 253 155 -397 133 225 -313 88 339 -269 -129
2851 -129 242 -189 -32 438 -102 -320 158 -8 -150 307 132 -204 58 -121 -301 327 311 -204 151 50
2871 50 -692 18 727 -161 -213 538 -294 -713 482 373 -458 276 382 -643 -151 559 -193 -172 366 -310
2891 -310 -329 583 137 -413 208 -69 -636 327 648 -239 -43 253 -599 -455 519 313 -3 219 -251 -530
2911 -530 72 191 88 320 -102 -445 180 203 -228 273 210 -657 -183 560 58 102 461 -502 -824 185 306
2932 306 174 722 87 -912 -259 114 -317 538 925 -421 -566 243 -364 -400 784 295 -662 86 384 -322
2952 -322 50 278 -527 -357 355 179 283 437 -383 -693 -130 -126 186 952 354 -620 -407 -316 -400 469 769
2973G69q27j08J13m02L74N15m93n8M00m95M8Q35n78p70O10O5l68J006L54j302
2993c12k58M43m72M14J135l90o72J67n58l44J080L02n43L44j13r06M79O58p32
3012b78k2O95m22j81P24k88p09K75K8j58O90K96m88j43l52n03O80P09l21P1J12
3033D15r34j26Q52j59j80O65l11p01N20J69n06L52J66o47M08O40o12j38L95p21
3053d53j90J101m7n43N55j84j015M35O44l87K46M33p23l20N36j92r5N15k50l04
3073b38M94j10n04M07P8n33M13M01m84Q6K64n97q3N80j06l8L68m42l66N16r9l07
3095c00O25j8o80M27K78p50K81O58o69j92P40l28m14O12j35n88N58K38n70K47
3115B0K35n69K08M83n03m9N23m30k96O36j22l95M62l5n62L53L37m09J12J57m10
$$ plain form
2973 769 -58 -166 -53 -455 -81 434 -59 -117 283 -212 -164 671 93 -677 -67 -2 -370 636 990 -312
2993 -312 -570 -127 -599 -185 950 560 -112 55 -503 -847 233 535 -8 336 223 -683 -204 454 -278
3012 -278 -300 395 -27 -208 516 228 -481 -206 -178 -336 354 650 162 19 -333 -836 -156 553 232 303 415
3033 415 -519 -645 207 48 -132 533 222 -479 41 210 -296 56 222 -425 -17 623 11 -127 268 -453
3053 -453 -643 458 411 -132 423 239 -776 -341 303 -84 162 595 -128 -448 88 -104 -199 316 66 -238
3073 -238 256 146 -358 49 127 -406 7 408 -76 10 274 -323 -406 174 68 30 398 -44 -410 106 7 -300
3095 -300 325 307 -373 54 332 -418 -137 521 -148 -340 400 72 -342 270 135 -453 105 343 -227 20
3115 20 255 -314 -106 377 -126 -175 348 -82 -378 258 136 -259 203 168 -394 -41 296 -113 -1 156 -254
3136b54J32L87l42l3L27l91j14N45j83k73M58j76n77M85K99l78K38J36o58J18
3156b54N18l41M3M77n17l00O17k12l92O97Mq28M29M78o37J36N34o75k51P99r9
3177B26l91M12j47n51L39K92k49K88J21n77j6K62j60K47L46m77k24L18j63l1M23
3198B88k10l31L51q8k83N17K4n95K43K47m83L33N98o84l55N64k00k49P33j7p12
3219c09K56J51m62L65M42m64m6K06m33J03O32l46l26M24k43l52O88R9o71K57K29
3240B00n48J99N61l67j77K85l61j24N98m4l03K11k13l08N00J60m04K30O1n06J78
3261a72M29l06M7K95n19j36N84j52j84M51l22n30O30J82n97L89L45p97L3P04l88
3282a4k29O43k80o10M95K33l38K42R3m97J18K84k07J63J87m26k8L22l17L2N56
$$ plain form
3136 -254 -122 265 -77 -110 217 -174 -288 257 74 -199 259 83 -494 -9 290 -88 150 286 -372 -254
3156 -254 264 -77 -34 443 -74 -374 243 31 -361 336 340 -488 -59 419 -218 -82 452 -223 -474 325 226
3177 226 -165 247 100 -451 -112 180 -69 219 340 -237 -253 9 -151 96 442 -35 -259 59 -104 -135 288
3198 288 78 -253 98 10 -273 244 268 -327 -84 163 -320 13 611 -73 -428 136 -64 -313 420 403 -309
3219 -309 -53 98 -364 1 443 -21 -67 139 -294 -191 441 95 -231 193 -50 -402 286 385 -286 -29 200
3240 200 -348 -149 412 45 -132 153 -208 -332 266 222 -81 130 -83 -391 109 269 -135 95 156 -350 -172
3261 -172 257 -49 -2 293 -226 -362 222 70 -114 337 15 -515 115 297 -300 89 434 -363 -330 374 -14
3282 -14 -243 400 120 -490 5 238 -100 142 235 -262 -144 140 -67 96 283 -143 -171 151 -166 -134 422
3303D22l63m00M46p9l11N30O5o63K47L37m59J80M75n55j77N31l17k50O92p3o06
3324c28L07J15m36L82L81n26o8L03l07K1M26k51j36L21l13k08N33n2l88L80on42
3346c92M03L98n55rM29l94j25N41k02k87L58j00l50L63J26l19K08K2m29K68L38
3367B92l92N5K78m41m0N24k63k40M87j86m88M82J68m90L58K32o96Q4O26l92j67
3388b09N53l04m56N35P0m43L39J94m80P3K58k41R9K49l02o4K45j82MK79k44j40
3410a67L79j81k65L98om05L17J42m68K51L44n00m6M57k87j47M59k12l82M38L5
3431A54l94L10J65m51J46K61l89Q0M42l60j80L88k17k28M93n7m28L11J52m36J81
3452e7K97l52J6L23l18j17L93j21k08K58o5k29K69J7k56J66J15k37J18R9k46J34
$$ plain form
3303 422 59 -341 105 26 -285 245 310 -353 -106 231 -228 -48 427 -128 -305 226 -91 -341 351 278 -328
3324 -328 -21 94 -342 40 421 -105 -173 130 -177 -156 270 19 -117 204 -109 -317 216 164 -224 156 150 -392
3346 -392 11 409 -146 -155 274 -120 -245 296 94 -193 165 65 -285 78 204 -115 93 115 -314 -46 292
3367 292 -100 -45 233 -208 -248 276 13 -227 260 74 -414 68 236 -254 104 336 -360 -276 350 -42 -209
3388 -209 344 40 -416 119 189 -254 85 279 -201 -128 130 -111 -12 237 -65 -129 116 -66 -62 217 -27 -167
3410 -167 212 31 -234 164 158 -247 70 212 -256 -5 339 -161 -207 250 -37 -184 275 63 -319 119 154
3431 154 -240 70 235 -216 -70 191 -198 -118 324 -36 -216 172 -45 -273 220 163 -265 46 198 -238 -57
3452 -57 240 -112 -96 227 -91 -208 185 64 -144 114 49 -180 89 106 -150 16 131 -106 12 111 -135 -1
3474aJ81k88M3K48k76j3L44l01j81N16j26m54L92J26m97K83L51m99l3M82l28k67
3496b98M63m6l02K99J2l72K17J72k94J32K07k86K4K32k79n5L57j13k11K35m7k03
3518a56K11L6j98J52O2j90J21O3k52J69J78l32M5L27k52j23L28j85k53L90J1l34
3540a82K63J20l70J41J85l68J35L73l49j25M21k53l12M58Rm30L91K39n38j1L54
3561A51k52p9L97j15j96J85r6k01J94M7o0K15r3k79J70N9k30J95J82k74Q2J80
3583A82l15k6K90j66m9L00k01j78L60j12m04L62K02m36K03L25m77p6M64k75k62
3604b89M66Jl29K45K3l65K06J92k83J40K52l27j5K37l29r6M91o9l01K88ml89J53
3627a02J81j88J36J91k24n0N2j75J27K28k29QK85k88j99L43n8k51L93N5m46J71
$$ plain form
3474 -1 180 -108 -65 183 -93 -106 238 -63 -244 272 146 -308 84 210 -287 -4 347 -152 -185 297 -31 -298
3496 -298 165 119 -183 116 128 -244 -27 145 -149 -17 190 -96 -72 160 -119 -174 183 70 -141 94 47 -156
3518 -156 55 91 -107 45 107 -83 38 101 -151 18 196 -136 -91 236 -16 -139 189 4 -249 141 152 -182
3540 -182 81 201 -169 -28 157 -211 -76 297 -52 -177 244 -9 -321 137 146 -284 107 346 -192 -203 151
3561 151 -101 -180 217 102 -94 91 -5 -206 -12 35 -25 190 97 -182 -12 47 -183 12 194 -80 2 182
3583 182 -133 -159 131 -35 -84 216 15 -163 197 85 -319 43 245 -191 12 337 -140 -216 248 -27 -289
3604 -289 177 178 -151 94 117 -248 -42 150 -133 7 259 -68 -83 154 -175 -271 220 151 -150 138 134 -255 -102
3627 -102 79 -109 27 218 -6 -56 -4 -179 -52 176 -53 -45 240 -48 -247 96 38 -213 180 235 -211 -40
3649d0K34l50O7L25l06l4L62k85j92M13j08l50L82O6m58K81L31m94o3M29k29j98
3671b17L78n5k64K19lk38J52J04j21J32k6k48J82J40k96J00K68k66n2L02k26j83
3693b18L45k6k49K19L9k66J96M9l09K23K59l82K2L13l40j11N05j57l68M07N6m67
3715b60J98K89l06O4K42l28p8K90r8q4K49j54j95K86n7k69K82J24l17P2J79k47
3737a18K1K46j65r8J78q7m4J70j62q3K87j15k14L02Ll67K55J99m07J04M02l53
3759d6k02L70r1k03L29k4l24J94Q0k92K32K11l18M2K01l40l8M64j19k84K59m0
3781F1l05K59J75k54M5J46k16J0J57j03L8J17k48lK56j17p8K32j97k47L14Q9k55
3804a24J75J33l39L9J99j94O1K83k81j21L21j50j77L30r0l92L81K48m07O2K65
$$ plain form
3649 -40 194 -156 -89 236 -70 -104 258 -27 -219 194 86 -264 118 184 -274 7 338 -156 -219 210 -19 -217
3671 -217 161 106 -158 61 58 -180 -28 76 -45 87 61 -187 -5 135 -161 -61 207 -59 -111 191 -35 -218
3693 -218 127 101 -148 71 110 -156 40 89 -220 3 262 -120 -98 215 -125 -236 269 112 -256 151 207 -260
3715 -260 -62 227 -79 -15 227 -101 -179 111 13 -71 178 24 -171 115 58 -211 71 195 -122 -50 129 -118
3737 -118 -97 149 -16 -114 64 -23 -67 103 -59 -142 145 30 -184 118 121 -246 9 208 -199 -95 307 -46
3759 -46 -248 122 31 -172 157 133 -191 3 83 -209 23 234 -84 -42 159 -181 -219 245 126 -158 101 61
3781 61 -244 15 190 -64 -19 127 -89 -79 78 -25 13 130 -118 -121 135 18 -60 172 -25 -272 42 131 -124
3804 -124 51 184 -155 -116 83 -111 -50 233 -48 -169 152 2 -175 155 65 -327 54 302 -105 -43 222
3825B22m15j20M46Kj42K60j41m08R8J85K6K25Ql28k9L4j33K21K72k34q9J61k42
3848a21q3L59n0k27J38L9j30K17K9l53M2J47j34K02K68l35j85J73j77q0M95N4
3870B88l48O4k3k68K36K84k45l0J34j84L9K60k23j70K37j06j18M17Q3m40lN7k63
$$ plain form
3825 222 -193 -313 133 135 -7 253 112 -296 -198 -13 13 238 246 -82 -111 -77 -210 11 283 49 -40 121 -121
3848 -121 -204 155 105 -122 16 55 -75 142 171 -182 -140 7 -127 75 343 8 -177 -4 -181 -261 234 288
3870 288 -60 4 -19 -287 -51 233 -12 -42 92 -92 -53 207 -16 -186 51 -55 -173 244 327 -113 -116 -59 -322
$$ [...]
8191b
##END NTUPLES=NMR FID
##END=
