##TITLE=1H_LY-822.40
 CCl4, 8 sc, 
 28.5.2019
##JCAMPDX= 6.0         $$ Bruker NMR JCAMP-DX V2.0
##DATA TYPE= NMR FID
##DATA CLASS= NTUPLES
##ORIGIN= UXNMR, Bruker Analytische Messtechnik GmbH
##OWNER= root
$$ XWIN-NMR		Version 3.5
$$ Tue May 28 14:59:59 2019 Russian Standard Time (UT+4h)  she@DPX200
##.OBSERVE FREQUENCY= 200.1315
##.OBSERVE NUCLEUS= ^1H
##.DELAY= (6, 6)
##.ACQUISITION MODE= SIMULTANEOUS
##.ACQUISITION SCHEME= undefined
##.AVERAGES= 8
##.DIGITISER RES= 18
##SPECTROMETER/DATA SYSTEM= spect
##.PULSE SEQUENCE= zg30
##.SOLVENT NAME= CDCl3
##.SHIFT REFERENCE= (INTERNAL, CDCl3, 0, 15.7039)
##AUDIT TRAIL= $$ (NUMBER, WHEN, WHO, WHERE, WHAT)
$$ ##TITLE= Audit trail, XWIN-NMR		Version 3.5
$$ ##JCAMPDX= 5.01
$$ ##ORIGIN= Bruker BioSpin GmbH
$$ ##OWNER= she
$$ F:/spectra/data/she/nmr/H-F/1/audita.txt
$$ ##AUDIT TRAIL=  $$ (NUMBER, WHEN, WHO, WHERE, WHAT)
(   1,<2019-05-28 14:53:50.14 +0400>,<she>,<DPX200>,
      <created by zg, POWCHK disabled, PULCHK disabled
       configuration hash MD5:
       00 E9 B6 7A A2 85 ED C7 34 08 36 98 17 FE 4E 26
       data hash MD5: 16K
       AA 4C 68 CF EC B0 51 C9 DD 35 3D 70 CA 3C A8 47>)
$$ ##END=
$$ 
$$ hash MD5
$$ BD 50 50 86 71 54 FF 49 69 CE 71 70 C6 19 50 BF
##$RELAX= 
##$RELAX= 
##$RELAX= 
##$RELAX= 
##$RELAX= 
##$RELAX= 
$$ Bruker specific parameters
$$ --------------------------
##$DU= <F:/spectra>
##$EXPNO= 1
##$NAME= <H-F>
##$PROCNO= 1
##$TYPE= <nmr>
##$USER= <she>
##$AMP= (0..31)
100 100 100 100 100 100 100 100 100 100 100 100 100 100 100 100 100 100 
100 100 100 100 100 100 100 100 100 100 100 100 100 100 
##$AQSEQ= 0
##$AQ_mod= 1
##$AUNM= <au_zg>
##$AUTOPOS= <>
##$BF1= 200.13
##$BF2= 200.13
##$BF3= 200.13
##$BF4= 200.13
##$BF5= 200.13
##$BF6= 200.13
##$BF7= 200.13
##$BF8= 200.13
##$BYTORDA= 1
##$CFDGTYP= 0
##$CFRGTYP= 5
##$CHEMSTR= <none>
##$CNST= (0..31)
1 1 145 1 1 1 1 1 1 1 1 1 1 1 1 1 1 1 1 1 1 1 1 1 1 1 1 1 1 1 1 1 
##$CPDPRG= <>
##$CPDPRG1= <>
##$CPDPRG2= <>
##$CPDPRG3= <>
##$CPDPRG4= <mlev>
##$CPDPRG5= <mlev>
##$CPDPRG6= <mlev>
##$CPDPRG7= <mlev>
##$CPDPRG8= <mlev>
##$CPDPRGB= <>
##$CPDPRGT= <>
##$D= (0..31)
0 1.2 0 0 0 0 0 0 0 0 0 0.03 0 0 0 0 0 0 0 0 0 0 0 0 0 0 0 0 0 0 0 0 
##$DATE= 1559040829
##$DBL= (0..7)
120 120 120 120 120 120 120 120 
##$DBP= (0..7)
150 150 150 150 150 150 150 150 
##$DBP07= 0
##$DBPNAM0= <>
##$DBPNAM1= <>
##$DBPNAM2= <>
##$DBPNAM3= <>
##$DBPNAM4= <>
##$DBPNAM5= <>
##$DBPNAM6= <>
##$DBPNAM7= <>
##$DBPOAL= (0..7)
0.5 0.5 0.5 0.5 0.5 0.5 0.5 0.5 
##$DBPOFFS= (0..7)
0 0 0 0 0 0 0 0 
##$DE= 6
##$DECBNUC= <off>
##$DECIM= 24
##$DECNUC= <off>
##$DECSTAT= 4
##$DIGMOD= 1
##$DIGTYP= 9
##$DL= (0..7)
0 120 120 120 120 120 120 120 
##$DP= (0..7)
150 150 150 150 150 150 150 150 
##$DP07= 0
##$DPNAME0= <>
##$DPNAME1= <>
##$DPNAME2= <>
##$DPNAME3= <>
##$DPNAME4= <>
##$DPNAME5= <>
##$DPNAME6= <>
##$DPNAME7= <>
##$DPOAL= (0..7)
0.5 0.5 0.5 0.5 0.5 0.5 0.5 0.5 
##$DPOFFS= (0..7)
0 0 0 0 0 0 0 0 
##$DQDMODE= 0
##$DR= 18
##$DS= 0
##$DSLIST= <SSSSSSSSSSSSSSS>
##$DSPFIRM= 0
$$ [...]
##$SUBNAM2= <"">
##$SUBNAM3= <"">
##$SUBNAM4= <"">
##$SUBNAM5= <"">
##$SUBNAM6= <"">
##$SUBNAM7= <"">
##$SUBNAM8= <"">
##$SUBNAM9= <"">
##$SW= 24.9337058887773
##$SWIBOX= (0..15)
0 0 2 0 0 0 0 0 0 0 0 0 0 0 0 0 
##$SW_h= 4990.01996007984
##$TD= 16384
##$TD0= 1
##$TE= 0
##$TE2= 300
##$TE3= 300
##$TEG= 300
##$TL= (0..7)
0 120 120 120 120 120 120 120 
##$TP= (0..7)
150 150 150 150 150 150 150 150 
##$TP07= 0
##$TPNAME0= <>
##$TPNAME1= <>
##$TPNAME2= <>
##$TPNAME3= <>
##$TPNAME4= <>
##$TPNAME5= <>
##$TPNAME6= <>
##$TPNAME7= <>
##$TPOAL= (0..7)
0.5 0.5 0.5 0.5 0.5 0.5 0.5 0.5 
##$TPOFFS= (0..7)
0 0 0 0 0 0 0 0 
##$TUNHIN= 0
##$TUNHOUT= 0
##$TUNXOUT= 0
##$USERA1= <user>
##$USERA2= <user>
##$USERA3= <user>
##$USERA4= <user>
##$USERA5= <user>
##$V9= 5
##$VALIST= <valist>
##$VCLIST= <CCCCCCCCCCCCCCC>
##$VD= 0
##$VDLIST= <DDDDDDDDDDDDDDD>
##$VPLIST= <PPPPPPPPPPPPPPP>
##$VTLIST= <TTTTTTTTTTTTTTT>
##$WBST= 1024
##$WBSW= 4
##$XGAIN= (0..3)
0 0 0 0 
##$XL= 0
##$YL= 0
##$YMAX_a= 61030
##$YMIN_a= -74640
##$ZGOPTNS= <>
##$ZL1= 120
##$ZL2= 120
##$ZL3= 120
##$ZL4= 120
##$ABSF1= 10
##$ABSF2= 0
##$ABSG= 5
##$ABSL= 3
##$ALPHA= 0
##$AQORDER= 0
##$ASSFAC= 0
##$ASSFACI= 0
##$ASSFACX= 0
##$ASSWID= 0
##$AUNMP= <proc_1d>
##$AZFE= 0.1
##$AZFW= 0.1
##$BCFW= 1
##$BC_mod= 2
##$BYTORDP= 1
##$COROFFS= 0
##$CY= 11.3945322036743
##$DATMOD= 1
##$DC= 2
##$DFILT= <>
##$DTYPP= 0
##$F1P= 18.9103706918063
##$F2P= -1.10871071338519
##$FCOR= 0.5
##$FTSIZE= 0
##$FT_mod= 4
##$GAMMA= 1
##$GB= 0.15
##$INTBC= 1
##$INTSCL= 1
##$ISEN= 128
##$LB= 0.24
##$LEV0= 0
##$LPBIN= 0
##$MAXI= 10000
##$MC2= 0
##$MEAN= 0
##$ME_mod= 0
##$MI= 1.114404
##$NCOEF= 0
##$NC_proc= 0
##$NLEV= 6
##$NOISF1= 3.799351
##$NOISF2= 2.8
##$NSP= 1
##$NTH_PI= 0
##$NZP= 0
##$OFFSET= 15.70392
##$PC= 1
##$PHC0= -8932.55
##$PHC1= 11.40025
##$PH_mod= 1
##$PKNL= yes
##$PPARMOD= 0
##$PSCAL= 0
##$PSIGN= 0
##$REVERSE= no
##$SF= 200.130013532006
##$SI= 16384
##$SIGF1= 3
##$SIGF2= 2
##$SINO= 400
##$SIOLD= 16384
##$SREGLST= <1H.CDCl3>
##$SSB= 0
##$STSI= 0
##$STSR= 0
##$SW_p= 3612.71676300578
##$SYMM= 0
##$S_DEV= 0
##$TDeff= 0
##$TDoff= 0
##$TI= <>
##$TILT= no
##$TM1= 0
##$TM2= 0
##$TOPLEV= 0
##$USERP1= <user>
##$USERP2= <user>
##$USERP3= <user>
##$USERP4= <user>
##$USERP5= <user>
##$WDW= 1
##$XDIM= 8192
##$YMAX_p= 0
##$YMIN_p= 0
$$ End of Bruker specific parameters
$$ ---------------------------------
##NTUPLES= NMR FID
##VAR_NAME=  TIME,          FID/REAL,        FID/IMAG
##SYMBOL=    X,             R,               I
##VAR_TYPE=  INDEPENDENT,   DEPENDENT,       DEPENDENT
##VAR_FORM=  AFFN,          ASDF,            ASDF
##VAR_DIM=   8192,          8192,            8192
##UNITS=     SECONDS,       ARBITRARY UNITS, ARBITRARY UNITS
##FACTOR=    0.0002004,     1,               1
##FIRST=     0,             0,               0
##LAST=      1.6414764,     0,               0
##MIN=       0,             -74640,          0
##MAX=       1.6414764,     61030,           0
$$ Real data points
##PAGE= N=1
##DATA TABLE= (X++(R..R)), XYDATA
$$ [...]
915A363k386j156L136l01j525K346j42k748J021N75j835J603J762j740L93R34
$$ 1363 -1023 -2179 957 656 -869 1477 1335 -1413 -392 183 -1652 -49 1713 -27 366 1300
931A300k762j63K562j357n41L090r10k581J670q5k515J925K054j716M63J160k419
$$ 1300 -1462 -1625 937 -420 -961 2129 1219 -1362 308 223 -2292 -367 1687 -29 434 1594 -825
948h25o79J601r29L63K567j184j687J421j071j861K554J114k098J308J350k901
$$ -825 -1504 97 -832 -469 2098 914 -773 648 -423 -2284 270 1384 -714 594 1944 -957
964i57n13K088j217n27K548l27j623J103l25j884J007J129o59R18O33j779m55
$$ -957 -1470 618 -599 -1126 1422 1095 -528 575 250 -1634 -627 502 -157 761 1394 -385 -840
981h40P43p13L57J502n15n49N79r09o93J190m8n65J136j45j128J035K02j824N96
$$ -840 -97 -810 -453 1049 534 -15 564 -345 -1038 152 104 -461 675 530 -598 437 639 -1185 -589
1000e89J315j213L66J798j448j453J422l28j270J909J087j692l3N82j462JJ718
$$ -589 726 -487 -121 1677 229 -1224 198 -130 -1400 509 1596 -96 -129 453 -1009 -1008 710
1017G10k39n97P39m16q78N82J28m38O35K20n41L06Q0p16J99K65m99N82P72p94
$$ 710 471 -126 613 197 -681 -99 29 -409 226 446 -95 211 291 -425 -226 39 -460 122 894 100
1037A00l72L62o93m7J303j03p92N73k01j078P30Q64p06Q4N30r68l23J123m7n27
$$ 100 -272 90 -603 -650 653 550 -242 331 130 -948 -218 646 -60 24 554 -414 -737 386 339 -188
1057a88M52k50o49O64L85m81K35Q3p19J68N73l35J73M88q13m26Q42m1m33O64p4
$$ -188 264 14 -635 29 414 -67 168 251 -468 -300 273 -62 111 599 -214 -640 202 161 -272 392 318
1078C18r04M50N79o34oO44m70l89N79L6l73K58M3l42P2K76N6o7l05n5L23p4k9
$$ 318 -586 -136 443 -191 -197 447 -23 -412 167 203 -170 88 131 -211 -139 137 193 126 -179 -234 89 15 -14
1101a4M17l39o42N67K81o33N04O60j115l96J024l51m98J259n1j500N04Q66j006
$$ -14 403 64 -578 -11 270 -363 141 801 -314 -710 314 -37 -535 724 673 -827 -323 543 -463
1120d63J22J277p68r02R64J2r34P54P13r21k57O50k32l34M79J37m53k8L42j8l32
$$ -463 -341 936 168 -734 230 242 -692 62 775 -146 -403 247 15 -319 160 297 -156 -184 158 140 -192
1141a92P1L67k15l56M68J59o25K25N10o99r1R60m07p51P55P0q21P17N32j071O6
$$ -192 -121 246 31 -325 143 302 -323 -98 412 -287 -378 582 175 -576 179 249 -572 145 677 -394 -328
1162c28Q39p89k25J116m01p11Q10j66r10Q85N52r99K30N57r31J2J058n24n05Q65
$$ -328 511 -278 -503 613 212 -499 311 145 -765 120 672 -327 -97 460 -471 -459 599 75 -430 435
1182D35k59q14O54L59o20K75L93o22j40N11o2k08J25P7o0j96M3L28k46l02O83
$$ 435 176 -638 16 375 -245 30 423 -199 -339 172 110 -98 27 104 44 -152 -109 219 -27 -329 354
1203C54m7r55O64P21j275L2J445j019q65J787l34j847J515J041k159M30J905j820
$$ 354 307 -648 16 737 -538 -506 939 -80 -945 842 508 -1339 176 1217 -942 -512 1393 -427
1221d27q02K335o76j777J902N17k257Q00J535j610j85J680r64j079J381Q0j069
$$ -427 -1229 1106 430 -1347 555 1072 -1185 -385 1150 -460 -645 1035 71 -1008 373 453 -616
1238f16P04M97q46j6M30k23m1K01J04k9m71L0O75m58m28J062k19j203J085N12
$$ -616 88 585 -261 -277 153 -70 -111 90 194 165 -306 -276 399 -59 -487 575 356 -847 238 750
1258G50j701O98J530j764m10K143j207j429K319j64k290J883J089k753P39K184
$$ 750 -951 -253 1277 -487 -897 1246 39 -1390 929 765 -1525 358 1447 -1306 -567 1617
1274A617k338m46K814j516j822K712j20k621J944J312k709O13K052k083n92K425
$$ 1617 -721 -1167 1647 131 -1691 1021 901 -1720 224 1536 -1173 -560 1492 -591 -1183 1242
1290A242q77j536J692J06j594R03Q24j104R9P11n26k36K42J05K23l47k34P42m37
$$ 1242 365 -1171 521 627 -967 -64 760 -344 -245 466 -60 -296 -54 51 274 -73 -307 435 -2
1309bq08J375J29j827J202J284k446K22K667k058j435L258q33l010L004J195l886
$$ -2 -810 565 694 -1133 69 1353 -1093 -871 1796 -262 -1697 1561 728 -2282 722 1917 -1969
1326a969J432K949l541n86L941k087k440L809j63l632K520J691l559Q63K821k635
$$ -1969 -537 2412 -1129 -1715 2226 139 -2301 1508 1345 -2287 233 1924 -1635 -772 2049 -586
1342e86q08K989j354j936K369K18k002J266Q56j699K16J024p37k4N42k96N4j52
$$ -586 -1394 1595 241 -1695 674 892 -1110 156 1012 -687 -471 553 -184 -208 334 38 92 -60
1360f0m34P67O8r55J002L42j809Q42J493k021j9K426j837j428K961p19k643K877
$$ -60 -494 273 341 -614 388 730 -1079 -237 1256 -765 -784 1642 -195 -1623 1338 619 -2024 853
1378H53Q53l721J707K605l697n2L913k675k129M287p87l828L257J490m171J475
$$ 853 1706 -2015 -308 2297 -1400 -1452 2461 -214 -2343 1944 1157 -2671 586 2076 -2095 -620
1394f20L152l435p11L587j916k158L197L6k640J810R98k439N90J623j463k13J368
$$ -620 2532 -903 -1614 1973 57 -2101 1096 1132 -1508 302 1300 -1139 -549 1074 -389 -602 766
1411G66o33n20O09k61j69J89k89N56K77j016O46O93j942K24K232j565r02K883
$$ 766 133 -387 222 -39 -208 -19 -308 248 525 -491 155 848 -1094 -870 1362 -203 -1105 1778
1429A778j112k909K686R09l435J903K912l603n79L546k508k204M113j93l323K938
$$ 1778 666 -2243 443 1352 -2083 -180 2732 -871 -1450 2096 -412 -2616 1497 1304 -2019 919
1445I19J250m142J019K731l072j02L813j840k173K792o70k923K325J559k239R15
$$ 919 2169 -1973 -954 1777 -1295 -1397 2416 576 -1597 1195 525 -2398 -73 1486 -753 162
1461A62J612k307p77J587n97l59J474n7o58J98o25l70N27k60M45J206q85o39R96
$$ 162 1774 -533 -1310 277 -320 -679 795 738 80 278 -347 -717 -190 -450 -5 1201 316 -323 673
1480F73j215j179K079L37j386J887M41l122N54J787k320M94L468j870j956K807
$$ 673 -542 -1721 358 695 -691 1196 1637 -1485 -931 856 -1464 -970 2498 628 -1328 1479
1496A479j210l250L054J750l158J549K638l662j144L142j718j707L721M41k848
$$ 1479 269 -2981 73 1823 -1335 214 2852 -810 -1954 1188 -530 -2237 1484 1925 -923
1511i23J425O27l110N50K413j074O0J909j352j693P94k05m67J528O07o16R4n51
$$ -923 502 1129 -1981 -1431 982 -92 -32 1877 525 -1168 -374 -579 -1046 482 1089 473 567 16
1529A6r11L18M9J54J346o0r61O37n72j784J224J296j319J012J735k393j263J953
$$ 16 -895 -577 -528 -374 972 912 -49 588 16 -1768 -544 752 -567 445 2180 -213 -1476 477
1547D77j128j188L089M97k510J255O64l069N36K603j530k15K616j498k168J887
$$ 477 -651 -1839 1250 1747 -763 492 1156 -1913 -1377 1226 -304 -519 2097 599 -1569 318
1563C18j96k001K074J469j966N19J143k326o09J965m84l89J868l58j684M63n8
$$ 318 122 -1879 195 1664 -302 217 1360 -966 -1575 390 -94 -483 1385 1027 -657 -194 -252
1580b52r46J086R67n51K05l8j113Q5M08l86P00P37q20L4L97j273j03J323n99k32
$$ -252 -1198 -112 855 304 509 471 -642 -557 -149 -535 165 902 82 116 513 -760 -863 460 -139 -371
1600c71J615o53j532J114j8j577J482J336j744J87J363j843p11K108n40j167J899
$$ -371 1244 591 -941 173 155 -1422 60 1396 -348 -161 1202 -641 -1352 756 216 -951 948
1617I48M3k048R38Q74j721M70J592j203l60J418q81j042J195m1q35J097K95j107
$$ 948 991 -1057 -119 755 -966 -496 1096 -107 -467 951 70 -972 223 182 -653 444 739 -368
1635c68L38K89q86M14P27o03J52M60q66p6P77n47r6R06n68n71R51l05q22R94J60
$$ -368 -30 259 -627 -213 514 -89 63 523 -343 -419 358 -189 -285 621 53 -518 433 128 -694 300 460
1656D60j080P05N60j184K97R22j033j32J235p19o51J119l42r18J096K24j149O55
$$ 460 -620 85 645 -539 -242 680 -353 -485 750 31 -620 499 157 -761 335 559 -590 65
1674F5N30j218L19J010r32j24J072p73o75J123j80q09R42J61j064N48N00r73K49
$$ 65 595 -623 -304 706 -226 -350 722 -51 -726 397 217 -592 350 511 -553 -5 495 -478 -229
1693b29P80p18j05Q11n53m17P24k74m79P46pn62N01kp22M74L38o29M02M65q17
$$ -229 551 -167 -272 539 -14 -431 293 19 -460 286 279 -283 218 216 -506 -32 306 -323 79 544 -273
1714b73N1O31p16j11R77m65n19Q92k57q63P84K43r31N88O66r99O8P65q25k44J045
$$ -273 -222 409 -307 -418 559 94 -425 467 210 -653 131 374 -557 31 697 -302 -234 531 -294 -538 507
1735E07l75n50Q74j80q73O46K66p76N20N37q60N7O10o46j16P84l83l49O86k48
$$ 507 132 -418 456 276 -597 49 315 -461 59 596 -264 -207 403 -243 -359 425 42 -307 379 131
1755A31n85O06N1n64M85K28o46K60L80o08R7N22m75p0N26m01k38N79k38l54N55
$$ 131 -454 152 203 -361 124 352 -294 -34 346 -262 -165 357 -118 -188 338 -63 -301 278 40 -314 241
1776B41j31n08N94N7o61M92L19q19K86O37p69m0Q73o26m71R53k30p83Q35J74r40
$$ 241 110 -398 196 253 -408 84 403 -416 -130 507 -262 -302 571 -55 -526 427 197 -586 249 423 -517
1797e17M87N66q85J03P91o48k85P71l34m76O86m1n56M40J31n43K87K50m27K19
$$ -517 -30 536 -349 -246 545 -103 -388 383 49 -427 259 218 -338 102 233 -310 -23 227 -200 19
1817A9K52m64R6K76m03J37M33m39n5M93m78k86P38j98m82P01m0q52N41M10q32
$$ 19 271 -193 -97 179 -224 -87 346 -93 -148 345 -133 -419 319 121 -361 340 300 -552 -11 399 -433
1838d33L33P13p91j85Q07n34m27Q87j10o71O12Q9p45M31L75o41K21M99o30k0N55
$$ -433 -100 613 -178 -363 444 -90 -517 370 260 -411 201 290 -455 -24 351 -290 -69 430 -200 -220 335
1859C35m62j43O43l25l83O02j63m86N74M5n84M57J71o57L45M16o46J51N57o76
$$ 335 -127 -270 373 48 -335 267 104 -382 192 237 -347 110 281 -376 -31 385 -261 -110 447 -229
1879b29j07P70m98l54Q71k91p15P76Q0q51O24M62r22K09O79q11p6Q95n36l71Q29
$$ -229 -336 434 -64 -418 453 162 -553 223 303 -548 76 538 -384 -175 504 -307 -383 512 -24 -395 434
1900D34l19o57P31P0o65N68K37p84K73M36o11J39N73n53q2N11m70j31O53l47k88
$$ 434 115 -542 189 259 -406 162 399 -385 -112 324 -287 -148 425 -128 -210 301 -169 -300 353 6 -282
1921b82O58l46n48Q23o7p79Q03K51j107N06P43j137J22J168r30n17J264m80r69
$$ -282 376 30 -518 305 238 -541 262 513 -594 -88 655 -482 -360 808 -122 -639 625 145 -824
1940h24J219J49j252P84O28j304K74J052r88k15J147o33o80J024j78p79Q12J85
$$ -824 395 544 -708 76 704 -600 -326 726 -262 -477 670 37 -643 381 203 -576 236 421
1958D21q48M48L07p37L44M58n95J64L93o70J06O06o14K4P67p32l42R78m84o05
$$ 421 -427 21 328 -409 -65 393 -202 -38 355 -315 -209 397 -217 -193 574 -158 -500 478 -6 -611
1978f11J160j60j158R78L38j346P43R81j419P3J300j194m95J644o12j102J464
$$ -611 549 389 -769 209 547 -799 -56 925 -494 -421 879 -315 -810 834 222 -880 584
1995E84m7j565J121P42j568N25J227j441k23J455q98p14J459l03j108J072J52
$$ 584 537 -1028 93 835 -733 -208 1019 -422 -645 810 -88 -802 657 354 -754 318 470
2012D70j198P05N62r86L79O83r10QO74o83J8P97n81k10P53o46l75J028m04o25
$$ 470 -728 -23 539 -447 -68 615 -295 -287 387 -296 -278 519 -62 -272 481 -165 -540 488 84 -541
2032e41J080k73j087J096L17j391Q39Q26j615L06J512j372m55J779r91j262J855
$$ -541 539 266 -821 275 592 -799 40 866 -749 -443 1069 -303 -758 1021 30 -1232 623
2049F23K0j675J434O49k110N87J462j569KJ831j180j025J575m63j244J486L62
$$ 623 643 -1032 402 1051 -1059 -472 990 -579 -577 1254 74 -951 624 161 -1083 403 765
2066G65j407P80N71j371L05R13r33R6J000p29k83P32p04l48R62l12l05R90n02
$$ 765 -642 138 709 -662 -357 556 -377 -281 719 -10 -293 439 -265 -613 349 37 -268 722 220
2085B20r33R02j46q72J259M01j440O57O55j619M14J544j345l47J773j071j189
$$ 220 -713 189 43 -829 430 831 -609 48 703 -916 -502 1042 -303 -650 1123 52 -1137
2102a137J868k30j781J550P16j979R24J433j994k17J810j312p36K182m51j566
$$ -1137 731 501 -1280 270 986 -993 -69 1364 -630 -847 963 -349 -1085 1097 646 -920
2118i20J365L1j752J115J118j338L42J003j364l33J157n91k97J138m14o18P12
$$ -920 445 476 -1276 -161 957 -381 -39 964 -400 -733 424 -167 -464 674 260 -358 354
2135C54l63o44Q25r5n10R66l3j019P07L7j228R48R21j265L89J058j685l63J798
$$ 354 -9 -653 172 77 -433 533 500 -519 188 225 -1003 -55 866 -399 -10 1048 -637 -1000 798
2154G98q55q06J948m34j871J442N49j955J052J458j953k1J865j414q78J964o14
$$ 798 -57 -863 1085 651 -1220 222 771 -1184 -132 1326 -627 -648 1217 -197 -1075 889 275
2171B75j505J719L58j727R97Q36j774K28J369j040j78J363p91q52R83k29o62R84
$$ 275 -1230 489 847 -880 117 953 -821 -593 776 -264 -442 921 130 -722 261 32 -630 354
2189C54R7p75N26np54N95K39o80N86L19r55M08N84j112K18J082j011j85J382r11
$$ 354 451 -324 202 197 -557 38 277 -403 183 502 -453 -45 539 -573 -355 727 -284 -469 913 2
2209Br40J499k90j311J493M66j810P70J084j764J80J793j278p75J776o66j406
$$ 2 -938 561 271 -1040 453 919 -891 -121 963 -801 -621 1172 -106 -881 895 229 -1177
2226a177J636K98j662R70Q44j615K64J326j145l12J320p18p58J167j71q65Q73
$$ -1177 459 757 -905 65 909 -706 -442 884 -261 -573 747 29 -729 438 267 -598 275
2243B75J32r40N48L69q01L69M86p06J41M87o64R9O58o26p7P48o61l31R94m26o51
$$ 275 407 -533 15 384 -417 -48 438 -268 -127 360 -304 -205 453 -173 -250 498 -163 -494 500 74 -577
2264e77J042j33j097R29M34j254N67R08j317j1J297r27n74J415m60j131J264J81
$$ -577 465 332 -765 164 598 -656 -89 819 -498 -509 788 -139 -713 702 242 -889 375 556
2282E56j349Q69O97j416K79J177j053k99J265o99q06J176m0r52Q20K62j020M23
$$ 556 -793 76 773 -643 -364 813 -240 -539 726 27 -779 397 357 -595 225 487 -533 -110
2300a10N61p24J65N70o87q1O19l96p2N95m98l88O44j89k97P64j82p97N06J16o53
$$ -110 451 -273 -108 462 -225 -306 313 -83 -155 440 -58 -446 198 9 -288 476 294 -503 3 119 -534
2321e34P06N32r70P2N73q61J5J152n47n91R35l63q96R75K78j049N65O12j017J83
$$ -534 172 704 -266 -194 379 -482 -467 685 138 -453 482 119 -777 198 476 -573 -8 604 -413 -230
2341b30R16q68m18R30l54m42J043o5r83M00J49p29O45P50p26j02L89p33j26R01
$$ -230 686 -182 -600 330 -24 -466 577 512 -471 -71 78 -651 -6 744 18 -84 305 -428 -554 347
2361C47j61k94M97l00n39N20Q6m40L67J00m70M05L15n85M6J97o00K21Q46l14k33
$$ 347 186 -108 389 89 -450 70 156 -284 83 183 -287 118 433 -152 -106 91 -509 -288 558 244 11
2382A1L75o80n61Q84K87l66N81o1j082J95N87m92K86P52o94m06O72l11m80P08
$$ 11 386 -294 -855 29 316 -50 531 470 -612 -417 170 -322 -36 716 22 -384 288 -23 -503 205
2402B05k0o50N96M11o66Q8K40p27M1P99r0p8L55n67n91M29J70nN91l1p14J3R4
$$ 205 185 -465 131 542 -124 -36 204 -523 -482 317 227 149 504 -63 -654 -225 -55 -60 531 500 -214 -201 -107
2425a07k86M09M43m86l5L24m12r0M76l11k93N38Mk65M24r5p30J94L18k34M34M58
$$ -107 -393 16 459 -27 -62 262 -150 -240 236 -75 -368 170 174 -91 333 238 -492 -298 20 -214 220 678
2447F78o76l37K95l37K3Q05n4m90K22j54m91M42L64l84J27K45m18j4L81l25j67
$$ 678 2 -335 -40 -377 -354 451 397 -93 129 -25 -516 -74 290 -94 33 278 -140 -154 227 -98 -265
2468b65L67j22p9M19j21m32J81l7k51M60K91l99K7M9m70J29N06k07m3L15l56l10
$$ -265 102 -20 -99 320 199 -233 -52 -89 -340 120 411 12 39 88 -382 -253 253 46 3 318 -38 -348
2490c48M41l2l01M09O8m81K27K75m45M2L64l45p7M74j69k96K94o6l32L24J57k82
$$ -348 93 61 -240 169 237 -244 -17 258 -187 -145 219 -126 -203 271 102 -194 100 34 -298 26 183 -99
2512i9J51J19l36L2K15j42K3K22j92r2J53j20n5K41q3j18K16j26k05K52K2k20
$$ -99 52 171 -165 -133 82 -60 -37 185 -7 -99 54 -66 -121 120 37 -81 135 9 -196 56 78 -142
2534a42K56M9l97J68K53l15O1L52l41k01M25j37k65M30Km97K47K43l86J55L62
$$ -142 114 163 -234 -66 187 -128 -67 285 -56 -257 168 31 -234 196 198 -299 -52 191 -195 -40 322
2555C22m24j54M15j42j90L91n2m29J72J93k18J55K13k93j60J50QM7J71q4j48n9
$$ 322 -102 -256 159 17 -173 218 166 -263 -91 102 -116 39 252 -41 -201 -51 -43 4 175 91 -57 -116
2577a16m2J34J75r4m2K3k33K7L78j01k08K05j48l01M26K50m05K5J73m40N5O38
$$ -116 -158 -24 151 57 15 38 -195 -168 210 109 -99 106 -42 -343 83 333 -72 -47 126 -314 -259 379
2599C79j92l37L08k11m21N16L65m31L4J54n02J7O09r4k51K03k13l30L96K58k18
$$ 379 187 -150 158 -53 -474 42 407 -24 10 164 -338 -321 288 194 -57 146 -67 -397 -1 257 39
2620C9K8j3l26Q8L36j1l7l0k67n2K52J06P0k2l01r7J61M6J46K01l11l02K29K4
$$ 39 67 54 -272 -184 152 141 104 74 -193 -245 7 113 183 161 -140 -237 -76 -30 116 317 6 -296 -67 -43
2644d3m3M09n4n99J36K64k52K51M15n29l65M59n6j99N73jp31J28L57l24K23N20
$$ -43 -86 323 269 -330 -194 70 -182 69 484 -45 -410 49 -7 -206 367 366 -365 -237 120 -204 19 539
2666E39n09m59L98Lj44M76M7n76mK10j21K04K90k74k81N7kJ49K46j01j75r1j39
$$ 539 30 -429 -31 -28 -172 304 351 -225 -229 -19 -140 64 354 80 -201 -144 -146 3 249 148 -27 -118 -257
2689b57J65L24r4j23N6k99r1N07O3l03J67r9m79L67M96l72q1K82m96j83P24om24
$$ -257 -92 232 138 15 71 -228 -319 188 251 -52 115 16 -463 -96 400 28 -53 229 -267 -450 274 268 -156
2712a56L27p2o12L93N55m51k7L26n55j84P13Kl64K84j13n27L44M31k81J3J33m11
$$ -156 171 99 -513 -120 435 -16 -43 283 -272 -456 257 259 -105 179 66 -461 -117 314 33 46 179 -232
2734b32r6M41K3q9J05k09k44K34J41K1Q3j70k22J18O7L2K48j45l58J76J01k34
$$ -232 -328 113 136 47 152 -57 -301 -67 74 95 178 8 -214 -96 -29 3 251 106 -252 -76 25 -209
2756b09L64K35o01p4M67l13p0O69k83o50M75J71n23M25M41p48j19N75l59j36P01
$$ -209 155 390 -211 -285 182 -131 -201 468 185 -465 10 181 -342 83 524 -224 -343 232 -127 -263 438
2777D38k28o26M13J38m56M14L40o12o0M29k96j03N21j64l74K26M9k01K24J18k30
$$ 438 210 -416 -3 135 -321 93 433 -179 -239 190 -106 -209 312 148 -226 0 49 -152 72 190 -40
2798d0%lo4J94J4j89J41k4k61K44K33l78M6K93l51q7M84j95k86M05r3m34M63J58
$$ -40 -40 -43 -107 87 101 -88 53 29 -232 12 245 -133 -87 206 -145 -232 252 57 -229 176 83 -351 112 270
2822B70n58K81L31o12Q3O45n15k97P20k12o07O21K00p27K94M81n89m0N56l32k75
$$ 270 -288 -7 324 -288 -205 440 -75 -372 348 136 -471 150 350 -377 -83 398 -191 -231 325 -7 -282
2843b82M61r0k87L20m9k94K67J01k89J88R5l48J27K66k33J8J86k64m7K37r9N7
$$ -282 179 89 -198 122 73 -221 46 147 -142 46 141 -207 -80 186 -47 -29 157 -107 -154 83 -16 41
2865D1J85l47j24L59j68j24N67j97o38M13K54n78L38N84o78k73O07k64l02O51
$$ 41 226 -121 -245 114 -54 -178 389 192 -446 -33 221 -357 -19 565 -113 -386 221 -43 -345 306
2885C06n0o09L32K22m49L24K87o30J4M73l28QN90m02n70M47R2l09M98K41o25j54
$$ 306 256 -353 -21 201 -248 76 363 -267 -253 220 -108 -100 490 88 -482 -35 57 -252 246 487 -138 -292
2907b92K46j35J65L41k01j63J2k23J68L62k66j56K80k53j49O15m2o00J78R5l15
$$ -292 -46 -181 -16 325 124 -39 -27 -250 -82 280 14 -142 138 -115 -264 351 309 -291 -113 -18 -333
2928c33M51M76n16k32J13m48J77P93j53l46K93m68n56P77M05n50K36K70p67k1
$$ -333 118 594 78 -154 -41 -489 -312 481 328 -18 275 -193 -749 28 433 -117 119 389 -378 -399
2948c99P60k90l50M19j19l09M98J47m51J6q3k80M86M44k88m8j07o24Q2P42L7q3
$$ -399 361 71 -279 140 21 -288 210 357 -94 -78 -161 -441 45 489 201 153 46 -578 -496 246 283 200
2970B00J83m65m56L52K43l0K75j18m31K17J20k56K57J04n97K03O26l00j50L38
$$ 200 383 -82 -538 -186 57 27 302 184 -247 -30 90 -166 91 195 -402 -199 427 127 -23 315
2990C15n33n21P17L64k51L21o2q55j9M84l9L11L89o12l81L37j85p1O64j10n61
$$ 315 -218 -739 -22 342 91 412 350 -505 -524 -40 -79 232 621 9 -372 -35 -220 -291 373 263 -298
3011b98L53J78m57J82K57m93m3N32n6k2J68m14l46K70J03J82M55k82n42R2j2k01
$$ -298 55 233 -224 -42 215 -278 -321 211 155 133 301 -113 -459 -189 -86 96 551 269 -273 -181 -193 -394
3033c94N83L39n26q0J88l82K4N13k12k25L32j16k07M02j26m79K88J69l02M08L11
$$ -394 189 528 2 -78 110 -272 -248 265 53 -172 160 44 -163 239 113 -366 -78 91 -211 197 508
3054E08o68j61L80l20JP22j17n28J98n4l63L86L12l11O5J05l31L8K98k64l0L21
$$ 508 -160 -321 59 -261 -260 462 345 -183 15 -39 -402 -16 296 -15 50 155 -176 -138 160 -104 -134 187
3076A87k14j19M04j78l49K62L8k29L35J60l76J1P9k53J62L17k42OK06l59j00M59
$$ 187 -27 -146 258 80 -269 -7 31 -198 137 297 -79 -68 11 -242 -80 237 -5 1 207 -152 -252 207
3098B07j59k64M20m8m55L53K16m83J00L40l37k8L92k51k34L49j08k08L65j6l49
$$ 207 48 -216 204 156 -299 54 270 -213 -113 227 -110 -138 254 3 -231 118 10 -198 167 151 -198
3119a98K11J18l51K12K94l88n3L09k19j02L57j12k51K18j1j64K04K6k21J21N0
$$ -198 13 131 -220 -8 286 -102 -155 154 -65 -167 190 78 -173 45 34 -130 74 100 -121 0 50
3140E0j85J97J21l10L5K01k49P0L59k38k45K51j02j65L82M5l33J35M7l31K50L04
$$ 50 -135 62 183 -127 -92 109 -140 -70 289 51 -194 57 -45 -210 172 217 -116 19 66 -265 -15 289
3162B89l64J6K75l54r6N11j76l60L50L0l73L01K47m13l3K43k24K5L73j31k30J14
$$ 289 -75 -59 216 -138 -234 277 101 -259 91 121 -252 49 296 -117 -150 93 -131 -106 267 136 -94 20
3184B0j40r7L46O0j96P7q5k42K18K09j82N6O9k70M7K43j34j6J36k33o5L34o0j78
$$ 20 -120 -217 129 189 -7 70 -15 -257 -39 170 -12 44 113 -157 -110 133 -1 -17 119 -114 -179 155 95 -83
3208h3K18j38l36L44K27k79R0J55m11o0M35j05r9K70k06l13K87J06j78K08K8l83
$$ -83 135 -3 -339 5 232 -47 43 198 -213 -273 162 57 -42 228 22 -291 -4 102 -76 132 160 -223
3230b23J25K49k26N8K65l39j65L45j9j63K75p7l53J51J77j14J21P7k93j4J46p3
$$ -223 -98 151 -75 -17 248 -91 -256 89 70 -93 182 105 -248 -97 80 -34 87 164 -129 -143 3 -70
3252g0R6J94k39j39J90j07k5L01q4k90J49L4j59K41J20l25N2J30k26J00L15k52
$$ -70 26 220 -19 -158 32 -75 -100 201 117 -173 -24 10 -149 92 212 -113 -61 69 -157 -57 258 6
3274Fj69K80j71j69L92M8l88J36J37k78J30K97k34j58J92j18p4K86l0j84J05q0
$$ 6 -163 117 -54 -223 169 217 -171 -35 102 -176 -46 251 17 -141 51 -67 -141 145 115 -69 36 -44
3296d4j26K24P5j89R1L0k60J32K44j80n4J74j96q9K86m8j63J93q0k28K31J16k23
$$ -44 -170 54 129 -60 31 61 -199 -67 177 -3 -57 117 -79 -168 118 70 -93 100 20 -208 23 139 -84
3319h4J08J13l21M1L17j66p7K28j82j98K60N0j62J74kk69J14J49j72J10J40k73
$$ -84 24 137 -184 -143 174 8 -69 159 -23 -221 39 89 -73 101 99 -170 -56 93 -79 31 171 -102
3341a02k9K36j23o0K43j42k03K15M3j87J67P6k47M8J31j16N7J47j97n9J64j24
$$ -102 -131 105 -18 -78 165 23 -180 35 78 -109 58 134 -113 -65 66 -50 7 154 -43 -102 62 -62
3363f2J2K10j42j66J88k7j65K37M9k76R3J38k24R2K48k55q8K42j36j22L09l9k92
$$ -62 -50 160 18 -148 40 13 -152 85 134 -142 -49 89 -135 -43 205 -50 -138 104 -32 -154 155 116 -176
3386a76K02P3k79J44K47k70l2J93j57o3K40n9j61J32k6j16J51L0j45R1K3j56J05
$$ -176 26 99 -180 -36 211 -59 -91 102 -55 -118 122 63 -98 34 8 -108 43 73 -72 19 42 -114 -9
3409iJ02j55L9J25j96K4J90j31o8J85j24j33K32qj97J68M3k44J39J59k20K0K07
$$ -9 93 -62 -23 102 -94 -70 120 -11 -79 106 -18 -151 81 73 -124 44 87 -157 -18 141 -79 -59 148
3432A48k32n1K67j11j61K44n3k36K13J05k52J09J60k55PK26j50q4K40j05j81K00
$$ 148 -84 -135 132 21 -140 104 51 -185 28 133 -119 -10 150 -105 -98 128 -22 -106 134 29 -152 48
3454D8K7j80J44N6j85O6J24j38J3J20j25j0J09j03k0J49q9o8J14o6o2J51m3j39
$$ 48 75 -105 39 95 -90 -24 100 -38 -25 95 -30 -40 69 -34 -54 95 6 -62 52 -14 -76 75 32 -107
3478a07J64Oj89J55R0k47Q7J99k32m5K85j63j89K89j8k51K10R8k76Q2J78k12J2
$$ -107 57 63 -126 29 119 -128 -41 158 -74 -119 166 3 -186 103 85 -166 44 142 -134 -52 126 -86 -74
3501g4K11j57p3J91j11j27J96J3j73J41N4j96O6J43j57mJ30p0m6R5n8k9P1o3q
$$ -74 137 -20 -93 98 -13 -140 56 69 -104 37 91 -105 -39 104 -53 -57 73 3 -43 52 -6 -35 36 -27 -35
3526c5J13p9n8J42p7j51J86M6j85J10J10k20J3J80j61l2K27j09j36K06q8j85K33
$$ -35 78 -1 -59 83 6 -145 41 87 -98 12 122 -98 -85 95 -66 -98 129 20 -116 90 2 -183 50
3549E0L7k39J68J68k90kK48k03j08L11m0k15J69L4k23N7J33r6N8Q5j30k0O3j06
$$ 50 87 -152 16 184 -106 -108 140 -63 -171 140 100 -115 54 88 -135 -78 55 -41 17 102 -28 -48 15 -91
3573i1N2J34q5m7J21r9r6J14J8q3J22%j08Q3j4j25J05O2j52J19J32k38k3K28j88
$$ -91 -39 95 10 -37 84 -15 -111 3 21 -62 60 60 -48 35 21 -104 1 63 -89 30 162 -76 -99 129 -59
3598e9j18L11k2k51J88O2k76P1K11j61j4J89j39q4J62j03j15K18Jj69J67L4k48
$$ -59 -177 134 112 -139 49 111 -165 -94 117 -44 -58 131 -8 -92 70 -33 -148 70 71 -98 69 103 -145
3621a45P4J66j79J0K23j00j36J02k8q1J11K3l3N8o2q7J10k9j04J83M6k06Q7J05
$$ -145 -71 95 -84 -74 149 49 -87 15 -13 -94 17 40 7 65 3 -84 26 -3 -107 76 122 -84 3 108
3645A08k08OK17j39n5J92r4j37J71l8j34J76K5k09J44J23k72N3K19k07q1K99r2
$$ 108 -100 -94 123 -16 -71 121 27 -110 61 23 -111 65 90 -119 25 148 -124 -71 148 -59 -140 159 67
3668F7k13K01L4k20Q6J42j31J3J12j45j6J13q2K1R4r5l4J36j03j07J90lj58J21
$$ 67 -146 55 89 -131 -45 97 -34 -21 91 -54 -70 43 -39 -18 76 -19 -53 83 -20 -127 63 60 -98 23
3692B3N2j47O0R3j47L3R6q9J2J04j52k4J92j12j08K38o0k26J78J07k47Q9K19k19
$$ 23 75 -72 -12 81 -66 -33 63 -26 -14 90 -62 -86 106 -6 -114 124 64 -162 16 123 -124 -35 184 -35
3716c5q7J99p7r0J79m4j31J11Rj34J42M6j61O7R2j89L6J87j32p0J63p8r2J29L
$$ -35 -122 77 0 -90 89 45 -86 25 34 -100 42 88 -73 -6 86 -103 -67 120 -12 -82 81 3 -89 40 43
3741D3j07P3Np1R0Lj18J22J4j86J15J43j79rJ81j46j01K20j2j76J33M0j84Q5J26
$$ 43 -64 9 14 -57 33 36 -82 40 54 -132 -17 126 -53 -62 119 -27 -128 92 80 -96 37 77 -107 -22 104
3766A04j43M9R2j93nJ75p9m8J82j20j66J74M7j63J14J09j81j2J24p6j4J09p9n7
$$ 104 -39 10 102 -91 -96 79 0 -48 134 14 -152 22 69 -94 20 129 -52 -64 60 -16 -30 79 0 -57
3790e7Q2m0jJ15j07r1J24qj02J67L4j96L9Q5j32N2J76j10r3R8q9m8J74l2j08J15
$$ -57 25 -15 -16 99 -8 -99 25 17 -85 82 116 -80 -41 44 -88 -36 140 30 -63 35 -54 -102 72 40 -68 47
3816D7J6j69J18J02k02J8J76j45j7K16q9j91R5Qq4J77R6j51n8rr2Q1J61n6JL0
$$ 47 63 -106 12 114 -88 -70 106 -39 -56 160 71 -120 -25 -17 -101 76 172 21 -37 -46 -138 -57 104 48 49 79
3842G9j90k8J88k6m6J03o4j27J22N6j09L0K3q5P7J22r8k4K8j73pK33Km8P7j27
$$ 79 -111 -139 49 23 -23 80 16 -111 11 67 -42 -12 11 -74 3 125 27 3 31 -142 -149 84 86 38 115 -12
3868a2k21J65J46q4Q0N6k17k9J48m6j6J24j06p4J45kr5R3n0j97J57J84r0nM5k25
$$ -12 -233 -68 78 -6 74 130 -87 -116 32 -14 -30 94 -12 -86 59 57 -38 55 5 -192 -35 149 59 54 99 -126
3894a26p7K11O3j1Q7j02j94M1N6M6J32pj77JL0m0R0P9j53l0J19m1J9Q5j15j24
$$ -126 -203 8 71 60 147 45 -149 -108 -52 -6 126 119 -58 -57 -27 -67 23 102 -51 -81 38 -3 16 101 -14 -138
3920a38R2M6J4J40m1k32J6O8o3J63J55k14j33J27o5l3K17kj88M2N6j10J05R4j71
$$ -138 -46 0 14 154 113 -119 -103 -35 -98 65 220 6 -127 0 -65 -98 119 117 -71 -29 27 -83 22 116 -55
3945e5k8R1m7N5J44j33j53R1Kj7J71L0j91m1M7n4J06J16p2q9k6l8P2J15m7o6K1
$$ -55 -83 8 -39 16 160 27 -126 -35 -33 -50 121 151 -40 -81 -34 -88 18 134 62 -27 -53 -91 -19 96 49 -17 4
3972Dp0j0J69l4j07M5k0p4J16J10j27n0L5q2M6J82p6j06O6n8q4K05N1j73L3N6
$$ 4 -66 -76 93 59 -48 -3 -23 -97 19 129 2 -48 -13 -95 -49 133 57 -49 17 -41 -125 80 131 -42 -9 47
3998D7j62P2J87q9j19P2l4o7J52N3j27k0J4n8R0O5o2m2J1n5N0J01l0p7K1n9mJ33
$$ 47 -115 -43 144 55 -64 8 -26 -93 59 112 -15 -35 -21 -79 11 76 14 -28 -17 -72 -22 79 49 -28 -7 -66 -70 63
4026F3K7o5k5o1m3J26N2o5J8k5j20Q4J44j00l2Q3j22o4K07J8j40M2mj31J22J65
$$ 63 90 25 0 -61 -104 22 74 9 27 2 -118 -34 110 10 -22 61 -61 -125 82 100 -40 2 -2 -133 -11 154
4052A54j22p5O0j13jJ97Oj17K8m1j01J14J27p8k7jr1K3J31mm8l2o8K3J19mrqj18
$$ 154 32 -43 17 -96 -97 100 106 -11 17 -24 -125 -11 116 38 11 10 -81 -58 73 69 21 -11 -79 -56 63 59 50 42 -76
4081g6l6J41O0n7M9q1j55R8J48m3RRj56m0J80K2o8Q1q2j66J39J00o8M7J7j96m
$$ -76 -112 29 89 32 81 0 -155 -57 91 48 57 66 -90 -130 50 72 4 85 3 -163 -24 76 8 55 72 -124 -128
4108a28K12j7m4N1j25j13J54R0l9L8l8j71M5J40k4L2K4j61n2J35M5MM7j09j09
$$ -128 84 67 23 74 -51 -164 -10 80 41 79 41 -130 -85 55 31 63 87 -74 -126 9 54 58 105 -4 -113
4133a13O2Q2K3M4o7j14L7K8J7J00jj77QO5l7P7J33j61j33J16Rl6J61J2k47L7J21
$$ -113 -51 31 54 98 31 -83 -46 -18 -1 99 98 -79 -71 -6 -43 34 167 6 -127 -11 -2 -38 123 135 -112 -75 46
4160D6r5N5J70j80j25J20J7n4J51Mk12J5R9l6N5O8j03r3P0kL7P7l6r3J1j2K2J26
$$ 46 -49 6 176 -4 -129 -9 8 -46 105 109 -103 -88 11 -25 30 98 -5 -98 -28 -30 7 84 48 -45 -34 -46 -24 102
4188A02l1j12J8%n3J45M3j23j7N0r2M6J42q2p8O9o4m3J52J9j23L1J4j06Q9J22
$$ 102 71 -41 -23 -23 -76 69 112 -11 -28 22 -70 -24 118 36 -42 27 -37 -80 72 91 -32 -1 13 -93 -4 118
4214A18j13l2P5r7j6J51n3q6J07m6j21J31P9j25K2P0j29PJ54o3q4R1k6r5R1M0
$$ 118 5 -27 48 -49 -65 86 33 -53 54 8 -113 18 97 -28 -6 64 -65 -58 96 33 -51 40 14 -81 10 50
4240E0o0K0K8o8OM3j5K9j0q7N6M8o9L9O2r5k9J04n0n9J38l1j35R4M3j20P2J01
$$ 50 -10 10 38 -30 -24 19 4 33 23 -64 -8 40 -29 10 72 -23 -52 52 2 -57 81 50 -85 9 52 -68 4 105
4268A05j46k8J41r3o0J50j6j42R2L7j05N8R6j04k6O1l8j3P5l9l1L6m2j1Q5j7n3
$$ 105 -41 -69 72 -21 -81 69 53 -89 3 40 -65 -7 89 -15 -41 20 -18 -31 44 5 -26 10 -32 -43 42 25 -28
4295b8N5j9q2R0N6q6J7M0r3J8J06n6l9O3o9l3J14k1n5N6qr4O6O8q4L3M1j07qJ34
$$ -28 27 8 -74 16 72 -14 3 43 -50 -32 74 18 -21 42 -27 -60 54 33 -22 34 26 -68 -2 66 -18 15 56 -51 -59 75
4325G5l6o2O8n0o2R1L3r3O9K3j39K1J25o3j8R7r6q4J25K9p4L6J2r1K7P0k2j4J5
$$ 75 39 -23 45 -5 -67 24 57 -36 33 56 -83 -62 63 0 -18 79 -17 -101 24 53 -21 15 27 -64 -37 33 11 -3 12
4354A2n3K0L5pL2oq8LP5qmP6r1r4J01K8o9Q3L3j51K8R6p9kJ11q9p3J21J6q3O6
$$ 12 -41 -21 14 7 39 33 -55 -52 23 15 11 87 -4 -98 3 31 -38 45 78 -73 -45 51 -28 -30 81 -8 -81 40 56 -27 39
4385C9j5j22O6J09l2k1L5j14l8J00K1MO1p2r1L1K5RN4nj02K7N3l6K0L1q5j0P8
$$ 39 24 -98 -32 77 45 24 59 -55 -93 7 28 32 93 21 -70 -39 -14 -5 49 44 -58 -31 22 -14 6 37 -48 -58 20
4414B0J7jJ5p3p9N1N8L1Q4o9j39RO1k2J06N0j29m2O7o2QJ24n2r7O8M3o5O9J5j57
$$ 20 37 36 51 -22 -101 -50 8 39 123 54 -85 -76 -15 -37 69 119 -10 -52 15 -47 -39 85 33 -64 4 47 -18 51 66 -91
4444i1k0J29OK9P3j27j32O8N5J7R0J7j47n3K5J2Q3N8n5n9jqM7J3l4n2L2KN0O8
$$ -91 -111 18 24 53 126 -1 -133 -65 -10 7 97 114 -33 -86 -61 -49 34 92 37 -22 -23 -31 16 29 -5 -57 -25 -23 27 95
4474I5o1j18J5MK5J41N3j35q0j0l9J03J37k7j18J3o5k1J29L8r1J7J8o6M4J01r1
$$ 95 34 -84 -69 -65 -40 101 154 19 -61 -71 -110 -7 130 103 -15 -2 -67 -88 41 79 -12 5 23 -43 1 102 11
4501A1p3L6qL3J26l3j42l3K0J3J08P5p8r0k5k7O0J10Qo6k9n5NQ1K5l9k2l0j1R2
$$ 11 -62 -26 -34 -1 125 92 -50 -83 -63 -50 58 133 55 -35 -60 -87 -27 83 91 25 -4 -59 -54 27 52 13 -9 -39 -50 42
4531D2K7n5j6m4n6J04R8m6m3j6r4rJ61M5o5Jo2q5R0R2k3l0Lp4oJ22qn5L4o5m1
$$ 42 69 14 -2 -46 -102 2 100 54 11 -5 -99 -108 53 98 33 34 -28 -113 -23 69 46 16 19 -55 -61 61 53 -2 32 -33 -74
4562g4J06N5n4k8k0o5N8R2j2m9k0n0mQ4L5j3np1l8O3N2njm4p6M3P6njkq1KP4q
$$ -74 32 87 33 5 -15 -80 -22 70 58 9 -11 -61 -65 19 54 41 36 -35 -73 -10 42 37 36 -8 -84 -41 35 30 29 27 -54 -52 22 14
4596A4QK6o3o1O7K8j6M2k2j18M9R0k2rM5r4o1J07M2l6L9j8r4J1P9k0K9J3o5m3
$$ 14 22 48 -15 -76 -9 19 3 45 23 -95 -46 44 22 13 58 -36 -97 10 52 16 55 37 -57 -46 33 13 42 55 -10 -53
4626e3P1NoOl6k9L8L4k0J1l4m9M6K2mN3j0r3pN1nK5N4p1n9M6K8l6N6J2o9RM3l4
$$ -53 18 23 17 23 -13 -42 -4 30 10 21 -13 -62 -16 6 2 55 45 -48 -55 -4 -9 16 70 -1 -60 -14 14 -22 34 46 -23 -14 29 -5
4660ePL3n1k8O3Qj9M0l0q7M3N3k6L1K9q9j7N6k0J1N0l1m8M0rk0N1%p6L5K6j4J1
$$ -5 2 35 -16 -44 19 27 8 48 18 -69 -26 27 1 32 61 -28 -45 11 -9 2 52 21 -27 13 4 -16 35 35 -41 -6 20 6 17
4693A7J5n7j1N1j3QK4l2m4L7j3j1P3k8n2K9J0m0M1M5o7j1O7n3j5P2k5m9M8Oo5
$$ 17 32 -25 -36 15 2 10 34 2 -42 -5 -18 -29 44 16 -36 -7 3 -37 4 49 -18 -29 38 -15 -30 42 17 -32 16 22 -43
4724d3N4K7o5NM0m2J5M8m1k9N2j5l3M5km1L8kl0K1K9k6j9K7l8K3L7l6lK9k6k8
$$ -43 11 38 -27 -22 18 -24 -9 39 -2 -31 21 6 -27 18 16 -25 13 11 -19 2 31 5 -14 13 -25 -2 35 -1 -4 25 -1 -29
4756b9M9j3k7N0Jo4J9L3l9J5M4n1j3M9l8j0N9k1n1M1nm7N9K4n4J2K3m7K1O1m0
$$ -29 20 7 -20 30 31 -33 -14 19 -20 -5 39 -12 -25 24 -14 -24 35 14 -37 4 -1 -48 11 35 -19 -7 16 -31 -10 51 11
4787A1k2L3k2k9M9J0o2M7Ln4L8L7l8j2L5m8RN3l2k3K8pl1N7Pn2J6kl1M5L2l4j5
$$ 11 -11 22 0 -29 20 30 -32 15 18 -36 2 39 1 -11 24 -24 -15 38 6 -17 11 4 -27 30 37 -15 1 -1 -32 13 45 11 -4
4820dPm3J6O2j3j8Rl3k5O7Ll2K0lo4L7M9m2QJ6o5pQ0Ok8K1k9m3M1M2k6lJ2n0J
$$ -4 3 -40 -24 38 25 7 16 -17 -42 25 28 -4 16 13 -51 -14 35 -7 1 17 -48 -55 25 31 3 24 -5 -48 -7 35 9 6 18 -32 -31
4855c1M8J1j8K2o6mO9jj3Ol7l2M6K6k2K2mp1OO8j5KK5o5l0O8J1j6J8j4o8L0N9
$$ -31 17 28 10 32 -34 -38 31 30 17 23 -14 -46 0 26 4 26 22 -49 -43 25 10 12 37 -28 -58 10 21 5 23 9 -59 -29 30
4888C0j6PJ5o8pL4OK2K3m2o8M9J9KL9k1p5K2M2j8J9K6o5j7M7mJ5K9k6o7K9M3j4
$$ 30 14 21 36 -32 -39 -5 1 23 46 4 -64 -15 4 6 45 24 -51 -29 13 -5 14 40 -25 -42 5 1 16 45 19 -48 -19 24 10
4921A0L1j3p4RL2K0J2J0n8j9L1pL3L2m4n1K8N%O7k0p9J0L1k5N4K9p6k9M7nlN3
$$ 10 41 28 -46 -37 -5 15 27 37 -21 -40 -9 -16 17 49 5 -46 -18 -13 -13 54 34 -45 -35 -4 -29 25 54 -22 -51 -4 -9 -12 41
4954D1pp5RK1nL8K2o4j8K9%J2L8m0l8J6%J0N5rn7jjjO0L4p8k0J8j5K8O7m5n4K7
$$ 41 34 -41 -32 -11 -16 22 44 -20 -38 -9 -9 3 41 1 -37 -21 -21 -11 44 35 -22 -23 -24 -25 35 69 -9 -29 -11 -26 2 69 24 -30 -3
4989cmk2O2J6o3lQj8K4M4m1k3lj8L6N1k2m6MrJO6Jn4J9om2N2N3n0k1K5m6KP5k6
$$ -3 -7 -29 33 49 -14 -17 -9 -27 -3 41 0 -23 -26 -44 -8 43 21 -25 -21 -30 -29 37 38 -16 3 -3 -45 7 60 10 -11 14 -32 -30 45 19
5025A9n7K7Qk1L7M2n9k8K8k7K2O2k4k8j4j8pO7nk4Lj4k7N1J8m6J7Nk1qN9j8l3
$$ 19 -38 -11 -3 -24 13 55 -4 -32 -4 -31 -9 53 29 1 -13 -31 -38 29 24 0 3 -11 -38 13 31 -15 2 7 -14 -22 37 19 -14
5058a4L1l7j3N4K5m5nrl8M2N0k6k5J6m1kM1MpJ7l3j5L7Qk1Pnl5L6L4k9jK1n5L
$$ -14 17 -20 -33 21 46 1 -4 -13 -51 -9 41 15 -10 6 -35 -37 4 8 1 18 -15 -30 7 15 -6 1 -4 -39 -3 31 2 1 22 -33 -30
5093c0O4%m1L3j4o3L7M8k4JJ7n5%L9%k4J7j0j3K4%Nrj4j2K7J8nOk2l6J8M1j3m
$$ -30 34 34 -7 26 12 -51 -14 34 10 11 28 -27 -27 12 12 -12 5 -5 -18 6 6 11 2 -12 -24 3 21 16 22 0 -36 -18 23 10 6
5128FK5n2j8L1K0k3L1pm3J3K9k1KL2l6k3M7lk3K9j8l5L5K1k9J6J1l0PJ4j4J7K9
$$ 6 31 -21 -39 -8 12 -11 20 13 -30 -17 12 -9 -7 25 -11 -34 13 10 -13 16 -2 -37 -2 19 -10 6 17 -13 -6 8 -6 11 40
5161D0l5k9K5Qj1K2Jm6J9J8j6QK1l4mK9k6PK4k8pJ9mMNlk6RK6j9Qlj6RL4l5jL1
$$ 40 5 -24 1 9 -2 20 21 -25 -6 12 -4 4 25 -9 -13 16 -10 -3 21 -7 -14 5 1 5 10 7 -19 -10 16 -3 5 2 -14 -5 29 -6 -7 24
5199B4j1l6L2j3k4M3Om0J8J6m2QM0k4k8N3j4k4L0J0l5J2J9k7J4J7l8kL0j1pJ4
$$ 24 13 -23 9 -4 -28 15 21 -19 -1 15 -27 -19 21 -3 -31 22 8 -16 14 24 -11 1 20 -7 7 24 -14 -16 14 3 -4 10
5231A0j4%K0j4j5K3j1kJ1J6l0OL1m8J8J5k2rL3k4j4L5Kl2RQj5K3J1k8kJ0opK3
$$ 10 -4 -4 16 2 -13 10 -1 -3 8 24 -6 0 31 -17 1 16 -6 -15 18 -6 -20 15 17 -15 -6 2 -13 10 21 -7 -9 1 -5 -12 11
5266A1j0JMj8j1M2kk3RJ1k8J6M0n7JL6k8RL0j6l1L5ln8M7L0k4k3L2m9J0L4j9m
$$ 11 1 2 6 -12 -23 19 17 -6 3 14 -14 2 42 -15 -14 22 -6 3 33 17 -14 21 18 -40 7 37 13 -10 22 -27 -17 17 -2 -6
5300fJ1lj3QooJ8orL5qk2J2j5k6M0L7k5oJ3k6m9O9j1j3L7oo2J9L8m1J8M0l1j3
$$ -6 5 2 -11 -3 -9 -15 3 -3 -12 23 15 -7 5 -10 -36 4 41 16 10 23 -3 -52 17 6 -7 30 24 -38 -19 19 -22 -4 36 5 -8
5335hL9j7m8K9Lj3K3K5k6oJ4k9PJ4Qj0K3k7k5K6Nj2L3ml1J4nk3J3K9k3QK0l1R
$$ -8 31 14 -34 -5 -2 -15 8 33 7 1 15 -14 -7 7 15 5 28 1 -24 2 7 -5 28 24 -7 7 2 -21 -8 21 -2 6 26 -5 4
5370Dnl4J2M5j7OJ8l5m0N6Om7N1K1m7LL9o3kO5j1n7N3qm2K4J7n3M6L7l5k2L1j5
$$ 4 -1 -35 -23 22 5 11 29 -6 -46 10 16 -31 20 41 -6 -3 36 -27 -29 36 25 -32 21 13 -29 -5 12 -41 5 42 7 -15 16 1
5404Ak7L2J5k3J1J0j8k0J7J0J1oJkk1mL3Lo3O8Nn1J8K5m2rN8k7l5N8Jp7L3M2n9
$$ 1 -26 6 21 -2 9 19 1 -19 -2 8 19 13 14 12 -9 -13 20 23 -40 28 33 -18 0 25 -17 -26 32 5 -30 28 29 -48 -15 27 -32
5439c2J0O3p1j7P6j1o0O3Ln6L4L0m0j1N2m2qL3Rk5Rj3rJ3RlNkj8J6j2nL4j7k8
$$ -32 -22 41 -30 -47 29 18 -42 21 24 -32 2 32 -8 -19 33 -9 -17 16 25 0 9 -4 -13 0 9 6 11 9 -9 7 -5 -10 24 7 -21
5474b1J2Rj0L7J2n2J9J6l5QN2n2j2M0j1n0O0J1o2K4L9o0JP8m7n1N5Rm6M1J3n4
$$ -21 -9 0 -10 27 39 -13 6 22 -13 -5 47 -5 -17 23 12 -38 22 33 -29 -5 34 -26 -25 53 6 -45 10 19 -27 14 27 -27
5506b7%M8l3lN0qm5J9prJ9J6pk2J1J3oj5J1J1k8JM3j7l9N1j3n4L2N1n5NL6m3l3
$$ -27 -27 21 -12 -15 35 27 -18 1 -6 -15 4 20 13 -9 2 15 9 -6 5 16 -12 -11 32 15 -24 27 14 -40 -8 43 -12 -7 29 -14 -47
5541d7Q0rn1N7Op5K7N6n7J0M9m1l8O0Ro9M8Rm5J7L6l4k3L2qk0J9K0j8J0j1j0%
$$ -47 33 24 -27 30 36 -39 -12 44 -13 -3 46 5 -33 27 36 -33 15 24 -21 -4 32 -2 -25 7 -1 -21 -2 18 0 10 -1 -11 -11
5574a1J2J3Qk4lJ0j2mL5j4k9L0lk5L1J8m3pM7m4J2M9l2n8M7K3n4L2L2n8KM1m5
$$ -11 1 14 22 -2 -5 5 -7 -11 24 10 -19 11 8 -17 14 32 -11 -18 29 -15 -3 46 14 -44 3 26 -28 4 36 -22 -20 21 -24
5607b4j2O0Jm8L6ll1J6M9n8j4L8rj6K1Ok4NJ0j7J0NPj2pOMJnJ3j4pK4Kl3K7K4
$$ -24 -36 24 25 -23 13 10 -21 -5 44 -14 -28 10 1 -15 6 12 -12 -7 3 -14 -4 1 8 -4 -11 -5 -1 0 -5 8 -6 -13 11 13 -20 7 31
5644C1o5K8L5m1jL9l0l7N3J3m9L4L4o6LM9m9qN6k7l9L4J0k9K9J5m1%M1l0qL2j2
$$ 31 -34 -6 29 -12 -13 26 -4 -41 12 25 -24 10 44 -22 -19 30 -19 -27 29 2 -37 -3 7 -22 7 22 -19 -19 22 -8 -16 16 4
5677Dk3K7lk6K2J7k3pQ%MMjjkjK2j4k1K7Nl2J3K2l4RK9l5lK4J1m1K7J7l9RL9m4
$$ 4 -19 8 5 -21 1 18 -5 -12 -4 -4 0 4 3 2 0 -1 21 7 -14 13 18 -14 -1 21 -13 -4 25 -10 -13 11 22 -19 8 25 -14 -5 34 -10
5715a0nM1j5k8L9rl1J8J6m5K7K8l6pL1j4j2K4Lk5MJ0j5MJ6j4LQoLqL%nJ1lmrK2
$$ -10 -15 26 11 -17 22 13 -18 0 16 -29 -2 26 -10 -17 14 0 -12 12 15 -10 -6 4 -11 -7 9 -5 -2 6 0 3 -5 -2 -2 -7 4 1 -3 -12 10
5754A0qj3J1J8k9J0J0jk7L9j4k2K9Rm5J5K0j4j7K3J4l7K6J4m5K5L4l6lK4k0j6
$$ 10 2 -11 0 18 -11 -1 9 8 -19 20 6 -16 13 22 -23 -8 12 -2 -19 4 18 -19 7 21 -24 1 35 -1 -4 20 0 -16
5786a6L3ol2K3Mk1J9LjpJ0pj7J3NkppJ4OnnQNj9K%rJ9J2k6J9Ok9J6Qj7OQoqK6
$$ -16 17 11 -21 2 6 -15 4 7 6 -1 9 2 -15 -2 3 1 -6 -13 1 7 2 -3 5 10 -9 -7 -7 -16 3 15 -11 8 14 -15 1 9 -8 -2 6 0 -8 18
5828A8k0k0K5nj5J6Ok4JL4k5J0K5j6l4L2mj9J6Rj3KJ7j1j2K2k1k1M2k1OMJ4l4
$$ 18 -2 -22 3 -2 -17 -1 5 -19 -18 16 -9 1 26 10 -24 8 4 -15 1 10 -3 -1 16 5 -7 15 -6 -27 15 -6 0 4 18 -16
5862a6nK8j0J0J1nj5j4J1kPRpnoPMOk%Pj2RNl0J5Qk3K2J8j5j9J0pk3L9Qj8NRl6
$$ -16 -21 7 -3 7 18 13 -2 -16 -5 -7 0 9 2 -3 -9 -2 2 8 6 6 13 1 10 15 -15 0 8 -15 7 25 10 -9 1 -6 -29 10 18 0 5 14 -22
5903b2J7K4k5pL3j3k2K0lk0J4J8k2K3J8l5njJ0rL6qk8J0j5j1J5J2%K4k3j7pOL
$$ -22 -5 19 -6 -13 20 7 -15 5 2 -18 -4 14 -8 15 33 -2 -7 -8 2 -7 29 21 -7 3 -12 -23 -8 4 4 28 5 -12 -19 -13 -10
5938a0QJ0lmRj7j3J0OPJ3oj0lpj8L1K2j2kjk8mK2mj2N1k6j1mJ7l9J6K2j7oL9k7
$$ -10 -2 8 5 1 10 -7 -20 -10 -4 3 16 10 0 -3 -10 -28 3 25 13 11 10 -18 -22 0 -4 -16 35 9 -2 -6 11 -28 -12 10 -7 -13 26 -1
5976aj9L0j4k3L4Ok8J7j1j3RJ5j0J1llj%j6J6J1j7NJppK8j8nL2nk9J8Pj2j7L7
$$ -1 -20 10 -4 -27 7 13 -15 2 -9 -22 -13 2 -8 3 0 -3 -4 -4 -20 -4 7 -10 -5 -4 -11 -18 10 -8 -13 19 14 -15 3 10 -2 -19 18
6013A8j2jJ9j3k3K1JokJ4k5PMqkK3j5pRj2J0Qj3jlJ7k2J2Lk1QJ9rj6J8pqL1j7
$$ 18 6 5 24 11 -12 9 10 4 2 16 -9 -2 2 -6 -8 15 0 -7 2 -10 0 8 -5 -6 -9 8 -14 -2 1 -20 -12 7 -2 -18 0 -7 -15 16 -1
6052aj4K9Ml0J9Kk2J6Ok2lJ6j2mJJ1kK0j7j9K9j4j0L3oj5Qlj8J1K2qpJ2mj6QJ
$$ -1 -15 14 18 -12 7 9 -13 3 9 -13 -16 0 -12 -16 -15 -4 -6 14 -3 -22 7 -7 -17 16 10 -5 3 0 -18 -7 15 7 0 12 8 -8 0 1
6090AJnLqJ2jj4PMj7MK0j4J6j9lqM0k5nL1j2l3PJ2JJ3Rk6k3M4j6jJ6rj7K1jj1
$$ 1 2 -3 0 -8 4 3 -11 -4 0 -17 -13 7 -7 9 -10 -13 -21 19 -6 -11 20 8 -25 -18 -6 -5 8 17 -9 -32 12 -4 -5 11 2 -15 6 5 -6
6129fPOj5nJ4mQRl0pMK5NOj4k5J0%nL1oj6J3KpmK3j9j4J5mmL3k3k1KJ0j5L0J9
$$ -6 1 7 -8 -13 1 -3 5 14 -16 -23 -19 6 11 17 3 -22 -12 -12 -17 14 8 -8 5 7 0 -4 19 0 -14 1 -3 -7 26 3 -18 -16 -6 -21 9 28
6169B8k3k9J0pJ6K3pk0jk2%M1J2k7jnnJ4L1k3j6J6k7J8J8Nj4Lk8MQJ7nOk3qK9
$$ 28 5 -24 -14 -21 -5 18 11 -9 -10 -32 -32 9 21 -6 -7 -12 -17 -3 28 5 -11 5 -22 -4 14 19 5 8 -20 -16 -8 9 4 10 -13 -21 8
6206HJ5j9MLk5NJ5jPJ4l3l2M2OoJ6mm5PK9j2OK0j0l9J8J6rJ2lk3kK0LjJj7PML
$$ 8 23 4 8 11 -14 -9 6 5 12 26 -7 -39 3 9 3 19 15 -30 -23 6 -6 0 20 10 -29 -11 5 -4 8 5 -18 -20 0 3 2 3 -14 -7 -3 0
6246@J4mj4KJj7K3K0k1j2Qj1kL6ll4J3LrKL2l9mJ1roL5Mk6LOj9J4J8j5j1J5j5
$$ 0 14 10 -4 -2 -1 -18 5 25 4 -8 0 -11 -13 23 20 -14 -1 2 -7 -5 27 -12 -16 -5 -14 -20 15 19 -7 -4 2 -17 -3 15 0 -11 4 -11
6284a1oM1rk0l%oJ0J1J2rj6j3J3J6j0Pj4j4MK5j2J0Rj2mkLQJKk4K9kj0J1%j4%
$$ -11 -17 24 15 -5 -8 -8 -14 -4 7 19 10 -6 -19 -6 10 0 7 -7 -21 -17 8 -4 6 15 3 -1 -3 0 8 9 11 -13 16 14 4 15 15 1 1
6323ALkj1J9Nk3K6kk1RQj5kJ6j2j8J6%nNlkpK7oqnjL%%J1plQk4J7P%omJ4j5nK7
$$ 1 4 2 -9 10 15 -8 18 16 -5 4 12 -3 -5 11 -1 -19 -3 -3 -8 -3 -6 -8 -15 12 6 -2 -7 -8 -5 -5 -5 6 -1 -4 4 -20 -3 4 4 -2 -6 8 -7 -12 15
6368A5rk1J7oLJ1J0k0oJ7k5jK6jk5lK3j1K3J0k9j4NOlK8j1k3Orj0K2L2k0k9Ok
$$ 15 6 -15 2 -4 -1 10 20 0 -6 11 -14 -15 11 10 -15 -18 5 -6 17 27 -2 -16 -11 -5 -8 20 9 -14 -8 -17 -27 -5 27 7 -22 -16 -18
6405a8PK1j2%mj5K2J4mj4rpOJ1K3j3j1j4j1J7K6oLj9j5MJ4J2Ool4OOK0Nlk3j8
$$ -18 -11 10 -2 -2 -6 -21 1 15 11 -3 -12 -19 -13 -2 21 8 -3 -17 -28 -11 15 9 12 -7 -22 -18 -4 8 14 8 -26 -20 -14 6 11 8 -15 -33
6443c3OK4K0rkj7j0MK3J0ook9J2J9J0kqj4k3K4PK0j4j6j3kRL6%j6j8k1J9MK8J2
$$ -33 -27 -3 17 8 6 -11 -21 -17 6 16 10 4 -25 -13 6 16 14 6 -8 -31 -7 0 20 6 -10 -23 -25 -16 20 20 4 -14 -35 -16 -12 16 28
6480B8l3m0K5JK1J3kl2j5K3KK3J0l1k4J5PJ7Oqm9RJ4J6K4%k9k7J5J3OK0j0k1p
$$ 28 -5 -45 -20 -19 2 15 13 -19 -34 -11 -9 14 24 -7 -31 -16 -9 8 14 6 -43 -34 -20 -4 20 20 -9 -36 -21 -8 -2 18 8 -13 -20
6515b0PRK3mk0j0njL2J4k2lj0rNM1j8j6j3kQJ9J0j0j7jj2J7K5mj6rjjK1MmNk2
$$ -20 -13 -4 19 15 -5 -15 -20 -21 11 25 3 0 -10 -19 -14 27 9 -7 -20 -22 -14 5 15 5 -12 -13 -25 -8 17 13 -3 -12 -13 -14 7 11 7 12 -10
6554a0j5L3%Orkl4J7J8J0npj2%K1j3J5nmk1J2J3nMnj9kJ5NJ0j0prK3j5j4L1j0
$$ -10 -25 8 8 14 5 3 -31 -14 4 14 9 2 -10 -10 11 -2 13 8 4 -17 -5 8 3 7 2 -17 -19 -4 1 11 1 -6 -15 8 -7 -21 10 0
6592@k2K0Rk1J7Qk0KJ8l3OK0kj0Mqj7M1Ok8%K0j7LN%k1L6k1pJ1nkQmJlJ7j4JJ
$$ 0 -22 -2 7 -14 3 11 -9 -7 11 -22 -16 4 2 -8 -4 -12 -29 12 18 -10 -10 10 -7 -4 1 1 -20 16 -5 -12 -1 -6 -8 0 -4 -3 -6 11 -3 -2 -1
6633aroPkMPrmNPqJ2J3m2QJ5j1K8oj3j2J5k6J4K6pj7Omj4J3L0j9j4Rj8RJ8j1n
$$ -1 -10 -16 -9 -11 -7 0 -9 -13 -8 -1 -9 3 16 -26 -18 -3 -14 14 8 -5 -17 -2 -28 -14 12 5 -12 -6 -10 -24 -11 19 0 -14 -5 -23 -14 4 -7 -12
6673a2J5j5j5L4J4k4J4j2j1KK7%Lj3k1kL0j0Pmk5nK0J5rJ1k1k9J7J9kJ9j1k7l
$$ -12 3 -12 -27 7 21 -3 11 -1 -12 -10 17 17 20 7 -14 -16 14 4 11 7 -18 -23 -3 12 3 14 -7 -36 -19 0 -2 17 6 -21 -24
6708b4K7JMJ3l0k3J6J7NJ8j6l6NJ1RK0Ok6l0K5QQJ9j6l6RJ8J0kOj9j7%RK5J1j4
$$ -24 3 4 8 21 -9 -32 -16 1 6 24 8 -28 -23 -12 -3 17 23 -3 -33 -8 0 8 27 11 -25 -16 2 12 10 16 -3 -20 -20 -11 14 25 11
6745A1k7OpK3K1j2qk3rJ3L0qj1rqj2L8L1l3j5Ol6J7M5Jrk6j9j5L7M7j9j5j3k8
$$ 11 -16 -10 -17 6 27 15 7 -16 -25 -12 18 10 -1 -10 -18 -30 8 39 6 -9 -3 -39 -22 23 24 15 -11 -30 -45 -8 39 20 5 -8 -36
6780c6J6L4Pj1j3rqJ4K0Mlk5j1J6K1Qlk5k9PK6K0J4k0l2kK2KJ6J7k2k5MK2jJ5
$$ -36 -20 14 21 10 -3 -12 -20 -6 14 18 15 -10 -21 -5 16 24 21 -4 -33 -26 0 20 34 14 -18 -20 2 4 20 37 15 -10 -6 16 15 30
6816C0pl9KJ6J8J0j4k0k5J9J5J2RJm9j2K3%K8J1k4l6J4oK0K6ll9KjNK8J0k3j7
$$ 30 23 -16 -14 2 20 30 16 -4 -29 -10 5 17 26 27 -22 -34 -11 -11 17 28 4 -32 -18 -24 -4 22 19 -20 -18 -19 -14 14 24 1 -16
6851a6PJJ8Kj0qj1oL1J8k3Oj5j8J4L8nl3J2pj8J9K4j6qJ0k8J1K4lk1jK3k4J2K1
$$ -16 -9 -8 10 12 2 -6 -17 -23 8 26 3 9 -6 -24 -10 28 23 -10 2 -5 -23 -4 20 4 -4 6 -22 -11 13 10 -11 -12 11 -13 -1 20
6887B0j8qmJOJ6Mk0j1lMJ7lj7J7rKLnQjOj6J4Oj2J3qlnJ4pKJ7k5rK3%j4Rpj0K4
$$ 20 2 -6 -10 -9 -3 13 17 -3 -14 -17 -13 4 1 -16 1 -8 -6 -3 -8 0 -1 5 -11 3 9 -3 10 2 -1 -6 8 1 3 20 -5 -14 9 9 -5 4 -3 -13 11
6930A1J3l3KK4j8j1K5oj1J0j1lJ1J6k0oJ6j0Q%qj0JRrJ7mlj2KOJJ5oj3j0j5K7
$$ 11 24 -9 -7 17 -1 -12 13 7 -4 6 -5 -8 3 19 -1 -7 9 -1 7 7 -1 -11 -10 -1 -10 7 3 0 -12 -10 -4 -3 12 6 -7 -17 -32 -5
6968eRrRmj4J3J8Mpj3j1nK4jj%oj2LK9Pk5J8m1jK6K0Jl1%k6J1L1Rj3j7jj4J8L0
$$ -5 4 -5 4 0 -14 -1 17 21 14 1 -10 -15 9 8 7 7 1 -11 -8 21 28 3 21 -20 -21 5 25 26 -5 -5 -31 -20 11 20 7 -10 -11 -25 -7 23
7008B3k0rqmlL7%j0ql3K3J6K5ppl6rK1K2Kkj8j4QJ7LKkl2j0K8PK1kl0k5J6K8J1
$$ 23 3 -6 -14 -18 -21 16 16 6 -2 -35 -12 4 29 22 15 -21 -30 -9 13 15 13 -5 -19 -11 6 9 11 9 -23 -33 -5 2 23 21 -9 -34 -18 10 21
7047B1Qj4l9OJ6%L3ll0k5J4RQQnk7oL0j1QJ7k7j2KK6J5%j2k3j2J5PJ7j2rj5KJ5
$$ 21 29 15 -24 -18 -2 -2 31 28 -2 -27 -13 -4 4 12 7 -20 -26 4 -7 1 18 -9 -21 -19 7 22 22 10 -13 -25 -10 -3 14 2 -7 -22 -20 -5
7085eJ7Rk5mpMK6Pk1j3l%PL8ml3qNj9L1J8j3j0qpJ5J7Qj5pj9J6PJ8j1j4j1mK1
$$ -5 12 21 -4 -8 -15 -11 15 22 1 -12 -15 -15 -8 30 26 -7 -15 -10 -29 2 20 7 -3 -11 -18 -3 14 22 7 0 -19 -3 4 22 11 -3 -14 -18 3
7124CJ3j6qPj0RPJ8k2Kj1j6J7J6j5jjnRNRj3Mj8J0NJ4%pqpQ%QOQm4J7J0%nJ6k2
$$ 3 16 0 -8 -1 -11 -2 5 23 1 3 -8 -24 -7 9 -6 -7 -8 -13 -4 1 10 -3 1 -17 -7 -2 12 12 5 -3 -10 -2 -2 6 12 20 -24 -7 3 3 -2 14 -8
7167hj1J1kPMK1k7RN%j3J3mlKNkj6K4Jk0J7j6lJ0LRk3QRj8lJ7qjpR%oJ2j3lJJ5
$$ -8 -19 -8 -10 -3 1 22 -5 4 9 9 -4 9 5 2 4 9 7 -9 15 16 -4 13 -3 -6 4 7 16 -7 1 10 -8 -11 6 -2 -3 -10 -1 -1 -7 5 -8 -11 -10 5
7211EpPLj6RQj5Rk%Jllj0J5J0j4j2J9j1RKj9J1KJj6J7Rj0kLkLJ6j1j7PJJPJ0k0
$$ 5 -2 5 8 -8 1 9 -6 3 1 1 2 -1 -4 -14 1 11 -3 -15 4 -7 2 4 -15 -4 -2 -1 -17 0 9 -1 -3 0 -2 1 17 6 -11 -4 -3 -2 5 15 -5
7254eoRKrJ7mnoM%kNJJk2JK6j2PJ8k4pJ5KjqJ8l1J0J6lKrNj6RpJ3j0J3qj1QLK
$$ -5 -11 -2 0 -9 8 4 -1 -7 -3 -3 -5 0 1 2 -20 -19 7 -5 2 20 -4 -11 4 6 5 -3 15 -16 -6 10 7 9 0 5 -11 -2 -9 4 -6 7 -1 -12 -4 -1 1
7299AOkk4PQK1qrKj3J5KnJ1pppJ1LJ8kk9NpJJ6K%qj1OJ5opKj0j2J9J1lMnj7mL0
$$ 1 7 5 -19 -12 -4 17 9 0 2 -11 4 6 1 12 5 -2 -9 2 5 23 21 -8 -3 -10 -9 7 9 9 1 -10 -4 11 5 -2 0 -10 -22 -3 8 5 9 4 -13 -17 13
7344A3Kj0oJ6l6J7K9j0pkj0pPL2k2mLj4KL1pj0oj6NMPJ3lj9rJ0J3LKj9j2J8Rm
$$ 13 15 5 -1 15 -21 -4 25 15 8 6 -4 -11 -4 28 6 2 5 -9 -7 24 17 7 1 -15 -10 -6 1 14 11 -8 -17 -7 6 9 11 -8 -20 -2 7 3
7384CJ6j3j9rK3kJ2J7k1k8QRONmj3oJJ0J6j9jj3K0JJ6nj0k2J2J6MJ5k2k1J1lJ0
$$ 3 19 6 -13 -22 1 -1 11 28 7 -21 -13 -4 2 7 3 -10 -16 -15 -5 11 -8 -9 -22 -2 -1 15 10 0 -22 -10 6 10 25 3 -18 -7 -10 0
7422@OLj0j2qK1Rmnj1jOjK2lk2jj3J7J1KJk1NL%K2Lk0Lj7QJ7Pj2j0Qj0RJ1j3q
$$ 0 6 9 -1 -13 -21 0 9 5 0 -11 -12 -6 -7 15 12 -10 -11 -24 -7 4 6 7 -14 -9 -6 -6 16 19 -1 2 -15 -7 10 17 5 -5 3 -7 2 13 0 -8
7464hOkRJoj4%J4nJ2Oqmoj7K7NrPj1oJ1J3oj1KJ6l2J4K4k0j0%lnJ3J6j9ppJ5%
$$ -8 -2 -4 5 6 0 -14 -14 0 -5 7 13 5 1 -5 -22 5 10 1 8 -3 -9 2 15 9 -2 0 16 -16 -2 22 2 -8 -8 -11 -16 -3 13 -6 -13 -20 -5 -5
7506ePNj6J2j9J5J1oQj7PlPnl%j8QJ8nnRj1nK8okj0kj6K6jJ0rnl%Nj0QJ5j4j9
$$ -5 2 7 -9 3 -16 -1 10 4 12 -5 2 -1 6 1 -2 -2 -20 -12 6 1 -4 5 -6 -11 17 11 9 -1 -3 -19 7 6 16 7 2 -1 -1 4 -6 2 17 3 -16
7549a6J8J7j3j5J6j3R%J1k9J2MmJ1KqpoQLLMjj6pJ1k%K1mk3KNJ4mjkj1J6lOKm
$$ -16 2 19 6 -9 7 -6 3 3 14 -15 -3 1 -3 8 10 2 -5 -11 -3 0 3 7 6 -10 -17 -6 -8 -8 13 9 -14 -12 -7 7 3 2 0 -11 5 2 8 10 6
7592Fj6OJJLQj8j0QL2k0LJk2J9%nL%lnJ0LlJ4qj0LPp%kj7kJ7jRqmojPJ7j2klq
$$ 6 -10 -4 -3 -2 1 9 -9 -19 -11 21 1 4 5 -17 2 2 -3 0 0 -3 -8 2 5 2 16 8 -2 1 8 1 1 -1 -18 -20 -3 -4 5 -3 -7 -13 -14 -7 10 -2 -4 -7 -15
7639a5lQK2j5nJ0pNlKjnJ5j9KJ0J4j6%Qk1J8J1k9nJ9mMOj0klJ3JljJkj1J4Rk0
$$ -15 -18 -10 12 -3 -8 2 -5 0 -3 -1 -2 -7 8 -11 -9 1 15 -1 -1 7 -14 4 15 -14 -19 0 -4 0 6 -4 -6 -9 4 5 2 1 2 0 -11 3 12 -8
7681hJ5k0OKKRqK0j0oj0NLj0J6j3MJjkoJ5nLLrJmOj8K5mKnPpMkQojloMJ3j1jQ
$$ -8 7 -13 -7 -5 -3 6 -2 18 8 2 -8 -3 0 -10 6 -7 -3 -2 -3 -5 -11 4 -1 2 5 -4 -3 -7 -1 -19 6 2 4 -1 6 -1 3 1 9 3 2 -1 -7 -3 10 -1 -2 6
7729Fj6J3JJk0MQqJ6Lj0jL%lNNJj2mjJ1%Oj0KJrJRLj1JPrmRJ8k8J4Qj1j5J9J2
$$ 6 -10 3 4 5 -15 -11 -3 -11 5 8 -2 -3 0 0 -3 2 7 8 -4 -8 -9 2 2 8 -2 0 1 -8 -7 2 5 -6 -5 2 -7 -11 -2 16 -12 2 10 -1 -16 3 15
7774A5j8OMj4J8jpMJj7PJ2j2PqPj9J4MpMrNMjqMJ6j7rPOlJ1lqLNJ8j4j4jJ3J0
$$ 15 -3 3 7 -7 11 10 3 7 8 -9 -2 10 -2 5 -3 4 -15 -1 3 -4 0 -9 -4 0 -1 -9 -5 11 -6 -15 -8 -2 -5 6 3 -5 -2 3 21 7 -7 -8 5 15
7818A5j4pJ5j8NMpJ0J6j7qNMrJ2pplK5j7MKlkJ0j2NJ6j2j9LL0j1qnJKJ0rqJ2K
$$ 15 1 -6 9 -9 -4 0 -7 3 19 2 -6 -1 3 -6 6 -1 -8 -11 14 -3 1 3 0 -2 8 -4 1 17 5 -14 -11 19 8 0 -5 -4 -2 8 -1 -9 3 5
7860EmLj1kJ2mppLMJ7oj6Rj%KJ4k5%K1Mk2K5j0k3K0qoJ3Qj7jPpJ0J2pk0J5jqJ6
$$ 5 1 4 -7 -9 3 -1 -8 -15 -12 -8 9 3 -13 -4 -5 -5 -3 11 -14 -14 7 11 -11 14 4 -19 1 -7 -13 0 8 -9 -10 -3 -10 0 12 5 -15 0 -1 -9 7
7903GKj4qJ5oLQJj1QKqJ0qlQKj4K0Jj7K%JMJ1k1KPqPJ3k7JNlj0QOoNJ2j2JPjq
$$ 7 9 -5 -13 2 -4 -1 7 8 -3 5 7 -1 9 1 -2 6 8 -6 14 15 -2 0 0 1 5 16 -5 -3 4 -4 3 16 -11 -10 -5 -8 -18 -10 -4 -10 -5 7 -5 -4 3 2 -6
7950fJ2lqJ4kk3J2NrJ0J0po%lMKPj3%nOJ1NnNoj0KJ1kPrn%OqnJ0kj1J9kj4oJ0
$$ -6 6 3 -5 9 7 -16 -4 1 -8 2 12 5 -1 -1 -4 0 2 9 -4 -4 -9 -3 8 13 8 13 7 -3 -1 10 8 15 6 1 1 7 -1 -6 4 2 -9 10 8 -6 -12 -2
7996bjLJ5k4jJ9j9kK1j8NOjj8K6Mj6LOnQOqlnkj9L7nMj7J1j9J2MmKnj2J5NjmK
$$ -2 -3 0 15 -9 -10 9 -10 -12 9 -9 -4 2 1 -17 9 13 -3 0 6 1 9 15 7 4 -1 -3 -22 15 10 14 -3 8 -11 1 5 1 3 -2 -14 1 6 5 1 3
8040CkqlJ5nJJoKNm%o%JKkQpnMnOj7K9j6npJ6kJ1kmj9J3OK%oPJQj2%Mj2J4Jno
$$ 3 1 -7 -10 5 0 1 2 -4 -2 3 -1 -1 -7 -7 -6 -4 -6 2 -5 -10 -6 -11 -5 -22 7 -9 -14 -21 -5 -7 4 2 -2 -21 -8 -2 0 0 -6 1 2 10 -2 -2 2 -10 4 5 0 -6
8090fMqLMJoJ4nj9K4kqkkNpPM%oKj3J4Mj2K0oj0QpLOj0jlJ2k0LJ6j0jLnQLn%L
$$ -6 -2 -10 -7 -3 -2 -8 6 1 -18 6 4 -4 -6 -8 -3 -10 -3 1 1 -5 -3 -16 -2 2 -10 10 4 -6 2 -5 -2 4 -6 -7 -10 2 -18 -15 1 -9 -10 -7 -12 -4 -1 -6 -6 -3
8138cLk0J4O%JOpJpLjJ4j9LMjNkrPpMlmNmJlK0j0Knj3J0J1kjj0J3pJ9j7lJ8j3
$$ -3 0 -20 -6 0 0 1 7 0 1 -6 -3 -4 10 -9 -6 -2 -3 2 0 -9 -2 -9 -5 -8 -12 -7 -11 -10 -13 7 -3 -1 -6 -19 -9 2 0 -1 -11 2 -5 14 -3 -6 12 -1
8184aLj1MkJ0KJ
$$ -1 2 -9 -5 -7 3 5 6
8191F
$$ Imaginary data points
##PAGE= N=2
##DATA TABLE= (X++(I..I)), XYDATA
0@%%%%%%%%%JrJ6j6J6j6K4l2L3m1M9n7P0p9Q9j04J21j38J55j78K01k26K56k86
$$ 0 0 0 0 0 0 0 0 0 0 1 -8 8 -8 8 -8 16 -16 17 -24 25 -32 38 -41 48 -56 65 -73 82 -96 105 -121 135 -151
33a51L21l60M01m46M95n50O12o76P48q29R18j016J125j250J390j551J736j950
$$ -151 170 -190 211 -235 260 -290 322 -354 394 -435 483 -533 592 -658 732 -819 917 -1033
51a033K206k517K902l392M041m951O329q677J3693m1045M1272N2202j00423M0143
$$ -1033 1173 -1344 1558 -1834 2207 -2744 3585 -5092 8601 -32444 8828 61030 -39393 750
65G50N4592q2797k8128Q8243j6785m0811M3828J469n0212K5078K0592k4319J0354
$$ 750 55342 -27455 -55583 32660 15875 -24936 18892 20361 -29851 -4773 15819 -8500 1854
78A854J1241l1531J0461K8365j9189q857J9972j7359j8487K3999J8519j1090j0344
$$ 1854 13095 -18436 -7975 20390 1201 -7656 12316 -5043 -23530 469 18988 7898 -2446
91b446P3K368j1776m268L3311R689m4381K518L8286l2762k0616N9854o101o2980
$$ -2446 -2373 -5 -11781 -16049 17262 26951 -17430 -14912 23374 -9388 -30004 29850 23749 -39231
105c9231L4572L8283n1858M148M9891m1381k9982M9329l763k5843L8478o059m8237
$$ -39231 -4659 33624 -18234 -14086 35805 -5576 -35558 13771 10008 -15835 22643 16584 -31653
118c1653K6985J7661l6638L1489L5143n9968j2105N3645k9855k8919O2939J830
$$ -31653 -4668 12993 -23645 7844 42987 -16981 -29086 24559 -5296 -34215 28724 30554
130C0554o2293K3760L3937m1899k164M2700j7091k7366K1116R100j3565J667L967
$$ 30554 -31739 -7979 25958 -15941 -18105 24595 7504 -19862 1254 10354 -3211 -1544 2423
143B423l262k767k076R934Q095j5184n036J2081q613m190K0060m133j5239J1557
$$ 2423 -839 -3606 -5682 4252 12347 -2837 -7873 4208 -4405 -8595 11465 7332 -7907 3650
157C650m170j4317K3364N648k8944J4558J7322l5364N978M2329l0214k7661M4520
$$ 3650 -520 -14837 8527 14175 -14769 -211 17111 -18253 -12275 30054 -160 -27821 16699
170A6699l590m3509L4695K7671m8033j505L8750k5022j7033L7910l735k9383J6438
$$ 16699 13109 -30400 4295 31966 -16067 -17572 21178 -3844 -20877 17033 13298 -16085 353
183C53P167j8901J1899J0709j6881L753R290j4903L071J5283j2863o047J5229
$$ 353 7520 -11381 518 11227 -5654 -1901 7389 -7514 -4443 10840 -2023 -8070 7159
196G159n088r887J1352J825j0251K220L784j16K503m503j987O692o828m404J7094
$$ 7159 2071 -7816 3536 5361 -4890 -2670 1114 998 3501 -1002 -2989 3703 -3125 -7529 9565
211I565j885j9045J1016R320j9600N532K1224j5991j1160J7616o258j1980J9025
$$ 9565 7680 -11365 -349 8971 -10629 -5097 16127 136 -11024 6592 334 -11646 7379
224G379J825j7797R639M473j6879J1077J3826j9944k84J8819j5978r341K5098
$$ 7379 9204 -8593 1046 5519 -11360 -283 13543 -6401 -6685 12134 -3844 -13185 11913
237A1913l965k2027J5295R157k0240N673J7687j4238r405J3427q08p150P760J866
$$ 11913 7948 -14079 1216 10373 -9867 -4194 13493 -745 -10150 3277 2469 -4681 3079 4945
251D945p591k99J612P79L764j241k843J589l303k015P947J415o031J702j070n605
$$ 4945 -2646 -2945 -1333 -554 3210 1969 -874 715 -2588 -4603 3344 4759 -1272 430 -640 -6245
267f245O990N526p212J331L056j0745J851J3837o379o573J1133n533j3744J3478
$$ -6245 745 6271 -941 390 3446 -7299 -5448 8389 2010 -4563 6570 1037 -12707 771
281G71R434j3775J991R511j3195m146J5908j776r167P445m29r890O155O424o264
$$ 771 10205 -3570 -1579 7932 -5263 -9409 6499 4723 -4444 3001 2572 -7318 -1163 5261 -1003
296a003J269L168p649K32P990k725k563M424l996m852O540L219m313N21P03l917
$$ -1003 266 3434 -4215 -3983 4007 1282 -1281 3143 -853 -5705 835 4054 -259 262 965 -2952
312b952M04L960J117n17k239k404J045Q10P37M204q36o957L11L922k001K097N225
$$ -2952 -2548 1412 2529 2012 -227 -2631 -1586 -776 -39 4165 3329 -3628 -3317 605 -1396 701 5926
329E926n374n468M348K52k209O468J169q091J84L379l692K869O915n588n627M635
$$ 5926 552 -4916 -568 -316 -2525 3943 5112 -2979 -2795 584 -3108 -239 6676 1088 -4539 96
345I6n31l045O694K129p722m20L672l128R29O100k294n206J201N81p66L627J758
$$ 96 -435 -3480 3214 5343 -2379 -2799 873 -2255 -1326 4774 2480 -2726 -1525 -944 -1710 1917 3675
362C675l631k090L82K89J967K021j056k087j350k29J886K117J91j006k369j991
$$ 3675 44 -2046 -1664 -1375 592 2613 1557 -530 -1880 -2109 -223 1894 2085 1079 -1290 -3281
378c281K048L119J33k86j229l739q9M496J188j049P17k643l964K764M158o01K06
$$ -3281 -1233 1886 2019 1733 504 -3235 -3324 1172 2360 1311 2028 -615 -4579 -1815 2343 1742 1948
395A948o7m855j547M913K145r20O70k422m225J990M193M7j11p3l666j960L226
$$ 1948 1881 -2974 -4521 392 2537 1617 2287 -135 -4360 -2370 1823 1870 1759 1686 -1980 -3940 -714
412g14K707J14k05k009l038L80L292K136l56j977k150p48J226K728J679j660k676
$$ -714 1993 2107 1902 -107 -3145 -2765 527 2663 2307 330 -1820 -2568 -1342 1386 3065 1405 -1271
429a271p44J39J238L168P09l450k173M66N58K328K721j976l783k29R12R79K839
$$ -1271 -2015 -1876 -638 2530 3239 -211 -2384 -1918 -1360 968 3689 1713 -2070 -2299 -1387 -408 2431
446B431P44l379k146M36O29K254K417j605l167r68K81J870L016j24k907j511m02
$$ 2431 3175 -204 -2350 -1914 -1285 969 3386 1781 -1386 -2354 -2073 -203 2813 2689 -218 -1729 -2131
463b131O44K930J533k063j798o32o34J781K959m79k262j058q66O97K947R14j883
$$ -2131 -1487 1443 2976 913 -885 -1517 -2151 -370 2589 2110 -152 -1210 -2076 -1379 1568 2482 599
480E99j346r66j32K406J650j228j003p96j386J360K766l68j284l84j738j78L242
$$ 599 -747 -1713 -1845 561 2211 983 -20 -816 -2202 -842 1924 1556 272 -112 -1850 -2028 1214
497A214J018j853l77q53j529K254K529j588j030L62j837l7L258L11j910J72p83
$$ 1214 2232 379 2 -851 -2380 -126 2403 815 -215 147 -1690 -1727 1531 1842 -68 104 -679
514f79j459K199K139j379j019l39j135J109K134n40p77k01j653L10K517k52r60
$$ -679 -2138 61 2200 821 -198 -537 -1672 -563 1571 1031 254 53 -1600 -1290 1227 975 15
531A5R44j517j815K671J471j971M17L64k497J079K988j698j353J426j523p31L530
$$ 15 959 -558 -2373 298 1769 -202 215 579 -1918 -839 2149 451 -902 524 -999 -1730 1800
548A800J5k837J129j00k731K535L267k601j162J353k390n90M154K70k644N62l12
$$ 1800 1815 -1022 107 7 -2724 -189 3078 477 -685 668 -1722 -2312 1842 2112 -532 30 -282
565b82j510K134J414j848j08P9j572J717K327j861j025N35k123K94M205J54k446
$$ -282 -1792 342 1756 -92 -200 -121 -1693 24 2351 490 -535 0 -2123 -1829 2376 2530 84
582H4o2j465j538L156K114j301J84j086k985J859K618j815P17J724m032q53N132
$$ 84 22 -1443 -2981 175 2289 988 1172 86 -2899 -1040 1578 -237 480 2204 -1828 -2681 2451
599B451q97l416K651n14l952L899M048l824j345J308l396J21N350K9j779J064
$$ 2451 1554 -1862 789 275 -3677 222 4270 446 -899 409 -2987 -2866 2484 2513 734 1798
615A798l375l050M546K274k148K110j18n631J133M913k089j313K810k198k412
$$ 1798 -1577 -4627 -81 2193 45 2155 2037 -3594 -2461 2452 363 -950 1860 -338 -2750
630b750L679J386k189l1j168j721K597K098l22R94k304m851K027M069r88J299
$$ -2750 929 2315 126 95 -1073 -2794 -197 1901 1579 2573 269 -4582 -2555 1514 526 1825
646A825K064n044l103L810P26p43L141r45l795J479P85j454K849L2m842K230L864
$$ 1825 3889 -1155 -4258 -448 278 -465 2676 1731 -2064 -585 200 -1254 1595 1627 -3215 -985 2879
663B879l639O27M145n806m023P065J381m139M234J144p830k40N333j144M02L552
$$ 2879 -760 -133 4012 -1794 -5817 1248 2629 -1510 2724 3868 -3962 -4202 1131 -13 389 3941
679C941l244l575K014n8J90L475j663l225K783J56k962L184J592m927K40L753
$$ 3941 697 -2878 -864 -922 -732 2743 1080 -2145 638 794 -2168 1016 2608 -2319 -2079 1674
695A674j581o0K631k630k670J542K12J396L014k721k733K470j808k327O023J536
$$ 1674 93 33 2664 34 -2636 -1094 -882 514 3528 807 -1926 544 -1264 -3591 2432 3968
711C968o260J607L415n466p2O548k568m086L908R9l038K924O39l379J431O50k152
$$ 3968 -2292 -685 2730 -2736 -2808 3740 1172 -2914 994 1093 -1945 979 1618 -1761 -330 320 -1832
728a832L323J453n053J083L201m845J66O904k753m899M427J05n026L606L622m148
$$ -1832 1491 2944 -2109 -1026 2175 -2670 -2504 4400 1647 -3252 1175 1280 -3746 -140 3482 -666
744f66l99K387k297L1K256j756K03J928l058k13M183k400k637M305p65m381L795
$$ -666 -1065 1322 -975 -944 1312 -444 -241 1687 -1371 -1584 2599 199 -2438 1867 1102 -3279 516
761E16K448m506O29K740k917j9K701k016J0K202l104k27M156l071k304N746j497
$$ 516 2964 -1542 -913 1827 -1090 -1109 1592 -424 -414 1788 -1316 -1543 2613 -458 -2762 2984 1487
778A487n867N204L027o976J393N841m965k433N893j399m035L605Q19l148J658
$$ 1487 -4380 824 3851 -3125 -1732 4109 -856 -3289 2604 1205 -2830 775 1594 -1554 104
793A04O73j991J961J53k820K492J293m103J627L462m071p51M603k418k957M022
$$ 104 777 -1214 747 900 -1920 572 1865 -2238 -611 2851 -1220 -1971 2632 214 -2743 1279
809A279J13l104K265M80k655K027P02k757K289J235m199J775L512m567m78N462
$$ 1279 1392 -1712 553 1033 -1622 405 1107 -1650 639 1874 -2325 -550 2962 -1605 -2083 3379
825C379l182l838N355M72m862K971K170m497P74L183k442N2K219k660k49K647
$$ 3379 197 -3641 1714 2186 -2676 295 2465 -2032 -1258 1925 -517 -465 1754 -906 -1155 1492
841A492k605l37M364k465l297M414j93m686L643K778n056N69M175l185j633L466
$$ 1492 -1113 -1450 2914 449 -2848 1566 1373 -3313 330 3108 -1948 -1379 2796 -389 -2022 1444
857A444j309j854K705l15j469K087j001k343K448J70k317L024J312m229N80K531
$$ 1444 135 -1719 986 671 -798 1289 288 -2055 393 563 -1754 1270 2582 -1647 -1067 1464
873A464k949K0L730j703j582K460j503j987K730l22j865L068k6l507K506J370
$$ 1464 -1485 -1465 2265 562 -1020 1440 -63 -2050 680 358 -1507 1561 1535 -1972 534 1904
889A904m613J251M194l267r28M532k359l927L499P49l211K576K292l096j02J297
$$ 1904 -2709 -1458 2736 -531 -1459 3073 714 -3213 286 1035 -2176 400 2692 -404 -506 791
905G91k377K66K508j205l0J972k097j380K241j127j564L123N57k485J362N88k888
$$ 791 -1586 -1320 1188 -17 -47 1925 -172 -1552 689 -438 -2002 1121 1678 -807 555 1143 -1745
922a745O32J855j427P25K019j916q96J333j762n75L025m52j611K352l24l217J289
$$ -1745 -1113 742 -685 40 2059 143 -753 580 -1182 -1757 1268 816 -795 1557 1233 -1984 -695
939f95J355k149J308K560k011r48J404j731r97K340K4n45J913r47k505J256L54
$$ -695 660 -1489 -181 2379 368 -580 824 -907 -1904 436 460 -85 1828 881 -1624 -368 -14
956a4j663K090J761k490JJ690k385j015K745k63j249K089J6k362O42O17j581Q78
$$ -14 -1677 413 2174 -316 -315 1375 -1010 -2025 720 457 -792 1297 1313 -1049 -407 210 -1371 -493
974d93J750q40j17N85j650o35J418n3o5J290n22j211N05k71o90J237M54r27O51
$$ -493 1257 417 300 885 -765 -1400 18 -35 -100 1190 668 -543 -38 -309 -999 238 692 -235 416
993D16K14j311N44P22j528K60J760q89n21J545j056j826J517O76j299J281J236
$$ 416 630 -681 -137 585 -943 -683 1077 188 -333 1212 156 -1670 -153 523 -776 505 1741
1010A741k018p03J139p60k00J818j15j248M71j0r23N76N87n17L35L62o86OL04
$$ 1741 -277 -980 159 -601 -801 1017 902 -346 125 115 -808 -232 355 -162 173 535 -151 -145 159
1029A59n91Q1N93l16J84O56p89o81O09j38j77J137k8j172L27K71q76N69J067p50
$$ 159 -432 -351 242 -74 110 766 -23 -704 -95 -233 -410 727 699 -473 -146 125 -751 -182 885 135
1049A35m51O25n94m22J168J46q95K55J32n89N24N86o15j25K72n18N5P49k64k34
$$ 135 -316 309 -285 -707 461 607 -288 -33 99 -490 34 620 5 -120 152 -366 -311 438 174 -60
1069f0M11n46m89R10K40o79L61J78q60K78Q08n75l11O78k65n47N77J95m86J23
$$ -60 351 -195 -684 226 466 -213 148 326 -534 -256 552 -23 -334 344 79 -468 109 304 -182 -59
1089e9J89l13N6L18l7j74j85lL25L4j90K18j64n66M80N42o17R3O46q67n69J166
$$ -59 130 -183 -127 191 154 -20 -205 -208 117 151 -39 179 15 -551 -71 471 -146 -53 593 -274 -843 323
1111C23N0p67Q54J81j502K92J286p69l52J190m99j183Q99M85r61M41Q34q92n21
$$ 323 373 -394 460 641 -861 -569 717 -52 -404 786 287 -896 3 488 -473 -32 802 -90 -611
1130f11Q11nm89M02K22n02o5L96ol13J3L51j11l76L27K79n75J5O13m60l36Q75
$$ -611 200 195 -294 108 330 -172 -237 159 153 -160 -147 204 93 -283 44 323 -252 -237 376 -84 -420 455
1152D55j68r22O08M63q31L31P39r62k73J012m38n36J016j16r87O53K90r10N97
$$ 455 287 -635 -27 436 -395 -64 675 -287 -560 452 14 -522 494 378 -609 44 334 -576 21
1171B1P84j028k01Q48o38k70J076k97q11P24J01r03N36O26o82l3N13n11k64O10
$$ 21 805 -223 -424 424 -214 -484 592 295 -516 208 309 -594 -58 568 -114 -147 366 -145 -409 201
1191B01L7l59J06J27j17j03RK84r1l89M72J73q70L23R07r92l88J448n27j270J468
$$ 201 238 -121 -15 112 -5 -108 -99 185 94 -295 177 350 -520 -197 710 -282 -670 778 251 -1019 449
1212D49L11j920R71J548j944l39K146j192j440K203R4k190J371J206k234J78K018
$$ 449 760 -1160 -189 1359 -585 -924 1222 30 -1410 793 887 -1303 68 1274 -960 -782 1236
1229A236j282q87J746m79j445J298N71j277L81P94q73k38O82j21j97K35J2j07
$$ 1236 -46 -933 813 334 -1111 187 758 -519 -138 656 -217 -455 227 106 -91 144 156 49
1247D9k90j7O13j92o12P90J40j235O68R41j454O0J736j290j081K081m06j914J868
$$ 49 -241 -258 355 163 -449 341 481 -754 -86 855 -599 -539 1197 -93 -1174 907 501 -1413 455
1266D55P15k469J056J829k482j99K659j643j423K764n68k497K269R16k856J116
$$ 455 1170 -1299 -243 1586 -896 -1095 1564 -79 -1502 1262 694 -1803 466 1382 -1474 -358
1282c58K096k496l64K533j450j377K425j83k114J400Q32j767M92J282j112l30
$$ -358 1738 -758 -1122 1411 -39 -1416 1009 826 -1288 112 944 -823 -331 951 -161 -491
1298d91R26l92m33M63J12mj62l22N52k8q59R11N72j708N00J679j882o22K714j150
$$ -491 435 43 -390 73 185 181 19 -303 249 221 -638 273 845 -863 -363 1316 -566 -1188 1526 376
1318C76k233K805L54l333K018K270l659P7L651k632j904L986p96l393L153J170
$$ 376 -1857 948 1302 -2031 -13 2257 -1402 -1325 2326 -306 -2210 1776 980 -2413 740 1910
1334A910l952J445K822l257l98L426j935j913L009l41k599K044J105k313O10J452
$$ 1910 -2042 -597 2225 -1032 -1430 1996 61 -1852 1157 816 -1783 261 1366 -947 -337 1115
1350A115j633k55J442n60m70P02k40k72J51l07M80L54r43M42P29j489K00J807
$$ 1115 -518 -773 669 109 -361 341 101 -171 -20 -327 153 507 -436 6 735 -754 -554 1253
1368A253j478q48K359r22k111K540M32l003J897J887l516M23L381k859j446M087
$$ 1253 -225 -1073 1286 364 -1747 793 1225 -1778 119 2006 -1510 -1087 2294 -565 -2011 2076
1384B076j375l242L688P11m324K146K837l949J7L904k659k067L744o78l013K781
$$ 2076 701 -2541 1147 1858 -2466 -320 2517 -1432 -1415 2489 -170 -2237 1507 829 -2184 597
1400E97J131l131R84J884k315j30K158j135q90J525l14j005P17N3m31L74q6J37
$$ 597 1728 -1403 -419 1465 -850 -980 1178 43 -847 678 364 -641 76 129 -302 72 -14 123
1418A23L99q77P4R40j325k84K290q32j749K280j07l134J980K137l162N20L366
$$ 123 522 -355 -281 659 -666 -950 1340 508 -1241 1039 932 -2202 -222 1915 -1247 -727 2639
1435B639k970j947L747r86l006L601J102l976J637K356l863j12L738k117j422
$$ 2639 -331 -2278 1469 483 -2523 1078 2180 -1796 -159 2197 -1666 -1778 1960 -157 -1579
1450a579L684j000l285K398P45k982J737K452k421l50J929j866j260K146J45r10
$$ -1579 2105 1105 -2180 218 963 -2019 -282 2170 -251 -601 1328 -538 -1798 348 493 -417
1466d17J203N7j264J15q0l34P91J86m5Q10p46j168R07k61j114J864R86j852P05
$$ -417 786 843 -421 -306 -386 -720 71 257 212 1022 276 -892 15 -246 -1360 504 1490 -362 343
1485C43Q97k813rK744j371o16L140j301l071K349L62l173K419K818l246j51K932
$$ 343 1240 -1573 -1582 1162 -209 -825 2315 1014 -2057 292 654 -2519 -100 2718 -528 -679 2253
1502B253k932k092L671j86k423L024J083l638L90J711k448J46L119p77j205J490
$$ 2253 -679 -2771 900 714 -1709 1315 2398 -1240 -850 861 -1587 -1441 1678 901 -304 1186
1518A186j020k025J190Q41n06J117N85j290m05q6o16N81O88lP55j20j417J99J84
$$ 1186 166 -1859 -669 172 -334 783 1368 78 -327 -413 -1029 -448 240 237 992 872 -545 -346 -162
1537a62j256J058J837j246j99J484j947j721K326K15j510K355R05l117K26J600
$$ -162 -1418 -360 1477 231 32 1516 -431 -2152 174 389 -1121 1234 2139 -978 -752 848
1553H48k320K6L206j004j488K149q48k691J787J115j946J368J898k233o19J520
$$ 848 -1472 -1446 1760 756 -732 1417 569 -2122 -335 780 -1166 202 2100 -133 -752 768
1569G68j620q68K433J73j167J242j45k044M12Q86o79P94J093r27m99J72p98P1
$$ 768 -852 -1720 713 886 -281 961 816 -1228 -816 70 -609 185 1278 351 -148 24 -774 -703
1587g03R18j57K25O39r21m84O09p27k35J505j55q21J129k92j775Q94Q58j349Q67
$$ -703 215 58 283 922 1 -483 126 -601 -836 669 514 -307 822 530 -1245 -351 507 -842 25
1606B5J600j713p23J572j123j080K190J61j711J287N75k166M59J556j388j49J797
$$ 25 1625 -88 -811 761 -362 -1442 748 909 -802 485 1060 -1106 -647 909 -479 -628 1169
1623A169r00j070J374l51j321J162N54j040O15N82j223j5P52o73J13R38n57l41
$$ 1169 269 -801 573 222 -1099 63 617 -423 192 774 -449 -464 288 -385 -272 666 109 -232
1641b32N67n94l13R19k21m71P99k58q28Q21J39r44O92N75j114K71Q70j023j42
$$ -232 335 -259 -572 347 126 -345 454 196 -632 189 328 -616 76 651 -463 -192 678 -345 -487
1660d87J143p00n72J228l24j013R78J71j099P89O31j229K25R10j020j04J215o66
$$ -487 656 -44 -616 612 288 -725 253 424 -675 114 745 -484 -259 651 -369 -473 742 76
1678G6o34J086l75r53J034K80j030O25N06j115J93Q53q11j23R59n19m77Q17k84
$$ 76 -558 528 153 -800 234 514 -516 109 615 -500 -307 546 -265 -388 571 52 -425 392 108
1697A08o71P12P1o36N77K49p22K51L05o79K69O12n81L1N70o63k53P86l84l99R42
$$ 108 -563 149 220 -416 161 410 -312 -61 244 -435 -166 446 -135 -104 466 -197 -450 336 -48 -447 495
1718D95j91q06O90J40r50N66O27r31K12Q41q64l30R27m56n30J031p8q58O49J88
$$ 495 304 -502 188 328 -622 -56 571 -360 -148 693 -171 -501 426 -30 -560 471 393 -465 184 372
1738C72r50M47O19p37J52O85p55k67P79l77l86Q07j60o22N74M8o99M77L54o55
$$ 372 -578 -131 488 -249 -97 588 -167 -434 345 -32 -418 389 229 -393 181 229 -470 7 361 -294
1758b94K55M21o30J9N44m46j44O03l10l41N63j88m25N57pn12M41J31n79L84L11
$$ -294 -39 382 -248 -229 315 -131 -275 328 18 -323 240 52 -373 184 177 -335 106 237 -342 42 353
1779C53o74K32N34p01j6P78n57l68Q89l26p24Q58J31r39N74N06r46J61Q12p39
$$ 353 -321 -89 445 -256 -272 506 -51 -419 470 144 -580 278 409 -530 44 550 -396 -235 577 -162
1799a62k44Q97l91n81P53m9o55N62K16o81K73L70n41J02M29l89k3L70l81r6M10
$$ -162 -406 491 100 -481 272 223 -432 130 346 -335 -62 308 -233 -131 298 -91 -114 256 -125 -221 189
1820A89k56o6M58l10k97M93k18m19O75N6o65M81K31q59L21O90p04n5Q25o06n06
$$ 189 -67 -133 325 15 -282 211 -7 -426 249 305 -360 121 352 -507 -186 504 -200 -255 570 -36 -542
1841e42Q57j63o53P56J85q35L79L88p27J90O27n79q1O18m81k76O33k21l85O08
$$ -542 315 152 -501 255 440 -395 -16 372 -355 -165 462 -117 -198 420 -61 -337 296 75 -310 298
1861B98j11n46M88J01n79M10K84o29K31L86o07J02N85n46j44O61m52l68Q02k15
$$ 298 187 -359 129 230 -349 61 345 -284 -53 333 -274 -172 413 -133 -277 384 -68 -436 366 151
1881A51o07P20L5q49N68M23q63L01P15q49j42Q63n61l78R17k44o80P08L0p93N84
$$ 151 -456 264 299 -550 18 441 -422 -121 594 -255 -397 466 -95 -473 444 200 -480 228 258 -535 49
1902D9L89p69K84N03p51J8O58m72j45O55m08l48N90k23l46O23j01n40N42l1o55
$$ 49 438 -331 -47 456 -295 -277 381 -91 -236 419 11 -337 253 30 -316 307 206 -334 208 177 -478
1923d78O38K61q70M65N67j038J13J007q71l28J228n70r16J195L2j227R08O13j314
$$ -478 160 421 -449 16 583 -455 -342 665 -206 -534 694 124 -792 403 435 -792 116 729 -585
1942e85L27J009j126j96J272o73o54J119k42r76R08K54r60N59N08r15J54O22o49
$$ -585 -258 751 -375 -571 701 28 -626 493 251 -725 183 437 -523 36 544 -371 -217 405 -244
1961b44M6O61n40j66N54m72j58P23l82l17P40m06o17R17m6q56Q96K38j279N94
$$ -244 -198 463 -77 -243 311 -161 -319 404 22 -295 445 39 -578 339 293 -563 333 571 -708 -114
1981a14Q25j244K26J245j148n10J469o81r83J538l6j499J109N56j625O29J250
$$ -114 711 -533 -307 938 -210 -720 749 68 -915 623 587 -912 197 753 -872 -243 1007
1998A007j456j00J502j078p89J565l79j139J289J90j384P54O53j230L31R46r14
$$ 1007 -449 -549 953 -125 -914 651 272 -867 422 612 -772 -18 635 -595 -264 682 -232
2015b32r2R07p28l57Q77l75l58Q25l26n82P35k31o35R33Qr03P91K21j201P23P66
$$ -232 -324 583 -145 -502 375 0 -358 467 141 -441 294 63 -572 361 369 -534 257 478 -723 0 766
2036G66j347K85J208j307l04J690q98j070J685k93j632J551P07j889P30J222j906
$$ 766 -581 -296 912 -395 -699 991 93 -977 708 415 -1217 334 1041 -848 -118 1104 -802
2053h02l5J930j143p52J828o75j576J476K95j473J095Q50j576K20J029j184j07
$$ -802 -837 1093 -50 -802 1026 351 -1225 251 546 -927 168 1018 -558 -338 691 -493 -600
2070f00J259o69m04J054n08p05P99k57n72R61N7p10O80j26j077P60M65r32P79
$$ -600 659 -10 -414 640 132 -573 226 -31 -603 358 415 -295 385 259 -818 -58 407 -525 254
2089B54P07j472Q7J098j233j05J739q96j031J654m26j604J559N46j945R67J343
$$ 254 961 -511 -424 674 -559 -664 1075 179 -852 802 376 -1228 331 877 -1068 -101 1242
2106A242j879J11J791j598r04K060n55j299J873J27k057R34Q37j662O47J586j317
$$ 1242 -637 -526 1265 -333 -1237 823 268 -1031 842 969 -1088 -154 683 -979 -332 1254 -63
2123f3m28J212j004p06J404j27p28R57j03r88N90J20p53P07L41p17N70K50j145
$$ -63 -491 721 -283 -989 415 288 -440 517 414 -574 16 136 -617 90 431 -286 284 534 -611
2142f11L62O14j022N17J224j193l46J210j130p87J905j78j377J489J60k079R81
$$ -611 -249 365 -657 -140 1084 -109 -455 755 -375 -1162 743 565 -812 677 837 -1242 -261
2159b61J298j781L05J822j601q11K021p71j453J807J43j829J272R76j854L32J341
$$ -261 1037 -744 -439 1383 -218 -1029 992 221 -1232 575 718 -1111 161 1137 -717 -385 956
2176I56j525k69J707o81q01J288m07j203R91L22q73P10L96r74K20M09p12L37N81
$$ 956 -569 -838 869 188 -613 675 268 -935 56 378 -495 215 611 -363 -143 266 -446 -109 472
2195D72o98J66N81q64K3Q51q28j90J185o10o99J263m01j261J290L79j480R63R28
$$ 472 -226 -60 521 -343 -320 531 -297 -487 698 88 -611 652 251 -1010 280 659 -821 142 1070
2214A070j785J46J557j343m79J926p69j404J624N2j701J246R09j764L68J330j410
$$ 1070 -715 -569 988 -355 -834 1092 323 -1081 543 595 -1106 140 1049 -715 -347 983 -427
2231d27k84J583p71q64J307k39j102J027L02j098N86N34j020K59P09p51K1O96
$$ -427 -711 872 101 -763 544 305 -797 230 532 -566 20 554 -466 -207 502 -249 -228 468
2249D68o14j84O73m56k03P20l82m21P53l01n87Q88m3q97P96K76j144N52Q60j190
$$ 468 -146 -330 343 -113 -316 404 22 -399 354 53 -534 354 311 -586 210 486 -658 -106 754 -436
2269d36P4J173j024n01J413m92r99J262N0j362R50O83j410L79J104j240k02J370
$$ -436 -362 811 -213 -714 699 207 -792 470 520 -842 108 791 -619 -240 864 -376 -578 792
2287G92p24p78J246k23j106J001M05j131M72O29r99R1Q58o14k16O96m81l54P35
$$ 792 68 -710 536 313 -793 208 613 -518 -46 583 -416 -325 533 -81 -297 399 -82 -436 299
2306B99j70l87N24k34n49O55J17n02M99N6q76L63N35n99L15O42r13l04Q31m88
$$ 299 129 -258 266 32 -517 138 255 -247 252 308 -568 -205 330 -269 46 688 -225 -529 302 -186
2326a86k56J093k91r52P48J18r59P28O45j070J44Q90q33k71J029n61p19R94M9
$$ -186 -442 651 360 -592 156 274 -685 43 688 -382 -238 652 -181 -452 577 16 -703 291 340
2345C40p17P47J65j134K55O23n87L18P89p57m92N64l58k43R27Jo46L21m6n52M34
$$ 340 -377 370 535 -599 -344 279 -308 10 799 42 -450 114 -244 -487 440 441 -205 116 70 -482 -48
2366d8L61n21J78L01m59J55M18n77j70M52l17N4P96k80o48L25k68m67R02N07o53
$$ -48 313 -208 -30 271 -188 -33 385 -192 -362 90 -227 -173 623 343 -305 20 -248 -715 187 694 41
2387D1J17J03r43J32R48l07j20O57n70o55P01M4n78N76K54p01L31N33p13j80M56
$$ 41 158 261 -682 -550 398 91 -29 628 58 -597 104 148 -430 146 400 -301 30 563 -150 -330 126
2408A26m17n4Q69o0n01J71l20n15N80M86k08K30n9p67OM28j48K26M40m87k85L92
$$ 126 -291 -345 524 464 -37 134 -186 -701 -121 365 157 387 328 -439 -433 -5 -153 73 513 26 -259 133
2430A33k38k18N08j06m05M90J51m32J81N4o44J87O21j85N7L60o40m86N24M8p5
$$ 133 -105 -323 185 79 -326 164 315 -117 64 118 -526 -339 282 97 154 514 -126 -612 -88 -40 -115
2451a15O31n7p33J15J55l67L44M96m18j36L10l21j48M30j68k74M04J9k43K96n5
$$ -115 516 459 -274 -159 -4 -371 -27 469 51 -85 225 -96 -244 186 18 -256 148 167 -76 220 165
2472A65n04J75K26j94K94K83m80j77K25k72N1N73j62l11K48j72l61M43J70l90
$$ 165 -339 -164 62 -132 162 445 -35 -212 13 -259 -208 365 203 -108 140 -32 -393 50 220 -170
2492a70K44J86m85P5L99l68j16M46k02k28M47n3m40K47J14l19K25K70l00l4J88
$$ -170 74 260 -225 -150 249 -119 -235 211 9 -219 228 175 -265 -18 96 -223 2 272 -28 -62 126
2513A26k61l3L11q7j00K07j32j75J95k7j08K07j6j98J52rk33K17J38k62J18J52
$$ 126 -135 -168 143 56 -44 163 31 -144 51 24 -84 123 107 -91 61 52 -181 36 174 -88 30 182
2535A82l57N5L53k58r6L64k47k95M14M9l72L10J19n13J58L89l33m1L91l12k95
$$ 182 -175 -120 233 -25 -121 243 -4 -299 115 164 -208 102 221 -292 -134 255 -78 -119 272 -40 -335
2556c35M79ml11K90N5m53J29L40j84k0K10k56k04K47J09k9P3q9j80JQ3J07J29
$$ -335 144 140 -171 119 174 -279 -150 190 6 -14 196 -60 -264 -17 92 63 136 47 -133 -132 -49 58 187
2579A87j19j35M8q2qL52o1l15J24L3k27L10K78m64j23L01k44m4N77j26n28K39
$$ 187 68 -67 -19 -101 -109 243 182 -133 -9 24 -203 107 385 -79 -202 99 -145 -189 388 262 -266 -27
2601b7O4l83M10M31n20j91K83k84n5O15n9m61J49nk82L56L15l33j36J01k09R2
$$ -27 37 -346 64 495 -25 -216 67 -217 -272 343 284 -177 -28 -33 -315 41 356 23 -113 -12 -221 -129
2623a29L81o5k05l8j30mK97J06j03r4k05n0K67J03JP2k75k74L02J91j25K00j7
$$ -129 252 187 -18 -56 -186 -190 107 213 110 16 -189 -239 28 131 132 204 -71 -345 -43 148 23 223 206
2646B06n42O6M68j60pL52m47m31N34J73l20L45Q0p28O0N97k13n7M39m22n28M81
$$ 206 -336 -270 198 38 31 383 -64 -495 39 212 -108 237 317 -411 -351 246 33 -24 415 -7 -535 -54
2668e4K46k51K65P1n96k4M23l6J6K20k98l16J91J62P5J40j40k57j5L8J61K70j39
$$ -54 192 -59 206 277 -319 -343 80 44 60 280 -18 -334 -143 19 94 234 94 -163 -178 -140 21 291 152
2691A52k75N4q2o9M41J30m63K1J11l44K57N60l93l37L36k24k40O71J05o15J36
$$ 152 -123 -69 -151 -220 221 351 -112 -91 20 -324 -67 493 100 -237 99 -125 -365 306 411 -204 -68
2712f8J86n04K88O31m43l41M04k86k63O87J25n95J23J21m39K84N11l24k34J95
$$ -68 118 -386 -98 533 90 -251 153 -133 -396 291 416 -179 -56 65 -374 -90 421 97 -137 58
2732E8k39j19M89O8k91M5r4k08K77K28j13m4j22j74J71J79o2J20j22l45J75K71
$$ 58 -181 -300 189 257 -34 11 -83 -291 -14 214 101 57 -65 -239 -68 111 49 169 47 -298 -123 148
2754A48j92J32K46n27j91N68j02k69N22j17p24L86M70n16J44M94o39l11P11j07
$$ 148 -44 88 334 -193 -384 184 82 -187 335 218 -506 -120 350 -166 -22 472 -167 -478 233 126
2774A26l66N76p3p26L57L96m55J78M06n64k25N54j19k46M30o0m97K09K27k07J03
$$ 126 -240 336 263 -463 -106 290 -165 13 419 -145 -370 184 65 -181 249 189 -308 -99 128 -79 24
2795B4J49k45n8J20m5J16M5j97N7Q9k21J38K87l32j08L55k16j97M57o3m13L24
$$ 24 173 -72 -130 -10 -55 61 106 -91 -34 55 -166 -28 259 -73 -181 174 -42 -239 218 155 -258 66
2817F6R8m36K98L25n52N7M72m61j50O83l19m99O48M5p11M51M27p22N8O43m83k66
$$ 66 164 -272 26 351 -201 -144 328 -133 -283 400 81 -418 230 275 -436 15 442 -280 -222 421 -62 -328
2839c28O09j65m27M24R0m07K22J35l42J71K28l11M5K17l09K2L34j86j40K11j52
$$ -328 281 116 -311 113 203 -204 18 153 -189 -18 210 -101 -56 161 -148 -126 208 22 -118 93 -59
2860e9j20K88k2j16J46k06k01L99J2k51L68l7o59L09M97m90M9N94n46m67O78J1
$$ -59 -179 109 87 -29 117 -89 -290 109 121 -130 238 201 -458 -149 348 -142 -93 501 -45 -512 166 177
2882A77m78N05J37o87K13M38m22P7L72n15j31N88j61k72M88k32o38M66L77l79
$$ 177 -301 204 341 -346 -133 305 -117 -40 332 -183 -314 274 113 -159 329 97 -541 -75 302 -77
2902g7K37K47o39k24M88J4OK66k30l16J15k1R3L43k39k96L03n7k36M68L5o45J08
$$ -77 160 407 -232 -456 32 46 52 318 88 -228 -113 -134 -41 302 63 -233 70 13 -223 245 280 -365 -257
2925b57L82k28K21M15n71l98L20j00Q1P19j85o50J81o7m38O92N70p06j13M06n72
$$ -257 125 -103 118 533 -38 -436 -116 -216 -135 584 399 -251 -70 -137 -575 117 687 -19 -132 274 -298
2946b98j46Q32j27n80L94J04l84L36K18n38p4K07j25L58L86m31l46P1l00J35Q01
$$ -298 -444 388 261 -319 75 179 -205 131 349 -189 -263 -56 -181 177 563 132 -214 -143 -443 -308 493
2967D93Jm52J3k62l48M58M25j83L2p0m19J65L12k50O5K11m25N0O58k72m51L00
$$ 493 494 42 55 -207 -555 -97 328 145 177 107 -312 -147 165 -85 -20 191 -234 -184 474 202 -249 51
2989E1k15m31P32N16n15p2J4o62N9P73N3p8J97n32m62M87J48j79M67oo60K15L70
$$ 51 -164 -595 137 653 138 66 80 -582 -523 250 303 225 422 -110 -572 -85 63 -116 351 345 -315 -100 270
3012B70m54L6L95l83j14N63j8l05O7k34k86M06K96j2J74k81o08J59L32r7L46L03
$$ 270 -184 -148 247 -136 -250 313 295 -10 57 -177 -463 -57 239 227 401 120 -488 -329 3 -94 252 555
3034E55o18k62L43j87l9N18j37l88K98K2k91K76L5m61K42L67l02J13L16o07k87
$$ 555 -63 -325 18 -169 -208 310 173 -215 83 105 -186 90 125 -336 -94 273 -29 84 400 -207 -494
3055d94N66m5j56N64p3p03J35K51k92K70L91l72j55K09k28l0L54j74j59L30j04
$$ -494 72 27 -129 435 362 -341 -206 45 -247 23 414 42 -113 96 -132 -162 192 18 -141 189 85
3076H5k46L18n2l89K33K24k40J51K27m12r3K23j34O7L36k40j90K43k08j62M45
$$ 85 -161 157 105 -284 -51 173 -67 84 311 -101 -194 29 -105 -38 298 58 -132 111 -97 -259 186
3097A86j8l91L09J12m59K03L49m37o4M61k53j98L93j23l39L20Q0l03K61J06l95
$$ 186 168 -223 86 198 -261 -58 291 -146 -210 251 -2 -200 193 70 -269 51 131 -172 89 195 -200
3118b00J24K61l12P0L39l29j88L84r0k23L28k6l29J81J43k11J07J13k45N7J54
$$ -200 -76 185 -127 -57 282 -47 -235 149 59 -164 164 138 -191 -10 133 -78 29 142 -103 -46 108
3139A08j71P7J85l01m8K86j37q3L22j66l43K66Q3k12K71J15m24N4K04k52J25L49
$$ 108 -63 14 199 -102 -150 136 -1 -84 238 72 -271 -5 78 -134 137 252 -172 -118 86 -166 -41 308
3161C08l28j77L19j79j87M61m1m50K55K11l71J57L25m11j37L60j00j04L38j10
$$ 308 -20 -197 122 -57 -244 217 176 -274 -19 192 -179 -22 303 -108 -245 115 15 -89 249 139
3181A39l40J34N1q9K63R7l05kM8j83J82K68k19r8J32j84j5K79q0j42J38j09j21
$$ 139 -201 -67 -16 -105 158 255 -50 -52 -4 -187 -5 263 44 -54 78 -106 -121 158 78 -64 74 -35 -156
3204a56L08J0k69J35Nk70K48L14l41p6K22l00j03M86j4k85J71o7l13K54K52k48
$$ -156 152 162 -107 28 33 -237 11 325 -16 -92 130 -170 -273 213 199 -86 85 18 -295 -41 211 -37
3226c7N1J19l31L4L59j74j06K52k16k21L95N2k72J60L1l29J29K98j40k9J01k31
$$ -37 14 133 -198 -164 195 21 -85 167 -49 -270 125 177 -95 65 96 -233 -104 194 54 25 126 -105
3248a05o4K65l5l9J56k12j62K40K4j22K28k7l53J36J69j43J11J52l28o0K68j45
$$ -105 -169 96 61 22 178 -34 -196 44 68 -54 174 147 -206 -70 99 -44 67 219 -109 -169 99 -46
3270d6oK86j90k78K91Mk28K84J22m22M4K81k24OL21k07k58K40J6j34K20J4k57
$$ -46 -52 234 44 -234 57 61 -167 117 239 -183 -139 142 -82 -76 245 38 -220 20 36 -98 122 136 -121
3293a21P2N2j24J80J34k54rJ28j92O2K77j71j52J93r8j26K81J6k58J41L9k46J95
$$ -121 -49 3 -121 59 193 -61 -70 58 -134 -72 205 34 -118 75 -23 -149 132 148 -110 31 70 -176 19
3316A9J91k41k2J84k48l3L63j02k23J90o0k21K41J50k40N6Q3k44O6K26j43j2J44
$$ 19 210 -31 -53 131 -117 -150 213 111 -112 78 18 -203 38 188 -52 4 87 -157 -91 135 -8 -20 124
3339A24k02p9K71n7j58K02m7k43J77J45k06O9J16k27%K13q1l1J23j44j05J89j6
$$ 124 -78 -157 114 57 -101 101 54 -189 -12 133 -73 -4 112 -115 -115 98 17 -14 109 -35 -140 49 33
3362C3r9J86p6k11J81P7j90J46J16k76J6K39j84k1K46j71j86K59k9j88K61L6l32
$$ 33 -66 120 44 -167 14 91 -99 47 163 -113 -97 142 -42 -63 183 12 -174 85 56 -132 129 165 -167
3385a67J13K09k58M8K60k13j58K44o2j50K44%k46J00Q3j34R1R6j67K5P9j25M9
$$ -167 -54 155 -103 -55 205 -8 -166 78 16 -134 110 110 -136 -36 47 -87 4 100 -67 -42 37 -88 -39
3408c9J45j37k3J29j20n2K10q0j44J74l8j69K04N1k34J13J28k38O4K32k09p6K33
$$ -39 106 -31 -54 75 -45 -97 113 33 -111 63 25 -144 60 111 -123 -10 118 -120 -56 176 -33 -109 124
3431A24j39j38K64ok34J70O0k55J46J95k60J5K08k08q0K74q6j81K12j1k14J45
$$ 124 -15 -153 111 105 -129 41 101 -154 -8 187 -73 -58 150 -58 -138 136 50 -131 81 70 -144 1
3453AJ24k03O9J15j65jJ42q7m9J32q6o3J16m4p1J17k6j09J08J3j02J07J2j56J20
$$ 1 125 -78 -9 106 -59 -60 82 -5 -54 78 -8 -71 45 1 -70 47 21 -88 20 33 -69 38 50 -106 14
3478A4Q7k09R1J38k12JK49j65j46K95p4k52K42R2k99J35J83k53l0K53j47r7K29
$$ 14 101 -108 -17 121 -91 -90 159 -6 -152 143 69 -183 59 151 -148 -13 170 -83 -113 140 -7 -104 125
3501A25q1j77J98j2j75J69O9k00O9J23j81PJ72j02q6J48l9r3R2k4n8Q8k7m7J04
$$ 125 44 -133 65 53 -122 47 116 -84 -15 108 -73 -66 106 4 -82 66 27 -66 26 2 -56 32 5 -42 62
3526F2k9j16J10J0j69J46J11k02L9J47j80m3K02q6j03K19n6j90J65K5k02J61J40
$$ 62 33 -83 27 37 -132 14 125 -77 -38 109 -71 -114 88 2 -101 118 62 -128 37 62 -140 21 161
3549A61k67P9K24k58q9K81r7j89K93K3k89J13J31k37M4J99j05l0J10j34o3J20
$$ 161 -106 -27 197 -61 -150 131 34 -155 138 161 -128 -15 116 -121 -77 122 17 -13 97 -37 -100 20
3571B0l9pJ33n8j09J13l8j29J23O0j03O8L7j32L8N7j21O9J12j33M4J27k03r4K54
$$ 20 -19 -26 107 49 -60 53 15 -114 9 69 -34 34 71 -61 -23 34 -87 -18 94 -39 5 132 -71 -165 89
3596H9o8j81K58N6l00J03J71k49J4K68j42r8J96r8j52J77mj57K16M0k07Q1J05
$$ 89 21 -160 98 154 -146 -43 128 -121 -107 161 19 -79 117 19 -133 44 40 -117 99 139 -68 13 118
3619A18k31K6K32j41o8K02o6k05J15M3r4R5N4q2J5k1o8P5K8j06J47O8k19J5J64
$$ 118 -113 -87 145 4 -64 138 72 -133 -18 25 -69 26 80 -2 13 -8 -76 -1 27 -79 68 136 -83 -68 96
3644I6j61m4K27p1j54J89l2j99J55O2j59J05R1j95M9J84k30l2K59j29j60K57O
$$ 96 -65 -109 118 47 -107 82 50 -149 6 68 -91 14 105 -90 -41 143 -87 -119 140 11 -149 108 114
3667A14k74J62J36k44M3K13j42n5J20q4o2J30k9l9R1o3q4J37l6j28J37N7j80O1
$$ 114 -160 2 138 -106 -63 150 8 -47 73 -11 -73 57 28 -11 80 17 -67 70 34 -94 43 100 -80 -19
3691a9J23j51LJ29j02m0J41p7n4J12r3o5J85m9j62J91L0k47J11J85k24%K27j68
$$ -19 104 -47 -44 85 -17 -57 84 7 -47 65 -28 -93 92 43 -119 72 102 -145 -34 151 -73 -73 154 -14
3715a4j38K22j0j48J40K5j84R0P8j36Q4R4j56PJ35j40k6K03q1j53J60kj32J10
$$ -14 -152 70 60 -88 52 77 -107 -17 61 -75 9 103 -53 -46 89 -51 -77 126 45 -108 52 50 -82 28
3739B8M1j18M2N5r2O9M7j13M8O3j48M0J79j51r4K04p1j52K02L7k15P1J21j70L4
$$ 28 69 -49 -7 48 -44 25 72 -41 7 70 -78 -38 141 -10 -104 100 29 -123 79 116 -99 -28 93 -77 -43
3764d3J71j29o4J32j16o0J90l0j17J28k7j99J61J39j94L1J29j49n3J72m2p9R9
$$ -43 128 -1 -65 67 -49 -109 81 51 -66 62 35 -164 -3 136 -58 -27 102 -47 -100 72 30 -49 50
3787E0l1r2Q9J5m6P6m9j22J29N8j15R2O7k15J2J56q4k7J73q3j67J21kp2J32K5
$$ 50 19 -73 16 31 -15 61 12 -110 19 77 -38 54 121 -94 -82 74 -10 -37 136 53 -114 7 5 -67 65 90
3813I0j72Q9P2j74Q2J30j80m1K17q1j13K03n2k40J06J14p3Q2J01k08q4Q9l6Q3
$$ 90 -82 7 79 -95 -13 117 -63 -104 113 32 -81 122 70 -170 -64 50 -23 59 160 -48 -132 -43 -79 4
3837DJ41r1r4M3j02k8K01J6j19P3k5j20R6J00j30nP5o1L9J19j09j04P2p7RK21
$$ 4 145 54 -40 3 -99 -127 74 90 -29 44 19 -101 -5 95 -35 -40 35 -26 13 132 23 -81 -9 -86 -77 144
3863A44Nj71M6m9j78J79K10j22n3O2j68m9K08mp5J01n3j27J48K9j40N1K9j54J16
$$ 144 149 -22 24 -25 -203 -24 186 64 11 73 -95 -144 64 60 -15 86 33 -94 54 83 -57 -6 23 -131 -15
3888a5K16j30j14M0j26m6K45R5j12lo8j75R0J62LN0k3j88qJ16j9L3P1j28m7J36
$$ -15 201 71 -43 -3 -129 -175 70 165 53 50 -18 -193 -103 59 62 112 89 -99 -107 9 -10 23 94 -34 -81 55
3914E5Np6O6n7j15J25J03n3N5m8k21K8J70rN2J01k00j71J67N3o6J51Ok17J5J31
$$ 55 60 -16 50 -7 -122 3 106 53 108 60 -161 -133 37 28 80 181 -19 -190 -23 30 -36 115 121 -96 -81 50
3940E0q3M7J00j54q0J38J8j7R2j08j79J26J08o0R5J5k07m9J31JN8R6j01j46M3
$$ 50 -33 14 114 -40 -120 18 36 19 111 3 -176 -50 58 -2 93 108 -99 -148 -17 -16 42 138 37 -109 -66
3965f6L9M1R6p2r3L4Kj1J24mj58K9N7n6Q6R8j49q5R4l2K4J43n5j79P6J3n4J44
$$ -66 -27 14 110 38 -55 -21 -19 -30 94 90 -68 -39 18 -38 48 146 -3 -88 6 -26 -2 141 86 -93 -17 -4 -58 86
3993H6O1k00j9J12p8KJ79q8j58Q5K7p0J05O4j41m1O4j1L0Q8r9o3M8oK1P8k2j19
$$ 86 147 -53 -72 40 -38 -36 143 55 -103 -18 9 -61 44 108 -33 -74 -10 -21 9 97 -2 -65 -17 -23 -2 76 54 -65
4021f5L6JpJ17J0j21l0J7jR5O5j18m5L7q5P5J54j01r4R1m9q2J94L0j76j4R2q7
$$ -65 -29 -28 -35 82 92 -29 -59 -42 -43 52 117 -1 -46 -9 -94 -19 135 34 -60 31 -18 -100 94 124 -52 -66 26 -61
4049f1P1J70j42j31Q5k5k6J81Mj72mL7p3J01J32j21q2L7m9L6J20k1r1k5lK6J06
$$ -61 10 180 38 -93 -8 -33 -59 122 126 -46 -50 -13 -86 15 147 26 -56 -19 -68 -32 88 67 -24 -49 -52 -26 80
4076H0pr1Nn3j2J42M5j00j1m3q7R4J83o5r3K2j07j6J95L0j14K5m4j18J34J39j18
$$ 80 73 -18 -13 -66 -78 64 109 9 -2 -45 -132 -38 145 80 -13 9 -98 -114 81 111 -3 22 -22 -140 -6 133 15
4103A5m0N5j35LK14pj24L4n2q3J69R7j13n0J8j16O0J63k0p7K1j19l6J57P8o6k7
$$ 15 -25 30 -105 -102 112 105 -19 15 -37 -120 49 146 33 -17 1 -115 -55 108 88 11 32 -87 -123 34 112 46 19
4130A9o2p0Q6J13k3l0n5q1N5Q5J0L4l6j40j2J60k4J4Q6j49j41J47J00r3Q1K3k25
$$ 19 -43 -113 -27 86 63 33 -22 -103 -48 37 47 81 45 -95 -107 53 29 43 129 -20 -161 -14 86 -7 74 97 -128
4157a28K5J84o0j9J19j28j61J68Q5r9Q7J8k06J0J77j8k6O1j07q6J02N2j4L7l4
$$ -128 -103 81 21 2 121 -7 -168 0 85 -14 73 91 -115 -105 72 54 28 89 -18 -104 -2 50 36 73 39
4182C9j12L9M1lQ8k4j34L1M3l4Q1N1j40n3R8l5KJ28o0j30P8J0p3J25M8j68J2P3
$$ 39 -73 -34 7 4 92 68 -66 -35 8 -26 55 106 -34 -87 11 -24 -22 106 46 -84 -6 4 -69 56 104 -64 -52 21
4210B1p1M2J25j10q2J21n0n6J47j3j38P0L4j13P6J21j57j8J01q9k2J57l8j20Q6
$$ 21 -50 -8 117 7 -75 46 -4 -60 87 74 -64 6 40 -73 3 124 -33 -51 50 -39 -61 96 58 -62 24
4235B4J2q4N7O8p7k3N7m9NN2k8pNn3K8M9l7j3N9n6o0J05pp9Q8K0j38O1R1r8KJ19
$$ 24 36 -48 9 77 0 -23 34 -15 -10 42 14 7 12 -41 -13 36 -1 -14 45 -11 -71 34 27 -52 36 56 -82 -21 70 -28 -26 93
4267I3j17p3J58m0r7J36K8j76O2J00j09J4J19r4o6R0k3l1P3qn4J9%k3P1Jp9M3
$$ 93 -24 -97 61 21 -76 60 88 -88 -26 74 -35 -21 98 4 -62 28 5 -26 47 39 -15 4 4 -19 52 53 -26 17
4295A7Kq4P2P0p4k9O6p2mR9l5o2M5pn1P1L0p8L1K1r4L9J03p2l6O6o8l4J37k0r2
$$ 17 19 -65 7 77 3 -26 40 -32 -36 63 28 -34 11 4 -47 24 54 -24 7 28 -66 -27 76 4 -32 34 -34 -68 69 49 -43
4326d3O3j6q8J02O4j11J0O8j23J0J47m5p3P6m5q6J10O5j03jM9n9RP4l7l3K2k3
$$ -43 20 4 -84 18 82 -29 -19 49 -74 -64 83 38 -35 41 -4 -90 20 85 -18 -19 30 -29 -20 54 17 -16 6 -17
4354a7J0N7k1j4np4J0J11nn7M0n1q6R5P2p4J2N6j12j4J29o1l5R0n9q7J11N6j18
$$ -17 -7 50 29 15 10 -64 -54 57 52 -5 35 -16 -102 -7 65 -9 3 59 -53 -67 62 1 -34 56 -3 -90 21 77 -41
4383d1K6M2j18O4J35p0o6L2o8k4J19M6o1K0m2q8N9P3j5J4np8NQ1k5k3K9n0nQ9
$$ -41 -15 27 -91 -27 108 38 -28 4 -64 -88 31 77 16 36 -6 -94 -35 38 23 37 32 -46 -41 40 15 -8 21 -29 -34 55
4413E5J1m6ln7m1P6Q5j0oo0j33M1J11KM2K9j47p0J20%j5R5m6j10O8P2q5J7M1j28
$$ 55 66 20 17 -40 -81 -5 80 70 64 4 -129 -88 23 25 67 96 -51 -121 -1 -1 -16 79 33 -77 -9 63 -22 -5 36 -92
4443i2PJ51J5n2J0q6j05J06J26j9J6j8j39l9R0M2M3L1p7o4kL9L3L7o5k2L5L9o
$$ -92 -85 66 81 29 39 -47 -152 -46 80 61 77 59 -80 -119 -29 13 56 87 10 -54 -56 -17 16 53 -12 -34 1 40 34
4472C4L9o8j19O2O9K7O2Lj58p4O6M3O9R8p9j46K0J3%J00M8j29k6O4m7K2Q0q3r6
$$ 34 73 5 -114 -52 17 44 106 109 -49 -123 -57 -14 55 153 74 -72 -52 -39 -39 61 109 -20 -46 18 -29 -7 73 -10 -106
4501a06Q3M6mO3k7j50j9Q7M2O1M6j25r9J8M4M9Q5qj03m8J0K9P8J1o8k3j6K9O9
$$ -106 -23 23 19 82 55 -95 -114 -27 15 76 122 -3 -102 -84 -40 9 94 86 -17 -65 -55 -26 52 63 -5 -28 -44 -15 54
4530E4Op8l0J8j2Q1Q6r4q3Pk3K5J48K5j29l6Lm5P8J05o5o9K5l2nJ04Nr3J0Pl4
$$ 54 60 -18 -48 -30 -42 39 125 31 -52 -45 -68 -43 105 130 1 -35 -32 -77 1 106 41 -28 -3 -35 -40 64 69 -24 -14 -7 -41
4561d1P5O1q5n8J0j5N4P9k9q1mj6KJ05K1o2k7l2j8O3O6j2n6l0l0M4P6ol6k0n4
$$ -41 34 95 10 -48 -38 -53 1 80 51 -30 -34 -50 -48 57 78 16 -11 -43 -61 2 68 56 0 -30 -60 -16 60 54 18 -2 -56
4592e6QR0J5l9kl9l3O7N6n6oqo8L2J19k6p3J9l1n2J13N9p5oQp9K7Q8rm1J9m4l6
$$ -56 -48 42 57 18 16 -23 -56 11 67 11 5 -3 -71 -39 80 54 -19 0 -31 -83 30 89 14 8 16 -63 -36 52 43 2 21 -23 -59
4625e9O8M1l9j1j0l1M7L6l7Jj5n4M5O3k2k%q1JQ9J9l3M8p3o3O0M7m2J8M0r2K0
$$ -59 9 50 11 0 -10 -41 6 42 5 6 -9 -63 -18 45 23 21 21 -60 -59 30 49 16 64 -9 -72 -12 35 -7 11 51 -41 -21
4657b1O6l9rL6m9k9O2L2o4M1j9p8M4Q3l5jMn2j7O7jk1L6j5m9K6J7k3K5J4o7J3
$$ -21 45 6 -3 33 -16 -45 17 49 -15 26 7 -71 -27 56 21 20 24 -28 -45 22 21 0 36 21 -28 -2 15 -8 17 31 -36 -23
4689b3O3m1kK3m3pM9mj1J3j9l7L1J1jL8j7n9RM4k6K2M4o8k0O6l5l2P0ko4L8L6
$$ -23 40 -1 -3 20 -23 -30 19 15 4 17 -2 -39 -8 3 2 40 23 -36 -27 17 -9 13 57 -11 -31 35 0 -32 38 36 -28 10 46
4722D6n9K2L0m3j4O2m4j8N5k5n4O1Ol6OL0m1RL4l6%L6k7j6L2j8j0L6j6l7M6pl5
$$ 46 -13 9 39 -4 -18 44 0 -18 37 12 -42 19 25 -11 -5 25 -16 -7 27 -9 -9 27 0 -16 16 -2 -12 24 8 -29 17 10 -25
4755b5K9J2l5K3J8n1J0N0l9KL9l8k6M3Jl2L9%m4K4J0k1L4L6p1kM2k9JL8k1l9L5
$$ -25 4 16 -19 4 22 -29 -19 31 -8 -6 33 -5 -31 12 13 -19 20 20 -24 0 10 -11 23 59 -12 -14 28 -1 0 38 17 -22 13
4788A3mm1N2J0m8J3J7n2L5O6n5k0L4j7k5N6j8n0L6Rk3L2J4n4kK4j8K6L7m6k6J4
$$ 13 9 -32 20 30 -18 -5 12 -40 -5 61 6 -14 20 3 -22 34 16 -34 2 11 -12 20 34 -20 -22 2 -16 10 47 1 -25 -11
4820a1j0JO7k0n1J1koL1K4m7LJ8m4J8O6k7m5L5l1j0P5On7J2lk9L3L9k7k6J4k4
$$ -11 -21 -20 47 27 -24 -13 -15 -21 10 34 -13 -10 8 -36 -18 48 21 -24 11 -20 -30 45 51 -6 6 3 -26 7 46 19 -7 7 -17
4853a7nN9lm8J0k1j3P8nl7kpl6M4O1n6j5L4n9J2N7j3j5Kk6l5O8M4m6qom6M7N6
$$ -17 -22 37 34 -14 -4 -25 -38 40 35 -2 -4 -11 -47 -3 58 2 -13 21 -38 -26 31 18 3 5 -21 -56 12 56 10 2 -4 -50 -3 53
4887E3l2k5J4m6lN8J6k7J2l2n0O7K4j4Rk5n7L3P7l4j2J9o2oO9Qm0L8k8o7M7M8
$$ 53 21 -4 10 -36 -39 19 35 8 20 -12 -62 5 29 15 24 -1 -58 -25 52 18 6 25 -37 -43 26 34 -6 32 4 -63 -16 32
4919C2j4Kj0o2J7N6Qj8Jl9l5O1J6nJ0j8o1L0N0j6K8k0o3j1Q5j5lL7o4m9Q1Rj9
$$ 32 18 20 10 -52 -35 21 29 11 12 -27 -62 -1 15 10 20 2 -59 -29 21 5 33 13 -50 -61 24 9 6 43 -21 -70 11 20 1
4952AK7op6K0M7%OJ4m7l5N3J8j2J5l3l5K9K5OJ3j4m7OK0J2K0J2n6l2M7NRM1l7
$$ 1 28 22 -54 -34 13 13 19 33 -14 -49 4 22 10 25 -8 -43 -14 11 17 30 16 -31 -25 -5 7 27 39 -17 -49 -2 3 12 53 16
4986A6p1K8K1j7M0J5n7qL3pJ9K3l9m6L5RJ0M6m2n2K4RLL5Nn1MJ5j8K2M9m9l1K7
$$ 16 -55 -27 -6 -23 17 32 -25 -33 0 -7 12 35 -4 -50 -15 -6 4 50 8 -44 -20 -11 -8 27 32 -19 -15 0 -18 4 53 4 -27 0
5020@k1J2M5mq0K0L1j2L3Jl7l1K7KJ1M7j5o0lJ6PM9%m8j7J8j4L3K5m1j1L2l1m
$$ 0 -21 -9 36 32 -48 -28 3 -9 24 25 -12 -43 -16 -14 -3 44 29 -31 -34 -18 -11 38 38 -10 -27 -9 -23 10 35 -6 -17 15 -16 -20
5054b0M8kn0J5klL3Rn1k1J8mL4M1l0m8K6nj2N7qj8j3Jj9M5J7m5Ljk2M8K7m3j6
$$ -20 28 26 -24 -9 -11 -14 19 28 -23 -44 -26 -30 4 45 15 -33 -7 -12 -24 33 25 7 -6 -5 -24 21 38 -7 -4 -5 -27 21 48 5 -11
5089a1K0k6j4O9j0m6RJ3n1L7O5l8l4K2l4nN5pk4J1oJJ9Nj7mJj6J9J9j0j4qj8N
$$ -11 9 -17 -31 38 28 -18 -9 4 -47 -10 55 17 -17 5 -29 -34 21 14 -10 1 -5 -4 15 20 3 -1 0 -16 3 22 12 -2 -10 -28 -23
5124b3M1Jk7Qj7j1N7j1l2K3Nm9J8M1j3qJ3k8k0N5jk5J4Jm0L3L2k2j6K3l5mJ8K7
$$ -23 18 19 -8 0 -17 -28 29 18 -14 9 14 -35 -17 24 11 3 16 -12 -32 23 22 -3 11 12 -28 5 37 15 -1 22 -13 -17 1 28
5158B8l0J9k9k5L3J3j8J3%l4L3J8l3jL5l6mL5j0oPj0k1K1J6j6Nnj6J2K0k6OJ1
$$ 28 -2 17 -12 -37 -4 9 -9 4 4 -30 3 21 -12 -13 22 -14 -18 17 7 1 8 -2 -23 -2 14 -2 3 -2 -18 -6 14 -12 -6 5
5192Ej3JK0j6rK2j1l3K9J1l7L4Ql1KM4k5j7L0qj9K1Ll9K9J4l8J4K1k1kJ8ql0M6
$$ 5 -8 -7 13 -3 -12 10 -1 -34 -5 6 -31 3 11 -20 -18 26 1 -16 14 6 -13 8 11 -28 1 15 -23 -9 12 -9 -11 7 -1 -31 15
5227A5l1NK0j4nJ3Nk7J4JjLJ8k7JK1j2j4K8j5k1K8Jj8L5om4K2J3j3PK0k8j2K1
$$ 15 -16 -11 9 -5 -10 3 8 -19 -5 -4 -5 -2 16 -11 -10 11 -1 -15 13 -2 -23 5 6 -12 23 17 -27 -5 8 -5 2 22 -6 -18 3
5262Cj3NJ8J2l9K8k3mK7mk5J3K5l7J2M1m2k1L9j2nM0k1m6QK0k7K5L6l8j5J2lj3
$$ 3 -10 -5 13 25 -14 14 -9 -13 14 10 -15 -2 23 -14 -2 39 -3 -24 15 3 -2 38 17 -29 -21 -1 -28 -3 33 -5 -20 -8 -11 -24
5296b4L0Kj8J5Pk7P%m%J5j2K0Ll1RPk6L1K7l9j7K4j8j6M7Rl4L0kn8J5N4l9J0K8
$$ -24 6 8 -10 5 12 -15 -8 -8 -12 -12 3 -9 11 14 -17 -8 -1 -27 4 31 -8 -25 -1 -19 -35 12 21 -13 17 15 -43 -28 26 -13 -3 25
5332B5k2l4N4k2m2M5J4l2K2K7m3j9L1k0KM3rnpj6k1K6J5lNml6K3j5kQJ7llRj3
$$ 25 3 -31 23 1 -41 4 18 -14 8 35 -8 -27 4 -16 -14 29 20 15 8 -8 -29 -3 12 9 14 10 -26 -3 -18 -20 -12 5 2 -1 8 -5
5368ej8J8j9J1L9nk5J1j3m3L7K9l5J6M1n9j3O0l8k0O7pn8K9J6m5J8L5l6pO3l8
$$ -5 -23 -5 -24 -13 26 21 -4 7 -6 -49 -12 17 -18 -2 39 -20 -33 27 -11 -31 36 29 -29 0 16 -29 -11 24 -12 -19 44 6
5400Fk9K9kk8K7J7k2kJ2k1rK1J4Lk1Rlkj9K0Rm8M1K5m6pM1m4qO9j2n5M6J3q1M1
$$ 6 -23 6 4 -24 3 20 -2 -4 8 -13 -22 -1 13 16 -5 4 1 -1 -20 0 9 -39 2 27 -19 -26 15 -29 -37 32 20 -35 11 24 -57 -16
5436a6N8n2qN2n1k4O4pn2M4J9m8J4N0n0k3N3j9l5M1J5m2QJ2k2J6J6j0kj6%K0j1
$$ -16 42 -10 -18 34 -17 -41 23 16 -36 8 27 -21 -7 43 -7 -30 23 4 -31 10 25 -17 -9 3 -19 -3 13 3 1 -15 -15 5 -6
5469fJJ2pk4K3kj1K5K2m2j0K7j0rM7l6m3N8nn0K4N5p4KP5n9k3P5l2n1M8K2m5K2
$$ -6 -5 7 0 -24 -1 -3 -14 11 33 -9 -19 8 -2 -11 36 0 -43 15 10 -40 -16 39 -35 -33 42 -17 -40 35 3 -48 0 22 -23 -1
5503aK6n4%N3k1k8N6rn4J6J8nkK6l7J7%NnnLJ9k9J8J7j6k6K1J7m6L2M6n7k8N2
$$ -1 25 -29 -29 24 3 -25 31 22 -32 -16 2 -3 -5 21 -16 1 1 6 1 -4 -1 18 -11 7 24 8 -18 3 20 -26 6 52 -5 -33 19
5538A9k4m3O3J5m9J8K7n4nP8m6k7O5l4m9N9Pn3K4L1m9QM5l7k3L9pj8K6Kj3oJ5
$$ 19 -5 -48 15 30 -19 -1 26 -28 -33 45 -1 -28 37 3 -46 13 20 -33 -9 22 -27 -19 26 -11 -34 5 -2 -20 6 8 -5 -11 4
5571Dk9J2J7K0j0j4kN%nK5j3j9J8J2l3J2K2j9l0M7j9k2L6%o2N6K5p5L6M1n2j9
$$ 4 -25 -13 4 24 14 0 -2 3 3 -2 23 10 -9 9 21 -12 0 22 3 -27 20 1 -21 15 15 -47 9 34 -41 -5 36 -16 -35
5604c5O3l2k6N0K3q5J7N3n8RN2l6k2L7j1k5J9J2l1K0Rk2jL9j9rRj8J2J3pQlj8
$$ -35 28 -4 -30 20 43 -42 -25 28 -30 -21 31 -5 -27 10 -1 -26 -7 5 -26 -6 3 -19 -20 19 0 -9 0 -18 -6 7 0 8 5 -13
5638a3L2nl1K4J6l7j2N0j2l3N5j8m4M8J5n6J7K9l8lO6m1m1M9Kn8L9K9m1OL7m6
$$ -13 19 14 -17 7 23 -14 -26 24 12 -21 34 16 -28 20 35 -21 -4 25 -13 -16 50 9 -32 17 19 -39 0 29 -12 -6 31 -15
5670a5j5M5nk4K3%k4QK0pj0J9k5rK2Pj8lQmJKOJk2K0Oj7mJ9k4LL6j4k9M8lm7K1
$$ -15 -30 15 10 -14 9 9 -15 -7 13 6 -4 15 -10 -19 3 10 -8 -11 -3 -7 -6 -4 2 3 -19 1 7 -10 -14 5 -19 -16 20 6 -23 25 22 -25 -4
5709dL5m5QL8l6l4M5km1L9J2k8MK5m1K1K1j5l6L8j1j6K6J5l8OK3k3MJ3Nk6K3j3
$$ -4 31 -14 -6 32 -4 -38 7 5 -36 3 15 -13 -9 16 -25 -4 17 2 -34 4 -7 -23 3 18 -20 -14 9 -14 -10 3 8 -18 5 -8
5743hlLJ0Mj6KJ1mr%J6j2qK3j2oJ3Jk5K4J0l0RJ5j2j0L0j3l0L6K4n3K6J7m8K3
$$ -8 -11 -8 2 6 -10 -8 3 -1 -10 -10 6 -6 -14 9 -3 -9 4 5 -20 4 14 -16 -7 8 -4 -14 16 3 -27 9 33 -20 6 23 -25 -2
5779bK2k6j2L6Nl4K5Qn1J8K6l8J0J4Jj6JJ5k1K1Lk0MNoNPj3J1qOpJ0j2J0J1l2
$$ -2 20 -6 -18 18 23 -11 14 22 -29 -11 15 -23 -13 1 2 -14 -13 2 -19 2 5 -15 -11 -6 -12 -7 0 -13 -2 -10 -4 -11 -1 -13 -3 8 -24
5816b4K3kpRjkjJ4mj9K8j4j1K0jj9J1Pj3pL3j0k8L5pk6NK9k8NL7l3kK5k1mJ1j6
$$ -24 -1 -3 -10 -1 -2 -4 -5 9 5 -14 14 0 -11 9 8 -11 0 7 -6 -13 20 10 -18 17 10 -16 -11 18 -10 -5 32 -1 -3 22 1 -3 8 -8
5854h%J2Rj5j8J4j3j3L2JnK0j9j7J3J6j5J7nkOrKNrkJ8Mk7P%j8PK5pqJ4pj7J9
$$ -8 -8 4 13 -2 -20 -6 -19 -32 0 1 -4 16 -3 -20 -7 9 -6 11 6 4 10 1 3 8 -1 -3 15 19 -8 -1 -1 -19 -12 13 6 -2 12 5 -12 7
5894Gpj4L2J4l5qJ6j6JK6j2k2K6j2j5K9pk4J8J1j2Oqk7%J6JJ1RKk2Lj1RJ4J1q
$$ 7 0 -14 18 32 -3 -11 5 -11 -10 16 4 -18 8 -4 -19 10 3 -21 -3 8 -4 2 -6 -33 -33 -17 -16 -5 4 6 -16 -13 -24 -15 -1 10 2
5931BpRl8K1J3mMNjrLj6QK3kkJ8j9j0%Rk5K3K1j3j5Pk2MK2lk2K1Pl7K0K0l2RK5
$$ 2 -5 4 -34 -13 0 -4 0 5 4 -5 -2 -18 -10 13 11 9 27 8 -2 -2 7 -18 5 26 13 -2 5 -17 -13 9 6 -16 5 12 -25 -5 15 -17 -8 17
5971A7j7j0J3%j5RKmNJ2k7J1nj4LK3Nj5lj4j0K5qJ3J8j3k5K2%j7J1K1k4J1K0l3
$$ 17 0 -10 3 3 -12 -3 -1 -5 0 12 -15 -4 -9 -23 -20 3 8 -7 -10 -24 -34 -9 -17 -4 14 1 -24 -2 -2 -19 -8 13 -11 0 20 -13
6007a3NJ9k1RJ4Pk3OOl4L0mOmJ1k3NMqmK1nj6RooJ3Rj8lJ9j4NRk9J5K1j8j4L4
$$ -13 -8 11 -10 -1 13 20 -3 3 9 -25 5 1 7 3 14 -9 -4 0 -8 -12 9 4 -12 -3 -9 -15 -2 7 -11 -14 5 -9 -4 5 -24 -9 12 -6 -20 14
6047A4k9%K3ok2K7Pk6RJ5k3MJ2noK9j7j1LlMK4j7j8J8Nk0J9J2k9MJ8j5lK5j2j9
$$ 14 -15 -15 8 2 -20 7 14 -12 -3 12 -11 -7 5 0 -6 23 6 -5 -2 -5 -1 23 6 -12 6 11 -9 10 22 -7 -3 15 0 -3 22 10 -9
6084iK0pn%K5l2KQj7%J8oj0RoJ0Nqj7J5ppJ5J6k4kKk5K0L3k2RRl4j6L5Mk2L5j
$$ -9 11 4 -1 -1 24 -8 -6 2 -15 -15 3 -3 -13 -4 -10 0 5 -3 -20 -5 -12 -19 -4 12 -12 -14 -12 -37 -17 16 -6 3 12 -22 -38 -3 1 -21 14 13
6124A3m7K5K2j2j4J8j8NJ9nMj1pnJ1PMJ4j9k6L1jj7K3J1l1qJ6k2J9K3j5l2J2J6
$$ 13 -34 -9 13 1 -13 5 -13 -8 11 6 10 -1 -8 -13 -2 5 9 23 4 -22 9 8 -9 14 25 -6 -14 2 -20 -1 22 7 -25 -13 3
6159Cj2J3kl2J0Q%K0J8m3qJ0OJ1J3nk1nj4J1M1j1j2j1nJ0K4jok4Rj2kM4j1j9l
$$ 3 -9 4 2 -30 -20 -12 -12 8 26 -17 -25 -15 -9 2 15 10 -11 -16 -30 -19 22 11 -1 -12 -17 -7 17 16 10 -14 -5 -17 -19 25 14 -5 -8
6196hqJ0K2Qj6Mk4j0J9J0Lnj5j1RJ9J1qj1rj1J6K4l1J1Kl9J3L8nrqj0oK1J2j6
$$ -8 -16 -6 16 24 8 12 -12 -22 -3 7 10 5 -10 -21 -12 7 18 10 -1 -10 -21 -5 19 -12 -1 1 -38 -25 13 8 -1 -9 -19 -25 -4 8 -8
6233hJ3jk5RK7Kk5nj1RKK1MJk1PnJ1J0J0k3j7J0J8lQKl5NJ6j1OJ6k0j2K0o%J5
$$ -8 5 4 -21 -12 15 17 -8 -13 -24 -15 -13 8 12 13 -8 -1 -6 5 15 25 2 -15 -5 13 10 18 20 -15 -10 6 -5 1 17 -3 -15 5 -1 -1 14
6272A4nj2jROj1J8j9j6J6rMK1qk1NOLqK4j5rPj0OJ2j1JRj0kK2j2pkLj0J6OnJ2
$$ 14 9 -3 -4 5 11 0 18 -1 -17 -1 -10 -6 15 7 -14 -9 -3 0 -8 16 1 -8 -1 -11 -5 7 -4 -3 6 -4 -6 16 4 -3 -5 -2 -12 4 10 5 17
6313A7qj8J6Pk4RQk2QK2j5rK2j0omLjmK8l1OK0j0j0J0kk1J4Np%J7j3ljpJjQPL
$$ 17 9 -9 7 14 -10 -1 7 -15 -7 15 0 -9 13 3 -3 -7 -4 -5 -9 19 -12 -6 14 4 -6 4 2 -19 -5 0 -7 -7 10 -3 -6 -7 -14 -13 -14 -6 1 4
6355Dj1P%qJ4kj2jJ3%J9nj9j8J7Pj2J8%j4j1K4%LOj4j7LL3j4qJ2j4j8K6Jj0J6
$$ 4 -7 0 0 -8 6 4 -8 -9 4 4 23 18 -1 -19 -2 5 -7 11 11 -3 -14 10 10 13 19 5 -12 -9 24 10 2 14 0 -18 8 9 -1 15
6393A5j6kpOrJ6K0k8j6NKK7orj3%JJ6J9j3k8J2q%K2J2j8j8qJK8K1k4k0m%J6L2
$$ 15 -1 -3 -10 -4 -13 3 23 -5 -21 -16 -14 13 7 -2 -15 -15 -14 2 21 8 -20 -8 -16 -16 6 18 0 -18 -26 -25 3 24 0 -20 -24 -24 -8 24
6431B4lk4Oj6nK0L5j5k1lj5J1K6J8l0lj9jK2J2Mk5Kj1j0K8J5k0j6j3jK0L1Jk5
$$ 24 21 -3 3 -13 -18 2 37 22 1 -2 -17 -6 20 38 8 5 -14 -15 7 19 23 -2 0 -11 -21 7 22 2 -14 -27 -28 -8 23 24 -1
6466aj6kOK7Mj1j6pkRK0J2j0k8j6K9K7j6Jj6j7LK7PpLk6j8L6J9Pqj9k8MM1MoL
$$ -1 -17 -19 -13 14 18 7 -9 -16 -18 -9 11 23 13 -15 -31 -2 25 9 10 -6 -23 -20 7 14 7 10 -16 -34 2 21 28 20 1 -27 -23 18 22 16 19
$$ [...]
8191G
##END NTUPLES=NMR FID
##END=
