##TITLE=1H_LY-822.24
 CCl4, 8 sc, 
 28.5.2019
##JCAMPDX= 6.0         $$ Bruker NMR JCAMP-DX V2.0
##DATA TYPE= NMR FID
##DATA CLASS= NTUPLES
##ORIGIN= UXNMR, Bruker Analytische Messtechnik GmbH
##OWNER= root
$$ XWIN-NMR		Version 3.5
$$ Tue May 28 14:50:30 2019 Russian Standard Time (UT+4h)  she@DPX200
##.OBSERVE FREQUENCY= 200.1315
##.OBSERVE NUCLEUS= ^1H
##.DELAY= (6, 6)
##.ACQUISITION MODE= SIMULTANEOUS
##.ACQUISITION SCHEME= undefined
##.AVERAGES= 8
##.DIGITISER RES= 18
##SPECTROMETER/DATA SYSTEM= spect
##.PULSE SEQUENCE= zg30
##.SOLVENT NAME= CDCl3
##.SHIFT REFERENCE= (INTERNAL, CDCl3, 0, 15.7039)
##AUDIT TRAIL= $$ (NUMBER, WHEN, WHO, WHERE, WHAT)
$$ ##TITLE= Audit trail, XWIN-NMR		Version 3.5
$$ ##JCAMPDX= 5.01
$$ ##ORIGIN= Bruker BioSpin GmbH
$$ ##OWNER= she
$$ F:/spectra/data/she/nmr/H-F/1/audita.txt
$$ ##AUDIT TRAIL=  $$ (NUMBER, WHEN, WHO, WHERE, WHAT)
(   1,<2019-05-28 14:49:30.28 +0400>,<she>,<DPX200>,
      <created by zg, POWCHK disabled, PULCHK disabled
       configuration hash MD5:
       00 E9 B6 7A A2 85 ED C7 34 08 36 98 17 FE 4E 26
       data hash MD5: 16K
       15 E3 0E 1F 1F D1 A6 34 B8 53 76 75 7F A9 7F FD>)
$$ ##END=
$$ 
$$ hash MD5
$$ 5F 75 00 12 59 D3 32 74 12 C4 B5 CA 02 01 5F E3
##$RELAX= 
##$RELAX= 
##$RELAX= 
##$RELAX= 
##$RELAX= 
##$RELAX= 
$$ Bruker specific parameters
$$ --------------------------
##$DU= <F:/spectra>
##$EXPNO= 1
##$NAME= <H-F>
##$PROCNO= 1
##$TYPE= <nmr>
##$USER= <she>
##$AMP= (0..31)
100 100 100 100 100 100 100 100 100 100 100 100 100 100 100 100 100 100 
100 100 100 100 100 100 100 100 100 100 100 100 100 100 
##$AQSEQ= 0
##$AQ_mod= 1
##$AUNM= <au_zg>
##$AUTOPOS= <>
##$BF1= 200.13
##$BF2= 200.13
##$BF3= 200.13
##$BF4= 200.13
##$BF5= 200.13
##$BF6= 200.13
##$BF7= 200.13
##$BF8= 200.13
##$BYTORDA= 1
##$CFDGTYP= 0
##$CFRGTYP= 5
##$CHEMSTR= <none>
##$CNST= (0..31)
1 1 145 1 1 1 1 1 1 1 1 1 1 1 1 1 1 1 1 1 1 1 1 1 1 1 1 1 1 1 1 1 
##$CPDPRG= <>
##$CPDPRG1= <>
##$CPDPRG2= <>
##$CPDPRG3= <>
##$CPDPRG4= <mlev>
##$CPDPRG5= <mlev>
##$CPDPRG6= <mlev>
##$CPDPRG7= <mlev>
##$CPDPRG8= <mlev>
##$CPDPRGB= <>
##$CPDPRGT= <>
##$D= (0..31)
0 1.2 0 0 0 0 0 0 0 0 0 0.03 0 0 0 0 0 0 0 0 0 0 0 0 0 0 0 0 0 0 0 0 
##$DATE= 1559040569
##$DBL= (0..7)
120 120 120 120 120 120 120 120 
##$DBP= (0..7)
150 150 150 150 150 150 150 150 
##$DBP07= 0
##$DBPNAM0= <>
##$DBPNAM1= <>
##$DBPNAM2= <>
##$DBPNAM3= <>
##$DBPNAM4= <>
##$DBPNAM5= <>
##$DBPNAM6= <>
##$DBPNAM7= <>
##$DBPOAL= (0..7)
0.5 0.5 0.5 0.5 0.5 0.5 0.5 0.5 
##$DBPOFFS= (0..7)
0 0 0 0 0 0 0 0 
##$DE= 6
##$DECBNUC= <off>
##$DECIM= 24
##$DECNUC= <off>
##$DECSTAT= 4
##$DIGMOD= 1
##$DIGTYP= 9
##$DL= (0..7)
0 120 120 120 120 120 120 120 
##$DP= (0..7)
150 150 150 150 150 150 150 150 
##$DP07= 0
##$DPNAME0= <>
##$DPNAME1= <>
##$DPNAME2= <>
##$DPNAME3= <>
##$DPNAME4= <>
##$DPNAME5= <>
##$DPNAME6= <>
##$DPNAME7= <>
##$DPOAL= (0..7)
0.5 0.5 0.5 0.5 0.5 0.5 0.5 0.5 
##$DPOFFS= (0..7)
0 0 0 0 0 0 0 0 
##$DQDMODE= 0
##$DR= 18
##$DS= 0
##$DSLIST= <SSSSSSSSSSSSSSS>
##$DSPFIRM= 0
$$ [...]
##$SUBNAM2= <"">
##$SUBNAM3= <"">
##$SUBNAM4= <"">
##$SUBNAM5= <"">
##$SUBNAM6= <"">
##$SUBNAM7= <"">
##$SUBNAM8= <"">
##$SUBNAM9= <"">
##$SW= 24.9337058887773
##$SWIBOX= (0..15)
0 0 2 0 0 0 0 0 0 0 0 0 0 0 0 0 
##$SW_h= 4990.01996007984
##$TD= 16384
##$TD0= 1
##$TE= 0
##$TE2= 300
##$TE3= 300
##$TEG= 300
##$TL= (0..7)
0 120 120 120 120 120 120 120 
##$TP= (0..7)
150 150 150 150 150 150 150 150 
##$TP07= 0
##$TPNAME0= <>
##$TPNAME1= <>
##$TPNAME2= <>
##$TPNAME3= <>
##$TPNAME4= <>
##$TPNAME5= <>
##$TPNAME6= <>
##$TPNAME7= <>
##$TPOAL= (0..7)
0.5 0.5 0.5 0.5 0.5 0.5 0.5 0.5 
##$TPOFFS= (0..7)
0 0 0 0 0 0 0 0 
##$TUNHIN= 0
##$TUNHOUT= 0
##$TUNXOUT= 0
##$USERA1= <user>
##$USERA2= <user>
##$USERA3= <user>
##$USERA4= <user>
##$USERA5= <user>
##$V9= 5
##$VALIST= <valist>
##$VCLIST= <CCCCCCCCCCCCCCC>
##$VD= 0
##$VDLIST= <DDDDDDDDDDDDDDD>
##$VPLIST= <PPPPPPPPPPPPPPP>
##$VTLIST= <TTTTTTTTTTTTTTT>
##$WBST= 1024
##$WBSW= 4
##$XGAIN= (0..3)
0 0 0 0 
##$XL= 0
##$YL= 0
##$YMAX_a= 26602
##$YMIN_a= -32799
##$ZGOPTNS= <>
##$ZL1= 120
##$ZL2= 120
##$ZL3= 120
##$ZL4= 120
##$ABSF1= 10
##$ABSF2= 0
##$ABSG= 5
##$ABSL= 3
##$ALPHA= 0
##$AQORDER= 0
##$ASSFAC= 0
##$ASSFACI= 0
##$ASSFACX= 0
##$ASSWID= 0
##$AUNMP= <proc_1d>
##$AZFE= 0.1
##$AZFW= 0.1
##$BCFW= 1
##$BC_mod= 2
##$BYTORDP= 1
##$COROFFS= 0
##$CY= 11.3945322036743
##$DATMOD= 1
##$DC= 2
##$DFILT= <>
##$DTYPP= 0
##$F1P= 18.9103706918063
##$F2P= -1.10871071338519
##$FCOR= 0.5
##$FTSIZE= 0
##$FT_mod= 4
##$GAMMA= 1
##$GB= 0.15
##$INTBC= 1
##$INTSCL= 1
##$ISEN= 128
##$LB= 0.24
##$LEV0= 0
##$LPBIN= 0
##$MAXI= 10000
##$MC2= 0
##$MEAN= 0
##$ME_mod= 0
##$MI= 1.114404
##$NCOEF= 0
##$NC_proc= 0
##$NLEV= 6
##$NOISF1= 3.799351
##$NOISF2= 2.8
##$NSP= 1
##$NTH_PI= 0
##$NZP= 0
##$OFFSET= 15.70392
##$PC= 1
##$PHC0= -8937.318
##$PHC1= 17.80025
##$PH_mod= 1
##$PKNL= yes
##$PPARMOD= 0
##$PSCAL= 0
##$PSIGN= 0
##$REVERSE= no
##$SF= 200.130013532006
##$SI= 16384
##$SIGF1= 3
##$SIGF2= 2
##$SINO= 400
##$SIOLD= 16384
##$SREGLST= <1H.CDCl3>
##$SSB= 0
##$STSI= 0
##$STSR= 0
##$SW_p= 3612.71676300578
##$SYMM= 0
##$S_DEV= 0
##$TDeff= 0
##$TDoff= 0
##$TI= <>
##$TILT= no
##$TM1= 0
##$TM2= 0
##$TOPLEV= 0
##$USERP1= <user>
##$USERP2= <user>
##$USERP3= <user>
##$USERP4= <user>
##$USERP5= <user>
##$WDW= 1
##$XDIM= 8192
##$YMAX_p= 0
##$YMIN_p= 0
$$ End of Bruker specific parameters
$$ ---------------------------------
##NTUPLES= NMR FID
##VAR_NAME=  TIME,          FID/REAL,        FID/IMAG
##SYMBOL=    X,             R,               I
##VAR_TYPE=  INDEPENDENT,   DEPENDENT,       DEPENDENT
##VAR_FORM=  AFFN,          ASDF,            ASDF
##VAR_DIM=   8192,          8192,            8192
##UNITS=     SECONDS,       ARBITRARY UNITS, ARBITRARY UNITS
##FACTOR=    0.0002004,     1,               1
##FIRST=     0,             0,               0
##LAST=      1.6414764,     0,               0
##MIN=       0,             -32799,          0
##MAX=       1.6414764,     26602,           0
$$ Real data points
##PAGE= N=1
##DATA TABLE= (X++(R..R)), XYDATA
$$ [...]
807A285k177Q8K084j374q33J640n73q14J179o04n35J558p88j288J822j21j794
824a245J811N87k652J070K080k173m13K138j293j037J860m79r62J506m64j361
840a027J300r5j083J860Kk421J331J385k349M62K217j874q29K276r43j562J853
857E03J71j553R49M69r12P36n3j336R00O84j036R08N94j938K13J479j323j12J893
876A236q28j135J079n62q15J629m3j218J164L2j496J130M33j885J107J674j874
893c72k24J792j539j101K044k12j173J666J37j979M27O97q12Q65P59j225J83O14
911E47j315R0J278p91n5J347r88j051J267k11j111J124N28q25O29O9j423L23P98
930B30n44N52P18j107j45O88j100k04J605j94o84Q34m88j139Q85K95q20Q87O17
$$ y = [1285, -892, -804, 1280, -94, -927, 713, 140, -674, 505, -99, -634, 924, 136, -1152, 670, 549, -1245, 566, 1153, -1499, -429, 1651, -522, -935, 1203, -90, -1127, 733, 254, -708, 798, 334, -1027, 273, 178, -905, 955, 957, -1464, -133, 1252, -1097, -635, 1582, -292, -1121, 1155, 212, -1350, 503, 674, -879, 70, 539, -373, 363, 310, -1026, -126, 558, -478, 430, 1024, -914, -701, 778, -545, -657, 1236, 408, -727, 352, -210, -1025, 604, 561, -657, 507, 539, -957, 173, 606, -1279, -172, 1502, -372, -596, 1196, -343, -1444, 600, 388, -785, 881, 1018, -961, -534, 163, -649, 216, 975, -250, -67, 547, -768, -678, 600, -191, -246, 1101, 113, -938, 329, 118, -993, 131, 659, -166, 463, 532, -891, -568, 230, -314, 238, 956, -151, -296, 392, -708, -912, 693, 499, -185, 649, 161, -978, -93, 202, -618, 269, 886]
949H86r48Q6J15j144N30J246p40o6R68j041q24J079k45o36J454K88j497K50N29
968B90r31K58R37n70o3P74o55o50N02o8o5P28j43m96L62k02o19L97L50j39M54
989D51n4q11J75L41m38K68M57n04J34N51q01l94Q45j96m13Q42Oq15M61J14r85
1010g66L77J026l75k36K92o03l15P13L9k85M68k1n45J04J8j63M76J59n02P2K30
1031A63k87P3J67l98J56N41k96l26K65j47j70M05l4k64L45kn47J50L25j42J69
1052A46R2n17J5M69j39j34J89k30p9L70j35k23L93m9m83K25J82k04L50J18o97
1073c41j6N94j74j65L83k56l93M45J08m42K72L38m23j90K63pK3J70j57k32J03
1094i7K06J7j50j24K04O3k17Q2J26k49O5K99l40j23N52j30n76L05K57l36L01K55
$$ y = [886, -62, 24, 139, -1005, -475, 771, 31, -35, 933, -108, -932, 147, -98, -734, 720, 1008, -489, -239, 290, -641, -383, 554, -16, -79, 695, 40, -610, -108, -176, -241, 487, 344, -152, 210, 8, -611, -214, 136, -3, 451, 397, -414, -239, 102, -336, -68, 389, -115, 19, 570, -231, -625, 220, 24, -389, 453, 459, -356, 105, 219, -766, -389, 637, 262, 26, 318, -285, -600, 113, 152, -133, 335, 314, -231, -127, -109, -272, 204, 363, -139, -67, 163, -124, -51, 116, -282, -126, 415, 119, -207, 58, -89, -259, 146, 112, -152, 193, 191, -356, -206, 119, -23, 146, 238, -279, -264, 205, 66, -68, 121, -109, -188, 182, 47, -176, 217, 168, -315, -90, 92, -112, 238, 356, -341, -357, 237, 63, -102, 281, 25, -368, 77, 185, -257, 15, 353, -70, -260, 3, -4, 19, 189, 32, -200, -97, 109, 126, -24, -148, 56, 119, -98, -16, 110, -139, -74, 225, -115, -238, 314, 184, -392, -87, 170, -166, 135, 390]
1116C90o98p7O93k35l32M92l1n07K83J55m08K75M18m31l00K92N0l4J71j21k17
1137a72J31J29o6o2L3Q4j9j76J1J90k3j9Qk09J6L67j10k82J73M6j59K32l4l47
1161b58K63K35m02L3L52l06m0L64l95j80O63p4o29L48J92m60L47L68o84j8O53
1182C72m07l48N91J2m42K92O2m58K46M62l10l05K21Q1j02J8R5n9j24J55J00l53
1204b01J4N29k22n09M68J60n62L71M06q54O2R61o33n81R50j00q30P77K66j087
1224f15N00Q21j009j78J015m64n25P97k26o99P88K76q39K05M50m88M1M37l65j00
1244a78M08j90k84K02J17K4lk00M2R4r4J55N2l78K26L69n82p4O74l87l51P70l57
1267E5p08J005J62j191O10P52j162K09J043j124l21J499o43j121J330J59j347
$$ y = [390, -308, -385, 308, 73, -259, 233, 202, -305, -22, 133, -275, 0, 418, -13, -313, -21, 29, -5, 166, 45, -172, -41, 88, 22, -40, -7, 77, 58, -118, -107, 83, 60, 41, 49, -160, -144, 223, 113, -169, 4, 50, -109, 123, 89, -258, 5, 240, -162, -129, 223, -83, -123, 241, -154, -334, 329, 255, -374, -26, 166, -294, 53, 421, -263, -281, 372, -35, -383, 208, 220, -222, 70, 132, -326, -80, 382, 72, -233, -12, 69, -33, -15, 80, 21, -103, 52, 152, -201, -187, 342, 120, -389, 79, 239, -323, 48, 454, -400, -338, 623, -10, -591, 359, 259, -571, 206, 472, -615, -115, 706, -303, -481, 534, 70, -455, 342, 116, -583, 205, 481, -358, -153, 297, -191, -150, 287, -78, -178, 230, 40, -244, -42, 75, 99, 96, -104, -62, 32, -62, 93, 145, -233, -7, 362, -220, -294, 380, -7, -358, 412, 55, -653, 352, 514, -677, -67, 685, -477, -268, 775, -349, -670, 829, 186, -935, 395, 554, -793]
1284g93Q67O62j409L59J209j156m52J306m13p56Q97l0q81O54M26p91R1M98k81
1303Gj47J75o1K0M0LN7k84l2O09k63o32P15J89r60N63O57j203K10J284j191o75
1325i19J650l85j252J391J30j674J109R83j810L00J570j338n41J617q10j003J680
1342F98j29j579J129O75j479M55R82j162k9J204p79o57R75q4n81M87P5m32K79
1361D8P9k83J25J3N1K41m50j42O33k83l89P42k77p43R99J01j276Q37Q35j467K26
1382c80J306j381l14J877j001j349J935O0j924J315R00k041O20J691j758m77J965
1399A044r05j215J603m2j335J160M48j531M56R70r48k6Q64o08k39O52l87l76M86
1418G1O1j16J32k44N3J74m61J69N24n25J13P82r82o29J339k21j002J325K14j607
$$ y = [-793, 74, 736, -673, -314, 895, -261, -713, 593, 180, -576, 321, 291, -590, 64, 490, -301, -210, 288, 7, -140, 35, -26, -6, 34, 37, 94, -190, -222, 387, 124, -508, 207, 396, -564, -1, 656, -547, -337, 947, -244, -919, 731, 346, -906, 485, 615, -1059, 50, 1033, -777, -477, 1093, -245, -786, 831, 21, -982, 698, 569, -1010, 119, 794, -685, -230, 752, -410, -439, 765, -14, -671, 304, 220, -361, 126, 201, -231, 48, 127, -156, -31, -18, 33, 274, -176, -318, 315, 32, -357, 385, 108, -635, 364, 465, -811, 26, 861, -606, -380, 926, -455, -769, 1108, 107, -1242, 693, 753, -1171, 144, 1044, -997, -377, 1314, -444, -921, 1044, 139, -1076, 527, 485, -850, 310, 758, -773, -317, 653, -295, -321, 543, -65, -304, 348, -39, -415, 71, 132, 16, 148, -96, -43, 131, -330, -161, 363, -162, -49, 733, -249, -878, 461, 240, -762, 563, 777, -830]
1438h30P78P98j692M05J774j256o64J600r06j207J719k0j555J456P63j905L79
1455c63J120j527Q1J780r49q13J461m84j392R81N00q43P23N55j090j55N29m15
1473c01j2N32j2P0j5n11n8J41k03N24M25o58J68L94j081j53J097l75j27J224p49
1494C20j330J117J13j299J259J051j542J68J069j726m00K021m92j016J591j58
1510G46j742Q56N42j392Q02J428j125m18Q21r13n60J163Rm03Q68r2j072Q1K06
1529a95k52N98M12l91Qq4n20Q6J42k8O90J93p53O2R2p98L49Q71n30J25Q94j011
1551d0r30R89o8n61J287K07j365M70M53j366L24J388p18k06J055r57r72J218l6
1570A72r15J101N31j137K10L89j104J75J151l93k59O31m67o37M23Lj76O70J33
$$ y = [-830, -52, 746, -946, -541, 1233, -23, -687, 913, 7, -1200, 519, 499, -1056, 400, 1163, -742, -363, 757, -770, -689, 1091, 142, -671, 790, 306, -1086, -105, 395, -448, 275, 830, -260, -415, 114, -301, -313, 219, 207, 277, 262, -249, -307, -166, -369, 155, 580, -78, 90, 484, -597, -750, 347, -28, -155, 1069, 320, -1010, 107, 220, -1079, 180, 1231, -311, -143, 926, -800, -1200, 821, 329, -687, 904, 746, -996, -140, 402, -990, -188, 1240, 115, -303, 518, -395, -955, 208, 217, -186, 682, 590, -482, -401, -195, -447, 151, 563, 172, 180, 96, -424, -338, -196, -224, 466, 659, -94, -32, 60, -738, -389, 482, -48, 77, 971, -40, -970, 19, -49, -610, 677, 884, -481, -11, 442, -924, -600, 788, 70, -136, 919, -38, -1010, 208, 172, -743, 358, 889, -248, -38, 351, -753, -578, 573, 180, -79, 552, 85, -552, -129, -126, -302, 368, 501]
1589E01n05j9j44k34M07P3j94M37J3n41J58ln01N84M90o65J22N37q08k33P71l83
1611a37k10J045k86j010O15K24q22N62O26q47J38P04q79l09R34k63l99P14j95
1630B05o31N87P3p17M17M41m82J62K47o10N4N30l38j09M46k49k13L39k71j59N44
1651B66p9m08L13m6l05M12L6m94L38K56n04J38L10m47J27M59n28j47O27k85l38
1672b99N15j53l84N79%p13M15L94n83J74M29n83k3N86m50k78O66j18m27M12q4
1693G5m12M38J62n22K04L16l55K8J99l58R6M06l00j21L25k22j43L12k03j44N02
1714B83j01m17K60Pl10L76J42m72K25L13n06k1L98k87J8M46l79k82N03j23l58
1735b85L95L3l36L62M9n68K56L72m01O1L21l89k7M57l70k46N28m7l71L25l1l53
$$ y = [501, -4, -23, -167, -401, 6, 79, -115, 322, 335, -206, -48, -51, -552, 32, 522, -143, -21, 516, -292, -525, 246, -137, -347, 698, 412, -598, 17, 241, -581, -19, 607, -240, -102, 602, -277, -586, 348, 85, -314, 400, 205, -426, 161, 234, -483, -66, 375, -107, 55, 302, -308, -254, 276, -62, -171, 275, 26, -187, 152, -119, -278, 266, 187, -221, 92, 46, -259, 153, 189, -305, 33, 289, -215, -77, 233, -214, -87, 372, -156, -303, 324, 39, -299, 216, 63, -321, 258, 258, -455, -40, 354, -229, -55, 374, -209, -232, 354, -96, -374, 292, 174, -253, 159, 75, -337, 101, 263, -259, -55, 261, -94, -66, 133, -225, -129, 277, -23, -144, 181, -41, -184, 128, -75, -219, 283, 182, -235, 25, 32, -278, 98, 240, -232, -7, 306, -200, -221, 177, -110, -92, 354, -25, -307, 196, 73, -285, 110, 143, -193, 169, 218, -350, -94, 278, -123, -62, 259, -130, -157, 300, -70, -316, 212, 165, -206, 119, 88, -265]
1757b65L64J33m73J69L02l05MK25k73J5L17k44j34K64o9r4J88k05j00L45p7k56
1779a69K49j5k27K73j9l77L32K55m65M2L25l65M6M56m12k12N40j45m19L99P5l87
1801b20L21J35n38J69M32l51o9L15k66q6L49k11j91L69l0k35J54o3j62L00K2l05
1823a61J82J17k66J25P1k63K39K31l88l6K73k15jL20k88j37M23j80l41L76L8l08
1845a89L09L1m68K82L15m09J5L21l04l1L58l03j62M69j24l48L06j0k38L34Jm19
1867b64K46K10l30R7K00k75J02K34l47n0L55j67r9K54k56r6M18k12l10M40J7l77
1889b10L15L4m81L78L33n72N3M45m14r1M83l20k35N55j34m85L71J32l31K60R7
1910A83m25J98K70l62L0K84k28J7K08l49K4L79k19j17K68k61o8M09k41k87N22
$$ y = [-265, 99, 232, -241, -72, 230, -75, -71, 154, -119, -104, 213, -31, -165, 99, 30, -64, 124, -81, -181, 164, 87, -169, 80, 65, -162, 111, 92, -285, 47, 302, -163, -121, 204, -161, -115, 341, -71, -283, 257, 112, -307, 92, 167, -220, 101, 236, -302, -133, 299, -52, -121, 194, -72, -158, 191, -20, -211, 158, 128, -107, 47, -16, -178, 122, 144, -161, 21, 138, -128, -3, 68, -195, 44, 275, -113, -149, 124, -91, -92, 228, -60, -197, 226, 46, -295, 81, 119, -189, 120, 151, -317, -35, 280, -129, -114, 207, -97, -128, 230, -73, -235, 234, 110, -238, 68, 58, -180, 154, 155, -264, -18, 192, -138, -41, 159, -116, -14, 220, -127, -177, 178, 11, -88, 166, -90, -186, 232, 20, -290, 150, 167, -210, 105, 139, -342, 36, 369, -203, -150, 295, -119, -210, 273, -47, -282, 273, 139, -346, 25, 157, -174, 86, 183, -242, -44, 226, -136, -106, 178, -50, -33, 175, -174, -150, 229, 10, -107, 161, -100, -168, 241, 0, -287, 235]
1931B35n7m68L95L4m98M78L00p43J36O00n67j08O35m04l25P05k27o14O24J61n89
1952b97L59K20o39K80M66n72m6N48l52j77M27k76j89N03j29m14L69Ok71K87j8
1973H5l21L55O2m21K29J32l40L27J81o01J93M59n32kN65m71j61O90m66m80Q35
1994C18j3p16N84J19q11N19N16q86J59P76p57k33Q35m48m00Q57k15p70O74K38
2014C46p07L59L21o38K16M83n54m6N05l40j33L76k71p1M41k72k53L90j80j70M59
2035B61k41l54O10q0n94M95J03n97N21L45q70K60O61q41r3R13n31l00R10n07q37
2056g66R84J34q57P28L31j041L18O23q86Q7J006o40m25P64m03m60Q25r4o99O13
2076A42K12o60K97K29n68K87L77m92J17L73m38l8K93l90J57N44m62j91M61m19
$$ y = [235, 178, -290, 105, 139, -359, 119, 419, -324, -188, 412, -155, -263, 372, -32, -357, 348, 121, -493, 131, 292, -297, 62, 282, -357, -77, 389, -183, -229, 319, -33, -210, 217, -59, -248, 255, 126, -288, 81, 87, -184, 103, 85, -236, 119, 181, -240, -11, 121, -219, 108, 289, -312, -119, 340, -192, -194, 371, -100, -261, 429, -37, -517, 318, 305, -411, 173, 292, -519, 0, 516, -370, -211, 565, -192, -425, 410, -38, -438, 419, 204, -566, 108, 346, -361, -2, 319, -319, -103, 380, -174, -220, 285, -55, -188, 188, -83, -154, 287, 15, -238, 152, -28, -198, 261, 20, -334, 276, 196, -398, 97, 200, -397, 124, 469, -401, -141, 520, -321, -414, 499, -32, -332, 578, 71, -766, 218, 352, -505, 223, 554, -487, -169, 454, -432, -345, 661, 21, -404, 360, -43, -503, 322, 228, -471, 142, 354, -306, -9, 220, -348, -61, 316, -176, -59, 314, -124, -162, 131, -259, -102, 442, -20, -211, 250, -169]
2096a69j77O92l06m19Q19j66q31O66J70q44O15N48j008K62Q63r93l43J074m80
2115b7m32J141l38j054Q03K24r85O89O77r18J08N96r19r5R99l42m00O42k92n01
2135d24N80l7n02N04J55m39K55K2m04L06J14m48L69K89m85J72J79o67K67O83o04
2156a15p4P05o31l76Q58l44n89J011kj030O64L78r95M31P08r91Q8J076q10n58
2176e96R87l61o56J033L2r42O22L11r98L19P03n83O3N58o70k74O97k05k70N02
2196B72j84l06L86j59l05M43J8l57L14m6l65M57J9n69M10K84n74K77L80p47J40
2217b12P24o81k25Q82m34n31Q37j97p57Q48K37j022M54O09q57J23P48p78j84R45
2237E29m69n55P92r2o45O12J09p04M59L78o78R6M61m28PM30l96j30M67k40k11
$$ y = [-169, -346, 346, 40, -379, 440, 274, -557, 109, 279, -565, 50, 598, -410, -148, 715, -278, -621, 453, -27, -459, 682, 344, -710, 93, 317, -668, 21, 698, -220, -112, 484, -435, -530, 469, 127, -273, 369, 77, -424, 156, 119, -383, 121, 276, -163, 92, 114, -290, 16, 130, -318, 51, 340, -145, 27, 206, -461, -194, 489, -115, -189, 516, -115, -491, 367, 23, -566, 445, 443, -587, 77, 455, -540, -109, 599, -392, -304, 772, -38, -596, 391, 30, -626, 407, 439, -503, 119, 430, -568, -249, 454, -129, -66, 492, -178, -452, 245, 40, -230, 272, 88, -218, 168, 9, -296, 147, 165, -192, 122, 76, -289, 168, 187, -382, 28, 312, -262, 15, 395, -352, -212, 512, -169, -394, 488, 54, -477, 360, 163, -594, 254, 491, -531, -77, 532, -325, -202, 546, -232, -416, 529, 60, -495, 297, 205, -440, 172, 281, -423, 36, 414, -264, -168, 293, -135, -128, 302, -94, -224, 243, 3, -208]
2258b08L50j16j48L40k57k50M42n6l04L67n0m48M45J25n83L58L86o22O9M69n34
2279b25lP28m95m39O93j33n40O45O2p16M74L30p59K09O50n89j15N59m57k44P18
2300C53j86n10M70L6m37L59J06m60K67K49m25J00L16l44j2K65k99M0M42k52k68
2321a90K39j63q6M55j10l24L09q0m03L93J61l38K81J24o02J59N00m20o5M39l70
2342i1j84O25k18n02M64L2m64M41K74n17J36K08n82P5O49k13j58K71l72l05N35
2363A04L9k92L24M1m21J48J28k68K11K15l47N3K64k33k8J12l17P2M93j30j85J58
2385A41k97k45M44R0j63L54q1n95J11K66j66K93K55n25r3L69k50j01L78j66k15
2406a96M09k7m08K84M7m38K10L41j70J08J15n46j48M42N0J3K68k71l48J89j5q9
$$ y = [-208, 142, 26, -122, 218, -39, -289, 153, 97, -207, 160, 110, -338, 107, 232, -351, 7, 393, -229, -160, 309, -225, -228, 500, 5, -434, 259, 126, -414, 231, 293, -423, 51, 381, -378, -169, 481, -108, -223, 336, -121, -365, 353, 167, -343, 127, 163, -274, 85, 191, -269, -2, 247, -178, -78, 238, -106, -118, 147, -152, -112, 330, 78, -190, 49, -114, -200, 255, 145, -179, 130, 50, -353, 40, 201, -137, 144, 268, -334, -175, 325, -95, -160, 279, -91, -275, 350, 132, -370, 94, 126, -338, 103, 377, -140, -4, 204, -378, -303, 346, 133, -25, 246, -126, -431, 104, 143, -149, 175, 216, -205, -57, 71, -197, 14, 229, -118, -65, 199, -34, -62, 50, -267, -195, 298, 168, -17, 141, -156, -401, 43, 133, -30, 324, 243, -352, -241, 25, -141, 152, 407, -118, -211, 158, -92, -193, 185, 19, -196, 213, 186, -222, 62, 109, -329, -119, 222, 52, 160, 275, -271, -419, 23, 73, 86, 354, 83, -265, -76, -91, -180]
2428a80L45R5l03M0qk11K35J57k86K7K40j33KJ19l45o8L63l2o0K76j80l71J69
2451a09M8j13M21J54m76q3J15j85J84L43k63j55K44j36j77K58k0j66J98j5j71
2472a04K11N4l13J1J18o3K11J59l34j23J51r5N8K60j35j01J24j76j43K98P3j69
2494b8J11n2k24K27J38k89L2K02j74K1K02k24j10K83j10j57K61K6k32J09Nk13
2516a96K19J95k46o2J51j15LJ61j21o6J72n6j11Q5%l0Q0n7q8J30kr1P4l4q6K16
2542A25l9k62J46J63k02P7J24k48MK80j70j64L02n7k43K01M8k25K10J15l52L0
2564a37K80j13o9J55j97j07L06Kj84J06K1j94O7J11n3P6L9j95n8J17P4O9k9j78
2588i1KJ06qN9J5j44J1J05j10N3K10j73j88J43j7k8L04q4l91J14J63j23J61J75
$$ y = [-180, 165, 260, -43, -3, -11, -222, 13, 170, -116, -89, 151, 18, 20, 139, -206, -274, 89, 57, -3, 273, 93, -278, -109, -61, -174, 247, 401, -75, -158, -43, -228, -44, 299, 36, -119, 125, -11, -188, 70, 50, -116, 82, 67, -104, 107, 161, -152, -141, -23, -86, 125, 284, -50, -173, -22, -117, -59, 201, 66, -35, 89, -87, -230, 68, 141, -28, 83, 31, -193, 34, 172, -117, -85, 117, -57, -36, 166, -58, -168, 115, 5, -152, 109, 135, -97, 12, 17, -196, 23, 218, -28, -90, 61, -54, -51, 110, -11, -77, 95, 39, -72, 13, 13, -17, 63, 6, -82, 48, 46, -45, 29, -5, -91, 125, 86, -176, -30, 133, -69, 8, 132, -116, -112, 168, -2, -166, 136, 79, -164, 37, 85, -140, 70, 185, -167, -137, 143, 30, -39, 116, -81, -188, 118, 120, -64, 42, 63, -131, -64, 47, -6, 70, 109, -86, -144, -27, 47, 116, 87, -91, -89, 17, 9, 68, 83, -61, -50, 55, -55, -2, 208, 35, -153, -10, -27, -55, 249, 165, -226, -112, 51, -72, 89, 264]
2612B64l51j02K82j48o3L63p5l73J27Q7j33K55J63m26j06K54oK1J69j54k27J11
2634f8N4OJ31J6j73r8l3J36K25l5j64q3q8Q7K97l3k42N4j3j75K52K05k58l0R8
2659F8k93N1M75j07l09J27j04j58M17J72m42kJ50k33R9L70j92j89J46j74j14M05
2681A63J13l03l4m1j13K58K21k05j37K7r8Q4K12m5o9l5j53K1K06N7j0p2k67L1
2705a89L09%q1R0k26j58L34O2k24K27Nm24J09L82k06jK44l98k34N29O4k99J98
2728A13l8l95K52L27k89NK35l29j58L66K5j19J78j77k85K31K27j16J3l3j86P5
2750g8J34k5L0Oj44J0K0j2K07K6l07NJ73j15J24K02l28j57L52p0k27L46j3l78
2774b19K08J35l28K25L03m29j18L53j69o0L95k56l61M10P1l71K79J88m26N4K89
$$ y = [264, -87, -189, 93, -55, -118, 245, 170, -203, -76, 11, -122, 133, 296, -130, -236, 18, 12, 33, 202, 48, -179, -68, -14, -8, 123, 139, -34, -132, -165, -29, 196, 161, -3, -86, -174, -87, 210, 177, -65, -11, -24, -199, 53, 258, 0, -30, 68, -225, -174, 301, 194, -115, 12, -92, -250, 167, 339, -103, -105, 45, -188, -89, 281, 89, -100, 46, -128, -242, 163, 276, -27, -61, -102, -215, 43, 264, 59, -78, -51, -149, -65, 147, 102, 33, -2, -155, -134, 72, 129, 119, 47, -220, -189, 120, 120, 39, 129, -97, -255, 79, 141, -83, 144, 149, -275, -166, 216, 10, 9, 253, -145, -379, 150, 214, -85, 113, 75, -320, -68, 259, -30, -25, 210, -119, -277, 89, 114, -5, 173, -4, -289, -58, 169, 53, 66, 33, -153, -78, 56, 31, 61, 67, -77, -67, -47, -59, 148, 174, -133, -128, 45, -70, 54, 256, -72, -229, 123, 53, -174, 172, 159, -219, -11, 124, -204, 21, 324, -105, -223, 130, -39, -99, 296, 40, -321, 89, 160, -211, 68, 256, -170, -116, 173]
2795A73k69j6L69j80k65J80L4q3J80m2j92P6N2o5R7Kj05J05m7j65J80J07j69M8
2819EL8k18J64J90k56jK22k37k3L21k43j85M50q9m44L59J73m44J86K99m43LM65
2842B92k86k55M07o8k73L04k3l12K65J12l23J31J88k58P4J97k92k6L36j55j78
2863a43K20k8j23J03l3p1J66k1j11P6j33n1L13m3k76K34O4l78J54K78l01N5L09
2886B60l50j59M17q7k23K83j22k74L93R2m22J96J73m29J35M33l54o1L73l40l35
2907d01M74J47k61J83l0l78J42K42j40Q2P5k05K5Q9k05J46K06k70l9K72j33p7
2929e6J95k49j93L71J09j37J46j89l24K43J21j39L57J08n69k0K68k55J56N06l67
2950H2l99M02j3l13L51N0l81K25K14k79Q4J50l78k5L09q1J14L15m37m22L14J11
$$ y = [173, -96, -112, 257, 77, -188, -8, 26, -57, 123, 81, -111, -35, 17, -48, 49, 51, -54, 51, 4, -161, 19, 126, -43, 5, 43, -175, -11, 179, -77, -78, 144, -93, -116, 205, -38, -223, 227, 138, -306, 53, 226, -218, -32, 267, -176, -173, 292, 6, -249, 158, 90, -183, 121, 98, -214, 51, 163, -160, -29, 159, -99, -25, 172, -120, -146, 190, 35, -143, 77, 49, -74, 29, -4, -75, 91, 70, -41, 35, -98, -149, 164, 121, -155, 79, 143, -235, -81, 197, -104, -49, 260, -90, -249, 168, 81, -142, 141, 19, -255, 138, 230, -192, 4, 177, -252, -117, 316, -38, -99, 274, -66, -401, 73, 220, -41, 142, 112, -266, -124, 118, -22, 60, 135, -70, -45, 44, -161, -15, 191, -79, -118, 154, 21, -56, 139, -110, -303, 68, 177, 40, 186, -3, -327, -84, 37, -102, 255, 363, -206, -226, 42, -213, -57, 449, 82, -317, 85, 72, -241, 110, 160, -221, 4, 218, -61, 23, 173, -205, -230, 79, -2, 112, 427, -10, -432, -118, -7]
2972gm1L93l4m80LR1j24K20K22j68n1m7j94K00K00k73lK28j90N4L30l76l60L71
2996c6R0j43L94L9n15l1P9j70L80L81l56j75N3l27J13N53j73k89L20j39l34L35
3018D9J33l74J55J95k60J11K73k89j95R5o2K06L62k27k84M9j72j1M61M5k56J16
3040A20j22l61K42L12j57O3K4k98R2K66k41n4J94j79L3L84k30l02K64r8k55M27
3062A24K28l79L7L9l95J41M91j42j47J12k42q6L25n1j40K49r5k78K55N6k33J73
3084D2R2l22J30K90j91j03R0j70K9K79p8j14J01j48j03K41k6j05K33r4l34K35
3106b6J60k38J37J14l25P6L21k40j00K50j67j04K85j05k06K77k0l01K45J30k79
3127a16J14J58l32M7L51j96j61K26r0j30K13j7j70J41L1j63Q7L4j09J60qj87J25
$$ y = [-7, -48, 345, 311, -169, -166, -75, -199, 21, 243, 75, 24, -23, -217, -17, 183, -90, -93, 135, -55, -1, 329, -47, -407, -36, 54, -89, 305, 344, -171, -202, -123, -293, 87, 468, 112, -63, -10, -337, -224, 329, 156, -133, 187, 48, -286, 49, 182, -192, -37, 158, -102, 9, 282, -7, -202, -107, -169, 37, 399, 172, -112, -63, -235, -246, 215, 260, 4, 120, -2, -363, -121, 191, 34, 97, 121, -177, -85, 181, -60, -114, 80, -99, -66, 318, 88, -214, 50, -48, -303, 124, 352, -27, 10, 49, -346, -205, 286, 144, -3, 109, -133, -219, 106, 55, -85, 164, 69, -209, 46, 102, -131, 42, 134, -188, -58, 232, 41, -62, 28, -142, -113, 166, 88, -26, 75, -73, -176, 65, 39, -66, 167, 73, -261, -26, 134, -104, 33, 147, -178, -102, 219, -21, -121, 129, -38, -142, 143, 38, -168, 109, 89, -212, 33, 163, -116, -2, 156, -176, -129, 222, 26, -135, 91, 1, -129, 84, 67, -103, 38, 69, -94, -7, 27, -82, 78, 70, -117, 8]
3150HJ14k04L3J28j54O0K14k18j29J88n0p7K26r0j86K21n4k43K45J41k66J00J21
3173A28k84O9L04k44j52K86q4j31K48p8k64K03P5j84J61J14k41J8Q5j78J25K67
3195B43k03j62J54q8n2K51n7k06J41J9j23R9M9j02M2j1j01J59R8j87lM6j63J42
3219a5K53k16j33J51j02q2K83k1k12J60k6k47J99K04k37K1Q4k30P8K96j85j71
3241a48K06o1j38K39J4k16J12L9j94J23J70j14j3rj72J15K03j21n8O2j53J6K27
3264A29r5j10J73r7j56J75Q2j20Q8nk47J30J98j46nP1j83L0K27j28j04J85r2j59
3288a59J84N8j27J15pk31J12J79j15K2L1j97L6K16j13p2J62r4j29J61j5r8J82
3311A01pk24P5J16p5M9L0j70N3J54j24jJ13j52j1J69j21o7K34p6k16J54N2j44
$$ y = [8, 122, -82, -49, 79, -75, -15, 199, -19, -148, 40, -10, -87, 139, 49, -137, 84, 30, -213, 32, 173, -93, 7, 128, -156, -87, 217, -27, -179, 107, 23, -108, 140, 62, -202, 1, 76, -108, 53, 167, -74, -56, 29, -149, -24, 243, 40, -122, 32, -56, -108, 143, 86, -120, 21, 40, -83, 16, 65, -37, 5, -6, -107, 52, 150, -37, -40, 6, -157, -15, 238, 22, -111, 40, -62, -144, 139, 118, -94, 66, 40, -207, -8, 196, -41, -20, 64, -166, -88, 208, 23, -148, 58, -3, -141, 98, 112, -104, 8, 47, -147, -24, 146, 32, 19, 10, -162, -47, 156, 35, -23, 39, -114, -98, 129, 34, -76, 97, 0, -156, 19, 101, -19, 69, 64, -183, -53, 145, -1, -6, 65, -118, -88, 139, 11, -93, 92, 0, -159, 25, 83, -44, 71, 64, -167, -55, 124, 9, 31, 62, -135, -99, 117, 4, -68, 94, 0, -129, 32, 17, -81, 101, 94, -130, -55, 61, -14, 35, 65, -105, -52, 102, -22, -23, 90, -62, -73, 96, -25, -92, 142, 66, -150, 4, 56, -88]
3335h8J51N0k48P2J75j54j5J55j32n0J80j12j01J95%j81R2M9j15J24P0k10L1J17
3359E5q3J8O9j01K8Q0j30j2J48o6n5J18r6q3J83oj75J23N1j65J06O8j72Q7J28
3384A18j80k7J66p9m6J59j36j10K15Oj94J17N7j81J08J04j91O3J55j64o2J57o4
3407il3J37j03j29J66M2j04N1J1j15Q8M8j04O0N6j00KM4o8Q4P0j46l5J24n1lJ16
3434I9j24p8J71m2j34J64K5j65P5P3j84J13J73k17o5J86q4n5J90q4j63J70L1j77
3458a02J17P7j51L7Q2j36M5J53j22p8J01m7pJ33j06r4J05Qp1Q9Jp6N7k7r9J16
3484EN5q4K3Jj19J33R8j63j5J41j19l4J82j07r8J73l2j79J64Q9j76M7N7j78J12
3509b4J94j85q0J67j03p5J98l4j46J42J3j80O8J36j01lL5q8L4J13q3l7L3m0M7
$$ y = [-88, 63, 113, -135, -63, 112, -42, -57, 98, -34, -84, 96, -16, -117, 78, 78, -103, -11, 38, -77, 47, 117, -93, -62, 55, -28, -10, 59, -42, -14, 66, -64, -76, 72, 6, -49, 69, -27, -110, 73, 67, -108, 15, 66, -99, 7, 75, -97, -10, 118, -62, -89, 77, -2, -48, 111, -25, -135, 80, 86, -108, 9, 66, -115, -7, 97, -94, -31, 124, -40, -102, 55, -9, -42, 95, -8, -137, 29, 71, -33, 18, 29, -86, 2, 50, -54, 6, 62, -38, -36, 8, -60, 24, 94, -52, -87, 37, -14, -17, 99, -25, -103, 68, 26, -108, 56, 81, -84, -9, 64, -120, -7, 166, -51, -116, 70, -14, -69, 121, 37, -126, 44, 75, -102, 15, 92, -59, -22, 60, -76, -31, 122, 0, -78, 23, -24, -31, 102, -4, -98, 7, 15, -56, 33, 34, -42, 15, -12, -111, 5, 60, -24, -1, 0, -119, 14, 112, -51, -66, 75, -44, -78, 104, -3, -101, 72, 40, -139, 25, 114, -62, -15, 42, -136, -24, 170, -15, -95, 72, -31, -106, 92, 58, -88, 54, 67, -113, -45, 91, -10, -13, 22, -66, -32, 81, -2, -39, -6, -46, 1]
3534AJ07j19o9J19o8p8J54J1q3P1m8j45J22J01p9M5J3j61P1J55j96PK13j49j08
3559a13K12o8j57J82J2k24J51J46j57j2O2j49M8J84j02o8J15q6r4J60k7q9J59
3582H5qk00O9J07p9J0M1n6J5P8n4k6j0n8R4P7j28L0J31j84r1K02j4q4J77m8k45
3609a69J15J35j39M7J11j51J5J36j58l6J88q8j04J87n1j35J71lk40J13K12j48
3631Hk4Q6j43l2J54po3P8n2n3M8m8JJ48p1j37J38K4j25R0L5j54Q3J27j18k1P2
3658D4q6%R5r8J4J45j31j01J66n5j01K26j5k68J42J58k14J2J76j28m6J66j10q6
3682i5J43nj12J06j2p6J04%j63R3J21j24NQ5j19j0J44q2n5O8kl9L4o2K3J31r2
3709Ir5J41l9j04J40Qj96J29J35k02oJ73j07m3J41r3p9J50k8j18J17Kr9J10Oj88
$$ y = [1, 108, -11, -80, 39, -29, -107, 47, 58, -25, 46, -2, -147, -25, 76, -3, 42, 55, -106, -35, 120, -76, -69, 144, -5, -113, 99, 31, -126, 56, 68, -156, -5, 141, -16, -28, 34, -115, -67, 117, 15, -53, 62, -24, -118, 42, 15, -74, 85, 77, -123, -54, 53, -26, -16, 25, -31, -16, 62, 8, -18, -28, -86, 8, 85, -43, -13, 118, -66, -157, 45, 31, -53, 124, 76, -169, -54, 81, -58, -11, 100, -51, -36, 100, -58, -94, 94, 6, -98, 89, 38, -97, 74, 71, -169, -56, 156, 8, -16, 70, -73, -105, 49, 42, -21, 57, 5, -48, 0, -48, -47, 101, 30, -107, 31, 55, -70, 20, 55, -99, -16, 111, -7, -28, 44, -42, -42, 53, -45, -31, 114, -17, -118, 48, -7, -108, 118, 103, -165, -23, 135, -79, -67, 109, -19, -65, 101, -9, -95, 48, 43, -69, 37, 25, -51, 53, 53, -110, -17, 104, -20, -15, 70, -49, -59, 85, 3, -52, 16, 14, -25, 9, -53, -30, 101, 9, -86, 55, 16, -88, 52, 60, -136, -7, 128, -74, -80, 93, -14, -57, 84, -9, -88, 62, 34, -84, 33, 35, -64, 46, 52, -136]
3735a36J37J33j89j1J35j06l7J71p3j16J29J9j06M6K5m0N9l0r3J13K5q4O3Kj32
3760i6Q5J21j53k2J53q9o9J22l8q4J29l7j26J21K9r9Q2Oj58J07J39j74k0J52j01
3785b0o0J62p3j08J56%j45Q8Q1r4J4J1j00P5J04q9mL7j20K1J42q8k0J49q7j31
3811i9R0J4m8J26j4j34O6L1j13P3M9j04P4J16j79k2J50j00o9J61k9r7J37k4j98
3836a43J00J06r2P1L6j41J4R2j20K8J35m5o5R1j02o4J36K2j09P1N2q7K0lr2O2
3862b7Q4n7K6L9r3j3M7q7L7J89p9j02N3p7p1J74K8j06Q6J3j58J4Q7n5Q7Q3j51
3889b9m1J36p4o6J16m3o6J48Pj70N7L2j02P2R6o4QM1j45m3J42L5jM8j13r5J12
3916bK0q3R7L6r9K5L2p1M6M9j04K0P1j0K3Nj47j4J50ll5Q7j03j17J11J9m7J36
$$ y = [-136, 1, 134, -55, -66, 69, -37, -74, 97, 24, -92, 37, 56, -50, -4, 21, -19, 40, 10, -83, 30, 55, -29, 34, 36, -96, -11, 110, -43, -65, 88, -1, -70, 52, 14, -70, 59, 22, -104, 17, 46, -53, 29, 35, -123, -16, 123, -51, -71, 81, -20, -80, 82, 9, -99, 57, 57, -88, 0, 81, -13, 1, 12, -88, -13, 91, 2, -2, 35, -85, -64, 78, -10, -30, 119, 32, -99, -9, 5, -43, 83, 69, -65, 1, 32, -81, -8, 41, -63, 11, 127, -52, -74, 76, -24, -93, 68, 39, -58, 79, 55, -143, -43, 63, -29, 42, 78, -63, -49, 43, -77, -49, 86, 41, -24, 67, -35, -99, 37, 59, -50, 21, 73, -14, 6, 3, -89, -27, 57, 0, 26, 65, -28, -41, 6, -81, -44, 145, 66, -36, 17, -60, -131, 43, 71, -35, 51, 64, -94, -80, 7, -48, 39, 122, -29, -70, 66, -8, -74, 42, -1, -67, 81, 88, -82, -25, 7, -95, -23, 73, 9, 17, 58, -87, -130, 12, 47, 46, 94, -19, -114, -2, 18, -65, 32, 68, -31, -6, 26, -45, 1, 50, -54, -34, 37, 27, 50, 55, -92, -106, 44, 41, 6, 93, -10, -127, -16, 3, -44, 92]
3944I2L2j83j7O6l0Q0R2j60n7J37m5k3R7q7j10J37K7r2R2K7j50j8R4jM5O6j39
3971b8r7J09NN0M6r4p3N8Nk2J01Pj06Rkj9J19L3j33l1K6%J01N0j63l2R8n3PJ38
4001A09n9j49J03j2j04J77R5j98m0Q0n1N2J38j32j25J23j1m5J16j8r1M3jq6J01
4026A5Q4j12l0K8j4N7O0j06l2M1qL6O8j00l0O4p0pJ36J0j14L1l3o7J46O1j30k5
4054d1N8p0N1R2j05l1R4o7m7J48m2j06R5j5j09J29R8j81k5R3n7J9J17q6r8R7j
4081A0o6P9J3o9L6Ko1O4M6n9k4K3j3N3J7q2j8L4j8N3N0j04%R1r6k7J46l6j14R4
4111B4oj11J38Q2j87j7J37p4j7J37j07r0J36Or5Q7J3j14M8M8p7O9P2j41k4P8j6
4138aJ8N1r2o4R5J8m2P2n2n7P0om7Q7Qj08J4K3j6Q1M8j38k9R0l9K4O2r4k1R5o2
$$ y = [92, 124, -59, -76, -10, -40, 40, 132, -28, -85, 52, 7, -16, 81, -6, -116, 21, 48, -44, 48, 75, -75, -93, 1, 0, 45, 111, -28, -125, -16, -11, 39, 85, -9, -82, -24, -19, -41, 60, 67, -39, -30, -32, -51, 68, 101, -32, -63, -37, -37, 64, 114, -49, -81, 17, -36, -29, 109, 50, -99, 4, -8, -112, 65, 160, -38, -78, 2, -49, 3, 141, 9, -116, 7, -4, -49, 67, 49, -42, 1, 0, -86, 15, 99, -13, -43, -15, -29, 28, 88, -18, -50, -9, -17, 19, 87, -13, -43, 21, -49, -56, 80, 90, -24, 7, -26, -93, 53, 114, -16, -41, 17, -53, -2, 90, -15, -46, 48, -19, -66, 82, 40, -66, 29, 14, -95, 34, 132, -49, -74, 19, -38, -19, 98, 12, -86, 11, 10, -56, 23, 36, -33, 3, 5, -56, 8, 54, -5, -29, -6, -19, 34, 51, -31, -49, -15, -33, 20, 70, -34, -34, 57, -39, -66, 80, 44, -70, 24, 18, -93, 45, 127, -60, -77, 60, -14, -31, 106, -1, -91, 45, 51, -44, 43, 56, -58, -10, 38, -39, 30, 102, -39, -63, 15, -1, 17, 68, -24, -88, 7, 25, -17, 55, 3, -54, 16, 10, -37, 50, 58, -50, -36, -13, -29, 52, 100, -38, -67, 23, -16, 8, 70, -24, -45, 50, -12]
4169a2m5J40k4j33P8J8r9J24Q1k10kJ32q0J3J26j01j31J56Oj07J09M6j40K1O5
4194C1o6M9P9r5q2O7J1K2L2n8m6M8j2MO2m0m8P7o4m1J43jj24L1L2r3J20Q7j64
4223c9l6J34p7k6J14n5q4J21k8j08J16M5j21L0L6q4O1Q6j08l4R2l3k5O8n7m4J07
4250E1l9p2Q0L3q9M0Rp6N5P7r2k4O1k9jN2m9j0O8l6n0M5j6j4R0n6q5J07lq3P0
4281A4L0j09N9P4j41J2J62p8p8P7m0n8J44j3j23P3M4r6L6P0p3lN2o5l0J12j0n4
4309a2J1m2J7P8k2m5J5k9lR6l9o5P4l7q7P1J05r0kM1j16J8J62m6r9M9l4l8J19
4338E0Lq3L5J0r2O5R2p0j7L7j26K5J75k8q2K4n9l7J19M4r4J3oo8N2P1l6NOr7K4
4369d5J05j4o1No3L0J08lo1on9k2J24J3l3N0p0j22P7J12n0L3Qj54KJ74m4p3O6
$$ y = [-12, -57, 83, 59, -74, 4, 22, -77, 47, 128, -82, -84, 48, -32, -19, 107, 6, -125, 31, 37, -70, 39, 85, -55, -34, 31, -35, 14, 93, -2, -84, -17, -6, 16, 48, -10, -56, -8, -20, -16, 46, 6, -42, 35, -29, -70, 73, 72, -52, -21, 11, -82, 38, 125, -39, -75, 59, -18, -44, 70, 15, -69, 52, 24, -84, 32, 77, -44, -14, 22, -62, -1, 85, -23, -57, 35, 2, -23, 45, -12, -56, 51, 12, -60, 20, 53, -36, 4, 13, -63, -8, 69, -23, -47, 14, -15, -16, 36, -13, -23, 45, 9, -41, 4, -12, -26, 64, 8, -77, 30, 27, -56, 14, 44, -65, -6, 68, -73, -61, 101, 23, -55, 22, -18, -76, 68, 55, -68, 5, 49, -47, -11, 59, -14, -17, 35, -30, -60, 52, 42, -12, -1, -43, -26, 52, 30, -15, 0, -29, -32, 64, 25, -40, 34, -3, -90, -19, 86, -4, -6, 35, -81, -63, 99, 53, -46, 3, -31, -69, 50, 53, -30, 5, 15, -77, -12, 80, 10, -7, 30, -96, -71, 104, 76, -6, 18, -41, -78, 41, 85, -9, 4, -2, -70, -18, 53, 17, 22, 28, -69, -45, 60, 46, -15, -10, -73, -43, 65, 62, 1, -5, -64, -86, 38, 51, 18, 68, -2, -124, -47, 65, 15, 48, 56, -98, -96, 78, 34, -39, 27]
4398B7n5m9J07M1j04J8K9j03M7J18j7k6k6j13PJ61K3l6k3o6m9R8J8j5K5pp2L4
4426hM1l2K7l1q1O5R7l6l0m8q6M0J51Nn3K7r8p4J04N1j0O9l4j59L5R6l7K4M6j09
4456d8j5J50m9j04N8k0m6J18O5r9j8jj06M8J22L9l1m3r9k4J16L9j7j6m7rM0lk1
4485b1L7j6l3N9K1m0J5m4r1P8J20ml3m9j26K6J41J3m4N6p7r4Q1M3m4O7J5j24O
4514f2J22n1k5K9p8J5J29j1r8J2l3k9R5Q1p6J5l0q9NJ28J1ml5q1j3R0K1j6k2m1
4544d1J7N1kj2J8m5n8Q0K8%L1o6j20O7J14j8mjj06l1J34Mn8O0k2r9N6O4l1J4P
4575C1j15J5J14Mk7Jq8pJ12Ml3Ql7n1O8M6k6K8k9r5K1R6KK1l5j04qJ18Pk3K0o4
4607b6l8O6K4k7N9l7q5L5M0j4M6j3j06L9Q2k0j7J7q2kR8j0n0P3l2j10N6N4k9M1
$$ y = [27, -28, -77, 30, 71, -33, -15, 14, -89, -42, 76, 59, 33, 7, -106, -99, 62, 85, 49, 26, -40, -89, 9, 27, 12, 37, 30, -42, -8, 33, 1, 28, -3, -84, -19, 78, 42, 12, -36, -122, -82, 69, 74, 21, 48, -50, -124, -20, 31, 21, 90, 56, -103, -68, 28, -9, 15, 61, -48, -63, 87, 38, -66, -8, -28, -74, 44, 109, 10, -8, -9, -115, -67, 55, 94, 63, 20, -79, -103, 13, 52, 35, 19, -28, -37, 3, 0, -21, 16, 0, -33, 26, 47, 7, 22, -22, -113, -35, 85, 81, 48, -1, -127, -101, 40, 53, 9, 65, -12, -106, -25, 18, -26, 41, 56, -68, -62, 60, 9, -16, 13, -65, -50, 79, 68, -30, -18, -51, -80, 15, 96, 20, 35, 5, -84, -79, 49, 60, 56, 21, -60, -73, 17, 38, 22, 0, -41, -24, 27, 25, 13, 31, -14, -72, 8, 36, 36, 67, 1, -119, -52, 62, 44, 40, 39, -67, -98, 36, 40, -18, 42, 20, -79, -23, 41, 10, 24, 31, -84, -69, 45, 49, 22, 23, -65, -72, 40, 44, 11, 19, -18, -69, -1, 45, 19, 47, 18, -77, -56, 40, 42, 63, 28, -76, -84, 34, 41, 18, 38, -26, -64, 2, 26, -1, 58, 21, -64, -29, 11, -3, 43, 30, -76, -37, 45, 25, 8, 25, -57, -59, 39, 29, -21, 52, 20, -90, -34, 20, -9, 32]
4637C2J4j03k5R2Pj6J9m1j4N1J3l3J5j3l3K7L2j0M5k8r2K0O1OL0j4r0LO2olM8
4669E6n1l8N1l3k1Q4jq0K8M1m7J2L9q8nJ02j5m2J0j6l4O2Ll3L2Rn8LL4j8K7L2
4701D5o4k6N6lk2L7m1j0O1l1k9M3Nl4K0jm1O0K2p9PM2l2K5L3o3KP9n8l9N0rk0
4734a5L7l1l3N0K7o0PL7m1K3L2o2J0P0l9m7M6j0j8L7j0n8N3K6n1RJ3m0N3J5l7
4765gj5N0l7j2L7k7J8L3m5l9M8J3rJ5k4m7O3J1m6L1K8m3nK9k7J1O4o0n6M5K7k5
4797aJ7j0n9M9L9m7J4K0m6J1K9l2J3L1l5k8L4jPK5l8m5M9K4k5K8j9m1L4L6n3K9
4829IK6m7l0N5j6K4M0o5p2N9L8j9K4k5l8K9L4k7J5J8m4j7L4nK2L6o4n9O1oJ7L7
4861D4m1o0N3L7m2K0J0o4K0L5l3J7M7n9m1N3J3%K2l8n8M5M1j0J7l3l9L4J8j5L5
$$ y = [32, 46, -57, -82, 10, 17, 1, 20, -21, -35, 16, 29, -4, 11, -2, -35, -8, 24, 14, 59, 31, -61, -41, 20, 26, 56, 42, -48, -45, 17, 11, 8, 56, 5, -33, 18, -15, -36, 48, 47, -33, -5, 36, -11, 1, 40, -48, -53, 49, 34, -8, 2, -14, -48, 14, 17, -16, 16, 25, -33, -30, 4, -14, 13, 45, -19, -45, 11, 8, -14, 23, -18, -28, 33, 2, -27, 16, 21, -13, 7, 6, -35, 25, 47, -32, -25, 17, -15, 10, 43, -20, -18, 61, 3, -36, 14, 5, -15, 22, -9, -42, 8, 35, -25, -18, 19, -22, 1, 33, -29, -19, 51, 12, -35, 11, 1, -17, 20, 10, -48, 5, 31, -20, -11, 2, -38, 15, 30, -7, -22, 28, -9, -21, 16, -11, 7, 40, -5, -44, 4, 17, 8, 23, -1, -48, 15, 26, -20, 11, 39, -4, -9, 20, -7, 4, 68, 8, -48, -3, 24, -1, 16, 6, -53, -4, 35, -12, 2, 22, -24, -13, 16, -16, -3, 28, -7, -35, -1, -2, 5, 30, -8, -53, -4, 20, -5, 23, 4, -37, -3, 33, -20, 9, 35, -12, -42, 13, -3, 21, 61, -4, -76, -17, 21, 2, 26, 1, -37, -8, 26, -1, 14, 32, -12, -29, 5, 0, 22, 58, -6, -65, -4, -10, 7, 44, 3, -57, -4, 33, -9, 11, 21, -43, -23, 12, -21, -4, 43, -16, -57, -4, 9, 9, 31, -7, -65, -20, 21, 11, 28, -5, -44, -10, 8, -7, 28]
4892B8K3o9l1M1j1L2N0p6o1O5J0qM1j0q0L1N2l4K2K9o7j4L1pM2K3n8n3M0L7LJ8
4924C9l5n1M3K0j7L6po7J1K7k8N1K7p0m5M1J3K0M2n0o9L6M9l2N4mo0QJ3rL8L4
4956E8p9j8J3K0J5M3n9n3M3K5j7N6l0n3L1Kl2M6L7p3j7L1pK4N4o8o0M7K8lL1k4
4988A1n6K5J6j2M1On5kKj2O9L4p2n9M1KK5O1o6n3N5kk3M7Po8J5K7m0M7N5n7o1
5021e2L8lL7M8o4n2L6K2j9L8%n2K4kl8N6L3p1j2K4k8L9N9o3n3N6MoM3k0o0K2J3
5054ck3M7K4n2k1Qk4K8O4m3l7K1j0J6M6l1l6K2J7l4L7Kl8J6J3m2M2N3o4k8L1j6
5086a5K1M6l0n8L6Mj9L4ml0J4Ll3J9M7l2j9jj2L1M5n2l8L9nKL5l1k3J8J0m6M8
5119DK4l4j1J9m8K8P0m2m1L7%k1L2j8l2K2K5l2PK0j1qLj8L1K3l5j2J4nJ7L6m4
$$ y = [28, 51, -18, -49, -8, -19, 13, 63, -13, -74, -9, 1, -7, 34, 24, -56, -25, 27, -7, 15, 44, -23, -37, -6, -13, 29, 52, -6, -59, -19, 18, 21, 39, 4, -47, -4, 16, -1, 35, 28, -39, -28, -1, -29, 22, 49, -21, -66, -25, -12, 8, 50, 0, -69, -33, 16, -16, 38, 34, -26, -18, -5, -14, 24, 58, -21, -39, -26, -6, 9, 52, -7, -60, -17, 8, -9, 47, 17, -36, -5, -3, -35, 11, 48, -25, -42, -11, -18, 6, 60, -8, -68, -21, 7, 4, 35, 11, -45, -20, -4, -16, 25, 31, -24, -26, -24, -36, 33, 67, -5, -64, -23, -21, 4, 65, -1, -54, 1, -1, -24, 23, 30, -38, -23, 4, -36, 11, 66, 9, -52, -14, -17, 20, 68, 4, -48, -12, 10, -9, 29, 29, -23, 1, -1, -39, 17, 50, -21, -33, -9, -37, 2, 61, -2, -55, 1, 5, -1, 42, 22, -38, -16, -3, -26, 21, 45, -7, -28, -20, -44, -16, 48, 5, -32, -11, -21, -5, 41, 10, -26, -4, 13, -21, 16, 18, -20, -4, 9, -33, 9, 62, -2, -30, 1, -15, 6, 52, 22, -36, 0, 4, -15, 19, 15, -15, -1, 2, -31, -12, 35, 3, -16, -17, -29, 2, 47, -5, -43, -4, -9, -7, 28, -3, -26, -8, 2, -44, 4, 28, -6, -17, 2, -46, -18, 52, 10, -31, 6, 6, -15, 17, -1, -33, -11, 14, -18, -11, 9, -2, -10, -7, -25, 6, 29, -6, -18, -4, -9, 8, 44, 0]
5152@k0K2Jk9K4J0l7L4Qm0K2M9m6k2L1k6LM5k7l6K1L0l4J9Lj9LJ5k3mL3j2mOj9
5187a9MN6m1j8K9jk4L1j3k5L2K7o5J1M5l8J1J3k4oN6l8l2K1J3jJ1ok8K2J4k8L
5220hK0k2J8ll2J7L9j9j4K0l2LM2k6l6M0J0m3K5J0k7K9J8n3KN0k6j0J%nL3nm7
5254c1L2Mj6K1j4pK1jm4K8K7j7Pjm0J5M1k7k1M9k7k1K2nk6M0K3n2%K8j9J9J1m4
5288b5QN2k4k1K7k9j6M7j3l1M6qm9RK6l6M9L1o9j1N9l3k3M9ml5L7rm4L9J4k9M
5321a2K0kQJ6l9j8L7j5L2Km8%K3l1OO3l6j0J3k3l7P3K3p2K1M0n1J6K7o3nO5j7
5354Fl8M9j4n2L2Ok3M6K9m5l7K2j5K9L4l3kJ1j0j9K5Qk7L0k1k4M4kk2J6j4rN3
5387C3Ko9lL8j1J1L2m1LJ6l1j8N7Kk8K8l0m4N4K5n3J8L6m8J2L7m8k7P4k6l5M6
$$ y = [0, -20, 2, 3, -26, -2, 8, -29, 5, 13, -27, -5, 44, -2, -24, 7, -19, -16, 29, 2, -34, -13, 17, -17, 2, 5, -14, -11, 4, -19, -23, 10, -2, -6, 0, -19, -15, 41, 0, -18, 11, 10, -14, 17, 4, -21, 11, 38, -27, -16, 29, -9, 2, 15, -9, -15, 41, 3, -29, -8, 5, 4, 15, 9, -19, 3, 17, -11, -8, 12, -10, 8, 5, -27, -10, 29, 10, -4, 16, -16, -13, 29, 3, -33, 7, 17, -26, -1, 9, -18, 11, 29, -24, -22, 28, 2, -8, -7, -7, -12, 21, 16, -31, 1, 5, -11, 10, -4, -11, 10, 9, -35, -7, 20, 3, 10, 9, -31, -16, 25, -2, -23, 26, -1, -22, 0, -5, -31, 9, 32, -20, -20, 8, -11, 8, 19, -25, -17, 35, 11, -10, 17, -12, -28, 19, 6, -25, 21, 13, -36, -27, -1, -37, 12, 43, -26, -37, 22, -11, -34, 15, 11, -24, 13, 4, -40, -1, 13, -16, -12, 8, 6, 14, 30, -9, -27, 10, -5, 27, 29, -19, -19, 4, -27, -21, 42, 6, -4, 9, -14, -51, 22, 45, -27, -6, 34, -17, -1, 26, -37, -42, 23, 6, -32, 17, 3, -49, -17, -11, -34, 12, 41, -4, -41, -19, -34, -5, 29, -4, -6, 5, -5, -24, 1, 9, -18, 12, -9, -33, 11, 9, -13, 3, -11, -20, 33, 35, -34, -37, 1, -10, 1, 33, -8, -5, 11, -20, -38, 19, 21, -7, 21, -9, -53, 1, 26, -27, -9, 27, -21, -9, 28, -20, -47, 27, 1, -34, 12]
5419A2J0l3Rrk5L4L8k8l2K9k3K2Rj0mklQnpK4Ol2jM6l5nL2m3k3R2j3q3M3L1o3
5455c4K5M8o4pP2m4m9O8J5m8M0j4n2N4M2n8k5N2k9j9L7j1j5K5j3j8J0K2j4%oP
5487cL0k1rmj0mL7Kn3K8K8m8L5Ql1J6K8n6oN2mm6M9j3k9M6J8q8L6N3n9JO0n7k6
5522d0O6k6m4O6J6o3J7J3l8K7M2n5mK4jQj4lrK0oJNkoMl5J7O0l5qPk5j4P0ro3
5559c7N7Pn3K5L7o8K9N2o3k8P7j1n1L5pl9M6M5q7jN4k2%K7j0k3L5l2j1K3K7l6
5591cPj5LJ0J3k0j0NKKqlK5Ll2J9Qj6OM0p2%P1k1l7K6Km6O2Lo4M3L6o7K0L7l5
5628fj6O0m5l7O4Qn0K7J9n6L7K1l5k0L8j4j7K5OkPrk2J5J4%rj7kJ7j1jJ8Jj1j
5664drpL6Jl7J2K4m5L2Rm7LN7pl9L1Ml5L2J3n7L1M4m1k1M7k2rL1k8k5M4J1m4J8
$$ y = [12, 22, -11, -2, -11, -36, -2, 36, 8, -24, 5, -18, 4, 13, 3, -1, -3, -6, 2, -3, -10, 14, 20, -12, -13, 33, -2, -7, 25, -18, -41, 51, 38, -45, -2, 29, -34, -9, 39, -25, -32, 40, -4, -53, 15, 30, -18, 22, 8, -44, 10, 52, -6, -31, 21, -8, -27, 10, -1, -16, 9, -4, -22, -12, 10, -4, -4, -10, -3, 27, 6, -3, -7, -17, -21, 16, 18, -35, -7, 21, -27, 8, 16, -15, 1, 29, -27, -33, 19, 15, -31, 18, 5, -24, 22, 40, -48, -12, 41, -18, -17, 43, -14, -40, 26, 0, -44, 22, 38, -25, -8, 5, -33, -6, 36, -19, -23, 1, 0, 8, -6, -9, -18, 2, -4, -3, 2, 0, -6, -2, -37, -20, 40, 5, -3, 4, -21, -35, 35, 26, -37, 20, 27, -26, -1, 36, -32, -3, 49, -14, -42, 35, 24, -27, 8, 1, -38, 8, 53, -34, -35, 19, -3, -3, 24, 14, -9, 26, -6, -17, 6, 33, -3, 4, -11, -8, 2, 15, -5, -15, -10, -8, -6, -14, -17, 8, 11, -21, -2, 6, -10, -4, 36, -36, -36, 35, 14, -23, 3, 5, -41, 21, 24, -40, 3, 39, -28, -8, 29, -6, -22, 38, -7, -44, 20, 28, -22, 5, 24, -32, 5, 26, -9, -29, 9, -5, -22, 3, 9, 7, 14, 5, -17, -2, 12, 12, 3, -14, -16, 1, -10, -11, 7, 8, -3, -4, -13, -20, 16, 17, -20, -8, 16, -29, 3, 12, -35, -32, 25, 18, -21, 10, 14, -21, 11, 24, -33, -2, 42, 1, -20, 27, 5, -4, 27, -1, -26, 18, 29, -15, 3]
5699Cjk4J6J5j6nL5j5k7K0jORk2j5J8MklrJ0J4nk6L5j0j6K9j0m2M1K4m4RRj9M
5736a1L5m5pN2j5m7L6Nj7K8J5n3J6M9m3k7M8j3j8K9j3k0K4J5l6LK0j9RmmjJ4N
5770A0j4Pj0%Rj7lJ2Lj5J5j1JL8l0k3K8Qj1J6lm3L0K3l9jM5m2jK7l0jM6j2n2K9
5806a1K9l4J2K4l6J3L1k8j4J3Pj9K3Ml3L4Nk8NRkJ5pk3OJ3j3%QrRrj2rL8ok4K4
5844Ej7k6N0kl1K0Rj9KJ4k5J2K9k0k3L5k1kL3l7qM2On4K9Rk9K8J4l4QK9l6j1M7
5879B6j4pJ2Om4L2nk5K1NMj7J2k3J2oJ0lRomlk2NL8rkJ4l2j5L2j1k2L1Qk1KOk4
5918c0J8L2j4l8N5nk0K%k1K5K7k0k4K0k3RK3k3K0Pk5j1J3MmJ9j0rK0ll8OL2j1
5953CJ%j6LJ5k0j2L0mLJ9m1j5L3Pj8J6kj4Rmk7L5J5j9%kk1J3L0k8k8O6Om0J1K
$$ y = [3, 2, -22, -6, 9, -7, -12, 23, 8, -19, 1, 0, 6, 15, -7, -22, -4, 0, -2, -5, -14, -4, 10, 5, -21, 14, 4, -12, 17, 7, -35, 6, 30, -14, -5, 4, -15, -11, 24, -21, -28, 24, 9, -38, -2, 3, -14, 14, 29, -24, -8, 41, -2, -29, 19, 6, -12, 17, 4, -16, 8, 23, -13, -10, 10, -9, 0, -4, -8, -9, 5, 10, -4, 3, -7, -7, 2, -15, -18, -6, -3, -18, -3, -14, -13, 25, -5, -28, 0, 8, -3, 13, 10, -33, -3, 20, -19, -20, 25, -17, -18, 9, -21, -22, 24, 12, -40, -11, 18, -16, -4, 20, -16, -3, 28, 0, -14, -1, 6, -13, 10, 14, -19, 15, 20, -8, -3, 6, 4, 19, 12, -11, -5, 8, -5, -5, 3, -6, 3, -6, -18, -27, 11, 5, -19, 5, -12, -38, 12, 10, -21, -1, 8, -11, -9, 5, -20, -8, 21, 1, -22, 13, -8, -10, 23, -14, -22, 20, 26, -28, 1, 10, -19, 9, 23, -11, -3, 26, -10, -21, 26, 12, 5, 17, 23, -21, 11, 6, -19, 2, 7, 11, -6, 6, -17, -5, -11, -1, -4, 5, -1, -5, -8, -30, -25, 13, 4, 2, 16, -16, -31, 1, -10, -32, -1, 7, -14, -12, -6, -30, -12, 20, 6, -32, 23, 18, -2, 0, 0, -21, 4, 31, 11, -13, 7, -16, -7, 16, -7, 13, 20, -5, -16, -3, 1, -3, 16, 6, -3, 17, 14, -24, -18, 14, 3, 4, 4, -12, -9, 6, -14, -26, 4, 0, 3, 22, -19, -34, -1, 6, -12, 4, 2, -12, -3, -7, -34, 1, 16, -3, -3, -5, -26, -13, 17, -11, -39, 27, 33, -7, 4, 6]
5990Fk7K8J4l9J4K6k1l1L1qlL8j7k7J7J1ljj0j8L1pj3K1j6lK3jl8K1L1l5j7L5
6024A2j8lK1ql7M3Jm2K9J6l1PJ8k6qM1lk5K0j1nK5mj9K3oorOjJ4%m2K3K2l0K0
6061GJ9k5j1L6l1j6K9%j5J9ok5J3J4l2NL1k2NJ5k7%K7k7OK2%k1J9l2nL1Ml2J4
6096a1J6k1%K2k0kL4j6j0K4k1%J3j7KPJ0j4OolK4Mk5J2j0j6K2J3k4J7K1n0NK9
6131A5j0k0L4k4j6K3J1k4j0K9k3MJ3mmJ3l3lL6J5k3J2k8j7L5Oj4J7j5%LJpPK2
6166B1l3%J4rJ6Rl0k0M3Oj4J6j9k8M1Mj9J6Nl1jJ5%J0J0m1lK1J0rJ3k0j5J4J3
6201Ek1J8Ql1J4J0qJ9Pm3rJ4J8QJj6k3K6OrJ5Kpnlj3L2J2l9J2rqL1J2k5j1J7j9
6239a2LK9j7j4K1j4k1M0K7l3k8K2l1K4L3k5k6J6jmL0k0k3J5JpJ3LKk0NpJ5K4k7
$$ y = [6, -21, 7, 21, -18, -4, 22, 1, -30, 1, -7, -10, 28, 11, -16, 1, 12, 9, 8, -2, -20, 11, 4, -9, 12, -4, -7, 16, 15, -23, -2, 29, -6, -23, 12, -6, -9, 12, 4, -33, 10, 11, -31, -2, 14, -17, -10, 8, -18, -26, 15, 12, -13, 7, -4, -9, 16, 12, -7, 16, 10, 4, -5, 1, 0, 14, 14, -28, -5, 17, -13, 7, 26, 1, -10, 26, -5, -21, 8, 8, -7, 12, 6, -19, -6, 8, -24, -19, 12, -10, -5, 10, -17, -17, 10, -17, -11, 11, 11, -10, 9, -23, -28, 3, 7, -25, -11, 5, -16, -16, 6, -14, -16, 18, 2, -8, 16, -5, -5, 8, -9, -7, 0, 10, -4, 2, -4, -7, 17, 21, -4, 8, -2, -18, 4, 17, -7, 10, 31, -19, -14, 15, 5, -15, 19, -5, -21, 2, 13, -11, -21, 8, -15, -11, 2, -2, -6, 7, -26, -29, 7, 22, -1, 11, -17, -34, 1, 7, -7, 10, -5, -5, -2, -1, -8, -1, 21, -12, -12, 2, -7, 9, 18, -12, -32, 11, 17, 3, 19, 0, -28, 13, 17, -2, 14, 19, -12, -13, 2, 2, 12, 22, -19, -22, -1, 9, 0, 13, -7, -22, -8, 5, -16, 2, 10, -21, -7, 3, -5, 14, 21, -22, -31, -17, 1, 9, 10, -6, -29, -3, 3, -6, 9, 11, 4, -1, -4, -17, 15, 27, -12, 0, -9, -17, 14, 26, 1, -10, 7, -12, -9, 20, 3, -11, 10, -4, -25, 15, 42, 9, -19, 3, -28, -4, 29, 4, -22, -6, -7, -11, 19, -1, -24, -9, -8, -15, -2, 1, 3, -17, -12, -19, -4, 20, -7]
6274gnlj0J2K3j8j5K8qj8K7KpNok5K7K6k8rOn%K6k3%J6j7j6J8J6nMpk4K3Nk1J1
6313bJj3J4J6k6OJ5j4oknQK2j2j7J1mKLooJ0Mj0JJ3j8K6jl2J3K3j7j3K4j6j0L6
6351A8j6k9K7K5m8K2Pj3J1K4m1rM1jj7qKKLQj2kJ4j4kJ3lKOk5jRJ0P%l1J0%Lj
6391iOPk4LQj1J8J2l9nK6kJ1J8k1j1J1KjJ1nl0J9krL4Kk8lNqK3J6j9j7J4Oj6K2
6430A4nj1j0J4k5L1J7j8k8JJ0J3Rj5k7J0LJ7Poo%j7oK8J2k0k%k1L4Pj1j4Pj0N
6467a3K1Pk6mJ1k6L0K7j8j4oj0K3L4j4l0lPjL2j1klj4j4J7K1pj2j2k9K7L5j2k4
6502a3MqPK8j1rRk3k1K4J0PMk2k0PL7mrJj5qL3npljj7J6RRJ1k4m3L9K1qMpk8N
6543b1M8j4%Kj9j5K5j1JK9k6l2J6J5jK3j3m5L0J4j1J0Mj5j1J0%pL9k1l2J0LLJ9
$$ y = [-7, -12, -15, -25, -13, 10, -8, -23, 5, -3, -21, 6, 8, 1, 6, 0, -25, 2, 28, 0, -9, -3, -8, -8, 18, -5, -5, 11, -6, -22, -4, 12, 7, 11, 4, -20, 3, 8, -13, -2, -1, -14, 0, 16, -10, -4, 11, -3, -9, -11, -16, -8, 14, 2, -15, -4, -8, -6, -3, -9, -15, -5, -1, -11, -10, 3, -15, 11, 10, -22, -9, 14, -3, -16, 8, -8, -18, 18, 2, -27, 0, 25, -23, -1, 6, -7, 4, 28, -13, -22, 19, 18, 1, -7, -5, -3, 0, 8, -4, -6, 8, -6, -8, 5, 2, 4, 10, -15, -16, -7, 3, 10, 10, -21, -11, -11, -8, -9, -3, 4, -20, -17, -9, -20, -2, 10, -29, -34, -8, -10, 1, 19, -2, -13, -2, 0, -1, 10, 5, -25, -6, -8, -17, 17, 19, -9, -12, -7, -15, 8, 24, 5, -12, 2, 8, -8, 14, 9, -2, -12, 2, -23, 8, 25, 7, -21, -20, -10, 3, 12, -3, -30, -20, -17, 0, 7, 1, -5, -5, -22, -28, 0, 12, -8, -10, -10, -31, 3, 10, -1, -15, -8, -18, -13, 8, 15, -11, -15, -4, -30, 0, 27, 9, -5, -11, -21, 2, 36, 22, -8, -11, -4, -5, 27, 16, 14, 11, -3, -17, 0, 21, 14, 2, -10, -39, -12, 23, 11, -13, -9, -17, -10, 18, 7, -2, 7, -16, -37, -13, -3, 4, 8, -14, -34, -27, 10, 6, -3, -2, -17, -25, 8, 3, -4, -7, -8, -25, -9, 0, 9, 20, -4, -47, -8, 13, 5, 9, 2, -26, -21, 27, 13, 13, 15, -4, -19, 6, -5, -4, 25, -1, -33, -17, -2, -3, 20, 7, -38, -8, 6, -5, 5, 9, -6, -17, -7, -7, -14, 25, 4, -28, -18, -15, -12, 7]
6578G%l2MK5j6J3J3j7qJ4k7J8J7rj6lPJ3J1j1j6%J5j2L5k1JjPqj2L1j7llKj8L5
6616A8rk2NJ8k5K1%j0MK0l0j1K4j1RMj3j6L3pj9PJ0j2K0ok2J9K1j7rJ2oJ4Jj4
6652Aj5OJ2moJ3%j2LkJ9Nj1%j8pJ8K2j8k6RJ1j3K8j6j1K5j7k0K7K0k9J7j5k3K4
6688cJ8j2k3J0j0JL8j6j3%%j1NJ9kj1oj0J7K2mqj0oJK2jmJ0j0l2K0J2J6Mk7j6
6725b0OK5K3l4qj3mK5qJ4J3l7lK7nKJ3k4l4J7L0J8oj4m2J5K9j1kJ2k1j8ML1kJ5
6761A3Kn5J9J8J4mnk7j8L5QJ2nj9rNRJ3K9l1j7NlJ8K4rl8jJ5NK3ml1jK6k1J0N
6799A0pj1kKK5J3j6l7lJ1KK0Nk6mOj4QK8qk8OqJ4K1%l3J5j1K2pNj3QpjJ1Rlrq
6840a5j3J1L1jj6J9k2j1L5pj7J7j3j8K2Qk3J6Rj4kK3j6k2J5pnJ9nj0RJjj3MQJ
$$ y = [7, 7, -25, -21, 4, -12, 1, 14, -3, -11, 3, -24, -6, 11, 2, -14, -17, -10, 3, 14, 3, -13, -13, 2, -10, 25, 4, 5, 4, 11, 3, -9, 22, 5, 2, -1, 1, -17, 18, 9, -13, -8, 10, -15, 6, 6, -4, 0, 20, -10, -21, 3, -8, 1, 5, -8, -24, 9, 2, -17, -10, 0, -12, 8, 2, -20, -1, 20, 3, -6, 6, 0, 14, 15, 1, -14, -8, 4, 0, -6, 7, 7, -5, -2, -4, 15, 20, 9, 9, -9, -16, 2, 24, 6, -20, -11, 0, -13, 15, -1, -12, 13, -4, -24, 3, 23, -6, 11, -4, -27, -3, 15, 3, -20, -10, -20, -19, 19, 3, -10, -10, -10, -21, -16, 3, 1, -10, -16, -26, -9, 13, 9, 1, -9, -15, -14, 8, 7, 3, 13, 3, -29, -9, 3, 19, 23, -4, -20, -14, 11, 34, 0, -8, -21, -25, 0, -8, 6, 19, -18, -21, 6, 1, 3, 16, -8, -42, -25, 5, 23, 17, 3, -39, -24, 5, -6, -8, 4, -17, -35, -31, 0, -2, 13, 15, -40, -21, -3, 11, 7, 2, -25, -43, -8, 0, 12, 7, -12, -21, -16, -7, 6, 35, 4, -13, -8, -11, 7, 31, 22, -16, -17, -2, 3, 26, 22, -9, -10, 16, -5, 5, 10, 3, -8, -10, -8, 17, 30, 14, -23, -26, -15, -13, 7, 12, -14, -18, -12, -26, -18, 10, 2, -26, -20, -28, -14, 7, 7, -26, -11, -22, 0, -7, -2, -15, -7, -14, -15, -4, 5, 2, -7, -15, -28, -17, 14, 13, -3, 16, -6, -17, 18, 11, -6, 11, -2, -20, 2, 10, -13, 3, 12, -2, -4, 19, 3, -19, -4, -11, -16, 3, -2, -12, -3, -2, -3, -16, -12, -4, -3]
6877coqJ0JJNpj2J1J5j4pK2j1nJ5j2pK3qk0K1kj5K3Ok8KJ8qj5L7k4lK6l2rL0J2
6916B2k2pj2RJ2Rj5LQj3j2K0JoJ0j4k0J7MJ0j0oj6K3LLo%j1RpmK1Ok4j3L3j0J2
6955GKk3j3K1QrJ3Pm1K0QPrK8l2j5J7qJ1K5k5j1JJ4lkJ3lj1Rj5J8%j7oqJJ8Jl
6995ej4MQNQj8qJ2Kj1K0mnj4%oJ4L5k2k7K4pkK4qj4kPpK1k%j1Jj9J6K1ooj5%L
7037hJ7kqJ0j0j8J3RljlolK2Nk3rpJ4J5j3j1RlpJ2mLJ8k1k2K1J3kqNk7J7K1ro
7078a0K1j3j2OJ4j5J5%j1qL8k0lKj1KLJ4j7J7j1j7J7nQJ6j7j3JmJ6Mqj2jJ2j0
7115a2RRj2oRkpK2oj5j3RmK8rk4QPlKJ8j7JJ4k6OL0j5rJ3j8nK3J5k7rJ6J2j3K2
7155B1j5j3OJ2j1QNrpqOLJ5prj1NLKj2Q%NlNqkJ8k7J2Pljj2J1j2RJ8j2pJ0rkM
$$ y = [-3, -9, -17, -7, -6, -5, 0, -7, -19, -8, 7, -7, -14, 8, -3, -8, 7, -5, -12, 11, 3, -17, 4, 2, -13, 10, 16, -12, -10, 8, 0, -15, 22, -2, -5, 21, -11, -20, 10, 22, 0, -7, -19, -10, 2, 11, -4, -1, 7, -6, -18, 2, 3, -3, 7, -7, -27, -10, -6, 4, -6, -12, -28, -5, -2, 1, -5, -5, -16, -7, -14, -18, 3, 9, -15, -28, 5, -5, 7, 9, -14, -27, -6, 2, -7, 6, 13, -28, -8, 0, 7, -2, 26, -6, -21, -4, -12, -1, 24, -1, -12, -11, 3, 0, -2, 11, 8, -3, 6, -9, 9, 9, -8, -14, -22, -21, -3, -2, -5, -19, -15, -7, -2, 6, -12, -20, -8, -6, -17, 3, -1, -6, -20, -20, -26, -12, 23, 1, -26, -2, -9, -11, 13, 5, -9, -11, -4, -11, 10, 8, 8, -3, -2, -21, -5, 16, 10, 4, -11, -11, -8, 9, 7, -1, 9, -1, -19, -6, 3, 0, -1, -4, -10, -13, 9, 14, -9, -18, -25, -11, 4, -9, -20, -11, -14, -21, -9, -13, -10, 8, -13, -35, -14, -1, -3, -11, -6, -33, -16, 5, -4, -10, 11, -2, -14, -8, 6, -9, 6, 6, -5, -13, 25, 5, 2, 4, -7, -5, -2, 12, -5, 12, 1, -16, 1, -4, 4, 20, 3, -10, -9, -13, 3, 7, -1, -13, -14, -2, -12, -3, 6, -6, -12, -3, -5, -12, 10, 4, -11, -24, -15, -19, 9, 0, -24, -16, -9, -12, -10, 8, -9, -8, 6, -20, -14, 16, 1, -8, 5, -13, -18, 5, 20, -7, -16, 0, 12, -1, 21, 6, -7, -1, 11, 0, 8, 13, 4, -3, -11, -5, -2, 13, 6, -3, -14, -9, -6, -4, -16, -8, -8, -3, -6, -1, -9, -11, 7, -20, -8, -1, -4, -5, -17, -6, -18, -9, 9, -3, -10, 0, -9, -11, -7]
7199gMoQmOpJ3Jmn%jJ2oj2J4KLj4Pj2J9Pk5MJ3j0J3j3j2J7Oj0mqJ7j0rJNOMj1
7242hLrmK0%mm%j7PJ8k2K9j2k3ML7nj7Onj7K3Jj2J2Ll0RJ7j0J9jj8rK8PqOl3J
7283a8K9Nj3Qpj1J2jj0PLk1OJNMnj0KJ3j2J2lnj2J8OqOJ2l1%J1%J9Kl6oK3J4o
7324CJ1j4rJ4J6k7PJ7k7rJ4K0Qrnk3J9JJ0Jj5KnjJ0Mnj8j3J0J2J8ll9LJ7kJ3N
7363A1k2j4J5lRJ4j0j2jJj0K2J6l0j0RQMJ3j1j6J3MlJ7Ol4PRj4J3K3j5q%%K0J
7401B2k6jNpJ3J0j1JjnmJ5qj6J2j0KK0Ll6J7JoJ1Lj1qJ3moPOj9J5opK2lj4lJ3
7442aNJ1%j9j1J9%qRLq%rJ1QnOj9J7j0J1%j5jJ1oJJ7k6rRllJ4kJ8k6J0jJ1Jk9
7484a9KJ6pNkj1JNRpPqj2RQj4J5Rk0rRJJ9jj5PQj2ORj3PqPoK3oj5lPmK6lk7NJ1
$$ y = [-7, -3, -9, -1, -5, 1, -6, 7, 8, 4, -1, -1, -2, 10, 4, -8, 6, 8, 11, -3, 4, -8, 11, 18, -7, -3, 10, 0, 13, 0, -12, 5, 11, 1, -3, -11, 6, -4, -13, -12, -7, -1, 3, -8, -5, -14, -18, 2, 2, -2, -6, -6, -23, -16, 2, -20, 9, -3, -26, -22, 15, 10, -7, -1, -6, -23, 0, 1, -11, 1, 4, -26, -17, 0, -10, 9, 8, -10, -19, 9, 16, 8, 14, -19, -18, 11, 16, 3, 11, 4, -7, 5, 4, -6, 1, 4, -17, -11, -10, -5, -1, -6, -16, -14, -1, -13, -1, -4, -9, -21, -3, 3, -5, 1, 13, -18, -18, -7, -7, 12, 14, -22, -28, -5, 9, 3, 14, 0, -9, 5, 21, -6, 1, 18, -9, -18, -4, 16, 24, 15, 10, -13, 6, 7, 17, 18, 3, 5, 0, -1, 9, 13, 8, -10, -23, -13, -1, 17, 14, -25, -22, -5, -7, 6, 11, -11, -25, -10, -13, -4, 10, 0, -12, -13, -12, -22, 0, 16, -14, -24, -15, -7, -3, 10, -1, -17, -4, 0, -3, 14, 20, -14, -7, 2, -12, 1, 24, 9, 1, 1, 1, 21, 22, -4, -5, 0, -7, 6, 16, 5, 6, 5, 0, -4, 11, 3, -13, -1, -11, -9, 11, 14, -22, -5, -4, -10, 1, 4, -7, -15, -2, -6, -12, -5, 1, -18, -3, -9, -16, 6, 3, -11, -14, -1, 4, 15, 15, -4, -15, 4, 4, -4, 5, 8, 0, 0, -9, 2, 10, 5, 11, -8, 9, -1, 10, 10, -5, -6, 5, -1, 0, 17, -9, -18, -9, -12, -15, -1, -3, 15, -11, -1, -2, 9, 10, -19, -17, -1, -8, -3, -5, -16, -15, -10, -1, -8, -1, -9, -21, -12, -4, -18, -3, 6, -14, -23, -14, -13, 6, 5, -10, -3, 5, -7, -1, 8, -5, 2, -6, 1, -5, 18, 12, -3, -6, 1, -3, 23, 20, -7, -2, 9]
7530Ij0RRj3j6%QqJ1J0k8MONMLmk1QRJ6ropkrJ9Nj1KmqLK9nk1Qj3NJ6mj5kQKK
7576fQpMkLOJ2omj1NLNMj5NjkmLpLQqj3J5J4k3nRjJ5mpKk0MJ6oQoLj1kQJ0Oj2
7624dj6lL9rj8J2mnPoJ1nPo%RkkJ1j5j0K1J8k5l%jJ0j5lJLKlkJPqnj2J5PqJ1k4
7669b2R%nPRj1M%nRNNk4MK4j7lLlONRj0Kjj1RqOJ1J0nj4MOJRj6j3J4nmQlLJ3n
7716A0j3oMMNj4J4j7J8j7kPnMOrjnPoOjjN%j2J1J7l1J0J7j2RKj7pJ9qJMLLJqj0
7761a5J7P%j8J1lNNj0kOjk0J3NoQmNoNnpMoJ0Kj5PojJJ0Kj4M%k4K7J0j1J0mj4
7805a8J0J0j3j0K3j4j0K1kj5K2nj1KK6j4Pj3J4LLj0j7J4j1OJ2j2j2K7j9mJ8oj2
7840a0QoNjPnkJj7O%KMjkKnQj7K3j3j0PK3k1kJ0j0JJ8rj9K4j2NLPj6J8Nj7lJ9
$$ y = [9, -1, 8, 17, 4, -12, -12, -4, -12, -1, 9, -19, -15, -9, -4, 0, 3, -1, -22, -14, -5, 11, 2, -4, -11, -13, -22, -3, 2, -9, -7, -11, -19, -16, 13, 8, -13, -5, -18, -13, 3, -1, -16, -18, -10, -8, -6, 2, -5, -1, -3, 0, 6, 18, 12, 8, -3, 2, 5, 10, 14, -1, 4, 3, 1, -3, 0, -7, -4, 4, -4, -17, -2, 12, -11, -16, -7, -8, 7, 3, -4, -2, -22, -18, -2, -8, 0, -6, -3, -14, -16, -8, 2, 8, -4, -20, -23, 16, 7, -11, 1, -3, -8, -1, -7, 4, -1, 6, 0, 0, 9, 7, 5, 16, 1, -9, 12, 30, 5, 2, 2, 1, 11, -4, -7, -6, -3, -1, -4, -6, -5, 2, -6, -11, -23, -8, -1, -9, 2, -22, -13, -13, -18, -11, -2, -13, -9, -9, -14, -5, 0, 5, -19, -15, 9, -8, -11, -8, -11, -5, 0, 9, -1, 1, 0, -11, -2, -10, -4, 7, 17, 12, -2, 2, 8, 9, 18, 2, -11, 3, -2, -6, 2, -1, 2, 15, 10, -3, -9, -5, -1, 4, -10, 4, -13, 5, -12, -14, -7, -12, -8, -2, -11, -12, -17, -10, -16, -10, -11, -12, -7, -7, -19, -8, 9, -22, -12, 5, -7, 2, 4, -13, -20, -1, -9, -8, -4, -1, 2, 3, -5, -15, 2, 9, 9, -9, 2, -1, 4, 9, -1, -3, 3, 2, -18, -5, 0, -6, 2, -2, 3, -3, 2, -3, -10, -6, -12, -2, 0, -15, -8, -14, -15, -14, -4, -2, -16, -12, -12, -36, -9, 1, -10, 0, -4, -18, -8, 2, -11, -21, 2, -12, -22, -1, -3, -18, 4, -1, -12, -10, 16, 2, 9, -4, 10, 13, 16, 6, -11, 3, -8, -2, 10, -2, -14, 13, -6, -10, 8, 2, -10, -2, -8, -3, -4, 3, -2, -4, -3, -20, -14, -14, -12, -8, -9, -11, -9, -14, -6, -23, 0, -13, -23, -16, 7, -14, -16, -6, -16, -15, 3, -6, -25, -1, -13, -8, -5, 2, -14, 4, 9, -8, -11, 8]
7883HLk2J0MkKNk4J7J2q%rJj%JRj3J7j6MrJ3J2l1oJ3qLJ3j0mJ4kj1OPj2O%qOO
7927dKljj7J4J0qkK0j4mMJ4j7J0OrKJ5rlllNkKqLLqNMnJ2j5j4QJOKmj2kJ1qJ1
7973ejrQjqJ5k3J4qJ2J1rJj0JMJ6j7QpKnJ1pjQoOJ3onO%k3J2jJ5j3jMrJ4Mj1m
8018e%JRnRj6Qj3lK0j0kj2j2K4J8k1MnMkNj4jJ8Pj4oJ2qNMj2OJ2qNKk4K3mJjM
8062CmkJ2lj0RJ3j8oJ4j7K0qj8J8j6J4j5J9KmrOmQjj0QnLnnqMK1j4%mRKj2J5q
8105fnJ7rj5J5%NooNQKk0K3rNpkpJ7omOJ0lkJj7J9qQj0JPpQqkOjj2kJ1Kj1J8j7
8152hKnJ1j6J1J0oLrm%JJjpJ8qOpJ0j3MLqRj5K6mq%mJ9pj1PNj2PN
$$ y = [8, 11, -11, -1, 3, 1, 3, 8, -16, 1, 13, 5, 5, -4, -3, -4, -4, -3, 6, -7, 10, -6, -2, -11, 2, 14, -17, -23, -10, -18, -15, -2, -12, -16, -2, -4, -15, -9, -2, -14, -8, -8, -16, -10, -4, -2, -5, -6, -23, -9, 1, -7, -9, 11, -3, -7, -3, 11, -6, 4, 10, 1, 3, 18, 9, 6, 3, 0, 5, 3, 5, -3, 0, 3, -5, 0, 4, -1, 11, -4, -18, -10, -9, -3, -1, -5, -17, -19, -8, -16, -5, -6, -15, -7, -8, -16, -1, -24, -10, -18, -6, 5, -4, -3, -13, -12, -8, 8, -9, -1, -8, -6, -11, 0, -7, -8, 0, -6, 0, 13, 7, 2, 8, 8, -15, -3, -4, 11, -2, -3, 1, -8, 6, 10, -1, -5, -5, -4, 5, 0, 9, -7, 1, -12, -15, 5, -5, -7, -19, -31, -7, 11, -10, -6, -11, -7, -9, -4, -18, -19, -1, 6, -8, -14, -2, -10, -5, -1, -13, -7, 5, -3, 2, 4, -20, 3, -1, 0, -1, 3, -1, -3, 9, 6, -4, 5, 18, 0, -6, 8, -9, 11, 3, -15, 3, -13, 1, -14, 5, 7, 3, -6, 0, -4, 4, 3, -7, 1, -4, -1, -6, -11, -19, -15, 6, -8, -8, -12, -3, -1, -13, 2, -6, -11, 6, -3, -18, -3, -3, 2, -4, -10, -5, 3, 5, -15, 8, -1, 4, -3, -5, -12, 5, -1, -5, 1, 11, 8, 6, 7, -10, 9, 1, 9, -1, 0, 7, 0, 8, 0, -2, 4, 3, -9, -11, 0, 2, -9, 9, -8, -6, -11, 0, -16, -5, 5, -1, 2, -7, -11, -11, -10, -9, -10, -17, 1, -7, -1, -8, 2, -11, -7, -4, -12, -3, -18, 8, 4, -4, -4, -8, 11, 4, -7, 0, 5, -7, 0, 5]
8191E
$$ Imaginary data points
##PAGE= N=2
##DATA TABLE= (X++(I..I)), XYDATA
0@%%%%%%%%%%%%%Kj0J6j6J6j6J7k5L2l3M1m8N4o2P2q1Q9j04J17j26J39j59J80
36I5k00K22k46K72l02L34l69M10m55N03n59O23o93P75q72R86j124J296j514J805
56I87k213K825l868O101j8303J8676K2397m4235J9372K1438l8009p444L9002j1932
70D794j5393K0781l987k0429J4882N849j0971O990J500j3835R596J0079j1541
83a685q64P343j0601l000J4092L692q417l327J744m04n137M812J4504p413j7634
98a2295J2278Q329j9513P601K2215k1904j3982K7817k375k1817J8640O429k6081
111a4658Q758J8735j5649J043J3831j9306n667K1043p945o030K1720j1940k3929
124a9994K1843Q539k2987J4161J7700k7483n894K5173r095j3705J8840J858j8248
$$ y = [0, 0, 0, 0, 0, 0, 0, 0, 0, 0, 0, 0, 0, 0, 2, -8, 8, -8, 8, -8, 9, -16, 16, -17, 24, -24, 30, -32, 40, -41, 48, -56, 61, -65, 74, -85, 95, -105, 117, -129, 143, -159, 175, -194, 216, -239, 264, -295, 328, -365, 410, -462, 524, -600, 696, -818, 987, -1226, 1599, -2269, 3832, -14471, 4205, 26602, -17633, 1739, 23177, -14832, -22276, 16726, 4794, -10599, 10182, 6195, -14234, 648, 6497, -4474, 2516, 4016, -9819, -223, 9856, -1685, -2549, 4794, -5807, -8807, 5285, 8977, 560, -2767, -1023, -1427, -6564, -1752, 12752, 5339, -12295, -17, 8312, -11201, -3600, 18615, -3289, -17271, 10546, 8171, -13646, 4994, 11423, -14658, -5900, 12835, -2814, -1771, 12060, -7246, -12913, 8130, 185, -5845, 15875, 3935, -19994, 1849, 10388, -12599, 1562, 19262, -8221, -14115, 11058, 1963, -11742, 7098, 8956, -9292]
137i292N571J0523o794k578L708j529j217P97K748K674n847m181O448L1l880O764
153C946J00q670L515K432n785P290L957j2661L258R535j2463P60J7129j2971j2641
168a3269K0460r4j9243J4804J0320k2897J888J9249j2478o843J7298n571j3897
181a0273J1095L881q990O142K857r425L329M874o638K816N353p743m24P482m747
196d11l322O766j389n210L529K185j998k02j034N03J799k505J361M236o278l376
212e346Q977j147p260P414K128j0740L460P792p237P5P638p162m065Q548k298
227G77l932P743l152q035Q391K383r357N759N781j1132N26J0582o544m843R580
242D527k290q588O574M472o294O10L164m014l70L969l37j201l65j339R98J155
$$ y = [-9292, -3721, 6802, 8, -2570, 1138, -391, -1608, -811, 1937, 4611, -1236, -5417, 1031, 1062, -2818, 3946, 4046, -4624, -1109, 1323, -4462, 2828, 6785, -5876, -2618, 6917, -5546, -4786, 12343, -628, -13269, 7191, 7097, -12146, 2658, 12978, -9919, -8031, 11218, -1260, -8103, 9195, 3624, -10273, 822, 4703, -4287, 1855, 4712, -4713, -1384, 3490, -3148, -332, 5021, -2722, -3146, 4336, -411, -3733, 3033, 1644, -3566, -37, 2148, 150, -52, -1086, -583, 1216, -1289, 72, 4308, -1970, -5346, 3631, 2484, -4776, 2638, 4766, -5974, -2514, 5278, -1959, -1884, 5754, -1408, -5473, 3075, 777, -3155, 4588, 1436, -6599, 1792, 4175, -5182, 577, 6358, -4774, -4248, 6334, -210, -5053, 4527, 2237, -6351, 223, 4695, -1599, -989, 2175, -1839, -2209, 1760, 1423, 222, -143, -1482, -484, 671]
258F71r29J408L77l473L10K583j046R47J503l942r74L555j143O5L765m017m029
275d369N498M13m473N215K012q211R54O123m349o30O689m049n858N322J666l835
291a882L321J265n379R90L369k497O97K790l444j539L170r00q52L221j295l730
307b695J835J993j182P05N80k196o75J467R12K98o12q07M8p70L1K763L21k792
325g76L4M91j571K022K882k747j961J775j064n98L547j72l081J168J45k494K551
342A51K876l014j144J652k009j20M098o96l299J179M38j821J895K062k082r47
358g81P83j115J70K338L2j570m83l98J99J609N98j024q68l89K12R58N41o7n04
377B41j115k67J100O72K91J34j661j419J603J495l66K33n55k188L94K275q3l34
$$ y = [671, -258, 1150, 1527, -1946, -1636, 947, -99, 848, 2351, -1591, -2565, 990, -153, -88, 3677, -340, -4369, 1129, 1542, -2931, 2284, 4296, -3915, -2961, 3162, -1187, -1817, 4872, 823, -5035, 287, 1953, -1882, 1439, 2704, -2675, -1685, 1684, -813, -116, 2674, -770, -2309, 861, -39, -891, 2330, 1035, -2695, -860, 1133, -49, 656, 1236, -960, -1635, -168, 744, 1042, 430, -377, -329, -1099, -1068, 1695, 2016, -776, -742, -251, -1822, 200, 3082, 335, -1626, 149, -915, -1513, 2034, 1862, -1219, -51, 94, -2400, 151, 3027, 13, -1131, 521, -1488, -1608, 2490, 1794, -1505, -326, 112, -1709, 186, 2248, 166, -781, 2, -1113, -943, 1395, 1427, -143, -626, -1024, -825, 784, 1382, 358, -510, -899, -687, 271, 812, 745, 241, -874, -1141, -41, 631, 922, 1056, -605, -2024, -421, 1074, 708, 941, 386, -1802, -1408, 867, 784, 450]
395D50O89j598j683J693J430l59N46o18k492K77K412L79m00k4j553r70J613J214
413A006k62m0o18j388J4J449R68J0q70j264m03R23J442N43j097j375r3N49P09
432B03R69j22j462o39L57L10J093R45j264j633J48O76Q62J149o59j927k93Q38
450d49N98Q89J78j423q55K95L22R67J025r20j541j89L65R43J319m66j772m17N32
469e99M75R93L07j240p79J86J90P59Q71n51j097m23L5R83J178m86j239l15j6N69
489a99J240j73j209j09N1k75J047P98j002n93R5n18O58J550o19j385J62RO7J365
509I60P1j570q4N96l67N26Q45q03o77K14j79L79J025l83r20j19j81N07J214m55
529E99j163L30J0l76J140L34j297J91N28r79L94J310q87p29P34m37p2J440o19
$$ y = [450, 1139, -459, -2142, -449, 981, 622, 1168, 550, -1942, -1665, 747, 1126, 726, 702, -851, -1821, -208, 1006, 744, 704, 86, -1302, -1288, 161, 1129, 1139, 269, -995, -1398, -475, 967, 1510, 413, -962, -1055, -506, 203, 1172, 1050, -412, -1051, -694, -384, 709, 1654, 390, -1243, -1095, -419, 443, 1592, 933, -994, -1287, -449, 149, 1038, 1216, -207, -1062, -767, -445, 522, 1547, 627, -914, -1103, -738, 205, 1524, 1058, -714, -1131, -599, -124, 869, 1176, -64, -843, -657, -467, 292, 1163, 612, -485, -908, -873, 110, 1288, 802, -437, -752, -768, -199, 1041, 868, -341, -450, -399, -674, 373, 1171, 169, -424, -329, -847, -189, 1361, 742, -643, -481, -472, -405, 960, 1031, -539, -623, -27, -394, 132, 977, 174, -503, -289, -468, -89, 936, 553, -367, -486, -667, -160, 1054, 599, -564, -234, -224, -600, 540, 874, -423, -232, 296, -683, -289, 1021, 134, -595, 139, -298, -370, 1070, 451]
548D51j565Q68M79o61J161K98j987J45J332q71J01J529r70j291Q80J8l69J260
566H08m3j463K76N73k18O67j48j415M48J029m92L51N71j498n97J137J0J62J147
585A305p86j532K36K48M71J399o18j556O69J08q63J515N45k161M92J631j564j11
603e72K041j516j793J899N43q04J524l19k694M22J401k98J253O50k508m41J404
620A92j054L75K475j263k066J437R6j247J675O43k252K7J541j80J55K2j453j91
638a068Q80J30J112O33k084q88R59o90N55K682p89k508M43J46o00J810O56j734
656c55J65L81j090J148Q14k088M28J720j859J38K967k002k786K351N06j728K641
673A351J275l771o78K023q47L42K108j059j381N48p82L4J992n83j142J169p36
$$ y = [451, -1114, -246, 233, -428, 733, 1031, -956, -811, 521, -350, -249, 1280, 310, -981, -101, -83, -452, 808, 765, -698, -422, 151, -67, 600, 452, -963, -515, 514, 22, 373, 944, -554, -1151, -14, -4, 158, 1305, 519, -1013, -777, -529, -58, 1341, 723, -833, -164, -56, -919, 596, 1141, -1020, -528, 1103, -461, -572, 1469, -47, -1840, 59, 602, -202, 1322, 1003, -1691, -1269, 132, -166, 1087, 1737, -771, -1212, 192, -862, -487, 1988, 725, -1341, 96, 192, -1055, 620, 1263, -989, -962, 579, 399, 554, 576, -877, -1068, -188, -58, 1054, 1687, -397, -1285, -326, -1016, -461, 2221, 1432, -1076, -633, -487, -1087, 723, 1379, -355, -190, 191, -899, 249, 1063, -1025, -597, 1123, -736, -598, 2369, 367, -2419, -68, 438, -1290, 1351, 2626, -1145, -1823, 200, -647, -305, 1803, 744, -637, -89, -871, -837, 1155, 572, -570, 599, -137]
690a37j179K256L71k629N70J493j098N07J273j592q69P40l42P46J343j180n05
707b32O09j853J4L285o63k317J790q1k561J943J928k570q1J953j496n50J775p86
725A07p21J056j002j67K220j023j673J821n97j997K845J263l335M97K136k369
741i39m47K849q40j502J447m16j217J331K48p54P15p06p89J896j40j950J467P49
759A002k251R43J823k024l10J935j317q74J773l80p36J104j004p39K060o44j649
776a288K165k7k627J997J525l203N83K935k389j381K889o05j896J873J84j746
792a011J093N38j168P37J04j055J284J78j966J258J407k205J40J965j708o97K303
809A197q17j548J656O5j353J052J13j013J209j01j598J399O91j952R93J294k391
$$ y = [-137, -1316, 940, 1311, -1318, -748, 745, -353, 154, 1427, -165, -1034, -294, -636, 110, 1453, 273, -232, 377, -1476, -1462, 1823, 1160, -1157, 633, 552, -2009, -66, 1862, -708, -789, 1164, -332, -882, 893, 107, -614, 442, -560, -727, 1493, 470, -1203, 618, 21, -1976, 869, 2132, -1203, -706, 1430, -939, -1386, 1463, 623, -879, 568, 152, -1065, 266, 514, -240, 475, -231, -1020, 876, 736, -1214, 253, 1002, -1249, -306, 1517, -507, -817, 1118, -199, -1073, 700, 320, -416, 688, -316, -1055, 1005, 361, -1288, 877, 850, -1777, 220, 1745, -1458, -875, 2060, -329, -1710, 1179, 574, -1322, 551, 735, -1011, 82, 620, -548, 189, 293, -762, 522, 700, -1266, -8, 1399, -806, -666, 1299, -409, -1106, 1197, 380, -1168, 488, 553, -800, 252, 365, -648, 561, 460, -1138, 261, 952, -1000, -7, 1287, -1104]
826a104K49K559j761j318K316n49j673J764K96j563J101K26j612J035P45j330
842f19J031O18k358O60K092j920m87K442j271j645K226j03k045J548R12j841N12
859b48J065j100J62M78j165N63J187j052N2Q77j580k46J890p50q23J742m44j715
877a107J022L13r87J256M51j565N96O65j500N88J108j582L65J922j605j090J936
894G86p25j526J988N31j734J000O28k065J88J509o42J74Q74j224l96R88q31k43
912g20J488m12p34J115n56j354J192N00j228Q12Q83j093jM23j147J62J301m06
930B25j31O85r93n57R75m65m20J535Pj270N07J8j092P93Q38q60L52P57j096l70
950e62N86o56K95J376o54p48Q39n85j025J204L94q59R34M42j654o6J069o20n8
$$ y = [-1104, -855, 1704, -57, -1375, 941, 392, -1281, 483, 779, -784, 317, 543, -1069, -34, 711, -619, 412, 1030, -1328, -668, 1424, -496, -983, 1459, 188, -1457, 769, 666, -1379, 169, 1081, -760, -248, 817, -283, -121, 357, -808, -245, 942, -110, -58, 819, -761, -1007, 883, 133, -690, 1052, 608, -1107, -85, 228, -759, 497, 948, -617, -21, 644, -856, -268, 840, -742, -377, 1545, -60, -1150, 786, 61, -1465, 523, 1054, -680, 320, 948, -1117, -929, 580, -62, 112, 986, -238, -634, 354, -477, -720, 768, 356, -378, 737, 181, -1173, 19, 519, -709, 103, 986, -107, -108, 315, -832, -670, 631, 225, 94, 779, -214, -771, 204, -261, -681, 854, 861, -409, 98, 116, -976, -183, 655, -205, 147, 904, -192, -562, 24, -632, -337, 1039, 385, -363, 476, -109, -1134, 70, 464, -395, 539, 981, -673, -739, 330, -290, -348]
969c48J076m67n48O66l81p88O69L46k61M69n2p22K18J46n28L84N84k98N5K0p50
990e10R5O51k86lN31m41k26N37n19n08R09J43o42N54K32r59K02M94p49K05J104
1011H14m14o92K92k44l24P67K37n18K22Q2n86P9L16j24K69J92n30p6L90k17q5
1032a50K73k31nM95k54m62K99Q1k28L29R9l81J93J10m81R6M82j59p5J25l73o0
1054b77N49p2l46J87n5j53L28j1l14K59Q0m72J69L74k27P1J62n67q6P11o4m21
1076a75L06p1m17L71K68m43P3M04l81k76L67J03j10Q4j09k14J51K36n7j71r1J95
1098D3R7k11j4K18j83n4K97j96k29M62no09K46M52l32J4L09n52j86P61p3n30L86
1121A11J41n54J69L48l34P9M11m00l70M11J75j58N0m4k23J42J80j04o9K6O3pj43
$$ y = [-348, 728, 261, -287, 379, -2, -790, -121, 225, -36, 433, 381, -341, -123, 23, -505, -121, 463, 165, 220, 240, -510, -415, 236, -50, -53, 478, 37, -189, 348, -171, -679, 230, 373, -269, 285, 517, -442, -240, 254, -495, -290, 814, 400, -292, 0, -244, -568, 199, 436, -82, 140, 222, -364, -285, 31, -93, 176, 368, -162, -238, 152, -65, -150, 123, -108, -113, 382, 128, -334, -35, 46, -182, 147, 246, -135, 58, 168, -313, -217, 265, 106, 31, 156, -217, -277, 272, 200, -146, 41, -14, -167, 161, 150, -164, 95, 175, -297, -128, 246, 19, 90, 252, -315, -401, 310, 246, -175, 131, 60, -357, 14, 282, -161, -88, 316, -65, -341, 26, 129, 19, 103, -6, -220, -69, 167, 110, -61, -152, 43, 140, -71, -85, 133, -50, -104, 193, -3, -232, 230, 225, -384, -138, 314, -18, -4, 305, -247, -433, 328, 255, -275, 111, 252, -302, -133, 215, -119, -40, 371, -29, -399, 12, 187, 29, 79, 35, -188, -46, 134, 30, -39, -13, 50, 43, -100]
1144a00KK04j1j29K4r5j2L10n0l50J40J80j79R9P6l16J47L39l56j18M05j81k20
1167a91L65j88k85N78M8p13K43M32m39J16M43n65j99O92k04n12N39J69n60J52
1187g9K50l91J28M73l17l79K84J84j53l1R0m3j06Q8J31k51n8M62j16n48L43L76
1209C37n63J06N28o56j86R66l59q37Q47K63r42M83N59r92J27J010p76n37J071
1228D49j58q22O91J42p86N43N22q71l8O87l76k02N04k40k66L97o6l64K27K13r8
1249H8o4j30RJ70o3J0J18k80N0M06m06k65P01j67n60O04%p88P18M85j173K32J031
1272G26r40l04J193o97p71J421j55j415J066O87j451L84J075j228j51J395q15
1289B0q66J317oj089P25L55r63M15O79p82j52O85k32l30K61J4o9P2m2J6j21p2
$$ y = [-100, -98, 106, 95, -34, -10, -105, -117, 193, 143, -207, -67, 113, -66, 33, 109, -207, -60, 279, -77, -195, 210, 29, -191, 174, -14, -299, 279, 327, -386, -143, 289, -150, -34, 409, -156, -355, 337, 133, -379, 160, 329, -231, -79, 171, -220, -92, 381, 64, -315, -31, 153, 0, -31, 59, 16, -90, -2, 129, -122, -180, 282, 166, -382, -39, 337, -226, -120, 408, -248, -434, 532, 173, -664, 183, 446, -496, -13, 546, -446, -319, 691, -85, -622, 449, 291, -531, 160, 302, -484, 59, 581, -290, -328, 359, -17, -219, 285, 45, -221, 176, 110, -254, -27, 186, 88, 24, -106, -97, 73, 10, 20, 138, -142, -92, 314, -92, -357, 344, 177, -383, 221, 221, -567, 151, 636, -537, -305, 726, -214, -518, 675, -22, -793, 628, 473, -942, 124, 811, -640, -256, 819, -409, -560, 835, 20, -846, 471, 465, -624, 101, 456, -507, -92, 587, -195, -347, 338, 106, -224, 37, 51, -18, 54, 12, 28, -93, -165]
1311a65M67q5o84M93M50q75J79Q71r34k61J316p17j064J530J62j568R46P45j645
1330h39N17J441j554l82J826q85j160J614j37j407J339M78j760O60J206j404j02
1347e49J333q96n14J276m36r77R55K85q33L35L36n13J31K56l13P8J56p4J25k59
1367i8k28O03n5n76N53P4q25O60N02j207L65J138j228l64J501q38q88J734l52
1386D71j751J570P70k075O77J512j791j34K002j297j156J983k31j690J371O05
1402H36j584O80R13j464M1J342p69m85R68l57n94O93r6n23M92K14l26O0r8q0K51
1423A14k42l0N62l37k91O85n79p83J254K77j240Q06O41j590K44J319j285k12J903
1442A216q96j350J499j55j489J443O70j741Q01J187j846k21J629j003n03J823
$$ y = [-165, 302, 217, -467, 26, 476, -399, -220, 651, -283, -544, 772, 55, -1009, 521, 683, -885, 61, 806, -839, -322, 1119, -435, -817, 1009, 124, -1036, 578, 441, -966, 373, 851, -909, -249, 957, -447, -549, 784, -112, -626, 650, 214, -763, 192, 477, -356, -21, 315, -198, -67, 189, -124, -46, 110, 36, 161, -98, -326, 277, 222, -354, 199, 273, -552, 108, 610, -597, -232, 906, -322, -686, 815, -23, -911, 823, 471, -1280, 290, 1060, -1015, -338, 1174, -617, -751, 1251, -46, -1202, 781, 550, -1140, 231, 836, -748, -68, 845, -619, -578, 764, -5, -490, 478, 121, -473, 220, 124, -399, 93, 307, -19, 41, -57, -137, 114, -128, -158, 404, 67, -224, 461, -118, -901, 353, 630, -610, 196, 837, -753, -509, 810, -475, -687, 1216, 320, -1030, 469, 314, -1175, 268, 938, -803, -2, 1185, -661, -882, 747, -256, -759, 1064]
1458A064n73j418J248J30j534Q47J065r45J38P02j043m12Q82j31k03N77o2k79
1476E3Jm00n5M33l2K40L67o84k15N30o77k84J247pp01Q20l80j455R66Q79j261
1497f15O66J297j566n59J359j024p44K069K3j625J072L78j835N30J270j149K23
1514b30J526j095j044R56k87o91J227L51q17M14O6j110J09P14j19L22L69n99k87
1533b25J19l21J26M79m5L19J16q64j52M60m34J85R83m44m49O86o74j010J117N42
1553E14p57P34L96j510O4R77r74OJ553n46q89R04m75j119J194N51j073O36P45
1572I31j276k13P95o96m6J275k92p74N05j87p16N33L75k75M10J44p06j11J67r9
1592b56L45K21l11J74R2n88N5L25l26L43N67o68k48O13n23m29Q98j6n44P58m7
$$ y = [1064, 491, -927, 321, 451, -1083, -236, 829, -116, 22, 724, -319, -731, 151, 20, -183, 394, 332, 53, 54, -346, -401, 32, 0, 240, 607, -77, -292, 238, -439, -723, 524, 517, -184, 636, 256, -1199, -233, 646, -615, 51, 1348, -218, -777, 582, -442, -1186, 883, 906, -719, 353, 731, -1104, -574, 696, -453, -230, 1296, 201, -843, 113, -174, -865, 362, 713, -104, 310, 376, -734, -625, 89, -30, 292, 661, 62, -225, -106, -427, -301, 178, 133, 452, 568, -296, -448, 12, -422, -237, 746, 302, -147, 539, -135, -1145, -28, 514, -243, 491, 887, -623, -559, 418, -556, -550, 1003, 457, -432, 472, -3, -1122, 72, 623, -450, 186, 931, -345, -558, 237, -459, -505, 770, 478, -296, 209, 22, -694, -161, 214, -61, 349, 493, -213, -324, -157, -256, 89, 310, -1, 173, 265, -323, -268, 57, -269, 74, 641, -27, -275, 338, -185, -614, 284, 268, -276, 482, 435]
1613D35j166M79O78p46K21P81p85k81Q14n65n29R89L8o86N32R0p61L99L93o86
1633c56K21O31n13j51L73m29j04O38j99l35M39j21l71L32l5k59M62M6n29K01K11
1654A52l48K58K05m97J57M09m58p6M68l31j03M89l53l43O46p2n35M42J22n18L88
1675A02K09o97K24O01n35j18N45m21k39O37k40m73O34O8o01K80J82m36K84L18
1695C24n15K8M31l15j47L18k23n2M23k26k91L40m5k87L16j2k54L80L0n13J85K44
1717A39l05K02K62m68M6M13m20j63N09j37k14M02k30l94M75Q7m66L04K32m32J60
1738BK30n15J15N13l56j68M02k66k02M71j92l72N08Q7m84K05J83l83K21K77m63
1759a87K4M19k67j68L08j63j14L17j25k52K88L0k24J64m3j85L08K8l37J74J39
$$ y = [435, -731, -252, 426, -320, -99, 682, -103, -384, 430, -135, -664, 325, 363, -323, 209, 299, -462, -63, 330, -356, -135, 496, -17, -168, 205, -224, -328, 310, 111, -224, 215, 94, -277, 55, 20, -239, 223, 269, -260, -59, 152, -196, 62, 267, -230, -73, 336, -122, -198, 270, -61, -164, 325, -28, -371, 275, 203, -332, 110, 232, -286, 102, 311, -386, -162, 439, -96, -214, 331, -90, -329, 308, 68, -405, 229, 297, -304, -24, 158, -278, 6, 324, -191, -163, 268, -47, -194, 124, -99, -151, 272, 46, -245, 95, 50, -237, 79, 67, -187, 193, 223, -290, -105, 139, -166, 36, 298, -170, -124, 289, -131, -294, 215, 78, -136, 266, 36, -358, 117, 204, -262, 42, 274, -158, 2, 232, -283, -168, 345, -11, -179, 223, -43, -245, 226, 34, -338, 170, 257, -227, -22, 161, -222, -1, 276, -187, -163, 256, -11, -179, 129, -34, -148, 169, 44, -208, 80, 110, -114, 50, 7, -178, 130, 158, -179, -5, 134]
1780A34k66J50J28l45J81L29m17j14M33k27j51M34k25l85N10N6n26L14K55m41
1800a73J47K71m65L4N33k98k62L41j14k13L24n0k95L23Q3l52J13J02j88K01J08
1821A70l22Q9K11k43%K05k00P5K58l31j57L73r2j62L11j53k60L82l3l95K96K06
1843B28l59J39J70m14J40M24l74j62M09j85j82L66j56k99M37j5m13K38J82l07
1863a33J83J45m26J44L40l18n7K83k10n1K78k52j52M06p7k48K31r3k05L64m6l96
1885b90L55J91m72J55K48m35J81M56n09j68N49k48k87M97j20l85M56N1n54K83
1905d6L13l81R7K28l99O9L74k98j25L41j37j46K39j93j06L88j17k81K58n5k07
1926a84L66q1l82M04J33n44K51K77m84K31M40o55j04P10l64l73O51j65n31O12
$$ y = [134, -132, 18, 146, -199, -18, 311, -106, -220, 213, -14, -165, 269, 44, -341, 169, 225, -301, 13, 268, -173, -26, 245, -220, -186, 347, 49, -213, 128, 14, -199, 125, 75, -220, 103, 186, -166, -53, 49, -139, 62, 170, -152, -63, 148, -95, -95, 110, -90, -15, 243, -88, -245, 128, 36, -126, 185, 32, -228, 154, 121, -274, 22, 228, -131, 8, 178, -236, -96, 328, -46, -208, 201, 16, -166, 200, 44, -255, 182, 167, -246, -8, 174, -133, 50, 195, -231, -87, 253, -65, -122, 161, -49, -100, 178, -74, -226, 180, 103, -145, 86, -7, -212, 152, 106, -290, 65, 256, -216, -61, 187, -248, -67, 389, -120, -288, 261, 13, -274, 223, 103, -282, 174, 225, -329, -46, 267, -114, -17, 211, -188, -119, 255, -43, -168, 173, 36, -110, 129, -64, -170, 218, 101, -180, 78, 23, -184, 182, 101, -281, 123, 256, -288, -37, 240, -244, -13, 427, -228, -332, 378, 14, -359, 292, 127, -404, 208]
1946B08L0p14M87M20o76J12M53n38J9O12m75k61O03j83l95M51n5l50M45K3m85
1967b69K57K20l54J68J44l51J97K41m40Q7L14l13Q2L04m97k9N94l87k47O04k75
1988E0m14O29j51o17P05K44q48L21M64p71K28P44p83j95R05n04n51Q50r3o84P21
2009B50R4q94M92N52p57P6N58n54m3O07m25k85N82j65l55M11q5k52M14j27l88
2030b94L79L9l19L73k9m56M31J77o71L02M22o04J99N48p65o1Q16n98m02R76k34
2051B29o81P72j17r44Q02N49r76K99O45r86j7R19o50k70J034m19p77P49J0o52
2071d81O79J92q05L84M74p08P0M73m83N4N21m08j52M63l36k23M24j79o9N26l29
2092H7m44M77j09l44O13l4o23N98J38q94M26N66q20K42P72q77j76R96o96o39J132
$$ y = [208, 238, -476, 11, 431, -245, -133, 320, -218, -199, 413, -62, -323, 280, 97, -298, 153, 98, -252, 193, 216, -269, -12, 208, -146, 22, 166, -185, 12, 253, -187, -100, 214, -99, -17, 287, -210, -239, 355, -32, -279, 325, 50, -364, 265, 114, -503, 202, 446, -402, -81, 383, -388, -160, 584, -199, -394, 511, 7, -544, 306, 213, -471, 250, 344, -550, -58, 494, -263, -187, 371, -183, -226, 381, -44, -329, 253, 88, -267, 144, 59, -193, 221, 94, -294, 85, 124, -195, 178, 149, -307, 124, 301, -370, -68, 354, -250, -51, 497, -268, -329, 487, -111, -513, 463, 229, -452, 320, 203, -741, 61, 610, -366, -67, 578, -408, -425, 494, -156, -426, 608, 189, -588, 161, 171, -481, 198, 390, -415, -31, 443, -265, -195, 278, -205, -151, 370, -38, -190, 273, -63, -286, 138, -41, -110, 416, 87, -357, 120, 11, -333, 280, 246, -377, 221, 359, -535, -109, 457, -363, -121, 651, -226, -402, 594, -102, -741, 391]
2113C91o2p79Q53L6j227O25O84r50L10Q90q96l32Q05n61l48J074j46p51N40J1
2133A67o29M91K54n52L08L46n40N3K53l90J71L21m03J27M17n01r3L80m53M5P72
2154E44m62m35P03l11o03Q34L3p64P27K92j104L55P42q92L2R47p56l55J098m84
2174A41q88R66J06q69P94L47j094L19O48q87L8R49n07l37O04m21m44P68K7n02
2194b42L80L5m49K93J06l79L46J80m45J61J58l79K70K28n50J91M83n23k7N15n39
2215a87j49P88m13n15Q32j12p72O96J88q69N63N39j003J14Q75p17k48Q69m89m98
2235e08R15j48q03O78K28p84L95M10p14J96N78o27j39O32l18k17M76k39l11M77
2255A77o2l62L27M5k72K56n1l23L56J38m20K33J33m55K77L24n59J17N26n15j98
$$ y = [391, 329, -450, 403, 439, -788, -163, 521, -429, -119, 771, -125, -457, 348, -213, -561, 513, 367, -384, 156, 167, -462, 29, 283, -269, 39, 385, -155, -102, 151, -239, -68, 253, -150, -23, 394, -107, -200, 180, -273, -228, 544, 82, -353, 350, 39, -564, 270, 303, -461, 266, 558, -546, -191, 551, -341, -309, 638, -118, -473, 625, 141, -747, 219, 325, -544, 250, 597, -497, -178, 470, -417, -379, 570, 63, -274, 330, -91, -535, 233, 260, -242, 138, 173, -276, 17, 123, -256, 90, 270, -175, -14, 144, -235, 35, 263, -287, -96, 387, -136, -163, 352, -187, -336, 452, 39, -476, 356, 244, -528, 168, 356, -513, 50, 589, -414, -300, 575, -142, -390, 479, -10, -508, 407, 259, -544, 134, 362, -422, -27, 383, -331, -135, 443, -184, -323, 309, -9, -226, 250, 11, -300, 177, 115, -247, 80, 125, -147, 109, 58, -265, 91, 229, -191, 42, 175, -280, -3, 321, -238, -121, 405, -110, -308]
2276c08O00l29k52O89k67o30O36J64o69M29L28p46K17N54o65m6P58m31m09O11
2296B34j93m13O20L5o72L68K94n08J81L07m34O8L82l62r3M05k43j97L56j55j24
2317a44L93j55l98K84M6j57L55j4m49K09J30l73K58L34l92N8K34m89K3O09l06
2338E6k87M57j81l41N42l2o13L77K89m87K34L90n44q4L86l80n1P08j54m73K43
2359E5j39l12N24J94m30J55J39m30P7L08k19N5K66l00p7L01j78j56J95j49J3M36
2381C28j08l91J19q0j88M44K07l27J11J8n43J29M84j29L4K29m61k30M75p5k29
2402a83L53j6l51L25P4m43J61K23l47J07M43k30j58J41l67j45N69J41k27R4j85
2423b1l64K57K10j29K04J13l88m3J40j22J43K32k93p1K94j16j39J41j94r1M06
$$ y = [-308, 292, -37, -289, 400, 133, -497, 139, 303, -366, 63, 391, -355, -138, 416, -249, -295, 463, 32, -377, 234, 41, -372, 248, 283, -389, -21, 273, -235, -54, 253, -181, -113, 269, -93, -186, 219, -24, -221, 135, -20, -144, 249, 94, -304, -20, 26, -131, 224, 210, -239, -30, 100, -273, -15, 319, -73, -15, 219, -270, -247, 362, 56, -231, 226, 45, -296, 246, 214, -399, -22, 267, -220, 14, 404, -140, -224, 162, -218, -269, 439, 285, -188, 55, -84, -396, 128, 322, -108, 47, 186, -244, -167, 141, -78, -23, 243, -57, -134, 167, -11, -167, 28, -121, -108, 328, 220, -171, -52, -132, -320, 124, 331, 4, 115, 133, -410, -281, 203, 74, 108, 337, -124, -354, 121, 46, -183, 170, 154, -197, 128, 202, -241, -80, 143, -204, -97, 346, 116, -42, 99, -268, -413, 156, 297, 70, 164, -21, -385, -128, 82, -47, 157, 270, -118, -161, -21, -143, 0, 232, -61, -132, 162, 46, -93, 48, -146, -237, 169]
2444A69N4k49J42q9l62K12K24j24K37J30n14j65L35m0M7L02k43k74K66j4k02K08
2466E0Q1k15J27P5k20J22J10k79k1K49l1L7J19l13j61K67K5k2J92j17k21J09j6
2489e3j41K78J26k55J4N9j80J35K09k90l4K86j36j05K23j55j87K86J9k38K08J03
2511A72k86K9J37j58J13K26k50j38J97l2o6J46o4j09J48jj70R1O4o1L9j4q5J05
2535C3L2j26M5M7r1J13M1k45Q3K26j87l7J68j72o9K96r7k40K38N0k84J54J50k29
2559a01P3J93k88m6L35p6j86J45p1j42K68O3k51N2R5j53L5J72n3l4M0j61n9J90
2583D0P0k1n7j43J9J45J0k0Qj25k0J53n5k3J65j25k14J63J07o9J58n5l89J01L23
2608A46j16oJ55k98j52L58k1j72K86l5m17J21K54j38J06J47l64j42L60O6j22R9
$$ y = [169, 223, -26, 116, 27, -335, -123, 101, -23, 214, 344, -170, -335, 0, -40, 7, 309, 66, -208, 58, 44, -158, 50, 131, -84, 43, 118, -102, 20, 130, -149, -170, 79, 48, 85, 204, -109, -270, -3, 22, 0, 192, 75, -146, -37, -53, -194, 84, 210, -45, -31, 28, -152, -17, 192, -98, -132, 154, 18, -87, 136, -19, -206, 80, 99, -139, 69, 172, -114, -85, 52, -106, 7, 233, -17, -155, 42, 10, -56, 90, 26, -83, 65, 64, -106, -15, 49, -12, 27, 13, -72, 33, 65, -61, -16, 31, -60, 53, 94, -151, -68, 158, -29, -66, 102, -70, -139, 157, 60, -180, 58, 108, -176, -22, 128, -101, -28, 165, -123, -169, 166, 90, -96, 49, -22, -164, 104, 167, -84, -32, 63, -90, -55, 117, 64, 30, 70, -91, -150, 40, 110, 89, 32, -111, -92, 53, 63, 43, 51, -74, -94, 59, 4, -19, 146, 21, -193, -30, 77, 8, 166, 111, -278, -177, 146, 30, 24, 179, -119, -271, 87, 66, -106, 180, 145, -272, -151, 103, -35, 71, 218, -146, -288, 72, 138, 16, 115]
2630A15j24k11J54J67m9M9k5j78n2R7J41J19q5k32j8M8R6K01m7l11L4J23j13J57
2654E6K17k83j45J82j30j3M18p5m58J10J24j40L00J77m80r8L03j30qL41j55l38
2676b25J69K3j26L28J14l93r2J39l2J79J93k76j96J31K3M0J80q8j54kn2M9K23
2699A55Rj32p1j46N2L29pk34N5r0j36L05J56l06M6J29l40M7M49j66k12K27k13
2722i4k54N20J58m56M8J49l22J70L98k93j64K56j94j96L99R8k86Q3l5k44K29K84
2744B54j97j16M5j17N3K14p3n4J2j16NJ14mQ8K4k73m0K83o0m1J84k45k02L52P1
2769A61l01K34R3l97J22K84k77K5L45l59k37M43l6k22L11j17m24L52K54l97J07
2790c6K78l74q7L89j67j64L51r2l55K08J61j53J05Lk17Q4J35q3M2L9j29M8M6j41
$$ y = [115, -9, -220, -66, 101, 52, 101, 76, -102, -154, -57, 84, 203, 118, -114, -132, -84, 12, 213, 166, -145, -111, 12, -101, 56, 273, -10, -155, 27, -103, -116, 302, 227, -231, -121, 3, -137, 163, 340, -140, -238, 65, -65, -73, 268, 113, -225, -56, -33, -159, 169, 283, -110, -202, -63, -95, 84, 277, 1, -195, -64, -41, -1, 179, 91, -63, -65, -117, -68, 155, 164, 32, -39, -185, -133, 196, 189, -45, 10, -80, -216, 89, 245, -61, -15, 114, -226, -179, 270, 104, -108, 119, -94, -348, 172, 330, -126, -78, 71, -251, -81, 317, 24, -140, 116, -78, -274, 125, 223, -63, 20, -15, -259, -30, 254, 57, -59, -14, -131, -78, 136, 63, 9, 21, -95, -90, 24, 20, 108, 132, -141, -181, 102, 42, 1, 185, -60, -262, 90, 161, -140, 94, 187, -210, -88, 196, -81, -56, 289, -70, -307, 136, 100, -122, 189, 72, -352, 0, 254, -143, -36, 242, -132, -219, 170, 3, -161, 190, 98, -257, -49, 112, -41, 64, 67, -150, -66, 69, -14, 28, 67, -62, -14, 32, -109]
2814a09J01J62j94j7Q8j31O8K17k18j16K75j29j54L16j06k76L69N6m83K42L29
2835B90m23k1M29l49j50M87j78l84L85J01l74K13J23l39J66K29l32K3K83k27n7
2856a05K50j89j35L36n8k72J93P1j92R7N1j13J28K9j70M9Oq4K45L0l28J20J90
2879A49l15N8L59k57j16L23k22k59M12P1l59K09M4l09K79J87m30O3L15l35NM50
2901C22k69k64L66j60l57M50K61m02J1Q5k83J02L49j48p9J20j92l5J57j06M7J96
2923A71k05j29K98n8k10J86q7k05L56J67k83kn0k64K59K73j94J07J24n12r6M80
2945A26j01m6M10k98n08L98K02l63K22J99l99Q5L17k76o8K24k70o7L96k1j24J99
2967B37l39l94M23L01j56J70l8n04j5L18l5J03K12k46j66N6j01J47K36k43j07
$$ y = [-109, -8, 154, -40, -57, 31, -100, -32, 185, -33, -149, 126, -3, -157, 159, 53, -223, 146, 202, -281, -39, 290, -133, -154, 275, -74, -224, 263, 85, -299, 86, 187, -187, 26, 149, -190, -24, 205, -127, -104, 179, -48, -105, 145, -44, -179, 157, 99, -173, 20, 91, -101, -4, 47, -66, 62, 91, -79, -30, -24, -108, 137, 167, -161, -41, 149, -166, -108, 251, -6, -122, 201, -21, -280, 132, 203, -156, 53, 97, -212, 67, 254, -176, -113, 202, -133, -128, 322, 53, -211, 155, -5, -362, 88, 349, -53, -42, 43, -240, -138, 211, 63, -16, 104, -88, -123, 34, -72, -25, 171, -34, -163, 135, 77, -133, 53, -34, -239, 117, 284, 1, -1, -51, -315, -56, 217, 23, 130, 254, -258, -354, 126, 25, -21, 389, 91, -417, -19, 183, -180, 42, 241, -158, -73, 244, -32, -100, 124, -146, -213, 183, 162, 38, 237, -102, -496, -73, 228, 72, 242, 204, -300, -315, 3, -32, 71, 283, 37, -129, -73, -174, -27, 209, -34, -141]
2988a41K91j06j28K60k20l74M07K74k57J61N5n15l1L30m3J97L06m36l57K16n9
3009a70M1N03j36m65K33P4l58K65K64l84K4L14k15n9K58k36k44K35J02N6K28k59
3031G1l86J49O7NL84L8m30PN7k58K42L64k21j31Q7k03L0K99j63j73K39n9p9K97
3055B33j47l97K65J28k49K91K57m55j31K16k05O4M92j46l54J23q0j03L21N6k65
3076h6J64Ok84J86J87k67N4J78k51QL49j78k43J56k6k9K69o1k44R8k7j07K27M9
3100A28j96J51j4l29K01K63k46rJ79k43m1L42j48k12K50k9j85K43rk78K27Q4l06
3123a77J48K35k68k1K25k35n2L66j23k85K34L4j92J63P2k16R6Q6j72N6R6j02N4
3146B2P5j94N1J73j74o0J94r1l6J86j56j89K26N3j52J80l0k27J45Q1k38J56K05
$$ y = [-141, 150, 44, -84, 176, -44, -418, -11, 263, 6, 167, 222, -293, -324, 6, -37, 160, 466, 30, -327, -111, -170, -129, 374, 238, -227, 6, 80, -278, -13, 251, -133, -109, 205, -10, -69, 189, -47, -291, -56, 46, 102, 330, 71, -315, -166, -99, -94, 290, 328, -102, -95, -38, -296, -54, 310, 89, -42, 45, -158, -128, 171, 8, -165, 74, 15, -64, 233, 86, -311, -46, 82, -167, 124, 381, -74, -205, 11, -194, -130, 362, 216, -138, -15, -95, -198, 123, 179, -86, 78, 84, -200, -14, 173, -94, -40, 138, -113, -105, 244, 66, -177, -21, -47, -76, 193, 132, -112, -14, -41, -148, 79, 128, -68, 83, 69, -260, -59, 204, -42, -51, 128, -115, -156, 186, 38, -174, 76, 47, -138, 105, 96, -182, 45, 129, -177, -29, 206, -62, -83, 142, -93, -145, 221, 98, -187, 47, 81, -111, 52, 124, -92, 4, 90, -82, -26, 70, -32, 22, 97, -97, -46, 127, -47, -107, 87, -4, -40, 146, -10, -199, 27, 80, -72, 108, 78, -149, -4, 77, -161, -5, 200]
3169B00k64l0K16k00l1L19j84k43K94N2k39J63K4k68J65J79k00N0J53k44l7J85
3191F0j14L5K55j95k33J83M5j06J94j3k46J01J13j27L6J07j30NN7r8R3J20j91
3214d9q2J45p8N0K25k00k27K24Mj34K22M0k71J00Q8k24J45K41k44q5J59j41OK98
3238B12j45k58J95O3j70J72R0k71M6J37j59N8J99j35j13O2p4O9K07j34j46J01
3260Fn7k3K07m3j92J29J4j74J48J31j65oN8j66O9K40j41j17J16j15j7K42q5j83
3284a24J55Oj96J58J31j82M6N3j92Q7K13j13j01Q7j15j4K43o3j60J33k2j54J47
3307B3P7j54R5M5k07N6J80r5k8O3j32L4J66j09p4J20q5p5J91n1j38J92rk34J20
3332b9J45j57N9R2k20QK33j17j02J63o1j16J76m2j52J67O4k23N8J25j11N5Q0j54
$$ y = [200, -64, -94, 122, -78, -109, 210, 26, -217, 77, 129, -110, 53, 77, -191, -26, 153, -47, 3, 156, -88, -125, 60, -54, -19, 236, 41, -192, -9, 36, -70, 124, 111, -135, -34, 79, -48, -12, 95, -35, -30, 27, -71, 22, 142, -49, -131, 14, -64, -14, 211, 11, -216, 8, 12, -122, 100, 140, -131, -31, 57, -167, -22, 219, -25, -110, 49, -92, -86, 212, 67, -191, 4, 67, -103, 69, 159, -112, -66, 71, -88, -30, 169, 34, -79, -17, -91, -22, 185, 51, -95, 6, -51, -74, 133, 90, -102, 27, 41, -133, 15, 146, -19, -25, 33, -133, -64, 176, 35, -82, 34, -81, -98, 144, 59, -124, 31, 37, -159, -1, 130, -52, -6, 47, -145, -58, 155, 42, -59, 28, -87, -101, 142, 79, -81, 52, 30, -124, 23, 100, -54, 41, 86, -121, -65, 115, 20, -8, 55, -77, -43, 123, 14, -60, 60, -25, -100, 91, 40, -98, 94, 85, -149, -29, 116, -41, 18, 110, -110, -102, 131, 14, -88, 75, 14, -102, 74, 32, -120, 47, 111, -112, -54, 71, -40, 15, 95, -59]
3356e9k1J51o6m6Q9m9m3J05p4o7J73m1j14P7j7r3J72L5j92O4R8j32K9J15j36j
3382d3J72j47r8J96m1j12J35l6j58J89P3k25N1J35j62L6J44j50k6J85j35j16J77
3405D4Nj09J01l8j25J43Q2j42J1N5r3N4P4r3JQ6r2k6Q8l0QQ6j32p0J71j8p6J09
3433G4o1j15J45L4j67J12R8j93K0J34j38L2J80j74j42K24j1j28J42pj86J25J03
3456A01j77M4J37j47l1J29r6PJ41r1j34J41J4o8Q8m0j39J16P0j07N6L7r6L9K4
3481A8p8P5Q3j19j8M8o2O2J24j50q0J57l9j00J63k3j58J40L3j87J08J60k06j6
3505f5J43j44K4K15j59j56J86k4j24J69K5j92Q9R5j80K7J90j02p2P0n7J5R5p0
3529bp7P5j5K5Q4q7j06J23nr4J23M6j16L4j1j16R9J62j28l6O4j29M2J68j40p4
$$ y = [-59, -80, 71, 5, -41, 48, -1, -44, 61, -13, -80, 93, 52, -62, 15, -2, -95, 77, 112, -80, -16, 82, -50, -21, 94, -42, -43, 129, -18, -116, 80, 39, -73, 62, 26, -132, 57, 130, -95, -44, 91, -71, -35, 109, -41, -67, 118, -17, -133, 44, 49, -60, 41, 3, -122, 21, 103, -39, -28, 27, -66, -12, 62, -31, -30, 56, -36, -62, 26, -4, 4, 90, -42, -112, 59, 41, -35, 74, 13, -102, 43, 77, -90, 22, 120, -73, -53, 81, -57, -25, 155, -19, -161, 63, 52, -76, 66, 59, -127, -2, 101, -76, -32, 105, -42, -73, 56, -40, -33, 108, 17, -117, 24, 38, -30, 58, 18, -121, -5, 65, -42, 14, 51, -45, -6, 18, -60, 15, 98, -21, -39, 9, -53, 9, 133, -17, -97, 60, 21, -79, 84, 61, -97, 43, 76, -111, -3, 157, -49, -65, 78, -66, -42, 173, 14, -142, 44, 20, -104, 65, 90, -102, -13, 82, -98, -71, 119, 17, -55, 15, -42, -27, 68, -2, -79, -4, -19, 6, 90, 3, -103, 20, 15, -79, 44, 90, -26, 8, -3, -119, -20, 142, 14, -22, 42, -87, -45, 123, -17, -91]
3555i1K16p8j58J70K3j89J26J01k24P4K12j93q1J16p2mJ89p9j33J10m3r9J46M2
3579H1j40R6L3j83L6J61p8n1P6l5k3R1n8o9K5oN4Q9j17n9J45j07j28K20N1j50
3605d6J09ok21P6K24j43l4J32j15o6J59p4r0J89k7j67J52K4j89J17R0k07M9K49
3629A85j54j25J15n3o2J55Rr7O0l3o6N6Ol4J31m9j55R6P2j07L3O9j17J6J62j02
3655A1r9J10m2k3J03n5m6J35r9j32J77J9j32J41N3k68P8K32j89q3K16r1j03J63
3679G6l7j53J61L1j44O3O5j13O6M8j53O4J51j30n9J37q5n0J37l9j08J07Mq3L7
3704gJ0l6R8n3j16J23L8j26Q8N2j91Q8J74j88p0K07o1j21J48l4j33J41M1j50Q3
3729EP5j26M9O1j52P4J66j73o2J47n0q5J58l2j55J18N6j30N1N7n9K4Kr3Q5Q2j11
$$ y = [-91, 125, 47, -111, 59, 82, -107, 19, 120, -104, -30, 182, -11, -92, 24, -48, -52, 137, 58, -75, 35, -8, -107, 39, 81, -59, 37, 70, -113, -77, 84, 6, -45, 31, -4, -27, 64, 6, -63, -38, -44, 10, 99, -18, -77, 68, -39, -167, 53, 104, -46, 63, 57, -164, -88, 136, -7, -41, 91, -24, -90, 69, -5, -95, 94, 67, -100, 52, 76, -113, 4, 94, -113, -64, 185, 31, -94, 21, -32, -94, 61, 70, -27, 33, 0, -66, -10, -4, -38, 93, 44, -111, -15, 57, -50, -17, 52, -65, -49, 113, 11, -88, 22, -20, -43, 60, 5, -41, 94, -5, -137, 40, 59, -73, 68, 121, -147, -69, 163, -26, -109, 107, 16, -87, 76, 39, -114, 47, 78, -66, -3, 62, -51, 15, 63, -90, -26, 125, -5, -64, 73, -12, -62, 75, 36, -72, 35, 39, -44, -7, 3, -33, 65, 12, -104, 19, 57, -69, 19, 71, -120, -32, 142, -46, -116, 91, 30, -91, 57, 23, -110, 31, 72, -78, 5, 80, -46, 3, 64, -88, -14, 152, -21, -83, 64, 14, -71, 87, 55, -100, 18, 74, -56, -5, 52, -7, 17, 19, -74, 11, 93, -18]
3756a8kP7j14K7J51j36q4J55k0j23J25Jj08Q8L0j52R5R3j21J4O8j33N4J66j53
3781b0q5J84n3j21J45j0j36J11Q5j65M7J10j04k8N3o1O6R1j01n8O9n8mJ48n9q8
3807d2J14l9j46R0P4o4P8Qj56M2R9q8RR4r9J9J10j52m2J64o2r7J56J2j54R4L7
3834E9j78O9J64q6k7N7j09k5J36o5m1J57n4j14O4k3p1J23P2j50N2O6r5j2N2o8
3860d7L6J08o3l3M6p1m4R8l9%J61p6j64N8J7n7J29Q1j64J1N9j36K0J19m3PQ6j37
3888c8p0J45j8j16J25J6r5R9K6j73L0J14q4K3J17q3n3M9r4j9J64M1q5J8o2r9J34
3915A2N3q6N4M3j09LN8n2J3O7o9j8R6j9m4Mr9J0J80Qj05L6n2j14J13R4p6N0M0
3944I1j81k5J34jJ3O9j36p7J50J8p9P0k9j16J21P0j16K7P0j38l1J53mk4M2j18
$$ y = [-18, -20, 57, -57, -30, 121, -15, -99, 56, 36, -87, 38, 39, -69, 19, 49, -103, -8, 85, -36, -22, 46, -87, -33, 133, -20, -105, 79, 26, -95, 50, 40, -96, 15, 100, -65, -18, 92, -12, -40, 13, -48, 18, 109, 8, -50, 19, -39, -43, 105, 46, -42, 72, 33, -113, -23, 51, -13, 65, 73, -83, -41, 58, -30, -21, 73, -26, -7, 103, -49, -91, 73, 11, -86, 70, 82, -72, 22, 59, -119, -50, 114, 28, 1, 58, -51, -76, 60, -5, -46, 111, 57, -57, 7, -16, -87, 36, 108, -42, 10, 76, -19, -31, 21, -47, -11, 97, 34, 1, 47, -24, -68, 30, -9, -9, 152, 76, -88, -30, -13, -70, 59, 140, -24, -13, 46, -90, -70, 49, 6, 13, 99, -38, -108, 37, 19, -97, 28, 44, -51, 48, 74, -99, -69, 45, -39, -16, 101, 18, -35, 14, -80, -99, 65, 106, 21, 39, -23, -122, 12, 65, -21, 33, 76, -33, -30, 28, -24, -11, 56, -13, -31, 65, 46, 2, 6, -93, -83, 97, 105, 0, 36, -16, -130, -17, 77, 1, 51, 91, -90, -115, 19, 18, 31, 100, -36, -113, 37, 55, -24, 46, 17, -99, 22, 92, -24, 3, 73, -65, -96, 57, 53, 29, 71, -47]
3970d7r0J51N9l0K0o7p4N5N6k6M0J7j17nP2k3O8K3j31m5J03RL5L4j29m9J27qn4
3999b6J06k8j63R0N9q5P9J08k13o5J65pk1R9j11j39J44N9q1Q2J0j34K9O3n7N8
4025B1P4j12n6P6LK8L7q4n1O2L5nL7p2p5R7Mn2J16Qj45NN1m6Q3R1j51o1J08l3
4055gJ1P3p5q0J24k1q2J12mj23N3O3j06P7J12j60p5J47j8l4J07q0j25J26L3p6
4081b8L2M8q4lN8o1L6N7p0m4N9K4RPq2j5O3J5%M5r3k7J02k7q1J29Jj52P6N6j10
4112f0O7J22j75m9J76m5p9J08o0j06J41M1j34N5N7j16K6Q8p2K4P0j21m6J22lm7
4138a6O3o6q8J17M6p5L3qo5N9L2n6M4L7j12mQ8j4K7K2j10l9J17Jl1N0n8o5J06
4167C5j6n8J02%j43N3R6j14P2P5j60n9J86k7r0J14n4j37J34O9j35N9Q1j51qJ16
$$ y = [-47, -137, 14, 73, 43, 63, -4, -78, -23, 33, 7, 47, 64, -53, -58, 14, -9, 59, 82, -49, -94, 9, 18, 53, 87, -42, -91, 36, 28, -26, 80, 52, -111, -21, 38, -47, 32, 140, -73, -138, 27, 20, -1, 98, -13, -152, -8, 51, -30, 52, 62, -72, -43, 20, -37, 21, 95, -17, -73, 3, 6, 34, 71, -13, -64, -2, 33, 28, 65, -7, -82, 15, 19, -33, 83, 91, -54, -49, 2, -44, 39, 130, -21, -82, 26, -7, 4, 77, 2, -78, 46, 25, -57, 55, 51, -72, -19, 44, -62, 15, 127, -33, -108, 39, 21, -13, 94, 14, -111, 15, 48, -28, 4, 52, -32, -35, 23, -38, -2, 55, -15, -59, 0, 24, 33, 40, -42, -57, 6, 21, 21, 66, -27, -54, 48, 21, -60, 69, 70, -82, -6, 50, -60, 7, 129, -46, -95, 81, 36, -43, 65, 5, -101, 40, 81, -53, 2, 59, -57, -31, 57, -15, 9, 79, -42, -88, 34, 31, -16, 47, -19, -107, 10, 56, -19, 14, 6, -59, 0, 32, -24, 20, 57, -55, -59, 29, 15, 42, 64, -46, -85, 32, 33, 2, 52, -6, -71, 35, 19, -39, 63, 63, -80, -27, 69, -45, 27, 102, -58, -117, 69, 42, -48, 66, 12, -125, 9, 78, -57, 2, 83, -68, -76, 40]
4193D0m6KP4q8r2J09L3j0J7o5m0O8LlM1m3m3N2j3m9J06L0j56K8P9p4M9R1j38o0
4223i8J52k5p6R2j4r0Q4J2j07P5Q4j13k9Q3n5J2R3j00o0J13lo4O9l3o7R9Mr7M8
4252a1N5q1J5M7n9K0Q9r8l2Q7k3l5N5m1k5O9ro9N3kl1P7l7r4R1M1r6L5O7j01R
4283c4J02j02k3J44l9j26Q7L1q2Q2K4j28K5J08p6j1R3q1l7P0l8l8R9mq4J3QNO8
4312E6k1q8J4L6k1O0Lq2L4L0q9N9R1p1n6N1n3oJ41k9j22K7L5l2Q4K4j24J6N4p3
4342e2L8J11r1n4N4p3K5J55k9j32J3J7k4R5M0j14oM2o3L5Q0m9m0K4n0K3R5k6q3
4371c9KmK3J00j4j02rnOQ7L9q3Lk5r5Q2J41o5m7K6j03qJ80k0j30M7L9p1P5O2j26
4402c4nL8l6K5J14m2r2Kn3K9J60Mj10l6j8j7R6N8n6j8Oo4K6N9k5oPn3M7Q6m3q5
$$ y = [40, -6, -4, 70, -18, -110, -1, 32, 22, 39, -26, -66, 2, 5, 2, 43, 0, -43, 9, -4, -53, 53, 83, -73, -45, 34, -40, 9, 100, -38, -98, 54, 29, -47, 45, 31, -59, 25, 37, -70, 5, 89, -24, -53, 30, -25, -13, 80, -20, -80, 33, 30, -34, 35, 2, -65, 34, 38, -59, -11, 44, -37, -22, 25, -34, -14, 75, -23, -55, 32, 9, -26, 29, -12, -37, 32, 23, -46, 7, 5, -26, 51, 14, -80, 11, 52, -44, -9, 58, -43, -34, 68, -34, -57, 87, 48, -78, 9, 40, -42, 40, 64, -64, -39, 69, -7, -18, 75, -6, -43, 27, -11, -49, 50, 46, -38, -25, -17, -12, 56, 35, -53, -39, -3, -24, 36, 39, -43, -9, 21, -68, -9, 82, 11, -45, 6, -47, -53, 88, 59, -63, -36, -1, -33, 51, 75, -49, -33, 21, -52, -14, 97, 6, -48, 6, -67, -42, 113, 84, -48, -35, -18, -42, 53, 93, -21, -27, 15, -48, -13, 67, 18, -22, 2, -48, -25, 70, 44, -39, -37, -41, -18, 82, 68, -34, -43, -48, -42, 45, 84, 1, 4, -21, -116, -34, 107, 42, -5, 21, -82, -90, 90, 70, -60, -13, 26, -45, 30, 92, -34, -39, -1, -37, -12, 102, 60, -32, -30, -83, -54, 106, 110, 0, -36, -54, -71, 25, 83, 27, 9, 15, -49, -23, 36, 11, 5, 12, -41, 6, 92, 49, -36]
4434c6j2k9M8J54k5j29Jl0m4J09R3q4K0k4j30L9J41l6k5M6q9k0J37l8j25O1L3
4461Fl6Q6N4j31l6L6l9M5J38j4j12l9l6OJ37K2n8k2l6j1M8K3l8K4ok9M8J9n9m
4491a4j0n5Q2J36o1j05k5m9N2J34Qq9Ql6q5Q3Q7o0J2L0j18K3J12m4n4L5l4LJ28
4520I4j4j43K1J3k5R2Q1r7n2Pn7L8J24J8q8k8k9j0J05L6p8k5%nN6km2J1k0m3Q1
4551A9N5n4nm1p5P3J25l7p6J1m8l3J50Oq5L1j8q2O9Q6n6l1L3p5jJ27lr3J6l6L
4582d5J00J2q6j2J6k4M7N3m4j0j4o0L8R4lm8j9o2K1J02K9q9Pl8k8P1N4n2K4j5
4612A9q2L8O8k3nop3L2Q6j4n8J4m0j8J21jq4K9lq8N6J02n1qJ2r2j1J24J3o3lq
4644a7l1P0J6n5RK1m0M1K0k6J9j9o8K1J03k4j8lp8J1R1j4l2L2j9n4L8J3m6O2K9
$$ y = [-36, -48, -77, -29, 125, 100, -29, -28, -58, -102, 7, 100, 16, 36, 12, -118, -79, 62, 26, 1, 47, -42, -62, 75, 37, -88, -27, 6, -30, 56, 110, -21, -57, -21, -60, -15, 123, 109, -3, -42, -78, -72, 65, 87, 29, 7, -29, -40, 8, 31, -7, 17, 11, -18, 30, 49, -10, -14, -24, -79, 3, 139, 78, -27, -52, -101, -49, 85, 93, 4, 12, -24, -109, -26, 61, 1, 13, 43, -75, -52, 60, 16, -38, -3, -37, -34, 94, 80, -63, -42, -29, -54, 38, 119, 22, -30, -23, -80, -42, 82, 100, 12, -16, -45, -55, 50, 86, 8, -17, -17, -22, 34, 32, -10, 1, -19, -62, 19, 74, 20, 15, -26, -101, -28, 97, 60, -16, -5, -53, -86, 64, 70, -15, 16, -2, -84, -15, 71, 15, -16, 17, -58, -59, 68, 65, -28, -12, -48, -45, 55, 67, -19, -31, -15, -39, 8, 61, 17, 7, -7, -67, -29, 65, 62, 14, -5, -67, -46, 56, 85, -4, 3, -35, -63, 8, 62, 10, 34, 19, -63, -25, 43, 20, 15, 9, -64, -32, 54, 40, -18, -4, -44, -62, 59, 58, -26, 3, 0, -88, -32, 70, 19, 11, 23, -69, -80, 44, 57, -6, -9, -17, -48, 22, 38, -17, -8, 13, -27, 14, 34, 8, 27, 8, -60, -39, 64, 40, 22, 19, -59, -48, 43, 29, -3, 29, 10, -44, -6, 7, -39, 23, 52]
4675E2r7J5O2l6j2L3n2j7J15k8p5K9jk7M0L0n2J9J7n2J3M2j5LJ7n9j2O4J5m5J5
4706Aok6L9Pl4J6K2m3J7Lj9M4K1p3J4N3l5j1M4l6k8O8l0m9N1K8n2L2%n2L7M7p3
4739b3%N2l1j6L5l3k0O1np0M0K9m4M0Qo4M9L6o8J3L1l4K7K4n7nM8j7l0M3rk5M1
4772B6j9n7N7M4m6J4j5m4N2L7m1j1L3l6j9N6k1qM2m6n2O6J4k7K1qn3M7M5o4lK6
4804A0j9j4M0j8k0N6m1n0N0K4j9K5k6n1O1K9m7pK2l8K9N2o0rO0n5m1Q2Kj7K0l2
4836bp0N7O6m0plm9K8O0l3j1K4l4k1N8qjL2n8m4N9L2j9J1k4o3N9N0n2KK4n0kO5
4870C6k2mK4l7o2O0K8j1jm1k9L8O0j4k0j1l8L5L1j9J3K8o5m4P1J2JL2n6p3P3M6
4902D1m1J6Ko2K2N5k6OJ7l7m4N8K0k1L0m6m6L7O4j8Jl9m5N0L1m2K0K5o8MN5mj3
$$ y = [52, -45, -30, 32, -4, -16, 17, -35, -52, 63, 35, -40, -11, -12, -39, 1, 31, -21, -2, 15, -37, -24, 18, 3, 6, 23, -36, -48, 16, 31, -14, 1, -5, -31, 8, 15, -19, -3, 19, -24, -7, -4, -23, 21, 42, -31, -17, 36, 1, -10, 34, -2, -30, 38, 8, -41, 10, 38, -14, 18, 18, -34, 3, 50, -23, -23, 29, -2, -18, 17, -16, -36, 25, 20, -50, -10, 19, -25, 15, 23, -41, 8, 44, -24, -11, 20, -14, 13, 37, -20, -25, 23, 6, -24, 19, 10, -15, 26, 7, -50, 7, 51, 5, 19, 4, -40, 12, 49, 8, -3, 30, -6, -25, 31, 10, 2, 44, -2, -54, 12, 26, -1, 20, 12, -41, 6, 51, -13, -16, 10, -9, -23, 17, -1, -21, 35, -6, -56, -6, 18, -1, 24, -2, -53, 8, 37, -10, -17, 5, -33, -4, 48, -12, -21, 39, -16, -57, 25, 27, 10, 30, -2, -72, -15, 51, 11, 4, 1, -48, -20, 40, 7, -4, 20, -14, -35, 23, 15, 14, 46, -12, -56, 3, 35, 16, 27, 3, -60, -1, 49, -3, -1, 23, -27, -29, 36, 14, 10, 34, -3, -65, -5, 23, 12, 11, -30, -59, -21, 39, 25, 5, -6, -44, -9, 22, 3, 16, 44, -21, -65, 6, 18, 19, 51, -5, -78, -5, 41, 0, 16, 18, -44, -22, 33, 7, 13, 30, -7, -51, 7, 27, 6, 36, -10, -56, -19, 45, 27, 28, -11, -56, -6, 25, -17, 3, 28, -40, -36, 19, 15, 2]
4935BL9p2n1P5L1j3K5m5o3O1M7l0PNn7J1M1mK1J7o2l5N1LJ4K7n8m5N6L8k8J9j0
4968A7o7L4N2m7J9M3p4m0O3NjN0p5o0O5N1j2j3rn0J9N9k7OJ9n9qL9qM3K7q6l9
5001f4L2L3OM1n2o5N6M1m7K7K7p9J5M7l6J8N0o2n2N3K4JJ9l1o0L5M4j4J3pm4R
5033b2K8mLL3m9k4M2k7K6M5o0o3O4K9k6M1l0p2M3M1k7K0L3n8k8K5%L3O2n9p5L8
5065a8J6PK1j6m9L4K1l4K2J8n7K7J6l0L5M0n4n2N6QKL2l1o0L1M4n2L6K2l9j1K0
5097EpkL5k8m2L3KK6K3n6m1L9L1j4Qj3m1K3M0n7L8N0o3k1K7k1RO5k4o8L8L1k3
5130BOJ2m8L0L0l5j1L2k2oPoRL9l9l9M6j1J4K2l0k6L4Ok3J1J3l8J7K5m7K5N3m4
5164Hm7M0kk0M5j9n2L7M1l3KJ0l4J2K7m1RL9l4j0J7j6J9L6l6l6L8Ok6K2Ql5K7
$$ y = [2, 41, -31, -82, -7, 24, 11, 36, -9, -72, -11, 36, 6, 13, 18, -39, -28, 13, 9, 30, 47, -15, -50, 1, 4, 18, 45, -13, -58, -2, 36, 8, 27, 17, -50, -16, 36, -11, 8, 51, -23, -63, 0, 5, 4, 54, -21, -81, -16, 35, 23, 10, 1, -49, -30, 29, 2, 8, 27, -32, -40, -1, -9, 34, 61, -25, -64, -32, 1, 7, 48, -4, -69, -13, 28, -19, 8, 35, -44, -29, 18, -18, 0, 50, -12, -64, -11, 13, 14, 33, 2, -58, -23, 21, 7, 20, 13, -31, -22, 6, 2, 5, 38, -11, -35, 7, -20, 6, 51, -9, -72, -8, 21, -5, 36, 6, -66, -23, 18, -9, 11, 44, -14, -42, -17, -17, 16, 78, 19, -56, -18, -2, 5, 26, 10, -39, -5, 16, -18, 4, 22, -35, -8, 8, -22, 13, 53, -1, -53, 3, 11, 13, 45, 14, -46, -15, 29, -23, 13, 35, -4, -15, 5, -2, -4, 31, 3, -39, -6, -4, 22, 45, -11, -52, -13, 18, 4, 12, -1, -42, -19, 21, -36, 2, 52, -11, -32, -5, -26, -17, 48, 24, -44, -6, 25, 2, 8, 20, -28, 2, 32, -3, -14, 18, -4, -10, -3, -9, 0, 39, 0, -39, 7, -4, 10, 32, 2, -24, 10, 16, -7, 4, 17, -21, -4, 21, -26, -1, 52, 8, -39, 1, -1, -21, 24, 5, -47, -10, 31, -2, 0, 10, -24, -12, 15, -26, -17, 22, -12, -22, -5, -21, -2, 34, -2, -38, 0, 6, -20, 2, 10, -25, 2]
5197BJ5l4mN1l2j7K8k1nL5rm4L3J0j0J6j3k7K7Rk1KK7k3lK2l7J7L7k6k6J8%j1
5231a4L8j3m3K5L0n6J1L7k0kL3m1k0M7mk8QJ1JJ0Kk8J3K2k9OKpJ2J9m2RL4j3q
5266BRl2OM1pn0L8Pk6JK9l8K0L9n4qM3k5nJ9k2qN9k2l0QJ5l2K7J2l6K1J4o4K9
5301b0L9j8J3J8o1k0O4Ml5L6%l5K5J1m5QM7l2k0L3Mj6K9o1J6K9J1jok9oL5j8J
5335@L7%n8J8j3j6N8L0q2OM2l4jL8m6qO6on4K8J0m8J2L9j9K2J4n8k9M4QJ8K3k8
5369A3l8J6Rj6K6%j4J7ol0K7Pj8KJ0jK4ln2OL6j2OM4n7j3M2k8j3M5J3n7K4j8k5
5404c4M1M2o5pN9m8jM7l2k8N1Jn2L3K2o3J6L0k8MM7k6l7K5LOJ7j0j9J5nj5K4j2
5438A%K3m4RL4j4l9M8on1O1J7q6K9N4l9rN9l8l9N6pn9O6J8o2PL2m1NO6o9j9O2
$$ y = [2, 17, -17, -21, 30, -2, -19, 9, -12, -17, 18, 9, -35, -2, 8, -2, 14, 1, -26, 1, 10, -11, -9, 18, -5, -8, 14, -23, -6, 31, 5, -21, -3, -3, -14, 24, 11, -32, -7, 23, -33, -22, 15, -5, -7, 26, -15, -35, 12, 8, -20, -12, -1, 0, 10, 12, -16, -3, 19, -10, -4, -2, -9, 3, 22, -20, -11, 23, 10, 2, 11, -21, -15, 26, 19, -31, 7, 14, -12, -11, 18, -20, 0, 39, -15, -23, 20, -5, -10, 9, -13, -21, 38, 16, -14, -6, 9, -23, 4, 16, -20, 1, 15, -49, -20, 19, 1, 14, 32, -29, -49, 15, 19, -16, 20, 20, -15, 10, 21, -24, -16, 31, -1, -21, 12, 16, 0, 29, -32, -16, 13, 24, 23, 17, -12, -18, 17, -1, 0, 37, 37, -21, -3, -16, -32, 26, 56, -26, -20, 22, -12, -13, 25, -21, -29, 37, 31, -23, 5, 15, -33, -21, 18, -1, 21, 35, -23, -52, -8, 0, 18, 41, 13, -25, -9, 0, -16, 10, 10, -4, 13, 7, -23, 4, 11, -7, -5, 5, 4, 28, 25, -27, -21, 15, 3, 9, 53, -4, -17, 25, -3, -16, 29, 42, -15, 9, -9, -34, 7, 49, -16, -23, 36, -12, -13, 34, 2, -26, 25, 26, -26, 7, 29, -34, -18, 12, -16, -12, 35, 9, -28, -3, 0, 6, 23, 13, -6, 9, 4, -11, 13, 1, 1, 24, -20, -11, 23, 9, -30, 18, 12, -39, 22, 39, -47, -18, 36, -3, -12, 47, 9, -30, 26, 19, -40, 26, 44, -18, -11, 21, -20, -15, 51, -18, -37, 25]
5472B5j3k3K6j7k1M1j4l2K7Ooj3MJ0K1rj6nrKM1j7m2K1K9k7JM2k6l1P0n4k1O6
5506C6j3o5M9J3m2L6K8q0J7O4l7k4N7k8m3N4Kn9M9L8p5NL0k3QL6l4l0N3j2j6R
5538Cpj0K4oqNnmJ8k9%N6k5l4K9Nl5N7Ko9L1L6n9PO4m4k2P1m6m1P5Op2K3M5m9
5574hK2L9o2k3O4k8j2K2J2m4K8ok2L0K8l6j2LnJ9J2j6j7J8rK3j3k7K3Ol1OM3k3
5608DOJ2n3nO9j2m7L3jl5K6L3o0K9N2n8k3O6k1l3M4j9m3O4K5o6mM9n1K0N1m7k0
5641a5L4j2l3M8J1l1J8k3j8L0J2j9jj3ML2j6rPj0JPOj9K6Nm4J1L6k5pL3l6l3O7
5676B4ql9L3Ok5J1L1n5J1M9l9l2N7nn0M4Nm1K8K9m3j4L8k4J1Pj3j1K8lk4J9NK
5710A2Lj9jJ4j1OJj8lK7ol3M3Jk8K8qk8K3K1l4j2M9l0j8N0j5m0N0J1o8K6L3l0
$$ y = [25, 12, -11, 15, -2, -23, 18, 4, -28, -1, 5, -1, -14, -10, 0, 21, 12, -4, -9, -18, -16, 25, 8, -34, -13, 16, -11, -10, 32, 6, -25, 45, -9, -30, 36, 23, -42, 7, 20, -22, 14, 42, -38, -21, 43, 6, -18, 39, 11, -32, 22, 24, -35, 14, 52, -23, -18, 12, -11, -3, 33, -1, -31, 22, 10, -6, 3, -4, -14, 10, 4, -4, 1, -4, -8, 10, -19, -19, 37, 12, -22, 7, 12, -23, 34, 36, -33, -2, 34, -25, -18, 46, 2, -20, 51, 5, -36, 39, 45, -27, -4, 41, -8, 14, 53, -9, -32, 32, 4, -8, 14, 26, -18, 10, 4, -18, 12, 40, 4, -8, -5, -10, 9, 21, 5, -12, 6, -3, 20, 7, -20, 3, 9, -22, -16, 27, 4, 10, 22, -31, -36, 33, 21, -26, 7, 6, -29, -3, 30, -30, -1, 51, -7, -30, 36, 15, -18, 26, 7, -36, 28, 53, -13, -17, 32, -19, 1, 52, 5, -15, 19, 7, -26, 22, 33, 2, 20, -3, -21, 9, 21, 2, 1, -12, -8, 24, 8, -1, 6, -4, -3, 4, 10, -9, 17, 22, -22, -11, 25, 0, -7, 26, -10, -43, 24, 16, -23, 10, 16, -9, 2, 33, -22, -11, 38, -1, -33, 24, 19, -31, 13, 18, -23, 5, 34, -9, -23, 15, -9, 2, 9, -4, -15, 13, 10, -14, 5, 10, 12, 15, -4, -5, 9, -2, 4, 5, -13, -16, 11, 5, -28, 15, 16, -12, 16, 8, -20, 3, 24, -10, -22, 27, -3, -21, 29, 14, -26, 24, 35, -33, -7, 26, -4]
5744dLK4l7J2L3k2k9L9Pl5K2Jk0K3Lk5J7Qj9J2Mqj2K5j9j2J2Qj3K1k3nK3olNj3
5781cKK0j1l4L0J8k6J3jk8J2L8m5nL3j8oK3j7j8N2Kn6K4J8k4J0K6m5mM5j4l2K8
5815GRj5JMk1L1J7l9%J1JJ0ok3OL1pj1jnPMpLJ0Lk7OPpJ0%k5J6J8j8j5K1qKK4
5856B4k3k5K9Nj5OJjJ9J6m7PK7l2J9J7j8k5M6k7k7N0nk3J2Kk2K0K3l6rK7nqPl
5892Fk6J5K4k2J2%lj2j6J2J5J0roj2j9M0mk0J9K1m3JJ9j8QL3j5l3L1J1m0J6Rj5
5927a1K0J1k6j3K4j2j2L5j0KRj1l1J2L2j7Rmj8J3J9l9mM3k0MOj2j9L2j6j4L6J6
5961C4k5rj4j2L3K2j8qlmJ2rqJ2K5k2k3K1j3KK3k6pL1J1m0J2J5k1J9L3m2qL5k6
5996Bj8K0J0mRpm1K2L4j8Lj6mJ5mk0J1J4jmKj2QK8m7JK5KpOnl3M6Pl9QL4k5j7
$$ y = [-4, -1, 23, -14, -2, 31, 9, -20, 19, 26, -9, 13, 14, -6, 17, 20, -5, 12, 20, 1, 13, 17, 9, -3, 22, 3, -9, 3, 11, -2, 19, -4, -9, 14, 8, 5, 10, -3, -1, 19, 8, -26, 4, 22, -4, 9, 8, -20, -8, 30, -15, -20, 13, -5, -11, 12, -5, -23, 29, 31, -25, -1, 17, -7, 3, 29, -16, -20, 25, 11, -21, 7, 16, 1, 2, 6, -15, 16, 33, -6, -6, 5, 6, 16, 10, -13, -7, 24, 17, 6, 5, 0, 7, 11, 4, 7, 17, 20, -7, -1, 6, -1, 9, 9, -16, 0, 18, 0, -15, 6, -2, 0, 24, 1, -24, 5, 10, -5, 1, 2, 1, 20, 36, -11, -4, 23, -9, 10, 27, 9, -16, 30, 3, -24, 26, 21, -2, 10, 12, -10, 10, 33, -3, -12, 15, 10, 2, 9, 6, -20, -5, 19, -3, 9, 9, 6, -6, -22, -10, 5, 15, 6, 0, -12, -31, 9, 5, -15, 4, 25, -18, -17, 2, -16, -8, 25, 10, -23, 8, 19, -21, -5, 4, -11, 9, 20, -6, -19, 5, -7, -19, 16, 6, 8, 17, 6, -25, -13, 19, 2, 11, 7, -11, 2, 21, -18, -22, 21, 1, 5, 11, -1, -20, 12, -4, -18, 18, 34, 9, 0, -14, -26, 7, 29, 11, 3, 0, -4, 8, -1, -9, 3, 28, 6, -17, 4, -9, -7, 16, -10, -17, 14, 25, -15, -3, 12, -9, 10, 43, 1, -7, 28, 2, -16, 4, 14, 10, 19, 12, -29, -7, 27, 9, 12, -4, -8, 7, 3, -17, -6, 8, 7, 3, 5, -7, 1, 29, -18, -17, 8, 10, 3, 9, 4, -29, 17, 24, -15, -7, 27, 2, -15]
6035a5L2j7oL2j3k9J0NQMpj6K0J2j0rJ3plJ8l0J0J6j3nK2k2MK2j4k4K8kk6J5Q
6071A1j9J1J3k7lK4koJ0k4j3L9rk2L3nk4J1Qj6K6J4l8mK2k1LJ8k0KK0mk2QJ4j7
6107iJ1Pj8K1J6l2j0J1OK1ll9OK4k7K3J4k6jJ8k6lL1lj7K0rk4K8J7m2MK6k4OK0
6143A7j8j3J4Jk4L4J4j3k2Oj1J3K2j4rRk0J7K4k7MJ0k6nM2j6j0Oj1k2M1J9l5J5
6177A2lk9K0K3j4JJ0k5j7M2j0NLj2k2K8J1k1J4qk6K0J7k5PJ6k3jQjLK0l0l6M4
6212AJ7j9J2j7l2K4K1j1J1J7m2J5MOJ7lk4%PJPJ3m0k0M0J4k2K6mm9L9Mk8K4L2
6247D1m2j8J3QjK0j2j8J6KnLK1k8mKj2J8J3j4j6mJ4J9%k6%OpJ8%j0j0L1ok3K4
6284A3Lj4KPk1K5Oj8k5J6J0oRoj5J8j0j2J9KmK0j0k1J4J2nj7J6j1QQ%l1L3nk3
$$ y = [-15, 17, 0, -6, 26, 13, -16, -6, -1, 7, 11, 4, -12, 8, 20, 10, 1, 14, 7, 4, 22, -8, 2, 18, 5, 0, 22, 0, 4, 26, 12, -12, 16, 14, -12, 3, 11, -8, 3, 16, -11, -14, 10, 8, 2, 12, -12, -25, 14, 5, -17, 16, 11, -13, -2, 6, -10, 16, 30, -8, -12, 10, -11, -8, 10, -10, -8, 12, 8, -14, -6, 8, -9, 2, 9, -9, 12, 28, -4, -14, -3, 3, 24, 21, -18, -12, 12, -15, 8, 22, -4, -5, 13, -13, -16, 15, 12, -5, 15, 6, -18, 10, 27, -15, -11, 15, -9, -3, 17, -1, -14, 0, 1, -23, 11, 25, 12, -10, -4, -15, -2, 20, 6, -3, 6, -14, 3, 27, 0, 4, 14, -12, -17, 25, 9, -1, 5, -6, -28, 13, 32, -3, 12, 9, -20, 0, 23, 9, 10, 20, -5, -22, 20, 10, 15, 18, 6, -16, 12, 23, 2, 16, 8, -18, 2, 19, -6, 1, 17, -6, -7, 1, 0, 3, 23, -7, -43, 1, 18, -1, 11, -6, -38, -14, 7, -4, 7, 24, -18, -3, 1, 7, 24, 21, -3, -3, 4, 5, 12, 25, -15, -35, 5, 19, -3, 23, 19, -30, 9, 13, -15, 9, 41, -1, -19, -6, 2, 1, 21, 9, -9, 7, 9, 4, 7, 28, 0, -4, -2, -14, 4, 17, 3, -13, -17, -3, 16, 16, -10, -10, -4, -11, 7, 7, -3, -13, 18, 12, -11, 13, 16, 2, 4, 11, -10, 15, 21, 3, -22, -6, 4, -2, 7, 1, -14, 4, -6, -18, 1, 3, -1, 19, 9, -12, 2, 14, 9, -8, 8, -3, 5, 13, 13, -18, 15, 10, -13]
6321a3J4jj2J6%j3JJ3Jj0KmKJ5j7mK3ppjj0J0POk4K1j3kJ9kl1K5K6m6OK8j2pK4
6360B3k8j4L6Kk8MRj3J4J3j3mJ3k1jK9l1K7j1j1j9K2PRpj9JK1j4NJ2rj8MMLJ2
6397IJ6n0j1N7j4Llj4j4K6Ok5J7lk9J6RJK0Rl2j4K1QJ2kj9l4N2qj6J6Lk2lK5j2
6434AJ5Jk5k0J6J4RNk1j6OJ8kJ0j3opPJL0mk0j5jJ1J8J9m3pJ3J3j7L5k0j9J4o
6471flJ7J9k4j9J0lJ5K1j6l8JL6lPMj5Oj5rL1J3j7j2j5jK5K9k5l0RlJ1K7k4rK
6508dnk3L1K4j3k4Qj6mM8Jl0Lk4J6L2j5k1J1Kj8J4K3oqok9K0L8qj0j8oJM3nk0
6545BojoK0J5j7Rj1j8JL0jojk8J3L3j9oMpj4K9Mk5J8km1J9J3J2lQm8J1L1Pppj0
6585ej0J9q%PJ0k6kKK0J3j0k8OK7j3R%j9kK5j7qJ6Ml0J9%j1L2Om0MJ3nPQj0kJ9
$$ y = [-13, 1, 0, -12, 4, 4, -9, -8, 5, 6, -4, -2, -6, -4, 11, -6, -10, 13, 6, -1, -2, -12, -2, 5, 11, -13, 8, -5, -7, 12, 10, -21, 4, 30, -16, -10, 18, 6, -1, 23, -5, -19, 17, 19, -9, -5, 4, -9, 5, 18, 5, 1, 14, -7, -8, 21, -10, 17, 6, -5, -24, -2, 5, 14, 7, -12, -11, 10, -4, 1, 13, 4, -14, -10, -6, -3, 9, 25, -25, -36, 21, 7, 10, 7, -7, -21, 5, 11, -14, 3, 0, -29, -13, -4, -3, 17, 26, -6, -20, 1, 9, 21, 19, 0, -34, 18, 10, -6, 10, 13, -9, -12, 13, 1, 16, 17, -8, -28, -12, 2, 11, 16, -5, -21, -15, 3, 1, 11, -2, -8, -15, -8, -7, 23, 19, -1, -16, -17, -6, 12, 31, -12, -19, -6, 7, -10, 25, 5, -14, 0, -6, -9, 8, 27, 3, -16, -6, -9, 6, 27, 11, -27, -26, 10, 7, 14, 18, 3, 9, -6, -15, 16, 29, 12, 0, -15, -16, 9, 38, 13, -17, -8, -11, 0, 27, 3, -6, -4, -9, -32, -1, 23, 10, -14, -6, -22, -26, 22, 23, -7, -4, -28, -12, 20, 5, -16, -5, -3, -21, -7, 16, 10, 2, -4, -33, -13, 25, 17, 7, -11, -17, -16, 27, 22, 2, -4, -5, -11, 9, 24, 7, 16, 5, -13, -12, 18, 17, 11, 10, -18, -5, 28, 9, 3, 7, 0, -14, 15, 19, -6, 12, 10, -31, -12, 1, 13, 10, 18, -30, -19, 12, 19, 12, 5, -5, -15, 4, -4, -4, 3, 13, -13, -15, -13, 7, 20, 10, -18, -12, 15, 2, 11, 11, -8, -10, 15, -2, -10, 6, 10, -20, -1, -1, -12, 20, 26, -14, -10, 3, -2, 5, 13, 3, 1, 20]
6625B0k2lJ8%j4KKj5K2Mk1MK3k3RqloJ9Nl8J7QoK3j7j7J5K5k7J0Nj8J0orNJ9q
6664Dj1mKJ1J2j5qJ0Mk1L8pk5J3%j3J0J7oj3Jj5K4J8j1l6J9pJK7rk2rJ6j5J4J6
6701A0qj3jnQL3j3k3j0NLL0nj6Jj2JJ6POj1j7j7L3K6j6Ol0qK7J0nnlmj9L8pnR
6741A6j5k6J4K7n%j0k9J4L4j1llj3j0J5QJ6ok2opJ8K8ll0j2lL5J4j6qk7RK4pR
6778IJ8l4j8J8RJ6K3l6k9J1K4rJ4ol0J6MNnJ6j3j9J1J0JJ4om4NL6j4K3ll9NK1
6814DoOK1k4j4pJ6oK1nk5jJ6jK5j6j9JJ9j0QKpj6Nj7K9L4k1l4J7j7QM2qk4J3k
6852Gk9K8K2k5qJ4j9%K7j1j5jJ0kJ0%j1KNj1kJ1rLOj2qJ0RPk2OmJ5Qj9%PKPpj5
6894a4K1Kk3KNkNJ4k6RL1j9j2J3KrjnrL2Kj3k1J1mK0J7l1jQjpJ2J2j0mmj2RQp
$$ y = [20, -2, -5, 13, 13, -1, 1, 3, -12, 10, 14, -7, -3, 20, -3, 6, -2, -5, -11, 8, 13, -25, -8, 0, -6, 17, 0, -17, -2, 23, -4, 6, 11, -7, 3, -3, -12, -7, 12, 4, -7, -11, -9, 2, 14, -1, -9, 1, 5, -16, 22, 15, -10, 3, 3, -10, 0, 17, 11, -2, -1, -16, 8, 26, 15, -21, -2, -9, -8, 19, 10, -12, -21, -5, -20, -6, 10, 2, -11, -12, -17, -9, 24, 11, -12, -22, -17, -14, 16, 11, -5, -4, -16, -15, 1, 8, 14, 3, -14, -31, 2, 28, 12, 18, -12, -20, 7, 17, 12, 7, 4, 0, -19, 19, 12, 7, 16, 1, -25, -11, 16, 11, 11, 1, -28, -14, 20, 9, 6, 3, -10, -20, -5, 3, 19, 13, -9, -15, -22, -4, 24, 21, -9, -21, -24, 11, 25, 9, 1, -26, -17, 7, 0, 9, 27, -7, -25, -7, 2, 18, 41, 5, -24, -13, 11, 2, 16, 10, -20, -4, 0, 5, 0, 16, 3, -16, -5, 5, 6, 20, 14, -30, -25, 11, -3, 20, 17, -22, -17, 4, -2, 4, 25, 1, -13, -20, -4, -10, 11, 6, -19, -20, -4, -5, 20, 4, -15, -14, 5, -5, 3, 5, -2, -18, -13, -30, -1, 33, 12, -22, -5, -22, -14, 28, 20, -4, 9, 7, -22, 6, 28, 3, -5, 9, -10, -10, 17, 6, -9, -10, 0, -2, 8, 8, -3, -1, 4, -7, -9, 2, -7, -4, 2, -10, -18, -8, 1, 8, -14, -8, -12, 3, 11, -8, -8, -1, 1, 8, 1, -14, 7, 9, -14, -12, -7, -9, -4, 10, -16, -7, 24, 5, -7, 6, 8, -1, -2, -7, -16, 16, 18, 5, -16, -5, -9, 11, 28, -3, -4, 4, 3, -4, 8, 20, 10, 6, 2, -10, -1, 7, 0]
6935@pj3RJ3J7k3MkpOOj1J2Ok1J0J4jj2J8k6j6K9J6j8mK5m8J7K6mj6K3k4j2K1
6971GJ3j8J5pl1J1K6j6kJ9j2rJ0J4jpj3rQQO%qj9PK3kNqk0QQj6K3Lk0jMpJ4J0
$$ y = [0, -7, -20, -11, 2, 19, -4, 0, -2, -9, -3, 3, -8, 4, 10, -11, -1, 13, 12, 0, 18, -8, -24, 5, 21, 3, -1, 24, -24, -7, 19, 15, -1, 22, -2, -14, 7, 20, 2, 17, 10, -21, -10, 16, 0, -2, 17, 5, -4, 6, 20, 19, 12, -1, -10, -2, 6, 12, 12, 4, -15, -8, 15, 13, 18, 10, -10, -2, 6, -10, 13, 16, -4, -5, -1, -8, 6, 16]
$$ [...]
8191@
##END NTUPLES=NMR FID
##END=
