##TITLE=1H_LY-822.1
 CCl4, 8 sc, 
 27.5.2019
##JCAMPDX= 6.0         $$ Bruker NMR JCAMP-DX V2.0
##DATA TYPE= NMR FID
##DATA CLASS= NTUPLES
##ORIGIN= UXNMR, Bruker Analytische Messtechnik GmbH
##OWNER= root
$$ XWIN-NMR		Version 3.5
$$ Mon May 27 14:33:12 2019 Russian Standard Time (UT+4h)  she@DPX200
##.OBSERVE FREQUENCY= 200.1315
##.OBSERVE NUCLEUS= ^1H
##.DELAY= (6, 6)
##.ACQUISITION MODE= SIMULTANEOUS
##.ACQUISITION SCHEME= undefined
##.AVERAGES= 8
##.DIGITISER RES= 18
##SPECTROMETER/DATA SYSTEM= spect
##.PULSE SEQUENCE= zg30
##.SOLVENT NAME= CDCl3
##.SHIFT REFERENCE= (INTERNAL, CDCl3, 0, 15.7039)
##AUDIT TRAIL= $$ (NUMBER, WHEN, WHO, WHERE, WHAT)
$$ ##TITLE= Audit trail, XWIN-NMR		Version 3.5
$$ ##JCAMPDX= 5.01
$$ ##ORIGIN= Bruker BioSpin GmbH
$$ ##OWNER= she
$$ F:/spectra/data/she/nmr/H-F/1/audita.txt
$$ ##AUDIT TRAIL=  $$ (NUMBER, WHEN, WHO, WHERE, WHAT)
(   1,<2019-05-27 14:31:48.75 +0400>,<she>,<DPX200>,
      <created by zg, POWCHK disabled, PULCHK disabled
       configuration hash MD5:
       00 E9 B6 7A A2 85 ED C7 34 08 36 98 17 FE 4E 26
       data hash MD5: 16K
       AF A4 D2 49 6D 47 29 3C 6B 7E 65 47 3F 3D B2 51>)
$$ ##END=
$$ 
$$ hash MD5
$$ 6C 9F C4 0D 6A 04 8B D6 DA 23 79 0C B9 74 0E 0B
##$RELAX= 
##$RELAX= 
##$RELAX= 
##$RELAX= 
##$RELAX= 
##$RELAX= 
$$ Bruker specific parameters
$$ --------------------------
##$DU= <F:/spectra>
##$EXPNO= 1
##$NAME= <H-F>
##$PROCNO= 1
##$TYPE= <nmr>
##$USER= <she>
##$AMP= (0..31)
100 100 100 100 100 100 100 100 100 100 100 100 100 100 100 100 100 100 
100 100 100 100 100 100 100 100 100 100 100 100 100 100 
##$AQSEQ= 0
##$AQ_mod= 1
##$AUNM= <au_zg>
##$AUTOPOS= <>
##$BF1= 200.13
##$BF2= 200.13
##$BF3= 200.13
##$BF4= 200.13
##$BF5= 200.13
##$BF6= 200.13
##$BF7= 200.13
##$BF8= 200.13
##$BYTORDA= 1
##$CFDGTYP= 0
##$CFRGTYP= 5
##$CHEMSTR= <none>
##$CNST= (0..31)
1 1 145 1 1 1 1 1 1 1 1 1 1 1 1 1 1 1 1 1 1 1 1 1 1 1 1 1 1 1 1 1 
##$CPDPRG= <>
##$CPDPRG1= <>
##$CPDPRG2= <>
##$CPDPRG3= <>
##$CPDPRG4= <mlev>
##$CPDPRG5= <mlev>
##$CPDPRG6= <mlev>
##$CPDPRG7= <mlev>
##$CPDPRG8= <mlev>
##$CPDPRGB= <>
##$CPDPRGT= <>
##$D= (0..31)
0 1.2 0 0 0 0 0 0 0 0 0 0.03 0 0 0 0 0 0 0 0 0 0 0 0 0 0 0 0 0 0 0 0 
##$DATE= 1558953108
##$DBL= (0..7)
120 120 120 120 120 120 120 120 
##$DBP= (0..7)
150 150 150 150 150 150 150 150 
##$DBP07= 0
##$DBPNAM0= <>
##$DBPNAM1= <>
##$DBPNAM2= <>
##$DBPNAM3= <>
##$DBPNAM4= <>
##$DBPNAM5= <>
##$DBPNAM6= <>
##$DBPNAM7= <>
##$DBPOAL= (0..7)
0.5 0.5 0.5 0.5 0.5 0.5 0.5 0.5 
##$DBPOFFS= (0..7)
0 0 0 0 0 0 0 0 
##$DE= 6
##$DECBNUC= <off>
##$DECIM= 24
##$DECNUC= <off>
##$DECSTAT= 4
##$DIGMOD= 1
##$DIGTYP= 9
##$DL= (0..7)
0 120 120 120 120 120 120 120 
##$DP= (0..7)
150 150 150 150 150 150 150 150 
##$DP07= 0
##$DPNAME0= <>
##$DPNAME1= <>
##$DPNAME2= <>
##$DPNAME3= <>
##$DPNAME4= <>
##$DPNAME5= <>
##$DPNAME6= <>
##$DPNAME7= <>
##$DPOAL= (0..7)
0.5 0.5 0.5 0.5 0.5 0.5 0.5 0.5 
##$DPOFFS= (0..7)
0 0 0 0 0 0 0 0 
##$DQDMODE= 0
##$DR= 18
##$DS= 0
##$DSLIST= <SSSSSSSSSSSSSSS>
##$DSPFIRM= 0
$$ [...]
##$SUBNAM2= <"">
##$SUBNAM3= <"">
##$SUBNAM4= <"">
##$SUBNAM5= <"">
##$SUBNAM6= <"">
##$SUBNAM7= <"">
##$SUBNAM8= <"">
##$SUBNAM9= <"">
##$SW= 24.9337058887773
##$SWIBOX= (0..15)
0 0 2 0 0 0 0 0 0 0 0 0 0 0 0 0 
##$SW_h= 4990.01996007984
##$TD= 16384
##$TD0= 1
##$TE= 0
##$TE2= 300
##$TE3= 300
##$TEG= 300
##$TL= (0..7)
0 120 120 120 120 120 120 120 
##$TP= (0..7)
150 150 150 150 150 150 150 150 
##$TP07= 0
##$TPNAME0= <>
##$TPNAME1= <>
##$TPNAME2= <>
##$TPNAME3= <>
##$TPNAME4= <>
##$TPNAME5= <>
##$TPNAME6= <>
##$TPNAME7= <>
##$TPOAL= (0..7)
0.5 0.5 0.5 0.5 0.5 0.5 0.5 0.5 
##$TPOFFS= (0..7)
0 0 0 0 0 0 0 0 
##$TUNHIN= 0
##$TUNHOUT= 0
##$TUNXOUT= 0
##$USERA1= <user>
##$USERA2= <user>
##$USERA3= <user>
##$USERA4= <user>
##$USERA5= <user>
##$V9= 5
##$VALIST= <valist>
##$VCLIST= <CCCCCCCCCCCCCCC>
##$VD= 0
##$VDLIST= <DDDDDDDDDDDDDDD>
##$VPLIST= <PPPPPPPPPPPPPPP>
##$VTLIST= <TTTTTTTTTTTTTTT>
##$WBST= 1024
##$WBSW= 4
##$XGAIN= (0..3)
0 0 0 0 
##$XL= 0
##$YL= 0
##$YMAX_a= 68725
##$YMIN_a= -85374
##$ZGOPTNS= <>
##$ZL1= 120
##$ZL2= 120
##$ZL3= 120
##$ZL4= 120
##$ABSF1= 10
##$ABSF2= 0
##$ABSG= 5
##$ABSL= 3
##$ALPHA= 0
##$AQORDER= 0
##$ASSFAC= 0
##$ASSFACI= 0
##$ASSFACX= 0
##$ASSWID= 0
##$AUNMP= <proc_1d>
##$AZFE= 0.1
##$AZFW= 0.1
##$BCFW= 1
##$BC_mod= 2
##$BYTORDP= 1
##$COROFFS= 0
##$CY= 11.3945322036743
##$DATMOD= 1
##$DC= 2
##$DFILT= <>
##$DTYPP= 0
##$F1P= 18.9103706918063
##$F2P= -1.10871071338519
##$FCOR= 0.5
##$FTSIZE= 0
##$FT_mod= 4
##$GAMMA= 1
##$GB= 0.15
##$INTBC= 1
##$INTSCL= 1
##$ISEN= 128
##$LB= 0.24
##$LEV0= 0
##$LPBIN= 0
##$MAXI= 10000
##$MC2= 0
##$MEAN= 0
##$ME_mod= 0
##$MI= 1.114404
##$NCOEF= 0
##$NC_proc= 0
##$NLEV= 6
##$NOISF1= 3.799351
##$NOISF2= 2.8
##$NSP= 1
##$NTH_PI= 0
##$NZP= 0
##$OFFSET= 15.70392
##$PC= 1
##$PHC0= -8933.326
##$PHC1= 12.40026
##$PH_mod= 1
##$PKNL= yes
##$PPARMOD= 0
##$PSCAL= 0
##$PSIGN= 0
##$REVERSE= no
##$SF= 200.130013532006
##$SI= 16384
##$SIGF1= 3
##$SIGF2= 2
##$SINO= 400
##$SIOLD= 16384
##$SREGLST= <1H.CDCl3>
##$SSB= 0
##$STSI= 0
##$STSR= 0
##$SW_p= 3612.71676300578
##$SYMM= 0
##$S_DEV= 0
##$TDeff= 0
##$TDoff= 0
##$TI= <>
##$TILT= no
##$TM1= 0
##$TM2= 0
##$TOPLEV= 0
##$USERP1= <user>
##$USERP2= <user>
##$USERP3= <user>
##$USERP4= <user>
##$USERP5= <user>
##$WDW= 1
##$XDIM= 8192
##$YMAX_p= 0
##$YMIN_p= 0
$$ End of Bruker specific parameters
$$ ---------------------------------
##NTUPLES= NMR FID
##VAR_NAME=  TIME,          FID/REAL,        FID/IMAG
##SYMBOL=    X,             R,               I
##VAR_TYPE=  INDEPENDENT,   DEPENDENT,       DEPENDENT
##VAR_FORM=  AFFN,          ASDF,            ASDF
##VAR_DIM=   8192,          8192,            8192
##UNITS=     SECONDS,       ARBITRARY UNITS, ARBITRARY UNITS
##FACTOR=    0.0002004,     1,               1
##FIRST=     0,             0,               0
##LAST=      1.6414764,     0,               0
##MIN=       0,             -85374,          0
##MAX=       1.6414764,     68725,           0
$$ Real data points
##PAGE= N=1
##DATA TABLE= (X++(R..R)), XYDATA
$$ plain form
0 0 0 0 0 0 0 0 0 0 0 0 0 0 0 0 0 1 -8 8 -8 8 -8 8 -8 15 -16 16 -16 21 -24 24 -31 32 -37 40 -45 50 -55 61 -69
39 -69 77 -85 93 -101 112 -125 140 -156 174 -196 223 -253 294 -346 416 -508 649 -869 1258 -2077
59 -2077 4443 -23567 -85374 26514 30151 -51045 25819 66134 -41908 -40851 32427 -6711 -21253
72 -21253 34913 7086 -30397 8020 8579 -12515 18007 7941 -34233 -5270 23284 -2818 4283
85 4283 24206 -12549 -37872 -4849 21876 12056 1672 10389 2651 -34816 -24291 35846 22323
98 22323 -27002 10568 25478 -43486 -20386 54189 -640 -43680 26427 16981 -41420 15680
110 15680 40682 -32547 -19838 23646 -18602 -6379 46649 -4445 -33522 17785 -9502 -36833
122 -36833 40317 37483 -41333 -4078 30633 -38136 -21325 53611 6051 -39365 15962 16586 -30190
$$ packed form
0@%%%%%%%%%%%%%%%JrJ6j6J6j6J6j6K3l1L2l2L7m5M8n5O3o9P7q5R5j05J16j30
39f9J46j62J78j94K13k37K65k96L30l70M19m76N47o40P62r24J157j518K127l335
59b077O520k8010o1807J11888L637q1196P6864M0315j08042J057P3278l9138j4542
72b1253N6166k7827l7483L8417N59k1094L0522j0066m2174K8963K8554k6102P101
85D283J9923l6755k5323L3023K6725r820j0384Q717p738l7467J0525O0137j3523
98B2323m9325L7570J4910o8964K3100P4575n4829m3040P0107r446n8401N7100
110A5680K5002p3229J2709M3484m2248J2223N3028n1094k9077N1307k7287k7331
122c6833P7150k834p8816L7255L4711o8769J6811P4936m7560m5416N5327O24m6776
$$ plain form
135 -30190 447 29116 -8025 -19651 5337 8475 558 545 2481 -410 -13054 -9016 16322 12467
149 12467 -7988 867 519 -17235 -437 15720 -516 2614 5829 -18773 -5169 20672 -8526
162 -8526 -10309 25868 -6735 -32269 24651 21746 -35115 1871 32494 -27782 -19313 40954 1272
175 1272 -32913 17130 11341 -29011 7284 25727 -14317 -7840 12270 -11189 -5714 17361 -3225
188 -3225 -9022 11224 -4633 -13326 13972 7860 -14871 1635 9429 -9487 -3254 11952 1008
201 1008 -8885 -2528 4340 3618 -3537 -814 8150 -5309 -13515 11486 12216 -14966 -1374 15055
215 15055 -13160 -11506 20988 3374 -16658 8030 4511 -16481 6520 14484 -11200 -1720 9444
228 9444 -12897 -3075 18751 -5916 -12093 14178 -2112 -17688 14500 13565 -18165 -2245 13315
$$ packed form
135c0190L0637K8669l7141j1626K4988L138p917j3J936k891j2644M038K5338l855
149A2467k0455Q855l48j7754J6798J6157j6236L130L215k4602J3604K5841k9198
162h526j783L6177l2603k5534N6920k905n6861L6986L0623o0276Q469O0267l9682
175A272l4185N0043n789m0352L6295J8443m0044O477K0110k3459N475K3075k0586
188c225n797K0246j5857q693K7298o112k2731J6506P794j8916O233J5206j0944
201A008r893O357O868p22p155K723Q964j3459q206K5001P30k7182J3592J6429
215A5055k8215J654L2494j7614k0032K4688l519k0992K3001P964k5684R480J1164
228I444k2341R822K1826k4667o177K6271j6290j5576L2188r35l1730J5920J5560
$$ plain form
241 13315 -11179 -6152 18287 1384 -14002 1861 2927 -5560 4149 7501 -2205 -4357 -3332 -1311
255 -1311 4612 3088 -644 1212 -3504 -6442 3858 6185 -1200 192 -1255 -6716 1675 6351 -1347
270 -1347 1687 2358 -10336 -3173 11431 -526 -4576 9110 -3322 -15481 6997 11828 -7722
283 -7722 412 8544 -11329 -8163 12840 3126 -6423 5421 -506 -11001 3174 8080 -2765 1214
297 1214 2637 -8656 -3018 8062 1122 -1452 3757 -3969 -7599 3726 5904 -660 384 32 -4920
312 -4920 -2679 3289 4498 1820 -2462 -3471 -1176 -1065 1889 6725 614 -6938 -1599 1380 -2049
327 -2049 3909 6648 -4194 -5812 1601 -1154 -674 7537 1734 -7063 -1052 847 -3059 4616 6690
342 6690 -5053 -5015 2327 -1797 -776 7653 1425 -7096 -1218 1154 -2269 3613 6133 -2877 -5367
$$ packed form
241A3315k4494N027K4439j6903j5386J5863J066q487R709L352r706k152J025K021
255a311N923j524l732J856m716k938J0300K327p385J392j447n461Q391M676p698
270a347L034O71j2694P163J4604j1957m050J3686j2432j2159K2478M831j9550
283g722Q134Q132j9873L166K1003r714r549J1844n927j0495J4175M906j0845L979
297A214J423j1293N638J1080o940k574N209p726l630J1325K178o564J044l52m952
312d920K241N968J209k678m282j009K295J11K954M836o111p552N339K979l429
327b049N958K739j0842j618P413k755M80Q211n803q797O011J899l906P675K074
342F690j1743L8P342m124J021Q429o228q521N878K372l423N882K520r010k490
$$ plain form
357 -5367 -633 -430 1272 5244 1672 -3966 -3390 -1250 832 3747 3094 -824 -3345 -3283 -463 3197
373 3197 3436 1171 -1715 -4456 -2580 2917 3817 1433 232 -3193 -5102 688 4843 1960 716 -380
389 -380 -5227 -3609 3882 4148 930 693 -2925 -5823 350 5203 2332 544 -886 -4972 -3070 3503
405 3503 3945 1190 152 -3086 -4789 201 4382 3011 718 -1960 -4504 -2347 2722 4258 2130
420 2130 -1229 -3832 -3157 348 3412 3747 685 -3263 -3730 -1207 1723 4046 3030 -1963 -4485 -2168
436 -2168 631 3024 4142 331 -4259 -3212 -181 1610 3735 2769 -2478 -4265 -1452 723 2791
451 2791 3934 -18 -4222 -2977 -59 2052 3810 1792 -2878 -3584 -1147 934 3077 2996 -955 -3382
467 -3382 -2169 -274 2161 3587 779 -2755 -2792 -1196 1230 3571 1889 -1861 -2594 -1665 -131 2838
$$ packed form
357e367M734K03J702L972l572n638N76K140K082K915o53l918k521O2K820L660
373C197K39k265k886k741J876N497R00k384j201l425j909N790M155k883j244j096
389c80m847J618P491K66l218k37l618k898O173M853k871j788j430m086J902O573
405C503M42k755j038l238j703M990M181j371k293k678k544K157N069J536k128
420B130l359k603O75L505L064L35l062l948m67K523K930K323j016m993k522K317
436b168K799K393J118l811m590J047L031J791K125r66n247j787K813K175K068
451B791J143l952m204J245K918K111J758k018m670p06K437K081K143q1l951k427
467c382J213J895K435J426k808l534l7J596K426K341j682l750p33R29J534K969
$$ plain form
483 2838 2954 -772 -2312 -1610 -1273 1281 3731 945 -2277 -1844 -1354 6 3168 2314 -1602 -2067 -1138
500 -1138 -737 1950 2965 -476 -2001 -910 -1186 408 3153 1094 -2004 -1292 -812 -409 2330 2172 -1313
517 -1313 -1920 -808 -347 1612 2220 -507 -1520 -903 -1212 817 2870 234 -1591 -349 -1287 -958 2813
534 2813 1838 -1983 -901 48 -1227 1320 2566 -1423 -1902 485 -628 381 3106 -255 -2977 -111
550 -111 -260 -942 3349 2677 -3066 -2146 472 -1290 923 4041 -289 -3151 -213 6 -406 2142 1012
567 1012 -1954 -856 39 76 2235 1099 -2574 -1665 -49 -214 2691 3461 -1799 -3593 -1095 -753 1275
584 1275 4227 1147 -2302 -1627 -2212 -911 3625 2085 -1643 196 -724 -3180 2199 3985 -2925 -2486
600 -2486 2078 -1233 -509 5338 530 -5548 -1172 450 -1171 4079 4761 -2560 -3432 -1512 -2951 1719
$$ packed form
483B838J16l726j540P02L37K554K450k786l222M33M90J360L162q54l916m65R29
500a138M01K687J015l441j525J091k76J594K745k059l098P12M80M03K739j58l485
517a313o07J112M61J959O08k727j013O17l09K029K053k636j825J242r38L29L771
534B813r75l821J082R49j275K547J246l989m79K387j113J009K725l361k722K866
550a11j49o82M291o72n743R20K618j762K213L118m330k862K938K19m12K548j130
567A012k966J098Q95L7K159j136l673R09J616j65K905P70n260j794K498L42K028
584A275K952l080l449O75n85J301M536j540l728J839r20k456N379J786o910M39
600b486M564l311P24N847m808o078M376J622j621N250O82p321q72J920j439M670
$$ plain form
616 1719 6277 676 -2495 -147 -3010 -2685 4441 2979 -2788 -194 903 -2337 802 3340 -1276
631 -1276 -2837 -659 -150 2287 3589 -194 -2182 -2578 -3935 968 6576 2083 -1809 -98 -3688 -5025
647 -5025 3330 5193 -408 424 181 -4584 -1099 3581 16 -277 1442 -2753 -1026 4730 -65 -3492
663 -3492 1450 -1388 -4387 4765 6070 -3167 -1845 893 -5357 -2197 6927 3303 -1648 297 -2655
678 -2655 -4445 1702 3073 569 1850 -801 -3941 971 2114 -2105 875 2220 -3473 -1002 4611
693 4611 256 -2391 613 -1829 -2670 2842 3110 433 469 -2867 -3953 1709 1828 -478 3832 1390
709 1390 -6257 -1294 3872 -2074 -449 5293 -1625 -4835 2829 1675 -2925 1483 1173 -3247 879
724 879 2510 -1472 995 1177 -4358 -626 3963 -1361 -391 4520 -2370 -5423 2821 2130 -2748 2314
$$ packed form
616A719M558n601l171K348k863L25P126j462n767K594J097l240L139K538m616
631a276j561K178N09K437J302l783j988l96j357M903N608m493l892J711l590j337
647e025Q355J863n601Q32k43m765L485M680l565k93J719m195J727N756m795l427
663c492M942k838k999R152J305r237J322K738o250L160R124l624m951J945k952
678b655j790O147J371k504J281k651l140M912J143m219K980J345n693K471N613
693D611m355k647L004k442q41N512K68k677L6l336j086N662J19k306M310k442
709A390p647M963N166n946J625N742o918l210P664j154m600M408l10m420M126
724H79J631l982K467J82n535L732M589n324R70M911o890l053Q244o91m878N062
$$ plain form
740 2314 2663 -3781 -1365 2112 -884 180 1824 -1410 -357 1291 -1968 230 3241 -2363 -2472 3621
756 3621 -147 -3153 3221 1501 -4508 506 3007 -2224 -114 2682 -1782 -1148 1657 -1533 -140
771 -140 2986 -1842 -1820 3293 -1239 -3263 3957 1324 -4819 1655 3453 -3952 -766 4131 -1752 -2185
787 -2185 2883 -404 -2101 1881 63 -1408 1776 -466 -1984 2419 300 -3165 2159 2196 -3667 115
803 115 3270 -2478 -1346 3492 -758 -2480 1894 239 -1547 1515 57 -1403 1632 -307 -2241
818 -2241 2378 1055 -3374 1356 2570 -3559 -297 4167 -2103 -2827 3189 47 -2671 2448 1167
833 1167 -2777 612 784 -2037 1401 1822 -2108 553 1466 -3317 -293 3821 -1499 -1880 3307 -547
849 -547 -3423 2134 1431 -2801 788 2106 -1558 -69 1266 -1451 -333 800 -1330 861 2512 -1529
$$ packed form
740B314L49o444K416L477k996J064J644l234J053J648l259K198L011n604j09O093
756C621l768l006O374j720o009N014K501n231K110K796m464O34K805l190J393
771a40L126m828K2N113m532k024P220k633o143O474J798p405L186M897n883m33
787b185N068l287j697L982j818j471L184k242j518M403k119l465N324L7n863L782
803A15L155n748J132M838m250j722M374j655j786L062j458j460L035j939j934
818b241M619j323m429M730J214o129L262M464o270p24O016l142k718N119j281
833A167l944L389J72k821L438M21l930K661R13m783L024M114n320l81N187l854
849e47k876N557p03m232L589J318l664J489J335k717J118J133k130K191J651m041
$$ plain form
865 -1529 -1112 1603 -2012 -1901 3388 1118 -2092 1542 624 -3281 -54 1784 -936 841 1893 -1602
881 -1602 -638 1018 -2006 -547 2594 -772 -862 3156 -559 -3628 1250 944 -2651 1631 3340 -1749
897 -1749 -1021 1339 -2203 -1765 2286 824 -92 1778 -753 -2351 502 -282 -1376 2230 1916 -1440
913 -1440 335 638 -2844 -989 2116 44 95 2167 -250 -1869 -311 -895 -672 1856 1135 -90 998
930 998 -845 -2495 340 641 -1111 1687 2509 -1405 -1133 609 -1925 -1312 2292 984 -282 1597
946 1597 -357 -2666 -309 230 -672 1983 2035 -1376 -598 396 -2143 -849 2213 332 -392 1810 -158
963 -158 -2345 -50 354 -1070 854 1788 -105 -26 4 -1779 -1017 819 455 977 1545 -647 -1505 -226
981 -226 -765 -529 1697 1239 -382 126 -403 -1557 0 827 -263 512 1037 -534 -315 344 -1207 -781
$$ packed form
865a529M17K715l615J11N289k270l210L634r18l905L227J838k720J777J052l495
881a602R64J656l024J459L141l366r0M018l715l069M878l06l595M282J709n089
897a749P28K360l542M38M051j462r16J870k531j598K853p84j094L606l14l356
913a440J775L03l482J855L105k072N1K072k417j619J558n84K23K528p21j225J088
930I98j843j650K835L01j752K798Q22l914K72J742k534O13L604j308j266J879
946A597j954k309K357N39r02K655N2l411P78R94k539J294L062j881p24K202j968
963a58k187K295M04j424J924R34j893P9L0j783P62J836l64N22N68k192q58J279
981b26n39K36K226m58j621N08n29j154J557Q27j090P75N25j571K19O59j551M26
$$ plain form
999 -781 1198 328 -138 1365 -4 -1860 -264 220 -750 1056 1869 -609 -1016 49 -913 -511 1370
1016 1370 573 -448 452 -127 -1072 154 460 -436 273 554 -434 69 589 -571 -669 190 -47 254 963
1035 963 18 -725 -222 -401 -269 806 563 -177 150 -342 -988 278 834 -194 93 360 -805 -313 911
1054 911 -97 -601 515 -14 -719 570 579 -667 -45 336 -741 -111 1008 2 -455 193 -395 -546
1072 -546 728 512 -465 -13 63 -563 58 608 -31 -118 105 -372 -283 343 286 54 -61 -373 -168 274 91
1093 91 77 191 -356 -267 424 -6 -277 440 41 -719 197 507 -346 163 487 -776 -464 827 74 -370
1113 -370 588 -96 -933 368 580 -573 184 725 -673 -547 640 -31 -380 603 65 -807 180 556 -315
1132 -315 -124 318 -259 -258 329 149 -183 20 71 -169 -186 152 341 -38 -259 58 -67 -271 409 383 -561 -116
$$ packed form
999g81J979q70m66J503j369j856J596M84r70J806Q13k478m07J065r62M02J881
1016A370p97j021R00n79r45J226L06q96P09K81r88N03N20j160r8Q59k37L01P09
1035I63r45p43N03j79J32J075k43p40L27m92o46J266N56j028K87K67j165M92J224
1054I11j008n04J116n29p05J289Rj246O22L81j077O30J119j006m57O48n88j51
1072e46J274k16r77M52P6o26O21N50o39q7K23m77Q9O26n7k32j15l12K05M42j83
1093I1j4J14n47Q9O91m30k71P17l99p60R16L10q53N09L24j263L12J291p53m44
1113c70R58o84q37J301K12j153P57N41j398J26J187o71l49R83n38q72R87L76q71
1132c15J91M42n77JN87j80l32K03N1k40j7L38J89l79k21L17j25k04O80k6r44M45
$$ plain form
1154 -116 534 -380 -336 762 -25 -714 538 266 -895 369 882 -784 -374 863 -388 -547 991 35
1172 35 -1037 513 561 -863 126 855 -584 -391 707 -233 -564 689 298 -718 7 401 -284 -90
1190 -90 402 -59 -384 100 291 -179 -234 346 195 -539 -33 547 -331 -295 746 -191 -930 697 599 -1020
1210 -1020 152 980 -950 -465 1312 -409 -1057 1243 317 -1534 605 1090 -1254 -62 1371 -947
1226 -947 -824 1482 -53 -1306 861 566 -1227 279 999 -841 -345 964 -339 -795 633 394 -532
1243 -532 45 346 -321 -319 368 319 -404 -229 588 -41 -792 435 623 -900 -58 1100 -769 -781 1459 -70
1263 -70 -1573 1043 871 -1686 407 1595 -1590 -676 2043 -752 -1570 1908 387 -2116 1031 1247
1279 1247 -2009 145 2040 -1363 -1096 1885 -250 -1536 1301 610 -1566 438 1111 -1066 -328 1124
$$ packed form
1154a16O50r14M4J098p87o89J252k72j161J264N13j666M10J237j251j59J538r56
1172C5j072J550M8j424R89P29j439J93J098r40l31J253l91j016P25L94o85J94
1190i0M92m61l25M84J91m70n5N80j51p34N06N80q78L6J041r37p39J627r8j619
1210a020J172Q28j930M85J777j721o48K300r26j851K139M85k344J192J433k318
1226i47J23K306j535j253K167k95j793J506P20j840M96J309j303m56J428k39r26
1243e32N77L01o67KO87m9p23J75Q17o29p51J227J88j523Q42J158j869j2K240j529
1263g0j503K616j72k557K093J188l185R14K719k795q18L478j521k503L147K16
1279A247l256K154J895l403K67K981k135j286K837o91k176K004O73k177P38J452
$$ plain form
1295 1124 -260 -691 500 187 -459 88 385 -106 -444 112 558 -336 -551 765 152 -1090 580 937
1313 937 -1350 -83 1674 -1162 -1259 2060 22 -2057 1511 1041 -2560 507 2304 -2029 -873 2713
1329 2713 -953 -2125 2240 397 -2501 1457 1587 -2468 100 2260 -1588 -1043 2137 -540 -1599
1344 -1599 1711 507 -1822 602 1091 -1261 -207 1215 -322 -593 538 54 -553 -40 494 286 -539
1361 -539 -251 742 -256 -897 972 503 -1465 471 1302 -1615 -440 2111 -939 -1559 2067 40 -2289
1378 -2289 1661 1258 -2728 529 2446 -2184 -882 2807 -1233 -2141 2675 378 -2763 1666 1624 -2825
1394 -2825 20 2400 -1537 -818 2355 -667 -1883 1416 415 -1516 815 1034 -1003 -61 637 -718
1410 -718 -325 569 78 27 146 -9 155 -465 -630 615 178 -520 1155 519 -1816 77 1149 -1623
$$ packed form
1295A124j384m31J191l13o46N47K97m91l38N56M46q94k15J316o13j242J670L57
1313I37k287J267J757k836r7L319k038k079L568m70l601L067J797m333J156L586
1329B713l666j172M365j843k898L958J30m055K568K160l848N45L180k677j059
1344a599L310j204k329K424M89k352J054J422j537k71J131m84o07N13N34k08q25
1361e39K88R93r98o41J869m69j968J936Q31k917J175K551l050o20L626k027k329
1378b289L950m03l986L257J917m630J302L689m040r08M816k297l141M429m2m449
1394b825K845K380l937P19L173l022j216L299j001j931K331K19k037R42O98j355
1410g18L93Q94m91n1J19j55J64o20j65J245m37o98J675o36k335J893J072k772
$$ plain form
1428 -1623 -137 2640 -731 -1632 1926 -456 -2847 1774 1854 -2308 699 2466 -2454 -1403 2387 -1180
1444 -1180 -1746 3012 760 -2422 1218 772 -3013 165 2321 -1121 30 2442 -1177 -2239 929
1459 929 -45 -1103 1666 1438 -968 -223 64 -1283 -487 715 652 777 292 -406 -241 -926 -1061 844
1477 844 852 -174 1336 760 -2215 -913 825 -1187 173 2964 -80 -1584 1153 -940 -2940 1537
1493 1537 2095 -1345 1156 2074 -2781 -1716 1882 -1194 -1254 3326 1067 -2145 894 152 -3229 53
1509 53 2390 -486 455 2252 -1245 -2318 223 -427 -575 2119 1543 -637 -232 -633 -1666 -284 808
1526 808 686 1190 654 -694 -698 -1000 -1086 757 1123 146 1221 665 -2065 -1125 456 -1052 337 2954
1544 2954 204 -1522 742 -914 -2751 1144 2033 -812 1039 1772 -2393 -1774 1345 -779 -832 2725
$$ packed form
1428a623J486K777l371r01L558k382k391M621Q0m162L007J767m920J051L790l567
1444a180n66M758k252l182L640m46l785L178K156l442J151K412l619j062L168
1459I29r74j058K769k28k406P45K87j347P96J202o3J25m85o98J65o85j35J905
1477H44Qj026J510n76k975J302J738k012J360K791l044j504K737k093k000M477
1493A537N58l440K501R18m855J065L598l076o0M580k259l212L039p42l381L282
1509E3K337k876R41J797l497j073K541o50j48K694n76k180M05m01j033J382J092
1526H08j22N04n36j348ml02q6J843L66r77J075n56k730R40J581j508J389K617
1544B954k750j726K264j656j837L895Q89k845J851P33m165O19L119k124n3L557
$$ plain form
1560 2725 839 -1650 728 -26 -2676 120 1883 -431 532 1829 -1158 -1764 316 -548 -597 1802
1576 1802 1237 -502 -71 -582 -1439 -11 715 340 967 521 -731 -378 -473 -966 560 1090 -147 529
1594 529 707 -1302 -833 595 -686 -155 1978 283 -1171 568 -353 -1840 766 1406 -824 494
1610 494 1343 -1561 -1149 1173 -450 -699 1734 332 -1385 646 350 -1577 223 1133 -675 168 1160
1627 1160 -802 -828 670 -360 -549 1041 341 -551 372 -161 -951 349 514 -297 420 293 -737 40
1645 40 350 -603 175 727 -496 -122 658 -573 -410 872 -289 -667 898 127 -891 568 304 -1029
1663 -1029 421 864 -886 -112 876 -736 -444 1048 -250 -663 888 -56 -1079 561 499 -737 401
1680 401 580 -923 -110 731 -565 -217 869 -256 -460 602 -235 -655 586 191 -536 476 326 -621
$$ packed form
1560B725j886k489K378p54k650K796J763k314R63J297k987o06K080q64m9K399
1576A802n65j739M31n11q57J428P26l75O27m46j252L53r5m93J526N30j237O76
1594E29J78k009M69J428j281N31K133j695j454J739r21j487K606O40k230J318
1610D94Q49k904M12K322j623k49K433j402j717K031k96j927J800R10j808Q43R92
1627A160j962k6J498j030j89J590p00q92R23n33p90J300J65q11P17j27j030P77
1645D0L10r53P78N52j223L74P80j231J63J282j161l78J565p71j018J459k64j333
1663a029J450M43j750P74R88j612K92J492j298m13J551r44j023J640o2j236J138
1680D01J79j503Q13Q41j296L48J086j125k04J062q37m20J241l95p27J012j50r47
$$ plain form
1698 -621 139 245 -655 165 698 -316 -54 466 -567 -343 597 -199 -244 776 -31 -655 352 -9 -635
1717 -635 538 473 -629 246 516 -729 -156 600 -494 -153 897 -241 -609 592 -120 -755 546 345
1735 345 -614 426 457 -872 -106 614 -469 -115 760 -303 -445 563 -181 -628 483 236 -432 342
1753 342 230 -588 120 344 -450 41 474 -263 -77 333 -390 -205 484 -143 -237 443 -126 -366 415 -43
1773 -43 -488 466 215 -562 247 328 -603 135 570 -578 -146 728 -354 -456 642 -114 -569 625 155
1792 155 -770 328 459 -648 72 577 -494 -147 594 -373 -401 576 -11 -404 381 40 -454 284 174
1811 174 -418 177 288 -286 66 175 -343 68 300 -310 10 371 -276 -116 361 -341 -252 579 -70 -425
1831 -425 461 31 -597 375 272 -607 262 572 -575 -153 547 -405 -281 665 -163 -482 545 60 -626
$$ packed form
1698f21P60J06r00Q20N33j014K62N20j033K24R40p96m5J020q07o24J007l61o26
1717f35J173o5j102Q75K70j245N73P56j094L41J050j138l68J201p12o35J301k01
1735C45r59J040L1j329P66P20j083L54Q75j063j42J008p44m47J111k47o68P74
1753C42j12q18P08K24p94M91M33p37J86M10p23J85O89o27r4O80n69k40P81m58
1773d3m45R54k51p77Q09Q1r31P38M35j148M32Q74j082j02J098p56m55J194m70
1792A55r25J098J31j107P20N05j071L47P41r67k8R77n87l93P85l41m94P38j10
1811A74n92N95J11n74L52J09n18M11K32o10L20L61o47J60M77p02Q9Q31o49l55
1831d25Q86m30o28R72j03q79Q69L10j147M22P00r52J24R46q28l19J027m85o86
$$ plain form
1850 -626 295 262 -481 226 390 -488 -26 406 -345 -139 389 -193 -115 391 -235 -303 373 -80 -288 388 -21
1871 -21 -378 401 83 -543 295 334 -501 157 439 -550 -48 650 -413 -346 670 -120 -483 576 71 -627
1891 -627 439 342 -670 141 517 -475 -69 495 -389 -229 544 -144 -330 407 -38 -321 326 -1 -311 334
1911 334 97 -380 228 98 -364 298 199 -540 185 412 -554 19 554 -518 -208 736 -378 -542 799
1930 799 1 -763 592 298 -871 381 656 -877 -71 883 -535 -407 862 -240 -645 743 111
1947 111 -781 476 453 -677 124 463 -487 -12 537 -343 -208 399 -165 -154 333 -145 -127 348 -209 -208 390
1968 390 -159 -239 500 -189 -536 590 129 -712 467 380 -856 253 741 -858 -99 1056 -627 -649 1038
1987 1038 -183 -894 963 254 -1206 528 764 -1060 69 1036 -768 -396 1044 -424 -734 939
$$ packed form
1850f26R21l3p43P07J64q78M62M32p51K06N28n82P8N06o26o8O76m53k08O76m09
1871b1l57P79l18o26Q38L9q35O58K82r89N02O98j063O7J016p90l63J059n05o98
1891f27J066r7j012Q11L76r92M06N64q84J60P73o88j86P37m45k83O47l27l10O45
1911C34k37m77O08j30m62O62r9p39P25K27r66N73N35j072L10R44j114j64J341
1930G99p98p64J355k94j169J252K75j533Q06R54j418J28J269j102m05J388o32
1947A11q92J257k3j130Q01L39r50M75N49q80J35O07n64J1M87m78J8M75n57JN98
1968C90n49q0P39o89l47J126m61q41J179q7j236J109M88j599P59J155j683k2J687
1987A038j221p11J857p09j460J734K36j824J129R67j804L72J440j468l10J673
$$ plain form
2003 939 78 -860 573 363 -749 290 479 -671 -5 573 -310 -51 409 -331 -166 327 -252 -20 508
2022 508 -221 -179 358 -459 -281 780 -122 -520 717 -56 -911 615 367 -1026 452 866 -1044 -85
2040 -85 1109 -826 -654 1197 -376 -930 1294 298 -1377 531 556 -1298 326 1293 -830 -294 1074
2057 1074 -789 -917 1057 130 -665 858 234 -1046 255 440 -678 174 641 -363 60 438 -517
2074 -517 -230 306 -336 81 668 -182 -67 351 -760 -506 822 23 -189 989 -222 -1211 515 223
2092 223 -995 807 1076 -1110 -112 945 -1146 -578 1476 -351 -939 1368 206 -1440 662 468
2108 468 -1512 398 1446 -787 -170 1138 -963 -1103 990 76 -511 1203 328 -1234 -17 261 -702
2125 -702 409 867 -335 -37 309 -620 -249 368 -208 165 604 -291 -61 422 -698 -466 689 -186 -116
$$ packed form
2003I39q61r38J433k10j112J039J89j150O66N78q83K59M60p40J65M93n79K32N28
2022E08p29M2N37q17J78J061r02l98J237p73q55J526k48j393J478M14j910R59
2040h5J194j935J72J851j573n54K224r96j675J908K5j854J624R67k123N36J368
2057A074j863j28J974r27p95J523o24j280J301J85j118Q52M67j004M23L78r55
2074e17K87N36o42M17N87q50J15M18j111K54J328p99k12J178j211r89J726k92
2092B23j218J802K69k186R98J057k091N68K054j827n88K307j162j646K102j94
2108D68j980J910J048k233O17J308k101j40K093r14n87J714q75j562J217K78r63
2125g02J111M58j202K98L46r29L71O17n76L73M39q95K30M83j120K32J155q75P0
$$ plain form
2144 -116 1180 -164 -1195 455 18 -1098 955 1154 -1054 35 856 -1436 -602 1595 -248 -796
2160 -796 1360 -80 -1557 797 595 -1423 438 1270 -1012 -184 1224 -848 -907 1060 -142 -764 1122
2177 1122 463 -1035 138 222 -843 294 904 -290 -87 310 -560 -262 384 -91 149 465 -371 -183
2195 -183 359 -423 -155 685 -352 -385 902 -102 -815 655 93 -1039 671 792 -1016 196 979 -1140
2213 -1140 -487 1289 -427 -724 1310 -121 -1408 842 583 -1253 463 1041 -1130 -236 1127 -713
2229 -713 -615 1143 -158 -906 743 194 -830 484 436 -769 145 557 -507 -45 491 -352 -111 427
2247 427 -272 -147 424 -187 -146 386 -269 -190 545 -209 -392 598 -100 -613 619 186 -813 506 560 -991
2267 -991 30 894 -702 -267 1060 -497 -808 952 18 -954 755 449 -1090 264 724 -899 24
$$ packed form
2144a16J296j344j031J650m37j116K053J99k208J089Q21k292Q34K197j843n48
2160g96K156j440j477K354k02k018J861Q32k282Q28J408k072n9J967j202o22J886
2177A122o59j498J173Q4j065J137O10j194K03L97q70K98O46m75K40L16q36J88
2195a83N42p82K68Q40j037l3J287j004p13J470n62j132J710J21j808J212P83k119
2213a140O53J776j716k97K034j431j287K250k59j836J716N78k171Q94J363j840
2229g13R8J758j301p48J649n49j024J314m8j205R14M12j064M62N36q43K41N38
2247D27o99J25N71o11M1N32o55P9P35p54j83R90o98n13J232m33r99J319N4j551
2267i91J021Q64j596M35J327j557l11J760r34r72J709l06j539J354M60j623R23
$$ plain form
2284 24 1037 -667 -584 836 -227 -607 858 130 -867 358 349 -665 247 569 -486 -105 372 -377 -34
2303 -34 508 -245 -237 286 -217 -42 564 -169 -403 300 -160 -308 673 224 -506 209 -40 -770 397 763 -395
2324 -395 30 416 -837 -336 902 -163 -424 782 -100 -871 551 338 -846 262 568 -722 47
2341 47 921 -439 -547 395 -431 -446 970 427 -506 140 -203 -896 239 746 -51 255 276 -785 -474 386
2361 386 -5 113 550 -196 -368 281 -83 -312 268 -69 -274 548 344 -299 148 -149 -863 102 745 85
2381 85 363 414 -952 -810 420 121 144 966 36 -919 -33 -18 -548 532 735 -438 -91 407 -499 -271
2401 -271 478 -353 -414 699 357 -225 280 -232 -952 -27 512 134 559 477 -680 -686 -92 -157 373 918 64
2422 64 -410 -100 -401 -331 495 255 -169 324 96 -430 107 152 -501 -16 404 -71 268 539 -471 -658 50
$$ packed form
2284B4J013j704Q3J420j063l80J465p28r97J225rj014R12L22j055L81M77p49L43
2303c4N42p53QN23n03J75O06p33k34P03m60j48R81m49p30P15k49p30J167L66j158
2324c95M25L86j253N01J238j065k61J206q82p71J422k13j184J108L06j290P69
2341D7Q74j360j08R42q26j5J416n43r33O46l43o93J135N07p97L06K1j061L11Q60
2361C86l91J18M37p46j72O49l64k29N80l37k05Q22k04o43M47k97p14R65O43o60
2381H5K78N1j366J42J230k99K3Q22r30r55Q86J5n30J080K03j173L47M98r06K28
2401b71P49q31o1J113l42n82N05n12p20R25N39l78M25q2j157oN94o5N30N45q54
2422F4m74L10l01P0Q26k40m24M93k28n26N37M5o53M85M20m75L39K71j010j87P08
$$ plain form
2443 50 -116 83 912 284 -567 -155 -268 -576 385 743 -47 3 99 -627 -300 448 29 -105 364 -55 -281
2464 -281 246 -50 -433 89 122 -167 351 346 -315 -166 -47 -451 82 660 93 -95 93 -444 -403 384 217
2485 217 -82 374 43 -521 37 186 -267 186 405 -295 -116 367 -176 -255 291 -84 -263 378 174 -292
2505 -292 78 80 -337 24 268 -108 51 214 -249 -208 133 -57 4 249 -57 -178 119 -101 -173 207 57 -113
2527 -113 157 -56 -336 145 182 -220 108 176 -335 -41 315 -195 -92 381 -164 -364 288 71 -260 310 152
2548 152 -483 34 363 -219 -14 318 -266 -268 335 49 -172 274 31 -425 4 208 -39 170 176 -309 -246 97
2570 97 81 152 187 -114 -203 -93 -77 116 247 -41 -126 -45 -221 8 395 17 -245 34 -127 -211 397 267 -378
2593 -378 -70 101 -358 104 622 -111 -333 131 -262 -329 586 401 -380 -45 14 -442 137 613 -77 -231 124
$$ packed form
2443E0j66J99Q29o28q51M12j13l08R61L58p90N0R6p26L27P48m19j34M69m19k26
2464b81N27k96l83N22L3k89N18no61J49J19m04N33N78n67j88J88n37M1P87j67
2485B17k99M56l31n64N58J49m53M53K19p00J79M83n43p9N46l75j79O41k04m66
2505b92L70Km17L61K44l76J59J63m63M1L41j90O1K45l06j21K97k20p2L80j50j70
2527a13K70k13k80M81L7m02L28O8n11K94L56n10J03M73n45k00O52k17l31N70j58
2548A52o35N17L29n82K05L32n84kO03k86k21M46k43m56M29K04k47K09Om85O3L43
2570I7j6P1L5l01q9J10J6J93J31k88q5Q1j76K29L87l78k62K79j61q4O08j30o45
2593c78L08J71m59M62N18p33k22M64l93o7R15j85p81L35N9m56N79M76o90j54L55
$$ plain form
2614 124 -241 -241 451 267 -213 -36 -112 -286 202 428 -1 -150 -163 -229 65 317 173 17 -197 -350 -36 204
2636 204 126 233 54 -496 -270 265 99 109 321 -315 -574 207 269 -120 313 143 -653 -194 420 -55 67
2657 67 480 -361 -644 273 268 -115 380 108 -709 -167 436 14 101 380 -330 -513 178 207 55 321 17 -479
2679 -479 -191 174 197 280 67 -294 -249 -56 122 365 141 -246 -150 -142 -195 363 449 -231 -245 -10 -345 29 708
2702 708 31 -468 71 -137 -401 487 515 -460 -155 176 -472 -48 798 7 -490 140 -142 -416 527 530 -435
2723 -435 -223 111 -348 15 618 35 -331 -15 -155 -187 365 330 -113 -163 -203 -160 207 305 78 -70 -241 -224
2745 -224 171 190 46 165 -129 -452 74 310 -84 174 234 -558 -333 507 49 -203 432 -107 -738 240 479
2766 479 -347 105 428 -578 -392 544 23 -230 427 -104 -657 220 384 -232 141 268 -496 -201 434 -32
$$ packed form
2614A24l65%O92j84m80J77p6j74M88K26m29j49j3o6K94K52j44j56k14j53L14K40
2636B04p8J07j79n50K26N35j66J0K12o36k59P81O2l89M33j70p96M59O14m75J22
2657F7M13q41k83R17nl83M95k72q17N42O03m22Q7K79p10j83O91K9j52K66l04m96
2679d79K88L65K3Q3k13l61M5J93J78K43k24l87R6Qn3N58Q6o80j4K35l35L74O79
2702G08o77m99N39k08k64Q88K8r75L05L31o48M24Q46p91m97O30k82k74R43Lr65
2723d35K12L34m59L63O03n83l66L16j40l2N52l5m43n0m0M3L67R8k27j48j71J7
2745b24L95J9j44J19k94l23N26K36l94K58O0p92K25Q40m58k52O35n39o31R78K39
2766D79q26M52L23j006J86R36n21k53O57n31n53Q77J64o16L73J27p64K95O35m66
$$ plain form
2786 -32 -114 318 -99 -402 115 215 -43 100 37 -207 -79 62 118 153 -115 -174 118 -38 -138 302 143 -381
2808 -381 41 231 -314 43 483 -243 -298 340 -100 -301 448 62 -503 255 264 -517 103 458 -451 -163 571
2829 571 -274 -440 541 73 -566 282 319 -479 -2 348 -304 -122 373 -78 -227 144 -61 -87 240 -17 -156
2850 -156 119 -56 -136 215 84 -182 69 -4 -173 171 178 -119 22 -85 -308 249 375 -235 9 216 -508
2871 -508 -211 678 34 -356 406 -41 -748 247 564 -328 -19 345 -465 -234 557 -6 -295 227 -168 -351
2891 -351 464 294 -339 63 -18 -614 97 709 30 -125 87 -481 -439 403 434 82 52 -231 -360 23 111 157
2913 157 367 -139 -398 200 164 -201 252 112 -623 -61 621 83 0 185 -579 -586 360 362 185 519 -220 -908
2935 -908 -111 210 -56 633 585 -694 -534 295 -184 -125 666 15 -586 193 295 -244 95 60 -506 -103 382
$$ packed form
2786c2q2M32m17l03N17J00k58J43o3k44J28J41N6L5k68n9K92j56j00M40j59n24
2808c81M22J90n45L57M40p26n5O38m40k01P49l86n65P58Rp81O20L55r09K88P34
2829E71q45j66R81m68o39Q48L7p98M77L50o52J82M95m51j49L71k05k6L27k57j39
2850a56K75j75q0L51j31k66K51p3j69L44Pk97J41j07k23N57J26o10K44K07p24
2871e08K97Q89o44l90P62m47p07R95L17q92L09L64q10K31P91n63k89N22l95j83
2891c51Q15j70o33M02q1n96P11O12o79j55K12n68M2Q42L1l52l0k83j29L83Q8M6
2913A57K10n06k59N98l6l65M53j40p35N62O82n38q3J85p64pR46Kj77L34p39o88
2935i08P97L21k66O89m8j279J60Q29m79N9P91o51o01P79J02n39L39l5n66M03M85
$$ plain form
2956 382 224 337 105 -714 -560 127 164 502 742 -205 -805 -275 -109 14 677 476 -244 -225 -235 -300 258
2977 258 319 -204 48 200 -238 151 451 -511 -587 315 120 24 784 215 -890 -433 -5 -188 562 896 -132
2998 -132 -495 -290 -531 -44 748 250 -152 172 -264 -535 281 241 -369 91 330 -197 87 374 -321 -487
3018 -487 -44 -3 292 645 91 -360 -300 -498 -170 680 474 -42 142 -267 -750 40 516 -6 149 311 -347
3039 -347 -269 275 -123 -234 239 -15 -81 456 84 -456 -14 -68 -433 350 680 -155 -157 89 -556 -362 561 305
3061 305 -93 206 -111 -491 8 148 -101 208 162 -230 39 126 -300 -42 212 -205 -20 438 -16 -260 69
3082 69 -153 -255 319 259 -112 111 -34 -357 66 173 -157 200 272 -336 -106 311 -208 -191 387 -29 -290
3103 -290 349 132 -409 89 208 -236 100 322 -224 -114 196 -206 -81 351 -43 -199 178 -83 -274 268
$$ packed form
2956C82j58J13k32q19J54O87L7L38K40r47o00N30J66J23O63k01p20J9j0o5N58
2977B58O1n23K52J52m38L89L00r62p6R02j95r6P60n69j105M57M28j83P50L34j028
2998a32l63K05k41M87P92m98m02L24m36k71Q16m0o10M60K39n27K84K87o95j66
3018d87M43M1K95L53n54m51O0j98L28Q50k06n16J84m09m83P90M76n22J55J62o58
3039c47P8N44l98j11M73k54o6N37l72n40M42n4l65P83L30q35kK46o45J94R23k56
3061C05l98K99l17l80M99J40k49L09m6l92K69Q7m26K58K54m17J85M58m54k44L29
3082F9k22j02N74o0l71K23j45l23M23J07l30L57P2o08K30M17n19J7N78m16k61
3103b90O39k17n41M98J19m44L36K22n46J10L10m02J25M32l94j56L77k61j91N42
$$ plain form
3123 268 179 -282 15 129 -233 37 236 -126 -98 108 -107 -25 192 -84 -95 102 -144 -72 329 10 -263 89
3145 89 -20 -242 299 322 -269 -71 102 -283 -8 422 -11 -124 155 -236 -267 337 147 -219 178 35 -370
3166 -370 159 343 -261 -118 233 -197 -113 399 44 -273 34 -82 -210 233 289 -72 -39 -133 -306 83 295
3187 295 19 45 41 -293 -122 216 34 -6 161 -141 -213 153 77 -48 119 -107 -262 171 207 -97 111 34 -404
3210 -404 -44 366 -10 2 277 -237 -393 212 177 -60 250 83 -407 -53 232 -51 91 207 -257 -176 215
3231 215 -10 -58 234 -56 -321 86 140 -53 164 69 -311 -124 135 46 107 116 -199 -167 41 -45 81 258 -91
3254 -91 -218 46 -63 -63 307 83 -288 -35 40 -124 171 227 -200 -118 90 -139 16 315 -42 -186 98 -76
3276 -76 -147 290 191 -263 -47 79 -160 92 296 -101 -173 62 -104 -47 255 71 -135 3 -115 -157 197 171
$$ packed form
3123B68q9m61K97J14l62K70J99l62K8K06k15Q2K17k76j1J97k46P2M01l19k73L52
3145H9j09k22N41K3n91J98J73l85K75M30m33j13K79l91l1O04j90l66L97j43m05
3166c70N29J84o04J43L51m30Q4N12l55l17L07j16j28M43N6l61L3r4j73L89K12
3187B95k76K6ml34J71L38j82m0J67l02p2L66p6j25J67k26j55M33L6l04K08p7m38
3210d04L60M10l76J2K75n14j56O05l5k37L10j67m90L54K85k83J42J16m64Q1L91
3231B15k25m8K92k90k65M07N4j93K17r5l80J87K59q9O1Rl15L2K08q6J26J77l49
3254i1j27K64j09%L70k24l71K53P5j64K95N6m27Q2K08k29J55K99l57j44K84j74
3276g6p1M37r9m54K16J26k39K52K04l97p2K35j66N7L02j84k06J38j18m2L54k6
$$ plain form
3298 171 -122 -12 -36 -212 70 228 -76 -58 59 -169 -76 198 16 -56 92 -128 -181 206 129 -128 72 -24
3320 -24 -268 64 271 -88 -32 138 -198 -156 219 72 -55 138 -51 -245 86 152 -46 96 46 -204 7 187
3342 187 -40 -16 124 -128 -113 148 47 -30 115 -50 -186 41 67 -10 134 -15 -231 18 90 -93 92 136
3364 136 -198 -96 146 -78 -47 213 -46 -227 81 36 -120 155 89 -246 -9 143 -124 28 213 -145 -163
3385 -163 166 -34 -125 215 71 -224 40 102 -105 78 140 -140 -72 95 -30 9 127 -59 -77 74 -42 -30
3407 -30 145 -2 -94 57 -32 -69 143 54 -137 43 43 -135 85 126 -150 -22 131 -156 -75 207 -69 -156 160
3430 160 -44 -204 168 118 -221 9 141 -190 -8 215 -132 -120 185 -45 -159 162 53 -164 90 77 -150
3451 -150 54 160 -97 -25 93 -53 -22 122 -32 -49 88 -25 -39 85 -17 -54 88 -27 -89 84 21 -86
$$ packed form
3298A71k93J10k4j76K82J58l04J8J17k28R3K74j82p2J48k20n3L87p7k57K00r6
3320b4k44L32K07l59N6J70l36M2L75j47j27J93j89j94L31O6j98J42n0k50K11J80
3342A87k27K4J40k52J5K61j01p7J45j65j36K27K6p7J44j49k16K49P2j83J85M4
3364A36l34J02K42k24L1K60k59j81L08m5j56K75o6l35K37J52k67J52J85l58j8
3385a63L29k00r1L40j44k95K64O2k07J83O2k80O8J67j25L9J18j86j8J51j16J2
3407c0J75j47r2J51q9l7K12q9j91J80%j78K20M1k76J28J53k87Q1K82k76q7L16
3430A60k04j60L72n0l39K30J32l31J82K23l47J2L05k30j14L21j09k17K54j3k27
3451a50K04J06k57P2J18j46L1J44j54j7J37j13j4J24j02l7J42j15o2J73o3j07
$$ plain form
3473 -86 89 18 -131 92 91 -172 28 141 -150 -33 187 -125 -150 211 -15 -227 163 117 -223 58 146 -206
3495 -206 -35 204 -113 -98 178 -44 -124 134 4 -146 133 96 -150 42 103 -139 -20 128 -60 -17 127 -7
3517 -7 -73 26 -19 12 67 -36 8 83 -77 -67 108 -35 -107 181 55 -168 67 89 -191 -11 168 -97 -8 180
3541 180 -124 -159 148 -38 -131 204 52 -211 111 89 -268 -1 228 -135 -62 236 -71 -202 121 22 -172 100
3563 100 154 -70 -2 23 -127 -16 75 -36 85 106 -87 -29 47 -105 -13 164 26 -24 65 -36 -74 49 -27 -21 152
3588 152 28 -97 98 -24 -207 103 166 -175 49 247 -161 -203 169 -29 -165 227 121 -194 26 70 -189
3609 -189 -13 143 -68 39 145 -135 -119 116 -53 -121 179 56 -144 69 57 -183 -34 117 -19 10 87 -23
3631 -23 -50 -30 -93 42 90 -31 69 109 -145 -105 158 -25 -103 172 73 -150 55 44 -160 44 147 -88 24
$$ packed form
3473h6J75p1j49K23jk63K00J13k91J17K20l12k5L61k26k12L90m6l40K81Q8l52
3495b06J71K39l17J5K76k22q0K58j30j50K79l7k46J92O1k42J19J48j88M3J44j34
3517go6R9m5L1N5j03M4P5j60J0J75j43p2K88j26k23K35K2k80J80J79k65Q9J88
3541A80l04l5L07j86r3L35j52k63L22k2l57K67K29l63P3K98l07j31L23r9j94K72
3563A00N4k24O8K5j50J11R1j11J21K1j93N8P6j52R2J77j38n0Q9j01l8J23p6OJ73
3588A52j24j25J95j22j83L10O3l41K24J98m08m2L72j98j36L92j06l15K20M4k59
3609a89J76J56k11J07J06k80J6K35j69o8L00j23k00K13j2k40J49J51j36K9P7j10
3631b3k7K0o3J35M8j21J00M0k54M0K63j83p8K75r9k23K05j1k04K04J03k35J12
$$ plain form
3654 24 126 -115 -51 147 -124 -103 225 -14 -190 145 51 -249 43 172 -142 -28 193 -72 -155 62 -7 -55
3676 -55 92 0 -60 45 -37 -78 82 8 -106 81 63 -137 28 123 -88 -34 90 -59 -16 102 -53 -51 74 -51
3700 -51 -33 146 -23 -113 131 21 -186 104 162 -157 -15 148 -130 -93 192 -1 -124 95 -1 -100 84 49 -89
3723 -89 72 42 -139 19 80 -114 6 113 -129 -83 138 -36 -108 71 -2 -103 50 26 -68 46 9 -105 43
3746 43 32 -85 92 80 -172 -26 146 -70 -41 173 -42 -165 108 51 -114 92 85 -136 -2 62 -75 51 118
3769 118 -109 -52 90 -76 -35 153 -15 -123 80 1 -126 69 101 -98 -30 27 -66 29 84 -81 -44 16 -77 24
3793 24 145 -69 -110 49 -86 -117 164 114 -121 13 0 -185 16 181 -20 -18 63 -129 -60 123 -13 -49 118
3816 118 -35 -107 124 74 -135 10 40 -135 44 212 -4 -74 -10 -125 -63 144 109 19 41 -125 -165 38 58 22
$$ packed form
3654B4J02k41O4J98k71K1L28k39j76L35r4l00K92J29l14J14K21k65q3K17o9m8
3676e5J47r2o0J05q2m1J60p4j14J87j8k00J65R5k11N4J24j49M3J18j55KJ25j25
3700e1J8J79j69r0K44j10k07K90N8l19J42J63k78L7K85j93j23K19r6r9J84l5j38
3723h9J61l0j81J58O1j94J20J07k42M6K21j74p2J79p3j01J53k4r4J14l7j14J48
3746D3j1j17J77j2k52J46J72k16K9K14k15j23K73n7j65K06pk21J34O4j37J26O7
3769A18k27N7J42j66M1J88j68j08K03p9j27J95L2j99O8N7r3R5N5j65L7O0r3J01
3793B4J21k14m1J59j35l1K81n0k35J34j3j85K01J65k01KQ1j92O9J83j36l6J67
3816A18j53p2K31n0k09J45L0j75J79J68k16p0O4j15O2K07l5r0K2j66m0K03K0l6
$$ plain form
3840 22 134 18 -203 -22 76 -58 19 83 -94 -47 123 2 -63 15 -118 -122 127 92 13 99 -88 -284 -30 155
3864 155 42 133 132 -194 -196 57 27 25 182 15 -145 2 15 -61 90 47 -132 21 132 -4 60 49 -190 -138 136
3889 136 114 72 133 -66 -237 -78 42 79 192 85 -142 -117 -69 -45 120 133 -89 -78 24 -68 -10 115 -64 -132
3913 -132 51 28 11 117 -4 -197 -91 23 15 187 143 -150 -159 -28 -79 45 241 22 -144 -4 -47 -101 135
3936 135 136 -103 -33 32 -46 67 122 -71 -112 36 -2 58 172 -18 -160 -36 -7 -3 153 136 -81 -100 -47 -73 76
3961 76 139 -4 -69 -57 -85 27 123 -32 -68 5 -65 -41 141 33 -120 -29 -30 -73 101 148 -79 -81 -19 -89 34 185
3987 185 -10 -100 10 -59 -61 151 100 -116 -32 6 -103 50 178 -30 -103 8 -26 -17 141 51 -84 -33 -15 -2 97
4012 97 64 -64 -37 -25 -43 88 113 -38 -76 -34 -62 44 138 6 -75 -57 -87 -11 141 30 -76 -13 -68 -102 98 107
$$ packed form
3840B2J12j16k21J81R8j34P7O4j77M7J70j21o5P8j33mK49l5p9Q6j87j96K54J85
3864A55j13R1jl26kK53l0kJ57j67j60J47J3p6J51m3j79J53J11j36O4j1k39N2K74
3889A36k2m2O1j99j71J59J20L7J13j07k27K5M8K4J65J3k22J1J02r2N8J25j79o8
3913a32J83k3j7J06j21j93J06J14qJ72m4k93rJ31n1J24J96k19j66J40m3n4K36
3936A35Jk39P0O5p8J13N5j93m1J48l8O0J14j90j42J24K9MJ56j7k17j9N3k6J49
3961G6O3j43o5J2k8J12R6j55l6P3p0K4J82j08j53R1jm3J74M7k27kO2p0J23J51
3987A85j95r0J10o9kK12n1k16Q4L8j09J53J28k08p3J11l4RJ58r0j35N1J8J3R9
4012I7l3j28K7J2j8J31K5j51l8M2k8J06R4j32q1J8l0P6J52j11j06O3n5l4K00R
$$ plain form
4038 107 -78 -61 11 -110 11 181 -2 -132 -11 -39 -43 156 107 -94 -65 -33 -65 86 174 -16 -82 -23 -80 -5 168
4063 168 80 -86 -63 -43 -27 117 105 -22 -65 -42 -32 86 112 -2 -29 -74 -100 58 160 42 -47 -56 -135 -55 165 112
4089 112 -20 -19 -90 -117 90 127 -20 -4 -24 -151 -8 170 30 -54 10 -108 -107 146 135 -39 -31 -36 -105 38 176 52
4115 52 -40 -30 -106 -47 121 115 14 -33 -99 -90 84 122 37 -9 -67 -98 36 123 55 29 -53 -127 -19 79 51 58 10 -149 -91
4144 -91 89 63 25 64 -91 -180 29 102 -3 44 15 -163 -66 104 29 13 60 -94 -147 46 78 -10 61 -3 -148 -40
4170 -40 104 28 9 41 -84 -103 40 70 36 54 -38 -89 -4 58 49 67 -17 -83 -19 34 27 86 24 -78 -23 12 -21 66 80
4199 80 -71 -80 22 -30 0 110 -13 -107 5 25 -51 47 75 -92 -63 43 -39 -15 92 -15 -87 7 -1 -44 66 40
4225 40 -85 -26 21 -43 27 64 -29 -33 11 -13 -5 50 15 -30 12 -18 -9 46 12 -35 16 -11 -48 33 44 -30 8 28 -60 -27 54
$$ packed form
4038A07j85J7P2j21J21J70j83j30J21k8mJ99m9k01K9L2l2J51Q8j90o6N9n7P5J73
4063A68q8j66K3K0J6J44j2j27m3K3J0J18K6j14k7m5k6J58J02j18q9rp9Q0K20n3
4089A12j32Jp1k7K07L7j47J6k0j27J43J78j40q4O4j18JK53j1j74Qno9J43J38j24
4115E2r2J0p6N9J68oj01m7o6RJ74L8q5m6n8l1J34Q7o8k6q2p4J08R8k8Pm8j59N8
4144i1J80k6l8L9j55q9K09P3j05M7k9j78R7J70p5j6M7j54n3J93L2q8P1o4j45J08
4170d0J44p6j9L2j25j9J43L0l4J8r2n1Q5O2rJ8q4o6O4N3pN9o2j02N5L5l3Q7J4
4199H0j51rJ02n2L0J10j23r4J12K0p6R8K8j67K9J06q2K4J07j07p2R4qm3J10k6
4225D0j25N9M7o4P0L7r3mM4k4QN5l5m5M2l0RN5l4m7N1k7l7Q1J1p4L8K0q8L3Q1
$$ plain form
4256 54 -9 -14 54 -47 -53 62 10 -50 39 9 -84 14 40 -65 -7 52 -71 -61 50 -13 -44 44 7 -81 10 42 -25 14 23
4285 23 -49 -10 20 -13 13 40 -33 -28 20 -13 13 52 -11 -52 24 13 -4 60 8 -51 19 9 -28 51 42 -51 -9 35 -42 10 77
4316 77 -36 -71 33 21 -41 64 25 -93 -22 27 -34 6 47 -52 -52 2 -27 -14 63 -12 -84 -9 -15 -31 49 30 -68 -16 16
4345 16 -2 18 35 -25 -37 -7 -20 28 47 -36 -47 2 -16 22 97 10 -67 -11 3 -25 73 70 -36 -28 10 -42 8 77 -8 -50 36
4376 36 -4 -12 80 7 -98 -13 40 -2 53 63 -80 -95 -1 -1 19 90 16 -79 -62 -37 3 63 39 -34 -36 -19 -21 44 14 -39 -30 4
4408 4 1 45 74 -43 -75 -32 -11 53 121 27 -75 -68 -73 -8 127 102 -26 -39 -14 -67 9 110 1 -24 31 -27 -28 83 20
4437 20 -89 -35 27 14 77 92 -66 -118 -57 -24 54 139 48 -82 -89 -92 -40 70 97 -4 -43 -67 -57 18 46 -11 -32 -22 -10
4466 -10 52 52 -21 -52 -42 -57 54 134 50 -44 -62 -99 -54 105 136 30 -9 -62 -103 11 110 48 20 22 -48 -56 49 44 -43 -3
$$ packed form
4256E4o3nO8j01oJ15n2o0Q9l0r3R8K6j05N8N9j23J0J11o3l1Q8l7q8R1L2o7L9R
4285B3p2L9L0l3K6K7p3NM8l3K6L9o3m1P6j1j7O4n2n9P0j0l7P9rr3M2M4p7N2O7
4316G7j13l5J04j2o2J05l9j18P1M9o1M0M1r9%N4k9J3P7p5p2P5oj6Q0j9r8N2L2
4345A6j8K0J7o0j2L0j3M8J9q3j1M9j8L8P5q7p7N6J4k8R8lj06QL8n2N0O9q5m2Q6
4376C6m0qR2p3j05Q5N3m2N5J0j43j5R4%K0P1p4r5J7K5M0O0k4p3kJ7kO5l0n3RL4
4408DlM4K9j17l2M3K1O4O8r4j02PnO5J35k5j28j3K5n3P6J01j09k5N5n8jJ11o3
4437B0j09N4O2j3O3J5j58n2O1L3P8Q5r1j30plN2J10K7j01l9k4J0P5K8n7k1J0J2
4466a0O2%p3l1J0j5J11Q0q4r4j8l7M5J59L1j06l9n3m1J14R9o2k8Kp0qJ05nq7M0
$$ plain form
4496 -3 -19 -29 70 90 -26 -79 -54 -58 28 127 61 -33 -68 -92 -50 60 104 35 -26 -64 -93 -10 43 22 16 -44 -67 2 47 4 -17
4527 -17 -38 -81 11 78 40 6 -26 -95 -64 57 98 39 33 -56 -102 -15 97 51 34 15 -57 -69 61 61 15 37 -11 -65 10 75
4557 75 9 -10 -30 -77 -22 77 50 -8 -23 -61 -54 36 63 20 -6 -48 -69 -3 42 38 20 -34 -75 -21 30 20 25 -13 -71 -44 21 30
4589 30 21 21 -51 -60 15 24 10 28 -4 -66 -9 66 22 17 20 -62 -47 51 52 29 38 -7 -63 -2 56 27 43 18 -51 -37 32 19 10 11 -22
4624 -22 -34 27 19 -1 3 -30 -39 3 33 8 18 -27 -70 -21 17 18 34 1 -62 -54 14 1 12 33 -30 -47 7 5 -18 32 15 -38 -2
4657 -2 33 12 11 0 -41 -39 39 35 10 36 -10 -50 -3 35 0 32 27 -23 -28 11 10 17 20 -6 -24 6 8 -3 5 -18 -20 7 9 -13 21 -9 -44
4694 -44 -5 6 -10 33 13 -41 -29 8 -29 5 32 -14 -23 10 -14 -31 31 15 -40 7 25 -25 8 34 -22 -11 21 8 -4 30 1
4725 1 -29 23 23 -11 32 30 -14 7 21 -19 3 28 -3 -9 8 -6 -13 27 7 -24 12 -7 -16 9 -5 -16 4 6 -32 -6 6 -23 -13 5
$$ packed form
4496cj6j0R9K0j16n3K5mQ6R9o6r4l5k4M2J10M4o9o1l8k9Q3N3k1oo0k3O9M5m3k1
4527a7k1m3R2O7l8l4l2o9L1J21M1n9oq9m6Q7J12m6j7j9p2j2J30%m6K2m8n4P5O5
4557G5o6j9k0m7N5R9k7n8j5l8PR0K7m3k6m2k1O6M5mj8n4m1N4N1j0Nl8n8K7O5R
4589C0r%p2rP5Rj4J8l2o2N7P5m4nLq2J5R8Jk3Rm5n6O1N8k9J6k5o9J4O9j3rJl3
4624b2j2O1qk0Ml3rM2L0k5J0m5m3M9L8JJ6l3o3QO8j3J1K1o3j7N4kk3N0j7n3L6
4657bL5k1jj1m1KP8mk5K6m6m0M7L8l5L2nn0nL9jPLk6j8L0Kj1Qk3kK7Kk2L4l0l5
4694d4L9J1j6M3k0n4J2L7l7L4K7m6rL3k4j7O2j6n5M7J8n0L3K6n6J1L2j3j2L4k9
4725Al0N2%l4M3km4K1J4m0K2K5l1oJ7j4pM0k0l1L6j9rK5j4j1K0Kl8K6J2k9J0J8
$$ plain form
4759 5 -33 -8 18 -9 -33 26 -2 -31 20 3 -29 16 15 -38 5 16 -14 24 35 -13 -16 23 -9 -16 18 13 -19 10 28 0 35 28 -16
4792 -16 -15 7 -2 15 21 -4 -14 1 0 2 19 -10 -23 -11 3 -10 9 18 -17 -7 -6 -17 11 22 -19 -31 3 -13 -5 38 2 -34 10 -14
4826 -14 -33 30 16 -31 -16 -1 -22 14 39 -24 -21 20 -16 -2 43 7 -24 -13 -5 -5 35 36 -7 -3 0 -8 32 59 -15 -15 -3 -3 6 39 13
4861 13 -11 0 -19 -17 26 32 -15 0 -20 -41 21 38 -18 -24 -15 -31 -5 43 6 -16 -6 -25 -24 37 21 -13 -5 -4 -39 15 45 4 -22 -8
4895 -8 -29 -4 49 33 -7 13 -9 -25 36 34 10 7 1 -15 27 56 4 -2 3 -18 2 38 14 -7 -8 -23 -7 34 14 -7 -12 -35 -40 13 24
4930 24 2 0 -20 -51 -10 38 8 -23 -15 -42 -28 30 11 -2 7 -22 -45 11 36 -5 -5 -8 -48 -14 41 13 -4 7 -28 -26 40 30 -6
4963 -6 -1 -13 -29 15 31 10 1 4 -36 -13 45 22 2 4 -32 -22 44 27 12 12 -19 -34 22 23 -4 17 -2 -56 -13 17 2 -12 14 -39
4997 -39 -26 31 5 7 23 -23 -42 5 21 -15 13 3 -42 -15 27 7 -1 19 -34 -28 40 17 4 20 -2 -25 10 37 4 9 1 -28 -6
$$ packed form
4759El8K5K6k7k4N9k8k9N1j7l2M5jn3M3J1l0L8J1m8lL9l2pL4nl2K9J8k8L5pm4
4792a6JK2rJ7Ok5j0J5jKJ7k9j3J2J4j3J9Rl5J0Jj1K8J1m1j2L4j6QM3l6l6M4k4
4826a4j9O3j4m7J5J5k1L6K5o3LM1l6J4M5l6l1J1Q%M0Jm3MLqM0K7p4%J2%RL3k6
4861A3k4J1j9KM3Om7J5k0k1O2J7n6oRj6K6M8l7k2J0j9JO1j6l4QJl5N4L0m1k6J4
4895hk1K5N3j6m0K0k2j6O1kk4loj6M2K9n2oNk1K0L6k4k1jj5J6M1k0k1nk3nN3J1
4930B4k2kk0l1M1M8l0l1Qk7J4N8j9j3Rk9k3N6K5m1%lm0L4N5k8j7J1l5KO6j0l6
4963fNj2j6M4J6k1rLm0K3N8k3k0Kl6J0O6j7j5%l1j5N6Jk7K1j9n4M3L0j5j4K6n3
4997c9J3N7k6KJ6m6j9M7J6l6K8j0m5K7M2k0qK0n3OO8k3j3J6k2k3L5K7l3Nqk9K2
$$ plain form
5030 -6 34 21 15 27 -21 -29 11 17 10 13 -12 -25 -3 12 -9 10 1 -25 -3 13 1 2 8 -47 -22 17 7 -6 12 -23 -49 2 8 -17 19
5065 19 10 -33 -15 5 -5 3 22 -29 -23 20 6 13 24 -5 -27 17 18 2 5 23 -36 3 23 14 31 21 -12 -27 9 18 19 36 -4 -11 4
5100 4 3 -1 14 11 -19 -5 13 1 10 28 -22 4 6 -12 3 3 -13 -34 -2 2 -2 23 0 -25 -8 -2 -8 -2 13 -17 -17 1 -1 -3 27 -10 -34 14
5138 14 8 -8 12 4 -17 2 10 -6 12 16 -2 -23 14 3 8 40 8 -13 9 13 -3 21 1 -7 5 4 -12 11 16 -8 -12 8 -7 -3 15 3
5174 3 -25 0 5 2 8 12 -21 0 17 -11 -8 15 -20 -17 5 -5 -6 24 9 -10 12 -16 6 0 17 -11 2 15 -11 17 24 0 11 25 -1
5209 -1 -5 19 0 10 21 7 0 18 13 -5 17 11 -11 0 13 -19 -3 12 -17 -20 -2 6 -8 2 -5 -8 5 -2 -32 -8 8 -4 -8 6 -18 -9
5245 -9 11 -8 -16 -3 -10 -4 16 5 -11 3 8 -15 3 21 -11 12 14 -15 2 15 13 -1 29 13 -4 20 11 -17 8 17 3 7 22 4 3 0
5281 0 0 7 22 9 6 6 -8 -4 0 10 0 10 12 -16 -13 -9 -9 1 0 -13 -3 3 -7 -18 -6 -17 -7 21 6 -10 3 -1 -29 6 31 12 20 20
$$ packed form
5030fM0j3oJ2m8qM0OpLk5j3K2J5k1J9rk6K2J6j2JOn5K5L9j0j3J8l5k6N1Ok5L6
5065A9rm3J8K0j0QJ9n1OM3j4PJ1k9k2M4Jj6LJ8n9L9K0rJ7j0l3j5L6RJJ7m0pJ5
5100DjmJ5ll0J4J8j2RJ8n0K6Kj8J5%j6k1L2MmK5k3k5J7OoOJ5l0%J8kkL0l7k4M8
5138A4oj6K0qk1J9Qj6J8Mj8k1L7j1NL2l2k1K2Mj6K4k0qJ2jj6K3Nk4mK0j5MJ8j2
5174Ck8K5NlOMl3K1J7k8LK3l5LK2j0jL0j5j9K2k8K2oJ7k8J3J3k6K8Pk4J1J4k6
5209amK4j9J0J1j4pJ8nj8K2ok2J1J3l2J6J5k9lJ8Qj4J0plJ3pl0K4J6j2mJ4k4R
5245iK0j9qJ3pOK0j1j6J4Nk3J8J8l2K3Kk9J7J3kj4L0j6j7K4rk8K5Rj4MJ5j8jl
5281@%PJ5j3l%j4MMJ0j0J0Kk8LM%J0jj3J0Oj0j1J2j1J0K8j5j6J3mk8L5K5j9Q%
$$ plain form
5319 20 -23 -3 19 15 0 30 8 -10 17 13 -21 12 18 -6 5 25 5 -9 16 -6 1 24 13 1 5 -18 -30 -8 19 1 19 -6 -7
5352 -7 -6 -3 -14 6 2 -5 -3 -3 -23 -14 6 -20 -1 14 7 -27 -7 -12 -30 21 18 -15 8 18 -38 -18 20 -11 -3 31 8 -27 3 12 -21 0 33
5389 33 -7 10 31 -11 -12 13 4 5 27 10 -17 -5 -15 -13 1 8 4 9 2 -18 6 -2 -13 9 3 -22 11 9 -21 -6 9 -14 -18 21 -16 -19 13
5426 13 -16 -39 14 18 -22 3 9 -26 -12 26 -10 -8 21 0 -33 15 20 -16 14 26 -21 -4 24 10 -5 21 6 -3 8 9 -2 6 -7 -3
5460 -3 14 15 14 8 -25 -7 7 -10 0 15 -6 -26 14 12 -5 8 22 -29 -12 8 -27 -11 29 -12 -29 17 9 -30 0 27 -37 -14 27
5493 27 -21 -12 19 -4 -30 25 24 -10 10 17 -16 -3 23 9 5 14 -10 -10 1 14 3 14 4 7 5 -4 18 9 -13 4 14 -11 6 22 -4
5528 -4 -27 30 -11 -27 26 26 -29 -22 22 -29 -29 19 -24 -39 17 3 -34 11 24 -23 -5 26 -21 -6 17 -19 -27 29 2 -23 18 18 -11
5561 -11 2 6 -2 12 29 9 5 -4 -1 3 12 20 13 6 2 13 9 -5 20 39 -19 -5 17 1 -1 33 11 -38 19 18 -24 11 24 -27 -5 35 -2
$$ packed form
5319B0m3K0K2mj5L0k2j8K7ml4L3Ok4J1K0k0j4K5k2PK3j1j2Mk3j2K2K7j8J8k5j
5352gJLj1K0mpK%k0RK0k6J9J5pl4K0nj8N1ll3K3J0n6K0L8l1QL4k3l5L0Rl3K1L3
5389C3m0J7K1m2jK5rJK2j7k7J2j0KJ4PmNpk0K4qj1K2ok5L3kl0J5J5k3mL9l7lL2
5426A3k9k3N3Mm0K5Ol5J4L8l6KK9k1l3M8Nl6L0J2m7J7K8j4j5K6j5rJ1Jj1Qj3M
5460cJ7Jjol3J8J4j7J0J5k1k0M0kj7J3J4n1J7K0l5J6M0m1j7M6ql9L0K7o4K3M1
5493B7m8RL1k3k6N5jl4K0Pl3J3K6j4mRk4%J1J3j1J1j0LkrK2rk2J7J0k5J7J6k6
5528dk3N7m1j6N3%n5PM4n1%M8m3j5N6j4l7M5J3m7J8L1m7J5K3l6qN6k7k5M1%k9
5561a1J3MqJ4J7k0mrLMRQppmJ1mj4K5J9n8J4K2j6kL4k2m9N7jm2L5J3n1K2M0l7
$$ plain form
5598 -2 -15 19 -4 -41 4 9 -25 6 12 -27 -13 33 -3 -16 8 -2 -16 -3 8 3 16 11 -5 4 4 13 7 7 -2 -4 -4 0 11 5 -4 20 14 -3 13
5637 13 30 -22 -6 11 -10 -3 25 2 -20 11 18 -27 19 24 -25 -14 19 -15 -21 29 -6 -38 -4 -1 -32 3 22 -27 -7 12 -30 -15 19
5670 19 -3 -6 10 -4 -9 22 12 -1 13 1 -5 2 -4 4 8 -10 -2 11 16 -1 8 4 -17 15 12 -6 10 22 -21 4 24 -3 -23 28 8 -28
5706 -28 8 17 -26 -2 22 -9 -3 30 -5 -10 14 6 -29 7 17 -13 1 28 -30 -21 0 -21 -17 6 -11 -15 4 -2 0 14 3 -5 0 6 1 -5 -3 15
5744 15 4 -1 -6 20 9 -1 5 16 -10 4 18 -16 -8 21 5 -13 21 -1 -10 15 10 -10 14 20 -11 2 26 -5 -21 15 -13 -22 20 9
5778 9 -34 4 -1 -14 -7 10 -18 -14 4 -3 -11 4 -7 -22 -3 -3 -7 -11 1 -7 -2 11 -4 3 9 11 2 -1 2 12 5 -7 3 12 -3 6 26 2 8 22 -12
5819 -12 -16 25 8 -4 14 13 -5 14 6 -17 -8 16 -7 -10 15 -1 -16 4 5 -14 8 19 -8 1 12 -10 -2 10 3 -14 -5 5 -6 7 4 -11
5855 -11 -17 8 -3 2 18 -6 -1 -5 -10 7 23 6 6 -3 0 -2 10 3 -4 27 2 1 17 1 -15 21 14 -3 21 19 -14 -5 2 -8 -14 24 -4 -21 11
$$ packed form
5598bj3L4k3l7M5Nl4L1Ol9J4M6l6j3K4j0j4J3J1nJ3nj6R%Ro%rk%MJ1orK4oj7J6
5637A3J7n2J6J7k1PK8k3k2L1Pm5M6Nm9J1L3l4oN0l5l2L4Ll1L5J9m9K0J9m2J5L4
5670A9k2lJ6j4nL1j0j3J4j2oPoQMj8QJ3Nj7Rmk1L2lj8J6J2m3K5K0k7k0N1k0l6
5706b8L6Rm3K4K4l1OL3l5nK4ql5L6J0l0J4K7n8RK1k1MK3j7mJ9oKJ4j1qNOnoKJ8
5744A5j1nnK6j1j0OJ1k6J4J4l4QK9j6j8L4k2rK5nk0K4Ol1J3K4l1j6L6k8rM2j1
5778Im3L8nj3PJ7k8MJ8pqJ5j1j5J9%mmJ2qNJ3j5POKrlLJ0pj2J0Rj5RK0k4OJ4l4
5819a2mM1j7j2J8jj8J9qk3RK4k3lK5j6j5K0Jj9K2J1k7RJ1k2QJ2pj7RJ0j1J3lj5
5855a1oK5j1NJ6k4NmnJ7J6j7%rLkJ2ppL1k5jJ6j6j6L6pj7K4kl3RPj0oL8k8j7L2
$$ plain form
5894 11 0 -40 1 22 -7 10 13 -20 -17 5 -6 -14 19 7 -11 10 2 -17 -4 12 -9 5 14 -9 1 -8 -20 -11 17 14 7 -2 -10 -11 11 3 11
5931 11 18 14 1 3 0 0 10 19 7 18 20 -1 -8 5 -11 6 26 20 -12 -4 -3 -26 3 5 -8 3 8 -33 -28 9 -10 -9 15 8 -21 -8 2 -12
5969 -12 -2 4 -9 11 10 -16 -9 9 -6 -15 21 10 1 16 -7 -14 9 12 -5 19 20 -5 9 5 -21 9 28 7 11 9 -7 -10 22 -1 4 13 11 3
6007 3 16 10 -19 3 27 -7 -1 18 -4 -6 12 -14 -6 11 2 -27 -3 -1 -11 -6 6 -9 11 5 -18 -2 5 -7 -8 9 -15 -11 15 10 -11 24 5
6044 5 1 6 7 -12 13 26 -2 11 26 -3 0 17 6 3 29 3 -4 -4 2 -10 23 10 -3 20 10 0 -4 -4 -1 -1 24 15 -7 3 -7 -11 6 -5
6082 -5 -6 9 1 -18 -2 -5 -12 6 1 -7 3 13 -5 -8 -8 0 -6 23 -1 -12 10 -15 -26 13 23 -1 1 9 -27 6 20 2 3 33 0 -16 17
6119 17 11 -7 23 11 -18 2 6 -10 8 4 -17 0 9 -2 6 10 -16 -21 3 4 3 18 1 -21 -1 4 -14 18 8 -13 -10 8 -8 9 14 -20
6155 -20 -12 11 3 2 17 -1 -16 3 6 0 31 20 -20 -13 18 -7 22 37 2 -25 10 6 10 32 16 -5 6 -3 -11 22 22 -8 -8 0 -2 17 21 -10
$$ packed form
5894A1j1m0M1K1k9J7Ll3LK2j1qL3j2j8K1qj9J3J6k1J4Rk3J0rj2RK8lprqjK2qQ
5931A1Pmj3Kl%J0Rj2J1Kk1pJ3j6J7K0ol2QJk3K9Kj3J1Nm1NL7j9JK4pk9J3J0j4
5969a2J0Oj3K0jk6PJ8j5rL6j1rJ5k3pK3Lj7K4Jk5J4mk6L0J9k1Mkj6lL2k3NRkq
6007CJ3ok9K2K4l4OJ9k2kJ8k6QJ7rk9K4Kj0NJ2j5K0ok3J6Pj2jJ7k4MK6nk1L5j9
6044EmNJj9K5J3k8J3J5k9LJ7j1lK6k6p%Oj2L3j3j3K3j0j0m%L%K5rk2J0j0mJ7j1
6082ejJ5qj9J6lpJ8nqJ0J0j8l%QoK9k4j1K2k5j1L9J0k4KQl6L3J4j8JL0l3j6L3
6119A7oj8L0j2k9K0Mj6J8mk1J7Rj1QMk6nK4JjJ5j7k2K0Nj8L2j0k1LJ8j6J7Nl4
6155b0QK3qjJ5j8j5J9LoL1j1m0PL1k5K9J5l5k7L5mMK2j6k1J1rqL3%l0%QkJ9Ml1
$$ plain form
6193 -10 -2 4 -10 10 20 -8 -18 -4 -18 -17 15 23 -19 -3 -11 -23 8 15 -10 -11 5 -21 -27 33 11 -8 5 -12 -25 7 27 7 6 4 -29
6228 -29 2 43 7 0 2 -7 -8 32 14 16 21 -6 -6 17 26 24 17 -12 -23 1 14 9 27 17 -25 -4 17 -6 -1 25 -15 -24 10 6 -9 25 5
6265 5 -37 3 8 -8 -3 5 -28 -10 17 1 -4 29 3 -17 0 8 1 23 15 -9 0 22 15 19 26 -2 7 10 1 17 25 5 7 9 3 7 21 24 -7 16 12
6306 12 1 14 16 -10 20 15 -11 -2 18 -7 -4 25 -4 -2 22 2 -23 4 4 -16 -2 12 -9 1 18 -12 -18 4 0 -5 15 1 -10 20 16
6341 16 -1 8 13 -5 -1 1 -17 1 21 7 10 -1 -8 4 23 17 -1 20 6 7 31 13 -7 12 -12 -20 18 19 -3 12 9 -22 -14 18 -4 -8 3
6378 3 5 -20 26 16 -9 -2 6 -26 -7 25 16 4 6 -16 -20 10 12 1 11 -11 -24 3 17 19 23 -7 -9 -5 22 12 27 19 -10 -12 11 14 15 23 -1
6417 -1 -22 0 7 15 39 13 -13 -8 3 3 29 26 -5 -22 -1 18 16 32 -5 -40 -15 6 5 33 29 -17 -26 -6 2 18 30 -6 -34 -7 -12 20
6453 20 27 6 -34 -14 -6 -7 34 26 -3 -28 -7 -13 16 27 20 -1 -14 -6 21 47 22 -2 -13 -15 -13 23 37 10 -1 -14 -11 14 34 16 -10
$$ packed form
6193a0QOj4K0J0k8j0J4j4JL2Qm2J6qj2L1Pk5jJ6k6oO0k2j9J3j7j3L2K0k0jkl3
6228b9L1M1l6pKrjM0j8KNk7%K3Rkpk9j1K4J3nJ8j0m2K1K1k3NK6m0rL4mj5L4k0
6265Em2M0Nj6NQl3J8K7j6nL3k6k0J7QpK2qk4RK2pMPk8RLrJ6Qk0KKoMJ4Ll1K3m
6306A2j1J3Kk6L0nk6RK0k5LK9k9KK4k0k5K7%k0J4J4k1J0J7l0oK2mnK0j4j1L0m
6341A6j7RNj8MKj8J8K0j4Lj1pJ2J9oj8K1j4JK4j8k0J9k4qL8Jk2J5ll1QL2k2mJ1
6378CKk5M6j0k5PQl2J9L2rj2Kk2mL0Kj1J0k2j3K7J4KMl0kMK7j0J5qk9kK3LJQk4
6417ak1K2PQK4k6k6NJ1%K6ll1j7K1J9kJ6l7l5K5K1jK8mm6rK0QJ6J2l6k8K7nL2
6453B0Pk1m0K0QjM1qk9k5K1oK9J1pk1j3QK7K6k5k4j1kKL6J4k7j1j3LK5K0j8k6
$$ plain form
6488 -10 -7 -11 -4 23 37 -3 -9 -19 -28 13 45 19 -6 -21 -36 -11 28 19 -10 -20 -26 -29 15 21 8 -4 -33 -28 9 25 12 5 -20 -33 -3 23
6524 23 38 2 5 -24 -23 6 29 12 15 -11 -31 -11 19 23 25 15 -20 -10 17 13 13 20 -14 -21 -5 16 7 0 -9 -11 -17 2 14 13 7 -31 -39 -11 2
6563 2 20 4 -8 -25 -4 -1 -8 17 6 -11 -9 -4 -3 13 13 1 -15 -9 -4 0 31 3 -15 8 11 -3 13 12 -10 -6 4 -2 10 34 18 -4 1 -6
6601 -6 -8 28 16 4 8 15 -11 10 17 -9 -5 9 6 -12 10 8 -12 5 -1 -9 2 -1 -4 6 -4 -2 -3 -3 -7 5 12 -6 2 -10 -4 -2 10 -5 1 3 -1 -18
6643 -18 28 7 -5 -1 7 -16 21 25 -13 -4 10 -10 1 38 4 -20 3 1 -27 19 37 8 -4 13 -15 7 28 19 5 -6 -19 1 20
6676 20 22 -5 -14 -11 -22 22 20 10 7 -15 -21 -5 23 10 22 -11 -39 4 18 3 17 24 -32 -32 3 6 19 19 -3 -49 -8 28 1 33 27 -37
6712 -37 -30 3 20 25 34 -5 -44 -2 16 23 38 17 -28 -28 12 17 24 37 -4 -38 -17 17 29 32 -8 -24 -23 -5 13 41 25 -15 -25 -38 -9
6747 -9 42 28 -11 -27 -21 -12 12 31 0 -21 -18 -31 -8 51 21 -23 -23 -22 -20 26 68 5 -18 -9 -38 -1 55 38 -4 -13 -24 -27 27 41 10
$$ packed form
6488a0LmPK7J4m0oj0rM1L2k6k5j5j5K5L9rk9j0olM4Oj3j2k9NL7J6j3pk5j3L0K6
6524B3J5l6Lk9JK9K3j7Lk6k0K0L0MKj0l5J0K7m%Pl4pJ6K1rprkoJ9J2jol8qK8J3
6563BJ8j6j2j7K1LpK5j1j7KNJJ6%j2j6ONML1k8j8K3Lj4J6jk2MJ0oJ2K4j6k2Np
6601fkL6j2j2MPk6K1Pk6MJ4lj8K2kk0J7oqJ1llJ0j0Kj%mJ2Pj8Qj2OKJ2j5OKmj7
6643a8M6k1j2MQk3L7Ml8RJ4k0J1L7l4k4K3kk8M6J8k9j2J7k8K2K1rj4j1j3K0J9
6676B0Kk7rLj1M4kj0lk2oJ6K8j3J2l3k8M3J4j5J4Pn6%L5LJ3%k2m6M1L6k7L2oo4
6712c7PL3J7NRl9l9M2J8PJ5k1m5%M0NPJ3m1l4K1L4J2Lm0j6JJ8J8K8j6m0j0j3K9
6747iN1j4l9j6ORK4J9l1k1Lj3K3N9l0m4%JKM6M2o3k3Rk9L7N6j7m2rj1lN4J4l1
$$ plain form
6782 10 -5 -19 -20 22 57 19 -8 -16 -26 -8 42 50 1 -29 -41 -35 21 38 20 14 -36 -53 2 44 28 25 -3 -42 -13 28 11 17 3 -40
6816 -40 -33 32 19 -8 13 -19 -47 8 30 18 25 7 -38 -26 15 34 14 29 -10 -54 -5 24 22 29 6 -26 -6 8 20 26 3 -27 -13
6849 -13 0 20 21 27 -16 -14 -5 8 17 20 -9 -38 -7 -14 -6 42 15 -22 -10 0 -20 22 28 -13 -25 18 -5 -8 42 16 -35 -16 7 -3 16
6884 16 29 -22 -21 13 13 24 27 5 -19 1 20 8 21 12 0 3 -6 7 22 21 5 8 16 2 17 13 -3 7 16 -6 10 28 -26 -15 8 -5
6920 -5 -17 17 1 -34 1 27 -9 10 11 -34 -23 17 4 -7 24 -13 -39 0 14 -2 29 2 -26 -18 29 15 4 8 -26 -21 19 26 20 16
6954 16 -25 -29 -7 20 27 33 8 -20 -10 20 20 37 22 -17 -10 6 12 17 34 -17 -21 17 -2 8 40 -1 -39 -10 9 25 46 41 -35 -39 -5
6989 -5 -6 26 51 5 -45 -8 2 10 33 35 -32 -29 5 5 27 27 -4 -34 -10 14 28 39 7 -22 -23 -6 16 46 30 -14 -25 -25 1 62 50
7024 50 -2 -22 -32 -22 40 65 0 -18 -23 -35 -4 59 32 -16 -18 -31 -24 30 57 2 -19 -28 -35 11 59 29 -38 -20 -41 -23 21 44 -4
$$ packed form
6782A0j5j4jM2L5l8k7qj0J8N0Qm9l0j2ON6J7j8on0j7N5M2j6lk8l9K9M1j7Oj4m3
6816d0PO5j3k7K1l2k8N5K2j2Pj8m5J2M1J9k0J5l9m4M9K9kPk3l2K0J4J2Ok3l0J4
6849a3J3K0JOm3KRJ3RLk9k9L1pQM8k7l7J2J0k0M2Om1j2M3k3lN0k6n1J9K3j0J9
6884A6J3n1JL4%J1Lk2k4K0J9j2J3rj2LrJ3J5jj6LQj4J5mj6J0Rk2J6J8n4J1K3j3
6920ej2L4j6l5L5K6l6J9Jm5J1M0j3j1L1l7k6L9J4j6L1k7k8QM7j4j1Ml4NM0Pom
6954A6m1mK2K7POk5k8J0L0%J7j5l9PJ6ONJ7n1mL8j9J0L2m1l8K9J9J6K1np6mL4
6989ejL2K5m6n0L7J0QK3Ko7LL4%K2%l1l0K4K4J4J1l2k9jJ7K2L0j6m4j1%K6O1j2
7024E0n2k0j0J0O2K5o5j8nj2L1O3k7m8kj3PN4K7n5k1rpM6M8l0o7J8k1J8M4K3m8
$$ plain form
7057 -4 -9 -27 -37 3 47 23 -20 0 -39 -12 46 31 -5 -8 -19 -16 28 37 18 -2 -26 -29 2 46 35 4 -24 -42 -8 31 25 20 0 -32
7091 -32 -31 20 12 8 20 -21 -41 -3 18 8 12 7 -35 -27 31 14 -2 14 -23 -37 -3 13 -1 15 3 -47 -27 7 16 6 14 -18 -32 -4
7125 -4 17 20 9 -3 -34 -12 9 13 5 -5 -3 -13 -5 17 15 14 -10 -16 0 -7 19 17 -10 -6 -2 -1 0 21 1 -13 4 5 -19 11 26 -16 -12 -7 -9 -14
7165 -14 19 -8 -28 -6 -1 -28 10 17 -7 -17 9 -23 -16 22 4 -30 -2 11 -8 14 8 2 -7 4 -11 -10 6 1 -2 4 0 -9 7 14 8 -8 -1 8
7203 8 21 7 -10 13 19 -12 4 4 -16 2 13 -13 -3 10 -2 -10 8 -10 -19 3 -2 -14 -1 10 -9 -2 -1 -26 -21 17 -4 -20 -5 -5 -33
7238 -33 1 6 -2 -2 1 -12 -13 10 15 6 5 0 -2 14 5 1 -12 -1 -2 -8 -7 6 11 -4 -10 4 7 -1 15 16 -22 -6 2 -3 4 24 -6 -18 15 -2 -10 14
7280 14 13 -21 -3 5 -17 7 20 -17 -24 -5 -14 -10 16 6 -17 -4 -1 -19 7 29 -5 -21 -12 -8 12 22 1 -17 -4 1 -3 35 10 -14 -16 -12
7316 -12 0 22 31 -2 -12 -17 -30 2 27 11 17 5 -8 16 37 5 -9 6 -15 -16 18 33 -4 6 1 -36 -1 39 17 -8 -16 -42 -27
$$ packed form
7057dnj8j0M0M4k4m3K0l9K7N8j5l6lj1LM4Rj9k0k4lL1M4j1l1k8j8L4L9onk0l2
7091c2JN1qmJ2m1k0L8K1j0Mnm2QN8j7j6J6l7j4L4J6j4J6j2n0K0L4Rj0Ql2j4K8
7125dK1Lj1j2l1K2K1Mqj0Kj0QK2kjk4oJ6pK6kk7MMJJK1k0j4J7Jk4L0J5m2MNkn
7165a4L3k7k0K2Nk7L8Pk4j0K6l2PL8j8l4K8J3j9K2oorJ1j5JJ6nlOmrJ6Poj6PR
7203HJ3j4j7K3Ol1J6%k0J8J1k6J0J3j2qJ8j8rK2nj2J3J1j9PJk5NL8k1j6J5%k8
7238c3L4Nq%Lj3jK3NrjnkJ6rmj3J1joJJ3Nj5oJ4LqJ6Jl8J6QnPK0l0j2L3j7qK4
7280A4jl4J8Qk2K4J3l7pJ9rMK6j0k3J3Lj8K6K2l4j6RMK0J0k1j8J3NmL8k5k4kM
7316a2J2K2Rl3j0nj3L2K5j6Oj2j3K4K1l2j4J5k1jL4J5l7J0nl7L5M0k2k5qk6J5
$$ plain form
7349 -27 13 27 -3 9 -25 -45 -16 34 8 -3 -16 -30 -23 19 14 6 -8 -30 -18 10 31 15 -2 -21 -27 11 26 20 37 -13 -37 -11 22
7382 22 13 20 13 -29 -27 7 4 16 27 -9 -27 -9 14 13 21 -3 -45 -19 20 20 31 15 -25 -32 8 17 19 22 -10 -49 -35 8 13 35 2 -26 -36
7419 -36 -16 -4 18 15 -23 -25 -14 -1 10 19 -10 -16 -21 0 6 22 -3 -26 -22 -14 15 31 41 -23 -28 -5 -8 21 38 0 -28 -5 3 12 33 24 -9
7456 -9 -19 -9 -4 29 24 -3 -20 -10 -4 24 15 -6 -25 -14 -16 4 22 0 -14 -16 -17 -15 28 26 -20 -9 -8 -4 16 16 -9 -4 1 -21 -9 32 13 -28
7494 -28 -4 5 -4 19 28 1 -13 3 0 11 20 2 -5 -5 -7 10 38 25 -3 -1 -8 -1 11 10 16 -6 -23 -4 34 10 -10 1 4 -14 -1 25 6
7531 6 -11 1 -26 -7 42 26 -3 -10 -21 -14 28 32 4 -5 -4 -19 5 29 11 -14 -1 -5 -30 8 10 1 -19 -6 3 14 34 -1 -13 -15 1 26
7567 26 15 10 -1 -12 -13 5 26 17 7 4 -27 -2 23 15 11 13 -12 -24 7 36 -10 3 8 -15 -1 31 14 -10 14 -3 -24 10 32 7
7601 7 -3 -1 -11 -6 22 21 4 -2 -1 -19 3 9 5 -9 0 -8 10 19 16 -4 -22 0 5 16 13 6 -14 -13 3 18 3 15 10 -24 -26 7 0 6 29 2
$$ packed form
7349b7M0J4l0J2l4k0K9N0k6j1j3j4PM2nqj4k2J2K8K1j6j7j9oL8J5oJ7n0k4K6L3
7382B2rPpm2KL4lJ2J1l6j8J8K3jQk4m2K6L9%J1j6m0pM0RKLl2l9J4M3NK2l3k8j0
7419c6K0J2K2ll8kJ1J3J1Rk9onK1OJ6k5k3MQK9J6J0o4nK3lK9J7l8k8K3QRK1rl3
7456ij0J0NL3nk7j7J0OK8rk1j9J1kK0J8k2j4kjKM3km6J1JMK0%k5NNk2J2M1j9m1
7494b8K4RrK3Rk7j4J6lJ1Rj8p%kJ7K8j3k8KpPJ2jOk2j7J9L8k4k0J1Lj8J3K6j9
7531Fj7J2k7J9M9j6k9pj1PM2Mk8rJj5K4K4j8k5J3mk5L8Krk0J3RJ1K0l5j2kJ6K5
7567B6j1nj1j1jJ8K1rj0ll1K5K5qmKk5j2L1K9m6J3Nk3J4L2j7k4K4j7k1L4K2k5
7601Gj0Kj0NK8jj7oJj8K2Omj4RqJ8Rlk0j8K2NJ1lpk0JJ6J5j5J2nl4kL3pOK3k7
$$ plain form
7641 2 -36 7 16 -15 1 17 -22 -13 17 -5 -27 14 -1 -31 2 5 -11 -1 1 -29 -14 20 8 -2 22 -11 -22 1 4 -1 5 7 -5 3 3 -3
7677 -3 10 0 0 8 17 11 6 7 -7 9 6 -2 -7 10 3 1 11 0 -1 33 12 -30 9 8 -2 3 21 -15 -13 21 0 -18 14 15 -12 9 -4 -25 -12
7716 -12 10 -5 -8 4 -13 -9 12 -2 -5 -3 3 -5 -14 1 -1 0 -5 8 -7 -3 4 4 -9 16 9 2 -12 8 11 -12 3 6 4 8 16 -3 -18 11 7 -11 13
7757 13 3 -19 -5 19 0 -10 16 -1 -16 18 -3 -8 20 9 -16 -18 12 2 6 22 -6 -14 13 -1 1 -4 5 -19 6 7 2 0 -3 -10 -13 -6 9
7794 9 8 11 -4 3 -6 2 12 12 -3 0 7 1 4 33 3 -17 3 -6 -14 16 23 -6 -16 15 -5 3 17 11 -20 -2 -9 -15 11 11 -21 -9 13 -8 -8 16
7834 16 -4 -20 -1 7 -8 13 11 -15 -18 -1 -6 -4 4 -1 -12 0 -4 9 16 2 0 -13 -1 11 12 -3 1 6 7 -3 13 10 -21 -14 -1 -19 7 12 5
7873 5 -10 -6 -11 1 23 9 -9 -2 3 -8 14 20 -7 -11 7 -3 4 22 -6 -18 -3 -11 -1 18 13 -10 -8 6 -6 -1 22 -1 -8 -3 -13 -2 8
7910 8 8 -8 -13 -1 14 19 13 1 -6 2 -2 6 7 -10 6 -6 -10 1 18 -1 -8 15 -18 1 20 6 -7 5 0 -6 20 17 -11 -1 14 -8 0 17
$$ packed form
7641Bl8M3Rl1J6J6l9RL0k2k2M1j5l0L3Lj6J0Kl0J5L4j2j0K4l3j1K3LnOKj2Q%o
7677cJ3j0%QRonJj4J6lqnJ7pkJ0j1jL4k1m2L9jj0NJ8l6KL4k1j8L2Jk7K1j3k1J3
7716a2K2j5lJ2j7MK1j4lKOqrJ5kJnJ3j5MP%j3K5ppj4K0Lk3J5LkMQj9j5K9mj8K4
7757A3j0k2J4K4j9j0K6j7j5L4k1nK8j1k5kL0j0MJ6k8qK7j4KnRk4K5JnklplPJ5
7794IjLj5PrQJ0%j5LPoLK9l0k0K0rqL0Pk9j0L1k0QJ4ol1J8poK6%l2J2K2k1%K4
7834A6k0j6J9Qj5K1kk6lJ7nKQnj1J2mJ3Pj4kj3J2J2Jj5MNJj0J6ll1PJ3j8K6Np
7873Ej5MnJ2K2j4j8PNj1K2Ok7mJ8j0PJ8k8j2J5qJ0J9nk3KJ4j2NK3k3pNj0J1J0
7910H%j6nJ2J5Noj2pQmQJj7J6j2mJ1J7j9pK3l3J9J9j4j3J2noK6lk8J0J5k2QJ7
$$ plain form
7948 17 0 -1 7 -14 -7 11 21 -13 -12 7 -2 3 19 -8 -7 11 -5 -1 24 14 -1 3 -3 -1 19 13 -7 12 -9 1 16 17 -1 2 6 -9 2 14
7986 14 6 -4 12 -11 -19 23 18 5 14 4 -4 3 10 -2 -3 10 -19 -4 17 -2 -5 14 -3 -8 13 1 -9 0 8 -10 8 17 2 -2 3 -10 -3 13
8024 13 7 -17 12 -7 -15 4 25 -3 13 8 -14 15 15 -1 1 12 6 10 12 -3 5 18 4 -7 18 18 -5 10 5 -22 1 11 -3 -2 14 1
8060 1 2 13 -3 3 8 -5 -3 9 13 8 13 10 -9 0 11 -14 3 11 -10 -8 13 0 -5 7 -6 -14 14 11 -5 9 5 -15 -5 5 0 11 8 -7 -2 14
8100 14 4 -4 6 4 -14 4 19 0 12 15 -5 -1 12 0 -4 12 -4 -2 17 0 -9 3 -3 4 0 -9 0 -3 7 0 -3 0 1 6 8 -4 11 8 -3 -7 18
8141 18 -5 -29 -4 6 -17 7 7 1 10 17 -15 -11 16 -19 3 8 -5 0 14 13 1 7 3 -2 1 15 7 2 11 -5 15 5 8 -4 10 -3 -6 6 -3
8180 -3 4 17 1 -18 -3 1 -1 0 -10 -6 7
$$ packed form
7948A7j7jQk1PJ8J0l4JJ9rNJ6k7JJ8j6MK5j0j5MoKK0ok0J9k1J0J5Jj8LMj5J1J2
7986A4qj0J6k3qM2nj3Rj0qPPj2jJ3k9J5K1j9lJ9j7nK1j2j0RQj8J8Rj5mNj3PJ6
8024A3ok4K9j9qJ9K1k8J6nk2K9%j6KJ1oMKj5QJ3j4j1K5%k3J5nk7K3J0j4JJ6j3
8060AJJ1j6ONj3KJ2MnNlj9RJ1k5J7Qk1KK1j3nJ2j3qK8lj6J4mk0J0J0nJ1lj5NJ6
8100A4j0qJ0kj8J8J5j9J2Lk0MJ3j2mJ6j6KJ9j7rJ2oPmrRlJ0plLJNKj2J5lj1mK5
8141A8k3k4K5J0k3K4%oRPl2MK7l5K2Nj3NJ4jj2OmnLJ4qnRj6K0j0Lj2J4j3lJ2r
8180cPJ3j6j9J5MkJj0MJ3
8191G
$$ Imaginary data points
##PAGE= N=2
##DATA TABLE= (X++(I..I)), XYDATA
$$ plain form
0 0 0 0 0 0 0 0 0 0 0 8 -8 8 -8 8 -16 16 -16 24 -24 32 -34 41 -48 56 -65 73 -82 97 -106 121 -137 155 -172
33 -172 194 -216 240 -268 298 -330 366 -403 451 -499 549 -610 676 -749 838 -935 1047 -1179
51 -1179 1339 -1534 1779 -2094 2523 -3134 4096 -5816 9826 -37116 9136 68725 -42017 5050
65 5050 59761 -36780 -60537 39886 15683 -25551 24026 15769 -36835 1858 19997 -11424
77 -11424 4263 10976 -29148 -5914 32106 3231 -9666 12720 -12758 -33886 5108 33494
89 33494 11996 -8115 -3693 -3619 -24889 -13894 38104 28081 -31054 -8133 25419 -29035 -24656
102 -24656 51916 11632 -51194 14142 32044 -35763 -150 43219 -27376 -33079 30696 1702
114 1702 -14557 36412 315 -45785 9947 13185 -27638 28639 41282 -43864 -24356 36020
$$ packed form
0@%%%%%%%%%Qj6J6j6J6k4L2l2M0m8N6o6P5q9J04j21J38j55J79k03K27k58K92l27
33a72L66m10M56n08N66o28O96p69Q54r50J048j159J286j425J587j773J982k226
51a179K518k873L313l873M617n657P230r912J5642m6942M6252N9589j10742M7067
65E050N4711r6541k3757J00423k4203m1234M9577q257n2604L8693J8139l1421
77a1424J5687O713m0124K3234L8020k8875j2897K2386k5478k1128L8994K8386
89C3494k1498k0111M422P4k1270J0995N1998j0023n9135K2921L3552n4454M379
102b4656P6572m0284o2826O5336J7902o7807L5613M3369p0595n703O3775k8994
114A702j6259N0969l6097m6100N5732L238m0823N6277J2643q5146J9508O0376
$$ plain form
126 36020 -18583 -26032 50363 14941 -49017 4872 27773 -24945 -7037 31315 -5544 -24863
138 -24863 7798 14079 -1947 -3314 -573 -2019 -7664 -3827 16396 12656 -13014 -7609 3333 -10224
152 -10224 130 19351 665 -7587 3074 -12100 -7026 21618 -293 -16629 17769 2326
164 2326 -31073 16079 29083 -31332 -11045 35475 -15454 -26825 36832 10633 -39480 8200
176 8200 22780 -24475 -805 29570 -12281 -17980 14080 -2602 -9406 16326 1406 -14576 7660
189 7660 2165 -13250 10248 11414 -15479 -3257 12624 -6090 -6059 11495 1503 -10953 -1518 6449
203 6449 3429 -3226 -2770 5321 -2020 -11237 8617 14083 -13638 -7816 15441 -6072 -13788 18497
217 18497 8036 -20279 2221 11012 -13153 1634 17077 -9743 -9036 11017 -6088 -6716 17403
$$ packed form
126C6020n4603p449P6395l5422o3958N3889K2901n2718J7908L8352l6859j9319
138b4863L2661O281j6026j367K741j446n645L837K0223l740k5670N405J0942j3557
152a0224J0354J9221j8686q252J0661j5174N074K8644k1911j6336L4398j5443
164B326l3399M7152J3004o0415K0287M6520n0929j1371O3657k6199n0113M7680
176H200J4580m7255K3670L0375m1851n699L2060j6682o804K5732j4920j5982K2236
189G660n495j5415K3498J166k6893J2222J5881j8714L1J7554r992j2456R435P967
203F449l020o655M56Q091p341r217J9854N466k7721N822K3257k1513p716L2285
217A8497j0461k8315K2500Q791k4165J4787J5443k6820P07K0053j7105o28K4119
$$ plain form
230 17403 -1247 -16832 10403 5379 -16748 9098 16655 -17612 -8600 16470 -4699 -9600 16032
243 16032 3407 -17533 237 8645 -3701 1667 7042 -4177 -6584 -703 1480 4758 3007 -3051
257 -3051 -1534 -1773 -4203 4225 7226 -2730 -3503 -258 -3957 1706 7655 -1430 -3001 1672 -6538 -3049
273 -3049 12094 2098 -8631 4517 286 -13184 5755 15116 -7478 -6236 8090 -6706 -8729
286 -8729 13427 6340 -10187 1057 2579 -9053 2437 10683 -3092 -3761 2559 -5688 -2913 9466
300 9466 2526 -5074 1092 -1853 -6150 4513 7558 -2171 -3012 -173 -3321 -1143 4883 3974 -727
315 -727 -3964 -3417 518 1825 2062 4239 -803 -7740 -1617 4576 299 1754 4669 -4691 -7169 2944
331 2944 2792 -741 4949 1154 -8293 -1829 4326 -692 2396 5286 -5470 -6666 3810 1966 -1207
$$ packed form
230A7403j8650j5585K7235n024k2127K5846P557l4267R012K5070k1169m901K5632
243A6032j2625k0940J7770Q408j2346N368N375j1219k407N881K183L278j751o058
257c051J517k39k430Q428L001r956p73L245l699N663N949r085j571M673q210L489
273c049J5143r996j0729J3148m231j3470J8939R361k2594J242J4326j4796k023
286h729K2156p087j6527J1244J522j1632J1490Q246j3775o69O320q247K775J2379
300I466o940p600O166k945m297J0663L045r729q41K839l148K178O026r09m701
315g27l237N47L935J307K37K177n042o937O123O193m277J455K915r360k478J0113
331B944j52l533N690l795r447O464O155n018L088K890j0756j196J0476j844l173
$$ plain form
346 -1207 5283 962 -8296 -1686 4450 -151 1819 4489 -3917 -6544 1089 2840 1538 3431 -4
361 -4 -5411 -2992 1448 2622 3181 1346 -2850 -3846 -1498 1716 3922 2405 -1270 -3184 -3336 -469 4297
378 4297 3868 -757 -2356 -2913 -3027 2316 5823 1000 -2435 -1748 -3555 -1686 5315 4617 -1520 -2232 -2561
395 -2561 -3699 2043 6402 1351 -2642 -2173 -3356 -1119 4980 4176 -1182 -2377 -2772 -2841 2063 5380
411 5380 1751 -2131 -3136 -3183 -112 4325 3905 -268 -3297 -3661 -1203 2578 3989 2038 -1643 -4199
427 -4199 -2721 1225 3391 3185 711 -3581 -4443 -234 3078 3221 2093 -1667 -4948 -2196 2351 3024
443 3024 2445 601 -3725 -4150 491 3036 2695 1874 -1768 -4787 -1799 2433 3096 2388 -195 -3959 -3186
460 -3186 937 2750 2627 1236 -2402 -3793 -791 1873 2672 2311 -848 -3741 -2145 902 2454 2845
$$ packed form
346a207O490m321r258O610O136m601J970K670q406k627P633J751j302J893l435
361dn407K419M440J174N59j835m196r96K348L214K206j517l675j914j52K867M766
378D297m29m625j599n57j14N343L507m823l435O87j807J869P001o98o137p12l29
395b561j138N742M359n051l993M69j183K237O099q04n358j195l95o9M904L317
411E380l629l882j005m7L071M437m20m173l029l64K458L781J411j951l681k556
427d199J478L946K166k06k474m292q62M209L312J43j128l760l281K752M547O73
443C024n79j844m326m25M641K545l41q21l642l019K988M232O63p08k583l764P73
460c186M123J813j23j391l638j391L002K664P99l61l159k893J596L047J552L91
$$ plain form
476 2845 388 -3177 -2710 62 1536 2714 1816 -2086 -3153 -641 678 1834 2907 -209 -3478 -1752
492 -1752 487 1198 2677 1313 -2750 -2609 139 827 1902 2149 -1388 -2903 -373 500 892 2511 370
509 370 -2941 -1442 625 618 1886 1444 -2109 -2371 248 933 1475 1531 -1229 -2234 -309 251 1090 2362
527 2362 -297 -2590 -494 168 -207 2356 1591 -2641 -1615 1048 -141 785 2119 -1529 -2516 1032
543 1032 796 54 2048 -453 -3483 -33 1617 -196 2091 1887 -3666 -2828 1815 631 533 3030 -764
560 -764 -4059 -116 1637 -8 1343 789 -2336 -1016 1149 538 1184 485 -2782 -1601 1540 1076 1656
577 1656 1912 -2735 -4132 284 1769 1697 3047 -113 -3942 -1862 -58 521 3472 1946 -2870 -1284
593 -1284 359 -1836 1556 3902 -2697 -3511 2725 866 -1232 3481 269 -6187 -1039 3464 451
$$ packed form
476B845k457l565M67K772J474J178q98l902j067K512J319J156J073l116l269J726
492a752K239P11J479j364m063J41K748O88J075K47l537j515K530Q73L92J619k141
509C70l311J499K067pJ268m42l553k62K619O85N42N6k760j005J925N60Q39J272
527B362k659k293K096O62l75K563p65m232J026K663j189R26J334l648r87L548
543A032k36p42J994k501l030L450J650j813K287k04n553Q38M643j184r8K497l794
560g64l295L943J753j645J351n54l125J320K165o11O46o99l267J181L141m64N80
577A656K56m647j397M416J485p2J350l160l829K080J804N79K951j526m816J586
593a284J643k195L392K346o599q14O236j859k098M713l212o456N148M503l013
$$ plain form
608 451 2405 3211 -4064 -4968 339 471 2223 5466 -459 -5105 -939 -571 -1323 4305 3326 -3774 -1786
625 -1786 1809 -1257 -21 2989 -1329 -3346 563 1661 1807 2155 -1686 -3731 -1514 -724 2375 6196
641 6196 855 -4883 -1874 -1475 -2623 4257 6069 -1745 -2737 -123 -3152 -776 4609 818 -1967 891
657 891 -1305 -1439 3976 451 -4664 624 1283 -2778 3658 5724 -4464 -4766 1700 -1957 -1176 7213
673 7213 3208 -4750 -2049 -1146 -2829 2690 4523 -393 -647 -895 -3504 723 3350 -1518 -613 2406
689 2406 -2253 -1652 4343 513 -3982 33 211 -1569 2996 3352 -1496 -1721 -2106 -2688 2609 3688 -812
706 -812 1022 793 -5737 -1730 5477 -87 -2043 4037 -745 -5566 2285 3409 -3099 36 2241 -2600
722 -2600 -30 3262 -1359 -1013 1347 -2994 -989 4717 -116 -2334 2977 -1287 -5484 2797 4210
$$ packed form
608D51J954Q06p275r04N307J32J752L243n925m646M166L68p52N628r79p100J988
625a786L595l066J236L010m318k017L909J098J46L48l841k045K217P90L099L821
641F196n341n738L009L99j148O880J812p814r92K614l029K376N385l791k785K858
657H91k196j34N415l525n115N288O59m061O436K066j0188l02O466l657P81Q389
673G213m005p958K701R03j683N519J833m916k54k48k609M227K627m868R05L019
689B406m659O01N995l830m495M015J78j780M565L56m848k25l85n82N297J079m500
706h12J834k29o530M007P207n564j956O080m782m821P851J124o508L135K205m841
722b600K570L292m621L46K360m341K005N706m833k218N311m264m197Q281J413
$$ plain form
737 4210 -2748 264 2766 -3531 -2216 3193 238 -913 1653 -969 -1342 1530 -834 -692 2818 -1309
753 -1309 -3108 3174 1351 -3603 1769 2413 -4209 -486 4083 -1429 -1565 2687 -1067 -2159 1972 -179
769 -179 -1001 2560 -841 -2742 2695 411 -3518 2762 2514 -4680 141 4383 -3022 -2182 4337 -600
785 -600 -3351 2547 845 -2720 1361 1159 -1892 988 555 -2147 1515 1337 -3005 938 2891 -3133
801 -3133 -1134 3719 -1375 -2432 3220 222 -3232 1493 1413 -1899 801 895 -1712 853 702 -2143
817 -2143 1403 1864 -3069 86 3228 -2586 -1556 4119 -991 -3749 2874 1547 -3097 1393 1990 -2952
833 -2952 -274 1965 -1440 431 2218 -1973 -853 1898 -2069 -944 3942 -530 -3044 2473 591
848 591 -3657 1461 2609 -2591 -202 2639 -1386 -1183 1482 -939 -885 1404 -440 49 2132 -1376
$$ packed form
737D210o958L012K502o297J315N409k955j151K566k622l73K872k364J42L510m127
753a309j799O282j823m954N372O44o622L723M569n512j36M252l754j092M131k151
769a79q22L561l401j901N437k284l929O280k48p194M821M242p405Q40O519m937
785f00k751N898j702l565M081k02l051K880m33k702L662j78m342L943J953o024
801c133J999M853n094j057N652k998l454M725q0l312K700R4k607K565j51k845
817b143L546M61m933L155L142n814J030N675n110k758O623j327m644M490N97m942
833b952K678K239l405J871J787m191J120K751l967J125M886m472k514N517j882
848E91m248N118J148n200K389K841m025K03K665k421N4K289j844M89K083l508
$$ plain form
864 -1376 -2194 1542 -472 -1779 3083 1758 -2954 58 1216 -2762 -303 2906 -336 -379 1577 -1524
880 -1524 -1611 1345 -730 -776 2689 83 -1869 1984 -3 -3806 893 2556 -1861 626 3300 -1943
896 -1943 -2549 1426 -775 -1529 2735 1601 -1208 467 -600 -2529 581 1265 -774 1598 1910 -2070
912 -2070 -1094 837 -1873 -797 2909 792 -927 1123 -462 -2481 -163 546 -29 1824 1187 -1113
928 -1113 -313 -661 -2115 602 1934 -463 763 1956 -1846 -2258 852 -488 -849 2584 1472 -1315
944 -1315 174 -347 -2588 -30 1749 87 1215 1564 -1962 -1712 711 -906 -540 2602 866 -1300
960 -1300 706 -123 -2464 -28 1501 -354 561 1681 -604 -1174 -172 -1140 -540 1619 1063 233 564
977 564 -1092 -1928 73 438 24 1573 1112 -1192 -782 -217 -1075 227 1445 23 -54 742 -690 -928
$$ packed form
864a376q18L736k014j307M862j325m712L012J158l978K459L209l242m3J956l101
880a524q7K956k075m6L465k606j952L853j987l803M699J663m417K487K674n243
896a943o06L975k201p54M264j134k809J675j067j929L110O84k039K372L12l980
912b070R76J931k710J076L706k117j719K050j585k019K318P09n75J853o37k300
928a113Q00l48j454K717J332k397J226J193l802m12L110j340l61L433j112k787
944a315J489n21k241K558J779j662J128L49l526K50K423j617L66L142j736k166
960a300K006q29k341K436J529j855R15J120k285n70J002r68O00K159n56q30L31
977E64j656q36K001L65m14J549m61k304M10N65q58J302J218j422p7P96j432k38
$$ plain form
995 -928 355 -503 -554 1447 784 -653 490 -95 -1906 -213 1208 -67 645 1469 -989 -1724 205
1012 205 10 -210 1408 691 -981 -135 63 -920 154 887 -250 -36 586 -386 -311 483 -420 -691 482
1031 482 419 104 574 -186 -1024 -221 167 29 747 529 -573 -324 -156 -650 365 1048 -210 -386 268
1050 268 -520 -390 925 126 -817 327 325 -666 310 683 -702 -354 513 -367 -189 994 48 -820 76
1069 76 14 -381 658 605 -648 -303 259 -287 36 672 -40 -396 43 -153 -188 432 331 -159 -195 -262 -85
1090 -85 380 167 -102 37 -247 -268 405 175 -373 214 161 -631 75 669 -286 -204 416 -511 -513 877 307 -642
1112 -642 254 103 -847 257 839 -486 -199 675 -502 -685 723 299 -523 353 215 -768 82 743 -252
1131 -252 -329 338 -79 -297 330 223 -258 -68 107 -103 -102 185 282 -87 -341 24 114 -153 258 373 -515 -301
$$ packed form
995i28J283q58n1K001o63j437J143n85j811J693J421j275P12Q24k458p35J929
1012B05j95k20J618p17j672Q46J98r83J074P33j137K14O22r72P5P94r03k71J173
1031D82o3l15M70p60q38Q03L88j38P18k18j102K49J68m94J015O83j258j76O54
1050B68p88J30J315p99r43J144kr91R76L73j385L48Q67q80J78J183r46q68Q96
1069G6o2l95J039n3j253L45N62n46L23O36p12l56M39j96l5O20j01m90l6o7J77
1090h5M65k13k69J39k84k1O73k30n48N87n3p92P06N94r55Q2O20r27kJ390n70r49
1112f42Q96j51r50J104N82j325K87Q74j177j83J408m24q22Q76j38r83Q50O61r95
1131b52p7O67m17k18O27j07m81J90J75k10JK87R7l69k54L65R0k67M11J15q88K14
$$ plain form
1153 -301 569 -127 -458 623 168 -814 280 540 -757 53 943 -637 -707 869 -1 -741 736 296
1171 296 -1099 249 842 -728 -209 917 -390 -672 674 76 -658 513 439 -752 -150 594 -140 -236
1189 -236 348 -5 -396 76 339 -123 -250 259 220 -457 -106 576 -123 -449 552 72 -881 468 833 -882
1209 -882 -267 1058 -568 -775 1223 57 -1265 872 740 -1504 146 1405 -987 -624 1404 -468
1225 -468 -1167 1305 405 -1486 502 983 -1123 -113 1188 -615 -709 951 -30 -915 547 614 -609
1242 -609 -167 428 -205 -315 375 342 -353 -279 479 112 -704 235 786 -660 -386 1064 -345 -1014 1167
1261 1167 408 -1610 565 1337 -1431 -256 1759 -1059 -1221 1937 -18 -1926 1411 1047 -2137 343
1277 343 1785 -1620 -576 2161 -817 -1654 1725 422 -1817 859 1105 -1549 -63 1409 -831 -725
$$ packed form
1153c01Q70o96l31J081m55r82J094K60j297Q10Q90j580p0J576q70p40J477m40
1171B96j395J348N93j570N19J126j307k82J346n98p34J171p4j191O02P44p34r6
1189b36N84l53l91M72K63m62j27N09l9o77L51O82o99l26J001m80r53J349L65j715
1209h82O15J325j626k07J998j166j322K137j32k244J650J259k392L63K028j872
1225d68o99K472r00j891J988M81k106J010J301j803r4J660r81q85J462O7j223
1242f09M42N95o33j10O90l3o95P4P58l67q16R39N51j446K74J450j409o69K181
1261A167p59k018K175P72k768J175K015k818j62L158j955j908L337l64l184K480
1277C43J442l405J044K737k978q37L379j303k239K676K46k654J486J472k240J06
$$ plain form
1293 -725 1181 -10 -947 422 432 -481 -4 412 -126 -386 90 495 -192 -590 536 417 -955 191
1311 191 1094 -997 -578 1600 -528 -1552 1701 739 -2191 764 1672 -2173 -304 2622 -1315 -1696
1327 -1696 2520 -46 -2594 1716 1354 -2530 570 2171 -2101 -777 2515 -929 -1735 2015 232
1342 232 -1976 1220 1084 -1907 75 1524 -1025 -619 1325 -137 -938 459 269 -562 15 524 162
1359 162 -491 -335 615 54 -865 612 777 -1272 -64 1480 -1059 -969 1984 -217 -1971 1582 907
1376 907 -2315 846 1918 -2316 -404 2770 -1442 -1794 2671 -170 -2633 2103 1358 -2904 680 2307
1392 2307 -2429 -810 2823 -818 -1668 2076 -16 -2298 1140 1215 -1517 311 1356 -1043 -584 831
1408 831 -431 -468 753 197 -237 60 -118 -60 -231 -445 600 559 -567 453 528 -1647 -344 1631 -780
$$ packed form
1293g25J906j191r37J369J0r13M77M16n38k60M76M05o87l98J126j19j372J146
1311A91R03k091M19K178k128j024L253r62k930K955R08l845J869K926l937l81
1327a696M216k566k548M310l62l884L100J601m272J324L292l444q06L750j783
1342B32k208L196j36k991J982J449k549M06J944j462q01J397j90q31N77N09l62
1359A62o53J56R50n61r19J477J65k049J208J544k539R0K953k201j754L553o75
1376I07l222L161J072m234J912L174m212l52M465k841k463M736p45m262L584J627
1392B307m736J619L633l641q50L744k092k282L438P5k732J828J045k399M59J415
1408H31j262l7J221n56m34K97j78N8j71k14J045m1j126J020P5k175J303J975k411
$$ plain form
1427 -780 -623 2334 -287 -2393 1289 606 -2535 1262 2654 -2088 -634 2468 -1800 -2149 2588 205
1443 205 -2067 2369 1360 -2989 123 1584 -2308 -210 3022 -563 -1172 1812 -881 -2648 1115
1458 1115 1235 -906 1139 1369 -1533 -1024 348 -696 -174 1274 735 133 -226 -884 -526 -325 -414 1085
1476 1085 1300 -407 176 331 -2130 -1082 1673 85 -108 2395 -124 -2667 376 206 -2167 1514
1492 1514 2979 -1335 -518 1643 -2378 -2216 2500 459 -1404 2653 1261 -3081 -333 998 -2278
1507 -2278 133 3300 -60 -930 1344 -1245 -2710 738 1129 -139 1684 1212 -1644 -1215 -295 -929
1523 -929 324 1616 753 336 -90 -1332 -1010 -257 -163 1146 1504 -154 -48 54 -2018 -1194 1381 317
1541 317 204 2341 -51 -2642 -41 131 -1850 1303 2860 -842 -542 1193 -2108 -2102 2007 704 -909
$$ packed form
1427g80J57K957k621k106L682o83l141L797J392m742J454L102m268l49M737k383
1443B05k272M436j009m349L112J461l892K098L232l585o09K984k693j767L763
1458A115J20k141K045K30k902N09J372j044N22J448n39o02l59o58L58K01q9J499
1476A085K15j707N83J55k461J048K755j588j93K503k519k543L043j70k373L681
1492A514J465m314Q17K161m021J62M716k041j863M057j392m342K748J331l276
1507b278K411L167l360q70K274k589j465L448L91j268J823m72k856M29R20o34
1523i29J253J292q63m17m26j242L22P53R4J309L58j658J06J02k072Q24K575j064
1541C17j13K137k392k591K601J72j981L153J557l702L00J735l301OM109j303j613
$$ plain form
1558 -909 2099 942 -2497 -309 671 -1883 214 2692 -86 -630 1128 -1177 -2144 732 741 -271 1530
1575 1530 1046 -1362 -885 -271 -866 406 1355 369 245 49 -1137 -680 67 -284 686 1296 -284 -368 330
1594 330 -1150 -968 1026 236 -234 1549 250 -1834 -37 331 -1291 717 1921 -744 -491 1051
1610 1051 -1248 -1435 1466 469 -876 1281 556 -1752 79 849 -1210 -8 1557 -395 -472 976
1626 976 -620 -1146 792 277 -581 859 498 -907 -40 136 -747 315 837 -319 -32 307 -694 -190
1644 -190 599 -338 -77 753 -356 -488 598 -271 -592 797 101 -835 623 426 -988 217 644 -863
1662 -863 66 1028 -705 -543 932 -344 -715 986 124 -925 595 304 -1061 363 879 -695 -45
1679 -45 694 -761 -381 905 -231 -477 804 -16 -737 452 97 -686 468 483 -602 167 450 -641
$$ packed form
1558i09L008j157l439K188R80k554K097K478k778n44J758k305r67K876Rj012J801
1575A530m84k408M77O14n95J272R49r86j24j96j186M57P47l51R70O10j580q4O98
1594C30j480J82J994p90m70J783j299k084J797L68j622K008J204k665K53J542
1610A051k299j87K901r97j345K157p25k308J831P70k059J202J565j952p7J448
1626I76j596n26J938n15q58J440l61j405Q67J76q83J062N22j156K87L39j001N04
1644a90P89r37K61Q30j109j32J086q69l21J389o96r36J458j97j414J205M27j507
1662h63R29R62j733J62J475j276l71J701q62j049J520k91j365J424N16j574O50
1679d5P39j455L80J286j136k46J281q20p21J189l55p83J154J5j085P69K83j091
$$ plain form
1697 -641 -119 467 -424 -8 772 -258 -447 390 -310 -454 646 128 -425 535 98 -829 186 357 -544
1716 -544 318 644 -632 -144 588 -554 -391 743 -142 -392 772 -56 -848 418 260 -733 405 635
1734 635 -608 44 556 -730 -327 802 -167 -357 693 -106 -653 456 118 -631 392 473 -499 67
1752 67 353 -536 -70 514 -303 -147 524 -170 -300 325 -175 -305 485 35 -386 313 32 -451 284 165
1772 165 -484 285 396 -557 -5 481 -455 -101 636 -375 -398 701 -110 -642 546 193 -657 393 394 -740
1792 -740 106 652 -538 -188 676 -305 -393 586 -121 -520 546 222 -532 229 239 -458 152 351 -370 15
1812 15 395 -263 -112 261 -246 -70 377 -198 -167 391 -155 -289 343 -107 -339 506 122 -549 268 237 -585
1833 -585 175 483 -508 -17 642 -455 -412 603 -135 -449 582 76 -617 396 281 -639 133 482 -409
$$ packed form
1697f41N22N86q91M16P80j030j89Q37p00j44J100n18n53R60m37r27J015J71r01
1716e44Q62L26j276M88P32j142J63J134q85k50J164q28p92J266j58r93J138K30
1734F35j243O52N12j286M03J129r69j90J050p99n47J109l38p49J023Q1r72N66
1752F7K86q89M66N84q17J56O71o94j30O25n00j30P90m50m21O99k81m83P35j19
1772A65o49P69J11r53N52M86r36L54P37j011k3J099q11n32J188l53q50J050Jj134
1792g40Q46N46j190L50Q64r81q8R79p07l99J066l24p54P61J0o97O10J99p21L85
1812A5L80o58J51L73n07J76M47n75L1N58n46j34O32m50k32Q45l84o71Q17l1q22
1833e85P60L08r91M91O59j097M3J015p38l14J031n06o93J013j15r20P72L49q91
$$ plain form
1852 -409 -15 472 -390 -230 489 -174 -277 418 -34 -262 333 -68 -385 336 125 -348 263 159 -434 215
1872 215 247 -526 114 500 -427 -118 524 -385 -277 646 -194 -526 595 126 -651 384 291 -667 201 527
1892 527 -592 -98 645 -346 -324 513 -177 -389 521 44 -470 311 153 -390 206 174 -338 209 237 -384 81
1913 81 272 -311 113 351 -446 -16 544 -378 -203 622 -269 -416 680 -66 -685 647 309 -842 327
1932 327 598 -784 44 830 -670 -394 953 -244 -678 757 84 -811 529 406 -832 220 648
1949 648 -628 -159 619 -344 -252 559 -207 -407 416 10 -301 296 -18 -263 279 -32 -317 340 47 -359
1969 -359 348 37 -560 421 376 -697 178 600 -713 -74 873 -565 -464 1027 -255 -912 904 281
1987 281 -1022 625 634 -1165 143 1070 -834 -357 1138 -463 -770 982 -28 -962 752 438 -955
$$ packed form
1852d09L94M87q62J60P19o63j03O95m52k28N95m01l17P21k11m73O11j04n93O49
1872B15L2p73O40L86r27L09O42r09J08R23q40l32J121m69p77J035r3r58Q68L26
1892E27j119M94P43r91K2Q37o90k12R10m77n14P81j58n43N96l2n12N47K8o21M65
1913H1J91n83M24K38p97M30N60r22J75Q25q91j47J096p46o19J332l38j151J169
1932C27K71j382Q28P86j500K76J347j197m34J435o73q95J340j23j238J052M28
1949F48j276M69P78r63R2Q11p66k00Q23m06l11N97l14k45N42l11k85O57k93m06
1969c59P07l11n97R81m5j073Q75M22j313O39R47j438J01J491j282o57J816o23
1987B81j303J647Rj799J308R27j904M77J495j601l07J752j010r34J714l14j393
$$ plain form
2004 -955 282 649 -721 -20 649 -531 -233 705 -188 -351 395 -190 -345 385 -41 -178 438 -136 -410
2023 -410 314 -140 -343 696 123 -707 446 253 -889 358 711 -863 45 1031 -785 -537 1151 -400
2041 -400 -955 1114 194 -1114 910 668 -1468 92 1038 -966 -66 1451 -633 -886 976 -308 -1058
2058 -1058 1058 599 -910 418 433 -1076 14 794 -510 -84 751 -314 -341 407 -386 -386 484 -33 -67
2077 -67 593 -169 -482 235 -398 -469 923 349 -540 499 -66 -1257 353 844 -740 361 1157 -1053
2095 -1053 -720 1055 -566 -796 1465 182 -1264 932 598 -1577 196 1021 -1115 48 1668 -614
2111 -614 -888 974 -517 -1219 1122 739 -734 630 404 -1400 -238 798 -336 198 928 -413 -537
2128 -537 299 -382 -313 598 63 -76 479 -267 -431 335 -375 -479 798 248 -403 724 -61 -1375 265
$$ packed form
2004i55J237L67j370P01O69j180K98R38q93j63P46n85j55P30m26j37O16n74k74
2023d10P24m54k03J039n73q30J153j93j142J247L53j574R08R86j816K48J688j551
2041d00n55K069r20j308K024k42k136J560R46k004R00J517k084k53J862j284p50
2058a058K116m59j509J328J5j509J090P80j304M26Q35j065k7P48p93%Q70n17l4
2077f7O60p62l13P17o33p1J392n74q89J039n65j191J610M91j584J101P96k210
2095a053L33J775j621k30K261j283j446K196l34k175J773Q25k136J163J620k282
2111f14k74J862j491p02K341l83j473J364k26j804J162J036j134N34P30j341j24
2128e37Q36o81O9R11n35j39N55p46j64P66p10j04J277n50o51J127p85j314J640
$$ plain form
2147 265 670 -771 565 1268 -1073 -686 941 -800 -769 1701 280 -1254 861 352 -1611 460 1171
2164 1171 -1155 -12 1489 -779 -795 1165 -403 -1150 1057 456 -924 725 620 -1229 -207 659
2180 659 -513 115 1013 -320 -558 289 -331 -329 558 121 -93 342 -313 -413 384 -118 -294 613 -55 -575
2200 -575 653 152 -965 387 503 -908 329 1011 -900 -350 1040 -744 -798 1326 68 -1069 945
2217 945 298 -1477 501 1085 -1101 -31 1249 -862 -690 1219 -260 -914 1014 250 -1098 491
2233 491 586 -864 182 680 -694 -135 735 -378 -317 557 -191 -327 437 -99 -305 401 -26 -329 322
2252 322 -72 -322 450 6 -544 429 176 -665 366 451 -761 149 728 -791 -301 1010 -378 -616 937
2271 937 -138 -989 782 454 -1021 412 758 -1013 -109 990 -615 -349 1057 -379 -901 827 207
$$ packed form
2147B65M05j441J336P03k341L87J627j741L1K470j421j534K115n09j963K071P11
2164A171k326J143J501k268j6J960j568p47K207o01j380J649j05j849J022Q66
2180F59j172O28Q98j333k38Q47o20KQ87m37k14M35o55j00P97n02j76R07o68n20
2200e75J228n01j117J352J16j411J237O82j911N50J390j784n4K124j258j137K014
2217I45o47j775J978N84k186J070J280k111J72J909j479o54J928p64j348J589
2233D91R5j450J046M98j374N59Q70j113O1Q74p48j36P64n36k06P06m27l03O51
2252C22l94k50P72m44n50R73k53q41J031Q5j212R10N79j519M90J311j388k38J553
2271I37j075q51J771l28j475J433L46j771R04J099j605K66J406j436n22J728o20
$$ plain form
2288 207 -756 601 397 -931 136 657 -558 -16 677 -410 -359 487 -169 -205 516 -109 -423 304 25
2307 25 -190 434 -80 -554 256 147 -311 471 275 -692 -45 225 -529 274 884 -411 -438 377 -510 -406
2327 -406 969 160 -683 499 134 -914 335 657 -731 -20 769 -522 -257 880 -308 -834 435
2344 435 87 -387 842 473 -853 -219 107 -568 314 973 -112 -272 118 -649 -425 670 307 -86 336
2363 336 -188 -540 227 127 -336 231 189 -262 352 324 -526 -169 45 -546 182 964 39 -244 85 -819 -707
2384 -707 774 611 -50 493 -120 -1120 -113 470 -212 380 755 -507 -480 402 -274 -378 545 5 -417
2403 -417 625 451 -523 -105 -69 -691 179 915 187 56 120 -774 -690 330 367 376 668 -173 -794 -167 -47
2424 -47 -109 558 380 -325 42 107 -468 -37 290 -312 -31 553 13 -83 282 -475 -714 275 365 111 612 98
$$ packed form
2288B07r63J357k04j328J067N21j215N42O93j087N1Q46o56l6P21o25l14P27k79
2307B5k15O24n14m74Q10j09m58P82j96r67O47K70p54Q03O10j295k7Q15q87J04
2327d06J375q09q43J182l65j048J249L22j388P11P89j291K65J137j188n26J269
2344D35l48m74J229l69j326O34L26o75Q82O59j085j60L90p67K24J095l63l93M22
2363C36n24l52P67j00m63N67m2m51O14k8q50L57K14n91P28P82r25k83L29r04J12
2384g07J481j63o61N43o13j000J007N83o82N92L75j262K7Q82o76j04R23n40m22
2403d17J042j74r74M18L6o22Q70P36p28j31O4q94Q4J020L7RK92q41o21O27J20
2424d7o2O67j78p05L67O5n75M31L27o02K81N84n40r6L65p57k39R89R0k54N01n14
$$ plain form
2446 98 -875 -337 115 -213 435 804 -212 -444 -7 -406 -232 616 233 -267 213 11 -388 127 110 -372
2466 -372 108 357 -95 143 270 -413 -335 131 -107 131 658 38 -433 -48 -229 -275 485 391 -216 96 34
2487 34 -523 -43 380 -140 19 379 -259 -302 330 -41 -343 253 105 -290 262 238 -376 -80 182 -239 -16
2508 -16 360 -52 -104 147 -199 -260 208 106 -55 176 -42 -240 84 39 -147 188 145 -164 53 51 -254 116
2530 116 299 -162 -36 204 -248 -120 376 -69 -218 316 -35 -406 258 253 -298 123 214 -427 -76 460 -115
2551 -115 -189 287 -155 -336 332 174 -283 122 93 -396 -6 357 -17 -26 101 -303 -254 223 185 43 68 -161
2573 -161 -240 24 92 125 191 -82 -218 -14 -41 45 352 13 -351 7 81 -114 302 269 -427 -205 255 -135 40
2596 40 550 -116 -525 116 52 -213 498 418 -529 -277 190 -204 93 603 -114 -473 92 -19 -175 407 272
$$ packed form
2446I8r73N38M52l28O48L69j016k32M37l99J74Q48l83n00M80k02l99N15j7m82
2466c72M80K49m52K38J27o83P8M66k38K38N27o20m71L85j81m6P60r4o07L12o2
2487C4n57M80M23n20J59L60o38m3O32l71l02N96j48l95N52k4o14K96K62m21K23
2508a6L76m12n2K51l46o1M68j02j61K31k18j98L24m5j86L35m3l09K17kl05L70
2530A16J83m61J26K40m52J28M96m45j49N34l51l71O64nn51M21R1o41L51N36n75
2551a15p4M76m42j81O68j58m57M05k9m89L90L63l74rJ27m04M9M77l8j42K5k29
2573a61p9K64O8L3O6k73j36K04k7Q6L07l39l64L58P4j95M16l3o96K22M60l90J75
2596D0N10o66m09O41o4k65P11q0r47K52M67l94K97N10p17l59N65j11j56N82j35
$$ plain form
2617 272 -373 -179 33 -135 203 400 -114 -338 -118 -52 155 342 71 -181 -230 -219 100 345 113 12 -56
2638 -56 -426 -191 443 245 -73 115 -242 -505 284 492 -131 33 112 -539 -185 616 118 -160 270 -259 -621
2659 -621 355 524 -176 64 93 -620 -149 645 121 -162 181 -264 -504 293 409 -59 58 -63 -479 -122
2679 -122 362 230 71 -90 -355 -201 131 233 252 4 -367 -193 46 9 301 363 -329 -412 103 -44 52 584
2701 584 16 -665 -20 181 -212 378 510 -527 -394 328 -155 -83 707 30 -718 40 177 -277 399 516
2721 516 -542 -415 273 -68 -21 548 2 -538 -52 81 -84 323 292 -289 -296 -68 -11 236 269 -88 -233 -202
2743 -202 -103 243 250 -72 -48 -113 -366 89 436 -57 -84 147 -425 -326 603 242 -374 177 19 -638 201 676
2765 676 -286 -219 395 -384 -438 624 241 -411 216 54 -602 182 595 -232 -122 257 -362 -249 516 100
$$ packed form
2617B72o45J94K12j68L38J97n14k24K20O6K07J87k71k52m9J1L19K45k32j01o8
2638e6l70K35O34j98l18J88l57k63P89K08o23J64P9o51L54Q01m98k78M30n29l62
2659f21R76J69p00K40K9p13M71P94n24k83L43m45k40P97J16m68J17j21m16L57
2679a22M84j32j59j61k65J54L32J02J9k48l71J74K39l7K92O2o92q3N15j47R6N32
2701E84n68o81O45K01l93N90J32j037J33P22m83P2P90o77p48P58J37m54O76J17
2721E16j058J27O88l41M7N69n46n40M86J33j65M07l1n81pK28N7K47L3l57j45L1
2743b02R9L46Pl22K4o5k53M55L47m93k7K31n72R9R29l61o16N51j58o57Q39M75
2765F76r62O7O14p79n4J062l83o52O27j62o56P84M13q27J10L79o19J13P65m16
$$ plain form
2785 100 -287 180 -19 -403 131 338 -82 -52 18 -189 -59 147 106 59 -125 -208 110 91 -145 180 147 -382
2807 -382 -58 320 -196 -98 427 -165 -439 299 98 -347 288 214 -504 85 405 -399 -64 526 -281 -335 545
2828 545 -46 -536 438 275 -569 121 463 -408 -160 459 -144 -230 376 12 -318 135 82 -103 166 32 -216
2849 -216 71 60 -153 157 118 -236 -11 96 -138 112 194 -201 -100 20 -172 181 396 -268 -246 215 -283
2870 -283 -234 649 156 -558 175 136 -633 172 727 -283 -295 344 -250 -305 565 121 -461 134 71 -286 379
2891 379 366 -442 -151 169 -341 110 751 -26 -469 -16 -230 -263 541 524 -145 -199 -216 -268 157 288 101 149
2913 149 -167 -425 162 296 -213 45 169 -453 -72 701 70 -368 10 -347 -411 567 592 -75 58 -284 -854
2934 -854 33 658 87 271 356 -774 -676 509 199 -184 508 92 -679 96 454 -261 -114 159 -299 -35
$$ packed form
2785A00l87M67j99l84N34K07m20L0P0k07J30K06m1m7j84q3L18j9k36L25l3n29
2807c82L24L78n16R8N25n92k74P38k01m45O35p4p18N89L20q04L35N90q07n4Q80
2828E45n91m90R74j63q44O90L42q71K48O19o03q6O06l64l30M53n3j85K69j34k48
2849b16K87j1k13L10l9l54K25J07k34K50Q2l95J01J20j92L53K15o64K2M61m98
2870b83M9Q83m93p14P33l9p69Q05N55j010j2O39n94n5Q70m44n82N95o3l57O65
2891C79j3q08K91L20n10M51O41p77m43M53k14l3Q04j7o69n4j7n2M25J31j87M8
2913A49l16k58N87J34n09K58J24o22L81P73o31m38L78l57o4R78K5o67J33l42n70
2934h54Q87O25n71J84Q5j130R8J185l10l83O92m16p71P75L58p15J47K73m58K64
$$ plain form
2954 -35 540 212 -49 -118 -631 -378 517 507 269 318 -446 -940 -88 390 235 524 282 -551 -461 -42 -64 279
2976 279 383 -220 -146 228 -168 -63 322 -383 -572 481 456 -113 335 20 -982 -405 490 220 411 610
2996 610 -436 -858 -155 -38 176 786 221 -491 -86 -112 -426 286 438 -302 -27 409 -145 -146 264 -282 -474
3017 -474 199 324 249 390 -147 -643 -272 -61 125 746 423 -398 -241 -189 -515 177 746 44 -149 149 -310
3038 -310 -362 318 81 -264 225 147 -180 247 68 -545 -93 219 -181 280 627 -289 -505 55 -244 -211 662
3059 662 415 -331 -68 -58 -421 67 365 -31 70 167 -255 -106 167 -186 -84 294 -48 -104 367 -5 -417
3080 -417 47 62 -163 299 311 -206 -86 13 -289 55 315 -92 21 230 -299 -237 328 -48 -262 342 92
3101 92 -360 188 197 -423 -34 340 -158 -43 305 -198 -253 207 -50 -140 302 24 -316 107 64 -245 206 252
$$ packed form
2954c5N75l28k61o9n13K53Q95j0k38M9p64m94Q52M78j55K89k42q33R0M19k2L43
2976B79J04o03P4L74l96J05L85p05j89J053k5n69M48l15j002N77Q95k70J91J99
2996F10j046m22P03J17K14O10n65p12M05k6l14P12J52p40K75M36n54jM10n46j92
3017d74O73J25p5J41n37m96L71K11J86O21l23q21J57N2l26O92N69p02j93K98m59
3038c10n2O80k37l45M89p8l27M27j79o13M52L12m00M61L47r16k16N60k99L3Q73
3059F62k47p46K63J0l63M88K98l96J01R7m22J49K73l53J02L78l42n6M71l72m12
3080d17M64J5k25M62J2n17J20R9l02L44K60m07J13K09n29O2N65l76k14O04k50
3101I2m52N48Ro20L89L74m98J15L48n03n5M60k57r0M42k78l40M23m3l09M51M6
$$ plain form
3123 252 -307 -90 229 -136 -34 265 -88 -175 141 1 -60 179 -20 -147 113 -16 -91 273 57 -337 48
3144 48 138 -158 189 309 -308 -235 180 -95 -42 414 6 -311 67 -65 -240 306 236 -300 8 124 -297 53
3166 53 386 -245 -261 256 -47 -180 335 75 -382 -7 101 -117 207 294 -204 -206 -45 -152 135 357 -16 -137
3188 -137 -4 -210 -98 297 113 -104 83 -78 -200 168 180 -102 25 -20 -205 175 270 -143 -63 56 -277
3209 -277 -28 444 37 -189 145 -161 -374 244 341 -120 51 51 -383 -79 345 8 -68 149 -193 -226 242 86
3231 86 -145 130 -24 -317 95 266 -69 -5 52 -284 -113 260 97 -3 60 -190 -158 136 78 40 173 -97
3253 -97 -274 76 97 -36 205 90 -319 -82 173 -25 82 208 -203 -185 160 -7 -34 256 -23 -296 65
3274 65 69 -123 207 180 -306 -132 180 -65 16 250 -114 -264 72 29 -54 201 56 -226 -52 -8 -87 174 184
$$ packed form
3123B52n59K17L19l65J02K99l53q7L16j40o1K39j99j27K60j29p5L64k16l94L85
3144D8R0k96L47J20o17P3M15k75N3M56m08l17L78j32j75N46p0n36L08J16m21L50
3166E3L33o31j6N17l03j33N15k60m57L75J08k18L24Q7m98kJ61j07K87K22l73j21
3188a37J33k06J12L95j84k17J87j61j22L68J2k82J27m5j85L80R5m13Q0J19l33
3209b77K49M72m07k26L34l06k13O18R7m61J71%m34L04M24l37p6K17l42l3M68j56
3231H6k31K75j54k93M12J71l35O4N7l36J71L73j63j00O3k50L2K94n8l8J33k70
3253i7j77L50K1j33K41j15m09K37K55j98J07J26m11J8L45j67k7K90k79k73L61
3274F5Mj92L30k7m86J74L12k45Q1K34l64j50L36m3q3K55j45k82J74M4p9K61J0
$$ plain form
3297 184 -170 -108 31 -122 62 261 -57 -150 70 -68 -63 223 59 -143 34 -23 -131 186 185 -175 -43 61
3319 61 -185 65 315 -71 -165 106 -93 -149 239 142 -143 36 -6 -211 81 218 -76 -37 56 -189 -34 221
3341 221 -13 -108 79 -84 -154 149 93 -104 32 -29 -193 59 139 -39 20 -7 -210 7 171 -44 -6 109 -161
3364 -161 -136 189 27 -105 156 2 -241 77 155 -91 66 117 -215 -49 233 -38 -62 191 -96 -186 177 76
3386 76 -151 144 99 -232 -14 180 -64 10 143 -126 -128 129 26 -38 86 -38 -113 73 14 -58 97 11 -137
3409 -137 25 27 -80 85 72 -166 -21 96 -92 33 146 -135 -85 161 -67 -101 200 5 -193 121 82 -192
3431 -192 113 188 -196 -41 201 -98 -66 226 -52 -188 177 48 -175 137 130 -171 31 135 -139 -9 180
3452 180 -70 -92 110 -3 -64 97 -9 -85 79 15 -66 68 18 -82 49 2 -114 51 62 -105 32 70 -127
$$ packed form
3297A84l54O2J39j53J84J99l18r3K20j38NK86j64k02J77n7j08L17jl60J32J04
3319F1k46K50K50l86r4K71j99n6L88r7k85J79m2k05K92J37k94L9R3k45J55K55
3341B21k34r5J87j63p0L03n6j97J36o1j64K52Q0j78N9k7k03K17J64k15L8J15k70
3364a61K5L25j62j32K61j54k43L18P8k46J57N1l32J66K82k71k4K53k87r0L63j01
3386G6k27K95m5l31K18J94k44P4J33k69kK57j03o4J24j24p5J86n9p2J55q6j48
3409a37J62Kj07J65j3k38J45J17j88J25J13k81N0K46k28l4L01j95j98L14l9k74
3431a92L05P5l84J55K42k99L2K92k78j36L65j29k23L12pl01K02J04k74J30J89
3452A80k50k2K02j13o1J61j06p6J64o4q1J34n0j00J31m7j16J65J1j67J37L8j97
$$ plain form
3475 -127 21 112 -140 -34 162 -93 -99 179 -51 -180 176 60 -229 97 183 -205 -23 195 -145 -86 229 -40
3497 -40 -157 173 34 -151 108 85 -150 94 137 -151 -23 149 -88 -43 164 -5 -83 106 4 -119 32 37
3519 37 -11 50 -9 -44 63 -36 -91 93 6 -118 115 86 -199 -16 131 -151 -47 183 -39 -102 136 -65 -183
3542 -183 137 64 -135 139 98 -212 25 158 -199 -37 307 -65 -155 201 -12 -237 109 120 -148 59 181
3563 181 -83 -80 48 -60 -2 127 -7 10 78 -100 -84 56 -33 -19 160 38 -112 13 -15 -94 37 30 -42 107
3587 107 27 -158 22 38 -190 77 214 -141 -67 214 -138 -266 181 101 -163 146 151 -240 -60 120 -128 -29
3609 -29 192 -7 -48 119 -104 -160 139 39 -103 157 106 -167 4 106 -147 -38 185 31 -46 66 -25 -80
3631 -80 0 -28 36 117 -25 -17 66 -120 -125 170 48 -122 118 91 -195 -34 105 -126 -13 163 -80 -74 101 -93
$$ packed form
3475a27J48R1k52J06J96k55oK78k30j29L56j16k89L26Q6l88J82K18l40N9L15k69
3497d0j17L30j39j85K59k3k35K44M3k88J28J72k37M5K07j69p8J89j02j23J51N
3519C7m8O1n9l5J07r9n5J84q7j24K33k9k85J83J47k82J04K30k22o3K38k01j18
3542a83L20p3j99K74m1l10K37J33l57J62L44l72r0L56k13k25L46J1k68K07J22
3563A81k64LJ28j08N8J29j34J7O8j78J6J40q9J4J79j22j50J25k8p9J31pp2J49
3587A07q0j85J80J6k28K67J37l55P4K81l52j28M47q0k64L09Nl91J80J80k48R9
3609b9K21j99m1J67k23n6K99j00j42K60n1k73J71J02k53J09K23j54p7J12r1n5
3631h0Q0k8O4Q1j42QQ3j86nK95j22j70K40k7k86J61J39k31J13J76k43OJ75j94
$$ plain form
3655 -93 -120 127 -44 -140 187 50 -231 49 119 -213 -13 218 -90 -107 172 -37 -187 91 72 -61 53 43
3677 43 -100 24 32 -65 73 56 -90 42 91 -118 -8 138 -54 -62 106 1 -58 85 -14 -81 68 5 -69 103
3701 103 7 -152 82 83 -168 44 182 -149 -103 152 -67 -130 171 36 -183 25 61 -116 32 88 -98 12
3723 12 64 -118 -6 128 -59 -39 132 -70 -107 154 37 -124 68 62 -94 41 82 -64 19 52 -71 19 93 -65
3747 -65 30 89 -144 -67 180 -12 -104 149 4 -183 89 105 -102 29 115 -116 -60 112 -30 5 110 -110 -95
3770 -95 97 -14 -59 135 6 -168 33 78 -117 30 122 -116 -73 70 -21 -7 76 -66 -68 67 -18 13 120 -48
3794 -48 -142 62 27 -90 149 141 -144 -57 58 -86 42 227 -2 -90 47 -54 -53 146 42 -89 82 20 -125
3817 -125 90 117 -138 -25 91 -62 24 194 -23 -172 -8 -36 -25 170 115 -74 -50 -110 -121 89 135 -1 37
$$ packed form
3655i3k7K47j71r6L27j37k81K80P0l32K00K31l08j7K79k09j50K78j9j33J14j0
3677D3j43J24Qr7J38j7j46J32M9k09J10J46j92qJ68j05n9J43r9o7J49o3p4J72
3701A03r6j59K34Jk51K12J38l31M6K55k19o3L01j35k19K08L6j77J48N6j86J10
3723A2N2j82J12J34j87K0J71k02l7K61j17j61J92oj56J35M1j46Q3L3j23R0P4j58
3747f5R5N9k33P7K47j92r2K53j45j87K72J6k07J31Q6k31N6J72j42L5J05k20J5
3770i5J92j11m5J94j29j74K01M5j95J47R2k38M3J43r1J4Q3j42kJ35q5L1J07j68
3794d8r4K04l5j17K39qk85Q7J15j44J28J85k29q8J37j01JJ99j04j31J71o2j45
3817a25K15K7k55J13J16j53Q6J70k17j49J64k8J1J95n5j89K4o0j1K10M6j36L8
$$ plain form
3840 37 -22 -199 -40 139 -7 -37 77 -57 -76 118 10 -107 8 -31 -67 143 147 -63 -19 -73 -212 41 284
3863 284 69 2 41 -204 -200 142 129 16 96 9 -191 -16 83 -32 46 66 -112 -8 136 -20 -52 8 -145 -91
3887 -91 194 144 -27 3 -117 -240 -11 159 98 94 4 -207 -142 38 46 119 107 -103 -122 43 -4 -19 87 -24 -129
3912 -129 61 105 -22 41 -18 -186 -43 129 96 122 92 -191 -188 73 71 76 190 -7 -220 -33 56 -39 129 130 -118
3937 -118 -92 69 -12 13 78 -76 -122 62 66 -1 81 -55 -198 -22 81 33 93 71 -150 -147 11 12 71 112 -40 -133
3963 -133 -43 -18 39 104 -25 -109 12 13 -20 112 41 -146 -37 53 -20 70 125 -104 -126 35 5 42 161 -12 -156
3988 -156 9 32 -35 133 97 -143 -69 72 -38 31 143 -47 -144 10 28 -2 103 15 -124 -47 37 9 62 32 -111
4013 -111 -65 27 -7 62 86 -70 -120 -13 1 50 129 -31 -131 -36 -21 32 128 36 -117 -39 -3 -43 93 121 -90 -93 44
$$ packed form
3840C7n9j77J59J79j46l0J14j34j9J94j08j17J15l9l6K10Mk10M4n4j39K53K43
3863B84k15o7L9k45ML42j3j13Q0q7k00J75R9j15P8K0j78J04J44j56l2O0j53N4
3887i1K85n0j71L0j20j23K29J70o1mr0k11O5J80QP3j2k10j9J65m7j5J06j11j05
3912a29J90M4j27O3n9j68J43J72l3K6l0k83LK61kNJ14j97k13J87Q9r5J68Jk48
3937a18K6J61q1K5O5j54m6J84Mo7Q2j36j43J76J03m8O0k2k21LJ58JN9M1j52r3
3963a33R0K5N7O5j29q4J21Jl3J32p1j87J09R0p3R0N5k29k2J61l0L7J19j73j44
3988a56J65K3o7J68l6k40P4J41j10O9J12j90r7J54J8l0J05q8j39P7Q4k8N3l0j43
4013a11M6R2l4O9K4j56n0J07J4M9P9j60j00R5J5N3R6r2j53P8L6m0J36K8k11lJ37
$$ plain form
4040 44 -27 8 158 -13 -163 -3 52 7 124 78 -149 -94 33 -3 89 142 -48 -128 -19 -14 14 168 58 -134 -67
4065 -67 13 4 85 69 -78 -93 -25 18 76 68 -63 -96 -54 -51 77 160 -13 -131 -60 -70 -10 165 90 -104 -77 -41 -57 111
4093 111 158 -44 -88 1 -69 25 196 39 -111 -11 -18 -42 156 161 -83 -95 3 -41 57 182 15 -120 -34 -44 17 157
4119 157 110 -66 -79 -63 -39 108 124 -24 -83 -76 -60 55 110 6 -59 -64 -96 16 128 41 -34 -38 -130 -82 122 93 -47
4146 -47 -16 -73 -137 60 151 -13 -38 4 -126 -62 144 56 -46 22 -57 -126 88 144 -28 -24 -6 -114 -3 141 35
4171 35 -38 -1 -67 -77 70 85 3 -9 -43 -81 17 84 25 4 -44 -98 -4 51 17 23 -12 -109 -49 49 7 17 52 -74 -97 44
4201 44 34 -20 65 -6 -131 -3 69 -30 7 63 -88 -68 76 8 -18 88 8 -97 21 52 -20 53 53 -59 -24 66 3
4228 3 -9 67 -22 -48 44 28 -9 53 25 -52 -7 8 -18 39 15 -43 -13 -2 -44 21 40 -50 -9 29 -53 -39 59 -16 -40 27 -46
$$ packed form
4040D4p1L5J50j71j50J60N5m5J17m6k27N5J27l6R2N3j90q0J09NK8J54j10j92O7
4065f7Q0rQ1j6j47j5O8M3N8qj31l3M2LJ28Q3j73j18P1j0O0J75p5j94K7L6j6J68
4093A11M7k02m4Q9p0R4J71j57j50J00pk4J98Nk44j2R8m4R8J25j67j35Q6j0O1J40
4119A57m7j76j3J6K4J47J6j48n9PJ6J15N5j04o5nl2J12J12q7p5mr2M8K04k9j40
4146d7L1n7o4J97R1j64k5M2j30O4K06q8j02O8p9o9K14N6j72MJ8j08J11J44j06
4171C5p3L7o6j0J47J5q2j2l4l8R8O7n9k1m8n4R4N5l4Ol5r7O0R8m2J0L5j26k3J41
4201D4j0n4Q5p1j25J28P2r9L7N6j51K0J44o8k6J06q0j05J18L1p2P3%j12L5R0o3
4228Cj2P6q9k6R2j6l7O2k8p7M5J5k6N7k4n8L0J1m2O5J9r0M1L8q2J4R8p5k4O7p3
$$ plain form
4259 -46 -66 51 25 -68 1 29 -77 -11 70 -43 -32 61 -40 -78 62 27 -50 24 17 -70 14 70 -6 -7 12 -44 -19 49 12
4288 12 10 30 -25 -23 47 30 9 42 -8 -57 17 38 -17 34 3 -51 1 39 -9 21 37 -68 -43 33 -15 -14 62 -22 -108 24 37
4319 37 -46 27 21 -83 -24 45 -7 -9 34 -34 -81 36 18 -9 36 -10 -82 -3 45 -7 24 23 -54 -25 40 17 5 26 -20 -38 25
$$ packed form
4259d6k0J17k6r3O9K8j06O6Q1j13J1R3j01l8J40l5p7P4pq7Q4N6p6jJ9n6K5O8l7
4288A2kK0n5KP0j7k1L3n0m9P4K1n5N1l1n4N2L8m8L0J6j05K5P6m8JP6q4q6J32J3
4319C7q3P3oj04N9O9n2kM3o8m7J17j8k7M5m6p2P9M8n2L1jp7K9O5k3j2K1m6j8O3
$$ [...]
8191e
##END NTUPLES=NMR FID
##END=
