##TITLE=1H_LY-821.60
 CCl4, 8 sc, 
 28.5.2019
##JCAMPDX= 6.0         $$ Bruker NMR JCAMP-DX V2.0
##DATA TYPE= NMR FID
##DATA CLASS= NTUPLES
##ORIGIN= UXNMR, Bruker Analytische Messtechnik GmbH
##OWNER= root
$$ XWIN-NMR		Version 3.5
$$ Tue May 28 15:27:04 2019 Russian Standard Time (UT+4h)  she@DPX200
##.OBSERVE FREQUENCY= 200.1315
##.OBSERVE NUCLEUS= ^1H
##.DELAY= (6, 6)
##.ACQUISITION MODE= SIMULTANEOUS
##.ACQUISITION SCHEME= undefined
##.AVERAGES= 8
##.DIGITISER RES= 18
##SPECTROMETER/DATA SYSTEM= spect
##.PULSE SEQUENCE= zg30
##.SOLVENT NAME= CDCl3
##.SHIFT REFERENCE= (INTERNAL, CDCl3, 0, 15.7039)
##AUDIT TRAIL= $$ (NUMBER, WHEN, WHO, WHERE, WHAT)
$$ ##TITLE= Audit trail, XWIN-NMR		Version 3.5
$$ ##JCAMPDX= 5.01
$$ ##ORIGIN= Bruker BioSpin GmbH
$$ ##OWNER= she
$$ F:/spectra/data/she/nmr/H-F/1/audita.txt
$$ ##AUDIT TRAIL=  $$ (NUMBER, WHEN, WHO, WHERE, WHAT)
(   1,<2019-05-28 15:26:09.37 +0400>,<she>,<DPX200>,
      <created by zg, POWCHK disabled, PULCHK disabled
       configuration hash MD5:
       00 E9 B6 7A A2 85 ED C7 34 08 36 98 17 FE 4E 26
       data hash MD5: 16K
       57 8F BC 40 80 F1 17 99 B5 9B 00 10 82 A2 A3 BA>)
$$ ##END=
$$ 
$$ hash MD5
$$ B6 E6 CD 43 50 37 5B 0F 2A 86 A1 95 AB 56 E9 11
##$RELAX= 
##$RELAX= 
##$RELAX= 
##$RELAX= 
##$RELAX= 
##$RELAX= 
$$ Bruker specific parameters
$$ --------------------------
##$DU= <F:/spectra>
##$EXPNO= 1
##$NAME= <H-F>
##$PROCNO= 1
##$TYPE= <nmr>
##$USER= <she>
##$AMP= (0..31)
100 100 100 100 100 100 100 100 100 100 100 100 100 100 100 100 100 100 
100 100 100 100 100 100 100 100 100 100 100 100 100 100 
##$AQSEQ= 0
##$AQ_mod= 1
##$AUNM= <au_zg>
##$AUTOPOS= <>
##$BF1= 200.13
##$BF2= 200.13
##$BF3= 200.13
##$BF4= 200.13
##$BF5= 200.13
##$BF6= 200.13
##$BF7= 200.13
##$BF8= 200.13
##$BYTORDA= 1
##$CFDGTYP= 0
##$CFRGTYP= 5
##$CHEMSTR= <none>
##$CNST= (0..31)
1 1 145 1 1 1 1 1 1 1 1 1 1 1 1 1 1 1 1 1 1 1 1 1 1 1 1 1 1 1 1 1 
##$CPDPRG= <>
##$CPDPRG1= <>
##$CPDPRG2= <>
##$CPDPRG3= <>
##$CPDPRG4= <mlev>
##$CPDPRG5= <mlev>
##$CPDPRG6= <mlev>
##$CPDPRG7= <mlev>
##$CPDPRG8= <mlev>
##$CPDPRGB= <>
##$CPDPRGT= <>
##$D= (0..31)
0 1.2 0 0 0 0 0 0 0 0 0 0.03 0 0 0 0 0 0 0 0 0 0 0 0 0 0 0 0 0 0 0 0 
##$DATE= 1559042768
##$DBL= (0..7)
120 120 120 120 120 120 120 120 
##$DBP= (0..7)
150 150 150 150 150 150 150 150 
##$DBP07= 0
##$DBPNAM0= <>
##$DBPNAM1= <>
##$DBPNAM2= <>
##$DBPNAM3= <>
##$DBPNAM4= <>
##$DBPNAM5= <>
##$DBPNAM6= <>
##$DBPNAM7= <>
##$DBPOAL= (0..7)
0.5 0.5 0.5 0.5 0.5 0.5 0.5 0.5 
##$DBPOFFS= (0..7)
0 0 0 0 0 0 0 0 
##$DE= 6
##$DECBNUC= <off>
##$DECIM= 24
##$DECNUC= <off>
##$DECSTAT= 4
##$DIGMOD= 1
##$DIGTYP= 9
##$DL= (0..7)
0 120 120 120 120 120 120 120 
##$DP= (0..7)
150 150 150 150 150 150 150 150 
##$DP07= 0
##$DPNAME0= <>
##$DPNAME1= <>
##$DPNAME2= <>
##$DPNAME3= <>
##$DPNAME4= <>
##$DPNAME5= <>
##$DPNAME6= <>
##$DPNAME7= <>
##$DPOAL= (0..7)
0.5 0.5 0.5 0.5 0.5 0.5 0.5 0.5 
##$DPOFFS= (0..7)
0 0 0 0 0 0 0 0 
##$DQDMODE= 0
##$DR= 18
##$DS= 0
##$DSLIST= <SSSSSSSSSSSSSSS>
##$DSPFIRM= 0
$$ [...]
##$SUBNAM2= <"">
##$SUBNAM3= <"">
##$SUBNAM4= <"">
##$SUBNAM5= <"">
##$SUBNAM6= <"">
##$SUBNAM7= <"">
##$SUBNAM8= <"">
##$SUBNAM9= <"">
##$SW= 24.9337058887773
##$SWIBOX= (0..15)
0 0 2 0 0 0 0 0 0 0 0 0 0 0 0 0 
##$SW_h= 4990.01996007984
##$TD= 16384
##$TD0= 1
##$TE= 0
##$TE2= 300
##$TE3= 300
##$TEG= 300
##$TL= (0..7)
0 120 120 120 120 120 120 120 
##$TP= (0..7)
150 150 150 150 150 150 150 150 
##$TP07= 0
##$TPNAME0= <>
##$TPNAME1= <>
##$TPNAME2= <>
##$TPNAME3= <>
##$TPNAME4= <>
##$TPNAME5= <>
##$TPNAME6= <>
##$TPNAME7= <>
##$TPOAL= (0..7)
0.5 0.5 0.5 0.5 0.5 0.5 0.5 0.5 
##$TPOFFS= (0..7)
0 0 0 0 0 0 0 0 
##$TUNHIN= 0
##$TUNHOUT= 0
##$TUNXOUT= 0
##$USERA1= <user>
##$USERA2= <user>
##$USERA3= <user>
##$USERA4= <user>
##$USERA5= <user>
##$V9= 5
##$VALIST= <valist>
##$VCLIST= <CCCCCCCCCCCCCCC>
##$VD= 0
##$VDLIST= <DDDDDDDDDDDDDDD>
##$VPLIST= <PPPPPPPPPPPPPPP>
##$VTLIST= <TTTTTTTTTTTTTTT>
##$WBST= 1024
##$WBSW= 4
##$XGAIN= (0..3)
0 0 0 0 
##$XL= 0
##$YL= 0
##$YMAX_a= 16413
##$YMIN_a= -20403
##$ZGOPTNS= <>
##$ZL1= 120
##$ZL2= 120
##$ZL3= 120
##$ZL4= 120
##$ABSF1= 10
##$ABSF2= 0
##$ABSG= 5
##$ABSL= 3
##$ALPHA= 0
##$AQORDER= 0
##$ASSFAC= 0
##$ASSFACI= 0
##$ASSFACX= 0
##$ASSWID= 0
##$AUNMP= <proc_1d>
##$AZFE= 0.1
##$AZFW= 0.1
##$BCFW= 1
##$BC_mod= 2
##$BYTORDP= 1
##$COROFFS= 0
##$CY= 11.3945322036743
##$DATMOD= 1
##$DC= 2
##$DFILT= <>
##$DTYPP= 0
##$F1P= 18.9103706918063
##$F2P= -1.10871071338519
##$FCOR= 0.5
##$FTSIZE= 0
##$FT_mod= 4
##$GAMMA= 1
##$GB= 0.15
##$INTBC= 1
##$INTSCL= 1
##$ISEN= 128
##$LB= 0.24
##$LEV0= 0
##$LPBIN= 0
##$MAXI= 10000
##$MC2= 0
##$MEAN= 0
##$ME_mod= 0
##$MI= 1.114404
##$NCOEF= 0
##$NC_proc= 0
##$NLEV= 6
##$NOISF1= 3.799351
##$NOISF2= 2.8
##$NSP= 1
##$NTH_PI= 0
##$NZP= 0
##$OFFSET= 15.70392
##$PC= 1
##$PHC0= -8933.483
##$PHC1= 13.20025
##$PH_mod= 1
##$PKNL= yes
##$PPARMOD= 0
##$PSCAL= 0
##$PSIGN= 0
##$REVERSE= no
##$SF= 200.130013532006
##$SI= 16384
##$SIGF1= 3
##$SIGF2= 2
##$SINO= 400
##$SIOLD= 16384
##$SREGLST= <1H.CDCl3>
##$SSB= 0
##$STSI= 0
##$STSR= 0
##$SW_p= 3612.71676300578
##$SYMM= 0
##$S_DEV= 0
##$TDeff= 0
##$TDoff= 0
##$TI= <>
##$TILT= no
##$TM1= 0
##$TM2= 0
##$TOPLEV= 0
##$USERP1= <user>
##$USERP2= <user>
##$USERP3= <user>
##$USERP4= <user>
##$USERP5= <user>
##$WDW= 1
##$XDIM= 8192
##$YMAX_p= 0
##$YMIN_p= 0
$$ End of Bruker specific parameters
$$ ---------------------------------
##NTUPLES= NMR FID
##VAR_NAME=  TIME,          FID/REAL,        FID/IMAG
##SYMBOL=    X,             R,               I
##VAR_TYPE=  INDEPENDENT,   DEPENDENT,       DEPENDENT
##VAR_FORM=  AFFN,          ASDF,            ASDF
##VAR_DIM=   8192,          8192,            8192
##UNITS=     SECONDS,       ARBITRARY UNITS, ARBITRARY UNITS
##FACTOR=    0.0002004,     1,               1
##FIRST=     0,             0,               0
##LAST=      1.6414764,     0,               0
##MIN=       0,             -20403,          0
##MAX=       1.6414764,     16413,           0
$$ Real data points
##PAGE= N=1
##DATA TABLE= (X++(R..R)), XYDATA
$$ [...]
546F45o80q53R18M39m88M75l17j250Q28J170q49j26O72r84m28J155o8m30P28l58
566A99j012O00O03k88J10l01o01P85O11o82j05j2o48N66J011n19l50K59p70l18
586h62R99L64L1N6j094n23J123J89k68O83o85j088J368N42j486M94Q52j482K21
605e66J733q14q03Q44r51q40J916P32j014Q8p29j193J505J163j019L31L43j766
623a040P2J666o21l81J168q33j130J319N70r13r5j72k61J052N13n89k22q26o14
642a337J502P68p95N55n2k063J17J878j74l6O96j457r12J451J67m52P59p20p82
661h87J546n2j444J140K19k029J173J937j571k72J227k007r33K723N62j308N18
678E42n51j454J109R43n83O33n8j470N60P14r75P70R19j818k08J888n35r16Q33
$$ y = [645, -35, -888, 30, 469, -19, 456, 139, -1111, -283, 887, 38, -88, 584, -400, -828, 327, 259, -171, 557, 199, -813, -213, 390, 102, 212, -89, -690, 95, 706, 24, -81, -93, -741, -175, 836, 317, -33, 226, -544, -862, 137, 501, 532, 588, -506, -1029, 94, 283, 15, 698, 13, -1075, 293, 835, -651, -157, 695, -787, -566, 1167, 353, -450, 394, -557, -1397, 519, 1251, 237, 325, -404, -1597, -92, 1071, 52, 383, 726, -1040, -968, 698, 77, -304, 864, 31, -1099, 220, 790, -123, -218, -390, -651, 401, 914, 325, 103, -723, -1337, 165, 933, 138, 693, 641, -1422, -1305, 573, 399, 363, 1059, -398, -1310, 141, 308, -144, 615, -105, -887, 659, 607, -837, 303, 522, -1507, -334, 1603, 32, -240, 987, -1020, -1953, 770, 1332, 24, 542, -9, -1463, -354, 589, 6, 639, 581, -889, -329, 385, -590, 180, 1099, -719, -927, 961, 426, -490, 343]
697C43o68p46J474N10p64J13o15o52J074J28l73J360m85k223R79J266j324P58
715A55J394k154p03K150n15j139J354k46j103J134R8r52J003j56j456J162P26
732G52j324R90P63k414Q0K309r90q13J633p64j449J403L30j051Q23K73r92L75
750f6Q2n09J089n2j565R36R48j469M07J241j625l38J895p53j061J357j36j076
768f95Q20%o05J070k15j209J042K13j280J212O46k069O11J799j761n89K035p89
786B36j214J528j72j281J164L53j147N61K01p47Q70R7j319R88P87j636L04J355
804I28j295k33J592r95j045J524L8j068P19P1o71O94p3p62R34N2j115R09L41j434
824h89R10J148j850j69J822q75q17J380n10j065J281J09j021Q55J04j031P01J70
$$ y = [343, -325, -1071, 403, 913, 149, 262, -353, -1005, 69, 197, -176, 1184, 699, -1524, -545, 721, -603, 155, 1549, -605, -1308, 842, 327, -812, 542, 296, -807, 327, 425, -527, 476, 320, -1136, 26, 752, -572, 418, 1181, -1233, -1153, 1156, 166, -647, 986, 222, -1227, 176, 506, -545, 278, 551, -441, -66, 16, -493, 596, 544, -1021, -85, 863, -606, -199, 1042, -583, -921, 974, 221, -840, 517, 381, -695, 125, 125, -480, 590, 375, -834, 208, 421, -859, 353, 999, -1070, -459, 1340, -421, -1010, 1025, 236, -978, 550, 378, -903, 261, 614, -533, 28, 229, -518, 352, 449, -870, 118, 905, -731, -427, 928, -367, -600, 992, -3, -1048, 476, 514, -554, 165, 236, -435, 259, 186, -576, 358, 410, -705, 204, 545, -889, 21, 1169, -681, -850, 972, 97, -720, 660, 150, -915, 366, 475, -546, 309, 413, -618, 83, 253]
842B53r93J149O37j797K37J284j234p6J565r99r34J514j75j243Q76L55q16N10
860A13J99o62N87J00j010N15N35p34O70O17j568j47J318o30l71J225l97q67O72
879A65k31o46R63K34o97M86j08q11Q66K13j287P25J083j140o5R65j171m80J495
898E59k53p80J102m5j239L64K48m60R23M13j079J01L82q40L09Q36p09L6R85q03
918E0q04Q40l6n23P59J76n77L48p2p79K46M33l8N48p3r51J89L93o47K97Q86m99
940A66k20N13p59n00R59R7m69N92j1o37L17p8p08P07O68n83Q7K38r09J3Q37m24
962a04j68R68k80q60L26K6l70O35L29n83J15K39n09o5K55j74L90M32n33l09K42
983Bk43o9M95k5j13L44l21n90K91K54k8L07r2m35K59R1m67J69L73k55J96K72o28
$$ y = [253, -740, 409, 1046, -751, -514, 770, -464, -540, 1025, 26, -908, 606, 431, -812, 64, 419, -397, 113, 312, -350, 237, 337, -673, -158, 377, -357, 313, 930, -638, -785, 533, -97, -468, 757, 360, -507, 165, -66, -712, 251, 485, -212, 274, 166, -645, 221, 434, -853, -128, 955, -185, -250, 715, -456, -936, 559, 306, -474, 628, 583, -656, -292, -44, -504, 419, 832, -247, -146, 236, -604, -295, 541, -168, -132, 853, 50, -754, 86, 50, -473, 286, 462, -115, 233, 161, -618, -372, 61, 23, 571, 498, -453, -264, 129, -518, -221, 665, 166, -54, 459, -300, -800, 159, 256, -213, 379, 368, -269, 48, -30, -738, -31, 637, 54, 141, 379, -530, -517, 320, -104, -272, 696, 416, -444, -118, -92, -462, 173, 502, -81, 34, 273, -236, -301, -46, -220, 170, 602, 69, -240, 2, -241, -310, 185, 160, 47, 391, 70, -520, -229, 25, -3, 304, 212, -223, 36, 127, -340, -171, 202, -53, 143, 415, -213]
1006b13j54N64k59k86O05P0l91J96j73n26M86N07l75n7J70l64J3L32k52m6M55
1027C02j66l25K05k5j22K67p8k95K94K20k73j03rp9K73J68k74j4J15k05oJ97j14
1050d7J00K41l74k61L76R0j70J89j38l07L87J85m43O4K64k49kK66k54oL30k63
1072b2l14L86J50k29J11p1l09K84L09l05j21J81r8k2J49p4n1J78r6k15Q8J45Q3
1095A37k4k21p4K24N0p5K9j39k8K66p2k53K10J17k74N9J48j95J70K12m37j53M75
1118A52kk27J88j18k72L58J48m16J29K98l05j25K77j09l8K73j73l21K59K23j74
1139B5p3K8r0J18J21j03j21R5O9o6r7O4J61q9j00L5q1N0K89j41l61K23K17k61
1163h8O6J72k98L9L68l18k50N25k5m49K51J22l27K95K40n72j1N30k19k46L34j06
$$ y = [-213, -367, 197, -62, -348, 257, 327, -64, 132, -41, -567, -81, 426, 51, -6, 164, -200, -187, 145, -107, -153, 302, 136, -189, 16, -9, -131, 136, 58, -237, 57, 277, 4, -99, -108, -187, 86, 254, -20, -34, 81, -124, -130, 67, -47, 53, 294, -80, -341, 35, 125, -45, 144, 6, -301, 86, 271, -172, -108, 156, -93, -95, 171, -83, -89, 241, -22, -336, 50, 200, -29, 82, 11, -298, -14, 295, -10, -131, 50, -48, -70, 79, 5, -46, 132, 36, -179, -91, 54, 137, 113, -108, -182, 42, 92, 17, 46, -93, -121, 145, 73, -180, 30, 147, -127, -68, 80, -115, 55, 267, -170, -323, 152, 150, -77, 111, -7, -279, 79, 227, -189, -60, 238, -67, -192, 85, -24, -62, 211, 38, -283, -24, 199, 25, -48, -20, -110, 8, 129, 26, -95, 0, 69, 3, -94, -30, 131, 42, -58, -23, -104, -54, 235, 94, -267, -44, 173, -88, -22, 150, -148, -109, 259, -59, -309, 216, 191, -258, -7, 115, -212, 83, 323, -249, -260, 270, 51, -195, 139, 33]
1185C3k67L63M1m19J97L09k85j57K08j6j3J28r4k06J02K39q0k37P6J96j29r1K15
1208A13j11j55L17k8m88L01M28m72j02M30l40j46O41k77o00O25K23p04K62M27
1228C44n76P2N85n73k66P92j74o16M70J44m74L51K65o23N0N49k97k59L30j1k03
1249a20J75jk01Q8K34p6k58L9K75q3k25K07K8k96K95K11n87P8O45m45l55O57j72
1272A13n25P01J7r31O05O64r70j8Q72o71l21R91m25p76R87J52j028M86N66p88
1292b99J38O57o95k17Q36k44n86M82J36m11K40J25l37Q0K88j48k10Q6K07l7k26
1313a35J20J53k71Q7L79n02k26P89j71p30O58K63q94M48O01j023R2J149q34o44
1333f91J163k37r15J029J22j195P51P34j258J06J070q35l38J079n35p24J082K1
$$ y = [33, -234, 129, 170, -249, -52, 257, -28, -185, 23, 7, -6, 122, 28, -178, -76, 163, 83, -154, -78, 118, -11, -102, 113, 2, -153, 164, 136, -352, -51, 377, -95, -197, 233, -107, -253, 388, 111, -489, 136, 359, -345, -83, 344, -232, -160, 425, -148, -414, 378, 204, -412, 58, 202, -272, 79, 344, -279, -229, 320, 23, -236, 94, 83, -120, 55, 54, -147, -59, 175, 99, -159, -120, 155, 72, -153, 54, 82, -214, 81, 292, -295, -217, 428, -17, -372, 285, 113, -412, 289, 306, -625, -20, 644, -326, -344, 528, -143, -464, 527, 102, -674, 313, 465, -563, -77, 489, -299, -161, 496, -199, -416, 420, 176, -410, 72, 208, -203, 37, 162, -175, -95, 193, 45, -165, -79, 128, 91, -135, -15, 138, -133, -46, 333, -169, -395, 394, 223, -507, 151, 414, -480, -32, 569, -454, -362, 787, -47, -691, 472, 235, -680, 349, 471, -724, 27, 761, -497, -391, 679, -156, -494, 585, 50, -674, 408, 429]
1351D29j039N59N38p48J40M81n48q6N72k00l27K34J10j04p2j5J51m7j12K25j14
1372B7l75M77K71p31J60O21o44j13Q31o22m57J127k86j076R96L79j231N82P86
1391G22j267J42J296j052o71J427l09r87J079J04j243P47O66j140J82R76p39l19
1409c86P29m47l50Q02o7o19M08J46m08J01J44j56J51J12j06n9j74O8L04l33o6
1430b06O55k63n80N37j05o87Q75M67j114K68Q12j067j84J182o18m75J274m31j235
1449h95J016L45j186P26Q00j167J91R32j179m23J367k91o55R60j36j042N58L16
1467B37p72M60P56n70k35J99l83k6M38lOJ51j77j14j31k90L74M30k74Q6K08o95
1489c25o4N56m76K1J061l69q52O03k14q17J052N51j079M57P11j336k31J161n83
$$ y = [429, -610, -51, 487, -261, -121, 360, -188, -274, 298, 98, -229, 5, 115, 11, -61, -76, 75, 28, -84, 141, 27, -348, 129, 400, -331, -171, 450, -194, -307, 524, -98, -555, 572, 286, -790, 206, 585, -646, -64, 722, -545, -403, 893, -159, -830, 597, 288, -699, 380, 484, -759, -12, 654, -486, -304, 672, -67, -386, 343, -104, -454, 348, 281, -338, 70, 216, -192, -91, 53, -103, 48, 160, 54, -5, -179, -111, 193, -140, -206, 449, 186, -394, 143, 38, -649, 226, 693, -421, -153, 659, -408, -592, 590, -28, -503, 771, 340, -895, 121, 466, -720, 6, 806, -361, -170, 762, -417, -840, 527, 236, -419, 541, 405, -637, -79, 237, -535, -75, 681, 111, -124, 75, -308, -334, 104, 101, 107, 258, 81, -33, -164, -454, -80, 350, 76, 162, 370, -325, -389, 167, -309, -288, 773, 404, -448, 155, -59, -876, 176, 727, -352, 105, 816, -520, -751, 410, -173]
1508a73k54J330m67j141Q51Q1j079P46P88p67K51M94j122k82R20j85j62P69k30
1527C68o18K29j64l84N70M39k16lk01l32J19L4k4M39Q6k48J39l44n76N67M18m52
1549a54M04L92q90j29N36o27K9J197l24p56O04k51q39Q37M12q04N82N78j149j76
1569e28P86n49q5J033l63o50O79j88q44N46M72l90L65K14p82q4M22k56P8M79j64
1590A91j26O2m00r0M29oK0K08k90j33K67l23j74N69%k50L47k28n76M93K27n45
1612c28L98M53o66l0M15o06J5Q67l39n02N83j31n78N21J37n55M64L48o91K8M47
1633B50m30j2M91l38j44N11k61m17L78M6j88L14o8l80K64J20l22J77J68k61J78
1654G6N7l87J65L25l18J4K23l04L3L96l53k11N05j42k99L63q9l46M54O2n20K78
$$ y = [-173, -427, 903, 436, -705, 146, 227, -852, -106, 682, -85, 166, 660, -462, -744, 176, -9, -171, 598, 368, -250, -21, -185, -569, 1, 440, 224, 221, 20, -312, -193, -159, -183, 256, 342, 94, 233, -111, -687, -120, 298, -154, 250, 642, -248, -377, 159, -468, -439, 758, 434, -322, 282, 31, -808, 29, 441, -363, 219, 797, -352, -528, 258, -291, -376, 657, 294, -356, 323, 135, -709, -163, 309, -81, 284, 498, -284, -368, 54, -202, -124, 355, 191, 65, 127, -273, -363, 66, 60, 80, 288, -2, -135, 132, -191, -365, 204, 204, -46, 301, 73, -503, -10, 217, -328, 70, 523, -143, -173, 242, -364, -349, 518, 179, -323, 260, 129, -449, 72, 209, -346, 118, 466, -225, -197, 250, -180, -192, 299, -39, -183, 328, 67, -350, 28, 74, -114, 200, 132, -248, 16, 136, -186, -9, 159, -102, 76, 133, -254, -89, 236, -82, -68, 155, -149, -116, 280, -73, -284, 221, 79, -220, 143, 54, -292, 162, 224, -296, -18]
1676a8L05m75Q6L22l97P0M80m26k61M73j08k61L94p1l56L71N1m64K24K83l02R6
1698A6J67l67P1L37l08j07L47j07j08K27k27j74L64j8k61K40J3k44J92kl05K82
1720B8K22l22K2J57k69R6K72l31j3M05k30k29K87j31j64M20q7l77L12J27l96J69
1742c2J73l17J85K79m18p3L92j95j35K95j42j76L53j01l42K72J39k59J42P5k72
1763a57J44J78k70nK36j22l0J24k01KK56j45j34J94p1n5J88j82j31L09k0k64J80
1786B4N2k40K34R2l79J65K96l28m4K82k30l8L63k68k42L98j7l14K41O8k84K30
1808F1J12l79J23K96k38n8K07j93pK40j78j52K54j8j25J12r8q2K37l9k12J72M8
1831H3j56J19k4k05K40J44l23O2J76k19O8K18k91l5L69k01k30K95m0j91K73m8
$$ y = [-18, 287, -188, -102, 220, -177, -107, 373, -53, -314, 159, 51, -210, 184, 113, -243, 128, 179, -285, -61, 222, -80, 16, 183, -184, -113, 224, -84, -191, 156, 49, -59, 168, -59, -233, 131, 113, -148, 92, 105, -139, 53, 51, -254, 28, 250, -72, -50, 107, -162, -66, 206, -125, -138, 267, 37, -192, 95, -36, -200, 220, 133, -244, 68, 195, -201, -32, 141, -176, 9, 288, -130, -203, 189, -6, -141, 154, 12, -164, 189, 88, -254, 18, 157, -102, 40, 115, -157, -13, 165, -105, -110, 126, 4, -26, 98, -103, -101, 155, 10, -124, 70, -1, -56, 132, -50, -181, 128, 108, -156, 24, 76, -164, 70, 162, -217, -52, 244, -84, -128, 154, -76, -114, 249, -19, -261, 137, 120, -194, 47, 115, -169, 61, 173, -206, -83, 213, -25, -83, 124, -69, -76, 164, -14, -166, 88, 70, -55, 57, -41, -123, 114, 75, -137, 35, 83, -73, 46, 22, -183, 57, 201, -122, -60, 116, -103, -35, 183, -108, -143, 226, 25, -205, 90, 50, -141, 132, 84]
1853H4l28K80J69l36M1K15k12P8K02k92l2K93j41j41J93p4o9K22j41j93K42L5
1875I5j71J36l0j63K27M5l25J60J86k42P3J46k95R6K99l09j24L66j34j73K84j28
1897A9k61L80N4m09J88J95k93J14J73l05N7L06k56j37K62q0q3J92j37j30K69m3
1919G5j83J27j0q7J91p2k11K30O0k23J36N0k42K05J65m11J03L51l33n3L45k95
1941h2j12M84k28l79M50N1m29L09J21m46K48L18m81j2M36k59j56L43k07j77M11
1962B03j06l40K66J09k49J57J7k12J94J15k66Q3J06j38R9M9k58J68J92l01M5K05
1984A38k66Q5L10l99r9M93k31k91M70j19l90M70L5n79L98L46n82Q3M30m97mN93
2006C94m30l21O11j19m48M47K1m50L83J73n23J80L70l96l7K87k60L0L27k35j77
$$ y = [84, -244, 36, 205, -131, -90, 125, -87, -9, 193, -99, -131, 162, 21, -120, 73, -1, -70, 152, 11, -182, 60, 95, -76, 60, 30, -133, 94, 139, -186, -26, 160, -82, -9, 137, -158, -62, 237, -72, -196, 170, 36, -137, 147, 19, -242, 138, 192, -217, -29, 166, -127, -13, 160, -145, -88, 218, -38, -175, 87, 7, -76, 116, -21, -151, 118, 75, -108, 19, 9, -78, 113, 41, -170, 60, 120, -103, 33, 83, -159, 46, 211, -200, -97, 254, -79, -132, 213, -82, -194, 290, 62, -317, 133, 184, -245, 64, 185, -261, -13, 305, -176, -188, 248, -11, -167, 176, -31, -208, 203, 97, -243, 23, 132, -117, 40, 57, -155, 39, 154, -112, -29, 77, -61, 38, 87, -171, -3, 189, -112, -67, 138, -128, -43, 267, -132, -231, 262, 31, -260, 210, 91, -299, 171, 206, -373, 25, 371, -211, -128, 302, -195, -199, 394, -36, -357, 254, 135, -313, 134, 155, -295, 88, 261, -262, -82, 288, -108, -145, 142, -118, -88, 239, 4, -173]
2027a73K52r6n6J90j39n3K48j73j92K73p3j21L23j71l18M32L5m90L19J97m50K80
2049D4L40o42L8N59m73j70O67k79l77N77j97o23O39L08o76K79L31o57J31N36n19
2070a64p5O12l08l54M46j03l20L97jl60L26J60l74N3O9k23K70J76k81O8P2k87
2092b01J32J74k45K22K63m96n2L64l21PN08l74k63O13k29n55N59R8n62N23K61
2113D26p70K19N24p25l0P99l68k72O01m17n71P24J23n52M49K06o47J69L27m92
2133b77J48N09l56j87L24k11j34L18j67j36L45l9j97J21j92r0L56p0j72L51j45
2154I9l80L09j5l19N22J69o52J64L44n35J29N71n38j17O99m19m97O85p2n62O20
2175B05J26p15M27L85q05R0O71m60r1N96m47m07O16q0m32M75J20m71J89J15l84
$$ y = [-173, 79, -17, -73, 117, -22, -75, 173, 0, -192, 81, 8, -113, 210, 39, -279, 153, 188, -302, 17, 214, -236, 44, 384, -258, -220, 339, -134, -304, 363, 84, -293, 284, 87, -536, 103, 411, -265, 14, 345, -312, -181, 355, -164, -239, 373, 65, -289, 157, 54, -266, 131, 130, -230, 96, 256, -118, -65, 4, -219, 51, 227, -54, 14, 86, -201, -69, 105, -140, 82, 345, -151, -203, 161, -160, -153, 355, -19, -282, 331, 102, -453, 106, 204, -358, 165, 426, -344, -125, 399, -326, -356, 443, 75, -197, 404, -13, -584, 140, 263, -289, 160, 366, -281, -112, 215, -277, -129, 380, 24, -163, 161, -50, -184, 134, -33, -169, 176, 137, -60, 61, -131, -221, 135, 65, -107, 244, 99, -281, 28, 13, -306, 216, 385, -267, -103, 241, -294, -165, 406, -132, -249, 450, 31, -466, 219, 147, -415, 205, 331, -384, 43, 428, -377, -287, 384, -76, -167, 429, -18, -425, 191, 111, -321, 154, 274, -197, -8, 107, -277]
2196b77K46K93l34JJ93k11N1J70k65O9K36k18J2J79k74L2L00l10p7M53k27k82
2218b40M24j77l47N81J9o18L79K91o09K09M57n71mO42n04l14O79j61m70N28pn44
2240c57M62K28o23J94M13m66J1M03l65r1M61k36k79L52rk34K19k5k38K50N0k37
2262a17J37M8j69J79j3k55K47J25l26J16J56l14J75K85m23k5M10k87j57M44j96
2283D0k86M58j12m56M56J94n19J97K54m90J55M93m73j48N02k64k80M58p2l27L71
2304A51lm14K59K42l45Q0J59k87J24K64k70r1K14j44k9K54j35j05J89j74j53K95
2326H1J7j04J77j93k64L33Q5k51K09O2l44J61K09l67J01L56l48r2L93j84k02L31
2348A66j93l25N00J55m09J52M6m17K09L75k82L0K85l93k00L37k7m7L09j62l41
$$ y = [-277, -31, 262, -72, -71, 122, -89, -38, 132, -133, -64, 172, -46, -34, 145, -129, -97, 203, -107, -184, 269, 42, -240, 184, 7, -340, 241, 260, -358, 21, 312, -297, -88, 369, -202, -206, 436, -68, -382, 297, 136, -334, 194, 187, -357, 105, 333, -290, -96, 317, -149, -138, 265, -100, -191, 270, 34, -245, 107, 98, -136, 83, 58, -180, 70, 120, -117, 20, 68, -101, 78, 65, -190, 57, 182, -144, -28, 128, -186, -11, 274, -149, -174, 236, -51, -208, 236, 40, -246, 212, 100, -356, 100, 294, -225, -28, 226, -264, -109, 384, -89, -237, 265, 1, -279, 179, 107, -220, 151, 148, -266, -7, 235, -110, -30, 129, -158, -34, 230, -40, -131, 83, -61, -90, 164, 29, -76, 113, -61, -214, 81, 98, -6, 171, -22, -286, 47, 132, -119, 90, 152, -192, -31, 178, -189, -88, 268, -80, -172, 221, 37, -165, 166, -27, -352, 148, 303, -106, 46, 92, -325, -116, 259, -23, 7, 292, -101, -301, 36, 9, -38, 271, 109, -232]
2369b32K29P9k05J55N3k01J92J06k57L7R9k20R8K21j12N6Q7l73j25L25M9K7K07
2392B95k86l11K53M2j37L07P2l36Q6N5k74J97K73l28j8K85j51r3K04k53j90M09
2414A01R0j88J54q4l66J47J85q7K16J56l80j60J26n8J61K69k08j81J60q1r9J85
2436E8l9j00J97k2j91J59j1k36R5J34p0K02P0l93q0J96n2J18K56k35k04J61j13
2459a00j05L34P5k40O7l2j87K02J38k35pJ79r1K6J05k24n9J94l0k9J79q6j81O9
2483c8n1l2K80L0k23j0k7p4J95J10k09L5J08j83J5J71j38k7J96j58j09K61l6k16
2507a30J27J7j30K24O4k85K9J66j40J6J73j41n0J50j18j04K01J8j38O9l0p3J27
2530D2K3j35N2N4m4L4rj00R7P1j27M6L4q3N5P3j55K4J84j58r1J67n3o0J92j05
$$ y = [-232, -3, 76, -129, 26, 79, -122, 70, 176, -81, -44, 55, -165, -67, 154, 42, 98, 185, -188, -313, 12, 61, 88, 295, 9, -302, -49, -7, -144, 163, 235, -101, -15, 40, -234, -37, 236, -92, -110, 175, 24, -69, 135, -118, -308, 101, 191, 3, 157, 73, -293, -146, 39, -48, 168, 324, -56, -216, -90, -148, 13, 282, 74, -107, 53, -28, -127, 58, 19, -81, 116, 94, -97, 62, 51, -185, -90, 44, -26, 176, 246, -147, -227, -31, -83, 35, 291, 56, -148, 13, -100, -205, 129, 204, -36, 31, -1, -188, 14, 152, -83, -90, 89, -2, 24, 129, -95, -154, 40, 10, -19, 160, 74, -107, -38, -89, -121, 159, 189, -34, -44, -71, -145, 50, 160, -49, -14, 94, -89, -74, 97, -41, -68, 128, -30, -139, 122, 86, -130, -3, 14, -116, 108, 172, -113, -84, 82, -58, -42, 131, -10, -60, 90, -28, -132, 69, 87, -51, 18, -12, -85, 42, 65, -70, -18, 36, -8, 26, 17, -83, 14, 85, -42, 4, 38, -45, 10, 83, -72, -48, 136, -22, -113, 54, 1, -59, 133, 28]
2556B8k25K27Q6k06P8Q5j91Q1J92k18m6K42j33j44K05J2j16J17o3k01J60J72j17
2579B5k3J5j34N4J46m8m7N3o1n9N6J9P2K4j50l9R6J5O5L7k06o3K07Jp3J35r1k04
2607a78J69P3j48J95Q9l39m0K43o9L4J81k54k10K86O3j52J60qk85J05J91j46O8
2630B8J46k47j34K04O1J5P1j72j79J39J36J4J5q8j15L7M1M8J13p5j36Jj3N3K27
2655A90l5k73QP8k5J81J08l32n1J89j02J7K88j55k63J66j4j21L36Q5m28j5J87
2678A9p8R8K24k91j95K30op2K35k9k60K8P1n1J83R7k28j30O9O2J29N0j69r2J8
2703h8J8J29O3j13k0j5j46J37K39j44r5N1j87J7L91p0k89J30kk06K69J83l43J8
2727g3J85k72PM03j21k49J67j02j53L48R0l40L1J21j77J11K24k00r1J31j16n2
$$ y = [28, -197, 30, 116, -90, -12, 73, -118, -37, 155, -63, -109, 133, 0, -144, 61, 73, -43, 74, 11, -190, -30, 142, 25, 2, 17, -117, -63, 83, 35, -12, 41, -20, -79, -23, -4, 68, 92, -58, -97, -1, 14, 79, 116, -90, -153, 54, 55, -18, 117, 26, -178, -9, 64, -84, 111, 200, -139, -179, 64, -5, 29, 210, -44, -254, 32, 95, -57, 103, 95, -190, -85, 106, -40, 28, 174, -73, -207, -3, 58, 73, 144, -28, -207, -68, 68, 82, 97, 9, -106, -69, -28, 20, 133, 58, -78, -77, -90, -37, 190, 155, -118, -110, -32, -57, 124, 232, -100, -151, 38, -64, -47, 241, 86, -177, -11, -25, -146, 190, 275, -153, -168, 19, -59, 39, 263, -28, -223, 7, 1, -71, 164, 135, -125, -97, -26, -77, 106, 203, -25, -155, -86, -24, 105, 155, -14, -106, -88, -70, 59, 122, 9, -11, -26, -172, -35, 204, 60, -35, 16, -171, -154, 237, 167, -122, 8, 6, -200, 69, 252, -91, -73, 112, -160, -153, 250, 129, -120, 47, -55, -208, 140, 230, -110, -79, 42, -135, -24, 200, 0, -91, 40, -76, -128]
2749a28K29K4j28l0n1j2J68M0q1o2q5N6J58o7n3J03j11j40K17L4j52J85k3l22
2773b31J52K66j97j7J80k75m8L58j25k07K73n6l03K58J25k78J57J71l86J4L65
2794A96j62j32K27j32j94K87M7k32R8P9j55M6Q1o9M2L1j36J8R0l8O1Kj47L8J27
2819G3r3J2Q6j18J5J16j80J6K33j34j53K14p8j78L14ll61K12K16l50M2L05k57
2842e1r7L34j79k16L18Rk55J61N8k29J95R3k78P3K13k12k6K13j69m6K03j27j43
2865a58K00N5j24L0l4m1R8j5l2J02q0j01J65p4j37K55O3k99O2J54j92O1K27k52
2889f7o3K81j43j20K21r8j72K72l3k48K87P2m07J06K63k39Q7K89l26k01K98l4
2911B5j55K62K6k32O8rj25J89Q7j57M1nj45J60Q4k33J9K11j26J1J37j83j01J32
$$ y = [-128, 101, 125, -3, -33, -84, -96, 72, 112, 31, -31, -116, -60, 98, 31, -22, 81, -30, -170, 47, 81, -71, 114, 91, -231, -79, 187, -10, -27, 153, -122, -170, 188, 63, -144, 129, 73, -230, 28, 153, -125, 32, 203, -183, -169, 196, 34, -98, 129, -3, -197, 90, 137, -95, 3, 82, -73, -27, 54, -15, 27, 58, -78, -60, 30, -8, 53, 55, -92, -54, 73, -20, -8, 78, -40, -25, 91, -89, -73, 160, 26, -127, 87, 9, -169, 145, 142, -219, -7, 209, -141, -99, 206, -51, -148, 186, 7, -209, 109, 118, -137, 24, 82, -147, 48, 141, -137, -64, 149, -63, -89, 124, -45, -91, 112, -15, -158, 42, 97, -27, 3, -31, -72, 26, 11, -21, 81, 1, -100, 65, -9, -146, 109, 172, -127, -65, 89, -103, -42, 185, -67, -130, 151, 8, -112, 109, 11, -161, 111, 78, -170, 117, 189, -218, -112, 151, -88, -1, 288, -38, -239, 59, 25, -130, 132, 158, -74, -6, -15, -140, 49, 136, -21, 20, 15, -130, 30, 114, -119, -100, 111, -15, -4, 133, -50, -151, -19]
2935a9m5K2K41r0j70M9j90k0M25J9l00J40j6l47K29K88k76J0K76k83j46L13p0
2958D0j74J80k5j34K92nl33O3N2j39L07K02l19q7R6k42K2M16kj61K1j80j38K29
2982a9J16l5M1j08r6J62m4j69J75M1j99K10J55k85k3R8k47P4M13m9j88J0k46j03
3006c16L77J04j23J46j46l32K10J55j75J95J69l97l0L08j41j09J86j28q6L00J8
3027A85k27Oo2j00K57J38j27N5j03l08J16K74m6R1M6l42q8K47rj2J49j29j00J56
3051F7r0p4J70n9j60K14P3j91J27rl58J43L51j29l5J16k69j36K88L1r2J81q4k35
3075a60J02O0p5J76M1k69O9J61j53L7J07k03rK35o1j09J23q5j19J41J0KJ15r9
3099C7j91J18N0o0J76l8k49J27J36j94O0J65j83m8J89j38o2K31r7j53J63j3j08
$$ y = [-19, -64, -42, 199, 109, -61, -12, -202, -222, 203, 222, -78, 62, 46, -301, -72, 216, -60, -50, 226, -57, -203, 110, 40, -134, 46, 21, -113, 179, 174, -159, -96, -44, -183, 124, 326, 7, -80, 16, -226, -204, 212, 210, 49, 70, -110, -248, -19, 97, 62, 103, -5, -101, 61, 17, -152, 23, 64, -135, 75, 230, -55, -78, 20, -227, -153, 260, 211, 23, 33, -213, -316, 61, 165, 42, 188, 42, -290, -80, 75, -100, 95, 264, -133, -163, 145, 4, -105, 81, -47, -133, 167, 185, -42, -36, -98, -198, 59, 197, 70, 125, 22, -286, -170, 104, 58, 149, 195, -147, -235, 12, 3, -9, 140, 11, -89, 67, -23, -97, 73, 14, -146, 68, 141, -50, 77, 68, -290, -147, 204, 75, 40, 156, -113, -249, 39, 70, -22, 159, 75, -160, -58, 2, -73, 103, 144, -125, -56, 105, -48, -11, 96, -107, -116, 119, 58, -51, 72, -13, -132, 9, 19, 21, 136, 37, -154, -36, 14, -46, 130, 92, -157, -30, 106, -88, -28, 137, -46, -94, 95, -43, -105, 126, 29, -124, 39, 26, -82]
3122h2J83l3k43J77J26k19O2J47k20J1K20j50q6K06n9j50J35J2r5J31oj71Q6P0
3146E2q7N8L0j27R0Q6j77%J44r1J4J12j29l9J11q1n3J62k9q8J18j18j11K16L8
3171A01k00J23O6k07J00J43k27jK36j35r8K09o8j50J27j2j38K10N7k18M3M6j15
3194a08J41J23j89l5J40j26m0J81l2j00R5p8n0J26K4j01K6l3k8J44Oj52M7K2r3
3219i0J24Q7j44j0R2j69J9K21o4r7Q5j28o1K35Jj72Q7J1j40J44Q5j86L9J20j89
3244a00J2K04p8q2Q3r5n2J84L5j44NJ3p7J27N9j32N3Pj20O4J17q4MM4j37NJ67
3271H2k3p3L5p3k6J60l5r0Q4k8j11J13N4j18P0M8j90L9J88q0m4O1j16k5J77j9
3297F0j19R9l2j01J15L4r0P1K5j59L2J18m8%N9j21j6J49m6o1N1l2l0R7n2n4J31
$$ y = [-82, 101, 68, -175, 2, 128, -91, -29, 118, -102, -91, 129, -21, -107, 99, 40, -110, 25, 37, -58, 73, 67, -104, -18, 52, -35, 23, 53, -74, 16, 102, -75, -75, 69, -22, -8, 104, -25, -64, 47, -34, -87, 75, 46, -42, 76, -42, -153, 63, 101, -99, 24, 90, -117, -17, 126, -101, -102, 134, -1, -99, 110, 42, -108, 19, 7, -131, 79, 136, -82, -39, 7, -108, 33, 156, -33, -68, 72, -54, -94, 87, 55, -45, 50, -28, -78, 48, 72, -29, -3, -36, -64, 80, 86, -66, -19, 3, -90, 34, 121, -23, -33, 59, -110, -91, 130, 66, -31, 54, -74, -135, 100, 101, -71, 16, 27, -113, 31, 116, -70, -31, 89, -100, -88, 116, 38, -44, 39, -56, -108, 76, 111, -33, -28, -15, -92, 35, 94, -38, 15, 22, -98, -34, 83, -1, 3, 47, -90, -85, 82, 59, -14, 21, -52, -78, 82, 47, -43, 41, 13, -98, 15, 69, -49, 21, 69, -121, -82, 106, 26, -18, 43, -73, -98, 79, 60, -59, 40, 8, -93, 22, 56, -34, 37, 62, -97, -65, 53, 5, 5, 64, -57, -73, 76, 30, -31, 20, -12, -42, 55, 3, -51, 80]
3324H0o5j06J01L2p8R3J1j84P0J40j06pR1r3l5J14o1o3J36l1j22J09jr1J04K3
3350F1j60N7J27j18%R2j02lJ00n2p5J22l2o8O6k8l3J02j8j10P7K0p5P1J0j01O3
3377gP1j09J7P4o7J2O1j04nJ32n5r3J14k8q2J31j6j44J21O5j65M0J12j00J0R8
3403H3j26n0J57l1r9J02l2p7J15qr9P9O1j27J7P4o2M0L3j12MR7l4JK8p1j8J01
3431D6o1k0R0m4o5Q7l9m8J26j6j59Q6P1r0P3N8j79L1J46j06m9J53q7r2J42m4q6
3458g6J58Jj80N8R1q8O1O7j57OJ39q3l0J02o5o6Q3k4l6J00Kj21K5L1j5P3k8r0
3486f2M6K0l8P3J0j02N6N7j16K2J36r6o4J08q1j2J52o9j33R3L6r2J16K3j72P2
3512a7J04j56M8J50j16q9J22o5n8J86k5j81O9P7q9N1L4q3J9O1m9J7K7n6nM6n3
$$ y = [80, 15, -91, 10, 42, -36, 57, 68, -116, -46, 94, -12, -19, 72, -21, -56, 58, -3, -66, 70, 39, -83, 26, 25, -66, 38, 61, -99, -42, 85, -33, -33, 59, -43, -46, 54, 2, -73, 49, 17, -51, 15, -13, -46, 56, 38, -72, 5, 25, -50, 21, 31, -70, -7, 64, -45, -28, 46, -21, -9, 52, -52, -57, 75, 20, -73, 41, 13, -69, 62, 46, -98, 23, 88, -77, -37, 75, -25, -15, 83, -43, -93, 64, 33, -66, 36, 4, -73, 42, 34, -65, 14, 75, -52, -35, 39, -23, 17, 50, -62, -58, 39, 5, 6, 34, -37, -55, 46, -15, -35, 55, 11, -54, 33, -6, -54, 72, 56, -103, -17, 54, -36, 37, 95, -84, -53, 93, -13, -62, 91, 4, -88, 54, 10, -76, 82, 83, -97, -39, 52, -36, 25, 92, -65, -59, 80, -3, -33, 69, 4, -62, 21, -3, -39, 61, 63, -58, -33, -2, -17, 56, 28, -62, -16, 4, -34, 39, 49, -53, 3, 60, -56, -34, 102, 6, -58, 50, -31, -43, 109, 40, -93, 0, 36, -56, 60, 83, -89, -17, 87, -69, -21, 129, 13, -76, 46, -19, -77, 109, 84, -97, -28, 49, -40, 11, 45, -38, -19, 42, -7, 10, 37, -19, -24, 22, -31]
3539c1L1J15j02q7M1mJ9J07o4p0O3n6k4J01j3o8R4j0j54J11J11j73J8J15j26J0
3565d6J71j28j25J52K1j00J32lj46O4K4j15J07J06j19k4P2j30L2J63p0j11J11
3588C8j3p0O2Np2M3L3l4L3j9l4L7m2o1J57M4j40J2L0j14P8J43j21m2J01p0p2J31
3616D3k5m8J10n7j25J43K2j49R4N1j44R5J37j85q0J73l7q9J53Pj30N1lq7R5N6
3642G1n8J2j5p4P8O9j28L2P1p6kP0p7k8R4m6k4O5pm6M2p8j7J51k8j25J08mj36
3671a06J31P7j76M8J51j55o1J50n0o1J10m2p3J02Kr0N0Qo3R8M2j53L6J02j13m
3697d0J04o4l0Q7n7n1R1J0o4L7m3rR0l7q4R3pq3Q0K3j21P5Q4j44J0J36r2l6J00
3726E8p2l4J24n6r4R5Jo6R6j2j18R6O6j37K6J02j07nJ07p5m0R6k6p7N2QnM8m0
$$ y = [-31, 0, 115, 13, -74, -33, -37, -18, 89, 25, -45, 18, -38, -62, 39, 26, -42, 52, 42, -112, -1, 110, -63, -45, 70, -56, -46, 125, -3, -128, 24, 45, -55, 77, 74, -72, -8, 16, -99, 8, 114, -5, -29, 43, -87, -55, 108, 38, -73, 38, 25, -45, 17, 22, -50, -7, 26, -8, 25, 6, -28, 9, -33, -94, 63, 107, -33, -21, 9, -105, -27, 116, -5, -47, 54, -16, -88, 43, 18, -30, 80, 23, -102, 41, 63, -86, 8, 59, -85, 10, 147, -38, -118, 55, 18, -71, 82, 89, -41, 10, 7, -80, 15, 71, 13, 25, 10, -64, 14, 83, -45, -13, 58, -18, -20, 50, -27, -55, 39, -7, -31, 34, 27, -19, 23, -55, -72, 79, 51, -74, 34, 30, -106, 25, 102, -74, -26, 125, -30, -91, 59, 9, -52, 58, 16, -57, 45, 47, -43, 7, 15, -48, 50, 92, -61, -25, 77, -36, -40, 64, 0, -30, 57, 0, -51, 40, 50, -14, 23, -20, -29, 61, 24, -60, 33, 26, -57, 23, 46, -75, 0, 84, -60, -50, 86, -6, -42, 58, -14, -48, 76, 20, -74, 21, 22, -44, 52, 40, -78, 18, 84, -53, -27, 75, -32, -37, 70, -5, -45, 51, 25, -52, 0, 8, 3, 51, 11]
3755A1o9R2mo0O7%r2P5N3j23L2J11j02m6R7n7NR4q3q4J23k0n9J13n2j14J25K3
3783E6j32P3J05j44PR7r1j2J24q0q2J12Om3M0m1n8Q3J7n4O1Rj04M2L2p4P1Q2j06
3812dn2P0l8J7O4m9m2Q5l5n8P1l4o1J30j4j14R2N2j57J9J14q9N6Q1j27o5J03j5
3840@l2Q6j9p3N9k1r3R1O2q5O5J6j11J9P9q8k0J21k9l5L8p2k5Q2j2JN7m4k9K4
3870A2l8n6J29L7r8L3Rj02L1P8o8N2Q3r6o8O1m4nJ27n2o8J05l7j12P8M2r5Q0Q3
3899A01j41LR3r5l2R8j4rO9q5q5P5K9j2O8Mj09M5j0p7P4P5n4k0K6n5K3O4o0k2
3929c3N9j0PM0r0l4Q5nm3R5k1j10M2J4o1R7R8j28m0L8n9L0J23q0m8P3n0n6J24
3958E7k1r8P1jq6J08O8j31k8N7l0L2J05r0p9M5jkQ1j5p0L3l5l7J01L4o9k0Ol8
$$ y = [11, -58, 34, 30, -30, 37, 37, -55, 20, 73, -50, -18, 93, -9, -55, 42, -15, -10, 84, 1, -83, 40, 20, -39, 74, 22, -92, 33, 56, -76, -3, 102, -42, -35, 62, -29, -41, 83, 3, -79, 33, 39, -4, 36, -5, -63, 20, 37, -17, 44, 53, -51, -9, 23, -51, 20, 102, -4, -56, 14, -24, -7, 57, 8, -34, 51, 16, -42, 29, -5, -66, 64, 50, -64, 28, 80, -77, -58, 56, -33, 23, 104, -23, -88, 15, 0, -32, 54, 35, -38, 21, 0, -93, -2, 60, -25, 40, 56, -55, -36, 43, -45, -65, 56, 27, -8, 30, -42, -67, 15, 3, 4, 61, 17, -12, 12, -26, -82, 47, 84, -14, 19, 28, -74, -43, 35, -33, 19, 102, 6, -62, -1, -45, -50, 77, 25, -43, 62, 25, -87, -9, 33, -62, 18, 101, -40, -37, 56, -39, -71, 27, 13, 4, 73, -12, -97, -22, 7, -5, 63, 67, -42, 3, -7, -84, -10, 65, 11, -9, 17, -38, -15, 49, -11, -33, 26, 16, 23, 63, -27, -61, 24, 19, -24, 71, 50, -60, -18, -4, -65, 32, 130, 2, -38, 0, -59, -29, 94, 14, -34, 39, -11, -67, 57, 36, -62, 9, 8, -78, 30, 98, -33, -61, -4, -34, -2, 103, 13, -66, -21, -22, -24, 57, 42, -28, 5, -30, -67, 34, 68, -1, -21, -15, -53]
3988e3P8N9r3k2K0k8O0N0q0LL3p8QJ27k9q6M6l9n2J37M7j34oM4p1P0Q0r9j9N1
4018B4p1j4J22k1n3J7l4n6J07O3r5j9K3l2M2N0n5k7L3k8RN2k3p%o4J9J05j5n9
4048gJ0n4k3J22K5q6J7J2p5N4M7m5J7K8j04K2J11o4l1O9r3j5J38jj37N5K8p6O3
4077GO7r7PM8p5lQ8nm8K8l7l4R1J0p1J9oj5N3j2n5M6K1m4K0K1m0K9jo2L5Q2p0
4110clL5o3JJ09o1o7Q9mq0O0L1q8N8M3j11L2R2q3j3O6n3qR4n0p5O2L1o3M8Np5
4142d4K8O2p2K0L6l7j3L1l3J2M8m9k0J6J1J1L2n1k2M7j0k7O2k2o0O6k3n2Q0M4
4172G1j10J1N9p3M0P6r3m3R3j1n0O9j4r2O1K5p0O8L8q6oM9l6K4O4p8m2O3J9k2
4202DJ7k0l5L5Lj7L2ml6J3jj8P0qq4K6K6k5K7M0o8j1O7l2k1O1l0m0N9j9o1Q5K0
$$ y = [-53, 25, 84, -9, -31, -11, -39, 21, 71, -9, -6, 27, -51, -43, 84, 55, -31, 15, -24, -76, 61, 108, -26, -32, 12, -59, 11, 91, -8, -27, 24, -47, -61, 61, 40, -13, 4, -30, -86, 21, 84, -11, -30, -7, -39, 3, 53, -2, -29, 4, -24, -15, 37, 14, 7, 7, -57, -38, 67, 52, -7, 3, -51, -74, 48, 73, -13, 4, 16, -59, -5, 42, -3, 14, 42, -62, -40, 71, 7, -24, 45, -48, -63, 75, 74, -63, -8, 20, -56, 7, 74, -23, -16, 32, -43, -46, 42, 37, -11, 17, -20, -54, 37, 47, -24, -5, -11, -26, 27, 15, -40, 6, 27, -17, 3, 24, -16, 13, 12, -50, -15, 67, -3, -6, 29, -34, -33, 76, 15, -52, 37, 33, -47, 13, 44, -44, 14, 57, -54, -22, 70, -13, -26, 40, -13, -21, 73, 23, -52, 10, 41, -22, 26, 31, -44, -16, 46, -26, -6, 30, -7, -20, 11, -22, -10, 38, -11, -31, -15, -4, 7, 39, -12, -34, 13, 3, -24, 38, 16, -44, 22, -1, -53, 27, 71, -39, -28, 31, -42, -2, 74, -19, -62, 31, 20, -30, 39, 25, -67, -6, 19, -51, 17, 55, -31, -37, 12, -24, 0, 64, -14, -56, 7, 26, 4, 21, 1, -34, 1, 4, -13, 19, 15, -21, -8, -9, -27, 43, 35, -49, -23, 3, -22, 5, 45, -23, -34, 33, 1, -20, 41, 11, -29, 30, 11, -50, 35, 55]
4235E5j11M4M5n8L2N3r8mQ8l5m3O4j7l2M0qn2O0Pm8J3K0l6K4K8o0lO1k9j4K3j8
4267iPK1k5rK1k7J8L1n3j1O7k7n1O6Oo7L9K6p2M7O4q1l2P0l1mP8n2o6Q0ln6N8
4300B3J7n6J9J4n2M1N4n0n4M7%%M7l5n1K7NkK8j2l8K9l3mP5J2p0Mnk9O4M9p8k0
4334c4M6k1jP6o6k5L8m6k1J05mq8J9Jk7R0M2j14j7M5k5L1P4m7o7J9nk0Q5J3n2
4365Dqj1k8P5K8o9k0QlO0K5p7j8J3rM1M9m7l1pm7K7J19mq4Pn3j5J25K4r0oK0m8
4399e0L7P1o8j8M2m6K1R0l6q7jJ0jJ15J2j08m7J7j5Q3O4o1k7j1l9QQ7J2l9k1k6
4430c2K5O0l1n2JLK7O9l1p0lj7lQ8O0p0l1l2o4O7J19k5n5lm5l3J23j2p2L9K4o0
4462c6N2K9q2kM0m1M3Q7o4q1lJ0L8J02j9q0l2pnO9K9l1j9%l7K9L1j4j7jj3N3L3
$$ y = [55, -56, -12, 33, -25, 7, 60, -38, -42, 46, 11, -32, 32, 15, -17, 23, 15, -37, 23, 30, -18, -5, 15, -21, 3, 31, -29, -32, 29, 0, -14, 9, -9, -2, 19, -6, -15, 6, -21, -3, 28, -25, -36, 31, 4, -47, 19, 25, -42, -3, 23, -49, -2, 62, -19, -51, 19, -12, -16, 62, 10, -56, 24, 21, -35, 23, 40, -16, 3, 17, -35, 6, 60, 10, -44, 3, 3, 3, 50, 15, -36, -9, -4, -6, 22, 10, -28, 1, -32, -36, 39, 51, -19, -15, -20, -49, 15, 64, -14, -34, 12, -9, -10, 66, 0, -25, 13, -33, -54, 51, 47, -41, -22, -21, -48, 42, 84, -30, -47, -2, -27, 4, 78, 31, -36, -17, -22, -42, 43, 56, 4, -4, -15, -43, 32, 60, -9, -29, -21, -24, 36, 61, -16, -34, -21, -30, 11, 60, 13, -18, -25, -72, -45, 74, 70, -14, -7, -60, -75, 50, 74, -16, -22, -2, -50, -13, 58, -10, -28, 14, -32, -11, 79, 43, -44, -45, -35, -36, 79, 91, -17, -64, -47, -62, 21, 85, 24, -3, -14, -53, -45, 42, 54, 15, -6, -32, -7, 53, 22, -30, -29, -26, 1, 70, 39, -31, -34, -51, -54, 34, 94, 24, -7, -39, -103, -36, 83, 58, 3, 0, -45, -78, 45, 33, -39, 0, 24, -36, 16, 45, -37, -39, 1, -40, 3, 90, 26, -55, -58, -48, -10, 92, 73, -7, -39, -46, -51, 18, 47, 16, -3, -3, -40, -11, 20, 6, -11, -12, -25, 28, 61]
4495F1n8n2OQO0O0o3p0J9l1J5R3M0p7j4j3o4P3Q7p9k2L1m1J8O9n2q2P2J2pN8j3
4527D4r6NJ9lO2N8p9o2NJ0M8N8l4n3j6QK5L5Km1Rk9LM5K2n4j5j7K4P2J1p2l1K3
4561a4k2N1M6m9n0K8l1J3Q3j4n5j0j0j6R7K6q6l9L7j7L5N8p2m3M6nNN3k7k6j9
4592b7O%N5K5p8k5K4J6M4J6o3k6J9LL3K7m4j7%k6K8N4j6l0qj7MO3Np4NK2j4L1
4626A5J4n1j7M1l3K1O0k4n5JqJP2K0q0LL%K9K2l3mJj0lL9j7l2K2j5J8M5mo9MO
4662a8K2L5Rp1MJ6j7L7K3k7j9K1m9J6N5k3l4K4j8j3O1k6n4L8K8l0K2K0m7LJ3l1
4694c0K5L7l3j6J1k4jO3j9m3K6Mk3K7Ml6K6K3l7RJ7j7J2Pl9K5L4k9k2K8k0OL4
4727B9k8l5N1j7k2J7J6k3L5qm5J7M0k6j1L9m2kM4l4k8O1k5l2L6kl6N0Rn5J9K8
$$ y = [61, 3, -49, -43, -35, 25, 85, 22, -48, -29, -60, -45, 48, 88, 11, -3, -16, -80, -7, 80, 1, -21, 10, -31, -13, 56, 4, -78, -6, 6, -1, 57, 44, -52, -47, -28, -31, 31, 89, 10, -52, -47, -37, 11, 69, 35, -18, -34, -26, -1, 34, 36, -5, 4, -25, -22, 23, 45, -9, -24, -41, -17, 55, 66, -6, -37, -14, -36, 15, 61, 12, -38, -10, -41, -28, 55, 41, -14, -24, -34, -50, 47, 73, -13, -52, -15, -32, 3, 61, -11, -54, -8, -13, -8, 45, 18, -8, -27, -21, -21, 34, 59, -19, -44, -20, -4, 40, 56, -7, -33, -14, -11, 22, 49, 5, -12, -12, -38, -10, 44, 28, -2, -10, -27, -23, 40, 45, -29, -24, -2, -16, 15, 29, -22, -39, 2, -31, -10, 50, 26, -29, -28, -36, -35, 37, 57, -23, -20, -17, -17, 12, 34, 1, -3, -2, -12, -15, 24, 7, -25, -3, -18, 0, 45, 41, -28, -24, -18, 4, 39, 48, -23, -19, -3, -20, 17, 40, 13, -6, 15, -34, -18, 37, 14, -20, 4, -14, -27, 34, 8, -46, -8, 20, -10, 12, 32, -15, -12, 1, -30, -5, 32, -1, -17, -6, -30, -31, 32, 13, -30, -4, 0, -23, 4, 8, -28, -2, 21, -16, -7, 10, -7, 5, 12, -27, -2, 32, 3, -19, 9, -11, -5, 29, 1, -34, 17, 0, -22, -5, 11, -12, 23, 15, -30, -13, 27, 1, -10, 29, -13, -15, 29, -5, -33, 28, 3, -29, 7, 5, -31, 19, 28, -27, -8, 20]
4759B0l4J3K0l2nL5k7nL7j9k6L2lk7M7om5KL1j1J7Ln3K9L1l2J1K6m8J1K6l4QN9
4793E1l6n1L8Rj6L5j6l5J9L1k7J6rj5qK1k8J1N7m2m0L5k1kN3j0n9L1K4k4K6j4
4825Dl4J1J9k3K2L8m1j3K5j9J0M5l3m6L2OJK7k2l9K3K3k8K5K5n3J9Ol4K6M5m5
4857Bl8L0nJ9K4k8n8N1Oj8L9jl5kJ0k0L6K2n2qK3j3K2L7n3k6L6nlL6j9l9K2J3
4891El4M8J9n9KLJ1L1K7n8j9K2OPK3k7m0M7j6qL5On1LJ3j4N3Ro2j1L9j0J7L3n7
4926gl1M0noL6j0m2K0Lj8N8qo3J1J7mL7Qn8lL2j8QL3m0j1K1j4mN3j8m8J9P%L6
4962C1Op3RK5lK6J7n3oK3j6J2N4l4l3LMnO2k3o4K0K0mJ9Rn9J5K3j3LL6m1k2J4
4997a8jRN3l0m6JJ9J4K5j1n0J1K1j0J4J9k5j1J1oPL8k9n5L2PJN6l8n3K7K7rM2
$$ y = [20, -14, -1, 19, -13, -18, 17, -10, -15, 22, 3, -23, 9, 6, -21, 26, 20, -25, -23, 8, -3, 14, 17, -36, -7, 24, -8, 3, 29, -19, -8, 18, -16, -8, 51, 15, -36, 2, 11, -5, 30, 14, -21, -2, 29, 2, 18, 9, -6, -14, 7, -21, -10, 47, 5, -35, 0, -21, -23, 30, 20, -39, -8, 16, -8, 18, 4, -30, -19, 0, -23, -1, 37, -4, -17, 8, -11, -1, 44, 11, -35, -3, 3, 4, 31, 9, -30, -7, 16, -12, 13, 38, -15, 4, 10, -24, 2, 47, 2, -36, -6, -11, 8, 32, 4, -54, -3, 3, -15, 24, 23, -12, -14, -4, -24, 12, 34, -18, -26, -3, -16, 6, 43, -10, -36, 0, -5, -8, 28, 9, -30, -8, 5, -29, 19, 38, -21, -19, -16, -5, 26, 53, -5, -24, -2, 4, 11, 34, 7, -33, 14, -2, -10, 25, 31, -20, -17, -4, -18, 35, 44, -18, -29, 10, 0, 17, 50, -7, -38, 2, -3, -9, 27, 17, -25, -5, -2, -20, 38, 30, -33, -22, -5, -9, 28, 36, -22, -25, 7, -11, -3, 30, -10, -21, 0, -14, -18, 35, 17, -31, -12, -5, -5, 31, 37, -36, -27, -2, -5, 21, 38, -15, -21, 2, -14, -2, 52, 18, -15, -12, -8, -13, 49, 26, -38, -18, 2, -2, 17, 26, -33, -18, 5, -8, -5, 31, -10, -32, -18, -19, -10, 43, 13, -33, -32, -13, 1, 26, 15, -35, -24, -3, -13, 1, 20, -5, -16, -5, -11, -4, 34, 5, -50, -18, -11, -10, 46, 8, -45, -18, 9, 0, 42]
5031D2j5m0LJ0j8K7M0m7j9J1j6L4K8k4l9K0J6j3K5rm7K2K2k5L0Ml5k5L6k6K9L7
5063C8k9m7K4OJ2J8pm7L0K0l5K8Jj8JLk4L2K4m2qK5nJ1K5l5l5L2PkK3j0l2J1L
5098bk0L4L0m1j1LlK2K3m2j9M2%j2J4k5j7K5jj4J6K1m0lJ3j1L5K4m6j4OJ5kK4
5132B4l4qK4Jk5L3j1j5J2omK3J7m8LK4j4J9J4m4MK4j1oK5j0j3J8j5j9M2Lk8kJ7
5167A4k9K7K2m9kL1mqJ8l5%K9j4j5L2qk5PPoJ4Rl6RJ8LlJ2k6NJ7nk2K2rpK2oj8
5206iL2jk6LJ6j3J5rj9KL0lj7K4k1pK1j2j2K5jl5J3RpK3km3K4J8j6j2J4k0KK4
5242A0k0KJ7J1l6J5Nj9K9Jm2J9K3j6jJ4l1J4Rj5JJ4joNr%L2jl8K1jk5K3Pl2K8
5279GJ6n1J7K1lqK3l6J0L2j8k9J3J9j8K7j3l0K4Rl0J4K2j6jPl6OL5Kk6J5j7nJ5
$$ y = [42, 27, -13, -10, 0, -18, 9, 49, 2, -17, -6, -22, 12, 40, 16, -23, -3, 13, 0, 25, 16, -31, -9, 13, -12, 18, 22, -13, -38, -2, -28, 1, 38, 9, -38, -14, -8, 4, 22, 15, -32, -2, 18, -17, 11, 12, -6, -5, -2, -26, 6, 30, -12, -20, 5, 0, 11, 36, 1, -34, -2, 5, 3, 26, 16, -16, -5, -2, -22, 12, 42, 1, -10, -7, -10, 12, 35, -7, -26, 16, 16, 4, 18, -7, -24, 1, 0, -14, 2, 23, -17, -20, -7, -18, 17, 41, -5, -19, -13, 2, 0, 24, -10, -18, 6, 7, -18, 15, 4, -11, 1, -5, -9, 14, 31, -17, -14, 10, -4, 15, 29, -15, -11, 13, 2, -4, 21, 11, -2, 16, 1, -18, 24, 27, -1, -3, 14, -15, 12, 34, -15, -17, 14, 10, 2, 20, -15, -15, 14, 0, -15, 17, 9, -16, -9, -2, -8, 6, 15, -21, -12, 6, 9, 6, 18, -8, -3, 14, 9, -13, 9, 0, -7, 15, 9, -9, 23, 22, -4, -1, 15, 2, 17, 8, -11, -9, 21, 18, 1, 25, 4, -3, 18, 6, -6, 19, 18, -17, -4, 5, -2, 21, 19, -24, 0, 18, 2, -10, 4, -16, -14, 10, -10, -8, 9, 20, -16, -1, 4, -15, 14, 15, -27, -8, 15, -1, -2, 12, -19, -5, 4, -11, -10, 4, 3, -3, 2, -7, -7, 25, 24, -14, 7, 6, -19, 4, 11, -21, 7, 23, -28, -11, 10, 7, -1, 22, -14, -4, 28, 10, -19, -6, 13, -5, 22, 9, -21, 3, 12, -18, -4, 18, 2, 1, 8, -28, -22, 13, 15, -11, 4, -13, -18, -3]
5314cPk0K0K0k1Nmj4J8J5m9K8K4j7rMk2L5J2pqonk4K6qJ5K9j8n0K6J3j4K0ml6
5350b2J4L6l0l0M0Kl3M3ql5L0Nl9J9K9j7nPl7JM8pqRj6j5J4OlKQk3L0k3MK0k0
5387dj9L3Rj7K3k2l8L7K1j5J0Nk9j2K7j7K1L6m4l7L1Rl5M6Qm7J8K4m0j7P1l4l2
5420c0L5Pk7K7ml8J8K6Lj3J2k1j6L6pj9jO%J3rOJ2j4MlrNK8m2kM7j4k4L1j4l9
5457c0N1Oo0L8K8m8oM6l3KL9l1l4N3Ml5K2Nl1J6J9m3J3L3k2j4K4j7j5K9Lk7J1
5490dJ4j9Oj7OK8qoJ0k3OK6k0l2N9j0l6K9mk2L2J4l6OM4m3j4M2m1j4N8j5m9L7
5524DK2m6QK9k3LK9k9k9M2Qk6Qkj2J1J0k7NK3mnkj2Rjj2J2OJ2lj1k6K6J7k3J7
5561HLk1nM4l9j4O1l1k3L4qj9K5Jm3J9M7l7k4M1j6j6M1j4k4J9J1l8J4K2j7JJ2
$$ y = [-3, 4, -16, 4, 24, 3, 8, 4, -10, 8, 23, -26, 2, 26, 9, 0, 4, -18, 17, 29, 22, 14, 8, 3, -21, 5, -3, 12, 41, 23, -27, -1, 12, -2, 18, 14, -22, -8, 28, -2, -32, 8, 10, -23, 20, 12, -23, 7, 12, -27, -8, 21, 4, -1, 6, -31, -30, 18, 11, 3, 12, -4, -19, -5, 1, -2, 0, 8, -15, 15, -8, -4, 16, -4, -23, 10, 19, 2, 25, 3, -35, 2, 23, 8, 18, 23, -6, -18, 9, -8, 13, 49, 5, -32, -1, 8, -27, 19, 27, -20, -2, 22, -18, -35, 36, 2, -30, 5, 12, -15, 12, 8, -30, -12, 14, 17, 4, 16, -5, -21, 15, 8, -11, -12, -6, -6, 7, -2, 4, 16, 2, 6, 3, -6, -1, 27, -15, -17, 30, 16, -8, 23, 9, -30, 21, 27, -33, 5, 33, -15, -21, 25, -8, -6, 33, 2, -32, 21, 25, -10, 12, 17, -14, 2, 21, -22, -9, 24, 2, -12, 12, -5, -20, 9, 12, -15, -4, 10, -9, -3, -20, -14, 14, 6, 0, 10, -13, -7, 19, -1, -33, 26, 16, -20, 9, 5, -17, 15, 29, -7, -1, 43, 0, -14, 28, -13, -27, 31, 16, -33, 4, 26, -20, -12, 17, -6, -3, 26, -3, -32, 10, 18, -8, 0, -2, -14, -3, 7, -20, -15, 8, 4, -1, -3, -15, -6, -7, -19, -7, -1, 11, 8, -3, -29, -3, 14, -9, 8, 11, -10, -15, 29, -10, -24, 37, 6, -17, 17, 9, -10, 15, 16, -27, -8, 39, 2, -22, 19, 3, -13, 28, 14, -10, 9, 20, -18, -4, 18, 1, 2, 14]
5594A4l3RK0kj7O%NKOj5%j4K1%j9K9Rk7oJ7p%K4l3l1O0Om7L7Km2K8J3k2j0M8k0
5632A1l8M9Pm8L5Pm9K6K7l5jK7k4lK9j9kJ0Kl1K5Lk%qqJ4rKOj4rK2qj0K2mj6K1
5671GOk3J7K5o4RL7j6%K1j0l6N1k4j7K2J6l4J4J6k6OL5k3l4L2pj0K5k2mJ2J5j8
5705bOQqKqj0J8Pj3n%J1mlqJ1klmJ1k6PL9l7j1K6lrK0j5k1K7Jk1J2K7l4KJ8j2
5745frL2k5rK4Rk8J6K1l7RL5m1lK9j3qK8l1JJ8nj4J2Qj0J3j3k4J5MJ2j7mLJ0J
5782Cj5PNJjLj5J8rmj8K9j2j3K6j2nJ9Nk7J5J7l5J2K0j6lK4k0k5K6J4k3K2qk0
5818a5K1Qk8K2J5k0oJ1%j2K0ok9K1NjkLj7QJ3j2qMNPj4%J6noNj0oJ9%j9%J3%j7
5859a7K3ppK2pk4K4Kj7QLk0K5Nk3kK4k0J1J5lj6J3nk8RK6j9J0Nk5J4K2j9j2QJ2
$$ y = [14, -19, -10, 10, 8, -9, -3, -3, 2, 4, 10, -5, -5, -19, 2, 2, -17, 12, 21, -6, -12, 5, -2, -2, 22, -11, -42, 18, 24, -23, 14, 16, -26, 2, 15, -7, -17, 31, 11, -27, 22, 29, -19, 16, 23, -26, 0, 27, -8, -9, 18, -6, -9, 20, 1, -1, 9, 11, -20, 5, 8, 6, 6, -2, -10, 4, -5, -3, 3, -11, -20, 2, -6, -16, 6, 2, -14, 7, 13, -10, 7, 32, -32, -23, 14, -2, -2, 19, 9, -27, 24, 0, -17, 5, 21, -13, 1, 17, -9, -3, 32, 9, -25, 7, 0, -10, 15, -7, -11, 1, 16, -2, 4, 12, 4, 6, -2, -12, 6, 13, 0, -5, -5, 6, 2, -1, -9, 2, 0, -3, -7, 4, -22, -15, 24, -13, -24, 2, -1, -10, 10, -5, -26, 1, 2, -19, -7, 20, -14, -12, 6, -6, -15, 17, -8, -17, 7, 16, -12, 4, 25, -12, -3, 32, -9, -12, 17, 4, -4, 24, -7, -6, 12, 7, -7, 5, 13, 3, 16, 3, -21, -6, -2, 10, -7, -11, -8, 2, 3, -12, -5, 0, 1, 0, 3, -12, 6, -3, -7, -25, 4, -8, -21, 5, -7, -12, 7, 12, -15, 0, 17, -18, -6, 14, -2, -5, 19, -1, -26, 0, 14, -9, 13, 5, -15, 6, 14, -14, 8, 23, 3, -3, 8, 8, -4, 16, 10, -19, 2, 7, 6, 4, 7, -10, -2, 11, -1, -9, -5, 0, 7, -7, -7, 9, 4, -2, 3, -7, -13, 6, 6, -13, -13, 0, 0, -17, 6, -1, -8, 14, 7, -17, 7, 9, -8, 0, 3, -17, 8, 13, -10, -12, 12, -8, 3, 18, 15, -1, 12, 7, -21, -12, 14, -5, 5, 10, -15, -1, 21, 2, -10, -2, 10]
5896A0j5J1j2pJ4nlOJ1oJk9J0J6PqMj4OrJ3nNLnpJ7k5OK8k0qK9ll1J6pqK9Rk2
5937BnJ2k0LJ8Kk0K5k6NPOj2J1koRPm1J3jJ8kjqj1J7pJ1J1Pk5J1j5rK2Oj4R%j1
5978dj3J5j5J2J1j6RJomK1j0j2L4j2k0PRj2K1rj9K0Rj7mJ7j4J9lj0qJ2OrKJ3l0
6016iJ7Lj9K1j1jOj4mNJ5k9JK5jj2N%j5J5Nj5K3j0j0J0Jj3J5Nj6MJ9j3%Qk0OK3
6055B0k2j8K2Rj1KJk1K2J7k8OJ1j2mK7k6J1J5j8j1J4jj1J9k3pJ9Rj4J0rqJ9qj1
6091a0J0J4k3j1J9rJ5Oj1j6K3j1oJ4lj4K0Jj7J8Lj7MJ4j2J0nk8J0QJ4J0oj3j1
6126a0K1j1KQJqLjk2K3J2k9OJ8j3J1Jk8kL0j8QQPk2lJ0oRRl0JJ1j2J7J2k8JJ8
6165Dj4J4Lk2RJ0j0jJ4mokoJK1Kk6MPoJ2J9k2MJ3r%K2j5j2%j6j1M7jm0J4lmJ6
$$ y = [10, -5, 6, -6, -13, 1, -4, -7, -1, 10, 4, 5, -24, -14, 2, 9, 1, 5, -9, -3, -12, 1, -4, 1, 4, -1, -8, 9, -16, -10, 18, -2, -10, 19, 16, -15, 1, -6, -14, 15, 24, 2, -3, 9, -11, -8, 10, 12, -8, 17, -9, -4, 3, 9, -3, 8, 6, 0, 9, 16, -25, -12, -13, 5, 3, 2, -6, -17, 0, -7, 4, 15, 22, -3, 8, -7, -16, 6, 12, -2, 7, 7, -4, -17, -2, -17, -5, 6, -10, -1, 0, -6, -10, 11, 1, -11, 23, 11, -9, -2, 7, -5, 16, 7, -12, 8, 17, 0, -4, 13, -1, 18, 15, 5, -3, 9, 15, 6, 8, 21, -9, 8, 11, -8, 13, 2, 1, 7, -7, -11, -6, 9, -20, -19, 6, 5, -7, -2, -2, -17, -2, 3, -12, 11, 1, -9, 1, 2, -11, 4, 9, -7, -3, 16, 3, 3, 11, -9, -3, 20, -2, -20, 2, 11, 0, 2, 3, -18, 4, 21, -7, -1, 10, -2, -6, 21, -5, 6, 21, 3, -8, 6, 5, -6, 13, -10, -17, 2, 11, -3, 7, -2, -10, 9, 1, -10, 0, 14, -9, -20, -1, -10, 5, 11, 0, -16, 7, -4, -10, 4, 1, -13, 7, 8, -9, 9, 12, -5, -1, 13, 1, 11, 6, -22, -12, -4, 10, 20, 14, 1, -10, 11, 0, 2, 10, 11, 3, 6, 5, -17, 6, 18, -11, -5, 13, 0, 11, 12, -16, -18, 12, -6, 2, 10, 17, -5, -8, 2, -4, 5, 14, -16, -15, -4, -16, 1, 13, -15, -14, 4, -10, 4, 7, -15, -6, 4, -6, -7, 7, 3, -3, -5, -11, -10, 11, 13, -13, -9, -2, -8, 4, 23, 1, 5, 18, 9, 9, 31, 16, 4, 4, -12, -23, 24, 23, -17, -3, -6, -10, 6]
6205FJ4k7OJ0j3OJ4pk3J5j7J1J2pj7RmMJ2Nj8LLpJ8LolKk2J7J6j2jJ0k9K5K4k8
6244DoJ6j2PJ3j3j0J4J2l1PL6l0%pj6J4K6jk0LrmJ1RqJJk7K3QJ0j4lj8RK1j3k
6283ALj2LK1k0J2KrmJJMJ5j3j2J4Rj2JQk7M0nj7j5K4qj1OlOJ4rk2J9PqJ0rlJP
6325A0kmQjj5RqJ1Mpj3LOoRKqJPj4KOjKjojK1ppLknJ4Oj3J6j0j2J3Mj4K1%k3K
6371@J7pL%qj1RoMQNj9mK2Jjnk1OJ1J1j8JpmJ4oQJ1j8NnpJ5Rok0KJ8j4J8nk4J1
6415gPmjK1k0RJoPK6j5l2L1j8jK2Ol0jJ5j0J4Pk4JkqK0J6prj1kkK5mk2knKK3M
6457A4j3j3J2j7J7J2rmj0jlK5mk4NKORQj1mpmRJ9nlrmOK2Kk2kmNJ1Rj3j3%LKJ6
6501A5J3j7j9p%L5Jj3qj0jK2kpKqpQJ2Omj2k1J0J4J0jj1j9PL0%j3Jj5lJ8qJ4N
$$ y = [6, 20, -7, -1, 9, -4, 2, 16, 9, -14, 1, -16, -5, 7, 0, -17, -8, -12, -8, 4, 9, -9, -6, -3, -10, 8, 11, 5, 2, 4, -18, -1, 15, 3, 2, 12, -17, 8, 32, 4, -2, 14, 2, 9, 22, 9, -1, 13, 25, -6, 1, 37, 7, 7, 0, -16, -2, 24, 23, 3, 6, -3, -7, 4, 13, 5, 6, 7, -20, 3, 11, 21, 7, 4, -14, -5, 16, 3, 1, 4, -8, -5, 16, -4, 8, 10, 1, -3, -2, -1, 3, 18, 5, -7, 7, 16, 4, 5, 13, -14, 26, 21, 4, -11, 13, 5, -6, 0, -3, 3, 17, 8, -14, 5, 12, 4, 14, 5, 2, 3, 10, 8, 4, 12, 11, -4, 5, -3, 8, 12, 5, -8, -5, 1, -5, 4, 6, -2, -1, 6, -8, -6, 0, -1, 1, 0, -6, -7, 14, 7, 0, 3, 1, -4, 10, 16, 3, 19, 9, -3, 10, 14, 0, 21, 21, -2, 0, 17, 10, 13, 13, 5, -6, 3, -3, 1, 9, 14, -5, -9, 13, 14, 13, 8, -13, -7, 4, 15, -3, -2, -9, -13, 1, -5, 3, 14, -4, 1, -4, -11, 4, 13, 7, -13, -11, 7, -7, 11, 6, -18, -7, 0, -4, -5, 16, -4, 5, 6, 0, 7, 33, 18, -14, 17, -1, -2, 20, 26, -4, -5, 10, 0, 14, 21, -3, -2, -4, -12, 8, 24, 17, 8, -3, -5, -7, 18, 14, -8, -10, -15, -13, 10, 14, 1, -12, 0, -17, 0, 12, 3, -1, -11, -12, -15, 10, 6, -18, -13, -11, -5, 4, 12, 1, -3, -10, -14, -5, 14, 9, 6, -3, -7, -1, 21, 23, 1, -1, -5, 0, 11, 20, 7, -6, -6, -3, -1, 15, 28, 11, -8, -15, -15, 20, 21, 8, 0, -10, -11, 11, 9, 2, 4, -4, -11, -3, 9, 15, 11, -1, -22, -12, 2, 12, 11, 0, -19, -12, 18, 18, 5, 6, -9, -12, 6, -2, 12, 17]
6541A7j3k6J2J5%Orj7PK2lKJj7lJ4OoJ2j7k5J7MORj6j4OJ5jPpj0J2Rk0kJ1%k6
6581b2J0QMJ7j5k3OJ6qKLk2J5lQmOMmNpJ2J2j8joJ0QjnoP%%j6J8nj0J5kmK2k8
6624bnOJMmkoJ8oj6oK0kpJ7j5rJ8pMJ9j8k4K9Ml2L1j6kj3K3oQJ3j8k1K3OkJ5k2
6665bKoNKJ5kk1J0j4K2J1mj8oJ2pJ3J1j9j3K6k1QK4j4k0J3kMJ7ml0Qj0NPJ2k5
6703a1mJ2MmK6j7k3J2kOJ6mj0j8PJ1J6Jj3rrNJ4J7j6Jj2j1J3J9%j3j1jnK2%ok
6742Aj9j4M2Lojj7k1K8J7rLk4j7J4K6JqpmpK3J1k0Olj7QJ6Rj0k8kK0J0Pj6oqJ4
6782eJ1jKRj5j8J6NKJ0j4k3J8PmPPl5ML2pkMj8kK2M%rlk1OK5krqj6lJ6J7j5Rj7
6825a4lJ1LlkKj2QmJ6Pj8qPMJJ8qk3%J0KJ2J3k9LoOJ4J7k0lqJ8j3J6nl2J6K1j7
$$ y = [17, 4, -22, -10, 5, 5, 11, 2, -15, -8, 14, 11, 13, 14, -3, -6, 8, 14, 8, 20, 3, -22, -5, -1, 5, 14, -2, -16, -10, 5, 4, 11, 4, -6, 6, 15, -5, -7, 4, 4, -22, -12, -4, 0, 17, 2, -21, -15, 1, -7, -5, -2, -24, -9, -12, -4, -8, -2, 2, -2, 3, -4, 8, 20, 2, 1, -5, 5, 13, 12, 7, 1, 8, 8, 8, -8, 10, 5, -5, 10, 8, 4, 26, -2, -7, -1, 0, 4, 0, -2, -8, 10, 4, -12, -18, 2, 0, -7, 10, -5, -14, 4, -3, 1, 20, 2, -22, 7, 11, -21, 10, -6, -8, -21, 2, -4, 4, 17, -1, -22, 1, 7, 5, 20, -2, 0, -6, -1, 1, 16, 14, -7, 3, -11, 11, 22, 18, 0, -6, 6, -1, 12, 23, 4, -9, 17, -4, 4, 28, 14, -6, 7, 5, 9, 26, 22, -8, 0, -10, -5, 2, 14, -11, -15, -3, 1, -3, 23, 6, -17, -5, -7, -1, 15, 11, 1, -17, -10, 1, 17, 18, 5, -4, -13, -8, 6, 23, 7, 8, -4, -15, -2, 17, 17, 4, -7, -8, -13, 9, 9, 3, 1, -18, -32, 10, 13, 7, 6, -11, -32, -4, 13, 4, 7, -17, -34, -20, 6, 7, -1, -8, -12, -19, 4, 15, -5, 1, -2, -19, -11, 5, 14, 4, -24, -26, -6, 4, 11, -5, -11, -19, -5, 6, 5, 7, 16, 1, -17, -1, 4, 6, 16, 2, -21, -3, 4, 0, 7, 14, -21, -17, 15, 8, 6, 10, -8, -10, 12, 16, 16, 7, 4, -17, -11, 14, 12, 3, -5, -21, -24, -8, 9, -6, 3, -14, -17, -6, -3, -6, -8, -6, -18, -10, -14, 2, 9, -9, -17, -10, -6, -5, 13, 5, -18, -18, -8, -6, 6, 19, -10, -7, -13, -7, 7, 24, 4, 1, -7, 11, -2, 14, 9, -23, -7, 14, -3]
6866coJ0mj0J6j2MOlj0PllQojPn%PoOj1j2K1MnJpJ6j8mJ2oQKq%Rj0NJ6kk7K2%
6912Ej2NK0k8PJ0k2J7Rpk2J9K%J3j4k0J0J7k3J3Nj0jjqKJ6qnmoK3rLqNj2JK0q
6953fl%nJK1jj1NjnJ1J3j9oPjkK3j1j8J3j6kL1rrlj5j0K8J9j2j3J6k0NJ8Jk1L
6993dm%J5J4j4j1j1JJ7nQlj2N%K5k7Lol1J8K0JoK4l6mK8Nj6LqnJ6QMj5Jj7J4m
7034iMLMJj6J0%J0mmj7K0KkklJoPKpOk0NJ3J2j2lj9JK2rK0j1rj9K1lpK5Jj6qJ3
7078cmlK4l2pK1rK1Jj9OKlKOMj8NJ0J%J2rk4J2MkJ3j2oQ%%JmNJqNKmlrkOOKq%
7127iNj0PoNJMj5J0Rjq%KpJ4Oj1j4K3j2KpjROplRJ7k1KJ1k6J1K0j5%LLPqkomm
7173a1NMPqmk%MJOlojJ2lj4J0RJj7J2nm%KjPnkOlrJ4lojJ3j0kJ4mRNj2kqJ3mJ
$$ y = [-3, -9, 1, -3, -13, 3, -9, -5, 1, -2, -12, -5, -8, -11, -3, -9, -10, -3, -8, -8, -1, -7, -1, -12, -24, -3, 1, -4, -3, -10, 6, -12, -16, -4, -10, -2, 0, -8, -8, 1, -9, -4, 12, 10, -17, 5, 5, -7, -2, 18, -10, -3, 7, -15, 2, 11, 4, -18, 1, 3, 3, 16, 2, -18, -8, 9, -14, -1, 4, -6, -7, -8, -16, -14, 2, -6, -11, -15, -21, 2, -7, -4, -12, -7, -19, -18, 2, -6, -9, -9, -14, -13, 8, 7, -4, 1, 0, -5, 6, 19, 0, -6, 1, 0, -2, 21, 10, -8, 5, -11, -13, 18, 9, 0, -3, -18, -28, 0, 19, 7, -6, 10, -10, -5, 13, 14, -7, -4, -8, -8, 7, 21, 7, -4, -15, -14, 3, -2, 6, 3, -9, -4, -4, 21, -6, -3, -9, -40, -22, -2, -1, -7, 17, -19, -23, 5, 10, -6, -3, -11, -16, 0, 8, 12, -3, -2, -19, -5, -9, -5, -2, 2, 3, -13, -3, -3, 7, 3, -1, -18, 2, 4, 2, 0, -3, -2, -8, -1, 1, -6, 0, -20, -15, -2, 10, -2, -5, -24, -23, -1, -10, 10, -1, -10, -29, -8, -11, -18, 7, 8, -8, -16, -3, -7, -10, 14, -18, -25, -4, -13, 8, 9, -10, -4, -2, -5, -3, 3, 7, -11, -6, 4, 5, 5, 17, 8, -16, -4, 0, -2, 11, -1, -7, 1, 1, 1, 2, -2, 3, 4, -4, 1, 3, -1, -4, -13, -15, -9, -3, -1, -9, -9, -4, -14, -7, -13, -8, -7, -3, -18, -8, 1, 0, -8, -8, -6, -13, 1, 7, -4, -18, 5, -7, -5, -12, -13, -4, 2, -5, -8, 1, 18, -3, -1, 10, -16, -5, 15, 0, 0, 3, 6, 13, 5, 3, -3, -7, -11, -6, -2, 5, -3, -7, -9, -9, -5, -4, 2, -1, -7, -8, 4, 1, -13, -3, 6, 7, -10, 2, -3, -7, -7, -5, -6, 1, -4, -6, 0, -3, -12, 2, -1, -7, -8, 5, -5, -7, 7, 3, 12, 17, 5, 3, -5, 8, 4, 5]
7222ENk4J2JJMnJ0Jj4NrKNjrNJJ3j3jQ%rlnJ5pmnJ2RmpJ1k2J7qrkJ6Jj0J2lJ3
7268A0j6Mjj2J5kJ1mlj8J0J2mpK6k4KnLR%j2lK2mj1lj0nJ8j0R%J0j7RmjPnj3J1
7310fnQ%nlkPj0J7Kj7J0Pj8MK1qj9QJ5j3K3qk0JK2qkJ4k5MNLJ9j0j0lnJ6lPj2
7352ArLJ5j5J5pqlj0J3J5kj6mKoK5Kj2j9J6pQJ2j0j6QJ1j4J5J0j6nkRRLj2j3N
7392iK1j4J1rj9NJ8MOKj5nkNPJ4k1j3J0J2%J0k2kkkLJ9omMj7RMj4Kj2J6j2K6m
7433Dj5qJ8qLQj7RJqQJNk5PKORkrKjPOkoJj0%J3K0j7j0NkkJ6Lk9J4lRJmnnJ2L
7481EqOpqJ4MrQNk8P%JKMj2KKPQj8NKlRoJ1oqLnJ3J6k1lJ2KpKnOOlqJ8Jj6JPj0
7531bPQk3RKJ4Kk2k%LPOj2krlQJ4Lj9oQpNQLnj1OQkPNj4NnRjnnRNj0LjKnRlJ1
$$ y = [5, 10, -14, -2, -1, 0, 4, -1, 9, 10, -4, 1, -8, -6, -1, -2, -11, -6, -5, 8, -5, -6, 2, 2, -7, -10, -15, 0, -7, -11, -16, -4, 5, 1, -6, 5, -17, 0, -8, -17, -19, -3, -2, -12, 0, -3, 10, -6, -2, -3, -15, 0, -2, 9, 5, 2, -16, -6, 6, 2, -5, 21, -3, -1, -6, -3, 6, 6, -6, -9, 13, 9, -2, -5, -15, -20, -2, -12, -3, -3, 7, -10, -1, -5, -6, 1, -4, -17, -6, -11, -3, -3, -8, -11, -13, -6, -16, 1, 3, -14, -4, 3, -15, -11, 10, 2, -17, -9, 6, -7, 16, 8, -12, -11, 11, 3, 1, 15, -10, -6, -1, 2, 21, 11, 1, -2, -7, 9, 6, 13, 1, -8, -5, 10, -5, 10, 3, -5, -8, -18, -5, 10, 8, -8, -12, -10, -16, 9, 11, -1, -20, -4, -11, -3, 9, -1, -17, -9, 2, -12, 3, 13, -3, -8, -10, -1, 8, 11, -1, -14, -9, 12, -2, 9, 0, -19, -14, 4, 8, 14, 16, 1, -4, -6, -1, 6, 20, -1, -14, -4, 8, 8, 18, -4, -6, -8, -10, -7, 12, 6, 2, 6, -11, -2, 2, -12, -10, -22, -6, -18, 8, 4, -11, -19, -1, -9, -6, 2, -15, -6, -5, -13, -5, -4, 1, -24, -17, -15, -9, 0, -2, -11, -9, -10, -3, 3, 1, -5, -4, -14, -14, -1, 19, 2, -8, -3, -5, -7, 9, 12, -17, -3, -6, 3, 4, 0, -5, -10, 2, 5, -3, 3, -4, -12, 2, 6, -3, 5, 10, -18, -11, -11, -10, -8, -4, -16, -14, -12, -5, 3, -15, -10, -8, -11, -2, -8, 3, -3, -11, -8, -13, 0, 16, -5, -8, 4, 6, -1, 1, -4, 2, 8, 5, -3, 15, 16, 0, 1, 8, -2, 5, 13, -10, -1, 1, 15, 17, -5, -7, -7, -4, 3, 9, -3, -5, -14, -17, -9, 5, 8, -11, -17, -9, -16, -11, -3, 0, -5, -16, -10, -2, -4, 3, 8, -6, -1, -6, 3, 2, -3, -8, 1, 6, -4, -1, -2, 0, -5, 4, 1, 12]
7582A2jlqNlQJ0j5noJ1j0K1ok6MJ4JLLoojJ4j2J3nj0j3J7LJPj8KlMJ0nqNJj8J3
7626fJ0mqOqJ0OkrjNlOjJ%lNmRlpOj1RQoKJrJ1j1lKJ0j5J4q%kJ1rRr%JmJ2k1J1
7676b%nJ2nj7kJ3J1j9J0J0k6J4%NNr%PJ1j6J1JJ7j8%lmJ8pnnRLqqjMJMkKmkOj4
7722hJ3%mOJ2j6Kj2PJ1lj4KQjj0LOJ5k5J4j8MJ1qLOMj5J4Jj1KKj4K7pmJpJ6j0
7764CkklJ8j6J1jOj0Olj0JNlJ3j2nJ4ojnJ3j9K%pJ2%KmknJ6ppjLNpJ3J2j7j3R
7809dmNJ8j6j1J9mpJ5rj%J2moRj5KJ4j0NjnOrNQrrPOKNj5NjpOLj6QkJ0mj1O%%
7857dlN%%J2j5mQPmLJj1NkpJJJOJ2nLJmj5OJ1nNQk1NK1j9J1q%oKJ0Jj7J0j2mJ1
7904AK%Nj1%lJ0mm%oMmPJ0j5lJ3mjJ1%j6J5j2jKjjJ2rKoOK%JRoLj1%nN%J5qmm
$$ y = [12, 11, 8, 0, 5, 2, 10, 20, 5, 0, -6, 5, -5, 16, 10, -16, -12, 2, 3, 6, 9, 3, -3, -4, 10, -2, 11, 6, -4, -17, 0, 3, 4, 11, -7, -5, -8, -4, 6, 1, -7, -2, -1, -19, -6, 4, 0, -8, -2, -10, 0, 6, 4, -5, -6, -1, -4, 2, 1, 2, 2, -1, 4, 0, 9, 6, -1, 5, -6, 3, 11, 5, 7, 8, -1, 10, -1, -4, -2, 8, -7, 7, -1, -1, -3, 8, -1, 8, -1, -1, 0, -4, 8, -13, -2, -2, -7, 5, 0, -17, -19, -6, 5, -14, -4, 6, -20, -6, -6, -1, 4, -5, -5, 2, 13, -3, 8, 9, 26, 8, 8, 5, 1, 19, 12, 7, 2, 11, 14, 6, -2, -3, 1, 2, 6, 4, 6, 2, 0, 6, -8, 5, 5, 1, 7, 19, 3, 5, -7, 0, 11, 8, -6, -4, 4, 3, -7, -4, 2, 17, -8, 6, -12, -8, 3, -5, -2, 4, 8, -7, 7, 8, -3, -1, 1, -13, 14, 7, 3, 4, -3, 13, 3, 1, -1, -4, 14, -2, 9, 8, 14, 4, 10, 7, -3, -2, 3, 0, 13, 1, -4, 10, 4, 3, -2, 11, -8, -6, -6, -13, -1, -1, 1, -3, -5, -10, 6, -1, -8, -9, -6, -1, -8, 5, 17, 0, -13, -4, -8, -3, 15, -1, -12, 7, 3, -4, 11, 2, 1, 1, 13, 9, 3, 12, -3, -1, 13, 3, 8, 7, 2, 8, -1, 4, 12, 3, -6, 1, 7, 9, 14, -1, 4, 3, -4, 2, 5, -11, -3, -5, 5, 1, -10, -4, -4, -4, -7, -2, -2, -2, 10, -5, -9, -1, 6, 2, 5, 6, -5, 0, -2, -9, -8, -7, -6, 0, 12, 7, 10, 11, 7, -8, -2, 9, 4, 9, 17, -4, 1, 22, 3, 14, 6, 6, 0, 2, 12, 13, -4, 6, -6, -10, 1, 3, 3, 8, -3, -3, -6, 4, 0, -4, -4, -10, -6, -10, -3, 7, -8, -11, 2, -2, -3, 8, 8, -8, 7, -5, -6, -4, -5, -6, 6, -3, -1, -7, -1, 1, 1, 2, 11, 5, 8, -3, -3, -8, -3, -3, 12, 4, 0, -4]
7953dJ3rMrJ6%k3J7OJjj1MpjOQp%lQj3MplN%J1%j7JK2qnrKMjPNmjrKJ1PoLj2k
8003eJ6Kl%j2NKPk1K2olMj3PLJoj0J7m%kMllo%QklLO%KJk1J3LqJ2j3oQPkKmjk
8053djkmJ4lQj4O%J1mj3J3kKj6J8mpJ2%j1J2onJ0lJ3onj6J0KnLMj9ONlNj%kKj4
8099a4RPj3PlMmmJ2JqKJj4J5JlmKJKJ2rj1J4j6J1lkMJ0lnKkJ1nj0nK2ooJ3lpP
8145A0ppJ6j4MoM%Mnj1J1MjrJ1rQrLKr%LnOQ%kJLjr%KPJKjlLkJnJ0p
$$ y = [-4, 9, 0, 4, -5, 11, 11, -12, 5, 11, 12, 11, 0, 4, -3, -4, 2, 10, 3, 3, 0, 8, -5, -1, -8, -11, -6, -6, 5, 5, -12, -11, 11, 3, -2, -11, -9, -5, -6, 1, 6, 2, 1, -8, -6, 5, 12, 6, 9, -3, -5, 11, 13, 10, 10, -2, 3, 5, 12, -9, 13, 7, 4, 8, -5, 2, 5, 6, 0, -10, 7, 3, 3, 1, 5, 2, -1, -7, -7, 1, -1, -4, -1, 5, 5, 7, 8, -13, 0, 3, -5, 7, -6, -12, -4, 3, 1, 3, -1, -2, -4, -5, -7, -11, 3, 0, 8, -6, 0, 0, 11, 7, -6, 7, 5, 7, -9, 9, 5, -2, 10, 10, -1, 11, 5, 0, 10, 7, 20, 14, 9, -7, 3, 5, 0, 3, 7, -12, -6, -1, -4, 1, 0, 0, -2, 0, -14, -5, 2, -11, -4, -7, -3, -7, -11, 1, 2, -6, -4, -3, -17, -2, -1, -4, -8, -6, -5, -3, 9, 0, -11, 3, -13, -2, -5, -7, -3, 7, 4, -1, 1, -1, 10, 5, -5, -10, 12, 6, 0, 13, 10, 3, 10, 3, -4, 12, -2, 2, -4, 0, 0, 4, -1, -12, -1, 3, 2, -7, 4, -5, 3, -6, -3, -1, -10, -10, -7, -12, -6, 2, 2, 0, 1, 4, 3, -6, -6, -4, 3, 4, 6, 5, 2, 5, 3, 4, -1, 9, 2]
8191B
$$ Imaginary data points
##PAGE= N=2
##DATA TABLE= (X++(I..I)), XYDATA
0@%%%%%%%%%%%%%%%JrJ6j6J6j6J6j7K5l2L2l8M6m9N7o5P3q1Q9j02J11j22J38j54
39h1J70j87K09k32K56k85L16l50L90m37M87n45O18p03Q09r48J129j383J770k425
59a422L823j1531J1498J4045k6772J2026J1822k3552k810K3756q656q365J2835
72F697m254j1476J0890K219p311N226m05q991Q380O780q889r64M508p364r04J0987
88E129K180p675k548K324j344l412O790Q907r380r674J0530J240j1798J0724J0367
103A2360j8592k857J8431p810j0359J5361k136j5542J1744P648j2548N244N838
116F782j5178K606J3450r219j46J2704j4069j0196J8928k32j3852J3394M737j9755
130a0046M075J5195j0511m781J2626l959r915P240N053n426j268J620n90n3J024
$$ y = [0, 0, 0, 0, 0, 0, 0, 0, 0, 0, 0, 0, 0, 0, 0, 0, 1, -8, 8, -8, 8, -8, 8, -9, 16, -16, 16, -22, 24, -25, 32, -33, 40, -41, 48, -54, 57, -65, 73, -81, 89, -98, 111, -121, 135, -150, 166, -184, 206, -231, 256, -289, 329, -374, 435, -513, 616, -767, 1003, -1422, 2401, -9130, 2368, 16413, -10359, 1667, 13489, -10063, -12873, 10883, 2227, -6138, 6697, 2443, -9033, 1857, 4076, -3235, 1991, 1586, -7405, 975, 7755, -1134, -2098, 2410, -4954, -5858, 5129, 7309, -366, -2914, -590, -1934, -5346, 1444, 10351, 971, -8703, 1827, 3067, -8731, 1993, 12360, -6232, -9089, 9342, 1532, -8827, 6534, 4398, -11144, 600, 8248, -4300, 944, 6782, -8396, -5790, 7660, -1559, -1705, 10999, -3070, -13266, 5662, 5430, -8422, 4972, 9709, -10046, -5971, 9224, -1287, -6068, 6558, 2599, -7316, -76, 4977, -449, -1717, -97, -687, -740, 284]
145B84K497l94n683l1N100j522p57M170l129m078L434n22o96N784l137o097O561
162A784J40p663Q330M352j3835K892J2745j0588n029J4479n241j2238J2262M447
176F837j2647N141P594j1060q02R748m293k858N917m254l556O769j150m131N153
191B408r23n789M949K786n947J518M231m319j725M364L04k492l57Q73P01j246
207f64R7L240k335m598M997L098o469J345N596o099k347P683k037m894N732m93
223A852o346M705L099n326K388K290o399K327O012n882j402O610m600m028Q044
238C344m12p087M739K705o971J888O109l908k667L227j389j538L319N02k167l06
254f12l30L90J485n60l11P91j680p77K286J72p74P73j531j217K446M20j014J381
$$ y = [284, 2781, 2387, -3296, -3327, 1773, 251, -506, 3664, 535, -3543, -109, -631, -1327, 4457, 1320, -4777, 1784, 1924, -5739, 2591, 6943, -6892, -4000, 8745, -1843, -6872, 7607, 2366, -9872, 2390, 6837, -5810, -669, 6925, -4135, -4937, 4811, 518, -2340, 3577, -677, -4233, 2536, 1386, -2745, 2408, 1485, -4304, 645, 3431, -2516, -998, 3233, -1086, -2811, 1553, 1857, -635, -992, -119, 582, -664, -567, 2673, 338, -4260, 737, 3835, -2634, -1289, 4307, -1792, -4139, 3544, 1507, -3387, 2345, 1852, -4494, 211, 3310, -2016, 372, 2662, -3737, -1410, 4602, -1280, -2682, 3928, -672, -4700, 3344, 2932, -4155, 584, 3289, -3682, -1794, 4315, 407, -2260, 967, -422, -1960, 1359, 1861, -306, -612, -942, -552, 933, 373, 62, 853, -827, -1604, 682, 854, 80, 853, -678, -1895, 551, 971, -43, 1338]
272A338j725k586L725J457l698J874K094n120K04N396k513k213M330k089m590
287d116M471K557l884J023J458l807Q59L807k054j108K133k082j365L180nj740
303f73J740o46k832J868K405j409n77M14j351q8J847N20q38q13k34M06k0K79J391
322A389n61k192M91J106o36J185J079k679j098K259p1n27J751j040k214J571P34
339E47j418J667R69k886k64J987r32K68K108j988k280K099R33j168J186K69k289
356a192J22J485m45K37J068j177j366N96O85N07O13p63j337nQ00P23K87n37o79
375c78k19kO55Q06k77n62l58p37M14J788J11j391k98k55k81J558R70j458o94M28
395a80o16L11J653k46j188K7m74l64J723R61j401q87K7j55R68J232p97j179K6
$$ y = [1338, -387, -2973, 752, 2209, -1489, 385, 2479, -2641, -2437, 2959, 446, -1767, 2563, 474, -4116, 355, 2912, -972, 51, 1509, -2298, -1439, 2368, 314, -794, 1339, -743, -2108, 1072, 1067, -673, 1067, 421, -2411, -543, 1862, 453, -124, 290, -1061, -1149, 698, 1218, 380, -433, -667, -261, -281, -2, 1389, 828, -1364, -873, 233, -403, 782, 1861, -818, -1916, 343, 272, -255, 1496, 456, -1758, -187, 547, -871, 796, 1765, -1121, -1385, 602, -330, -62, 2046, 58, -2222, -123, 810, -358, 828, 1097, -1192, -1070, 415, -30, 207, 1275, 98, -1268, -672, 13, 520, 1133, 370, -967, -972, -172, 551, 838, 301, -378, -597, -599, 56, 862, 585, 23, -335, -1072, -658, 1130, 1241, -150, -448, -703, -984, 574, 1544, 86, -608, -180, -796, -485, 1168, 922, -266, -239, -713, -1077, 646, 1607, 206, -681, -654, -809, 159, 1391, 594, -585, -559]
414e59J1J91J049L34q30p17l16J75J025Q08m24j158p62M24J178N51l28p19p81
433h48k2R26O12p9j28p21r15N57J209K78k32o49j165J58J566N11n65m79p21k91
453i98J069P46l26k11m36q23L41J153L25k41o08j021R1J312O00m08n84p32q5R29
473I3N70j86k55n26m75M29O45L00P7p05r96L58J033L13n8n49r84J87J105J47k54
494B69J8o44m45P46M06r7K86m80j004M22R49K6Pl22j012K22J193k2m56Q6m70k83
516f05P25K67k81J56k97o06L90N70M9R3n58p92N99Q24k43p7o9q18K65R63m36l03
538a84N96m67n58P64J20l80M60l33q50Q92P07p85pP9r20O34J347q77p38P59n05
559b46n53J224K07q51M02j1r66N68Q83n05k39%m09N86O86q19m34L73k62L45R52
$$ y = [-559, -548, -357, 692, 1026, 196, -521, -837, -662, 363, 1171, 747, -411, -1173, -749, 429, 980, 652, -67, -848, -870, 56, 668, 589, 461, -260, -1175, -618, 591, 869, 637, -12, -1177, -1019, 547, 1058, 493, 14, -707, -998, 71, 817, 491, 280, -156, -979, -638, 515, 840, 599, -9, -1030, -939, 373, 973, 565, -19, -751, -836, 93, 663, 477, 222, -304, -779, -350, 295, 595, 672, -33, -1029, -671, 362, 675, 617, 68, -916, -729, 376, 523, 269, 287, -357, -802, -56, 350, 253, 539, 59, -945, -523, 426, 452, 459, 137, -875, -653, 540, 518, 62, 148, -322, -605, 120, 387, 106, 262, -35, -641, -251, 319, 368, 461, -97, -889, -290, 534, 291, 214, 145, -673, -408, 555, 119, -184, 412, -55, -613, 151, 271, -109, 351, 18, -832, 60, 767, -18, -25, 54, -866, -232, 1115, 238, -500, 259, -246, -799, 425, 632, -219, 183, 172, -794, -226, 657, 152, -87, -87, -496, 90, 776, -43, -477, -104, -366, -21, 931]
580I31o22q02L71k36k58J052L92n75k28o42l52J257M90p62K32k35r83J062R12
599A004j518m1J275j034l07J709n98j444Q80n6q19J652Q35j690m23J11o77J296
617A55J407j353n61O77j190j22J914l10j079R29k90j256J189Q76j235k89M08r0
635b20P38M16j027m50j13j76J352Q64j245k90L06j432J62K252j02j037M01q83
653d84r16J653O41j016L58j51r07J211M25j640N84R27j648N82K148j507j312J436
671C84r23j054K655Q35k244q1K91j108J028J415r01j90K13j222L24J265q11M5
689g9J038j422o21K000k06j534P55J22q16J239O74j306k09K2m64J025N73q26N86
708E51r1j992P64J972j162k78J444j623j163K322J08j716J048M21j358P97O49
$$ y = [931, 309, -493, -122, -358, -616, 436, 828, 253, 25, -617, -969, 288, 778, 16, 248, 13, -970, 92, 1004, -514, -555, 720, -314, -621, 1088, 490, -954, -74, -130, -949, 703, 1538, -152, -575, -464, -1141, 155, 1562, 209, -352, 325, -865, -987, 927, 617, -462, 467, 177, -1079, 110, 986, -249, -538, -130, -220, 518, 934, -93, -543, -656, -832, 520, 1384, 139, -151, 155, -1277, -1115, 1137, 1035, -2, 399, -484, -1400, 253, 894, -122, 236, 85, -822, 389, 814, -826, -242, 685, -963, -381, 1767, 260, -1052, 384, -539, -1593, 1062, 1897, -347, -428, -137, -1245, -217, 1198, 297, 107, 320, -902, -578, 687, -124, -79, 959, -463, -1084, 916, 710, -824, -69, 53, -763, 476, 1150, -156, -365, -343, -807, 218, 791, -35, 551, 460, -1532, -768, 1204, 42, -236, 1208, -415, -1578, 744, 852, -864, 184, 605, -753, 44, 693]
725F93j192M94M61j338P22J253j371O6J120j848l47K573n16j671J381o4j676J215
743d5R77j297L01O81j069J02O38n24N21L09j455M96J410j295l22J481j114q51
761a056J911k15j600J146M56j351N90N97q22O05K33j285O73Q33j282N19J051j760
779g57n1K097j261j274K035j31j751J276N44j524P61Q61j288J65P39p79L67N21
797E50j213M47J174j401k99J631q45q71J570m52j395J384N56j412M26N89q15L93
815A7L48q29N57M81j134M37Q18j255K61J411j465p26J970l93j413J230J19j317
833h83J018O32j257M14O07j084L50P10r35N22Q99j619k43J664p67p14J525n19
851C20j368J351L90j492O26Q42r43J40N62p00K04M34q99K49R11o81L6O95j240
$$ y = [693, -499, -5, 456, -882, -160, 1093, -278, -212, 908, -940, -1287, 1286, 770, -901, 480, 416, -1260, -45, 932, -365, -64, 617, -452, -350, 288, -236, 285, 594, -861, -365, 1045, -250, -572, 909, -205, -1056, 855, 640, -960, 186, 642, -709, -119, 478, -344, 261, 494, -791, -118, 715, -567, -48, 1003, -757, -808, 1289, 28, -1246, 789, 658, -1093, 183, 727, -797, -36, 825, -463, -298, 441, -338, 29, 550, -663, -216, 958, -443, -742, 889, 44, -827, 743, 291, -1104, 280, 836, -576, -150, 439, -376, 17, 365, -464, 93, 574, -560, -123, 695, -560, -299, 1112, -353, -1079, 891, 498, -915, 315, 434, -883, 135, 767, -490, -76, 531, -553, -203, 507, -428, 94, 993, -626, -869, 795, 28, -686, 839, 320, -1048, 303, 693, -799, -173, 669, -274, -134, 428, -272, -68, 366, -533, -284, 627, -54, -18, 677, -563]
870e63m34J594k13q58J007p9j182N96L39p03P16N01r53J17L18p47N16O10j123
889e41K67J273j013o50J100o02p64J491J63j231P10L17j311K57Q44l94M01M70
907G87j139k33P92n15lR90n30m67Q73m88r89Q98M36o77M80L70p90O3K25o12K30
928b99P27j56N7n8q74R8P66m13K3Q72m69o64N06l15n37R90L64p50K64J86p20J66
950b36L11n07M73P82p11l72L85n53j16J007k02n12P37j29j027L27M93l42L88L93
970E89p02j35L95l80j17M64k4P0L25n23m58M15K8j08M46L7l73J83j67n19L72M71
992B89j35N0o3m39J55K98l89P3M90k27j14K57m54k61O47j3m24M78J85n90M4J17
1014b6l67L74N92m54l16K58k03p1L85j26j74L77j03m26K03J68j91J74M1l04J90
$$ y = [-563, -997, 597, 384, -474, 533, 454, -728, -132, 207, -496, 220, 721, -232, -115, 203, -544, -28, 582, -541, -274, 999, -14, -664, 436, -166, -930, 561, 724, -507, 203, 520, -791, -534, 310, -84, 317, 787, -352, -585, 207, -308, -311, 679, 149, -318, 555, 67, -922, -24, 412, -265, 215, 585, -205, -142, 83, -529, -299, 428, 272, 329, 271, -603, -505, 261, -152, -129, 743, 274, -390, 116, -199, -736, 254, 618, -132, 132, 318, -402, -236, 75, -432, 41, 823, 112, -260, 125, -428, -544, 463, 261, -251, 486, 357, -670, -343, 150, -192, 196, 589, -113, -248, 147, -233, -350, 114, 90, 160, 485, -38, -496, -81, -53, -161, 285, 322, -51, 132, -35, -554, -182, 289, 154, 204, 141, -298, -143, 155, -234, -161, 329, 102, -12, 245, -209, -470, 177, 164, -260, 218, 403, -187, -143, -26, -393, -19, 573, 119, -197, 61, -142, -213, 172, 46, -128, 249, 146, -280, -77, 91, -100, 74, 115, -189, 1]
1035AK71l19j79J54K2J72J41l01j34K24j20n6K52n3o2J62k57k83M32J93k97M8
1057A1K2k71K79K70m42p9L73j63j36K80j29j61K86j08l37L32K63l25l4P8k16J95
1079a2L46l19k53K66Rj12J56k2j35J34l5j98J30J81l0r0j57l5K59O0j56rk8m0
1103i0K05Kk82J43J83k46l3K32j38J2K09l06k10M95R2l87J03N7k59K51K35l99
1125a31l0L80k29k15L06%j62K04o5l14K19K90k27j38R0l7Q2J15j26j19R5Q7q5
1148a0n6O3J36q4j58O8L6nJ84q7l47J87L00k44p7K31k01r1L64j82l28M35J23n11
1172b54J43L16k96O4L07m55j35N85r1m37L04P7l40K71J45m03R5L69k66k35K74
1193C8O1j15O4l7j60J02K11q5k33N9K26r7j60J78j4j88K29P9m18J60M69l94k77
$$ y = [1, 272, -47, -226, -72, -50, 122, 263, -38, -172, 52, -68, -124, 128, 75, 13, 175, -82, -365, 67, 260, -37, 11, 33, -238, 41, 311, -131, -210, 163, 0, -136, 144, 15, -146, 140, 32, -305, 27, 290, -35, -69, 9, -207, -12, 334, 15, -238, 28, 37, -75, 81, 59, -76, 58, 23, -175, -45, 136, 106, 16, -141, -176, 83, 143, -13, -22, -50, -90, 115, 117, -165, -22, 161, -85, -118, 114, -24, -12, 197, -109, -319, 176, 268, -119, -16, 41, -218, 33, 268, -131, -161, 219, -10, -225, 81, 81, -81, 123, 58, -256, -37, 253, 26, -112, -22, -59, 23, 138, 12, -107, -12, 75, -10, -66, -3, 133, 49, -109, -41, -5, -10, 174, 87, -260, -73, 227, -17, -94, 137, -64, -155, 209, 27, -301, 134, 257, -254, -111, 205, -91, -27, 280, -175, -310, 275, 184, -253, 51, 128, -212, 59, 204, -199, -104, 265, -1, -236, 38, 99, -16, 48, 11, -149, -47, 164, 79, -154, -95, 131, 34, -126, 52, 38, -150, 79, 158, -260, -100, 369, -25, -302]
1216c02M65j10l16N19m8o64M63M44p05NO32m60j98O22l45m53P39M5p58L49M00
1237C24n11J21M11n38j13O39j98m14L53R8k96R7J37k09O4K11j04k36M8K74m0k64
1259a46J33J50k70J24K83m45j04O66k88n38N95J18o56M45L14q58K92Q68q48l62
1279e27R79l50o27R01p8r41P62M87j070J63Q75o95k45P88m48m54Q10k6p42L94
1299d4L67m89R1K96l47qL37j34k54J24K11o1k15N5K21j88o3L50k87l38O76M4q09
1322d65M12N52q32Q6Q08p77k83J156n06r55J084K16j106O80N67j229L52J039j083
1341b84l21J254n21p47J026j31r51Q80L85j125L21P96o99j90O41l81k82O06p5
1360B02m71K37K08j79q3L7J12K8j80J17M6l19K93L54o22r2P06m07l81P77k43p11
$$ y = [-302, 163, 53, -263, 256, 208, -456, 7, 451, -254, -249, 383, -77, -275, 347, 2, -451, 288, 333, -425, -76, 324, -187, -66, 345, -193, -306, 333, 135, -279, 74, 172, -124, -27, 110, -99, -35, 176, 72, -164, -116, 158, 118, -146, -13, 137, -133, -9, 274, -171, -275, 391, 103, -435, 160, 278, -378, 67, 381, -477, -185, 683, -165, -527, 452, 102, -525, 376, 298, -643, 119, 606, -464, -301, 574, -121, -366, 422, -26, -480, 330, 304, -438, -44, 323, -166, -75, 221, -126, -134, 203, 69, -185, -61, 150, 89, -126, -71, 150, -38, -101, 249, -38, -376, 300, 344, -465, -53, 499, -333, -247, 561, -216, -499, 657, 151, -804, 280, 496, -610, 70, 637, -592, -240, 799, -284, -605, 649, 128, -619, 407, 276, -675, 205, 590, -535, -214, 582, -117, -307, 334, -47, -329, 277, 202, -269, -32, 176, -3, -86, -49, 63, 91, -89, 28, 74, -245, 48, 402, -220, -312, 394, -13, -394, 383, 140, -571]
1382e71R27J00j174O71P81j191R8J099r99l50J378o43j059J336J96j298P54N73
1400F28j250L59J025j026k34J140n37o99Q00p9n58P12J19p66K77L81m71K0K98
1419A39j44M3J17j75p4m0N9K73j68k27N21j01o94M07K85o20N09O40j063j72J019
1440E34o91n26J226j76r04R84kj370P75Q66j154K40J060j045l53J105p52p08J397
1459E06J02j054O51K12j123M14P50o94J33P99n87n61L94r3q4N00K5k50Q2j71j77
1480b26O0p6K98M45l48k37K32m60j65P24j45k82Q19k36j100M95L56p34P31Q00
1500I51j170j03R08r98m96J383j19p29J029j89j383O89O53r90M42J031q22l36
1518b49O21p88l96J159P3n26N28j18q30K56K53k85M52M72m61k69l1k34J92K62
$$ y = [-571, 356, 456, -718, -47, 734, -457, -359, 740, -259, -609, 769, 126, -933, 403, 599, -699, 55, 628, -622, -263, 762, -264, -498, 642, 105, -594, 206, 127, -431, 281, 400, -366, -89, 292, -179, -159, 139, -5, 38, 155, -20, -94, -134, -75, 198, 30, -197, 324, 223, -471, -64, 221, -399, 110, 750, -313, -485, 534, -157, -683, 543, 367, -537, 447, 445, -925, -150, 716, -438, -198, 862, -183, -536, 569, -183, -891, 506, 608, -446, 205, 417, -706, -292, 458, -236, -103, 696, 109, -452, -58, -151, -235, 265, 290, 40, 122, -49, -226, -166, -242, 56, 501, 153, -84, 148, -312, -477, 247, 102, -180, 639, 403, -697, -202, 154, -580, 151, 951, -219, -322, 586, -412, -908, 475, 356, -373, 656, 467, -916, -227, 426, -564, -122, 909, 87, -249, 372, -416, -812, 347, 420, -106, 422, 304, -526, -270, -17, -302, 150, 622, 161, -108, -139, -373, -181, 81]
1538H1m1K76P3m61l8n0l89N39O06n29j8M03p45l50Q00k00k15J004k01j116M43
1559a28K47p63O39P38q75O5P04r77m20J045j55m35Q95j77r40N21K10q14M79P42
1579F01n02n6K67o68j64O66n3j34M10j67l58J13j78p5M79Q7k28J25k13k21L09
1600D0q8k25N12J14m66J71j2n23M10M65n38Q9N50o22l00O12k88k11Q23j76p69
1621d32M82J81o45L73M01n86J90M92o46j78O27k57k37N15j78l57M58q4n02L58
1641b5K58l01J66N8m10J79K67k99M8K62k54J2J73l16N9L89k53j75L04j82j18L96
1663B38k21l09M56J3m14K74J01l66K96K33n49J23M35m17j13M42k50j39M66k69
1683C0l97M64J05m00K88Q8m14K45K20m67J20L95k87r8K72k78m8L83k01k34L68
$$ y = [81, 40, 316, 389, -72, -110, -160, -549, -10, 596, 67, 49, 452, -293, -643, 157, -43, -258, 746, 545, -571, -128, 119, -644, -5, 733, -142, -77, 627, -350, -770, 275, 120, -315, 580, 403, -537, -16, 194, -620, -141, 601, 99, 43, 310, -358, -522, 144, 91, -43, 367, 200, -158, -45, -223, -298, 181, 268, 40, 165, -48, -269, 40, -48, -273, 239, 353, -113, 58, 46, -477, -67, 398, -140, -51, 499, -123, -423, 189, -99, -310, 513, 337, -432, 50, 231, -414, -41, 360, -226, -36, 456, -190, -368, 259, 2, -235, 280, 102, -255, 203, 119, -383, -25, 233, -68, 98, 156, -254, -75, 192, -107, -59, 203, -51, -39, 134, -182, -123, 266, 13, -162, 142, -40, -158, 238, 17, -292, 164, 177, -237, 37, 138, -228, 68, 301, -248, -125, 310, -107, -220, 222, -28, -167, 299, 30, -367, 97, 202, -198, 90, 178, -236, 9, 229, -238, -118, 277, -10, -108, 164, -114, -162, 221, 20, -214, 154]
1704A54m0k42J79o0k19L27J16l48J42J31k83J16J34k86J89K93l44j21K56j65k2
1725i3L10k24j65L81j21l43K80O8k50K89O8m50K25K57l83K8L16k50NL10l46j92
1747b80M53o5k84K76nk70K77M4l92K26K57k92nJ68k14M4K47k49r0K88q1j33J50
1770G0j19n0K49r3k07J90L6j33J32m1j80K39P4l28J30J65k34R8J76l38O3L43k65
1793b3j74L31j03j72L22j24l29L54J31m07J58K07k99R4K24l30nL76j84j99K33
1814H1p9j16K51r3k12K42M5k15R5K1j35J88M9k60J26J25j74M0P3j80J56J84l03
1837i1n5K70j46n2K31j81j35L58j02l33K78J08k60J64O9l26J88K52l23o0K99j53
1859@o0K22k02j40L29o9k46K12K6j54J52k3k33K15J33k31N5Q4j69J36J21l03O5
$$ y = [154, 114, -128, 51, -9, -228, 99, 215, -133, 9, 140, -143, -27, 107, -179, 10, 303, -41, -162, 94, -71, -93, 217, -7, -172, 209, 88, -255, 25, 93, -157, 132, 200, -250, -25, 232, -151, -123, 193, -57, -52, 258, -88, -280, 173, 108, -176, 100, 95, -175, 102, 146, -246, -20, 237, -55, -60, 108, -106, -62, 185, -64, -154, 134, 53, -80, 70, -49, -99, 150, 57, -150, 40, 76, -57, 75, 34, -146, 93, 167, -161, -31, 134, -100, -2, 174, -164, -101, 242, -23, -197, 134, 31, -141, 181, 57, -272, 82, 213, -194, -36, 171, -128, -34, 190, -140, -145, 231, 47, -152, 81, 2, -114, 137, 44, -168, 74, 119, -96, -1, 20, -115, 73, 122, -138, -12, 113, -61, -21, 52, -128, 28, 212, -91, -146, 124, -22, -74, 157, -24, -159, 199, 97, -236, 42, 150, -110, 54, 123, -203, -15, 237, -86, -146, 153, 0, -60, 162, -40, -180, 149, 80, -166, 46, 72, -82, 70, 47, -186, 29, 162, -69, -14, 70, -99, 37, 158, -145, -80]
1882h0K74k33n8K20j94n2L36k18k42L82ml16K34M3l12K80J78m14P7L06k59l0K45
1905A63k28o7L32j67k45K98K3j91J47k6j64K09N6k50R4R4j50J29J4k21J60J55
1927A65k64N3J66k38J01K34l57l4M15k20k32L61j13k49M03k6m79L55K41m82J47
1948e3K80l93O3M21l96j67M94j57l30L46l3k91L50L1l96K04K20k83L5J66k16Q4
1970b1J77k42j0K01j17oJ11k15O7K53k54p2K69j68p3L21k68k30M73m2m27L66Q2
1993A75m52L13K35n68J95N05n34j42N56l30k22N88k44m86N78R7n78L15K50m83
2013b32J94L47m91K0M72l33k08L58j16j21L10j54k74K75L8j80J78l4j58K16p7
2034C0k33K57O7k32K37k9l58L15K01m84J23L90m06K3M37n00j82O63k60m13O48
$$ y = [-80, 194, -39, -97, 123, -71, -123, 213, -5, -247, 135, 131, -185, 49, 92, -220, 60, 238, -176, -99, 207, -52, -82, 163, -65, -132, 200, 33, -212, 86, 109, -82, 65, 39, -125, 84, 140, -110, -16, 78, -72, 57, 71, -150, 10, 165, -99, -46, 120, -118, -17, 217, -140, -174, 241, 21, -211, 150, 37, -212, 191, 165, -314, 41, 282, -200, -53, 227, -166, -103, 318, -78, -245, 249, 92, -238, 108, 75, -216, 134, 165, -231, -27, 193, -90, -55, 111, -105, -21, 156, -86, -96, 105, -12, -18, 93, -122, -55, 198, -56, -128, 141, -27, -100, 221, -47, -277, 196, 154, -273, 93, 175, -277, 36, 271, -297, -102, 403, -131, -273, 283, -47, -269, 319, 75, -411, 167, 264, -314, 1, 251, -232, -38, 309, -182, -162, 310, -23, -231, 127, 11, -110, 200, 46, -228, 47, 85, -95, 83, 49, -109, 107, 30, -203, 54, 121, -111, 126, 97, -261, 54, 255, -229, -106, 284, -122, -99, 338, -162, -344, 319, 59, -354, 294]
2055B94p0n94M57J09o53M83M98p20JN11n04j16O59l49l18O12j13n63M33J20m18
2076b41L09J70m28J89K68l99m5K50j59J38K06l07o9J84k10K9K83j75J6K55m05
2097a41j84M94j39k03M63j92m48N28K7o52M30L67n89K35M45p20m5P01m87k76Q28
2118D42j87n90N01r8o20O30L97o85J67L98o20j3N35l44q5N46k79l84L78m6k49
2139b06L19j9k40K94L8l21R3J6j36L16L4k96K13J2m12K42K20l19K77K75o52k6
2161b78N52l89j08O25l67l78O49j70o48O07K47o97L91L69p08J44N90o62j59Q11
2181D21k80m24N56k03n42N75J79n42L06K73n26N7L11l28J12L60l17j64K80j22
2201a8o1K06j87m6K86j55j40K20j55r1L31j82k11M14p3m02L39O0l99L92K20o46
$$ y = [294, 224, -370, 87, 196, -457, 26, 524, -196, -195, 316, -188, -304, 355, 6, -312, 300, 187, -376, 57, 177, -241, 68, 238, -190, -1, 267, -132, -177, 73, -86, 52, 258, -49, -118, 66, -144, -115, 168, -7, 9, 264, -141, -325, 169, 30, -173, 290, 98, -350, 178, 205, -447, -17, 350, -239, -4, 441, -279, -324, 377, -110, -386, 442, 255, -335, 166, 68, -552, 78, 475, -210, -43, 355, -265, -278, 257, -87, -172, 374, 95, -289, 89, 43, -206, 113, 94, -146, 148, 186, -135, -42, -26, -162, 154, 188, -108, 105, 117, -295, -53, 167, -152, 125, 400, -252, -278, 274, -115, -223, 402, 35, -343, 306, 136, -512, 95, 342, -355, 36, 405, -303, -159, 431, -231, -390, 421, 141, -283, 273, 70, -472, 103, 282, -260, 46, 319, -207, -150, 161, -167, -55, 305, -12, -176, 104, -18, -79, 127, -60, -106, 180, 25, -115, 105, -50, -141, 190, 8, -203, 211, 138, -264, 75, 135, -264, 128, 348, -298]
2223b98J64N03n51m9N90m09k50O34k57n22O46Q2o25L82K49o08K64M36n88k0N62
2244C35l61k19M56j95k68M57q7l96L41J27l34J36J20k57J62J40k59N8J38j70Q2
2265FQ3k28J36J99l14LK60k06k0L25l13j78M58j31l41M24j2m09L48J02m97L15
2287A0L44n33oM35l83n4N47l59l24N09o5m08L84J18m36K54J49m18J47L61l25q4
2309a37K71k08j4L12k30j97K88l4j35K24o6k14J88m9j75K70J06k43O9n7k26K84
2331B7K16l06N9J63l13M3L18k88n1L93k51k34L95n8l46K96J3l37L63K61m76l9
2353a52K34l01J24M39k67k02K86k51k55M23R3k04J97p2l83K07K39k22O0J29k04
2374h2Q5J61k50o0K19j33K4K38j14j26R8k33j09M12J10j67O8k01l00L00K11j85
$$ y = [-298, -134, 369, -182, -231, 359, -50, -300, 334, 77, -445, 201, 283, -342, 40, 289, -319, -55, 381, -207, -227, 335, -26, -245, 211, 16, -252, 205, 118, -278, 63, 190, -144, -8, 112, -145, 17, 157, -102, -44, 94, -76, 6, 89, -139, -3, 196, -118, -115, 145, -61, -81, 244, -69, -247, 211, 80, -261, 163, 151, -258, 90, 192, -305, 10, 354, -179, -185, 250, -133, -187, 360, 1, -323, 186, 121, -287, 97, 215, -221, 33, 182, -236, -89, 272, -53, -137, 134, -74, -88, 224, -6, -203, 85, 51, -84, 140, 74, -140, 48, -1, -176, 94, 200, -43, 26, -31, -257, 27, 243, -63, -4, 159, -154, -111, 207, -81, -132, 261, 10, -224, 171, 113, -233, 63, 76, -261, 102, 363, -113, -152, 82, -219, -95, 344, 77, -125, 161, -90, -345, 78, 171, -33, 164, 92, -291, -84, 155, -67, -7, 122, -82, 3, 164, -86, -146, 73, -60, -36, 202, 88, -38, 60, -173, -282, 130, 240, 73, 141, -60, -360, -60, 151, -34]
2396c4J68J07l90OK06k08R0L21k73j62L21q2k11J86q5k01L72J88l47OM9k96J30
2419a39L32j14K5J06l53j85K79R3K3J84k09k61J88M7j31J73L0j62J35M6k19R2
2441b0R8k23Q0K13q5K9M8l33r3L51L5k8J52k13k67K14O2j15K41Q7l03l4J11j47
2465a40J33J95k29q4K32o4q9R8j32p3K30L7j19Q9l5k10R7O1k6J79L6k91n0J39
2489a6n6J24J17k22m5J78j33n6K02p6r4J74o8j73K24L7k58R8J23j38J20R4k71
2512a15k0K30p6n7J64r4j27J49m1j27J79M5j68L3L7p5R6N0j28j1J09n3JJ7p5O7
2538A0Q6j23k3J08q0JJ01j29k9J94j05j60K01K8j38J42k4k29J66J75k34mJ68j68
2562f6j1K21j52j38K24l5j87J86Q0j79N7L2j79J20K19j45j22P8p2J1J67m2r2M0
$$ y = [-34, 134, 241, -149, -143, 63, -145, -55, 266, -7, -169, 152, 70, -141, 45, -40, -241, 131, 319, -28, -22, 27, -269, -139, 193, 79, 104, 210, -143, -328, -49, 44, 67, 251, 42, -219, -31, 16, -115, 58, 88, -74, 61, 107, -112, -20, 78, -145, -65, 148, 63, 92, 140, -193, -286, 65, 100, 72, 224, 11, -256, -42, 20, -95, 146, 233, -70, -104, 7, -140, -7, 188, -41, -125, 107, 43, -46, 52, -80, -153, 77, 114, -5, 84, 49, -161, -64, -3, -29, 150, 186, -105, -155, -16, -72, 52, 169, -53, -98, 80, -53, -109, 93, 17, -77, 97, 29, -144, 80, 117, -141, -43, 80, -58, 62, 156, -115, -135, 95, 19, -38, 126, 32, -95, 54, 13, -114, 65, 110, -58, -25, 12, -63, 33, 83, -45, -56, 53, 0, 1, 18, -57, 10, 96, -27, -50, 58, -22, -21, 80, -49, -78, 116, 11, -149, 52, 80, -58, 84, 60, -169, -3, 172, -62, -66, 102, -66, -77, 144, -8, -146, 78, 43, -144, 42, 122, -57, 0, 32, -147, -27, 192, 47, -75, 3, -69, -58, 109, 67, -25, 15]
2586A5j9o9P6M3jJ2j27m3J45M1l2j3j22n8K33L5j71Q6k3j85J52J60j51L7J26k78
2612a31p5L12Pj05J25j83k20L25J49k41M8O2k52P8K50j27m4J29j86j42K63J14
2634A56j12J4j15j32J75J74n9p4p3p3Q0R4J1M3q8j59M7Q4L3J36m7k93K5K01k5
2659B3O7P9k92j02K97k6r5K11r4l03J71J51j45J80R4m13m9L42l8k9J57k27k22
2682b63K85J09j59J35jk82L8J85l1N8P6k31j23J65J08N0jj84p8R2O6P4L2j51n7
2707h8O5p9J00K16j53j86Q0k9j2L18n1l81J03J57j77J66K04l31j14K83j50q7L79
2730B33q2l65J58P7j56K49J41l79n1K46j04J4K12j70j89J74oj02K00L8k07j6K9
2753e6K1J34K1j29p6LN3J54o8j12R0o1j24J82J10j98O4P6k70R2L24j76j75J99
$$ y = [15, -4, -73, 3, 46, 45, 57, -70, -113, 32, 73, 41, 28, -94, -152, 81, 116, -55, 31, 8, -177, -25, 135, -16, 21, 147, -131, -206, 106, 113, 8, 133, -50, -270, 55, 204, -37, 11, 73, -179, -101, 149, 22, -22, 107, -79, -221, 42, 156, 44, 58, -57, -189, -14, 160, 101, 27, -46, -119, -39, 55, 66, 109, 21, -138, -91, -7, 26, 162, 115, -178, -153, 48, 23, 90, 169, -123, -225, 72, 46, -49, 162, 68, -235, -64, 87, -58, 122, 216, -197, -246, 96, 58, 29, 186, -41, -263, 22, 131, -28, 107, 106, -176, -138, 47, 16, 74, 150, -81, -204, -39, 69, 119, 118, -66, -144, -52, 14, 88, 120, -31, -88, -23, -102, -2, 214, 61, -125, -45, -74, -86, 232, 181, -200, -97, 60, -117, 49, 253, -78, -192, 91, -59, -146, 233, 151, -214, -56, 21, -135, 114, 255, -124, -175, 71, -33, -19, 193, 23, -166, 8, 2, -100, 100, 138, -69, -85, -56, -35, 99, 120, -9, -85, -82, -29, 125, 57, -55, 35, -26, -150, 32, 142, -56, 8, 84, -186, -94, 230, 54, -121, 78]
2777G8j27j21L36k6l24K14P8l15J75K43k93J7K29k98p5M03p9k79K08Nk38K37J30
2800A78k82L8J59j48j3J43o5pM5j16lJ32j5k9J3j11L2J47q7m9J04r7l4J37r6o4
2826h8K23r3k08J98L5k09K09J09l71J05L13k85r5L47j67k05L23p8k72K73J00l07
2848a43R7J68k24Q1J83k64qK64j68j16K28p3j43K06l8k02J77J03j61k1L9l5Q5
2871C5J9p8N3j9j11J30L7j46J43J22l13lK49j42n3K53j80j57K78n5k14J99J8k20
2895a55K14P2k75J70J55l65J8L72j89o5K66k36l00L51J13k34J73P4k69J4J23j05
2917g8J24J20j82l5P2j05Q0J41k16l2K39p3j01J23j16j27J80L7m7J67p6k39O2
2940h2%j8L30M6m03K2J49k46J37L51k36j82K90j71k24L28L5k58J54Q2j83J62N4
$$ y = [78, -49, -170, 166, 140, -184, 30, 108, -207, -32, 211, -82, -65, 164, -134, -209, 194, 115, -164, 44, 49, -189, 48, 178, -104, -66, 93, -55, -68, 75, 10, 3, 48, -68, -71, 61, 46, 17, 30, -81, -49, 98, 11, -38, 66, -31, -65, 72, -24, -88, 135, 42, -166, 32, 67, -142, 67, 176, -195, -90, 223, -62, -157, 190, 23, -182, 141, 63, -209, 64, 164, -143, -46, 122, -102, -21, 162, -102, -110, 154, -14, -130, 98, 25, -118, 88, 50, -152, 25, 128, -33, -54, -15, -50, 35, 54, -24, 29, 10, -101, 29, 66, -80, 63, 185, -128, -131, 118, -24, -77, 176, -4, -161, 117, 62, -152, 47, 65, -155, 59, 131, -144, 26, 181, -184, -166, 206, 17, -48, 218, -18, -318, 33, 146, -88, 85, 159, -110, -96, 27, -78, 46, 166, -16, -51, 21, -84, -4, 137, -79, -111, 128, 55, -46, 77, -39, -166, 14, 51, 4, 171, 95, -144, -82, -82, -100, 230, 276, -127, -105, 44, -202, -65, 286, 50, -132, 158, -13, -237, 91, 126, -132, 22, 104, -79, 83, 137]
2963A37l33J3K20q0J49J89l55j91K23o5j8L82k8l18nm1r0K58J70j67l1n7q6J58
2987C4K9j88J14J29j85Q2J72k72j06K12j01J5L57p6l63K0l8k6L69J18k88jk8k73
3011b94K12K86j91K8J72l28j23L67n7k20J78L0j61K26M4l06j1Q9l4K03J25k16
3033A9o1qk05J52L37p7j06L0k44r2L46M9j44R6o9j52J41K8j29J46Pj76J71J19
3057A78k47M7Q2k64R3L98j45k30J13j29j36L29J01k02R0j6k68J21J80r5Q0N7k61
3080a24K2K34j34p4J63j37o5K58o3j78R0Jj16J37P4q2N5m7j91J32J41q9O3K7k54
3105a57O7K20j51l0J74j23j23K21o6j18J86k0k02J41P2j52R6N7k41J06K11k05
3127c7m6J92j57o0K42r6j73J88J9j89J12J04j29O7L8j70N2J23r1qO5r4K5J18j55
$$ y = [137, -196, -183, 37, -43, 106, 295, -60, -251, -28, -93, -111, 271, 243, -75, -80, -121, -211, 47, 217, 50, 19, -38, -124, 34, 63, -125, -11, 118, -67, 15, 187, -85, -191, 21, -80, -65, 292, 216, -147, -127, -165, -191, 178, 296, 8, 7, -21, -294, -82, 204, 13, 41, 213, -115, -238, 129, 72, -148, 30, 60, -101, 125, 169, -137, -148, -59, -93, 110, 235, 19, -42, -50, -255, -103, 234, 157, 51, 81, -163, -255, 91, 140, -4, 92, 23, -129, 12, 40, -89, 57, 64, -112, 59, 178, -69, -22, 60, -204, -111, 287, 142, -88, 25, -104, -240, 89, 190, -12, 78, 62, -206, -85, 95, 0, 80, 137, -124, -102, 132, -2, -76, 87, -50, -115, 143, 80, -98, -8, -7, -123, 14, 88, 6, 61, 14, -177, -45, 96, 7, 70, 97, -157, -90, 130, -21, -51, 123, 0, -123, 98, 32, -86, 100, 80, -122, 19, 91, -61, 35, 92, -149, -43, 168, -37, -83, 109, -48, -108, 134, 38, -135, 53, 72, -117, -5, 99, -30, 37, 75, -95, -43, 80, -11, -19, 46, -48, -23, 95, -60]
3152f0k9J69m5p6J07p0q9J32j8r0J35J4j37N8pj16J77R5k26M5J37j64J3J88j80
3177c7p6K38p0j70J73Qj85J22P3j45J17R1k51kJ60p6M8J50j91j10J75m0q3J55
3201G4nj36O8J7j09J18O2j44ON1k4Q9J9j76M1Q4o7N0R5j45m8J17q4l1K10m3j79
3228i0P8j4o4J88L8k12M4Q1j21P7J29j73m1J67j14m1J89m6j63R0jq4J83L3j93
3253f0lN9l3P8N3j37rQ7r8K7J33p9p0O8q5j0J91l4j25J4Jk0J33Qj64P3K6j03Q0
3282AR4j19J7O8j34j0K07p6j15P0k1o9J73J5j77N7M9j02P6P8j08K3N3j39K8J65
3308A04o8p0O7o6k6J42k5j17P2qm6Q9j9q3Q1Jj26Q6Q1r6K1O0j63L8J84j00p3J08
3336D8n1p1J25qj15J24Rj45P3O8j09P5O0j61K2J54q9p2J03m4n1J09l3r4R5K8r1
$$ y = [-60, -89, 80, 35, -41, 66, -4, -93, 39, 21, -69, 66, 80, -57, 1, -6, -122, 55, 150, -76, -31, 106, -58, -45, 143, -37, -113, 125, 55, -115, 58, 66, -119, 3, 76, -69, 48, 139, -112, -114, 46, -30, 18, 168, -23, -133, 42, 2, -81, 74, 69, -67, 1, 18, -91, 27, 89, -55, -49, 2, -22, 67, 86, -90, -49, 35, -32, 18, 113, -32, -80, 37, -47, -78, 132, 89, -90, -12, -26, -90, 98, 136, -76, -32, 49, -72, 5, 134, -39, -80, 87, -27, -68, 121, 75, -88, 2, 1, -83, 100, 133, -60, -63, -4, -37, 41, 94, -43, -52, 35, -63, -36, 97, 18, -52, 16, -69, -79, 112, 78, -47, -33, -32, -52, 81, 89, -75, -2, 24, -79, 1, 95, -24, -7, 61, -73, -83, 124, 48, -67, 3, -18, -87, 86, 101, -76, -19, 30, -72, 4, 82, -26, -3, 50, -89, -61, 104, 36, -34, 33, -33, -59, 83, 58, -59, 13, 5, -41, 48, 29, -54, 27, 28, -98, -12, 69, -27, -6, 54, -109, -71, 113, 13, -60, 48, -3, -74, 51, 43, -72, 52, 61, -84, -11, 57, -52, 23, 83, -78, -56, 98, 9, -63, 40, -4, -55, 54, 21, -73, 22, 50, -41]
3363d1L2K0m7Q1Mj17M7O9o7NN8q0J9R0j06k4J08k7o1P9p2m3J37l9j03J07Jj11
3391h1Q9N1j38N3J23j64j2J70r3o3J35r1r0J72Mj26P4K4r7P4N8j25M9P7j06j7
3417e0J01l3k6N1q2k6J27j3o6L3l8pQ0l3o0P0pq5P7J1o9R8J5j60N9J18r0jP3j39
3447g2MJ68q2r4J38l8j32J32M0j29R3O5j91L9J36p7j6Q1j22l3J68m9q9R7j0r4
3473f7Q6J9o5O1K2j15J0Q4j1J9nr8J7P2l0K1K1j00K1J02j10QJ26r3q5J23j4q1
3501f2J30k6j48Q4R6j12N5N5j58K6J56j26k4J76j06j35J45Nj06J56J2k05N3J23
3525F4q5RO4r8JR8n9k2O5n1k4Q7n8J3Q0o7j05P9L1j3N9l5j06O5K5n5Q6Rr7O2L2
3556E4j41O2J40j48m9J65r1m8J51q9j61J55Q4j20O7L6j57M8P4q6N8J22j29q0J06
$$ y = [-41, -9, 11, -36, 45, 49, -68, -21, 48, -19, -14, 44, -36, -17, 73, -33, -57, 51, 24, -37, 42, -30, -73, 64, 25, -78, 29, 30, -81, 8, 59, -79, -26, 97, -67, -79, 91, -2, -65, 70, -21, -111, 61, 65, -61, 13, 37, -60, 14, 72, -53, -4, 73, -33, -50, 51, 18, -8, 43, -39, -65, 62, 49, -17, 16, -22, -29, 51, 18, -42, 28, 21, -64, 13, 24, -45, 53, 68, -92, -33, 85, -5, -6, 67, -72, -68, 100, 18, -76, 62, 24, -108, 24, 64, -65, 28, 93, -98, -59, 77, 0, -16, 65, -57, -90, 78, 29, -60, 37, 27, -67, 19, 38, -27, 34, 56, -59, -49, 35, 24, 43, 38, -60, -43, 29, -1, 20, 41, -59, -38, 64, -46, -38, 88, -5, -90, 33, 19, -62, 68, 42, -106, -22, 74, -38, 17, 72, -86, -60, 96, -30, -54, 122, 16, -119, 26, 31, -75, 81, 93, -112, -59, 64, -21, -12, 52, -46, -45, 53, -6, -28, 37, -14, -38, 49, -9, 4, 84, 17, -88, -9, 22, 9, 68, 33, -73, -8, 17, -38, 48, 57, -40, 22, 54, -87, -25, 115, -33, -82, 83, -8, -56, 95, 6, -155, 0, 84, -36, 31, 67, -90, -42, 32, -54, 4, 126, -3, -83, 23]
3581B3o7j2J61o0j40Q8M1q5L0M0o6M4N6m9rK2n5K2K3n1J01O4j72k3R2o0K4J34
3609A16r8r0R3j0q1R9L7j04Q3j1j39J18P1j54K4J23j16MJ54j56j14J95J1j32J23
3634D6L4j53M1P1q3M6Q7r0l0Qn0O7Q2r9j7J04o6m1Q2l8o5J00lp8Q0no6L2j7k8
3664d9J19kj50O3N4j01Q0J00j64j5J65j01j05J58Nj07Q0J5j20Q6N5j22K3O5q2
3689e0N4O1j32NJ24o5o1J21n0q0J01j4q9Q2M0q1J2K5l5Q4l0p9P0L6r0N4L7j19
3717f9L6J32j29n7J63m9q3R1j1p4R4lj22Q4M8r2O3K4j23O7R4j21j9J47q8p3J22
3744E2l5q9J04J1r8L8M9m8L6j2p1P0M0q7L6L2r6M8Q5j16pJ26p8o8J07oo3Q2k3
3773A9j05J10K6q1O5or5O4Q8j37J3J45j26n5J18l6p4J25k7j08Q3M9p1RQo8Q7M0
$$ y = [23, -44, -56, 105, 45, -95, -7, 34, -51, -21, 19, -47, -3, 53, 4, -5, 17, -38, -16, 7, -44, 57, 121, -51, -74, 18, -42, -18, 116, 18, -72, 21, 11, -70, 29, 66, -38, 45, 34, -105, 13, 84, -70, -46, 77, -39, -35, 119, -37, -151, 44, 55, -77, 46, 80, -73, -32, 39, -44, 2, 89, -1, -31, -23, -73, -6, 76, -23, -40, 64, -2, -43, 39, 1, -64, 36, 33, -45, 35, 30, -36, -4, -21, -49, 70, 68, -82, -19, 35, -66, 14, 114, -50, -65, 100, -1, -106, 52, 57, -50, 30, 45, -75, 11, 66, -56, -33, 32, -50, 4, 65, -67, -62, 62, -3, -64, 57, 7, -73, 28, 14, -75, 7, 47, -34, -22, 3, -32, 52, 22, -57, 13, 49, -41, 13, 50, -69, -33, 99, -30, -87, 76, 27, -56, 35, 24, -50, 44, 41, -81, 3, 51, -41, 22, 46, -77, -10, 84, -37, -56, 91, 3, -70, 52, 17, -72, 32, 43, -55, -17, 32, -16, 20, 8, -63, 7, 47, -40, -4, 28, -68, -20, 65, -51, -58, 68, -10, -78, 29, 23, -40, 42, 19, -86, 24, 50, -31, 34, 28, -67, -3, 85, -52, -39, 106, -20, -75, 43, 7, -67, 58, 31, -77, 6, 55, -16, -7, 1, -67, 20, 60]
3801F0r3L5L5r6J9O8n8K2Q8r9o8Q9Pk8P3n3o0Q0k0n3N7J1o6P8K2j19M3R4j40J
3831g1J49p1k5R4r5j01J36K5o9O4J9j00M1K3r7P5J03j03qO6j09MR5n3l0J02j2
3858E2r5M3l0k7P8J3o2N6j5p5L9K1n5J04N2j27qM8p4NJ20m6l8R8p9q8Q4J5l7Q4
3888E6j4j07O9K7j15M6J01q6L3O4j03m2R9l6n5J17Mn0M1n2r0P9Q1n6M0lj07K5
3916c4O8o8M7Q1q1n7M2k2j0P5l6m4O9j6l1L4n3m5J08J4o7P7mj22L5N4l5N7O3j28
3946b9o0Q9qoR8o0r0Q9Oq0Q2J9j05M6N1j00N6Q2j07o4J08Oj3P0p3r7O4M9k3O0
3976F0j7r1J9J8k9R2J9j01k5M2oN0M0r3n0O4k2L3M8o5l8O3m2oR3jj21M8J8o3J02
4007C9O3j51k0P7k9K7Q5q2q0P3ql7R5K1j25L4J2m7R9O1j31l5O1qQO6o0n4L9Qo
$$ y = [60, -33, 2, 37, -59, -40, 28, -30, -8, 80, -19, -87, 2, 9, -19, 54, 1, -59, 21, 1, -52, 5, 16, -50, 28, 50, -69, -26, 68, -72, -71, 78, 7, -18, 76, -19, -120, 16, 41, -28, 36, 55, -45, -4, 19, -78, -3, 100, -3, -11, 55, -54, -50, 45, -8, -38, 64, 52, -43, 0, -30, -57, 21, 34, -28, 28, 13, -62, -23, -2, -57, 47, 99, -28, -36, 12, -62, -57, 63, 17, -21, 77, -2, -90, -6, 9, -28, 56, 42, -65, 4, 31, -84, -38, 63, -23, 10, 74, -29, -71, 28, -8, -63, 54, 58, 8, 49, -3, -93, -14, 67, 11, 51, 48, -59, -34, 34, -34, 13, 94, 13, -44, -2, -24, -34, 41, 5, -39, 30, 14, -17, 17, -36, -81, 27, 41, -26, 51, 47, -75, -40, 14, -21, 36, 99, -29, -89, 0, -8, -14, 84, 24, -66, 23, 29, -51, 31, 50, -55, -9, 42, -58, -2, 80, -27, -91, 17, 23, 10, 80, 7, -90, -26, 23, 0, 60, 43, -48, -29, -11, -40, 52, 71, -30, -55, -13, -19, 31, 71, -22, -72, -8, -30, 3, 51, -14, -52, 11, -31, -37, 56, 55, -66, -18, 0, -63, 39, 102, -49, -69, 8, -21, 6, 91, 9, -71, 2, -6, -43, 52, 73, -52, -18, -6, -53, 46, 107, -24, -59, 2, -6, 2, 68, 8, -46, -7, 1, -5]
4038eN3k3m3Qj5LR6j5r3Pj5KQ2J3j00J1L6n1M7N3p7lM7o0j1J18m3p7P7l0n1J19
4070F0J1j40L0O6n0K2Q3q5l4O3l4l1R1j6n5Nmk1P8Op0OL2l0L3J2m3MK9l5J9K6
4102B8m2J0Nm0K7Q5o7n2O2k9j4R2l7r3O8L5p6M0L2p1J5O4p3nQ5n4n9Q5j4m3Q4
4133D8m2p5O4N7o5K1K6p4J8O9n1j6N9m2l0M8oKK2m0l5N4Rj1K8m5m7O7lk6K8mn7
4166d9M4K6n3M2M7r8k0R8m6MO9q6o3J23J4q5M3J8p9L5P0q7J3O2o3l7R6j8l2N2
4196D0m9n3O8M2n5QKj9K1L1m6K0K0m0J1J3mK4Qo9NL8j9K2K3o2k7Q6l4m0O0ro1
4229d5N8J1o9P3L3j13K8Q2o3pN9p8l1R9np5O6Mo1M3J8n8K9M8p4RM1k6MK9n1j3
4261c5O4j5l3L0j2rM6m9k1N4nk3L8j5m5P2qp8M6M1o3J6M1n8PO9o6o2R6j0m5O0
$$ y = [-5, 48, 25, -18, -10, -25, -22, 74, 59, -34, -27, -42, -40, 42, 55, -45, -34, 2, -49, -2, 51, -26, -29, 18, -42, -53, 65, 22, -55, 22, -8, -59, 60, 71, -69, -39, 27, -23, -1, 82, -3, -37, 26, -8, -39, 52, 36, -19, -14, -18, -39, 39, 45, -25, -19, 13, -17, 16, 28, -15, -11, 18, -17, 2, 28, -14, -4, 1, -39, -12, 73, 6, -46, 16, -13, -27, 65, 28, -65, 3, 38, -38, 2, 34, -37, -22, 42, -31, -36, 49, -5, -64, 21, 7, -36, 48, 6, -69, -5, 52, -13, 8, 34, -40, -22, 47, -4, -20, 39, -3, -33, 15, 9, 11, 33, -7, -42, 12, 21, 10, 38, -7, -54, 13, 10, -16, 12, 8, -49, -5, 21, -32, 10, 57, -41, -61, 37, -9, -5, 64, -22, -85, 38, 52, -33, 10, 28, -51, -16, 54, -33, -20, 42, -21, -58, 38, 20, -12, 40, -9, -62, 6, 48, -7, 1, 3, -16, 5, 36, -10, 10, 30, -10, 1, 14, 10, 34, 42, -27, -22, 16, -3, 19, 42, -20, -47, 39, 5, -35, 25, 16, -45, 13, 24, -45, 28, 61, -52, -24, 58, -5, -12, 47, -31, -62, 37, 32, -43, 23, 27, -34, 9, 27, -31, -2, 46, -28, -19, 22, -4, 0, 29, -22, -35, 29, 14, -19, 11, -1, -10, 36, -13, -34, 20, 15, -8, 30, 15, -30, 42, 34, -44, 2, 43, -20, -4, 37, -21, -14, 55, -11, -73, 23, 13, -32, 28]
4293B8k9n3N4L0p2M4M3q5PL5l6K5O7n7o2O2J6j3L0j5o4N4Rk3K8j2m1K3J4k9N6
4324C4J5q1j3M5j9O2L1r1l3P2j7mN9l5o0M5J0n1Q5nr2MO2m5N2N9j21o4J14%j0
4355HO3o1o9K1L9k0N0Lq0j0L6pO4J2q8pM5KM1J4q7k6M0K8kM5m9m9Oj2M3J03m2
4388E4j07J0J0lR7J5j02jL8m6L6N2m8o0P1rk3Q4l5r9KO8QO3Oj37k9O5K8K2M7n7
4420B0q3L0nK8N0J6q1j4J7J3M0j7o2J9L6J9L0l6p9QN0j3P7K9r9m7J7j1O3R9n5
4451E9q9Lj1J4R2j6q4K7M6n4J4J9n6rN9NOL5o1r9L8P2L3M8l3j16j7M9QM0K8m7
4483Cl6J3j9K1N7l2m0J8J1J8K3p4l5N5J9L8K9o8o5K6J5J0P2K4r7m7M7k4N2P9p5
4514A8n4K8RnM8m2n3O1M3m7J4Lp9%P9qJ8M8r5o4M6L8L1L3n7p5J4M7RJ7j4l2qK1
$$ y = [28, -1, -54, 0, 30, -42, 2, 45, -40, -33, 2, -34, -9, 58, 1, -61, 1, 17, 4, 34, 19, -45, 9, 18, -5, 23, 11, -30, -7, 7, -22, 34, 49, -32, -45, 0, -19, 43, 74, -17, -50, 22, 5, 1, 60, 25, -35, 10, 20, -31, 54, 49, -43, -39, 23, -22, 30, 89, -32, -96, 18, 18, 8, 71, 10, -59, -38, 1, -19, 31, 34, -46, -56, -20, -27, 37, 49, -39, -46, -1, 1, 42, 56, -31, -57, -17, 11, 9, 54, 5, -44, -38, -50, -7, 96, 54, -53, -43, -33, -36, 61, 76, -26, -27, 11, -35, 1, 53, 5, -55, 16, 7, -16, 68, 33, -66, -64, 4, 12, 75, 81, -56, -85, -20, 8, 30, 77, 20, -63, -33, -38, -10, 40, 56, -25, -39, -22, -9, 31, 14, -48, -29, 7, 26, 56, 20, -59, -51, -1, -14, 63, 92, -7, -54, -37, -48, 15, 114, 59, -30, -27, -38, -24, 68, 52, -32, -5, 41, -13, 1, 20, -36, -45, 14, 19, 25, 60, -1, -100, -62, 10, 43, 91, 58, -58, -75, -26, -18, 22, 50, 3, -33, -20, -39, -18, 39, 7, -33, -15, -4, 14, 37, -37, -72, -17, 2, 40, 69, 1, -64, -38, -23, -13, 59, 83, -14, -61, -14, -38, 14, 93, 18, -36, -8, 1, -4, 44, 2, -51, 10, 53, 6, 20, 23, -56, -56, 23, 15, 33, 81, -14, -78, -32, 6, 37, 70, 13, -62, -48, -1, 8, 25, 11, -21, -29, -8]
4548hpL2Rm7k0L4J1L4J2q9k2M5K5K8K0p3n6O2PJN6j2r0J2M4kM0K8r9l4O8QJ4J3
4582D4m8n3N2J4rL4j7o1J4M9j5L0J0q5j5L8K9J7on7l0N0J2K1J7n1k7K8rOO6k4
4614B4n5LJ6lN1lo7MM0pK2Nn9j7N0nqN6l5n9K0K9jM1J0q1j5M9qK6J9m4k0L2j0
4649@j8M4j3m2J7kJ4L4k1o6J3K8J7K0po0jL5nK8K4m1k6J5j3QN9k6m2J5KoK8ko1
4684e1K1N0k9jL0m9RL3l0PM0k2m0K6Nj9O3j7n8PM3l6QK5k3NL1l3lL8l9mJ2pOK1
4720A9j0m1K4Lj3K4ml4L0J6m6J2K9j8jJ4l7J9M8l4k5L4j2j5M0j1l6M5Kl8K1Qj8
4753eML6n7RM0l3k2K9k3lM9k1k3L6jl5K7Oj9J2J3n0J9K8j5J2pm0J8K7k4j1L7k4
4787a1j7K4j5kL9rn6M9pmK4qn4L4L6l1j2L5k4j4M1j7kL7k7m4K9QNK7j5o4L0K7
$$ y = [-8, -15, 17, 26, -21, -41, -7, 4, 38, 50, -39, -61, -16, 9, 37, 57, -16, -72, -10, -3, -2, 54, 42, -48, -36, 8, 6, 46, 74, -25, -59, 9, 17, 31, 44, -4, -57, -5, 9, 0, 34, 17, -44, -30, 19, 4, 34, 44, -41, -56, -18, 11, 28, 22, -35, -65, -15, -3, 18, 35, -16, -43, -15, -24, -18, 48, 24, -31, -28, -12, -15, 36, 33, -34, -30, 10, 3, 25, 30, -29, -46, 4, -1, -9, 47, 12, -47, -27, 2, 1, 42, 52, -29, -44, 5, -3, 23, 42, -2, -22, 10, 0, -18, 26, 13, -29, -12, -14, 0, 34, 13, -53, -40, -12, 5, 25, 18, -42, -43, -8, -13, 15, 39, -2, -28, -13, -26, -18, 41, 15, -27, -12, -10, -16, 12, 10, -51, -30, 20, -9, -10, 20, -29, -20, 13, -17, -10, 30, 8, -32, -6, -1, -20, 43, 26, -32, -25, 18, -18, -10, 15, -8, -3, 28, -5, -8, 30, -9, -13, -1, -8, -2, 19, 9, -32, -8, -5, -18, 6, 2, -32, -2, 14, -32, -20, 9, -9, -10, 4, -33, -14, 34, 0, -25, 9, -3, -18, 22, 11, -25, 20, 22, -16, 5, 13, -5, -1, 35, -22, -13, 27, -6, -28, 1, -22, -25, 24, 3, -20, 16, 15, -20, 7, 13, -6, 6, 19, -31, -12, 16, 1, 13, 6, -34, -16, 11, -13, -24, 13, -11, -28, -4, -19, -21, 18, 9, -47, 2, -5, -9, 15, 7, -47, -13, 23, -8, -20, 15, -9, -23, 18, 1, -1, 36, 9, -35, -6, 2, 7, 34, 19, -45, -15, 12]
4821A2j0PPm1NL9l5K2J8l2k1M0Mj0L1k5m9K8K8j0K4k9m6J9M4m5J8K2l6j7M1j9
4853a6K9J8m3m2N1NnRk9l0M2K4j7MJ1l9JM0j6J3K1m8k2M2J3MJ4m7k7M6J2k0J0
4886HNn5L5J8k4K6J4n5j4L5PJ7J1n5k1M7KNJ6l1m5M3J7l0L9Po6QK9j7M1Mo4mL9
4921hJ3j0M1o0k2N0Rk4L2k3m6L0K2j7L3J9o8KM5%NKn3qM2NrK0k2l2K0K1j1K5j6
4956Gm8K5J9nK6po2QN1j1ROm3k1M3jQK5j8o0L5J3jK1mo0J0N6j7LJ5o1NO0k3j2
4992iL8l0l9L0K7k0L7k0o3K7M2nMMn8J1M8j0pL6m3l7M1j0mL5l0l5K0K7LOk4m5
5026e3L2M5k8J3ln8QO2k9J8K5l2m0K1J0%L4j8n7M6K6j9J9mm3J1M4k0j0K5l4k8
5058c7M2mJ0K5m3m1M1J9LPql4K2J5k4J5Ok2%J9j7%L9n4j3K9PkJ9m7j8L9J3k0K3
$$ y = [12, 2, 9, 16, -25, -20, 19, -16, 6, 24, -8, -29, 11, 15, 5, 36, 11, -38, -10, 18, 8, 32, 3, -43, -24, 20, -25, -7, 15, -21, -38, 3, -16, 13, 31, -12, -54, -3, 2, -3, 6, -23, -53, -11, 13, -4, 0, 11, -28, -27, 13, -3, 10, 31, -17, -39, 3, 16, 20, 34, -13, -40, 6, 18, -2, 8, 13, -42, -7, 11, -13, 13, 27, -28, -42, -7, 0, 17, 28, -27, -48, -1, 1, 6, 22, -9, -54, -11, 6, -24, 15, 22, -44, -36, -7, -24, 17, 21, -43, -47, -8, 5, -5, 36, -24, -46, 4, 13, -11, 21, -2, -48, -18, 4, -13, 20, 39, -29, -27, 18, 18, 23, 25, -28, -36, 6, 11, 2, 22, 0, -32, -12, 9, -2, 23, 7, -41, -16, 3, -2, 24, 17, -45, -37, 14, 3, 12, 18, -25, -46, -3, -4, 4, 29, 11, -49, -14, -1, -2, 19, 15, -45, -35, 21, 4, 7, 22, -39, -34, 26, 3, -9, 29, -1, -40, -10, 17, -3, 34, 14, -49, -22, 20, 15, 19, 23, -35, -24, 24, 14, 7, 43, 0, -37, 4, -6, -10, 25, -5, -40, -20, 7, 10, 16, -8, -53, -21, 24, -4, 9, 6, -52, -44, 18, -11, 7, 32, 0, -40, -19, -9, -9, 25, 7, -50, -4, 22, 3, 22, 18, -25, -14, 30, 10, 0, 25, -9, -37, 5, 1, 11, 36, -7, -48, -7, 12, 15, 22, 14, -20, 2, 17, -7, 8, 14, -8, -8, 11, -6, -6, 33, -21, -34, -5, 2, 0, 19, -28, -46, -7, 6, -14, 9]
5093Inl5J6Ok2L1L4n0j7M4k4QK3m2mL6PmJk4rK7J2k7NK3k3j7K3j2J5K8l8l2M6
5128IKK%j3k3K8J2k2RJ6l5K5Jk0K1%k6j0M0j7lJ6k4k4M2Pl2J9nk1J6Kj5J9Nl3
5164c2PL2l6L1J0k8lL5j6%Qrj1K7Ll1J7J1l2LJ8j%J4m2ML4mj0K2m1%L2j0k2J3
5200gljJ6j2kJ1Kl4J0K5rj%j5%K5j5nJ4j0qNMj4K6jl0J7J8pMPk0%M3l1lJ7j1r
5240dJ0LkJ2Om1J5J1rK0Ml0OK6k3lPqmK3l1rL6ok7PNqK6Lm1J7J2mOQl4J3Pk4N
5281b0K7j3%Lj6oL6rk7K0J8j7%K2m5L3J7l4J3J3qj6J3j1j4N2mk3J1mj1RQj5J1
5316A3Rl1J5j9MJ1MrqK5j5k8MPkM1j8l3K7oj3K0Pk2L2j5l2JL4nRJ4m7MM9k8k6
5353b7L3J2l3K3jk7J2J1j9J5L8j8k1%j7pM9Ll0Rj1j1K1Mj0J4mj0j0QKjjl0K6K8
$$ y = [9, 4, -31, -15, -9, -31, 0, 34, -16, -33, 11, -13, -5, 18, -24, -28, 8, 15, 11, 12, -12, -21, 6, 18, -9, -4, 19, -4, -21, 2, -10, 5, 33, -5, -37, 9, 11, 13, 13, 0, -23, 5, 17, -5, 4, 20, -15, 10, 11, -9, 12, 12, -14, -24, 16, -1, -4, 12, -12, -36, 6, 13, -19, 0, -5, -26, -10, -8, -23, -4, 1, -32, -25, 7, -29, 2, 12, -16, -19, 16, 0, 0, 8, -1, -12, 15, 18, -13, 4, 15, -17, -14, 4, 3, 3, 17, -25, -21, 13, 9, -1, 21, -20, -20, 12, 2, -20, -7, -10, -11, 5, -7, -9, 2, 4, -30, -20, 5, -4, -5, -5, -20, -20, 5, -10, -15, -1, -11, -19, -14, -10, -24, 2, 1, -29, -12, 6, -1, 3, 10, -10, -10, 33, 2, -1, 16, 5, -4, 6, 9, 7, 19, 25, -16, -1, 10, 1, 21, 25, -5, 1, 27, 4, 1, 8, 0, -4, 19, -12, -21, 15, 9, -18, -11, -6, -14, 12, 15, -26, -9, 3, -1, 5, 13, -21, -8, -1, -25, -20, 7, -6, -6, -3, -19, -25, 11, 2, -25, -5, 13, -4, -4, 18, -27, 6, 23, -11, 2, 15, 7, -9, 4, -7, -21, 31, 27, 4, 15, 11, 0, 9, 17, 2, 13, 22, -9, 6, -13, -9, 2, 6, -3, -11, 14, -1, -29, -25, -18, -20, 21, 3, -30, -3, -9, -22, -2, 5, -17, 15, 0, -32, -31, 3, -2, 7, 21, -26, -22, 27, -1, -27, 6, 18, -15, 8, 7, -20, -8, 3, -16, -1, 37, 19, -2, -2, -19, -26, 23, 26, -4, 5, -6, -17, 4, 8, -2, 12, 8, -2, -12, -4, -2, -3, -4, -34, -8, 20]
5389B0j8j8Nj0J1K4k6LKj5j5M1Ol7N5j9n8M6J9l3J6K9m4J3L1l6j3M1qk4L0Mk7
5422eMMk8K2K4Ll3J0j1ML1j0j5NrJ3j0pJ8%j7j0K2j4J0J8l4j2N2k6l9M2Nn4M5
5457bK2n1LM9l1k2M7j9l8O5j6m7L3M4m7J5kk9J8L3l4j0M1ok9K8j3j4K1Pj9lK5
5490A9Jk3jOJ5mj1Lj1pK0rpJ6J0m5K2J3j2KK1l6pM4rm2L5Lm6N7mo0J6N4m2%M3
5527B4k4l5N4k6k6N6Ml2jK4j9KJ9k7JL3qj6MoMLj1J6jpMj8pJ1L2k5j0J9k3mM1
5564B5k5k5M7nm6K1L4n2J7K6m1J3N9m5l5L2Pj9L2ol2J3J1k9RL9k3kr%J2NNk2n
5599a4mK2mkLkJ1oJ0qJ3Nl3mL4J1l7K1j9k5K7K8l7PJ1k1rM5l3j5M6j8m5M3J5k8
5635a2PMk5J0L9l5rJ6Mk8K2Rk9K4Nk4J0K0Jj7Kj2RRPk2J1pK4k6MK0j5jJK8l3R
$$ y = [20, 2, -16, -11, -21, -10, 14, -12, -9, -7, -22, -37, 4, 10, -27, 28, 9, -49, -3, 16, -17, -1, 28, -16, -3, 28, -8, -21, 20, 12, -12, 18, 22, -5, -1, 3, -25, -3, 21, 24, -9, 1, -10, -6, 25, 15, 0, 5, -4, 9, -1, -8, 10, 10, -7, -17, 5, -9, 1, 19, -15, -27, 25, -1, -40, 2, 7, -47, -2, 20, -31, -28, 21, -10, -32, 15, -4, -42, 23, 7, -40, -7, 37, -10, 5, 3, -26, -8, 25, -9, -19, 22, 16, -13, 15, 2, -12, 9, 16, -3, -6, 19, 20, -3, -4, 2, 17, 13, 2, 5, -6, -13, 7, -2, -9, 7, 17, -28, -6, 7, -5, -3, 18, -18, -25, 19, 10, -32, 3, 6, -40, 17, 13, -47, -31, 23, -19, -19, 24, 0, -35, 19, -7, -33, 23, 27, -5, -6, 18, -1, 1, 20, -7, -6, 27, 19, 3, 7, 1, 5, 8, -3, 13, 12, 5, 9, -9, -16, -5, 27, 2, -8, 11, -12, -16, 25, 0, -25, 22, 17, -29, -8, 26, -26, -9, 17, -24, -11, 48, 3, -32, 0, 7, -12, 20, 14, -18, -5, 6, -23, -14, 25, 2, 0, -9, -9, 3, 8, 13, -9, -14, -18, 4, 0, -2, 1, -1, 10, 4, 14, 6, 19, 24, -9, -13, 21, 32, -5, 16, -3, -28, -1, 27, -10, -3, 8, -13, -22, 23, -10, -25, 21, 3, -42, 1, 16, -12, -5, -1, -26, -16, 23, -12, -21, -5, -1, -29, -7, 2, -27, -3, 2, -22, -12, 8, 9, -8, -6, -18, -9, 0, 7, -15, -4, -11, 13, -13, -9, 11, -4, -5, -4, 24, -9, 0]
5673@K9l6NK2j6qJ4j0l6N1kl5J8K1l8KL7l2lL7k1m1M1J3l4J0%j3L0Rl5rL5pqJ6
5709FkpK0k1j0L0j6J2oj8OJ8j5jRj0LRJj6K2Lk5K4%k1J7J2k2j4L7l1j4L6j8oL4
5746B6j1l2K6Ql1J1J4m0J5K6k3j1K0j5j2J7olK0Kk3J2J7j0jOqj4K6Kk2J3Mjjl
5782bLJ1j6lPKpJ7oj3J9rj2J1Nj4J5jk6J4J8j5rK3j0oJ6j0j8J9LmjKk6K7mk4R
5821a5J5lj1P%pJ7pj6RJ6j2Oj0KJ1%j2OJkLJKQJ1j7pJ3j0PJ1k1%K4k2lLJ3k0J2
5862CQk1ORk5NL5j5LRj7k2L5j2j6K2j6oJ3J2l8K0J7j5oNj0PJ8j8j1J7J3j8Nqk
5899a4J4J6j0Mjj1p%RK2Qk3lLJrK5j4KK1l2j0J2lnJ6Jj1J6qk9kN1l2K2Nm1KJ9
5938DrJRJ6k5Ppk6L1J3k1%J2j6KKj3MJ6mpQ%j5K7j7oL4j1pLmNJ7jk4MNqPPj6l
$$ y = [0, 29, -7, -2, 20, 4, -4, 10, 0, -36, 15, 13, -22, -4, 17, -21, -19, 18, -14, -17, 20, -1, -42, -1, 12, -22, -12, -12, -25, 5, 14, -21, -30, 5, -2, -10, 6, 4, -3, 17, -4, -14, 16, 0, 12, 6, -12, -6, 12, -3, -4, 5, -5, -2, 7, 8, -8, 14, 17, -8, 16, 16, -5, 12, 24, 2, -12, 25, -6, -20, 16, -2, -8, 26, 15, -17, 9, 17, -14, -3, 11, -29, -14, 12, -11, -22, -2, -17, -29, -12, -18, -21, -1, 1, -22, -10, 7, -3, -4, 2, -6, -20, 6, 8, -14, -1, 3, 2, 1, -2, 1, 12, -4, -7, 0, 2, -5, 12, 6, -7, 12, 3, -9, 2, 7, -7, 8, 7, -19, -5, 13, -2, -11, 12, 2, -4, 12, 2, -16, 3, 6, 2, 1, 3, -23, 4, 0, -24, -15, 0, -3, -14, -7, -7, -14, 3, -4, -20, -11, 5, -7, -1, -11, -9, 2, 2, -10, -4, -3, -5, -2, -1, 1, 9, 20, 3, -4, 9, -1, 6, 17, -4, -4, 20, -2, -5, -2, 11, -9, 3, 11, -10, -4, 5, -20, -15, 20, 5, 8, 17, 0, -22, 13, 1, -15, 7, -9, -15, -2, 10, -28, -8, 9, -6, -12, -7, -17, -10, 8, -10, -21, -4, 9, -9, -4, -12, -14, 0, 16, 6, 10, 9, -2, -9, -9, 0, 22, 30, 7, 4, 7, 8, -1, 24, 10, 12, 33, 1, -9, 3, 0, -5, 11, 12, 1, 17, 9, -20, -22, 29, -3, 19, 24, -17, -15, 4, -5, -4, 5, 21, -4, 3, -4, -30, 1, 14, -7, -7, 5, -11, -9, -7, -20, -16, 0, -4, -11, -3, -3, -18, 9, -8, -14, 20, 9, 2, 5, 1, 6, 23, 22, -2, 2, 7, -1, 6, 13, -3, -6]
5981fL5k6j9K5j3kJ1jj5J5J9k3j0PjqJ8k2qK6j6j1L0Kj0kkj2K0Jj7J2nKNkj6J1
6019hK0k1ORj8OJ4j7JJ1QrnJ4j7K3Jj5MOk0lK2orK3k0j1J3Nj3J8k4jK3rpK0Lm0
6059b3PJ5k3J8J1k0JJ5j0QKooK6mk5K2noj0J3j3L0ol1J3%qJ6J8j2j1J0pj2K2q
6096AKJ3k3nJ7Pj7NLoJ2J2k7RQj1pJ5%j9%klJ3Llkj4qK5Nj5N%j4J8Nj3J0J2k6
6137a5nK0l%J2k7JL2Lk6MQk6K9koJ0J6m1jJ3oK1J5l4%J6l%Rj5oK3j3j1J6pj8L
6176a4J1qMJ4l2NJ1KNQm5QK6qj0K6j2k1J2Pj0K3J0l7MJ3PJ1nj2pJ3jMJ1plpOj
6216AK1j2nj9OMK3Kk8j3K1rMJ5j8J8oj4NK6j4k1RrlL1j8k1PK2j7JK6k0qJ6k1R
6254iJ6Lk8KKmL0ok5KK2JrK2rj2Qj9J6J3o%kj7RRLj2Pk4RJ4p%Nj5KJ7j0QoQl4
$$ y = [-6, 29, 3, -16, 9, -4, -6, 5, 4, -11, 4, 23, 0, -10, -3, -4, -12, 6, -16, -24, 2, -14, -25, 5, 7, -3, -5, -7, -19, 1, 2, -15, -3, -8, -6, -1, -3, -19, -8, 12, -9, -3, 6, -12, -6, 8, -9, -8, 3, 11, 2, -3, 11, -6, 17, 18, 3, 7, 13, -7, -10, 12, 6, -3, 20, 0, -11, 2, 7, -6, 12, -12, -13, 10, 1, -6, 14, 17, -23, -16, -1, -24, -6, 5, -15, -14, 1, -9, -1, 1, -5, -11, 15, 11, -14, 8, 3, -3, -13, 0, -13, 17, 11, -20, -7, -7, -15, 1, 19, 7, -4, 6, -1, -13, 9, 1, 3, 16, -7, -12, 5, 12, -5, 0, 3, -3, 9, 21, -6, 3, 11, 0, -7, 8, 8, -11, -11, -13, -16, -3, 0, -3, -5, -19, -27, -2, 3, -12, -7, -7, -21, -3, 2, -11, -1, 11, -15, -20, 0, -3, -3, 9, -18, -17, 15, 18, -8, -4, 4, -22, 7, 5, -1, 9, 25, -16, -17, -4, -10, 11, 26, -8, -8, 8, 5, 5, 14, -1, -7, 16, 3, -8, 8, 1, -17, -14, -3, -11, -7, 7, -25, -20, -9, -7, -2, 6, -39, -31, -5, -13, -23, 3, -9, -30, -18, -11, -21, 2, 12, -25, -21, -8, -1, 10, 5, -7, -14, -1, -2, 2, 13, 6, 3, -4, 2, 1, 22, 10, 5, -14, -8, -4, 19, 21, -7, -20, 1, -8, -4, 11, -7, 11, 5, -9, -4, 22, 8, -13, -4, -13, -16, 15, -3, -24, -17, 5, -12, -11, 15, -5, -13, 3, -18, -9, 7, 10, -18, -16, -14, -18, 12, 6, -19, -17, 5, 6, -3, 19, 10, -2, 6, -13, 3, 16, 10, 10, 8, -9, 0, 9, 12, 0, 7, -17, -8, 6, -1, -1, 4, -11, -9, 8, -2, 6, 0, 8, -26]
6297b6K9J3k8J3Kk4J1K2nk7K1Jj4K3mk4J0Oj7kM0l1oK1j5lK1k0PJ2%pLPnJ5pj4
6335bJ4j0PJ4k8J1%Lj0J2QKoj1qOJ5qj7J2j4RJ4k1oQNj8OJ5rJ1Ok4J1J2rm%Mq
6376hQJnKjpRLnJ4nrlJ2J5j1j0j3PJ2J1qJmjOj7J1J7j3j7PK0j1J1nk3%QJ0rJ3
6418A3j3pR%j6K1jl1J7OLLQk0J3%pJ2%j8j1J3KLK3j4k0pJ0J3K6l0k1PJ0J6J2%
6456B4j9j4JLJ0J7j6j7MLPK7ql1JJJ1K7j2k1nRqQJ9k6j2PoJ1K2qk4kRj0K7Nk0
6495fj1JJJ6Qkj3%lJ1K3j2pjj1J4J5oj4NonJ4Qjrj3oPJ8lplmnL1j3knlNNQmk2
6540gJ3l4K9J5npj5j%J3Qj6j0%%QnJ3Jk1lK0J2Ok0Jj4J0L3j5%kj1PJ2nrPLppP
6582DJ0lNj5kL0j4nlkkOpJLjrQM%olj6J0J0ljLj2J0Rj9Njrj%J2j2K7rk1J7lOJ1
$$ y = [-26, 3, 16, -12, 1, 3, -21, -10, 12, 7, -20, 1, 2, -12, 11, 7, -17, -7, -1, -18, -20, 20, -11, -17, 4, -11, -14, 7, -13, -6, 6, 6, -1, 2, 9, 4, 19, 12, -2, 12, 2, 9, 23, -5, 6, 6, 9, -1, 11, 19, 21, 15, 4, -4, 2, 17, 9, -8, 4, -10, -1, 13, -8, -14, -6, -1, -19, -13, 2, -7, 4, 10, -14, -3, 9, 0, -4, -4, 0, -8, 0, 1, -4, -2, -3, -10, -1, 2, -3, 11, 6, -3, -6, 6, 21, 10, 0, -13, -6, 6, 17, 9, 10, 6, 5, 11, -6, 5, 22, 9, -8, -1, 19, 8, 19, 14, -9, -9, -1, 9, 0, 13, 0, -7, 2, 2, -14, 7, 6, -25, -8, -2, 1, 4, 12, -8, 5, 5, -2, 10, 10, -8, -19, -6, -4, -1, 22, 8, -12, -19, -9, 4, 30, 0, -21, -14, -4, 12, 24, 24, 5, -9, -8, -5, 5, 22, 6, -11, -7, -4, 3, 30, 22, -9, -8, -7, 4, 31, 19, -2, -7, 2, -6, 2, 21, -5, -17, -10, -16, -5, 17, 9, -15, -17, -8, -18, 9, 14, -6, -17, -16, -15, 1, 9, 7, -6, -6, -9, 2, 25, 13, 6, 5, -6, 8, 23, 17, 3, 8, 2, -3, 11, 19, 18, 9, -4, -10, -3, 15, 12, 5, 2, -2, -7, 24, 11, 9, 4, 1, 6, 11, 19, 15, -7, 6, -28, 1, 16, 11, 4, -11, -12, -12, 1, 9, -7, -17, -17, -17, -9, -14, -1, 0, -21, -24, -4, 8, 14, -6, -5, -19, -9, 24, 9, 9, 7, -4, 3, 15, 10, 1, 8, 11, 4, -3, 4, 14, 11, 16, 1, -1, 29, 15, 10, 7, 5, 3, 9, 2, 3, 6, 5, -4, 4, 8, 8, 2, -1, -17, -7, 3, 0, -1, 2, -10, 0, 9, -10, -5, -6, -15, -16, -16, -4, -16, 11, 2, -19, -2, -5, 1, 12]
6628A2lj4QL%LJ2k1QPoj2J7MkKrLMlnrJ8j7kJ6qj1Rq%KJ7k3J2j1j6J6J2lQj5q
6671a3Qj1J3LNk1lJ0NlMn%MnMRrKJ0%%J6qk5MK9j7J2Nj9j2K3MqJ0j2j9RJ2KJ4
6713B7qk8LJ1kJ5qj5JmJ1J5lpj0noK4Qlk5L%JK8j9k9J7J3rK0J3k7oJ7j7J6K1j9
6752A4k8J1MqL3mk8JMPJJ4rjqpJ7K3j4j9mjJ9J1pj7j3MOJ9rk0LokK2J2j4jj5j7
6793b7J3K9j0j5kj3J3K7j3j2Nj2OK5Qj4koj6RL7j1oKk5J2PQqNj6KJ2rJ3oj2MJ2
6832A4J7j4rj2nJ8J5j7J1j7lJ0JOlJj7j3J7NqJ5j7j9J8K%nJ3qrJ4Nj4J1poK1N
6871A6olj0j4J3J0RqJ0j8jPqNPlkO%j1J4pj5J2kNjNlJ3l0%K1j8OK0ok3J8%p%J0
6914A1k4nJ8llJ1nk3J6KMJ4nk3J8J3j5MJ6j1j5J1nlJ8j2pKJ0J2Kj0j8JJ2J9oj3
$$ y = [12, 9, -5, 3, 6, 6, 9, 21, 0, 8, 15, 9, -3, 14, 18, 16, 18, 9, 12, 16, 13, 8, -1, 17, 0, -2, 14, 6, -5, 4, -4, -4, -2, 15, -8, 4, -7, -23, -7, 5, 2, 10, -5, -13, -5, -16, -3, 0, 5, -16, -19, -9, -4, -7, -3, -8, -8, -4, -9, -5, 4, -5, -3, 7, 7, 7, 23, 15, -10, -6, 23, 6, 18, 23, 4, -8, 15, 19, 11, 21, 9, -10, -1, 11, 13, 27, 19, -9, -6, 5, 3, 18, 10, -5, -4, -8, 3, 18, 15, 8, -2, -7, -13, 11, 19, 16, -9, -6, -6, -5, 23, 4, -25, -8, 5, -4, 16, 29, 2, -4, 13, -4, 12, 33, 14, -14, -3, 1, -7, 26, 22, -6, -5, -1, 6, 7, 21, 12, 11, 3, -4, 13, 36, 22, 3, -1, -2, 17, 28, 21, 4, -9, -5, 1, 20, 11, -9, -6, -12, -14, 8, 20, 6, 5, -10, -27, -14, 15, 5, -10, -12, -25, -12, 15, 2, -10, -5, -17, -11, 14, 22, 8, 6, 0, -16, -7, 30, 19, 13, 15, -10, 2, 9, 17, 9, 14, -2, 0, 12, 3, 16, 10, -2, 2, 14, 31, 17, 8, -4, -9, 9, 24, 7, 18, 1, -2, 8, 9, 15, 12, 13, -4, -17, 0, 5, -3, 12, -5, -24, -6, -4, -4, -9, 4, -4, -13, 1, 6, -8, 3, -4, -10, 11, 16, 10, 7, -3, -17, -4, 6, 15, 7, 17, -1, -2, 5, -3, 2, 9, 6, 4, 10, 10, -1, 13, 6, -9, 3, 1, 6, 5, 10, 7, 20, -10, -10, 11, -7, -1, 19, 13, -10, 8, 8, 1, 1, 11, -13, -18, 0, -3, -6, 5, 0, -23, -7, -5, -1, 13, 8, -15, 3, 16, 1, 5, 21, 10, -5, 6, 1, -2, 16, 4, -3, -1, 9, 21, 23, 13, -5, -4, 8, 27, 21, 8]
6952HlkmR%Oj5kpLJ7J5j5k9J0PjK2k1j1J3j4jJ8%j3oJ2j2NK2k0j5Mj5L0NLk1J1
6992gJpJ9Mj3lKjJ7j4K4k7NPJ1J5j3j0%j4RK4rj4Jj3J0Mjlj6j3RK7J4k7j8K0r
7031ioL7j0j9Pj0qJ4K1j5Lrj3J3J5pj2kOJJ4k%j3kkJ2J3j3jj7KJ9J8j6j0PrJ6
7070A3JKj2Oj6jK9k1J5j2k2JL5j3j0J5j7j2K1Qj9jMj3J6Oj4MJ2k2PJJ4lnj0%J1
7108bJLKLpn%kJ6Pk3OQKJ0mj1j1K1mPKkj1QLpPjk1kJ9nJ7j7mj2J7KlmnkOjj9J5
7155cPj4qJ2lLNj0LoK0j1J2mJj1%%J4rJ%OnLqJMkMO%KOmj2J3pKPnPj1%Ok%OpJ
7205A0oRj0Npj0J3j1QKj3mJJj1J6QrMkqJ9mOlOln%Lj0JJ4j2jJ8oKkj5PJ6j1l%
7250CjKJ3j1jnllJ9Nj1JKj6J1%J%J1k2QK1j3j6kOj3OJ0omoKKJ4qqQkLK1j2lj2
$$ y = [8, 5, 3, -1, 8, 8, 14, -1, -3, -10, -7, 10, 25, 10, -19, -9, -2, -3, 19, -2, -13, 0, -14, -15, 3, 3, -10, -16, -4, -16, -11, 11, -9, -24, -20, -35, -5, 0, 3, -18, -7, -6, -13, 6, 10, -3, -6, -4, -5, 12, -2, 22, -5, 0, 7, 18, 33, 20, 10, 10, -4, 5, 29, 20, 6, 7, -6, 4, 8, 7, 4, -12, -25, -16, 11, 25, -2, -20, 0, -9, -15, 22, 12, -7, 0, -10, -18, -4, 17, 2, 5, -4, -17, -4, 11, 4, -8, -10, -4, -3, 11, 9, 9, -4, -6, -8, 4, 17, 4, 3, -14, -12, 7, 25, 9, -1, 6, -3, 13, 14, 16, 4, 10, -6, -7, 22, 1, 16, 4, -18, -17, 18, 5, -5, 10, -7, -19, 2, 10, -9, -10, -6, -19, -3, 3, -11, -7, 5, -17, -10, -9, 5, 2, -3, -13, -13, -2, -1, 2, 4, 7, 0, -5, -5, -7, 9, 16, -7, -1, 7, 9, 19, 15, 4, -7, 14, 10, 17, 19, 17, 6, 14, 17, 10, 17, 16, -5, -7, 12, 7, 24, 7, 3, -9, 8, 10, 7, 3, -2, -4, 2, 1, -18, -3, 4, -10, -18, -6, -9, -6, -1, -11, -8, -14, 6, -5, 7, 3, 4, -7, -7, -7, 7, -2, -1, -1, 5, 0, 3, -5, -4, 0, -2, 2, 8, 8, 10, 16, 12, 0, 13, 6, 8, 15, 10, 17, 6, 6, 12, 10, 10, 16, 9, 10, 4, 13, 3, 8, 1, -9, 4, -7, 1, 3, -10, -14, -13, -12, -23, -7, 1, -8, -4, -6, -14, 5, 1, 7, 4, 10, 7, 2, 2, 5, -5, -4, 10, -2, -3, 15, 9, 11, 9, -6, 1, 17, 6, 3, 3, 2, 4, 17, 6, 5, 0, -3, -6, 13, 18, 7, 8, 10, -6, 5, 5, 6, 6, 17, -5, 3, 24, 11, -5, -7, -1, -14, -8, 2, -4, -8, -14, -12, -10, 4, -4, -12, -4, -6, -3, 18, 6, 3, -9]
7294inJ0MJ4j2Oj0LQNlPLj7R%J0kjk8J1PPj0Rj5mJ6%knlj2J6rNPOj9lJ5%mrpo
7340a7RJ9qlJ1k3KK7j8MmqMLJ5j9Nj5POJ0Qqj5rK1J5kLj7j5J3Rj0K1pj6KK3j4
7380I%Mk4J0JJ2kKj5j3J3J7nj3mKmJ5JpJ3k3LP%M%j3MmRPlj8kK5pJNqj9J1NJJ5
7425A2Jj5%J1J1mlolLj0K0qmpJJ3j3J6j0%j3J7%j0J6l5J4KloQnj1J1%OJljQ%p
7468fJ5kj5lMJkJ3j5JK2kj1Mj6oK1O%KmpNmKN%%rJ5Oj1LoMpQkMrJ2j6NKnnK%l
$$ y = [-9, -14, -4, 0, 14, 2, 8, -2, 1, 9, 14, 11, 18, 21, 4, 13, 13, 23, 21, 20, -8, 3, 10, 17, 7, 16, 1, -3, 13, 13, 11, 6, 3, -9, 7, -2, 3, 10, 16, -3, -6, 9, 9, 5, -4, -11, -17, -8, 11, 3, 0, 11, -12, -10, 17, -1, 3, -1, -9, -5, -2, 13, -6, -1, -16, -9, -3, 7, 15, 7, -8, -17, 4, 19, 17, 20, 3, -12, 1, 10, 0, 21, 14, -2, 0, 23, 9, 9, 13, -11, -1, 0, 12, 10, 12, -3, -16, -3, 14, 9, -4, -8, -6, -10, 5, 6, -1, 12, -11, -8, -1, -1, 3, 3, -10, -6, -10, -1, 6, 3, -15, -17, 8, 1, 2, 7, -1, -20, -9, -4, -3, 12, 13, -2, -2, 9, 20, 16, 13, 7, 4, 7, -3, 17, 9, 5, -2, -1, 12, -1, 15, 5, 5, -8, 9, 9, -1, 15, -20, -6, -4, -7, -13, -5, -10, -21, -10, -10, -4, -3, -6, -7, 1, 1, -6, 9, 7, -8, -11, -7, -6, -8, 5, -10, -9, 13, 11, 0, 4, -12, -18, 3, 9, 9, 11, 7, 0, 5, 1, 3, 8, 8, 8, -1, 14, 20, 9, 12, 6, 10, 3, 11, 9, 13, 4, 16, 0, 5, 7, 2, -3, -1, -1, -4]
$$ [...]
8191C
##END NTUPLES=NMR FID
##END=
