##TITLE=1H_LY-821.40
 CCl4, 8 sc, 
 28.5.2019
##JCAMPDX= 6.0         $$ Bruker NMR JCAMP-DX V2.0
##DATA TYPE= NMR FID
##DATA CLASS= NTUPLES
##ORIGIN= UXNMR, Bruker Analytische Messtechnik GmbH
##OWNER= root
$$ XWIN-NMR		Version 3.5
$$ Tue May 28 14:46:41 2019 Russian Standard Time (UT+4h)  she@DPX200
##.OBSERVE FREQUENCY= 200.1315
##.OBSERVE NUCLEUS= ^1H
##.DELAY= (6, 6)
##.ACQUISITION MODE= SIMULTANEOUS
##.ACQUISITION SCHEME= undefined
##.AVERAGES= 8
##.DIGITISER RES= 18
##SPECTROMETER/DATA SYSTEM= spect
##.PULSE SEQUENCE= zg30
##.SOLVENT NAME= CDCl3
##.SHIFT REFERENCE= (INTERNAL, CDCl3, 0, 15.7039)
##AUDIT TRAIL= $$ (NUMBER, WHEN, WHO, WHERE, WHAT)
$$ ##TITLE= Audit trail, XWIN-NMR		Version 3.5
$$ ##JCAMPDX= 5.01
$$ ##ORIGIN= Bruker BioSpin GmbH
$$ ##OWNER= she
$$ F:/spectra/data/she/nmr/H-F/1/audita.txt
$$ ##AUDIT TRAIL=  $$ (NUMBER, WHEN, WHO, WHERE, WHAT)
(   1,<2019-05-28 14:45:43.25 +0400>,<she>,<DPX200>,
      <created by zg, POWCHK disabled, PULCHK disabled
       configuration hash MD5:
       00 E9 B6 7A A2 85 ED C7 34 08 36 98 17 FE 4E 26
       data hash MD5: 16K
       0B 71 F3 66 C8 48 E3 DC 3D BB CB 74 16 28 03 73>)
$$ ##END=
$$ 
$$ hash MD5
$$ D2 51 92 FF 18 41 A9 D3 D6 31 D7 FF 3F B3 34 0A
##$RELAX= 
##$RELAX= 
##$RELAX= 
##$RELAX= 
##$RELAX= 
##$RELAX= 
$$ Bruker specific parameters
$$ --------------------------
##$DU= <F:/spectra>
##$EXPNO= 1
##$NAME= <H-F>
##$PROCNO= 1
##$TYPE= <nmr>
##$USER= <she>
##$AMP= (0..31)
100 100 100 100 100 100 100 100 100 100 100 100 100 100 100 100 100 100 
100 100 100 100 100 100 100 100 100 100 100 100 100 100 
##$AQSEQ= 0
##$AQ_mod= 1
##$AUNM= <au_zg>
##$AUTOPOS= <>
##$BF1= 200.13
##$BF2= 200.13
##$BF3= 200.13
##$BF4= 200.13
##$BF5= 200.13
##$BF6= 200.13
##$BF7= 200.13
##$BF8= 200.13
##$BYTORDA= 1
##$CFDGTYP= 0
##$CFRGTYP= 5
##$CHEMSTR= <none>
##$CNST= (0..31)
1 1 145 1 1 1 1 1 1 1 1 1 1 1 1 1 1 1 1 1 1 1 1 1 1 1 1 1 1 1 1 1 
##$CPDPRG= <>
##$CPDPRG1= <>
##$CPDPRG2= <>
##$CPDPRG3= <>
##$CPDPRG4= <mlev>
##$CPDPRG5= <mlev>
##$CPDPRG6= <mlev>
##$CPDPRG7= <mlev>
##$CPDPRG8= <mlev>
##$CPDPRGB= <>
##$CPDPRGT= <>
##$D= (0..31)
0 1.2 0 0 0 0 0 0 0 0 0 0.03 0 0 0 0 0 0 0 0 0 0 0 0 0 0 0 0 0 0 0 0 
##$DATE= 1559040342
##$DBL= (0..7)
120 120 120 120 120 120 120 120 
##$DBP= (0..7)
150 150 150 150 150 150 150 150 
##$DBP07= 0
##$DBPNAM0= <>
##$DBPNAM1= <>
##$DBPNAM2= <>
##$DBPNAM3= <>
##$DBPNAM4= <>
##$DBPNAM5= <>
##$DBPNAM6= <>
##$DBPNAM7= <>
##$DBPOAL= (0..7)
0.5 0.5 0.5 0.5 0.5 0.5 0.5 0.5 
##$DBPOFFS= (0..7)
0 0 0 0 0 0 0 0 
##$DE= 6
##$DECBNUC= <off>
##$DECIM= 24
##$DECNUC= <off>
##$DECSTAT= 4
##$DIGMOD= 1
##$DIGTYP= 9
##$DL= (0..7)
0 120 120 120 120 120 120 120 
##$DP= (0..7)
150 150 150 150 150 150 150 150 
##$DP07= 0
##$DPNAME0= <>
##$DPNAME1= <>
##$DPNAME2= <>
##$DPNAME3= <>
##$DPNAME4= <>
##$DPNAME5= <>
##$DPNAME6= <>
##$DPNAME7= <>
##$DPOAL= (0..7)
0.5 0.5 0.5 0.5 0.5 0.5 0.5 0.5 
##$DPOFFS= (0..7)
0 0 0 0 0 0 0 0 
##$DQDMODE= 0
##$DR= 18
##$DS= 0
##$DSLIST= <SSSSSSSSSSSSSSS>
##$DSPFIRM= 0
$$ [...]
##$SUBNAM2= <"">
##$SUBNAM3= <"">
##$SUBNAM4= <"">
##$SUBNAM5= <"">
##$SUBNAM6= <"">
##$SUBNAM7= <"">
##$SUBNAM8= <"">
##$SUBNAM9= <"">
##$SW= 24.9337058887773
##$SWIBOX= (0..15)
0 0 2 0 0 0 0 0 0 0 0 0 0 0 0 0 
##$SW_h= 4990.01996007984
##$TD= 16384
##$TD0= 1
##$TE= 0
##$TE2= 300
##$TE3= 300
##$TEG= 300
##$TL= (0..7)
0 120 120 120 120 120 120 120 
##$TP= (0..7)
150 150 150 150 150 150 150 150 
##$TP07= 0
##$TPNAME0= <>
##$TPNAME1= <>
##$TPNAME2= <>
##$TPNAME3= <>
##$TPNAME4= <>
##$TPNAME5= <>
##$TPNAME6= <>
##$TPNAME7= <>
##$TPOAL= (0..7)
0.5 0.5 0.5 0.5 0.5 0.5 0.5 0.5 
##$TPOFFS= (0..7)
0 0 0 0 0 0 0 0 
##$TUNHIN= 0
##$TUNHOUT= 0
##$TUNXOUT= 0
##$USERA1= <user>
##$USERA2= <user>
##$USERA3= <user>
##$USERA4= <user>
##$USERA5= <user>
##$V9= 5
##$VALIST= <valist>
##$VCLIST= <CCCCCCCCCCCCCCC>
##$VD= 0
##$VDLIST= <DDDDDDDDDDDDDDD>
##$VPLIST= <PPPPPPPPPPPPPPP>
##$VTLIST= <TTTTTTTTTTTTTTT>
##$WBST= 1024
##$WBSW= 4
##$XGAIN= (0..3)
0 0 0 0 
##$XL= 0
##$YL= 0
##$YMAX_a= 34626
##$YMIN_a= -42981
##$ZGOPTNS= <>
##$ZL1= 120
##$ZL2= 120
##$ZL3= 120
##$ZL4= 120
##$ABSF1= 10
##$ABSF2= 0
##$ABSG= 5
##$ABSL= 3
##$ALPHA= 0
##$AQORDER= 0
##$ASSFAC= 0
##$ASSFACI= 0
##$ASSFACX= 0
##$ASSWID= 0
##$AUNMP= <proc_1d>
##$AZFE= 0.1
##$AZFW= 0.1
##$BCFW= 1
##$BC_mod= 2
##$BYTORDP= 1
##$COROFFS= 0
##$CY= 11.3945322036743
##$DATMOD= 1
##$DC= 2
##$DFILT= <>
##$DTYPP= 0
##$F1P= 18.9103706918063
##$F2P= -1.10871071338519
##$FCOR= 0.5
##$FTSIZE= 0
##$FT_mod= 4
##$GAMMA= 1
##$GB= 0.15
##$INTBC= 1
##$INTSCL= 1
##$ISEN= 128
##$LB= 0.24
##$LEV0= 0
##$LPBIN= 0
##$MAXI= 10000
##$MC2= 0
##$MEAN= 0
##$ME_mod= 0
##$MI= 1.114404
##$NCOEF= 0
##$NC_proc= 0
##$NLEV= 6
##$NOISF1= 3.799351
##$NOISF2= 2.8
##$NSP= 1
##$NTH_PI= 0
##$NZP= 0
##$OFFSET= 15.70392
##$PC= 1
##$PHC0= -8933.918
##$PHC1= 13.20025
##$PH_mod= 1
##$PKNL= yes
##$PPARMOD= 0
##$PSCAL= 0
##$PSIGN= 0
##$REVERSE= no
##$SF= 200.130013532006
##$SI= 16384
##$SIGF1= 3
##$SIGF2= 2
##$SINO= 400
##$SIOLD= 16384
##$SREGLST= <1H.CDCl3>
##$SSB= 0
##$STSI= 0
##$STSR= 0
##$SW_p= 3612.71676300578
##$SYMM= 0
##$S_DEV= 0
##$TDeff= 0
##$TDoff= 0
##$TI= <>
##$TILT= no
##$TM1= 0
##$TM2= 0
##$TOPLEV= 0
##$USERP1= <user>
##$USERP2= <user>
##$USERP3= <user>
##$USERP4= <user>
##$USERP5= <user>
##$WDW= 1
##$XDIM= 8192
##$YMAX_p= 0
##$YMIN_p= 0
$$ End of Bruker specific parameters
$$ ---------------------------------
##NTUPLES= NMR FID
##VAR_NAME=  TIME,          FID/REAL,        FID/IMAG
##SYMBOL=    X,             R,               I
##VAR_TYPE=  INDEPENDENT,   DEPENDENT,       DEPENDENT
##VAR_FORM=  AFFN,          ASDF,            ASDF
##VAR_DIM=   8192,          8192,            8192
##UNITS=     SECONDS,       ARBITRARY UNITS, ARBITRARY UNITS
##FACTOR=    0.0002004,     1,               1
##FIRST=     0,             0,               0
##LAST=      1.6414764,     0,               0
##MIN=       0,             -42981,          0
##MAX=       1.6414764,     34626,           0
$$ Real data points
##PAGE= N=1
##DATA TABLE= (X++(R..R)), XYDATA
0 0 0 0 0 0 0 0 0 0 0 0 0 0 0 0 0 0 0 0 0 0 -7 8 -8 8 -8 8 -8 8 -10 16 -16 16 -16 21 -24 24 -28 32 -33 38 -41 46 -51
43 -51 56 -62 69 -77 88 -98 112 -127 149 -174 207 -255 325 -437 631 -1045 2230 -11793 -42981
62 -42981 13205 15204 -25388 12971 32795 -21192 -20138 16402 -3536 -10607 17528 3371 -15127
75 -15127 4140 4105 -6277 9171 3769 -17250 -2354 11810 -1409 2207 11712 -6993 -18763
88 -18763 -1387 11294 5491 685 5183 500 -17589 -10774 18340 10128 -13149 5878 11134 -22140
102 -22140 -8065 26979 -2042 -20844 13988 7009 -20118 9245 18550 -17300 -8233 11848 -9640
115 -9640 -1622 22676 -4349 -16016 9190 -5893 -16216 22035 15897 -21848 -311 13925 -19825
128 -19825 -7181 27120 -276 -19057 9713 6444 -15443 2471 14095 -5809 -9070 3780
140 3780 3727 -111 629 943 -1318 -6326 -2624 8755 4943 -4508 273 -563 -7825 1358 7510 -581
156 -581 1421 1353 -9516 -467 9674 -5229 -2887 12072 -6556 -13435 14758 6979 -17797 4611
170 4611 13741 -15913 -5062 20439 -3970 -14623 10902 2551 -14017 7016 10959 -9041 -2189
183 -2189 5473 -6529 -596 8733 -3439 -3688 5638 -3709 -5070 8110 1719 -7604 2646 3836
197 3836 -5719 -163 6245 -1033 -4631 -68 2455 894 -1757 669 3076 -4186 -4557 7344 3347
212 3347 -8069 1676 6055 -7926 -2454 10656 -1701 -7220 5550 27 -7441 5714 5262 -6625
226 -6625 772 3329 -6869 1570 8428 -5692 -3972 7514 -3591 -6508 9421 2930 -9913 2177
240 2177 5455 -7089 -13 9159 -2750 -6552 2699 752 -2318 3462 2532 -2863 -2103 -666 379
255 379 2516 797 -824 150 -2043 -2024 2959 2351 -1227 -220 -1320 -2454 2305 2685 -1172 622 -578
272 -578 -4698 1572 5345 -2341 -1277 3932 -4139 -5137 6451 3317 -4867 1955 2066 -6946 -175 7345
288 7345 -1144 -2945 2805 -2295 -3884 4279 2665 -2658 953 18 -4299 1099 4166 -974 -557 1192
304 1192 -3291 -2063 3922 2048 -1554 -168 -751 -2254 543 2677 1201 -774 -1724 -1007 59 255
320 255 1867 2242 -1984 -3257 641 904 -64 2716 917 -3928 -1328 1913 -399 888 2947 -1840
336 -1840 -3203 1117 292 -610 3232 925 -4093 -814 1780 -846 1286 3044 -2363 -3343 1408 820
352 820 -523 2433 924 -3212 -1407 996 207 1363 1987 -1286 -2608 -553 672 1364 1722 -107
368 -107 -1887 -1438 -131 1148 1635 570 -763 -1513 -1431 508 2142 1065 -341 -1024 -2081 -800 2413
385 2413 2003 -498 -671 -1227 -1996 856 2851 507 -757 -456 -1990 -1208 2359 2167 -319 -669 -1447
402 -1447 -2024 998 2868 632 -889 -977 -1747 -515 2131 1749 -208 -860 -1496 -1409 852 2287 1111
419 1111 -641 -1724 -1666 75 1864 1781 181 -1580 -1900 -386 1136 1556 1110 -536 -2075 -1275 561
436 561 1354 1603 592 -1842 -2186 26 1362 1466 1112 -897 -2411 -797 1115 1226 1218 303 -1802 -1740
454 -1740 262 1157 1367 1056 -1043 -2236 -645 1033 1421 1251 -323 -1989 -1182 524 1119 1249 447
471 447 -1271 -1504 -266 682 1315 1095 -684 -1679 -795 265 1232 1530 -183 -1726 -927 122 643 1395
489 1395 665 -1247 -1185 -115 144 961 1340 -452 -1514 -570 26 670 1518 181 -1542 -824 142 294
507 294 1110 777 -1085 -1048 144 76 482 1110 -190 -1240 -432 115 459 1102 175 -1140 -663 -28 376
526 376 1183 430 -1143 -580 151 -251 648 1144 -600 -941 238 -247 -114 1253 143 -1299 -90 335
544 335 -123 934 409 -1577 -523 898 -88 479 1204 -1119 -1604 682 353 -287 1424 553 -1848 -682
562 -682 683 -67 577 932 -919 -955 522 291 226 451 -888 -882 734 517 190 879 -526 -1867 -204
581 -204 838 530 1283 517 -1740 -1351 58 363 1394 1145 -1152 -932 309 -743 94 1847 -510
598 -510 -1690 1012 545 -1079 1261 878 -2621 -973 1792 360 620 1555 -1660 -2654 375 720 625
615 625 2247 150 -2505 -622 53 -835 1751 2183 -1568 -1441 812 -474 -316 1637 -215 -1793 311
632 311 1091 403 579 -576 -1653 -472 159 839 2381 555 -2336 -1190 -347 -903 1893 3081 -847
649 -847 -1992 -135 -971 -409 2176 698 -1107 272 -361 -1019 1401 574 -1893 240 855 -1318 1236
666 1236 2674 -2083 -2637 1052 -185 -469 3192 1280 -2874 -1133 96 -1069 1199 2402 -305 -801
682 -801 -461 -1633 220 2001 -353 -607 973 -935 -941 1997 310 -2154 136 760 -701 995 1463
699 1463 -993 -1105 -564 -849 1173 1903 -360 -179 -66 -2458 -443 2941 159 -1299 1513 -367 -2588
716 -2588 1141 1761 -1496 14 1280 -1342 -377 1606 -509 -684 585 -1160 -322 2315 -106 -1490
732 -1490 1076 -515 -2226 1671 2013 -1661 -76 1346 -1810 -1067 1915 297 -652 685 -541 -859
748 -859 857 4 -391 1000 -594 -1230 1535 490 -1792 859 1168 -1973 -138 1971 -803 -777 1329
765 1329 -630 -1187 1145 241 -571 854 -498 -1110 1326 153 -1576 1296 990 -2175 273 1873
781 1873 -1654 -693 2254 -675 -1745 1466 445 -1379 737 507 -1042 509 402 -1050 594 596 -1221
798 -1221 537 1051 -1650 -215 1902 -886 -1185 1593 -77 -1499 968 609 -1109 467 572 -915
814 -915 171 370 -691 698 557 -1481 272 1393 -1273 -419 1755 -889 -1376 1754 314 -1649
830 -1649 929 795 -1572 99 1062 -648 299 788 -1253 -349 1011 -730 -13 1609 -878 -1302 1393
847 1393 -81 -1587 1266 1095 -1512 81 1068 -1031 -328 998 -548 -440 840 -81 -75 524 -957
864 -957 -708 1057 -77 -478 1395 100 -1667 236 497 -1049 642 1516 -696 -619 376 -730 -273
881 -273 920 -235 -116 1052 -477 -895 790 -366 -1179 1240 888 -1120 559 971 -1631 -829 1115
898 1115 -208 -45 1491 -157 -1291 85 -247 -636 981 674 -424 518 15 -1509 -48 852 -509
915 -509 231 1241 -450 -756 426 -542 -919 705 745 52 489 -207 -1011 -155 -65 -280 942 830 -484
934 -484 -5 -12 -1322 -236 1179 16 -66 967 -277 -1074 130 -167 -579 927 895 -359 98 -72 -1191
953 -1191 -136 750 -228 357 1162 -501 -1061 215 -273 -563 980 735 -526 125 226 -910 -398 397
971 397 -15 359 765 -235 -507 -61 -514 -311 655 404 75 465 -309 -1010 -106 299 10 529 466 -410
991 -410 -216 3 -531 -90 534 50 96 452 -355 -510 266 -173 -468 599 569 -258 135 18 -924 -200 729
1012 729 84 40 524 -275 -657 112 3 -188 553 343 -434 -98 89 -299 53 285 -259 -51 421 -10
1032 -10 -219 42 -201 -220 256 164 -15 207 -73 -410 -100 35 62 414 169 -445 -148 119 -165 137 362
1053 362 -232 -201 282 -132 -266 347 114 -375 86 139 -239 204 331 -413 -257 292 4 -25 315 -132 -391
1074 -391 154 129 -197 178 231 -287 -173 91 -79 88 296 -94 -300 -33 58 85 134 -61 -128 -10 -60 -6 136
1097 136 -34 -59 90 -161 -191 262 149 -229 12 25 -235 180 350 -287 -228 244 -110 -162 384 39 -330 168
1119 168 65 -418 146 462 -201 -182 193 -203 -157 412 62 -359 79 169 -207 39 208 -124 -94 116 -79
1140 -79 -102 153 123 -100 -155 -43 85 79 28 30 -129 -156 145 116 -196 46 223 -235 -162 271 -70 -178 346 -17
1164 -17 -503 199 370 -320 -18 336 -349 -185 515 -104 -408 378 142 -482 139 347 -303 6 365 -312
1184 -312 -292 406 108 -285 115 89 -240 63 235 -127 -135 144 52 -177 -46 194 44 -161 26 74 -205 45
1206 45 358 -212 -343 348 98 -401 256 303 -514 -6 515 -436 -324 686 -51 -624 430 207 -643 281
1226 281 533 -668 -180 731 -273 -463 583 5 -579 390 295 -566 98 523 -357 -291 369 -36 -225 279
1246 279 99 -310 -21 251 -14 -189 73 201 -126 -168 233 33 -324 235 301 -524 -58 627 -295 -439 605
1267 605 -35 -674 579 376 -902 152 785 -740 -342 950 -345 -706 876 61 -1053 567 697
1284 697 -932 -36 847 -597 -414 874 -195 -713 631 271 -717 166 470 -415 -83 410 -244 -274 312
1303 312 119 -248 -35 150 38 -163 7 212 -174 -209 426 15 -562 374 455 -733 -84 784 -511 -443
1323 -443 1001 -188 -1029 808 484 -1149 323 974 -981 -263 1143 -668 -801 1202 23 -1161
1339 -1161 735 523 -1116 283 867 -931 -260 1085 -400 -707 780 77 -780 413 392 -594 58
1356 58 506 -291 -312 228 120 -92 -32 78 54 -227 -30 379 -176 -362 517 111 -706 329 544 -712 49
1377 49 823 -707 -469 1108 -258 -968 948 310 -1197 592 840 -1283 -37 1319 -841 -710 1351
1394 1351 -201 -1182 895 353 -1211 545 978 -981 -272 862 -570 -480 854 -21 -561 540 102
1411 102 -672 100 305 -217 93 238 -123 -72 -51 -103 4 -121 100 544 -138 -462 331 -115 -720 559 651
1432 651 -700 228 807 -1047 -660 1092 -181 -660 1218 208 -1343 487 556 -1314 185 1360 -642
1449 -642 -328 1112 -691 -1165 949 198 -881 972 813 -1103 -193 447 -942 -173 1230 76 -411
1466 -411 448 -243 -856 56 255 36 481 331 -200 -283 -431 -259 257 107 195 700 -55 -695 -15 -293 -641
1487 -641 771 900 -437 163 420 -1217 -622 932 -137 -166 1418 -16 -1450 281 212 -1192 588
1504 588 1415 -597 -165 914 -1041 -1196 885 250 -437 1127 543 -1141 -232 126 -942 126 1261
1521 1261 153 -145 254 -707 -863 229 280 160 659 286 -372 -367 -516 -322 358 368 319 534 -213 -695 -65
1542 -65 -310 -495 826 889 -326 78 151 -1195 -464 926 -9 -25 1187 -114 -1238 151 37 -826 750
1561 750 1130 -592 -114 605 -962 -750 825 76 -249 1054 217 -1053 -58 105 -714 282 945 -58
1579 -58 -56 217 -696 -625 312 219 203 515 -27 -395 -100 -332 -245 405 261 68 332 -196 -594 85 1 -341 482
1602 482 539 -326 64 182 -794 -240 732 -53 -112 734 -193 -794 319 80 -596 542 678 -554 -92 413
1622 413 -585 -260 681 -135 -306 625 28 -626 194 102 -457 298 425 -344 18 278 -407 -177 323 -93
1642 -93 8 369 -198 -308 180 -55 -138 303 -9 -240 244 -8 -364 209 172 -315 159 221 -391 50 374
1663 374 -335 -150 442 -168 -209 417 -115 -405 413 172 -413 232 239 -445 55 368 -342 -9 493 -245 -330
1684 -330 322 -63 -243 416 73 -392 199 151 -379 92 249 -228 70 272 -304 -141 256 -166 -145 294 -42
1705 -42 -142 252 -112 -354 169 98 -168 228 106 -314 57 133 -322 38 329 -143 -40 241 -261 -188 341
1726 341 -65 -217 332 69 -309 181 61 -385 176 337 -291 12 298 -281 -153 300 -163 -185 406 18
1746 18 -330 177 67 -288 177 201 -260 71 253 -244 -120 224 -122 -62 253 -101 -176 190 -32 -187 142
1767 142 21 -129 164 43 -234 91 112 -169 81 116 -208 68 211 -243 -60 272 -128 -123 263 -111 -226
1788 -226 302 38 -331 198 176 -305 71 216 -297 8 355 -193 -197 282 -72 -211 264 19 -246 211 117
1809 117 -286 47 180 -171 40 161 -179 -49 185 -113 -93 137 -63 -36 177 -100 -137 155 -33 -130 174
1830 174 8 -162 181 30 -304 106 197 -201 37 199 -249 -60 296 -163 -181 312 0 -232 211 33 -276
1851 -276 170 182 -280 45 250 -169 -47 200 -162 -88 274 -54 -152 191 -11 -146 149 0 -167 192 72
1872 72 -211 78 85 -174 110 137 -251 39 233 -201 -79 218 -158 -123 297 -89 -268 273 55 -306 162 137
1894 137 -291 105 243 -306 -84 297 -150 -152 255 -77 -186 236 12 -244 158 97 -174 89 78 -175 91
1915 91 124 -173 29 137 -136 35 131 -183 20 246 -151 -89 247 -112 -148 321 -63 -308 300 105 -379 163
1937 163 240 -357 58 338 -347 -133 436 -157 -295 362 -12 -344 288 131 -406 140 280 -324 -21 280
1957 280 -203 -92 288 -130 -168 239 1 -155 125 -14 -111 165 -7 -151 137 5 -126 169 21 -196 207
1978 207 114 -291 127 233 -278 58 316 -349 -114 470 -171 -293 443 -29 -449 354 177 -503 234 403
1998 403 -513 -71 461 -321 -201 508 -165 -412 428 79 -456 229 206 -407 102 307 -317 -43 296 -208
2018 -208 -176 238 -59 -72 227 -100 -179 135 -37 -65 233 -40 -137 206 -94 -269 273 95 -269 236 151 -427
2040 -427 147 341 -452 -66 502 -253 -167 542 -210 -505 459 85 -524 444 410 -582 25 353 -549 -90 693
2061 693 -180 -335 447 -152 -500 361 162 -400 276 296 -406 -34 236 -291 -68 283 -121 -28 292 -152 -227
2082 -227 49 -161 -18 360 9 -111 162 -226 -309 276 66 -153 429 83 -575 113 231 -428 169 532
2102 532 -394 -118 557 -348 -470 546 -20 -465 579 298 -625 163 295 -689 -28 732 -185 -162 483 -373
2122 -373 -605 413 157 -309 419 259 -496 -58 158 -347 60 402 -147 -79 187 -182 -154 107 -166 -31
2142 -31 306 -10 -45 133 -301 -260 280 -13 -106 490 30 -532 121 67 -453 346 547 -447 -91 451 -467 -312
2164 -312 619 -81 -415 600 103 -671 304 323 -629 91 570 -378 -79 592 -364 -516 428 35 -322 447
2184 447 194 -511 41 167 -370 66 383 -143 -84 130 -244 -115 205 -80 -41 172 -118 -57 176 -186 -153
2205 -153 275 -86 -164 325 -32 -340 260 45 -445 268 357 -428 34 373 -466 -160 588 -205 -351 532 -11
2226 -11 -568 365 249 -519 216 433 -509 -74 512 -284 -243 451 -132 -357 386 55 -398 231 197 -349 80
2247 80 220 -257 0 247 -197 -93 193 -112 -80 150 -106 -79 168 -114 -106 204 -75 -131 239 -88 -269 281
2269 281 115 -321 182 182 -396 87 346 -318 -76 423 -237 -282 414 -20 -319 376 76 -503 218 339 -369
2290 -369 57 372 -358 -167 416 -140 -232 374 -8 -372 168 114 -253 161 166 -305 11 214 -139 -4 142
2311 142 -201 -92 199 -62 -42 180 -158 -217 120 -26 -21 291 -14 -312 49 -24 -183 280 220 -278 17 137
2333 137 -328 -16 365 -158 -134 315 -108 -255 340 40 -416 140 216 -211 212 286 -385 -232 200 -129 8
2354 8 479 -2 -321 39 -132 -264 331 317 -156 -7 4 -303 1 228 -91 -10 172 -105 -63 139 -151 -182
2376 -182 92 -59 -2 328 60 -261 -93 -199 -228 331 382 -75 -25 -77 -443 -88 342 62 63 251 -242 -358
2398 -358 151 49 -141 231 95 -244 144 204 -279 -110 117 -175 53 452 42 -205 -10 -254 -294 269 336
2419 336 53 114 -129 -450 -92 193 59 191 179 -224 -168 51 -122 -27 206 -43 -103 162 -7 -139 49 -100
2441 -100 -256 174 263 3 63 -40 -407 -146 221 68 139 258 -198 -354 12 -17 -21 308 127 -243 -39 43
2463 43 -155 59 153 -127 -8 187 -40 -63 78 -150 -145 137 76 37 174 -48 -294 -50 37 1 230 147 -197
2486 -197 -100 19 -138 50 224 -44 -62 97 -130 -152 161 10 -169 83 51 -146 90 104 -224 -65 155 -57
2508 -57 -4 185 -85 -159 85 -30 -92 154 92 -122 -3 19 -109 57 107 -65 -8 77 -59 -22 58 -60 13 105
2532 105 -28 -37 63 -65 -32 122 -22 -72 112 -18 -157 101 80 -118 71 77 -211 -23 191 -82 -69 135 -92
2555 -92 -154 169 31 -163 98 59 -216 41 180 -106 -23 87 -148 -111 186 82 -84 8 -74 -156 75 128 5
2578 5 27 -14 -146 -39 81 63 71 -2 -132 -47 48 45 106 19 -172 -53 100 -15 51 134 -149 -194 93 32 -34 208
2604 208 32 -312 -55 126 -45 134 205 -236 -244 134 10 -29 222 -8 -312 -16 94 -68 123 157 -223 -209
2626 -209 76 47 69 171 -75 -261 -59 67 79 127 15 -156 -131 -44 68 179 82 -95 -96 -125 -27 249 161 -130
2650 -130 -78 -59 -146 132 286 -74 -155 38 -150 -73 328 139 -211 -25 -38 -221 171 350 -116 -179 37 -163
2672 -163 -65 345 90 -226 -25 -53 -187 153 265 -88 -126 -42 -146 14 259 73 -130 -120 -123 -21 160 117 -11
2695 -11 -88 -170 -69 122 98 57 32 -187 -207 119 149 11 127 -62 -314 40 243 -33 40 146 -251 -217 238
2718 238 85 -79 192 -23 -366 44 267 -72 42 151 -273 -205 253 93 -75 134 -56 -289 37 165
2738 165 -24 67 45 -218 -151 122 78 47 49 -113 -139 18 80 89 41 -89 -89 -13 -59 80 195 -86 -169 54 -67 -67
2764 -67 284 90 -269 -5 112 -164 82 287 -160 -185 170 -60 -126 281 92 -282 40 89 -204 135 275
2785 275 -208 -168 171 -97 -97 258 26 -242 56 70 -151 68 156 -102 -114 10 -38 0 98 3 -51 -53 -71 48 84
2810 84 -58 -20 42 -124 -62 136 -26 -56 107 -73 -148 153 47 -137 98 59 -228 66 213 -212 -52 259
2832 259 -120 -201 251 14 -259 183 142 -275 33 229 -161 -56 203 -91 -102 165 -43 -132 136 20 -125
2853 -125 94 20 -163 55 92 -138 -18 84 -78 -33 81 -18 -12 10 -102 -7 63 -48 67 97 -192 -126 159 -22
2877 -22 -77 234 12 -292 70 128 -181 72 230 -183 -120 184 -57 -66 204 -72 -221 181 88 -150 159 62 -341
2900 -341 -15 250 -63 33 262 -158 -310 66 72 8 210 79 -223 -109 -27 -18 141 74 -107 13 -13 -131 71
2923 71 129 -171 -81 134 -28 46 203 -133 -275 -28 -16 85 327 44 -260 -76 -128 -205 282 361 -137 -70 51
2946 51 -313 -117 381 87 -186 133 3 -193 136 121 -227 -53 94 -38 165 232 -169 -209 -56 -166 98
2967 98 452 135 -199 -129 -231 -208 232 329 27 -22 -126 -259 -34 116 28 101 45 -179 14 166 -129 -130 73
2990 73 -154 -66 388 176 -236 -111 -157 -290 167 398 76 -10 -93 -424 -175 257 143 123 204 -205 -331 102
3012 102 92 -118 148 119 -206 40 210 -123 -118 12 -142 -30 283 166 -4 -52 -293 -229 181 221 122 177 -132
3035 -132 -405 -70 121 5 188 175 -194 -162 38 -61 6 143 -80 -94 148 13 -77 86 -132 -260 149 209
3057 209 -50 100 57 -355 -200 191 69 77 243 -82 -307 -10 38 -7 200 71 -163 15 44 -117 69 106
3079 106 -129 -23 153 -42 -18 136 -106 -168 95 77 21 128 -33 -192 -25 22 -25 149 69 -167 -24 42 -151
3102 -151 28 188 -103 -116 116 -53 -123 149 2 -175 76 75 -120 50 66 -169 -12 125 -115 -21 141 -110
3124 -110 -114 132 -11 -102 133 33 -191 38 113 -58 28 85 -99 -53 84 -35 -23 74 -45 -18 87 -40 -41 93
3148 93 -47 -87 114 58 -69 58 -12 -162 31 112 -42 11 58 -168 -61 116 -51 -17 158 -81 -161 115 11
3171 11 -141 100 55 -209 10 162 -95 -59 88 -133 -98 165 51 -54 66 -77 -158 40 97 -7 90 18 -202
3194 -202 -41 84 -1 44 84 -96 -87 68 23 -11 72 -40 -65 51 22 9 100 -45 -154 19 61 -19 121 62 -205
3219 -205 -91 99 -19 28 163 -72 -163 35 -9 -58 141 51 -178 -35 37 -78 64 110 -146 -112 83 -16 -24 134
3243 134 -17 -164 22 39 -35 86 68 -113 -66 20 -16 92 99 -91 -69 18 -48 41 142 -45 -81 34 -24 -28 134
3268 134 67 -89 -4 -27 -66 95 108 -83 -40 26 -102 11 148 -42 -97 42 -49 -96 117 69 -99 -8 4 -97
3292 -97 42 127 -58 -56 18 -91 -14 122 -7 -60 30 -45 -95 73 56 -49 31 9 -100 24 89 -43 2 17 -76 11
3318 11 120 -33 -28 72 -64 -55 119 39 -56 78 7 -136 38 99 -34 30 50 -112 -36 95 -17 -36 70 -39
3342 -39 -90 59 2 -70 71 39 -123 3 64 -57 -4 55 -75 -60 52 -19 -20 39 -31 -43 22 -29 -31 78 -2 -80 15
3369 15 3 -53 58 56 -79 2 58 -51 1 87 -29 -33 63 -45 -67 100 31 -86 46 34 -97 54 107 -90 -33 72
3395 72 -68 -40 100 -13 -82 60 -8 -89 55 61 -51 5 21 -71 21 77 -51 -26 31 -46 -28 41 -30 -26 19 -46 -50 38
3423 38 1 -19 47 -33 -75 56 37 -60 40 23 -94 -2 87 -54 -4 95 -59 -67 95 -3 -61 96 16 -118 43 81
3449 81 -71 24 83 -85 -58 105 -21 -40 80 -7 -100 36 31 -58 47 33 -80 -11 54 -21 -10 40 -59 -36 34 -27 -9
3476 -9 52 -29 -44 20 -38 -6 69 -20 -63 32 -22 -50 91 42 -85 22 52 -81 0 100 -65 -55 84 -32 -56 112
3502 112 17 -109 36 27 -70 79 89 -108 -24 77 -76 -34 124 -7 -82 49 -7 -87 49 56 -49 -4 29 -29 0
3527 0 20 -49 -7 -5 -29 27 50 -48 -33 14 -64 -40 71 10 -43 21 -63 -78 59 39 -49 54 14 -103 30 55 -115 -12
3555 -12 110 -71 -62 139 -26 -118 61 17 -105 76 114 -74 -27 32 -84 -13 101 -3 -4 54 -63 -75 61 16 -41
3580 -41 69 23 -87 -1 33 -55 -30 26 -18 11 19 -52 -24 -30 -82 13 69 -48 -7 42 -113 -100 88 16 -59 74 13 -129
3608 -129 -16 55 -81 5 86 -39 -29 64 -62 -74 89 -25 -80 94 46 -88 32 42 -128 2 136 -15 -38
3631 -38 60 -24 -81 38 24 -8 57 4 -46 2 -34 -26 59 -3 -55 46 28 -76 4 22 -72 -11 64 -24 -27 26 -44 -46 36 -31
3661 -31 -8 90 -29 -115 50 24 -97 56 94 -98 -23 101 -57 -79 92 11 -69 59 19 -56 29 16 -51 30 37 -46
3687 -46 23 27 -66 -1 79 -30 -36 64 -16 -62 38 -2 -49 24 17 -47 32 -8 -36 49 -7 -86 25 49 -88 -6 66 -87 -58
3716 -58 84 -30 -78 56 12 -90 35 25 -57 20 24 -78 -2 58 -31 10 67 -74 -42 100 -24 -69 68 28 -58 40
3742 40 45 -37 22 40 -38 -3 44 -13 19 18 -67 4 61 -25 -26 71 -37 -64 80 16 -73 61 44 -79 -5 52 -43 25 38 -77
3772 -77 -30 62 -40 -24 66 -52 -80 54 -5 -74 54 44 -88 -17 43 -58 -18 45 -52 -42 38 -3 -14 11 -47 -48 41 -3
3800 -3 -27 83 -4 -85 15 16 -48 55 94 -45 -36 13 -54 -10 68 -24 -13 62 -35 -64 50 -8 -50 63 37 -78 41 64
3828 64 -98 -61 47 -22 -1 91 -15 -85 -15 -35 -62 69 36 -20 2 -37 -104 -1 61 -14 25 41 -71 -55 30 -31 -48
3855 -48 35 7 -11 41 -7 -51 3 -26 -44 77 77 -11 26 -15 -132 -7 114 18 26 62 -63 -113 13 7 -6 100 32 -86
3883 -86 -4 9 -52 25 35 -68 -13 81 -23 -42 18 -76 -87 56 49 -11 32 -21 -131 -55 21 29 76 45 -90 -81 -26 -25 34 72
3913 72 -14 -46 9 -38 -44 46 8 -48 12 23 4 53 16 -97 -37 35 6 78 81 -63 -82 11 -37 8 139 40 -72 -22 -33
3942 -33 -41 92 92 -38 -23 5 -40 22 61 -47 -49 28 -15 -35 77 8 -85 -22 3 -22 67 84 -46 -88 -33 -30 30 78 1 -50
3972 -50 -28 -47 -10 62 11 -20 -7 -36 -42 72 64 -23 -20 -4 -44 55 74 -21 -27 11 -52 6 92 2 -36 16 -48 -64 83 74 -47
4003 -47 0 9 -75 23 106 -14 -41 2 -37 -38 58 27 -42 8 -22 -63 35 47 -20 -16 -15 -59 5 62 -7 -24 -18 -29 6 43 6 -16
4035 -16 -17 -53 -15 61 22 0 33 -29 -64 33 58 -10 11 21 -51 0 71 -7 -32 29 -17 -36 66 23 -42 31 4 -65 36 98
4065 98 -26 -21 22 -57 -25 86 21 -61 8 -14 -30 31 24 -24 -11 9 -38 5 38 -5 -8 -22 -47 15 47 -7 -43 -27 -41 -14 45
4096 45 16 -21 4 -26 -46 45 36 -17 20 -6 -80 21 99 -21 -31 32 -40 -19 98 34 -50 7 0 -58 46 70 -23 -11 21
4125 21 -54 -13 89 13 -45 -8 -28 -35 50 65 -34 -23 -18 -37 24 42 -2 -27 -20 -42 7 51 23 6 -27 -74 -19 70 20 -18 1
4156 1 -71 -57 59 31 -14 31 -9 -80 2 79 1 1 29 -59 -31 81 43 -25 24 -23 -59 44 68 -14 4 24 -55 -8 75 27
4186 27 1 23 -42 -52 43 59 -5 -9 -35 -47 18 36 -2 6 -13 -45 -9 23 6 34 -5 -66 -32 10 -9 8 27 -61 -51 29 4
4217 4 -20 31 -6 -73 11 39 -16 29 51 -60 -32 50 -2 5 58 -10 -58 36 48 -21 36 37 -35 -8 48 -3 0 40 -7 -25 4 9
4249 9 12 33 -10 -36 23 9 1 24 -11 -31 17 7 -27 19 21 -19 -8 8 -42 -3 36 -31 -29 28 -19 -42 36 3 -33 27 20 -65 -5
4282 -5 49 -21 2 30 -30 -28 52 19 -10 40 6 -46 24 24 -18 23 41 -29 -11 37 8 23 24 -27 -28 28 13 8 32 -13 -24 9 -10
4315 -10 2 45 -10 -45 -9 -8 -26 46 51 -60 -43 18 -16 -3 50 -24 -44 13 -2 -16 34 22 -57 -12 3 -26 42 58 -36 -46 20
4346 20 -3 13 59 13 -60 -3 1 -10 41 37 0 -21 -2 5 52 53 -3 -18 3 8 31 46 -26 -46 0 -11 13 66 5 -42 -33 -29 -22 53
4380 53 68 -27 -18 -21 -56 22 55 -34 -49 23 -25 -40 36 -3 -67 -7 3 -36 21 49 -53 -63 -23 -13 31 75 11 -65 -34 -29 -8
4411 -8 48 56 -19 -10 -13 -29 10 34 0 9 16 -6 31 57 -16 -27 -15 -11 67 82 -4 -55 -20 -34 0 83 54 -9 -10 -20 -62 8 73 0
4445 0 -11 2 -49 -22 44 -21 -53 5 24 -4 45 25 -57 -54 -7 -15 36 92 6 -54 -36 -42 -8 84 67 -11 -31 -22 -29 9 17 2 12 19
4479 19 -1 22 23 -22 -20 -1 -3 43 79 4 -52 -39 -59 11 105 44 -14 -20 -41 -64 28 60 -7 7 2 -52 -22 54 6 -41 2 -7 -15 38
4513 38 28 -70 -52 -22 -21 41 61 -15 -55 -42 -54 -9 70 46 -17 -40 -54 -23 27 43 -8 -19 -23 -16 26 28 -1 0 -23 -19 20 49 24
4546 24 2 -25 -53 -10 77 59 -3 -17 -45 -36 24 56 -1 9 4 -58 -21 54 32 0 -7 -48 -45 43 38 -47 -27 -32 -40 24 44 -2 -31 -19
4580 -19 -37 -9 30 22 -6 -19 -37 -26 44 47 1 -19 -40 -46 21 40 15 3 -17 -18 4 41 21 29 14 -25 -25 36 28 -5 10 -24 -35 38
4614 38 38 -17 -2 -14 -27 -2 53 0 5 7 -43 -56 29 18 6 8 -26 -67 2 40 -9 -16 4 -26 -6 13 -15 -21 -7 -22 -16 10 10 0
4648 0 3 -29 -35 10 29 7 13 -16 -49 -1 22 7 18 21 -8 -15 24 -5 14 35 7 -17 19 20 -11 6 -2 -45 17 36 -10 -15 12 -20 -36
4683 -36 28 -5 -10 17 -5 -42 -11 5 -3 -1 -3 -51 -14 20 -21 -10 -2 -26 -4 16 -12 -10 14 -11 -16 2 -9 -5 7 -9 -25 1 9 -8 13
4718 13 7 -21 -2 23 -13 -6 30 13 3 19 11 -18 24 10 -18 14 18 -14 4 11 -32 1 31 -8 -23 8 21 -15 17 -7 -33 21 21
4751 21 -28 -5 3 -15 0 5 -29 -9 12 -14 -23 4 -5 -5 10 -16 -32 8 2 0 4 5 -14 12 13 -17 2 31 -13 -5 19 -3 8 28 0 -23
4787 -23 21 9 -7 16 11 -25 -4 21 -5 -1 16 -16 -24 4 -3 7 20 -6 -32 2 17 -9 6 -7 -44 -17 2 -19 -2 4 -21 -7 11
4820 11 -20 -10 21 -21 -37 -7 -1 10 14 -14 -46 -3 16 -2 17 11 -13 -19 6 -11 12 35 0 -11 -1 2 3 28 1 -31 -4 14 -3
4853 -3 12 9 -24 -20 7 6 20 36 -13 -21 5 -2 -3 34 -1 -49 -25 -9 -4 17 -3 -42 -29 7 -17 -4 15 -18 -30 -13 -25 2 30 1
4887 1 -36 -29 -9 -3 37 2 -44 -21 -8 -8 8 22 -17 -11 -4 -17 6 37 5 -37 -8 0 -10 39 17 -39 -17 6 -5 17 30 -19 -29 2
4921 2 -1 0 41 6 -25 -14 -21 -11 30 9 -34 -28 -22 -7 15 16 -18 -14 -4 -10 5 25 3 -16 -5 -5 -9 27 15 -38 -15 -22 -24 19 22 -13 -2
4958 -2 2 -9 7 34 17 -18 4 -15 -14 37 28 -19 -20 0 2 40 37 -14 -18 -7 -5 1 38 3 -21 -2 -18 -7 31 14 -24 -21 -26 -23 20 18 -17
4995 -17 -26 -21 -27 -3 17 -12 -24 -13 -32 -23 10 2 -26 -3 -24 -36 14 18 -11 -16 -10 -24 13 27 -2 -12 17 -18 -10 41 19 -11 16 -6 -31
5030 -31 16 35 1 -7 -4 -25 1 25 -5 -8 -3 -7 -13 20 0 -8 -1 -31 -8 8 19 0 -6 -27 -40 -19 19 -9 -8 -3 -27 -22 4 3 -12 5 -5
5067 -5 -32 7 8 -20 -3 -20 -32 -4 28 -4 -10 -13 -24 1 28 2 1 19 -12 -17 -2 5 5 15 0 -18 -5 20 -13 -17 11 -12 6 31 2
5102 2 -19 -5 -1 -15 7 9 -2 1 -9 -28 -18 9 -3 -6 -8 -28 -11 2 -9 -17 2 -13 -13 -2 -14 -27 -5 -8 -22 -8 10 -15 -8 -3 -32 -7
5138 -7 26 6 -7 10 -7 -6 22 12 -3 17 4 -8 -3 10 -7 30 5 -15 -1 14 8 -5 10 0 -5 13 8 -12 13 6 -23 -7 -5 -6 7
5173 7 -2 -26 -20 12 5 -19 -3 -16 -19 -1 -8 -23 11 -1 -21 -22 -17 -19 -6 8 -21 -12 9 -10 1 11 -17 -14 23 11 -17 -1 9 -4 9 13
5209 13 1 12 13 -12 -10 6 10 -4 25 8 1 19 9 -5 12 4 -18 1 0 -14 8 20 -5 -9 7 -10 -4 14 -3 -16 -1 -3 -11 1 -5 -12
5245 -12 -8 -8 -21 -3 6 -14 -20 -2 -17 4 28 -5 -23 3 5 -9 17 -5 -4 8 -2 -5 -10 12 7 7 22 -7 2 22 -2 -14 9 15 -2 18
5281 18 14 -6 13 13 -17 0 20 0 -9 -7 -24 -17 15 10 -18 -14 -22 -21 10 3 -12 17 9 -19 -20 -13 -9 2 -3 -17 -23 0 -1 -12 -8 -22 -7 13 2
5320 2 -3 11 -7 -15 1 5 -1 21 27 -23 -19 4 -1 7 26 8 -13 17 5 -14 17 10 -9 11 19 -10 -16 18 -22 -22 8 9 -1 8 -9 -50 -8 3
5358 3 -9 -9 -1 -25 -11 -21 -20 -5 14 0 -21 -26 -30 -17 -8 -23 -14 4 -8 -14 -9 -17 -26 3 1 -11 24 24 -16 0 -5 -13 9 30 -3 -20 5 5 -14
5397 -14 25 21 -5 17 22 -25 -3 17 1 2 14 -7 -2 16 3 -34 -12 3 -8 4 5 0 -20 -6 -9 1 -3 6 5 -14 -23 -1 5 -10 -6 0 -18
5434 -18 -3 10 -14 -21 12 -10 -14 18 6 -17 14 11 -25 -3 30 -6 -6 13 -3 -10 31 13 -19 21 32 -9 7 20 -13 8 16 8 -3 18
5468 18 24 -17 5 7 -15 -3 -6 -13 -13 -4 -1 3 -11 -21 -4 -8 -11 -3 0 -13 1 0 -30 -13 15 -13 -7 -3 -24 -22 5 -4 -34 -3 10 -29 0 2 -13
5507 -13 -11 27 -17 -12 32 17 -18 -1 4 -17 20 25 -22 -18 28 -4 4 12 12 -1 17 10 2 0 6 4 -1 -14 -1 5 -3 -9 -1 -4 12 21 11 -13 -2 -4 -17
5548 -17 8 16 -8 -2 7 -39 -26 29 -2 -27 13 8 -25 12 9 -15 9 19 -4 0 23 5 -14 9 -3 -21 16 21 -6 -3 -4 11 24 11 7
5583 7 4 2 3 -1 -5 1 5 8 -13 -14 5 21 1 -7 -25 -10 4 -2 -9 -2 -5 -7 12 12 -19 -10 4 -13 -25 4 -14 -10 12 -11 -36 12 20 -16 -10 7 -10
5624 -10 -12 9 -14 -19 15 -10 -25 7 -4 -2 3 14 -16 2 11 10 13 6 6 7 5 1 2 4 4 -3 3 -15 10 11 -12 -6 -1 -7 13 9 -4 -22 8 2 -19 8
5666 8 10 -25 -3 0 -15 -11 2 -8 -32 -4 -6 -16 -2 2 -25 -11 8 -11 -19 8 -18 -14 6 -21 -22 -4 10 -16 3 14 -3 15 -5 6 2
5701 2 11 0 7 -5 8 17 -10 -5 2 4 10 -1 -10 -11 -7 24 -6 -14 21 0 1 11 -1 -21 -4 5 -20 -10 -1 -14 -19 1 -10 -18 6 -5 -28 -13 -3
5740 -3 -15 -2 -10 -12 1 18 -1 -21 7 -6 -6 -1 -8 -19 -3 -1 -2 -8 -7 5 9 -3 1 12 24 11 0 -2 -4 9 1 -9 -14 3 -9 8 4 -9 -14
5779 -14 11 -3 -21 -11 3 -12 -9 -12 -27 -14 3 -12 -20 -7 -7 -13 -14 -10 -22 3 13 -23 -22 12 -1 3 2 -4 -19 9 2 -11 6 9 11 10 4 -5 2
5818 2 13 18 7 7 11 16 -3 -2 0 13 9 13 -3 3 1 3 -4 -15 5 3 -5 14 -13 -16 8 5 1 -13 2 -15 -8 0 -13 -3 4 0 -26 -6 -2 -16 5 -9
5860 -9 -3 -2 0 -7 -19 0 3 -7 -5 -3 -14 6 -5 -10 -5 4 5 -4 1 -11 4 11 5 9 -2 9 6 5 7 6 8 6 0 2 1 -5 5 -4 -6 0 12 -13 -1 -6 -9 5
5906 5 5 -11 -27 0 -13 -8 0 -4 -12 -3 -2 -21 6 6 -13 -16 -7 3 0 17 -18 -17 -4 10 4 5 10 -4 -9 0 -7 -3 19 8 11 5 0 9 7 13 0 15 12 22
5950 22 15 0 -16 1 9 -4 9 15 8 3 2 -7 -8 23 15 3 -5 -14 -4 10 9 -18 13 13 -3 1 -3 -9 1 16 -7 6 18 -9 -15 -6 -1 -19 -1 7
5990 7 -19 2 -2 -11 3 11 9 1 12 10 4 7 10 3 10 -1 -4 15 6 1 10 17 2 7 0 -12 5 2 3 3 8 13 1 12 -11 -13 -8 2 -7 -12 -3 -13 3 6 -26
6035 -26 -3 6 -5 -10 -16 -8 -3 6 4 -5 -3 6 -12 -5 -3 -9 10 -3 -11 -5 9 0 9 17 1 6 24 11 10 6 12 0 12 11 -9 14 9 -3 -3 8 3 8 2 4 -4
6080 -4 2 20 -9 4 0 0 -7 0 -3 -4 14 -12 2 -5 -2 -12 1 -1 -2 10 1 -13 -15 3 -6 -6 -1 -7 14 9 -9 -6 0 -14 -1 15 -7 -2 -3 4 6 14 6 3
6124 3 15 14 -4 5 23 11 13 5 -6 14 15 9 9 12 8 -1 18 4 6 4 0 6 8 12 0 3 -11 -12 5 0 3 -12 3 -6 -7 7 0 -1 6 0 0 12 -1 0 1
6169 1 -13 -7 9 22 9 5 -7 -3 12 25 7 9 12 11 -4 6 18 13 13 -4 -6 14 7 24 13 9 -2 13 26 13 12 10 9 -1 2 9 7 18 -2
6208 -2 -12 -10 -3 -4 0 -3 -15 -7 10 7 8 3 5 -5 -6 -6 -5 18 7 -7 -1 -3 0 15 -3 -8 -9 6 12 9 23 -1 -4 11 8 8 4 18 5 -2 8 7 10 13 10
6253 10 -2 7 7 7 15 5 4 14 17 7 13 9 7 4 -4 6 1 2 -1 -9 -7 8 3 0 -17 9 10 3 9 12 3 4 14 -6 -18 12 1 4 2 3 -2 5 4 -3 7 8
6299 8 4 5 8 12 15 14 8 -9 8 5 7 7 6 3 14 27 28 17 8 9 15 3 12 26 19 11 7 13 9 8 12 -3 -7 5 -1 -3 7 -2 -16 7 8 -3 -2 14 20 1
6345 1 4 -10 9 27 11 -6 11 -4 -5 -7 -6 3 -1 10 -3 8 8 9 21 4 9 -1 8 16 0 10 7 4 4 6 8 15 16 10 -1 -8 7 15 11 -1 -9 12
6387 12 -6 -9 1 1 -9 0 -10 -8 3 7 -12 0 2 -5 8 20 -9 -8 4 -4 -7 -9 -17 -15 -4 -1 -8 -1 8 16 -2 -9 -1 1 21 -2 3 3 9 -4 2 4 8 11
6431 11 0 2 10 6 18 3 7 2 14 12 9 -1 7 7 8 5 13 6 0 -12 -7 12 3 -2 5 -6 -5 6 12 8 -9 -6 1 -3 -3 2 -6 -1 -2 -10 -13 6 5 3 0 -7 -5 7
6479 7 3 5 -11 -1 -3 -5 1 16 6 12 -6 -1 5 14 15 2 -8 -3 9 9 6 10 2 -5 21 3 4 0 4 -7 -13 -3 -3 20 0 -12 -11 12 1 2 -1 -11 -6
6522 -6 -1 6 0 -9 -2 -2 -9 4 -4 20 9 -10 -9 -6 4 9 4 0 -9 -4 9 10 10 14 7 -2 9 0 -2 10 11 1 5 4 12 17 10 1 -10 10 6 6 19 0 2 -6 -4 9
6570 9 -2 -4 -4 -5 0 -5 5 -2 -10 -11 -4 6 -5 6 -18 -2 -12 -24 -23 -4 -8 -7 -16 -11 -9 -1 -4 -13 -9 -3 -6 -4 7 6 9 -5 -4 -17 1 5 5 1 -7 -7 12 8
6616 8 -2 3 11 2 13 15 11 8 10 5 -1 6 2 6 4 14 -4 7 -7 -3 0 0 7 11 3 -11 -9 -6 0 2 1 -5 -5 6 -6 0 -5 -1 -6 -9 -9 0 18 6 -2 10 9 -2
6664 -2 4 13 2 6 2 6 -1 5 8 -3 -1 3 6 17 0 0 10 28 20 15 2 1 10 -3 1 6 12 -7 -7 -1 -3 9 8 -1 -1 -8 0 4 9 -11 -20 -13 -16 1 -20 -4 -10
6711 -10 -6 -3 -8 -11 -1 -8 -17 2 -2 3 1 9 -4 -3 10 5 7 -2 -4 -1 6 -9 11 14 4 9 16 3 4 24 8 9 -2 6 1 10 12 -1 0 0 3 0 5 18 10 13 -2
6758 -2 2 21 3 15 -3 -7 -8 10 2 -10 -3 -11 -2 7 -12 0 -2 -6 -13 -6 7 1 -5 -5 6 -2 7 16 -6 -2 6 2 -7 6 -4 10 4 4 -4 -6 8 19 -2 -1
6802 -1 7 6 14 6 2 0 -12 2 10 -1 1 6 0 -14 2 10 1 10 -1 -1 -2 -11 -2 -18 -14 -14 3 -5 -9 3 -5 -9 -8 4 -10 2 10 -14 0 5 8 4 8 1 -3 7
6848 7 -4 -7 14 7 15 -2 8 13 0 1 11 -1 1 5 13 14 1 -2 9 -6 -1 12 -1 0 17 8 -2 0 5 5 -3 7 3 -4 4 11 -8 -2 -13 -6 6 -24
6890 -24 -11 1 2 -6 -12 -1 -7 4 -11 -9 -3 -1 -18 -17 5 3 -3 -3 -10 -1 -10 9 -5 -5 4 2 0 -1 5 9 9 11 10 6 6 12 3 2 -6 -7 14 8 -2 0 2 3 -7 13
6938 13 -1 1 6 -12 -6 -10 1 5 -2 5 2 5 -3 -3 -13 3 1 -4 -4 -5 0 6 -4 3 -1 -10 10 4 -7 8 5 -2 -8 4 -1 -3 2 1 -3 -3 12 8 14 -4 14 9 4
6985 4 8 -1 12 7 9 -3 0 3 4 -2 0 10 6 -3 -5 -11 -9 12 -5 -7 0 2 -2 9 -8 -7 -6 -2 -16 -3 0 -7 -7 5 -3 -4 -5 1 -14 0 -6 -1 -10 -1 6 -7 5
7032 5 6 -4 4 5 13 7 3 0 8 6 0 -2 1 7 5 15 -1 7 4 2 9 1 2 -4 -3 10 1 10 5 3 -5 1 -9 0 -4 6 -10 -1 -8 -6 -3 -6 -6 -7 -13 -18 4 -12 -6 5 -13
7083 -13 -6 -1 2 -8 -2 -8 -3 12 6 -1 1 -2 3 6 4 -6 0 9 -8 -5 -9 8 -5 2 4 -2 4 3 -4 1 3 5 9 11 -2 2 11 -2 -7 -6 4 -6 11 0 -7 5 0
7130 0 -20 5 -6 0 2 -14 -9 -20 -2 -8 -2 -1 1 0 -4 -4 -12 6 2 -3 -2 -3 3 0 11 8 -4 9 9 -7 -8 16 2 0 9 6 3 -4 -8 -2 3 6 6 4 8 -8 5
7177 5 -12 -5 -6 1 -1 8 -6 -10 -8 0 -12 -5 -6 -2 -15 2 -7 -17 -14 -12 -11 -6 -15 -15 -15 1 -6 -18 -14 -13 -5 -10 -9 -9 -6 -10 5 3 2 -3 2 0 6 6 2 12 6 3 -1 7 7
7228 7 -8 -15 8 -7 3 3 8 6 -5 2 -7 12 2 4 0 -3 1 -5 0 -17 -12 -12 -2 -13 1 -20 0 5 2 -18 -11 -1 -3 5 -3 -8 -3 -5 2 -1 -10 -3 -5 -3 0 -5
7274 -5 -6 -13 -1 1 0 1 8 12 -1 -2 16 -5 -6 -1 -4 4 8 1 8 3 2 3 9 -5 0 -3 -11 -4 -5 0 -10 -16 -4 -5 -16 -9 -11 -8 -2 -5 -6 -10 1 -1 6 -2 -4 -10 -1 -6 -12 4
7326 4 -6 -14 1 -1 -4 3 2 -1 8 -4 -2 14 6 -4 -2 9 10 9 2 18 16 -3 7 9 12 12 -4 8 7 3 1 13 3 -3 -5 9 19 -3 -5 -10 -1 8 -3 0
7370 0 2 -18 -4 -2 -7 1 7 -4 -22 -7 -2 4 -8 -9 -13 -3 -13 -13 8 1 -2 -10 -5 3 1 6 5 3 -1 -6 8 3 6 10 3 -8 10 7 7 -1 -3 4 10 2 2 11 3 5 -2
7419 -2 -3 -4 4 0 -4 3 5 7 4 4 5 -14 0 12 -6 0 9 -4 -2 1 4 -3 -1 -3 -13 4 2 5 -9 -4 -3 1 7 -3 7 -3 3 7 1 -11 7 8 12 9 7 10 -1
7466 -1 2 -3 7 5 0 -2 -1 8 12 2 15 -4 10 4 6 -7 -1 4 3 6 -10 -8 -9 -2 3 -14 -2 -10 3 -8 -3 -4 -10 -5 -7 -2 -3 13 -9 0 -8 2 -6 1 -4 -12 -14
7513 -14 -6 4 -3 0 -3 -1 -11 17 14 3 2 -7 0 2 6 -7 -12 9 1 -4 -1 7 4 13 10 7 19 14 6 -2 -3 -2 1 -3 0 -1 9 -5 -2 8 -7 9 3 0 -2 0 14
7560 14 5 4 -7 -10 -5 -5 5 5 3 -2 -8 9 -4 4 -3 -7 -10 6 6 9 6 -1 -2 0 -1 -5 0 -6 2 -6 4 -6 -5 6 8 -12 6 11 8 13 -2 -2 0 2 -2 7 9 -3
7608 -3 1 -10 7 4 1 2 -7 -2 -7 -7 9 0 -5 1 5 3 -4 7 -8 4 0 0 6 12 4 -1 7 -1 -3 -2 0 -4 3 8 9 6 15 6 4 -5 7 2 -5 8 -1 5 3 1 3 4 -1 7 1
7661 1 -4 6 -1 1 -2 0 13 7 -3 -12 -9 -4 -11 -4 -6 -8 -7 13 -12 -5 4 -8 -5 1 -8 -5 3 -6 -12 -8 -12 -2 1 -12 -4 0 -4 -3 3 5 4 10 5 1 2 3 3 3 11 7 4 11 1
7714 1 11 7 3 18 6 4 8 -2 3 -1 11 -3 -1 3 1 -3 7 11 5 7 8 15 0 10 13 5 -8 2 3 -2 7 -3 -8 5 -3 -3 -11 6 -5 -4 -1 2 0 -1 -5 0
7760 0 13 9 1 5 8 1 -2 -1 3 9 -1 -1 0 -1 0 0 -3 -3 6 16 4 -4 3 -8 -6 11 -7 -10 5 0 2 -3 -9 -3 2 -9 -5 -7 -1 -4 -6 -6 -16 -8 3 -9 -14 -11 -5
7809 -5 -6 1 3 -9 -9 -6 -2 -11 -3 -1 -11 1 3 4 -3 -8 -9 0 -2 -7 1 3 12 5 6 4 1 6 13 13 -4 -6 -1 -10 6 2 2 -3 -8 6 -9 -8 -6 -13 8 7 15 -1 7 1 -3 -3
7861 -3 0 6 -7 -4 1 -1 8 6 -11 -5 -5 -11 -18 -14 2 -12 -5 -7 0 4 0 0 -1 5 -9 1 -5 -2 -5 2 5 7 11 0 6 3 7 -4 11 2 1 0 -7 -16 6 1 -5 5 -5
7910 -5 -6 13 6 -4 3 -2 -1 -5 3 -1 -2 8 3 6 9 1 -6 -11 -3 -6 -2 -9 -13 -9 -4 -14 -11 -2 -3 19 -3 7 7 5 5 3 1 9 -3 4 5 3 9 5 3 10 -2 5 9 2 -2 4
7962 4 3 4 2 -2 8 -12 -2 9 2 -4 -3 -3 -14 1 5 -4 4 10 -9 -4 0 -10 -11 -6 -8 -4 -10 5 -15 -4 3 -5 -12 -6 5 -4 6 -1 -2 -2 9 1 -2 1 -14 6
8008 6 -6 4 -1 3 0 18 -3 -9 19 6 -7 8 4 7 11 8 5 -3 -7 -3 2 1 -6 -9 3 6 -2 8 4 3 -4 9 -2 0 0 -5 -10 -2 -5 -2 -1 -7 -12 -17 -1 -6 0 13
8056 13 -2 7 -1 4 -10 5 -6 -4 0 0 1 1 -2 -13 -1 8 -10 8 -8 1 -7 9 -2 -3 2 4 -5 1 -8 0 -2 1 -5 0 11 -1 2 -1 9 -2 -4 -2 -3 -4 4
8101 4 4 -4 2 0 3 -3 -4 6 -5 8 -5 -2 -5 -1 4 -1 5 1 3 -4 -5 -7 -15 -1 4 -11 1 3 0 18 0 5 0 10 11 0 5 14 12 11 4 -3 6 9 19 16 3 12
8149 12 14 -6 0 2 -1 13 6 5 0 5 7 -1 -8 0 -1 -5 -3 1 -4 -6 -9 -2 -2 10 -16 -3 -14 -6 4 1 2 -6 4 -1 7 -1 -3 11 -3 6 -3 3
8191C
$$ Imaginary data points
##PAGE= N=2
##DATA TABLE= (X++(I..I)), XYDATA
0 0 0 0 0 0 0 0 0 0 0 0 0 0 -8 8 -8 8 -8 8 -16 16 -16 24 -24 26 -32 40 -41 48 -56 62 -70 78 -89 97 -110
35 -110 121 -135 151 -167 184 -204 227 -250 279 -306 340 -379 423 -472 529 -595 676 -774 898
54 898 -1058 1274 -1582 2070 -2938 4965 -18833 4463 34626 -20929 2505 29646 -18537 -29983
68 -29983 20208 7599 -12846 12152 7775 -18434 1102 9884 -5778 2329 5405 -14711 -2668
81 -2668 16234 1427 -4944 6132 -6749 -16570 3521 16870 5139 -4457 -1665 -2113 -12442 -5735
95 -5735 19437 12749 -15682 -3292 11689 -15012 -10329 26150 3799 -25063 8372 14704 -18023
108 -18023 1401 20311 -14953 -14584 15985 -246 -6518 17931 -1958 -22152 6445 5739 -12753
121 -12753 15881 17829 -23751 -9792 18042 -10421 -10339 25721 3806 -24441 5022 12622 -13436
134 -13436 -1314 15545 -4860 -11754 5352 6365 -1750 -1316 -308 -1644 -3479 -324 8419 4531
148 4531 -7256 -3238 1595 -4471 1490 9035 -847 -3644 828 -6201 -1438 10679 -1837 -6863
162 -6863 8965 -1754 -13736 11056 11101 -17143 -1534 16603 -10719 -9703 19406 379 -18756
175 -18756 7785 8832 -13074 3046 13358 -8989 -7028 7675 -2651 -3012 8659 -1584 -6874
188 -6874 4832 -118 -5740 6512 3675 -8437 512 5935 -4452 -1768 6319 -809 -5631 637
202 637 3482 692 -1826 -441 2218 -2294 -3966 5977 4446 -8091 -1235 7343 -4934 -4364 9993
217 9993 400 -9677 3736 3771 -6882 3319 6925 -6819 -2566 5342 -4144 -911 8403 -3847
231 -3847 -6850 6946 281 -7373 7020 5001 -10407 -492 8110 -4810 -2576 8660 -1811 -8458
245 -8458 2934 3788 -2420 1870 2433 -3769 -2498 1169 1331 2034 434 -2031 -584 -679 -1122 2859 2508
262 2508 -2351 -1534 -113 -1248 2106 3031 -1946 -1382 256 -2870 1172 5632 -1874 -3758 3021 -1588
278 -1588 -4741 5834 4737 -6016 -964 3438 -4804 -984 7846 -474 -5565 1947 120 -3541 3827
293 3827 3643 -3789 -1048 1261 -2906 779 4747 -1102 -2678 970 -1632 -1627 4094 2290 -2950 -1328
309 -1328 177 -1142 978 2796 325 -1911 -1750 -321 1102 995 1066 972 -2195 -3126 1359 2452 -152
326 -152 995 393 -3769 -1334 3238 732 -404 1768 -1669 -3475 1564 2056 -751 1635 704 -4120
342 -4120 -1042 3225 165 -141 2028 -2150 -3550 2021 2371 -836 946 578 -3263 -1307 2344 1056
358 1056 377 922 -1669 -2631 402 1905 1247 673 -926 -2154 -804 1010 1573 1144 -332 -1496 -1270
375 -1270 -342 1232 2115 358 -1513 -1319 -981 230 2604 1649 -1611 -1648 -570 -696 1313 2815 -139
392 -139 -2084 -759 -773 -278 2556 1942 -1509 -1724 -781 -712 1489 2820 -154 -2164 -1093 -578 361 2291
410 2291 1330 -1349 -1604 -885 -271 1470 2164 132 -1732 -1730 -638 1111 2110 996 -1004 -2000 -1267 696
428 696 1839 1222 -30 -1296 -1909 -443 1590 1648 629 -532 -2041 -1615 1072 2113 927 -151 -1437
445 -1437 -2070 32 2049 1288 120 -626 -1819 -1192 1206 1744 724 -112 -1462 -1918 223 1915 1258
462 1258 163 -1068 -1918 -524 1466 1409 490 -427 -1514 -1169 592 1327 973 226 -1206 -1643 -77 1178
480 1178 1240 726 -849 -1897 -485 1060 974 801 -13 -1541 -1109 622 847 701 678 -849 -1660 -102
498 -102 917 785 863 -299 -1759 -633 942 712 619 274 -1266 -1078 655 695 257 582 -419 -1367 -151
517 -151 796 540 574 -213 -1304 -495 641 630 703 25 -1339 -630 691 243 333 786 -716 -1216 419 419
537 419 -131 836 120 -1427 -130 924 -9 315 267 -1425 -522 1402 321 -204 649 -951 -1587 987
555 987 1167 -406 606 364 -1875 -714 1388 402 36 569 -861 -1054 791 677 -148 109 -610 -724
573 -724 945 848 -286 110 -504 -1559 237 1627 526 274 -130 -1852 -1107 1042 1061 858 505 -1461
591 -1461 -1304 698 148 -44 1455 -269 -1910 791 1224 -1121 320 951 -2113 -910 2523 852
607 852 -614 500 -1468 -2393 1189 2064 349 924 -376 -2828 -597 1427 90 1106 1723 -1838
623 -1838 -2084 1164 484 -551 1187 55 -1809 360 1573 -1 -323 -655 -1341 141 1243 871 1244
640 1244 -273 -2839 -1188 1119 436 1464 2255 -1570 -2979 172 495 -24 1924 714 -1820 -318
656 -318 332 -787 927 891 -1766 -184 1597 -711 174 2009 -1944 -2981 1688 1518 -551 1951 815
673 815 -3510 -1481 1540 161 911 2080 -891 -1913 -229 -545 393 2133 -183 -1416 678 -190
689 -190 -1072 1539 644 -2247 -58 1636 -362 230 1102 -1296 -1518 254 211 1109 1672 -856 -1364 -20
707 -20 -1264 -176 3060 512 -2266 591 361 -2269 827 2402 -1351 -897 1489 -791 -892 1628
723 1628 -147 -1300 632 -204 -470 1926 137 -2154 508 515 -1708 1274 2364 -1745 -1186 1486 -1023
740 -1023 -1225 2110 745 -1340 228 -39 -933 821 531 -713 559 -56 -1237 1115 970 -1793 160
757 160 1567 -1509 -667 2153 -363 -1485 1138 7 -1383 1034 787 -975 345 47 -1138 958
773 958 762 -1535 577 1382 -1872 -420 2175 -1001 -1351 2081 -20 -2149 1165 1144 -1545 224 1010
790 1010 -1026 31 810 -882 101 951 -986 -67 1246 -1152 -702 1919 -337 -1643 1336 573 -1664
807 -1664 605 1131 -1150 -51 907 -803 -191 761 -497 162 711 -1182 -200 1556 -797 -991 1602
824 1602 -227 -1682 1404 904 -1832 328 1269 -1381 -334 1453 -422 -427 774 -910 -658 1262 -163
841 -163 -540 1270 -492 -1642 1178 661 -1543 772 1440 -1504 -547 1336 -637 -723 1136 -134 -741
858 -741 822 156 -563 314 -500 -686 1146 458 -792 762 254 -1746 33 1199 -594 187 1408
875 1408 -786 -1229 514 -110 -325 1031 98 -572 667 -242 -1160 624 318 -1009 925 1185 -1266
892 -1266 -257 1010 -1261 -956 1554 450 -521 932 -177 -1642 67 563 -310 810 808 -800 -198
909 -198 116 -1193 -42 1355 -126 -226 981 -463 -1210 387 87 -663 832 992 -337 -187 -257 -956
927 -956 -23 601 59 659 675 -853 -601 147 -749 -59 1489 262 -623 460 -252 -1223 166 521 -276
946 -276 719 856 -747 -556 25 -777 -6 1162 92 -150 705 -581 -1313 312 436 -312 795 768 -831
965 -831 -418 274 -643 -321 793 311 52 428 -392 -800 1 -13 -61 763 480 -309 -42 -307 -879 89 786
986 786 173 203 254 -572 -476 165 -170 -11 673 138 -228 190 -298 -597 297 203 -342 485 605 -497 -315
1007 -315 59 -616 -101 944 229 -332 198 -250 -707 186 378 -99 340 270 -565 -284 252 -121 -5 336
1027 336 -146 -178 351 -12 -374 16 6 -143 283 243 -143 -1 -76 -386 -15 284 120 216 53 -501 -206 284
1049 284 2 48 295 -190 -316 260 37 -290 263 207 -393 -11 280 -177 26 281 -353 -317 386 165 -165
1070 -165 162 -87 -406 151 275 -183 40 214 -280 -219 197 39 7 213 -124 -343 29 191 87 58 -97
1091 -97 -163 25 41 10 132 -11 -124 59 -43 -142 226 197 -271 -77 141 -108 82 324 -253 -332 263 63
1113 63 -206 275 102 -397 38 200 -316 54 469 -194 -371 207 -23 -196 320 125 -418 6 277 -161
1133 -161 -65 206 -108 -164 122 1 -116 108 92 -155 -160 21 120 71 -42 -38 -91 -108 131 158 -158 -46 208 -163
1157 -163 -207 269 55 -246 221 93 -464 112 476 -270 -225 348 -170 -272 473 65 -475 243 296 -451 0
1178 0 450 -233 -175 349 -176 -339 387 207 -367 8 189 -201 -5 252 -99 -195 149 87 -167 -47 168 39
1200 39 -178 -15 121 -122 -29 288 -127 -388 270 239 -409 62 376 -413 -193 533 -226 -458 593 148 -722
1221 -722 241 442 -573 40 622 -518 -384 741 -51 -623 456 230 -622 207 472 -511 -98 573 -265
1240 -265 -426 385 117 -320 170 156 -324 -61 290 -9 -215 48 192 -112 -209 175 117 -282 88 325 -400
1261 -400 -213 606 -120 -586 472 219 -676 324 576 -789 -144 899 -478 -609 908 15 -884 647
1279 647 409 -1042 275 930 -801 -383 946 -316 -667 798 104 -845 439 516 -729 -38 632 -325
1297 -325 -274 424 -97 -354 293 189 -283 -69 187 29 -155 -28 175 -84 -238 297 136 -512 163 553
1317 553 -594 -322 799 -213 -664 781 129 -1097 507 801 -1048 -94 1127 -703 -673 1135 -198
1334 -198 -1043 1000 423 -1272 372 893 -1002 -140 1061 -650 -596 1085 -105 -955 639 388 -826
1351 -826 202 636 -536 -158 564 -222 -415 286 207 -130 -46 53 27 -138 -71 304 -44 -392 330 262 -661
1372 -661 86 679 -519 -274 817 -393 -692 971 133 -1128 619 693 -1158 136 1080 -1010 -468
1389 -468 1399 -416 -1091 1154 249 -1367 578 823 -1124 128 1163 -844 -677 978 -175 -678
1405 -678 795 242 -764 285 302 -672 18 536 -172 -76 244 -157 -185 27 -51 67 43 43 346 -118 -590
1426 -590 181 182 -527 388 774 -656 -278 751 -717 -795 1174 315 -889 761 426 -1427 74 1005
1444 1005 -940 -145 1486 -418 -948 891 -266 -1249 932 794 -914 460 881 -1201 -611 791
1460 791 -391 -242 1247 165 -882 120 -25 -742 219 678 65 185 137 -476 -415 -145 10 458 320
1479 320 13 307 -198 -864 -66 246 -253 658 918 -650 -506 342 -810 -571 1243 420 -508 824 4
1498 4 -1663 66 876 -709 309 1487 -625 -897 686 -589 -1160 1103 888 -606 502 465 -1346
1515 -1346 -508 642 -318 144 1298 27 -804 -52 -451 -654 592 742 92 271 0 -700 -466 -114
1533 -114 54 608 514 21 64 -374 -792 9 255 -124 724 850 -642 -552 132 -746 -321 1246 385 -443
1553 -443 639 -142 -1433 61 709 -435 504 1141 -731 -745 529 -546 -732 1031 546 -487 533
1570 533 167 -1243 -226 612 -297 226 994 -168 -589 53 -429 -473 615 543 13 206 -167 -590 -111
1589 -111 22 -27 485 363 -157 24 -208 -586 122 362 -171 322 508 -463 -323 208 -479 -194 894 176
1609 176 -424 395 -85 -887 258 497 -444 298 712 -599 -458 494 -282 -369 713 94 -509 408 139
1628 139 -707 74 364 -340 152 506 -355 -249 303 -253 -248 425 73 -161 248 -134 -385 209 144 -170 218
1649 218 79 -302 134 124 -316 137 304 -283 -2 294 -286 -90 418 -202 -282 429 -10 -361 322 64 -443
1670 -443 304 322 -457 29 362 -364 -99 450 -198 -196 440 -152 -445 316 138 -301 284 172 -442 59 265
1691 265 -329 -21 367 -162 -92 273 -207 -249 297 -4 -207 262 76 -247 147 -2 -324 177 261 -182 78
1712 78 163 -305 -42 253 -197 -30 375 -99 -203 210 -137 -239 336 99 -296 218 167 -350 38 199 -291
1733 -291 78 406 -233 -161 314 -177 -270 322 4 -249 315 111 -416 69 213 -241 84 280 -241 -71 283
1754 283 -181 -204 260 8 -142 211 -21 -233 152 84 -208 107 125 -154 82 94 -223 36 202 -127 -3
1775 -3 181 -147 -38 235 -152 -151 288 -16 -205 218 8 -271 235 156 -334 86 263 -265 -37 289 -209 -113
1797 -113 360 -111 -295 265 53 -269 185 126 -285 91 201 -272 -43 253 -119 -72 179 -126 -115 195 -40
1818 -40 -148 152 24 -92 133 -39 -171 142 66 -171 122 92 -178 88 100 -266 47 272 -161 -72 222 -153
1840 -153 -150 290 -55 -255 262 81 -285 125 132 -270 76 259 -243 -69 291 -130 -159 206 -72 -148 255 24
1862 24 -228 131 65 -187 94 79 -163 109 125 -211 -2 155 -151 6 175 -195 -57 273 -124 -177 244 -38
1884 -38 -194 252 26 -320 201 176 -297 61 251 -237 -6 293 -222 -163 322 -49 -231 234 35 -229 170
1905 170 103 -254 86 188 -183 -9 135 -140 16 158 -148 -56 173 -103 -54 143 -123 -74 242 -107 -187 221
1927 221 -18 -237 227 50 -339 186 222 -368 25 321 -282 -101 365 -228 -266 420 -25 -395 290 155 -377
1948 -377 171 267 -378 -1 370 -241 -154 324 -98 -201 262 -30 -235 211 105 -211 92 81 -138 106 80
1969 80 -179 74 106 -144 80 93 -204 99 175 -279 3 304 -221 -100 323 -215 -243 446 -11 -418 327 150
1991 150 -468 209 340 -465 30 479 -402 -265 528 -139 -350 458 25 -496 321 256 -472 103 347 -345
2011 -345 -45 375 -226 -177 326 -113 -267 258 68 -145 167 -25 -251 138 88 -114 151 24 -211 132 26
2032 26 -261 194 212 -293 66 230 -367 -7 407 -303 -221 509 -106 -383 432 -29 -592 362 349 -513 204
2053 204 496 -557 -224 491 -310 -217 703 -41 -556 323 78 -528 299 376 -392 91 367 -399 -190 349
2073 349 -145 -140 337 -21 -159 217 -80 -297 113 51 -18 313 21 -282 60 -82 -270 311 262 -208 196 110
2095 110 -570 -23 433 -269 -17 545 -284 -376 487 -149 -563 493 275 -523 326 407 -678 -126 475 -446
2115 -446 -143 806 -73 -492 324 -148 -605 451 434 -345 162 280 -537 -189 347 -155 -15 447 -96 -261
2135 -261 161 -91 -199 170 8 -53 286 14 -219 69 -156 -238 338 177 -184 281 60 -588 21 335 -279
2156 -279 179 576 -420 -371 455 -221 -391 593 146 -538 377 270 -698 94 516 -483 -88 672 -242 -355
2176 -355 493 -182 -596 443 321 -378 234 271 -553 -106 353 -203 -12 431 -108 -253 142 -105 -127 265
2196 265 33 -120 141 -47 -130 151 -67 -169 264 54 -232 228 93 -367 144 216 -361 147 460 -366 -190
2217 -190 418 -262 -284 575 -13 -518 407 191 -607 208 435 -463 -26 506 -399 -269 553 -114 -391 401
2237 401 59 -438 268 214 -419 93 330 -318 -71 304 -177 -120 277 -109 -177 223 3 -147 141 -20 -124
2258 -124 171 -18 -149 189 13 -186 173 45 -264 217 213 -319 49 264 -293 -35 412 -205 -233 402 -90
2279 -90 -385 363 150 -391 213 217 -464 84 457 -298 -150 380 -227 -291 424 23 -352 284 103 -418 113
2300 113 262 -239 33 216 -248 -96 270 -81 -129 154 -108 -128 237 25 -129 118 -74 -217 158 133 -68
2321 -68 182 -8 -346 18 165 -85 192 233 -304 -116 233 -176 -68 397 -63 -263 258 13 -313 233 161
2342 161 -398 73 341 -172 -11 236 -351 -298 342 76 -82 340 -26 -459 -18 93 -139 296 347 -269 -198
2363 -198 45 -179 -2 320 -20 -100 154 -55 -138 114 -54 -150 147 112 -28 220 9 -357 -104 46 -52 327
2385 327 374 -225 -264 -36 -244 17 479 135 -137 85 -204 -362 199 231 -124 142 158 -263 8 211 -247
2406 -247 -180 226 0 11 343 -32 -389 -67 -48 -122 338 374 -103 -143 -155 -337 14 382 111 12 57 -251 -216
2429 -216 141 45 -19 216 16 -163 111 36 -196 9 29 -128 189 314 -84 -130 -52 -279 -42 380 161 -27
2451 -27 100 -213 -368 106 206 15 217 84 -325 -114 137 -73 18 185 -94 -74 173 -16 -151 57 -44
2472 -44 -120 179 150 -47 61 -60 -276 1 193 53 113 84 -247 -157 110 -8 42 214 -42 -163 81 -31
2494 -31 -125 174 84 -170 62 136 -135 6 120 -189 -83 218 18 -72 132 -50 -189 89 77 -95 102 107 -141
2517 -141 -44 80 -56 21 126 -61 -62 68 -24 -40 51 -22 -31 69 -27 -80 53 -16 -69 101 5 -102 72 21 -145
2542 -145 58 119 -104 1 95 -148 -47 220 -28 -148 130 -13 -162 155 104 -179 32 125 -152 12 207
2563 207 -61 -108 98 -62 -92 203 108 -143 -38 -1 -94 102 177 -31 -68 -11 -92 1 131 58 7 -49 -120 -22 96
2588 96 46 32 -8 -160 -39 159 41 -17 67 -115 -193 146 141 -47 101 16 -303 -56 251 30 1 125 -204 -253
2612 -253 194 160 -68 116 -5 -293 -11 215 -18 22 118 -208 -195 178 131 8 74 -88 -225 36 203 83
2634 83 53 -45 -171 -85 72 127 139 2 -174 -93 -17 52 206 121 -196 -155 36 -20 115 235 -115 -251 29 -4
2658 -4 -50 264 126 -296 -98 80 -99 130 309 -165 -298 89 7 -38 301 96 -307 -62 85 -69 134 255
2680 255 -121 -229 23 -13 58 241 25 -208 -101 -4 59 175 98 -97 -128 -100 3 175 102 -36 -39 -147 -140 182
2704 182 205 -47 -25 -67 -243 47 319 -11 -118 90 -186 -201 279 157 -180 42 10 -334 38 365 -47 -132
2726 -132 94 -178 -199 309 171 -171 12 -6 -232 48 259 -25 -66 17 -176 -99 190 114 -47 -20 -93 -111 84
2749 84 136 51 -12 -118 -77 55 31 61 136 -94 -189 66 59 -63 179 93 -290 -78 203 -70 1 245 -131 -270
2773 -270 170 66 -165 191 121 -312 -38 193 -141 20 253 -185 -240 200 35 -145 193 72 -272 9 159
2794 159 -115 11 173 -97 -147 75 23 -3 97 -16 -81 -20 2 49 97 -57 -58 60 -51 -59 137 12 -110 62
2818 62 -9 -148 118 123 -160 27 104 -183 3 250 -146 -142 244 -35 -244 208 121 -270 76 196 -244 -66 256
2841 256 -114 -154 195 -15 -154 124 33 -174 94 98 -152 43 73 -133 22 134 -102 -62 121 -33 -51 94
2863 94 5 -46 13 -42 -8 115 -6 5 77 -144 -130 207 75 -130 143 53 -287 16 222 -116 -12 228 -136
2886 -136 -185 194 17 -124 161 -4 -214 162 163 -177 25 90 -272 -41 320 -19 -101 162 -131 -320 127 230
2908 230 -21 94 35 -261 -127 95 48 114 55 -134 -40 44 -99 41 143 -133 -78 166 31 -48 118 -110 -267
2931 -267 64 162 96 207 -26 -346 -100 73 -42 266 332 -229 -262 72 -140 -81 399 134 -286 29 79 -197
2953 -197 52 166 -207 -73 185 27 45 128 -228 -270 55 67 126 356 19 -405 -181 -15 -45 303 342 -101
2975 -101 -221 -116 -149 42 220 67 14 20 -153 -51 168 -82 -159 124 10 -36 310 118 -370 -179 38 -70
2997 -70 228 423 -55 -248 -125 -251 -48 404 230 -60 20 -213 -323 166 234 -103 63 123 -192 -56 200
3018 200 -99 -195 67 13 -1 244 93 -191 -157 -185 -90 274 292 -17 -54 -184 -350 18 299 83 55 88 -238
3041 -238 -224 116 46 -17 145 -35 -141 119 43 -142 25 -30 -179 172 298 -93 -74 29 -275 -136 326 169
3063 169 -40 101 -112 -317 21 195 22 112 60 -207 -60 101 -68 15 129 -97 -67 162 -13 -117 78
3084 78 -55 -163 124 155 -38 28 -51 -188 9 125 4 86 50 -181 -65 109 -63 -2 197 -67 -169 132
3106 132 30 -127 121 66 -184 40 145 -98 -21 107 -122 -38 154 -44 -73 132 -49 -149 131 69 -130 76
3128 76 69 -184 -7 164 -52 -42 101 -77 -84 98 -2 -49 60 -33 -67 68 -16 -63 55 -8 -100 89 78 -94 -28
3153 -28 30 -123 30 162 -35 -58 36 -100 -78 156 14 -67 111 -37 -176 95 101 -114 53 112 -166 -5 193
3176 193 -54 -127 103 -36 -87 165 85 -131 0 -16 -117 74 170 -17 4 7 -154 -48 152 35 -28 64 -64
3199 -64 -103 83 46 -36 16 -19 -76 57 43 -42 39 -32 -145 17 137 -18 32 39 -174 -101 159 50 -28 98 -56
3224 -56 -184 66 89 -34 84 56 -156 -36 133 -27 23 108 -121 -113 146 51 -61 74 -19 -156 33 115 -24
3247 -24 37 41 -120 -63 71 29 52 64 -94 -94 54 28 10 103 -41 -131 32 46 -24 99 59 -124 -36 33 -36 66 95
3274 95 -90 -75 54 -35 -7 124 -46 -135 59 29 -76 91 90 -115 -44 54 -46 39 118 -55 -112 24 -11 -12 114
3299 114 18 -90 15 6 -47 74 86 -71 -5 23 -71 19 108 -36 -59 27 -52 -5 97 -23 -56 35 -28 -65 84 46
3325 46 -93 18 14 -110 19 124 -49 -35 40 -80 -58 103 13 -70 64 -13 -98 44 55 -64 18 44 -110 -19 99
3350 99 -23 -24 51 -50 -51 56 26 -28 31 -21 -61 35 16 -29 50 14 -91 13 52 -34 31 66 -83 -44 71 -26 -34 80
3378 80 -21 -75 51 -3 -68 80 50 -111 8 63 -81 15 99 -84 -63 84 -15 -74 92 12 -97 21 35 -69
3402 -69 34 81 -55 -30 48 -46 0 80 -22 -61 39 -15 -37 66 11 -38 21 -19 -47 36 26 -45 18 -13 -78 54 68
3429 68 -42 7 35 -75 -8 94 -33 -50 81 -28 -104 82 36 -77 52 43 -128 7 116 -59 -42 81 -67
3452 -67 -75 107 10 -87 58 14 -112 31 73 -60 9 37 -71 -20 78 -6 -18 29 -39 -30 49 14 -12 41 -13 -51 21 1
3480 1 -17 53 -3 -81 27 28 -46 51 40 -102 -8 84 -57 -29 95 -24 -101 86 8 -75 83 29 -126 -7 75 -56
3506 -56 25 83 -106 -72 87 -35 -50 100 13 -109 38 27 -84 33 77 -58 -39 51 -19 -10 23 -43 -29 22 2 12
3532 12 44 -46 -45 39 -20 -23 77 21 -76 2 -18 -57 51 71 -67 -3 26 -95 -11 90 -80 -38 121 -39 -84 88 13
3559 13 -147 37 77 -93 32 116 -90 -98 47 -34 -13 105 14 -63 29 -35 -80 68 58 -39 30 16 -93 -12 77 -36
3585 -36 -27 54 -7 -5 18 -28 -39 5 -14 34 83 -33 -42 42 -67 -91 102 95 -60 41 25 -123 -24 106 -36 -17 87 -27
3613 -27 -59 55 -33 -66 84 21 -69 70 62 -111 -17 64 -88 -22 143 -9 -90 31 -3 -81 36 55 -13 21 -7 -58
3639 -58 -1 8 -21 47 12 -66 18 51 -57 -26 62 -29 -11 85 -9 -55 30 -25 -37 72 23 -33 68 2 -122 39 85 -71
3667 -71 28 117 -84 -65 118 -26 -95 88 51 -60 24 42 -71 17 43 -38 12 64 -41 -12 37 -60 -13 85 -7 -60 43
3694 43 1 -66 40 19 -39 15 20 -37 7 18 -35 37 29 -77 10 71 -64 -27 88 -36 -55 105 6 -106 51 42 -71
3721 -71 13 62 -50 -15 37 -59 -21 84 -28 -42 60 -48 -60 90 13 -74 52 40 -67 10 62 -47 -12 36 -42 -14
3747 -14 45 -13 -15 20 -51 -15 78 -23 -45 56 -20 -74 65 41 -76 14 47 -85 -19 75 -18 -22 40 -56 -43 78 10 -32
3775 -32 48 -18 -82 54 38 -60 21 72 -81 -35 68 -15 -19 60 -14 -47 47 28 -29 14 -13 -35 56 21 -23 50 1 -85 0
3804 0 51 -17 41 67 -49 -71 34 -7 -17 64 1 -45 25 -9 -77 42 38 -58 21 59 -69 -11 68 -75 -58 80 34 -31
3832 -31 67 -11 -94 -13 36 -12 57 70 -42 -11 -19 -73 19 101 4 -17 43 -47 -59 52 17 -31 55 37 -30 12 -1 -59 -1 13
3862 13 -24 62 80 -44 -45 -12 -92 2 146 45 -46 18 -61 -115 38 67 4 52 6 -88 -33 46 -33 18 62 -48 -18 82
3890 82 -13 -85 18 -18 -56 87 94 -30 -24 -26 -109 -11 95 59 35 25 -100 -79 50 25 38 75 -24 -66 6 9 -24 57 35
3919 35 -45 -2 36 -7 12 -8 -87 -33 58 27 21 27 -91 -93 36 33 21 102 2 -125 -53 11 -15 69 84 -74 -64 22 -15 3
3949 3 61 -25 -71 42 22 -21 49 9 -97 -20 51 0 46 70 -89 -84 13 37 48 67 -11 -76 -22 -5 28 63 17 -55 -15 0
3979 0 -31 46 47 -58 -54 2 -16 55 74 -43 -70 5 -13 15 84 -2 -78 11 -16 -38 74 76 -73 -54 9 -37 23 94 -26 -80
4009 -80 -9 -9 -22 61 31 -60 -12 5 -34 34 65 -30 -48 -5 -22 5 83 -21 -61 -14 10 4 38 3 -42 -13 -30 -8 52 37 -28
4040 -28 -28 -26 -60 34 86 -29 -39 16 -41 -24 76 -14 -70 23 5 -36 29 24 -64 -15 7 -50 22 87 -39 -64 20 -9 -22 69
4070 69 19 -73 -15 27 -21 26 46 -36 -20 3 -28 7 40 -22 -26 -7 -13 15 63 -12 -46 -18 -17 -2 65 12 -48 -22 -8 -27 44 43
4102 43 -42 -23 2 -50 5 88 -28 -68 7 -19 -16 72 29 -100 -35 17 -41 27 62 -52 -65 -1 -28 -12 80 5 -80 -27 -9
4131 -9 -12 57 42 -69 -42 -4 -3 35 38 -23 -40 -17 -15 22 53 10 -35 -29 -31 14 77 29 -47 -13 -29 -32 69 46 -42 -11 1 -60 25
4164 25 88 1 -35 6 -56 -28 87 47 -59 -19 15 -46 48 88 -37 -34 2 -38 -11 73 29 -34 -10 -32 -32 52 53 -23 -43 -16
4194 -16 -35 24 47 -12 -18 -22 -31 5 46 2 -2 -7 -60 -17 44 18 -16 17 -36 -48 53 31 -37 18 10 -56 3 53 -23 -16 40 -43 -48 50
4228 50 23 -28 21 -16 -74 30 38 -41 -13 10 -34 -34 42 -14 -26 19 -14 -39 6 17 -14 13 -22 -40 9 24 -15 6 12 -31 20
4259 20 23 -23 9 38 -21 -8 17 -26 0 46 -5 -30 29 8 -43 38 33 -36 28 30 -46 -11 59 -2 -23 25 -36 -29 47 21 -24 17
4291 17 8 -46 17 34 -25 -2 21 -48 -32 38 12 -11 11 -35 -46 24 32 0 -6 -10 -30 11 6 -7 27 -4 -61 -16 17 -9 27 23 -52
4324 -52 -36 38 -4 -15 39 -26 -58 21 25 -12 24 21 -61 -26 38 -12 18 39 -59 -66 30 32 4 38 -5 -58 -7 38 6 13 16 -28 -43
4357 -43 5 -1 28 34 -28 -37 3 20 18 11 -34 -53 8 34 16 47 9 -62 -31 1 3 62 49 -48 -53 1 -13 22 61 -7 -55 24 8 -15
4391 -15 37 10 -47 4 31 -5 18 40 -51 -53 16 34 36 54 -18 -75 -41 16 35 48 21 -34 -35 -6 -8 11 41 -8 -12 -5 -3 8 9 -36
4425 -36 -43 16 17 34 54 -36 -85 -19 13 5 71 36 -49 -48 -14 -34 24 90 5 -39 6 -10 -22 49 0 -34 27 45 7 18 23 -58 -35
4458 -35 43 37 48 74 -13 -78 -35 11 42 84 45 -39 -40 -18 7 33 25 -10 2 7 -10 6 4 -24 -19 7 22 41 48 -33 -79 -34 4 39
4492 39 86 27 -58 -51 -25 -32 44 79 -5 -30 -17 -34 -6 52 24 -41 6 16 -1 36 23 -60 -32 35 23 40 55 -38 -70 -24 -1
4523 -1 25 76 35 -45 -64 -20 -5 47 49 -21 -23 -10 -10 16 24 -23 -39 -5 -4 30 44 -5 -39 -24 -27 13 72 38 -55 -33 -14 -11 62 64 -10
4558 -10 -22 -2 -36 -5 57 15 -38 -2 -19 -15 56 55 -36 -29 -2 -14 21 51 -5 -44 -5 -1 11 42 22 -28 -23 -27 0 44 45 -16 -36 -31
4592 -31 -27 42 40 -7 -22 -31 -33 12 36 9 -3 0 -29 -17 32 25 -8 -15 -20 -31 37 43 -26 -22 -7 -8 15 48 9 -37 -5 -21 -24 45 31 -5
4628 -5 -13 -25 -43 0 51 1 1 9 -24 -5 34 4 -15 5 7 -3 10 26 -21 -4 -11 -16 24 51 2 -15 -13 -28 16 57 10 7 8 -22 -17 19
4664 19 11 -1 26 -9 -34 11 24 -21 -5 -5 -22 13 53 -9 -23 7 -5 -16 35 14 -14 7 -1 -34 -1 30 8 0 -3 -39 -15 9 -8
4697 -8 -8 9 1 -13 16 3 -21 6 1 -18 5 5 -14 12 -10 -35 1 21 -5 -10 -6 -23 -4 16 -15 -25 21 6 -33 5 11 -14 24 15 -17
4732 -17 2 15 -24 -17 13 -15 1 26 -2 -29 14 14 -11 -5 6 -11 14 19 -14 -16 7 -9 0 7 -12 -3 13 2 -8 15 5 -15 11 -16
4766 -16 -26 22 21 -16 -9 9 -19 -7 10 -22 -8 16 -22 -23 4 -11 -5 23 -10 -29 15 11 -15 11 4 -25 4 34 -20 -12 21 -15 -16 10
4800 10 3 5 15 -2 -28 2 26 12 2 2 -34 -5 22 -7 -13 12 -4 -18 11 -4 -12 13 -2 -25 -3 18 -8 9 -3 -34 5 28 -2
4833 -2 -2 11 -19 -16 15 -7 -6 22 -9 -28 12 13 -8 21 -1 -31 -8 29 9 -5 6 -32 -21 13 -3 -1 12 -15 -35 3 10 -5 25 -11
4867 -11 -33 -12 15 9 6 11 -28 -15 22 4 4 26 -24 -29 15 13 -2 33 0 -27 -10 24 8 17 3 -46 -6 15 8 0 18 -26 -27 1 4 -7
4903 -7 17 2 -38 -28 14 -4 15 8 -39 -34 10 1 8 18 -22 -23 11 12 10 29 5 -27 -16 3 10 34 8 -40 -28 8 4 21 10 -16 -27
4938 -27 -4 -5 1 25 -1 -26 -12 -3 -7 32 23 -38 -27 4 9 35 21 -29 -36 12 -8 -2 25 -10 -34 -6 -11 -1 26 17 -38 -17 7 5 15 23
4974 23 -27 -19 11 2 0 20 -16 -16 -1 -3 -5 18 26 -30 -17 -2 2 13 16 -21 -29 -4 9 12 21 -10 -21 7 -7 -10 22 17 -22 -18 3 -5 15 20 -25
5013 -25 -28 -4 -1 19 24 -19 -37 2 -11 -3 29 12 -26 -9 -9 -25 13 31 -9 -32 -7 -23 7 27 -8 -25 -6 1 -7 14 18 -20 -5 0 -10
5048 -10 19 32 5 -15 -5 -22 12 39 -4 -16 -3 1 -7 6 -7 -16 13 12 -17 11 23 -9 -14 -5 -14 11 30 -1 -28 -9 -15 -12 27 1 -18
5083 -18 11 -5 -29 -1 21 2 -1 -11 -38 -9 12 -6 -10 -6 -5 -3 23 4 -25 -4 0 1 11 17 -10 -5 -13 -19 -10 27 -6 -14 -5 -14 -4 11 6 -14
5121 -14 12 7 -7 4 8 -10 5 -3 -23 -4 12 -11 -21 3 -8 -12 30 -1 -19 -3 -3 -10 13 3 -4 6 10 -25 -14 19 4 6 4 -21 -4
5156 -4 24 11 -20 -7 10 5 14 9 -16 3 15 -4 2 21 11 2 7 2 -6 22 11 -10 1 -6 -11 17 8 -14 -3 10 -9 -8 12 7 2 3 -12 -6 14
5195 14 2 7 2 -3 -6 17 4 -27 -4 11 -14 -4 5 -3 -4 19 -7 -14 6 2 -2 21 -15 -27 15 6 -16 -10 17 -5 4 -4 -7 8 16 -4 -22 17
5233 17 1 -4 23 8 -11 3 7 -8 -1 15 -13 -5 0 -7 -15 4 4 -20 -3 0 3 1 7 -17 2 7 -18 0 7 -12 5 9 -25 -5 22 11 -7 8
5271 8 -7 -1 23 6 -20 9 -1 -15 -1 16 -5 9 16 -14 -7 23 3 1 5 -7 -8 30 22 -5 1 -3 -14 4 22 10 12 9 0 -14 1 1 11
5308 11 2 -12 -12 17 5 -10 -4 -3 -5 13 11 -8 5 -1 -13 -12 33 8 22 9 -23 -19 20 21 -10 13 -17 -23 3 5 -4 7 16 -5 -8 29 -5 0
5346 0 37 0 -17 14 34 -9 -9 -15 -19 5 29 -1 4 7 -16 -6 6 9 19 37 -3 -15 -5 -4 5 6 -7 -6 14 3 -8 6 -9 -10 16 15 -1
5383 -1 14 4 -19 -14 11 4 8 23 -2 -25 5 14 -11 11 18 -19 7 8 -20 -4 24 4 -10 8 1 0 19 -6 -15 -2 24 10 1 21 -9 -4
5419 -4 7 15 -6 19 -6 -12 -16 -5 -5 22 -3 -3 2 -6 -7 20 -12 -21 8 14 -14 3 12 -25 1 25 -11 -5 23 1 -26 8 10 -26 19 3 -27
5456 -27 -9 27 -15 -14 25 -9 -16 15 1 -10 15 17 -7 -2 11 8 9 13 -9 -10 5 7 4 -13 -3 -6 6 4 1 4 -10 12 14 -6 2 13 -12 -12 10
5495 10 -3 -10 20 15 -29 0 21 -14 -5 6 -21 -2 22 -13 -15 29 11 -25 1 14 -4 9 18 -23 -10 12 11 -5 8 7 -9 14 7 0 6
5530 6 10 -6 3 -8 3 6 -2 -13 0 10 12 24 14 -25 8 23 -10 6 19 3 -9 17 -7 -11 22 11 -15 -1 10 -8 10 14 -15 -12 22
5565 22 -11 -11 19 5 -17 4 14 -21 12 23 -9 -20 -5 -5 -7 14 4 -9 -3 -2 -6 7 8 6 15 -4 -1 8 9 2 8 -5 4 18 2 -4 8 -3
5603 -3 -14 4 16 -9 1 17 -10 -16 38 15 -7 8 -2 -6 17 21 -9 -8 7 -2 -10 25 -2 -10 18 8 -23 0 22 -13 0 6 -21 -5 23
5638 23 17 -5 -1 2 -1 0 9 7 3 -6 0 8 3 11 18 -12 -4 7 6 -4 7 -6 -13 14 9 -16 2 18 -14 -8 12 -9 -5 21 1 -20 3 12 -6 3 16
5679 16 -21 -14 21 -13 -18 13 -8 -12 1 7 -17 3 9 -10 -5 3 -6 -2 0 2 -12 4 -2 -3 -8 5 10 0 -8 8 22 6 0 12 0 5 26 1 -8 12
5719 12 -5 -1 15 12 -2 11 25 -5 0 18 15 -2 11 0 -9 10 14 -25 -5 15 -2 -10 2 -12 -10 5 0 -24 1 -2 1 5 -2 -4 -9 10 8 -5
5757 -5 0 2 -13 0 0 2 3 2 -15 10 8 16 17 -3 7 10 8 2 14 -7 1 18 9 -10 9 14 10 -9 16 -3 6 22 17 -10 10 14 4 20 4 -2 12
5798 12 22 -14 -1 15 2 -15 6 2 -2 22 15 -1 5 10 5 3 3 -10 -1 0 -7 4 -14 3 -2 -3 -1 -5 10 2 -4 -11 -8 -4 6 1 -6 2 -5 5 1 10 -6
5841 -6 19 6 -3 -1 19 5 9 12 4 -2 21 10 -14 14 8 -1 12 21 12 -9 2 4 -3 20 17 -11 10 -2 -2 6 18 14 6 13 -8 -1 0 -12 2 13 -2
5882 -2 4 -11 -10 -10 6 -15 -1 18 5 -6 3 -1 -4 22 12 8 11 10 -7 -14 -2 8 11 27 -4 -5 13 14 6 -4 5 -2 12 7 -11 -10 23 -2 -9 15
5922 15 6 -5 -4 -4 -12 -6 2 -9 4 6 -7 -10 -2 -2 -12 9 15 -5 -9 -11 -4 -3 23 -11 3 16 6 8 2 -8 -8 24 4 3 10 5 -11 2 0 11 24
5963 24 19 -5 11 9 5 9 14 6 6 11 15 4 4 11 7 18 0 -13 0 5 -12 1 5 0 11 12 -4 -11 -2 -1 -4 7 -7 4 7 6 -10 6 -5 1 0 -8 -5
6006 -5 -5 6 -5 0 15 5 13 -4 5 2 14 -13 -3 12 -2 -1 0 -1 3 11 9 0 4 8 9 5 5 -17 9 11 6 -11 8 4 3 13 -3 -5 5 18 1 -9
6048 -9 -1 2 10 6 -5 -3 4 2 2 4 2 -8 12 8 -10 7 7 -1 -12 -3 -5 0 5 -2 0 11 -6 1 3 7 0 8 9 -9 6 5 -4 -11 7 -1 19 13 2 -15 6 -4
6094 -4 3 5 -3 -11 10 14 -4 9 -6 -2 7 -1 -6 4 7 -13 -4 3 8 -1 -1 -10 -6 1 -4 -20 8 -4 -11 8 -1 -13 5 6 -10 -11 -1 -2 -5 1 -6 -24 2 19
6138 19 -5 8 3 -8 8 -2 -11 -2 1 -12 -11 -12 -7 9 16 5 -6 0 1 6 21 -7 -7 6 -2 -7 -1 8 -8 -4 8 -16 2 -1 -16 -10 -9 -14 -12 -1 0 -9
6180 -9 -5 -9 -11 7 3 -8 -6 4 2 -16 5 4 -1 -3 -7 1 7 -4 -6 13 -6 -14 4 7 8 -1 -10 -2 -4 1 14 22 12 -15 -1 14 3 -2 9 -14 9 13 -14
6223 -14 -9 1 0 -2 0 -5 -2 8 5 -8 -5 6 -7 -6 1 -20 -6 -10 0 -4 -1 6 -12 -4 -12 -1 11 10 -3 -12 3 -7 5 -4 4 1 0 -7 5 -2 7 11 -2
6266 -2 5 -4 17 8 1 1 11 -4 9 2 -5 -9 6 -7 6 9 -1 8 -2 1 -1 20 13 14 9 7 1 18 1 -14 0 -4 4 -10 -5 1 -6 -1 1 -5 9 1 -4 -19
6310 -19 -3 8 4 5 -9 -7 -4 11 2 -7 -3 7 6 -4 -6 7 5 3 6 -2 -9 7 9 -8 2 1 -4 -3 -1 -5 -1 20 0 -4 -6 4 4 5 0 -4 -2 -4 -3 -10 1 2
6356 2 -13 5 -13 -21 -2 2 1 -11 1 4 5 -3 5 -10 11 0 3 4 -5 2 -9 -5 -4 7 8 11 -5 -4 -5 1 2 -5 1 2 -6 -3 -3 -2 8 6 -8 3 13 4 1
6401 1 -1 8 2 12 5 -4 -6 3 -6 -14 -10 -8 -9 5 6 -18 -18 -7 2 -3 -7 -23 4 -1 -6 3 -3 6 -8 4 -6 -4 15 -4 -1 -5 -5 8 11 4 -5 1 1 10 4 9 7 -1 1
6450 1 -15 14 10 2 0 3 6 16 25 11 6 4 -3 6 4 -9 3 -15 -2 -10 -8 1 2 -5 -10 -16 -11 4 7 -4 -12 -12 -16 -1 8 -4 4 7 1 -3 0 0 -3 -4 -16 12 12
6497 12 10 12 3 -7 -7 3 11 -3 -3 2 -2 3 12 17 16 2 1 -9 12 12 2 -1 -8 -3 -3 11 5 1 1 -3 0 5 -1 2 -5 -11 2 -6 -9 -4 -13 -3 -13 -3 -2 -5 -4 -4
6545 -4 -8 -17 -4 11 7 11 -6 -13 -4 1 11 2 3 -12 -3 17 3 8 1 9 -5 17 14 18 17 5 -3 10 5 15 7 2 2 7 14 2 -3 -3 3 -1 4 6 -2 12 -4 -3
6591 -3 4 -8 6 -1 -6 -8 2 10 7 3 -11 -10 7 -6 -20 2 3 -1 -2 5 -4 -3 -4 1 -6 3 -4 7 -2 3 -6 7 11 -6 6 7 5 6 1 3 -2 15 9 -1 9 -5
6637 -5 -4 8 6 -4 5 1 10 -6 3 7 6 10 16 -5 0 3 3 2 -8 -3 2 -10 -16 -17 3 -1 -7 -13 -10 0 12 -18 6 4 -17 -2 7 -9 -11 6 -1 -8 -2 12 13
6682 13 9 -1 7 8 2 11 -4 3 3 3 8 4 6 2 2 -12 2 4 9 9 -8 4 1 8 1 10 0 -9 -1 5 1 -14 -1 -15 -12 -14 -5 -7 6 -8 -21 -12 -3 4 -7 -4
6728 -4 -16 -1 -13 -5 -3 3 -4 -8 0 -1 0 7 0 -8 -10 7 11 2 4 4 -2 11 12 5 14 14 6 -7 0 19 13 15 2 -2 -2 24 7 13 -8 5 1 15 2 -2 -5 0 -7
6775 -7 -25 -8 2 4 6 -4 -3 -4 -5 7 -9 -8 -7 -3 -10 -7 -6 -1 7 -4 9 6 3 -4 1 -2 -3 6 15 9 -15 6 5 1 7 0 9 11 -2 3 7 0 1 4 -3 -3 8 18
6823 18 -3 0 3 5 10 1 3 -5 10 -7 -12 1 3 11 -7 -17 -18 -6 4 4 -1 -6 -13 -13 3 -10 -17 -1 -2 -8 -9 -9 2 5 1 -14 2 7 1 -5 9 0 -9 3
6867 3 -1 2 15 2 6 -2 -3 -4 11 16 1 -3 11 -2 13 6 -3 -6 10 7 -8 7 4 8 5 -1 1 0 5 -5 -7 -2 0 -1 -2 -17 -5 -1 -7 -6 -12 -5 5 0 -10 3
6913 3 6 -5 9 -10 -16 -12 3 9 -4 1 2 -2 8 4 5 9 7 -11 1 0 -1 -1 -1 -2 5 1 -2 0 0 -9 9 8 8 -4 11 1 -1 1 16 6 -1 -3 -7 -8 -3 -3 -8
6960 -8 -3 -6 -10 5 -2 -4 11 -1 -3 -5 -2 -11 -1 -8 -4 0 1 -7 -2 -2 4 10 10 6 1 -2 -1 6 -4 0 -4 4 12 -3 -3 5 8 5 0 -2 11 14 10 0 4 4 6 12 -1 14 -1
7011 -1 8 -6 1 1 -10 5 0 -8 -8 1 -1 -1 -5 5 -6 -7 -3 -14 -11 2 11 -14 -11 0 -1 -15 -8 -5 -5 2 -4 -13 -11 5 15 9 -3 -7 -6 8 -2 8 2 2 12
7056 12 7 -6 4 10 12 16 -5 20 4 14 4 -4 0 4 8 7 2 -7 -9 -9 -10 -9 10 -10 -4 1 -6 -15 7 -6 0 -6 -3 -13 -6 -6 3 -4 1 -8 -12 3 -2 0 -1 -4 -10
7103 -10 2 -7 0 5 9 7 1 14 -7 6 -13 7 8 -2 9 3 -1 4 -2 7 0 -3 9 9 9 10 -8 0 -1 -3 -1 1 -10 -3 -2 8 -24 -5 -10 -6 -1 -14 -16 -9 5
7148 5 -11 -15 -24 -17 -8 -6 -5 -9 -4 -12 -4 -17 -14 6 6 2 -3 -1 9 11 -11 1 12 14 -1 7 -5 2 4 11 15 6 7 -6 7 0 1 10 -4 3 4 -16 -5 2 1 -7 4
7195 4 -6 -5 -3 -2 5 -3 -11 -1 -14 -8 -7 -8 -14 -9 -12 -5 -10 -23 -2 -12 -13 -10 -17 -16 -11 -8 -11 -12 -6 -17 -10 -6 -24 -2 -8 -6 -2 -1 -7 -6 -5 -13 -6 0 -3 8 11 8 7 8 2
7246 2 2 2 8 -3 0 2 -5 12 6 3 -15 -7 -2 -7 -8 -16 0 -3 4 -12 -11 1 -11 -13 -3 -7 -3 -2 -1 -13 -14 -16 -9 3 -4 3 -3 3 -2 1 -5 1 -4 -2 -1 0 8 -3 -9 13
7296 13 13 6 -6 5 9 -7 7 6 -14 -2 6 -3 13 12 1 -6 -2 8 -17 2 -3 -2 3 -10 -6 -9 -3 -13 -2 -7 -7 -6 0 -17 -3 -10 -4 -17 -11 -10 -1 -9 -10
7339 -10 -19 2 11 2 -2 6 -13 -2 -3 -6 9 5 18 -3 7 2 11 0 -2 -1 5 1 10 23 2 7 2 11 -1 19 -3 -1 10 -1 -5 10 -5 5 2 7 4 -7
7381 -7 13 -2 0 -6 -3 -3 -1 -17 -2 -13 -14 -8 -9 -8 -2 -13 -15 -8 -4 -12 -4 -1 -13 -20 -8 -8 -2 0 2 12 -7 -1 5 -5 11 -4 9 -1 8 -7 5 -3 11
7424 11 6 4 10 -5 2 -4 4 -3 3 1 9 -5 0 -2 1 2 -3 -7 -1 1 -2 4 -7 -6 6 -8 0 -18 -9 -5 -10 -1 -4 -6 -11 -18 -3 -8 6 -13 -13 -7 6 -1 1 3 0 2 1 -8
7474 -8 -4 3 8 0 -2 9 5 9 8 13 6 -1 2 19 3 5 3 5 -3 8 7 16 1 -3 -8 -10 0 0 9 4 -6 -2 6 4 1 -10 -12 -11 5 -4 -11 -11 -8 -7 -22 -3 -10 -4 -1 -8
7524 -8 -4 2 8 -4 -19 1 -2 -4 2 5 6 3 12 -3 21 21 17 10 7 15 7 4 5 -6 8 10 0 7 11 11 -4 -2 5 6 9 -3 1 -1 -8 -6 2 2 -1 -2 -2 -4 -9 -1 -9 1
7574 1 -3 -10 -4 7 -3 -14 -1 8 -3 3 3 -4 -9 -4 2 -5 -2 2 -7 -5 6 5 -6 6 8 -4 0 13 8 10 2 7 3 11 13 12 4 10 11 7 5 4 -6 -2 1 -1 0 8 -1 8
7624 8 -13 -3 9 4 -1 -16 -15 -11 -5 -5 -11 -21 -10 -6 -13 -25 -21 -10 -6 -4 -11 -11 -3 -2 -11 -7 -2 5 4 -9 -8 5 10 13 11 0 12 10 11 5 10 6 7 7 7 6 17 11
7672 11 -3 -5 13 1 6 10 0 -1 8 4 -2 -3 -6 -1 -14 -1 2 -18 3 15 1 8 -15 -14 -2 -5 -5 -1 -3 -6 -1 -18 -17 1 3 -4 -1 -4 -1 0 -9 -4 -7 4 0
7717 0 -3 2 -1 6 5 -2 5 11 1 1 3 1 5 12 13 5 -2 15 -1 6 0 6 14 3 13 0 9 5 -2 10 8 3 0 -12 -8 -4 11 3 5 -6 -11 -5 0 4 -14 6 -7 3
7765 3 -4 -6 -9 0 -1 -14 -3 -14 -2 -5 -6 -3 7 4 -6 3 7 10 5 4 17 6 12 15 10 21 15 7 11 5 10 13 14 11 3 -1 7 8 11 3 2 -10 6 -3 0 -3 0 -3 -11 -3
7815 -3 -7 -1 -6 -10 -20 -11 -13 -16 -1 -6 2 -11 -13 -5 -9 -11 -6 1 -6 0 1 0 -3 1 -3 8 11 -3 3 3 14 1 14 18 6 14 8 7 10 16 8 -3 12 6 -6 22 13 6
7863 6 0 12 2 -8 1 -4 -2 3 1 -1 -5 -5 -5 4 -11 -3 -5 0 -8 -5 -2 -12 0 -6 -13 -11 5 -6 1 -7 3 -7 -1 1 -2 8 12 -5 13 4 -6 11 4 7 4 -3
7909 -3 10 7 15 4 9 4 4 15 -4 4 -6 9 2 -5 12 -3 -1 -10 4 -4 0 0 -13 -14 -14 -15 -16 -6 -5 -14 -9 -9 -8 -7 -2 -11 -11 0 1 -4 0 0 -4 -3 -9 -4 -1 -3 10
7958 10 3 1 5 -6 -1 -3 16 2 9 6 7 3 0 20 13 6 12 12 -2 9 2 4 5 2 -1 20 10 8 3 0 4 -7 6 1 -13 -7 0 -7 -7 -3 -6 -7 0 -19 -5 -7 -14
8005 -14 -2 -10 -4 -5 -1 -2 10 8 -4 -4 -1 -9 4 -3 -2 3 15 -5 -5 2 0 4 11 0 6 4 11 8 4 11 22 14 -5 19 9 8 13 -2 -3 8 6 -4 2 -2 1 6
8051 6 7 5 -4 0 -4 4 -4 -4 -9 2 -15 3 0 -5 7 -4 6 -4 -6 -4 -2 -7 3 -4 -7 6 3 -1 -4 -5 -13 14 10 -1 3 2 12 -4 5 5 4 0 15 25 11
8096 11 9 10 13 3 13 6 5 10 10 3 6 -5 1 1 3 -4 -10 -4 -12 2 -8 -3 -12 -3 -16 -11 -10 0 -23 -1 0 -25 -9 -5 -14 -16 -13 -13 -9 -19 -7 -12 14 -4 -9
8141 -9 0 0 6 3 6 0 7 9 10 2 6 9 6 0 1 11 6 0 3 10 13 11 5 -1 1 -4 10 12 0 4 -9 -7 3 0 -8 -2 -1 4 -12 -8 -17 -15 -14 -2 -3 -14 -12 -26 -6 -7
8191g
##END NTUPLES=NMR FID
##END=
