##TITLE=1H_LY-821.24
 CCl4, 8 sc, 
 28.5.2019
##JCAMPDX= 6.0         $$ Bruker NMR JCAMP-DX V2.0
##DATA TYPE= NMR FID
##DATA CLASS= NTUPLES
##ORIGIN= UXNMR, Bruker Analytische Messtechnik GmbH
##OWNER= root
$$ XWIN-NMR		Version 3.5
$$ Tue May 28 15:23:19 2019 Russian Standard Time (UT+4h)  she@DPX200
##.OBSERVE FREQUENCY= 200.1315
##.OBSERVE NUCLEUS= ^1H
##.DELAY= (6, 6)
##.ACQUISITION MODE= SIMULTANEOUS
##.ACQUISITION SCHEME= undefined
##.AVERAGES= 8
##.DIGITISER RES= 18
##SPECTROMETER/DATA SYSTEM= spect
##.PULSE SEQUENCE= zg30
##.SOLVENT NAME= CDCl3
##.SHIFT REFERENCE= (INTERNAL, CDCl3, 0, 15.7039)
##AUDIT TRAIL= $$ (NUMBER, WHEN, WHO, WHERE, WHAT)
$$ ##TITLE= Audit trail, XWIN-NMR		Version 3.5
$$ ##JCAMPDX= 5.01
$$ ##ORIGIN= Bruker BioSpin GmbH
$$ ##OWNER= she
$$ F:/spectra/data/she/nmr/H-F/1/audita.txt
$$ ##AUDIT TRAIL=  $$ (NUMBER, WHEN, WHO, WHERE, WHAT)
(   1,<2019-05-28 15:22:17.64 +0400>,<she>,<DPX200>,
      <created by zg, POWCHK disabled, PULCHK disabled
       configuration hash MD5:
       00 E9 B6 7A A2 85 ED C7 34 08 36 98 17 FE 4E 26
       data hash MD5: 16K
       3C 07 52 50 8D 03 AF 7E E3 E1 DD 92 78 D6 53 2C>)
$$ ##END=
$$ 
$$ hash MD5
$$ 61 E9 1A 34 39 7E A8 62 23 C5 2E 41 A4 1B DC 20
##$RELAX= 
##$RELAX= 
##$RELAX= 
##$RELAX= 
##$RELAX= 
##$RELAX= 
$$ Bruker specific parameters
$$ --------------------------
##$DU= <F:/spectra>
##$EXPNO= 1
##$NAME= <H-F>
##$PROCNO= 1
##$TYPE= <nmr>
##$USER= <she>
##$AMP= (0..31)
100 100 100 100 100 100 100 100 100 100 100 100 100 100 100 100 100 100 
100 100 100 100 100 100 100 100 100 100 100 100 100 100 
##$AQSEQ= 0
##$AQ_mod= 1
##$AUNM= <au_zg>
##$AUTOPOS= <>
##$BF1= 200.13
##$BF2= 200.13
##$BF3= 200.13
##$BF4= 200.13
##$BF5= 200.13
##$BF6= 200.13
##$BF7= 200.13
##$BF8= 200.13
##$BYTORDA= 1
##$CFDGTYP= 0
##$CFRGTYP= 5
##$CHEMSTR= <none>
##$CNST= (0..31)
1 1 145 1 1 1 1 1 1 1 1 1 1 1 1 1 1 1 1 1 1 1 1 1 1 1 1 1 1 1 1 1 
##$CPDPRG= <>
##$CPDPRG1= <>
##$CPDPRG2= <>
##$CPDPRG3= <>
##$CPDPRG4= <mlev>
##$CPDPRG5= <mlev>
##$CPDPRG6= <mlev>
##$CPDPRG7= <mlev>
##$CPDPRG8= <mlev>
##$CPDPRGB= <>
##$CPDPRGT= <>
##$D= (0..31)
0 1.2 0 0 0 0 0 0 0 0 0 0.03 0 0 0 0 0 0 0 0 0 0 0 0 0 0 0 0 0 0 0 0 
##$DATE= 1559042536
##$DBL= (0..7)
120 120 120 120 120 120 120 120 
##$DBP= (0..7)
150 150 150 150 150 150 150 150 
##$DBP07= 0
##$DBPNAM0= <>
##$DBPNAM1= <>
##$DBPNAM2= <>
##$DBPNAM3= <>
##$DBPNAM4= <>
##$DBPNAM5= <>
##$DBPNAM6= <>
##$DBPNAM7= <>
##$DBPOAL= (0..7)
0.5 0.5 0.5 0.5 0.5 0.5 0.5 0.5 
##$DBPOFFS= (0..7)
0 0 0 0 0 0 0 0 
##$DE= 6
##$DECBNUC= <off>
##$DECIM= 24
##$DECNUC= <off>
##$DECSTAT= 4
##$DIGMOD= 1
##$DIGTYP= 9
##$DL= (0..7)
0 120 120 120 120 120 120 120 
##$DP= (0..7)
150 150 150 150 150 150 150 150 
##$DP07= 0
##$DPNAME0= <>
##$DPNAME1= <>
##$DPNAME2= <>
##$DPNAME3= <>
##$DPNAME4= <>
##$DPNAME5= <>
##$DPNAME6= <>
##$DPNAME7= <>
##$DPOAL= (0..7)
0.5 0.5 0.5 0.5 0.5 0.5 0.5 0.5 
##$DPOFFS= (0..7)
0 0 0 0 0 0 0 0 
##$DQDMODE= 0
##$DR= 18
##$DS= 0
##$DSLIST= <SSSSSSSSSSSSSSS>
##$DSPFIRM= 0
$$ [...]
##$SUBNAM2= <"">
##$SUBNAM3= <"">
##$SUBNAM4= <"">
##$SUBNAM5= <"">
##$SUBNAM6= <"">
##$SUBNAM7= <"">
##$SUBNAM8= <"">
##$SUBNAM9= <"">
##$SW= 24.9337058887773
##$SWIBOX= (0..15)
0 0 2 0 0 0 0 0 0 0 0 0 0 0 0 0 
##$SW_h= 4990.01996007984
##$TD= 16384
##$TD0= 1
##$TE= 0
##$TE2= 300
##$TE3= 300
##$TEG= 300
##$TL= (0..7)
0 120 120 120 120 120 120 120 
##$TP= (0..7)
150 150 150 150 150 150 150 150 
##$TP07= 0
##$TPNAME0= <>
##$TPNAME1= <>
##$TPNAME2= <>
##$TPNAME3= <>
##$TPNAME4= <>
##$TPNAME5= <>
##$TPNAME6= <>
##$TPNAME7= <>
##$TPOAL= (0..7)
0.5 0.5 0.5 0.5 0.5 0.5 0.5 0.5 
##$TPOFFS= (0..7)
0 0 0 0 0 0 0 0 
##$TUNHIN= 0
##$TUNHOUT= 0
##$TUNXOUT= 0
##$USERA1= <user>
##$USERA2= <user>
##$USERA3= <user>
##$USERA4= <user>
##$USERA5= <user>
##$V9= 5
##$VALIST= <valist>
##$VCLIST= <CCCCCCCCCCCCCCC>
##$VD= 0
##$VDLIST= <DDDDDDDDDDDDDDD>
##$VPLIST= <PPPPPPPPPPPPPPP>
##$VTLIST= <TTTTTTTTTTTTTTT>
##$WBST= 1024
##$WBSW= 4
##$XGAIN= (0..3)
0 0 0 0 
##$XL= 0
##$YL= 0
##$YMAX_a= 51263
##$YMIN_a= -63416
##$ZGOPTNS= <>
##$ZL1= 120
##$ZL2= 120
##$ZL3= 120
##$ZL4= 120
##$ABSF1= 10
##$ABSF2= 0
##$ABSG= 5
##$ABSL= 3
##$ALPHA= 0
##$AQORDER= 0
##$ASSFAC= 0
##$ASSFACI= 0
##$ASSFACX= 0
##$ASSWID= 0
##$AUNMP= <proc_1d>
##$AZFE= 0.1
##$AZFW= 0.1
##$BCFW= 1
##$BC_mod= 2
##$BYTORDP= 1
##$COROFFS= 0
##$CY= 11.3945322036743
##$DATMOD= 1
##$DC= 2
##$DFILT= <>
##$DTYPP= 0
##$F1P= 18.9103706918063
##$F2P= -1.10871071338519
##$FCOR= 0.5
##$FTSIZE= 0
##$FT_mod= 4
##$GAMMA= 1
##$GB= 0.15
##$INTBC= 1
##$INTSCL= 1
##$ISEN= 128
##$LB= 0.24
##$LEV0= 0
##$LPBIN= 0
##$MAXI= 10000
##$MC2= 0
##$MEAN= 0
##$ME_mod= 0
##$MI= 1.114404
##$NCOEF= 0
##$NC_proc= 0
##$NLEV= 6
##$NOISF1= 3.799351
##$NOISF2= 2.8
##$NSP= 1
##$NTH_PI= 0
##$NZP= 0
##$OFFSET= 15.70392
##$PC= 1
##$PHC0= -8930.715
##$PHC1= 9.00025
##$PH_mod= 1
##$PKNL= yes
##$PPARMOD= 0
##$PSCAL= 0
##$PSIGN= 0
##$REVERSE= no
##$SF= 200.130013532006
##$SI= 16384
##$SIGF1= 3
##$SIGF2= 2
##$SINO= 400
##$SIOLD= 16384
##$SREGLST= <1H.CDCl3>
##$SSB= 0
##$STSI= 0
##$STSR= 0
##$SW_p= 3612.71676300578
##$SYMM= 0
##$S_DEV= 0
##$TDeff= 0
##$TDoff= 0
##$TI= <>
##$TILT= no
##$TM1= 0
##$TM2= 0
##$TOPLEV= 0
##$USERP1= <user>
##$USERP2= <user>
##$USERP3= <user>
##$USERP4= <user>
##$USERP5= <user>
##$WDW= 1
##$XDIM= 8192
##$YMAX_p= 0
##$YMIN_p= 0
$$ End of Bruker specific parameters
$$ ---------------------------------
##NTUPLES= NMR FID
##VAR_NAME=  TIME,          FID/REAL,        FID/IMAG
##SYMBOL=    X,             R,               I
##VAR_TYPE=  INDEPENDENT,   DEPENDENT,       DEPENDENT
##VAR_FORM=  AFFN,          ASDF,            ASDF
##VAR_DIM=   8192,          8192,            8192
##UNITS=     SECONDS,       ARBITRARY UNITS, ARBITRARY UNITS
##FACTOR=    0.0002004,     1,               1
##FIRST=     0,             0,               0
##LAST=      1.6414764,     0,               0
##MIN=       0,             -63416,          0
##MAX=       1.6414764,     51263,           0
$$ Real data points
##PAGE= N=1
##DATA TABLE= (X++(R..R)), XYDATA
0 0 0 0 0 0 0 0 0 0 0 0 0 0 0 0 0 0 0 4 -8 8 -8 8 -8 8 -8 13 -16 16 -16 20 -24 24 -27 31 -32 37 -40 45 -51 55 -61
41 -61 69 -77 85 -93 103 -116 130 -147 166 -190 219 -259 309 -379 481 -643 931 -1538 3282 -17415
61 -17415 -63416 18588 23135 -37552 16728 50543 -27754 -32460 22657 -2828 -17739 24205 8835
74 8835 -22363 3403 7759 -9743 11692 10074 -23977 -9297 16433 -179 735 19770 -2160
87 -2160 -28327 -10651 12978 10386 2018 8304 7996 -20743 -26986 16991 24056 -15789 -253 25757
101 25757 -21769 -30007 32318 16561 -33451 6278 23579 -26696 -5626 36097 -8344 -24346
113 -24346 14337 -5690 -18598 28658 16296 -24771 4904 6304 -34385 5691 42020 -13039
125 -13039 -19387 26109 -9292 -36084 22974 27547 -24300 -5360 21724 -12687 -16119 18473 9050
138 9050 -14533 -4819 5433 1908 677 2581 3834 -4334 -13387 445 13289 987 -1705 5959
152 5959 -7515 -11694 6103 4575 -490 9654 -3338 -15470 8025 7149 -14813 8229 17304
165 17304 -21990 -10152 28006 -4633 -22861 20822 9150 -30700 5369 27195 -15301 -10774
177 -10774 20133 -7325 -18753 15327 9206 -11924 4658 4092 -13032 2763 10069 -7347 354
190 354 8820 -9768 -6098 12667 137 -9212 5917 3409 -9216 109 8521 178 -5229 -1932
204 -1932 2724 1454 -3906 2249 7789 -7174 -9742 10597 5256 -11582 4660 10212 -13647 -6127
218 -6127 15025 -1325 -8523 9708 -390 -13170 6376 7675 -8063 3602 6150 -12614 -997
231 -997 13341 -6287 -6006 12697 -4093 -14419 10938 9268 -11959 1119 9309 -10648 -6170
244 -6170 12729 2753 -6944 2077 163 -6167 1378 5508 1280 -415 -2801 -3372 1201 1453 765 3734
260 3734 -739 -6098 -348 2907 283 2892 1093 -5626 -1436 2572 -1403 3258 5577 -6589 -5743
275 -5743 5848 -848 -4005 9488 2946 -12432 -584 7403 -5017 137 10495 -4335 -10101
288 -10101 4671 2875 -4216 5336 4079 -7875 -2368 3959 -2025 1471 6282 -3446 -5956 2206
302 2206 438 -1249 5448 2124 -6273 -2466 2288 -3 1427 3493 -828 -4031 -2173 926 2898
317 2898 1828 -31 -355 -3010 -3839 2813 5239 -766 -1300 513 -4232 -2497 5587 2860 -2425 836
333 836 -1044 -5414 1536 5567 -710 -579 1477 -4768 -3218 5663 2706 -2448 1391 -741 -5756 1155
349 1155 5860 -356 -1211 1390 -3432 -3774 3527 3836 -274 10 -1424 -4062 -366 3733 2388 385
365 385 -1120 -3042 -1971 1326 2726 2101 -61 -2516 -2494 -627 1513 3350 1844 -2313 -3040 -1076
381 -1076 -11 2549 3953 -568 -3928 -1536 -337 181 3806 3004 -2779 -3328 -683 -746 1729 4705
397 4705 499 -4001 -2176 -616 226 3681 3136 -2228 -3394 -1114 -432 1725 3944 872 -3010 -2607
413 -2607 -1125 613 3299 2922 -1036 -3344 -2450 -101 2552 3161 832 -2039 -3201 -1666 1558 3053
429 3053 1866 -195 -2506 -3325 -330 3007 2714 839 -1245 -3555 -2368 2059 3343 1365 -167 -2244
445 -2244 -3450 -172 3144 2230 603 -805 -3211 -2420 1707 3072 1579 45 -2350 -3348 -91 2864
461 2864 2226 753 -1155 -3070 -1637 1614 2326 1499 159 -2266 -2681 48 2013 2107 1191 -1392 -3035
478 -3035 -1027 1372 1968 1848 -165 -2799 -1831 723 1270 1674 1377 -1575 -2749 -354 1026 1302 1950
495 1950 -43 -2823 -1536 796 1115 1715 1015 -2050 -2199 364 818 947 1678 -503 -2501 -603 792
512 792 512 1478 836 -1983 -1769 456 908 1254 1012 -1300 -1854 -68 517 1029 1645 -570 -2064 -220
530 -220 249 -136 1802 1216 -2038 -1260 727 -212 657 1840 -1116 -2122 719 709 28 1572 -266 -2762
548 -2762 -48 1448 -257 1335 1738 -2566 -2455 1312 498 114 2588 87 -3414 -679 1356 31
564 31 997 1089 -1707 -1243 912 382 587 809 -1677 -1651 957 780 817 1976 -967 -3586 -792 1218 1101
583 1101 2513 1178 -2727 -2332 -305 -29 2131 2554 -1311 -1593 375 -1506 -362 3530 20 -3474
599 -3474 834 1501 -1546 1939 2631 -3890 -3262 2108 877 812 3745 -538 -4651 -1250 78 -56 4065
616 4065 3031 -2912 -2181 -325 -2347 1073 4756 -390 -2999 808 -34 -1524 2037 1394 -2664 -1319
632 -1319 956 812 1994 1216 -2027 -2144 -1626 -1083 3516 4676 -1038 -2612 -925 -3312 -1213 5205
648 5205 2964 -1888 -196 -991 -3487 928 3107 -556 37 687 -2540 242 3575 -1411 -2449 1547
664 1547 -1602 -2098 5305 3241 -4286 -1333 566 -3962 304 6325 1200 -2348 -106 -2537 -3062 2532
680 2532 2883 221 958 -1362 -3302 1244 1876 -1731 740 1666 -2841 -523 3782 -300 -2327 702
696 702 -1116 -2060 2423 2688 11 -106 -2346 -3180 1530 2077 -208 2587 975 -5086 -1306 3467 -1295
713 -1295 -804 4379 -718 -4426 1759 1890 -2363 967 1577 -2720 -54 2511 -868 194 1353 -3167
729 -3167 -1392 3455 -364 -1323 3604 -464 -4995 1153 2690 -2161 962 3219 -2507 -2462 1777 2
745 2 -503 1679 -587 -1098 1254 -904 -1028 2621 -348 -2949 1984 1396 -3066 1167 3057 -2979 -1759
762 -1759 2826 -574 -1395 2355 -144 -2035 1177 -91 -1385 2110 338 -2493 1777 1167 -3575 975
778 975 3610 -2881 -1679 3725 -1026 -3025 2937 1095 -3096 1051 1770 -2047 107 1351 -1381 479
794 479 1339 -2025 27 2241 -1920 -984 3071 -960 -2646 2575 794 -3104 1213 2228 -2125 -444
810 -444 1574 -1219 -225 1531 -1007 -302 1366 -1568 -562 2606 -1150 -2104 2802 303 -3339 1832
826 1832 2379 -3024 -358 2572 -1857 -1091 2891 -310 -1802 1180 -549 -1398 2071 420 -1676 1727
842 1727 368 -3226 935 2468 -2164 -93 3023 -1790 -2269 2473 264 -2231 1256 1024 -1374 776
858 776 820 -1419 109 255 -1471 1071 1820 -1338 99 1485 -2474 -1743 2634 501 -1152 1949 312
875 312 -2735 111 900 -1227 862 1634 -1002 78 760 -2096 -479 1991 -1130 -762 2982 15
891 15 -2477 1171 180 -3027 954 2944 -862 -212 1579 -1759 -1968 1052 15 -93 2293 358 -1639
908 -1639 255 -588 -1951 1207 1708 -943 708 1676 -1822 -1705 816 -483 -458 2075 939 -782 83
925 83 -784 -1657 291 617 176 1807 745 -1890 -531 224 -1686 135 2388 39 -402 1365 -962
942 -962 -2414 386 620 -453 1624 1400 -1216 -450 -70 -1931 -179 2064 230 93 1426 -1116 -2203
959 -2203 632 407 -1013 1307 1717 -880 -430 343 -1440 -867 1150 449 235 1188 -115 -1204 -371
976 -371 -709 -624 1393 1340 -160 116 -332 -1659 -385 888 70 518 1171 -441 -981 -17 -513 -422 976
995 976 357 -378 797 248 -1214 -203 128 -908 515 1689 -175 -619 404 -906 -1272 851 880
1012 880 -122 770 308 -1463 -591 606 -114 245 894 -319 -555 436 -158 -624 381 211 -401 419
1030 419 476 -370 -32 68 -720 -210 635 322 302 241 -730 -650 260 114 149 714 -86 -694 105 -31 -501 546
1052 546 663 -646 -267 432 -353 -110 772 -305 -828 455 347 -409 378 308 -795 -170 527 -265 -1
1071 -1 742 -226 -728 148 89 -140 567 281 -667 -267 285 -33 132 353 -173 -301 0 -70 47 300 65
1092 65 -86 -117 -335 37 513 -5 -293 135 -156 -272 505 227 -577 69 308 -512 11 702 -240 -392 401
1113 401 -316 -627 712 536 -648 -27 287 -655 -27 835 -229 -512 513 -18 -674 324 448 -399 -33
1132 -33 305 -382 -180 530 111 -361 -55 45 -56 144 208 -24 -203 -94 134 -9 -134 271 259 -433 -209
1153 -209 353 -148 -130 598 -132 -768 390 485 -616 90 658 -624 -366 826 -221 -689 774 280 -1007
1172 -1007 178 685 -610 -39 814 -552 -667 782 166 -688 377 382 -657 -43 538 -309 -249 498 20
1191 20 -516 24 318 -39 -116 140 0 -320 37 464 -146 -464 402 257 -672 103 725 -501 -326 855
1211 855 -334 -919 937 537 -1151 246 899 -1024 -263 1339 -555 -1014 1212 220 -1373 614 907
1228 907 -1155 -62 1132 -803 -699 1252 4 -1111 546 492 -859 169 796 -544 -418 614
1244 614 -14 -565 182 429 -158 -274 159 120 -370 -11 645 -227 -719 619 464 -986 126 983 -858
1263 -858 -495 1354 -360 -1247 1300 542 -1747 493 1369 -1436 -263 1856 -982 -1408 1822 211
1279 211 -1890 1071 1188 -1803 33 1677 -1202 -868 1773 -199 -1542 976 642 -1248 299 968
1295 968 -888 -410 917 -150 -652 373 311 -348 -146 241 69 -291 -10 511 -281 -680 740 507 -1137
1314 -1137 144 1130 -1081 -575 1735 -432 -1594 1565 646 -2245 655 1866 -1795 -489 2305 -1149
1330 -1149 -1784 2258 336 -2343 1304 1464 -2211 115 2051 -1587 -978 2221 -433 -1776 1560 682
1346 682 -1797 538 1193 -1366 -276 1485 -423 -928 692 204 -691 114 437 -48 -246 -13 302 -229
1364 -229 -604 644 627 -1070 -79 1177 -833 -757 1592 -231 -1663 1414 807 -2126 573 1848 -1864
1381 -1864 -561 2403 -1137 -1754 2446 178 -2701 1509 1726 -2473 187 2377 -1955 -1332 2593 -336
1397 -336 -1963 1861 789 -2244 456 1318 -1484 -64 1742 -656 -945 906 -169 -879 537 340
1413 340 -350 310 256 -269 -269 -376 90 439 -318 199 1011 -715 -1004 890 -349 -1274 1725 1267 -1895
1432 -1895 210 1443 -2176 -898 2576 -489 -1446 2466 295 -2999 834 1446 -2308 409 2827
1447 2827 -1346 -1094 2153 -1146 -2546 1806 1084 -1542 1478 1602 -2301 -888 1237 -1206 -598 2286
1463 2286 619 -1012 346 -368 -1544 34 812 291 630 437 -252 -422 -1032 -760 743 489 143 1385
1481 1385 171 -1808 -235 153 -1556 715 2575 -414 -652 1184 -1700 -2378 1756 1003 -1298 1975
1497 1975 1733 -2744 -928 1385 -1921 -754 3332 429 -1642 1579 -35 -3211 143 1655 -937
1512 -937 923 2588 -1099 -1889 354 -954 -1166 1816 1527 -204 509 -209 -1978 -837 479 334 1041
1529 1041 1121 -114 -418 -790 -1321 -138 605 263 1348 1202 -1241 -1021 134 -1429 -581 2314 866
1546 866 -653 1218 -360 -2997 -49 1525 -812 829 2526 -1148 -1784 939 -972 -1850 2018 1629
1562 1629 -1136 823 920 -2403 -970 1351 -704 -174 2434 343 -1500 160 -529 -1694 720 1551
1578 1551 -7 479 558 -1260 -1045 23 -181 550 1261 130 -248 -93 -1020 -595 547 -62 203 1354
1596 1354 -20 -1034 195 -469 -1226 921 1166 -633 523 915 -1635 -1001 1055 -416 -364 1894 173
1613 173 -1607 516 267 -1599 437 1453 -780 -61 1265 -960 -1133 1008 -61 -886 1076 606
1629 606 -923 337 359 -1207 -75 948 -256 46 755 -540 -607 446 -240 -321 779 141 -450 318
1647 318 -170 -655 545 330 -616 341 429 -731 108 577 -759 -152 936 -432 -536 858 -194 -826
1665 -826 740 219 -925 576 641 -1028 -66 796 -643 -143 1048 -462 -773 776 -48 -806 715
1682 715 449 -773 285 422 -903 -18 816 -397 -189 706 -337 -475 582 -161 -599 596 297 -476
1700 -476 347 167 -700 130 405 -473 142 684 -381 -261 348 -501 -323 761 20 -429 535 -14 -747
1719 -747 315 223 -634 398 657 -612 -132 551 -579 -323 750 -222 -433 807 27 -847 330 231
1737 231 -698 370 661 -629 -68 648 -558 -427 665 -94 -366 660 22 -712 303 285 -562 186
1755 186 449 -380 64 411 -464 -242 466 -137 -184 406 -124 -292 372 -71 -429 350 157 -379 273 125
1775 125 -549 201 427 -532 -33 559 -395 -233 590 -331 -490 692 58 -696 398 306 -685 213 529 -650
1795 -650 -80 725 -414 -441 611 -86 -455 572 108 -637 293 342 -534 62 421 -336 -30 391 -328 -213
1815 -213 416 -105 -197 326 -70 -195 348 -88 -385 312 123 -302 314 147 -511 177 340 -524 2 588
1835 588 -321 -215 524 -328 -490 618 87 -609 416 320 -633 135 415 -587 -62 665 -307 -351 515 -122
1855 -122 -431 416 18 -458 362 273 -447 82 227 -358 116 333 -352 -3 404 -301 -163 365 -242 -186 535
1876 535 -154 -446 471 89 -525 359 243 -592 246 529 -616 -133 644 -363 -354 619 -151 -534 593 149
1896 149 -701 283 387 -549 79 442 -448 -124 501 -289 -298 414 -73 -256 322 -109 -335 342 54 -347 249
1917 249 63 -359 308 165 -533 221 418 -533 0 555 -492 -179 765 -353 -592 755 67 -783 555
1936 555 368 -871 280 750 -803 -189 942 -425 -548 793 -83 -714 667 287 -847 241 561
1953 561 -598 -22 563 -434 -220 560 -219 -345 413 -15 -282 264 -95 -268 356 -2 -327 286 -25 -405
1973 -405 413 126 -611 316 420 -717 63 693 -622 -180 919 -509 -732 977 67 -949 720 429
1991 429 -1150 339 908 -977 -187 1176 -574 -735 991 -103 -921 840 381 -1055 343 740 -796
2008 -796 -95 729 -544 -329 770 -170 -480 522 -34 -526 282 77 -291 418 114 -492 126 23 -394
2027 -394 433 281 -573 256 383 -796 -16 741 -593 -189 1004 -473 -745 1010 -11 -1147 710
2044 710 554 -1090 528 1071 -1186 -419 1146 -706 -692 1454 75 -1083 806 190 -1433 450 1128
2061 1128 -775 19 969 -793 -646 873 -223 -612 836 246 -642 360 125 -697 152 261 -406 355
2079 355 506 -331 4 -36 -781 100 734 -235 199 663 -814 -646 670 -360 -467 1300 222 -1160
2097 -1160 514 319 -1343 378 1180 -1009 -141 1484 -707 -1037 1096 -260 -1298 1185 851 -1151
2113 -1151 506 877 -1538 -541 1185 -377 -210 1431 -231 -1298 412 77 -826 705 829 -526
2129 -526 72 314 -786 -237 502 -193 71 533 -236 -74 301 -630 -403 532 -145 28 1004 -265 -946
2148 -946 453 -184 -993 943 965 -896 205 678 -1462 -473 1490 -361 -678 1398 -98 -1480 833
2165 833 515 -1464 496 1298 -1071 -216 1366 -783 -979 1081 -160 -987 1176 730 -1101 116 447
2182 447 -1027 -3 1067 -240 -200 627 -441 -650 349 15 -106 556 -40 -406 257 -141 -371 456 -37
2201 -37 -509 607 248 -788 322 414 -955 103 931 -703 -217 1140 -622 -1013 1021 82 -1031
2218 -1031 977 637 -1421 202 1069 -1102 -297 1398 -536 -875 1142 -74 -1175 867 595 -1129
2234 -1129 259 820 -841 -102 920 -547 -467 835 -151 -601 569 110 -541 360 166 -518 216 289
2252 289 -361 119 185 -402 185 304 -487 104 457 -525 -103 607 -488 -313 885 -240 -801 706 163
2271 163 -910 581 617 -1022 80 897 -824 -342 1134 -343 -765 873 -60 -1007 795 614 -1041
2288 -1041 142 712 -860 -127 1032 -405 -531 777 -167 -747 602 335 -566 275 253 -630 148 511
2306 511 -362 -58 266 -395 7 557 -201 -182 295 -398 -378 574 122 -182 477 -227 -895 290 408 -338
2326 -338 501 463 -907 -264 615 -496 -198 962 -204 -723 655 91 -811 485 407 -955 82 934
2344 934 -337 -113 608 -730 -802 719 325 -210 757 130 -1080 -202 244 -302 513 902 -405 -498 127
2363 127 -360 -154 656 63 -282 349 -2 -353 241 -58 -530 218 300 -123 529 407 -787 -511 53 -331
2383 -331 396 1190 -39 -699 -62 -560 -632 812 743 -254 230 53 -1023 -187 685 -216 -84 663 -226 -407
2403 -407 603 -68 -853 107 229 -266 630 744 -516 -495 -105 -639 -45 1049 482 -85 11 -692 -815 351
2423 351 521 126 465 88 -655 -124 153 -312 142 470 -236 -51 471 -162 -345 126 -372 -406 688 571
2443 571 -130 130 -265 -974 -64 646 112 361 539 -605 -768 113 -37 -14 753 205 -571 -9 78 -400
2463 -400 103 311 -291 36 468 -119 -150 191 -356 -392 322 187 62 490 -35 -691 -142 99 -93 474 491
2484 491 -374 -238 105 -379 -90 562 12 -211 312 -145 -479 301 217 -424 106 322 -285 41 378 -382
2504 -382 -344 328 -40 -200 371 75 -375 66 23 -339 127 332 -147 -47 98 -275 -73 220 -90 -66 222
2525 222 -72 -149 126 -126 -131 302 43 -223 168 7 -300 208 213 -290 101 285 -381 -129 421 -91 -180 377
2547 377 -152 -477 371 294 -376 114 239 -452 -46 481 -173 -189 354 -171 -430 327 277 -198 127 30 -499
2568 -499 -61 424 75 -3 76 -301 -294 137 146 114 159 -141 -291 -69 -10 162 313 -124 -336 1 -24 -13 416 87
2592 87 -495 -64 174 -205 242 532 -340 -463 176 -132 -119 726 254 -684 -152 120 -312 321 690 -331
2612 -331 -472 185 -148 -185 621 246 -510 -110 23 -279 296 564 -212 -435 -83 -120 91 495 138 -302 -283
2633 -283 -215 15 360 256 33 -149 -456 -261 371 336 56 117 -326 -605 230 540 -46 82 123 -633 -294
2654 -294 627 179 -130 379 -237 -809 255 637 -118 146 236 -761 -410 712 256 -154 328 -203 -758 164
2674 164 551 -36 144 174 -578 -430 377 295 134 154 -319 -509 19 289 270 193 -184 -388 -133 -24 184 478
2696 478 -3 -462 -144 -114 -124 571 441 -510 -338 122 -312 117 806 -133 -648 172 -66 -443 620 617 -615
2717 -615 -270 256 -458 -23 953 -6 -732 98 0 -393 524 601 -478 -315 156 -282 -13 642 108 -380
2737 -380 -92 -164 -157 410 363 -146 -221 -216 -145 229 264 57 -17 -290 -325 210 224 -48 259 1 -680 -92 548 -71
2761 -71 -47 460 -439 -687 535 367 -425 321 319 -802 -173 699 -167 -155 619 -311 -755 452 361 -359 338
2782 338 254 -745 -105 623 -161 -151 483 -211 -546 280 245 -202 194 169 -372 -178 180 109 104 -11 -200 -33
2804 -33 -4 -77 263 144 -360 -19 199 -314 -24 484 -173 -337 294 -116 -349 479 176 -569 175 333 -558
2825 -558 46 609 -484 -330 713 -194 -668 595 284 -724 223 535 -561 -127 619 -280 -376 507 59
2844 59 -342 237 46 -322 245 208 -288 69 156 -287 59 285 -201 -94 182 -160 -104 233 8 -35 34 -316
2866 -316 -89 396 -8 -91 332 -318 -640 436 375 -446 260 453 -758 -389 644 -96 -276 605 -83 -740
2886 -740 298 358 -377 194 232 -654 -9 661 -193 -145 442 -481 -699 561 451 -197 388 113 -914 -336
2906 -336 490 224 246 320 -343 -449 -50 -19 265 434 -207 -253 176 -179 -141 543 -43 -710 80 348 -44 425
2928 425 293 -788 -555 157 -9 462 887 -277 -780 -99 -404 -301 1095 708 -664 -180 82 -787 24
2947 24 981 -139 -530 388 10 -356 420 125 -659 -151 157 15 647 569 -550 -601 -269 -431 419 1255
2967 1255 300 -526 -316 -609 -517 613 764 131 70 -282 -632 20 279 -80 239 136 -491 164 730 -307
2987 -307 -549 114 -423 -357 1035 773 -448 -246 -368 -990 43 1053 452 198 67 -967 -794 425
3005 425 308 141 668 -73 -834 103 315 -462 56 430 -379 -98 675 113 -327 -100 -470 -430 518 645
3025 645 301 207 -547 -980 -45 396 193 679 458 -738 -578 100 -192 100 750 26 -426 151 -15 -275
3045 -275 246 -26 -519 270 469 -161 184 208 -831 -483 535 101 66 782 -91 -979 -169 150 -164 488
3065 488 584 -385 -332 49 -299 -27 431 -87 -151 321 -117 -279 330 0 -496 148 280 -146 261 285 -479
3086 -479 -318 151 -65 169 460 -156 -270 121 -273 -213 519 131 -334 245 71 -539 193 450 -421 -141
3106 -141 457 -186 -221 407 -133 -438 280 132 -294 261 161 -442 28 260 -306 58 456 -313 -336 322 -41
3127 -41 -216 372 76 -440 74 198 -176 83 179 -210 -19 149 -168 59 221 -247 -112 274 -85 -42 384
3148 384 -143 -473 175 172 -132 328 200 -470 -113 188 -211 141 497 -205 -282 229 -187 -230 538 135 -514
3169 -514 122 242 -351 119 412 -413 -323 360 13 -99 397 -26 -479 -32 38 -92 388 298 -320 -214 -44
3190 -44 -223 172 466 -97 -210 57 -170 -123 309 119 -171 54 -83 -164 289 180 -231 -15 -60 -304 290
3211 290 508 -206 -190 133 -335 -185 568 217 -250 118 -102 -511 176 470 -104 -3 106 -427 -145 471
3231 471 18 -195 188 -159 -359 309 274 -226 44 75 -414 -66 402 55 -57 60 -305 -234 268 167 12
3252 12 117 -203 -324 148 151 -62 227 70 -413 -88 231 -27 133 267 -291 -303 201 48 -10 304 -68 -380
3274 -380 106 126 -177 232 262 -353 -173 240 -107 -14 395 -115 -419 81 93 -86 244 125 -342 -96 91
3295 91 -135 135 287 -161 -188 53 -178 -37 377 49 -263 17 -30 -155 213 167 -211 -18 53 -211 81 279
3317 279 -138 -92 122 -237 -140 415 92 -254 85 -30 -303 205 331 -183 -41 155 -253 -106 310 9 -95
3338 -95 200 -121 -292 221 185 -158 80 57 -306 20 270 -98 -80 124 -158 -146 154 34 -25 134 -108 -236
3360 -236 95 68 -55 190 21 -327 23 186 -147 47 229 -216 -181 202 -75 -122 297 2 -318 112 94
3381 94 -185 194 223 -331 -97 274 -137 -86 334 -67 -289 184 65 -231 195 227 -252 -60 132 -130 37
3402 37 249 -105 -150 104 -57 -73 189 2 -162 81 -23 -161 129 114 -125 32 2 -195 96 186 -146 -35
3424 -35 120 -201 -58 259 -101 -185 244 -35 -296 216 179 -246 101 191 -330 -45 369 -127 -166 269 -83 -264
3446 -264 263 118 -282 131 198 -268 -37 250 -121 -71 222 -113 -180 198 71 -125 99 -1 -166 85 99
3467 99 -118 61 85 -149 -3 79 -101 63 138 -163 -70 121 -110 -21 220 -129 -193 239 -18 -282 190 136 -333
3490 -333 73 238 -277 -47 347 -164 -265 252 3 -214 248 93 -334 93 179 -252 31 298 -164 -104 243
3511 243 -133 -225 266 109 -217 101 110 -145 26 106 -115 -17 97 -18 47 51 -131 15 85 -172 -4 243 -44
3534 -44 -110 136 -129 -246 212 121 -173 140 107 -273 8 136 -253 19 337 -189 -189 309 -95 -341 257 105
3556 105 -364 202 370 -297 -161 241 -175 -188 325 93 -141 161 -11 -265 37 91 -64 186 138 -211 -20
3577 -20 120 -165 -51 193 -21 -29 148 -49 -145 13 -60 -25 159 0 -20 198 -123 -346 137 137 -209 193 312
3600 312 -340 -198 273 -172 -259 330 114 -238 134 56 -342 43 189 -214 48 296 -162 -97 221 -229 -283
3621 -283 313 137 -226 199 172 -324 -89 171 -108 -11 244 12 -105 -13 -90 -7 116 -68 12 230 -75 -181
3643 -181 145 -48 -235 202 186 -195 57 154 -223 -91 122 -131 25 264 -129 -174 203 -112 -246 286 77
3664 77 -325 179 250 -393 -106 317 -143 -182 290 -1 -250 136 39 -226 44 120 -98 82 46 -207 33 157
3686 157 -166 -23 219 -129 -123 191 -42 -176 159 69 -153 54 50 -86 109 32 -200 92 128 -204 56 206
3708 206 -245 -115 320 -88 -248 283 79 -341 71 176 -212 45 217 -200 -119 156 -95 -46 216 -115 -167
3729 -167 190 -41 -234 189 137 -253 40 155 -206 -27 234 -96 -130 100 -43 -31 147 -63 -97 144 -74
3750 -74 -146 234 63 -233 128 114 -300 51 326 -139 -132 196 -100 -161 252 49 -174 105 13 -217 108 144 -150
3773 -150 89 154 -293 -80 278 -65 -134 213 -55 -254 145 94 -183 36 77 -155 11 76 -96 46 63 -238
3795 -238 -43 200 -38 4 220 -180 -303 166 90 -120 216 147 -261 -72 70 -147 86 289 -97 -103 125 -123
3817 -123 -105 272 -35 -251 193 141 -195 106 169 -318 -133 195 -44 25 308 -26 -303 -83 -80 -22 333 186
3839 186 -141 -44 -116 -274 99 258 -58 31 118 -216 -155 173 -8 -118 72 -34 -64 231 63 -233 -66 -98
3861 -98 -167 261 364 -82 -74 -10 -395 -177 404 233 -6 144 -168 -434 49 233 -26 121 127 -225 -50 196
3883 196 -124 -67 147 -141 -135 315 160 -147 7 -150 -387 79 410 127 47 -30 -398 -263 160 148 173 226 -158
3906 -158 -313 -40 -27 -2 262 61 -261 -24 127 -55 48 55 -264 -128 218 113 104 150 -254 -355 51 94 98
3929 98 393 87 -430 -206 61 -53 230 380 -147 -283 54 -34 -51 265 62 -251 17 78 -72 182 168 -290
3951 -290 -211 115 16 132 318 -105 -386 -61 33 40 273 149 -206 -178 -87 -61 194 224 -85 -118 -66 -164 87 290
3975 290 -56 -201 6 -83 -33 284 95 -220 -64 -40 -158 196 264 -122 -126 -14 -215 28 388 27 -231 32
3997 32 -82 -172 261 275 -200 -105 66 -175 14 303 31 -162 -1 -109 -83 226 137 -145 -68 -51 -119 152 195
4020 195 -112 -129 -13 -103 34 212 21 -118 -86 -161 -35 222 109 -61 -28 -180 -199 209 216 -120 -25 20 -237
4043 -237 -10 289 -30 -156 78 -99 -166 256 186 -159 -39 -52 -213 138 359 -44 -148 24 -198 -95 322
4064 322 164 -148 -3 -45 -208 101 255 -1 -94 -63 -144 8 222 64 -74 -110 -184 -23 237 94 -66 -29
4086 -29 -187 -199 155 221 8 32 -114 -323 -12 263 58 16 31 -299 -179 264 140 -79 99 -88 -330 86
4108 86 311 -36 3 77 -303 -182 307 196 -33 44 -159 -315 124 300 48 22 -46 -277 -88 214 117 50 43
4131 43 -190 -216 92 189 107 64 -157 -257 -2 140 116 141 -104 -303 -48 106 36 178 118 -289 -218 94 22 71
4155 71 272 -99 -375 -17 118 -14 206 127 -319 -180 163 -7 39 273 -103 -324 23 89 -14 218 119 -284
4177 -284 -167 103 32 105 167 -117 -227 21 40 50 164 22 -177 -74 -22 12 178 113 -135 -98 -61 -38 164 168
4201 168 -115 -103 7 -121 21 234 -43 -151 41 -87 -160 192 179 -175 -42 18 -186 30 269 -60 -167
4222 -167 88 -63 -135 192 106 -162 31 53 -180 22 221 -23 -84 61 -83 -74 148 71 -61 8 -16 -67 56
4245 56 47 -25 53 6 -120 19 77 -45 40 81 -127 -66 120 -21 -48 112 -41 -131 86 17 -128 96 103 -172 -19
4270 -19 95 -141 -4 195 -92 -169 114 2 -144 120 99 -150 -8 70 -128 -14 177 -27 -73 32 -80 -39
4292 -39 160 49 -98 34 -15 -90 91 113 -46 20 20 -114 15 138 24 13 12 -140 -38 155 32 -25 82 -95
4316 -95 -148 135 89 -99 69 65 -205 -48 169 -29 -41 98 -128 -178 147 115 -73 54 -28 -208 32 163 -24
4339 -24 13 86 -160 -153 127 63 -12 101 -44 -198 12 96 22 46 -10 -115 14 100 7 39 26 -149 -55 136 39 64
4365 64 119 -120 -214 59 104 37 164 16 -228 -62 90 -43 66 148 -123 -102 119 -36 -70 123 -28 -205 58
4388 58 157 -46 40 33 -257 -152 160 122 50 100 -131 -247 -22 63 45 165 75 -159 -92 -5 -31 77 94 -102 -68
4413 -68 102 46 29 18 -155 -143 87 120 121 157 -83 -272 -84 23 56 279 220 -185 -196 -23 -72 52 276 20
4437 20 -165 50 34 -94 87 48 -187 -31 166 37 70 120 -221 -310 6 123 146 268 16 -343 -233 -27
4459 -27 36 191 217 -33 -164 -105 -80 41 147 27 -71 -9 -5 71 137 -59 -215 -82 25 124 294 137 -223 -230 -121
4484 -121 -64 220 376 53 -166 -139 -231 -72 307 212 -86 -35 -46 -161 85 203 -96 -127 63 -3 25 216 21
4507 21 -258 -138 -41 8 258 268 -87 -261 -174 -120 105 323 119 -92 -143 -167 -82 153 164 14 -44 -112 -86 108
4531 108 130 -23 -66 -116 -103 156 251 35 -84 -99 -197 -23 274 189 -9 -18 -162 -246 113 267 75 16 -45 -246
4555 -246 -57 229 101 -30 20 -110 -149 138 176 -22 -33 -52 -175 -11 228 88 -37 -74 -172 -123 157 177 15
4578 15 -37 -141 -162 43 154 72 15 -74 -182 -45 117 102 74 -2 -168 -129 84 92 69 72 -109 -167 75 121 19 75
4604 75 8 -172 -40 166 46 38 81 -138 -191 86 160 59 88 -48 -236 -48 138 49 80 83 -116 -137 39 24 6
4629 6 90 -6 -138 7 83 12 27 -37 -138 -27 103 63 59 1 -135 -119 42 41 81 119 -49 -161 -31 -10 2 128
4655 128 75 -123 -46 56 -39 32 81 -75 -58 114 32 -28 109 -7 -152 12 92 -12 92 104 -135 -120 45 29
4679 29 29 118 -2 -119 -9 9 -48 52 68 -60 -23 24 -52 12 63 -78 -52 35 6 25 58 -51 -104 14 7 -16 80
4706 80 24 -93 -2 -1 -79 50 113 -47 -45 46 -63 -38 112 5 -90 63 46 -72 44 64 -77 2 81 -56 -19 122
4732 122 4 -66 66 6 -46 88 52 -85 5 58 -56 1 52 -43 -30 75 -30 -48 45 1 -30 46 -17 -60 45 12
4758 12 -63 30 25 -54 4 22 -85 3 92 -40 -43 45 -43 -43 95 4 -81 48 33 -84 46 65 -75 -13 66 -70 -20 141
4786 141 18 -72 39 -22 -65 105 82 -75 4 22 -70 24 106 -16 -18 42 -66 -57 92 24 -52 18 -37 -81 77 67 -57
4813 -57 -21 -14 -88 24 108 -27 -30 19 -95 -61 104 43 -31 37 -62 -124 59 106 -24 4 4 -111 -6 130 -2 -23 63
4840 63 -73 -94 109 81 -20 66 -21 -151 36 137 15 21 28 -118 -42 128 63 -7 62 -67 -113 76 68 10 69 -14
4866 -14 -149 -15 91 33 42 20 -142 -81 98 37 16 53 -89 -142 34 43 -8 71 -11 -170 -48 71 21 57 78 -131
4892 -131 -121 81 48 18 96 -43 -148 20 71 8 88 65 -135 -81 73 25 50 119 -76 -135 37 65 45 100 11 -140
4918 -140 -30 49 2 95 76 -99 -91 19 -1 73 141 -54 -152 -7 14 33 140 8 -139 -48 29 -23 98 110 -96
4943 -96 -85 2 -43 41 156 -24 -158 -24 -20 -9 147 80 -130 -60 23 -31 81 152 -45 -91 5 -22 27 176 67 -105
4969 -105 -33 -8 -6 128 122 -84 -79 10 -29 66 140 -24 -88 -18 -54 -5 139 78 -80 -51 -54 -59 107 114 -53 -61 -13 -65 36
4998 36 125 -8 -79 -3 -58 -36 128 59 -69 -31 -56 -104 87 155 -33 -38 -12 -104 -6 154 31 -56 27 -34 -79 94 87
5025 87 -43 -7 15 -78 41 162 9 -49 -2 -64 0 163 69 -42 -7 -40 -82 73 112 -10 21 -19 -111 -13 103 25
5051 25 -4 8 -82 -58 77 42 -52 -7 -35 -81 70 74 -38 1 -39 -121 -16 113 35 0 23 -106 -100 84 67 -17 35 -15
5079 -15 -102 9 77 -38 6 48 -67 -48 100 18 -33 41 -52 -87 73 113 -4 14 -6 -99 4 104 31 30 40 -64
5105 -64 -78 27 28 3 59 -13 -87 9 46 -14 17 -2 -91 -10 73 -10 -17 25 -73 -74 41 12 1 54 -14 -122 -11 44 -12 51
5135 51 43 -94 -45 63 -7 -11 72 -17 -67 48 18 -38 52 47 -63 -23 53 1 36 61 -48 -38 58 28 7 59 -1 -61 31
5164 31 25 -21 42 59 -41 -21 16 -25 19 59 -38 -66 23 -10 -24 52 -10 -65 11 2 -63 15 40 -53 -27 30 -44 -9 65 -12 -45
5195 -45 31 -5 -23 55 30 -58 3 48 -41 3 74 -11 -8 50 -36 -39 67 28 -34 34 32 -36 43 43 -40 18 62 -32 -16 38 -19 -2
5227 -2 58 -1 -48 35 29 -34 30 21 -40 1 40 -37 -7 46 -20 -39 21 -26 -21 62 -3 -65 10 2 -36 33 38 -54 1 37 -35 9 63
5260 63 1 -23 26 -32 -40 76 50 -43 27 8 -54 32 67 -34 2 59 -21 -15 73 7 -48 40 3 -38 62 82 -50 -26 2
5289 2 -51 11 97 18 -26 17 -46 -65 33 23 -16 42 6 -72 -21 18 -31 3 4 -36 22 50 -36 -40 -8 -52 -25 86 43 -3 31
5320 31 -35 -111 22 77 11 61 46 -89 -49 60 -16 -17 99 12 -32 59 40 -79 32 64 -46 12 102 3 -34 21 -64
5347 -64 -57 69 79 9 34 -19 -94 -19 21 0 49 65 -37 -44 -21 -51 -6 43 -21 -11 43 -16 -28 11 -58 -61 73 44 -27 49
5377 49 12 -115 -19 48 -41 26 134 -28 -90 37 5 -61 86 79 -58 29 74 -67 -33 86 -14 -31 95 24 -59 35
5403 35 20 -85 1 72 1 27 38 -57 -48 12 13 12 24 -6 -3 -3 -44 1 44 -23 -5 43 -32 -40 65 -20 -91 37 50 -58 39
5434 39 61 -87 -49 96 -30 -50 109 14 -95 50 46 -98 41 105 -75 -62 93 -3 -35 87 15 -78 53 72 -46
5459 -46 16 59 -12 -14 38 11 6 44 -1 -36 2 23 30 26 -13 -25 0 -23 9 53 -28 -59 50 -32 -77 70 58 -82 2 43 -108
5490 -108 -9 109 -42 -88 86 14 -89 61 47 -117 -9 100 -63 -33 115 -20 -81 37 -1 -56 87 96 -51
5513 -51 -18 33 -43 9 74 16 -5 18 -6 -21 9 28 18 3 -25 8 48 -4 1 15 -47 -25 92 28 -52 36 19 -114 7
5542 7 84 -44 0 87 -71 -107 79 24 -66 61 40 -119 8 77 -72 -36 93 -37 -86 85 28 -66 39 32 -88
5567 -88 -2 87 20 -6 43 -28 -22 48 34 10 15 6 -9 -4 -10 37 41 3 -16 24 -31 -16 76 -2 -62 35 25 -45 52 66 -77 -18 70
5600 70 -40 -55 108 6 -100 12 9 -92 33 90 -74 -52 73 -31 -56 76 24 -74 31 25 -73 20 89 -24 -31
5625 -31 32 -7 -11 54 26 -31 6 23 12 24 14 8 23 -24 8 44 2 22 45 -15 -44 43 48 -24 26 42 -60 -11 81 -31 -39
5656 -39 97 -6 -92 46 42 -71 36 59 -96 -28 86 -28 -57 67 -13 -91 35 42 -62 14 52 -60 -33 49 -13
5681 -13 -19 41 -10 -59 10 40 -7 9 23 -16 4 11 1 11 10 1 26 4 -20 61 36 -30 28 18 -39 17 64 -44 -27 63 -15 -47
5713 -47 51 20 -52 24 36 -76 -5 73 -46 -53 55 -22 -57 46 11 -78 19 55 -47 -18 38 -29 -28 41 -23 -41 25 30 -38
5742 -38 3 15 -19 0 20 -16 -5 14 -3 -3 1 7 23 28 -2 2 17 -10 14 46 -11 -6 46 -10 -21 37 21 -34 24 25 -66 -6 46 -42
5776 -42 -27 43 -23 -51 46 8 -76 28 36 -51 -17 47 -48 -38 40 -38 -48 35 15 -55 10 5 -42 0 35 -19 -30 28 -11 -25 6
5807 6 9 13 15 -1 -27 -8 14 8 20 -3 -3 30 12 -21 18 15 -20 21 16 -26 17 39 -30 -27 32 1 5 60 2 -62 11 10 -43 19 48 -35
5843 -35 -29 39 -36 -58 43 4 -50 17 18 -37 -3 20 -51 -32 38 4 -31 32 -1 -50 4 11 -14 22 51 -20 -35 -12 -5 2 39 6
5875 6 -12 8 3 -7 11 -2 4 33 7 3 14 -7 -35 10 8 -4 44 49 -35 -27 10 -30 2 73 10 -27 32 -25 -75 8 24 -27 29 38
5909 38 -51 -40 25 -17 -59 38 23 -21 25 6 -65 -16 14 -27 16 66 -3 -30 -5 -39 -45 43 51 13 25 -5 -37 1 13 -3 38
5940 38 46 10 13 5 -25 -8 18 -9 3 51 12 -32 2 -26 -52 44 52 -19 11 0 -54 -36 28 -21 5 63 -8 -66 -9 -13 -55 27 31
5973 31 -42 6 40 -52 -33 5 -34 -24 50 1 -30 13 -13 -66 -13 25 1 47 34 -50 -42 18 -10 9 45 10 7 36 -20 -35 35
6004 35 17 -12 26 28 -19 29 25 -53 -8 46 -11 6 37 -36 -45 14 1 -35 46 24 -27 5 -4 -49 -6 49 -9 -18 22 -20 -39 28 -6
6037 -6 -35 34 8 -50 8 18 -35 20 28 -47 -20 30 -12 -21 33 -12 -3 38 -7 -24 44 20 -19 22 11 -24 27 42 -33 -7 41 2
6069 2 -1 52 -4 -27 21 -3 -27 39 48 -35 -8 -3 -49 -17 39 -7 -22 24 -24 -41 6 -4 -34 19 1 -49 -5 6 -27 -15 3 -58
6101 -58 -5 49 -2 -19 6 -39 -38 42 15 -3 37 -7 -72 -13 24 0 55 56 -44 -32 38 -11 0 45 6 -22 35 5 -25 29 33
6132 33 -29 -8 38 -2 30 35 -46 -47 10 5 15 48 0 -53 -8 -27 -22 42 28 -22 -9 -22 -57 -4 43 -20 -41 5 -31 -3 48 -1
6164 -1 -54 9 -15 -34 40 40 -24 -18 -12 -54 0 90 12 -24 -8 -33 -25 51 50 -13 -3 -2 -44 12 57 7 5 -4 -42 -23 37 36 12 3 -38 -34
6200 -34 29 35 3 9 -21 -57 -6 24 -9 29 13 -80 -56 24 1 11 21 -47 -70 8 16 -5 27 7 -72 -26 18 -2 19 46 -35 -57
6232 -57 7 13 15 42 7 -49 3 33 16 35 27 -23 -15 14 5 12 52 9 -37 -6 -1 32 63 14 -39 -18 -18 -4 39 32 -36 -18 -2 -49 -3
6267 -3 47 -12 -33 -4 -42 -38 56 16 -35 -15 -15 -50 12 39 -35 -26 16 -36 -27 37 8 -21 20 -16 -52 19 35 -8 -12 12 -21 10 35
6300 35 17 1 15 -10 -12 25 9 11 34 0 -34 2 10 -3 30 -7 -21 21 31 -29 11 33 -23 -12 18 -27 -12 48 4 -45 7 6
6332 6 -31 6 26 -41 -16 28 -22 -30 14 -2 -30 16 -8 -42 10 36 -19 3 18 -8 7 17 -1 3 27 -1 -11 7 6 4 45 14 -26
6365 -26 12 16 12 37 37 -17 4 21 -15 34 43 -14 -19 3 -13 -7 60 32 -41 -13 -7 -28 20 31 -24 -17 -8 -27 -16 33 12 -27 -8 -25 -34
6400 -34 41 50 -14 -42 -39 -36 7 50 13 -15 -1 -23 -16 27 51 7 -3 -39 -35 23 46 33 12 -18 -46 -2 46 30 36 1 -35 -28 25 40
6434 40 38 35 -9 -66 -2 44 34 20 2 -68 -45 17 33 26 35 -33 -71 -13 14 23 44 11 -65 -63 10 30 36 25 -44 -71 -10 26 24 25 -7
6469 -7 -55 -46 -3 20 60 27 -34 -51 -21 13 60 60 -9 -44 -18 11 31 73 33 -33 -34 -16 1 47 63 8 -28 -24 -1 43 70 30 -51
6502 -51 -51 -28 -17 40 56 -6 -34 -41 -33 8 61 20 -26 -37 -47 -15 54 45 -9 -44 -38 -32 22 54 6 -16 -28 -43 -14 46 51 -2 -21 -37
6536 -37 -42 30 75 35 -1 -11 -31 13 50 28 24 14 -30 -37 30 57 15 22 -9 -33 6 59 26 14 -10 -40 -29 22 19 13 2 -25 -56
6569 -56 -13 4 25 28 -1 -43 -32 -4 10 11 -3 -29 -26 4 -6 4 7 -13 -23 11 -7 -6 36 6 -36 -22 6 0 22 34 -2 -25 10
6602 10 3 -4 20 20 -2 11 16 -14 20 46 2 3 22 -3 4 32 0 -8 28 18 -13 1 19 4 2 11 -12 -14 1 -1 -5 9 -7 -16 -4 -20 -27
6639 -27 11 8 -18 -8 -9 -5 10 32 -25 -21 -5 -33 4 36 3 -3 8 -21 -21 32 25 0 18 2 -29 2 62 24 12 5 1 -17 45 42 12
6674 12 19 3 -36 3 54 23 9 -6 -40 -17 47 39 0 -4 -33 -39 6 26 15 20 -20 -44 -39 9 26 32 0 -58 -43 -1 -3 25 22 -32 -61
6709 -61 -8 3 -7 56 10 -51 -35 -6 1 50 51 -22 -39 -14 -3 28 74 19 -53 -19 14 1 49 67 -4 -36 1 -9 31 75 30
6740 30 -50 -50 -15 21 60 34 -22 -41 -38 -14 28 55 16 -12 -36 -30 7 44 25 -15 -52 -74 -22 39 30 -14 -18 -54 -64 20 63 10 14
6773 14 -16 -67 -35 53 45 16 11 -48 -53 12 47 14 18 -1 -42 -14 51 45 30 26 -32 -48 29 70 54 28 -29 -68 -29 33 55 44 10
6806 10 -42 -45 -14 10 42 42 -41 -54 -28 -17 10 51 -3 -62 -25 0 2 39 25 -57 -44 -17 -21 37 55 -24 -72 -24 -26 -11 75 52 -56
6839 -56 -37 -15 -17 33 65 13 -28 0 -4 12 47 32 -7 -12 -17 12 53 47 9 -22 -35 -6 40 56 24 -4 -29 -33 -11 38 21 13 -6 -49
6873 -49 -38 27 34 0 1 -22 -71 2 25 -17 -26 -3 -39 -38 19 1 -20 12 -22 -54 0 24 6 5 7 -30 -11 43 15 -14 8 -9 -26
6906 -26 6 25 18 17 -1 -11 1 9 21 14 0 -26 2 14 -11 12 15 0 -2 20 -8 -11 16 0 -21 10 8 -6 5 7 -46 -22 22 -12 -18
6941 -18 3 -25 -47 12 5 -43 -1 -4 -29 -13 25 -24 -17 4 -19 -11 22 12 -10 -6 -16 -17 21 46 7 -7 -11 -20 3 34 16 18 2 -17 -7
6976 -7 30 17 3 10 -34 -15 34 37 6 9 -15 -39 8 50 10 17 17 -39 -42 17 16 19 25 -31 -74 -23 28 15 5 -20 -67 -37 16 7 3 10 -37
7013 -37 -57 -19 22 19 27 -7 -48 -35 23 47 44 11 -41 -45 -1 37 61 40 -11 -27 -20 -2 38 67 21 -33 -22 -7 16 61 34 -34 -41
7046 -41 -19 -2 26 59 -1 -32 -13 -5 7 61 39 -39 -59 -37 -17 32 65 -8 -68 -36 -18 -5 21 23 -23 -40 -26 -14 21 44 3
7077 3 -36 -35 -36 11 48 23 -30 -44 -32 -6 42 50 13 -23 -19 -34 25 51 40 12 -33 -53 20 45 26 10 -1 -36 -11 30 43 -2 3
7110 3 -13 -47 -8 33 4 13 -4 -49 -45 20 27 7 -9 -27 -62 -12 33 6 -7 -15 -35 -33 17 23 12 -4 -20 -46 -11 23 18 -3 -7 -29 -25
7145 -25 14 20 8 13 7 -1 11 23 27 36 13 -19 -8 21 24 21 8 -20 6 16 6 0 27 -9 -13 7 -10 -3 17 17 -34 -28 -7 -16 -4 -3 -30 -35
7183 -35 -5 -8 -15 9 -1 -19 -10 4 -17 0 14 -3 -22 -4 -4 -11 6 0 -15 -3 9 -6 6 7 4 6 5 -8 6 2 11 7 5 -3 19 26 -3 5 15
7222 15 13 6 21 5 -10 32 19 -13 1 14 6 -9 34 -16 -17 0 -5 -31 10 7 -9 -16 0 -32 -25 7 -1 -28 -12 -8 -21 -1 11 -18 -16 3
7258 3 -22 -10 10 10 -5 -6 -19 2 14 18 4 -7 -6 5 8 17 8 15 4 -13 8 4 2 15 14 -18 -2 17 7 3 26 -9 -17 25 13 -21 11
7295 11 12 -17 -9 -6 -19 -5 11 -7 -27 -3 -3 -20 -4 -6 -21 -18 -7 -6 -8 13 -8 -18 -17 -12 -3 24 14 -17 -2 -6 4 29 12 3 15 -11 0
7332 0 6 9 18 23 19 -4 -10 29 20 7 15 -14 -16 23 17 0 13 15 -17 1 18 1 9 32 -25 -36 0 8 -3 4 -3 -22 -11 4 -10 -13 19 -13 -27
7371 -27 -12 -11 -5 -5 -16 -33 -25 -1 4 16 -9 -34 -18 -10 1 7 23 13 -22 -11 -21 10 35 19 -3 -7 -11 1 32 35 -5 3 10 -1 4 25 -1
7408 -1 -8 -3 -11 -4 25 26 -10 -30 -26 -13 16 29 6 -12 -35 -29 -16 5 5 -16 -8 -27 -31 4 4 5 -15 -27 -41 5 20 2 -27 -33 -33 -7 20 2
7446 2 7 0 -12 -25 10 40 20 19 10 -26 -12 32 31 13 6 -14 -1 21 23 -1 7 -1 -15 3 22 16 18 -18 -26 -17 9 14 3 -3 -33 -13 -7 -1 12
7485 12 -4 -20 -38 -11 -9 -10 17 -11 -32 -24 0 -22 20 9 -40 -22 -17 -8 -3 21 -6 -21 -24 -1 -9 0 19 -10 -25 -1 7 10 30 -2 -19 -1
7521 -1 16 15 12 3 -8 -5 3 9 22 15 3 -10 -17 2 22 13 -7 -8 -9 -11 3 4 -20 -27 -12 -20 -21 -2 6 -20 -8 -9 -19 -11 22 -9 -27 -12 0 -14
7561 -14 22 18 -14 -9 8 1 -1 6 5 -13 -2 2 5 17 8 5 -9 1 12 22 11 3 -10 -14 13 16 7 6 18 6 -10 9 15 9 2 0 -18 -2 19 -1
7601 -1 -32 -7 -1 -20 7 -4 -27 -20 7 -22 -10 0 0 -23 -11 -14 -24 6 20 -10 -14 2 -14 -5 18 5 -13 6 16 -4 18 4 2 -9
7635 -9 -3 13 10 17 6 9 -14 -11 18 18 4 10 15 -4 7 24 5 10 23 -7 -18 11 1 -12 5 -4 -16 -4 21 3 -26 -15 -31 -29 6 8 -17
7672 -17 2 4 -29 -27 3 3 -17 -4 -23 -19 3 4 -4 -16 -11 -5 3 6 6 5 12 9 6 1 3 21 6 6 8 7 5 7 27 -18 6 25 6 -10 26 0 -20
7713 -20 15 1 -10 6 34 0 -19 4 2 -12 10 -6 -13 -6 0 -23 -14 5 -7 -8 -7 -7 -21 -7 -9 -13 -12 -5 -3 -7 -4 -8 -2 10 -8 2 9 5 14 -5
7753 -5 -1 4 0 6 10 17 0 12 12 0 -11 15 13 -2 17 2 -9 10 24 9 -13 9 8 11 10 2 -7 -17 2 -14 -4 14 -4 -24 -3 -10 -12 13
7791 13 0 -19 -14 -16 -6 -9 -1 -21 -13 -10 -12 -23 7 4 -2 -6 -10 -13 8 16 10 -1 -7 11 23 12 3 15 15 -5 15 22 1 10 19 7 13 38 20 11 1
7832 1 8 -6 17 29 7 -3 17 -6 -8 8 -6 -13 -1 -6 -24 -10 7 5 -18 -8 -14 -24 -1 -3 -25 -9 -7 -9 -3 1 -9 -4 -6 -6 -14 8 -2 2 3
7871 3 -5 6 14 16 6 -6 -9 8 13 3 8 14 4 -5 11 18 19 23 8 8 -11 22 21 10 17 -3 -12 20 8 -11 7 3 -7 -13 3 -4 -5 8 -18 -30
7911 -30 3 7 3 -16 -6 -16 -15 1 -4 -12 -5 0 -11 -7 10 0 1 -7 -17 -2 9 -3 11 0 -5 5 6 16 16 17 6 -6 22 12 10 19 15 5 7
7950 7 16 3 19 4 -12 1 32 12 -5 17 -5 -5 13 5 -15 9 4 -20 -16 7 -1 -2 -1 -10 -24 -9 -2 -7 -2 -11 -21 -10 1 -13 -10 -8 -12 -5 -1 3
7990 3 5 9 -8 4 7 6 4 10 -4 -8 9 8 6 4 13 -2 2 17 -3 8 34 23 -7 3 -1 12 20 2 -12 -3 6 -4 -7 8 -9 -18 6 6 -12 -3 -4
8031 -4 -23 -16 -8 -3 11 -1 -25 -5 -4 -13 -9 3 -15 -10 -6 -3 -22 11 7 6 2 -4 -7 10 11 0 -1 14 -2 13 12 5 8 17 15 9 20 7 9 13 0 7 17
8074 17 19 7 -5 5 0 13 11 11 -1 -1 1 -6 2 13 -4 3 2 -16 -9 2 -17 -1 -7 -17 -18 6 3 -15 -12 -15 -20 -8 0 -19 -12 3 -14 -9 5 -3 -8
8115 -8 -3 5 -4 16 -1 -27 9 15 5 -6 22 5 15 13 6 8 15 22 3 10 13 -3 18 2 -1 -3 -4 6 2 7 -14 8 0 -3 3 -8 -2 -14 3 -10 -9
8156 -9 3 -1 -12 -2 -12 -3 -6 5 -9 -12 1 -11 -11 7 -2 6 14 8 -9 -4 -8 -3 7 12 1 -5 14 3 3 11 15 13 7 11 11
8191A1
$$ Imaginary data points
##PAGE= N=2
##DATA TABLE= (X++(I..I)), XYDATA
0 0 0 0 0 0 0 0 0 0 0 0 -8 8 -8 8 -8 9 -16 16 -17 24 -25 32 -33 40 -48 56 -64 72 -81 89 -103 113 -129 143
34 143 -159 178 -198 219 -244 271 -298 330 -365 403 -451 500 -554 614 -687 773 -870 986 -1130
53 -1130 1311 -1544 1858 -2310 3020 -4288 7258 -27535 6134 51263 -30183 2202 44963 -24140
67 -24140 -46870 26852 13837 -19273 15818 14836 -26251 -1984 15576 -7233 1480 10523 -20102
80 -20102 -9736 22513 6521 -7531 9825 -4499 -26869 -4218 22986 13385 -3077 -2131 -44
93 -44 -16868 -18623 19994 29207 -14844 -13306 20066 -12065 -29885 28398 25300 -34049 -5453 30014
107 30014 -17326 -14923 33427 -2509 -33273 11955 10391 -16537 19926 19234 -30031 -8188 15692
120 15692 -20475 1006 42406 -9061 -33438 18874 3931 -32722 18301 34401 -24494 -17034
132 -17034 23309 -5077 -19352 17048 12447 -17465 -6497 10228 3498 -1377 256 195 -4209 -8901
146 -8901 2801 15167 1261 -8211 1701 -4098 -9971 7954 9866 -3226 2665 -1612 -14355 5317
160 5317 12810 -11442 268 17109 -15750 -14967 26282 3375 -26842 12991 16634 -27062 -1510
173 -1510 30865 -11006 -20083 18339 1042 -20376 12981 14952 -14689 -2245 8099 -10113 -409
186 -409 12952 -5392 -5269 8570 -5672 -7990 12134 3338 -11542 3087 6272 -8031 -1167 9340
200 9340 -385 -7025 -1138 3663 2142 -2798 66 5735 -4743 -9364 9184 8411 -11394 -676
214 -676 11167 -9781 -8581 15485 2774 -12483 5716 3952 -12430 3932 11540 -7741 -2309
227 -2309 7528 -8893 -3958 14155 -2537 -10411 9831 878 -14344 8204 12719 -12137 -4429
240 -4429 10840 -6476 -7700 12854 4589 -10513 -498 3159 -4496 1391 6583 -251 -3254 -2457
254 -2457 -2062 2279 3139 -58 1121 -1002 -5568 174 5123 533 22 354 -4914 -1586 4740 414
270 414 354 3649 -5481 -6481 6596 3161 -4852 5423 3442 -12015 -2130 10699 -1894 -3504 8161
285 8161 -2826 -11274 4814 7099 -4386 1582 4177 -7529 -3582 6471 422 -1038 4478 -3005
299 -3005 -6876 3015 3640 -1471 2893 1541 -6651 -2578 4594 1565 -40 1883 -1657 -4289 -653
314 -653 2769 3022 818 -1792 -1680 -1769 -1762 3340 5192 -1793 -3818 254 -1704 -1422 5626 3147 -4359
331 -4359 -1451 406 -3410 1666 6257 -1074 -3507 831 -2445 -2419 5896 3435 -4338 -994 587 -3876
347 -3876 1301 6511 -680 -3916 553 -1501 -2628 4109 4331 -2034 -2306 -1028 -2375 848 4543 1651
363 1651 -1861 -2192 -2207 -470 2689 2832 517 -1669 -2849 -1529 1202 2498 2321 136 -3324 -2943 635
380 635 1964 2279 2229 -1850 -4579 -746 2094 1321 2533 1483 -3867 -3745 1035 1697 1714 3133 -854
397 -854 -5019 -1699 1887 1669 2656 1606 -3464 -3823 477 1820 1934 2579 -621 -4077 -2101 1040 2044
414 2044 2745 1279 -2646 -3693 -893 1907 3080 2009 -1058 -3168 -2432 206 2856 2912 226 -2052
430 -2052 -2704 -1835 1338 3771 1879 -1290 -2471 -2639 -605 3301 3399 -286 -2151 -2300 -1945 1287 3884
447 3884 1528 -1459 -1960 -2337 -872 2954 3276 0 -1865 -2435 -1989 1380 3674 1465 -1183 -2097 -2331
464 -2331 -276 2780 2431 34 -1371 -2320 -1676 1395 2817 1291 -500 -2137 -2504 206 2607 1860
480 1860 299 -1320 -2751 -1022 2035 1945 666 -18 -1983 -2409 678 2245 1108 535 -884 -2800
496 -2800 -899 2087 1624 598 -112 -2226 -1881 1317 1801 492 491 -934 -2436 -101 1889 765 439
513 439 71 -2031 -1469 1383 1562 529 36 -1526 -1704 700 1429 724 653 -955 -2181 87 1351 224
531 224 934 692 -2175 -1434 1490 669 48 1113 -1013 -2195 1002 1596 -333 423 -249 -2442 117
548 117 2437 47 -63 923 -2286 -2359 2141 1813 -437 1137 -197 -3432 -483 2622 520 -41 599
565 599 -1585 -1326 1455 894 -178 192 -1280 -1341 1564 1522 -26 471 -1235 -3182 152 2893 1316
582 1316 833 -113 -3205 -2168 1365 1500 1603 1583 -1927 -2529 710 83 -320 2782 292 -3749 414
599 414 2738 -1195 156 2017 -3326 -3158 3428 2554 -445 1486 -1136 -4963 -519 2832 1090 2540
615 2540 1708 -4109 -3280 1152 30 1077 4108 -684 -4261 430 1446 -1252 1185 1518 -2562 -1310
631 -1310 2129 1206 601 71 -2603 -2104 413 1009 3153 3309 -2635 -4477 -410 -377 233 5067 2547
648 2547 -3893 -2071 74 -1966 1211 3847 -623 -1601 684 -1487 -393 3251 -926 -3392 1564
663 1564 713 -1647 3845 2760 -5456 -2867 2390 -1191 414 5923 464 -4945 -1153 -524 -1569 3189
679 3189 3583 -1142 -1151 -1101 -2602 1281 2949 -1431 -565 1874 -1895 -1156 3512 -11 -3429 443 638
696 638 -1281 2275 2678 -1533 -1782 -1505 -1825 2274 3316 -658 157 408 -4400 -1449 4638 346 -2038
713 -2038 3057 -92 -4855 1230 3326 -2189 -390 2153 -2027 -798 2925 -506 -1404 1118 -1882
728 -1882 -1506 3719 807 -2524 1968 244 -4749 855 4232 -1569 -770 2804 -2096 -3134 2306 1303
744 1303 -1124 1088 -88 -1651 981 145 -1301 1888 446 -3008 1201 2394 -2649 -133 3215
759 3215 -2284 -2565 3134 641 -2187 1663 582 -2498 750 1105 -1411 1246 1033 -2545 657 2004
775 2004 -2815 -132 3859 -2009 -2839 3479 318 -3584 2164 2164 -3239 45 2569 -1761 -824 1902
791 1902 -879 -500 1526 -1377 -789 2324 -977 -1763 2657 32 -3086 1868 1836 -3005 277 2835
807 2835 -1856 -1400 2007 -485 -955 1581 -466 -1081 1331 -660 -1110 2256 -243 -2556 2066 1329
823 1329 -3254 808 3044 -2613 -1460 2990 -807 -1883 2611 323 -2626 816 656 -1411 1547
838 1547 1096 -2085 571 1061 -2699 289 3148 -1544 -1344 2716 -1005 -2873 2260 1333 -2463 665
854 665 1763 -1457 -114 1127 -1350 -424 1008 -789 512 1901 -1296 -1121 1363 -1444 -1694 2897
870 2897 1382 -1940 732 582 -2719 -147 2011 -598 173 1675 -1080 -1005 847 -1274 -708 2332
886 2332 -141 -1363 2209 340 -3109 419 1354 -2137 639 3393 -899 -1756 1104 -1109 -1996 1642
902 1642 1274 -387 1363 156 -2366 -267 468 -1148 1161 2219 -1017 -584 1223 -1612 -1974 1416
918 1416 794 -440 1611 751 -1712 -674 -218 -1052 734 1530 143 702 220 -2243 -966 1050 -514
935 -514 191 2435 66 -1578 501 -562 -2171 790 1848 -198 739 990 -1747 -1274 457 -800
951 -800 131 2419 425 -1055 465 -883 -2135 905 1555 -644 693 1503 -1288 -1327 456 -649 -567
968 -567 1617 888 -385 371 -382 -1537 -263 311 26 1359 1208 -887 -845 -315 -1109 -17 1542 449
986 449 -52 590 -655 -1329 121 226 -141 967 559 -703 161 204 -1204 -320 772 -259 355 1495
1004 1495 -384 -1371 142 -263 -883 1095 1327 -427 -88 115 -1359 -550 1150 353 -75 621 -327 -874
1022 -874 343 173 -585 346 502 -375 148 465 -497 -331 190 -389 -99 819 320 -196 -111 -655 -551 561
1042 561 501 0 347 -162 -821 38 361 -287 358 637 -647 -501 564 -58 -286 607 -120 -860 420
1061 420 656 -437 13 357 -658 -256 736 -20 -240 532 -165 -813 205 466 -124 279 228 -706 -310
1080 -310 512 143 -48 216 -200 -378 94 128 44 220 -9 -251 -116 -134 77 478 -14 -444 42 75 -229
1101 -229 351 284 -586 -117 466 -295 -154 659 -136 -623 300 36 -518 581 628 -742 -316 476 -344 -153
1121 -153 841 -97 -724 383 240 -620 209 610 -381 -266 363 -194 -234 498 142 -490 -107 211 12 72
1141 72 146 -106 -226 -47 171 69 -119 139 196 -383 -277 400 53 -236 377 0 -738 250 663 -517 -210
1162 -210 680 -400 -573 771 86 -804 522 503 -962 -50 907 -415 -382 757 -291 -783 729 458
1180 458 -773 118 547 -565 -206 649 -131 -408 420 123 -546 22 430 -22 -210 82 43 -231 27 411
1200 411 -73 -492 258 400 -546 -92 745 -311 -569 715 0 -940 666 793 -1104 -180 1083 -668
1218 -668 -638 1264 -155 -1261 921 647 -1370 216 1210 -954 -518 1213 -414 -955 1097 340 -1269
1235 -1269 304 845 -753 -131 882 -397 -635 608 190 -592 142 525 -177 -364 126 207 -248 -75
1253 -75 517 -85 -715 424 626 -830 -201 1041 -499 -793 1162 94 -1368 844 947 -1607 -34
1270 -34 1672 -1008 -884 1737 -387 -1730 1485 868 -1951 456 1633 -1525 -605 1848 -664 -1324
1286 -1324 1595 333 -1753 633 1116 -1186 -154 1155 -653 -697 974 103 -801 308 478 -391 -197
1303 -197 287 98 -232 -52 390 -112 -622 507 655 -965 -233 1207 -600 -911 1469 111 -1783 1034
1321 1034 1214 -1995 -10 2208 -1271 -1264 2172 -361 -2182 1795 1141 -2437 516 2022 -1900 -731
1337 -731 2266 -922 -1608 2042 282 -2122 1077 1281 -1826 -58 1581 -1037 -732 1537 -129 -1280
1353 -1280 595 539 -721 30 574 -109 -316 4 234 -78 -444 433 679 -869 -428 1169 -349 -1036
1371 -1036 1284 316 -1730 838 1346 -1851 -142 2119 -1272 -1299 2257 -295 -2229 1899 1061 -2733
1387 -2733 713 2365 -2120 -823 2549 -1184 -1955 2455 535 -2411 1172 1408 -2237 -176 1897
1402 1897 -1027 -654 1735 -396 -1463 809 343 -939 456 664 -471 16 253 -405 -276 -47 184
1419 184 522 -127 -162 645 -511 -1180 793 446 -1063 1154 1419 -1959 -692 1673 -1274 -1204 2632 347
1437 347 -2108 1513 829 -3019 233 2418 -1568 -418 2810 -949 -2195 1732 -143 -2499 1701
1452 1701 2092 -1672 257 1546 -2234 -1444 1870 -83 -757 2051 642 -1868 -308 128 -1099 355
1468 355 1445 274 25 22 -718 -657 -478 -162 1114 932 -201 426 -137 -1926 -411 1074 -505 539
1486 539 2398 -567 -1932 587 -732 -1944 1985 2082 -1405 554 1465 -2769 -1643 2130 -403 -877
1502 -877 3049 729 -2737 377 594 -2703 179 2816 -320 -202 1852 -1354 -2673 603 490 -605
1518 -605 1816 1628 -1129 -731 -290 -1594 -321 1511 862 554 510 -802 -1108 -579 -596 436 1328 465
1536 465 464 435 -1620 -1493 579 -127 -173 2274 976 -1639 -69 -110 -2432 167 2644 -106 -191 1783
1554 1783 -1235 -2577 913 418 -1318 1857 2062 -1635 -561 874 -1956 -1074 2131 342 -581 1801
1570 1801 180 -2317 -321 366 -949 900 1965 -285 -590 117 -1202 -989 755 596 482 948 -260
1587 -260 -978 -281 -543 -311 974 480 -72 803 -198 -1476 -41 285 -706 883 1442 -753 -407 685
1605 685 -1306 -1107 1488 449 -623 1309 255 -1978 49 939 -1117 185 1740 -595 -815 1028
1621 1028 -583 -1353 1050 615 -934 696 807 -1128 -212 605 -854 -186 1237 -42 -467 532 -398
1638 -398 -794 535 212 -369 620 251 -713 78 125 -553 404 562 -610 -3 555 -598 -196 707 -453
1657 -453 -399 926 -143 -798 689 183 -915 520 588 -900 177 835 -872 -386 992 -292 -497
1674 -497 915 -194 -1004 660 397 -818 435 671 -803 -99 622 -657 -218 964 -183 -538 585
1691 585 -114 -661 497 170 -628 432 493 -585 4 301 -610 -41 626 -295 -109 639 -322 -555 367
1710 367 -139 -349 722 212 -660 255 192 -729 163 548 -479 111 720 -574 -466 603 -265 -466 736
1729 736 87 -622 537 226 -918 138 583 -518 114 755 -549 -420 655 -293 -584 686 206 -544
1747 -544 415 191 -766 144 522 -467 -25 557 -316 -214 428 -312 -365 516 63 -340 316 9 -407 272
1767 272 120 -438 222 317 -398 66 295 -468 20 531 -388 -250 586 -176 -429 536 -39 -589 546 303
1787 303 -753 175 547 -589 -45 659 -452 -323 723 -184 -627 545 192 -561 360 301 -662 97 536
1806 536 -445 -145 516 -216 -256 389 -186 -332 407 49 -332 239 60 -312 208 48 -416 222 293 -332 103
1827 103 244 -451 -7 465 -380 -182 603 -172 -454 432 -71 -548 515 322 -665 181 486 -567 -117
1846 -117 568 -378 -249 680 -144 -545 441 97 -520 295 248 -464 189 396 -463 -111 353 -239 -57 386
1866 386 -251 -197 413 -163 -334 368 -36 -311 401 26 -549 326 283 -551 148 418 -508 -8 604 -467
1886 -467 -371 676 -120 -554 521 105 -630 388 340 -717 77 576 -435 -152 530 -298 -303 519 -108 -437
1906 -437 395 122 -373 218 59 -373 241 208 -375 104 233 -356 117 297 -446 23 528 -403 -246 590
1926 590 -265 -405 674 -84 -737 603 359 -832 253 614 -767 -69 862 -581 -522 905 -131 -805
1944 -805 644 246 -820 411 524 -815 -21 740 -466 -309 614 -231 -430 531 -2 -476 349 159
1962 159 -393 158 101 -294 266 150 -396 146 182 -373 235 296 -564 85 569 -564 -185 775 -352 -505
1982 -505 810 -153 -886 798 440 -1022 341 733 -1015 -63 1129 -676 -581 1160 -213 -1053 839
1999 839 342 -1027 529 702 -1030 -30 953 -637 -444 829 -264 -563 730 61 -678 360 217
2016 217 -575 188 341 -313 187 199 -530 -10 284 -274 232 403 -545 -61 500 -568 -223 858 -279
2035 -279 -508 851 -132 -974 779 424 -1161 410 952 -956 -23 1145 -946 -825 1260 -137 -933
2052 -933 1195 408 -1401 341 658 -1208 193 1424 -623 -583 896 -513 -898 911 241 -761 622
2069 622 464 -825 38 352 -595 39 571 -257 85 519 -423 -349 144 -422 99 907 -116 -294 442 -599
2089 -599 -784 817 239 -552 945 393 -1381 87 768 -998 60 1409 -673 -680 1311 -347 -1423
2106 -1423 947 434 -1240 855 1194 -1241 -241 997 -1155 -741 1531 177 -676 982 -92 -1568
2122 -1568 299 727 -598 429 943 -691 -460 381 -554 -287 766 53 -195 429 -214 -413 239 -339
2140 -339 -396 703 219 -240 625 -189 -1141 309 438 -717 697 1126 -998 -484 757 -933 -613 1644
2158 1644 146 -1110 941 276 -1590 457 1068 -1184 30 1527 -817 -817 1267 -363 -1280 1002
2174 1002 475 -1046 756 905 -1268 -374 772 -624 -173 1195 -105 -679 423 -199 -717 450 392
2191 392 -221 320 5 -567 143 139 -375 338 234 -518 338 423 -783 -22 634 -671 -170 1047 -398 -628
2211 -628 957 -238 -1185 875 633 -1076 488 885 -1303 -246 1329 -693 -702 1368 -135 -1230 893
2228 893 409 -1243 525 948 -1073 -167 1045 -606 -491 954 -257 -733 748 165 -770 390 362
2245 362 -616 144 393 -488 20 454 -340 -97 297 -296 -14 397 -352 -141 513 -337 -324 610 -191 -502
2265 -502 747 42 -909 499 532 -845 229 813 -878 -300 1026 -475 -648 1058 3 -1040 658
2282 658 382 -1009 487 887 -988 -267 932 -536 -430 1048 -133 -850 617 177 -809 443 584
2299 584 -621 -4 425 -495 -40 620 -287 -304 350 -158 -132 541 -119 -428 259 -120 -353 568 307 -424
2319 -424 165 -67 -786 280 759 -281 45 406 -802 -434 813 -98 -398 819 10 -912 424 428 -780
2338 -780 201 669 -753 -134 1034 -225 -596 460 -363 -751 843 680 -441 223 85 -1073 -191 760
2356 760 31 234 684 -567 -829 222 60 -107 645 170 -495 154 128 -437 103 151 -409 199 538 -133
2376 -133 110 219 -802 -549 493 200 286 882 -269 -1136 -121 32 -242 860 843 -557 -342 70 -773
2395 -773 -159 954 60 -329 515 -94 -610 401 130 -794 136 654 -116 273 521 -703 -753 177 -45
2414 -45 160 1036 319 -676 -379 -431 -461 624 835 -33 -16 -80 -707 -193 429 -53 47 477 -172 -291 341
2435 341 -130 -524 125 17 -224 659 573 -461 -340 -180 -639 152 975 193 -123 167 -627 -775 373 456
2455 456 20 487 141 -752 -194 313 -220 49 446 -178 -125 423 -117 -358 122 -130 -293 430 386 -125 139
2476 139 -96 -710 -88 460 96 267 345 -494 -458 215 -82 -69 553 93 -429 145 15 -446 223 376 -378
2497 -378 -32 426 -223 -171 344 -250 -395 387 183 -249 244 126 -444 -28 206 -204 94 386 -160 -208 114
2518 114 -139 -100 291 7 -147 181 -9 -218 96 11 -120 234 97 -281 51 131 -240 125 291 -258 -70
2539 -70 304 -249 -206 446 26 -328 240 7 -460 289 419 -394 -103 303 -323 -147 510 -55 -366 262 8
2560 8 -411 294 387 -276 -83 99 -343 -21 530 89 -226 -27 -183 -177 275 253 9 23 -155 -272 41 172
2582 172 150 199 -142 -376 54 205 17 240 51 -501 -94 378 -36 63 392 -335 -559 278 223 -118 477
2603 477 195 -791 -263 427 -56 134 548 -371 -684 253 178 -157 446 229 -649 -220 286 -52 194 461
2623 461 -287 -569 47 179 138 359 4 -474 -248 50 175 343 145 -216 -251 -280 -49 501 363 -168 -149
2644 -149 -236 -404 311 673 -105 -261 41 -407 -224 724 306 -379 67 -95 -646 292 823 -169 -265 133 -516
2665 -516 -329 816 397 -450 8 -74 -612 213 736 -68 -215 69 -433 -325 546 434 -105 -90 -294 -397
2685 -397 196 466 178 -44 -285 -358 25 233 223 287 -121 -556 -116 204 43 401 329 -618 -481 316 43
2706 43 56 623 -142 -826 121 331 -295 418 587 -680 -527 464 -59 -92 780 -4 -938 19 379 -228 310
2727 310 546 -572 -516 309 8 -45 544 48 -599 -139 89 -25 350 300 -325 -345 -65 42 279 256 -102
2748 -102 -176 -197 -187 269 353 -116 -23 7 -526 -62 713 44 -315 250 -235 -619 538 601 -495 -27 369 -619
2770 -619 -254 834 20 -439 414 -109 -735 421 617 -415 -21 306 -603 -194 757 -13 -411 327 -52
2789 -52 -574 277 434 -230 -25 177 -335 -169 319 141 -22 -64 -193 -13 124 -20 146 125 -336 -104 294
2810 294 -142 -114 435 -77 -476 226 125 -331 332 300 -565 -14 482 -378 -150 633 -270 -515 617 91
2830 91 -727 403 510 -695 -27 663 -423 -346 620 -98 -519 443 219 -452 103 206 -307 129 301 -300
2850 -300 -83 242 -199 -62 320 -139 -203 198 -48 -149 234 43 -172 12 -157 -71 420 73 -289 152 -120
2871 -120 -526 411 592 -435 -64 451 -568 -468 777 179 -467 380 79 -733 217 610 -363 -79 320
2890 320 -458 -98 741 -99 -472 306 -208 -601 609 671 -374 -53 91 -752 -227 826 369 -96 34
2909 34 -385 -492 158 264 210 288 -238 -411 181 40 -184 365 57 -654 88 600 -50 21 121 -727 -488
2930 -488 562 388 230 495 -469 -1017 29 224 -21 900 596 -971 -566 317 -338 18 1025 -41
2948 -41 -790 279 266 -415 214 222 -616 -108 511 146 297 264 -748 -727 145 189 502 998 -77 -1063 -457
2969 -457 -115 -70 788 790 -237 -423 -315 -468 133 534 2 3 150 -389 -20 620 -301 -729 213 119 -155 873
2991 873 610 -873 -677 -46 -392 340 1250 282 -503 -324 -756 -519 821 709 -59 222 -137 -870 37
3010 37 593 -285 -94 521 -199 -254 577 55 -606 -154 -91 -126 660 670 -129 -324 -583 -727 289 850 236
3031 236 205 101 -886 -654 422 253 74 581 -27 -692 27 186 -269 140 162 -367 200 571 -244 -202 130
3052 130 -595 -362 798 408 -186 351 -164 -1024 -75 646 75 255 435 -499 -550 181 9 -14 447 15
3072 15 -293 208 0 -355 221 135 -422 129 452 -143 -6 201 -447 -346 365 179 51 307 -185 -430 117
3093 117 -4 -157 445 197 -460 54 200 -442 56 537 -312 -307 482 -32 -372 311 13 -465 232 309 -313
3114 -313 70 233 -408 -86 400 -166 -97 421 -208 -440 337 175 -280 222 143 -439 4 343 -129 -58 197
3135 197 -177 -93 205 -83 -50 208 -158 -181 308 34 -164 252 -67 -473 176 378 -141 90 172 -479 -207
3156 -207 356 -24 -13 404 -191 -461 209 53 -233 396 205 -569 -4 410 -262 -72 391 -292 -392 439
3176 439 193 -235 206 5 -503 0 311 4 232 204 -429 -328 145 5 158 411 -134 -381 60 4 -91
3197 -91 300 118 -264 -14 45 -127 204 178 -297 -127 99 -137 198 465 -280 -418 139 -80 -141 519 225
3218 225 -478 -80 53 -349 167 558 -145 -262 81 -242 -137 496 103 -362 74 4 -303 268 363 -277 -142
3239 -142 131 -240 -45 464 76 -244 -13 -153 -146 330 242 -130 -28 -129 -256 200 289 -95 44 64 -356 -96
3261 -96 366 55 -48 161 -236 -314 281 198 -98 138 -40 -385 106 295 -146 65 245 -327 -248 327 57
3282 57 -110 269 -70 -453 98 285 -73 87 103 -344 -140 229 -3 39 248 -179 -287 110 35 -40 305 58
3304 58 -352 -20 116 -92 150 184 -235 -113 140 -93 18 272 -128 -211 148 -70 -113 359 135 -381 -21
3325 -21 116 -215 149 364 -202 -211 152 -129 -141 315 80 -221 89 -32 -269 179 261 -196 -59 100 -220 -20
3347 -20 314 -53 -193 94 -62 -151 185 105 -107 43 -57 -211 109 178 -67 62 36 -282 4 287 -73 -56
3369 -56 207 -149 -220 234 73 -169 195 63 -340 56 238 -138 48 232 -285 -178 340 -14 -171 254 11
3390 11 -341 138 189 -219 72 234 -244 -150 207 -22 -42 197 -98 -217 124 59 -97 135 36 -199 33 67
3412 67 -124 84 145 -142 -62 65 -115 60 212 -142 -141 134 -87 -86 258 -15 -236 166 67 -297 130 263 -230
3435 -230 -46 230 -222 -128 382 -19 -282 198 50 -288 196 221 -287 8 251 -223 -115 303 -53 -168 178
3456 178 -39 -214 164 125 -163 24 64 -158 44 143 -114 -19 109 -116 -56 124 -49 -12 138 -129 -123 155 -22
3479 -22 -79 190 -38 -219 201 108 -286 109 224 -266 -31 307 -176 -163 342 -59 -328 237 138 -237 140 156
3501 156 -325 1 282 -169 -64 315 -106 -222 220 -9 -246 237 173 -258 7 169 -144 -60 153 -84 -71
3522 -71 117 -2 -32 44 -104 -45 101 -98 -40 241 -26 -221 89 -12 -216 185 210 -217 3 136 -231 -69
3544 -69 229 -130 -62 322 -106 -278 252 41 -358 187 253 -316 60 404 -274 -294 285 -22 -207 309 152
3565 152 -243 33 53 -236 30 212 -50 72 106 -223 -100 185 -66 -91 217 26 -124 91 -35 -189 27
3586 27 42 -18 137 34 -106 95 -81 -324 138 271 -153 38 277 -301 -296 307 10 -262 311 208 -313 -17
3608 -17 146 -262 -5 291 -126 -62 289 -118 -235 201 -64 -254 311 239 -276 27 182 -295 -138 277 -9
3629 -9 -62 208 1 -205 -15 -1 1 139 -7 -49 162 -65 -226 111 64 -191 153 231 -211 -85 170 -155 -128
3652 -128 210 -17 -37 214 -77 -254 166 15 -233 228 203 -323 48 290 -310 -195 371 -19 -247 257 105
3673 105 -286 77 156 -201 15 207 -76 -9 83 -172 -22 201 -94 -85 218 -57 -184 158 48 -194 115 137
3695 137 -175 -6 99 -96 23 74 -181 36 170 -151 -48 226 -167 -188 298 14 -304 187 168 -343 -25
3716 -25 264 -147 -73 232 -144 -184 182 -1 -104 166 -39 -214 152 66 -221 137 208 -243 -45 211 -132 -87
3738 -87 240 -39 -189 117 55 -68 106 -18 -149 109 33 -151 172 123 -229 31 167 -212 -32 338 -88
3759 -88 -249 168 2 -182 202 115 -229 24 95 -186 65 189 -141 -38 148 -208 -131 307 13 -227 150
3780 150 23 -266 125 178 -175 -31 145 -118 -36 139 -65 -37 89 -151 -58 241 22 -116 129 -116 -293
3801 -293 189 231 -125 76 140 -297 -142 187 -33 27 259 -99 -230 107 -14 -125 239 51 -271 124 215
3822 215 -221 -26 177 -244 -157 285 72 -84 187 -74 -358 -27 123 64 262 109 -274 -165 -9 -129 135
3843 135 307 -51 -131 60 -156 -169 199 85 -157 62 68 -79 140 47 -275 -87 79 -34 227 334 -197 -290
3865 -290 3 -174 -76 484 263 -212 -71 -123 -341 120 389 -4 -27 84 -207 -99 209 -38 -141 152 -25
3886 -25 -147 256 148 -274 -117 -22 -199 159 469 40 -216 -149 -292 -125 319 261 49 46 -220 -337 51 177
3908 177 39 172 45 -291 -51 214 -29 -51 49 -165 -85 294 134 -71 -9 -225 -278 182 292 71 174
3929 174 -23 -490 -194 277 114 125 261 -212 -396 88 138 -50 177 59 -287 -29 181 -44 42 114 -270
3950 -270 -208 228 137 32 163 -158 -405 21 228 78 157 68 -289 -204 54 68 175 175 -149 -212 -9 -20 99
3973 99 244 -87 -270 22 67 -14 204 79 -290 -81 97 -29 136 234 -177 -216 61 -35 30 352 17 -354
3995 -354 -23 86 -81 209 245 -258 -216 129 -15 -13 268 3 -254 -20 40 -38 189 127 -218 -117 53 -26 110
4018 110 170 -161 -193 43 18 38 189 -5 -205 -76 -14 43 223 102 -158 -87 -78 -93 224 238 -169 -131 75 -117
4042 -117 -1 294 0 -242 49 18 -115 216 189 -237 -127 69 -92 114 329 -94 -295 11 -26 -31 302 157
4064 157 -267 -110 39 -111 93 261 -57 -190 -33 -45 46 220 14 -164 -100 -68 52 256 72 -180 -108 -92
4086 -92 -75 211 245 -70 -125 -85 -203 65 337 57 -131 -50 -185 -133 319 199 -184 -33 -28 -243 135 370 -73
4109 -73 -174 34 -172 -124 349 223 -182 -94 -87 -198 169 347 -36 -150 -60 -177 -37 293 123 -101 -66 -159 -143
4132 -143 179 229 17 -68 -167 -181 87 229 69 -12 -131 -259 21 240 71 52 34 -272 -191 217 167 12 116
4155 116 -105 -368 56 280 21 50 66 -296 -179 266 125 -32 133 -85 -324 62 241 11 74 66 -287 -152
4177 -152 215 134 7 87 -136 -236 71 152 35 78 -29 -211 -58 93 72 123 45 -184 -127 38 44 125 108 -164
4201 -164 -167 51 -5 18 195 -36 -239 18 32 -96 169 166 -209 -140 86 -78 13 239 -45 -239 59 52 -114 157
4225 157 145 -190 -52 110 -121 -1 228 -36 -165 38 -3 -79 132 91 -123 -35 28 -33 45 84 -37 -9 25 -97
4249 -97 -10 113 -22 -31 58 -100 -64 130 40 -89 71 6 -138 70 88 -116 48 118 -150 -65 139 -61 -53 180
4273 180 -44 -202 112 101 -135 72 138 -142 -41 120 -68 -38 170 -19 -141 51 4 -46 139 49 -133 -13
4295 -13 37 -49 55 117 -73 -50 40 -75 -1 147 -3 -78 -5 -78 -26 179 49 -94 23 -44 -140 132 149 -122 -35
4320 -35 77 -161 -59 206 4 -113 56 -57 -140 154 160 -124 -56 13 -144 35 224 -14 -89 63 -105 -121 173
4343 173 130 -57 19 -30 -163 39 178 14 -24 -7 -86 14 125 3 -23 7 -104 -23 166 69 -29 27 -105 -189
4367 -189 100 180 7 34 -10 -224 -51 179 24 1 98 -123 -155 124 46 -99 85 16 -187 62 204 -53 -70
4390 -70 22 -168 -102 246 170 -55 -24 -130 -208 60 179 63 77 21 -199 -98 87 43 47 73 -88 -83 95 48 -43
4415 -43 -30 -107 -78 141 161 37 10 -139 -270 -14 195 111 154 87 -291 -266 68 72 63 204 -9 -244 7 89 -79
4440 -79 28 92 -148 -39 218 46 -70 8 -188 -241 132 271 105 84 -103 -370 -157 176 183 150 119 -146 -252
4463 -252 -53 40 80 149 10 -107 -13 37 43 65 -72 -180 9 185 133 140 -13 -300 -204 59 126 229 267 -103 -323
4488 -323 -139 -43 54 325 192 -209 -155 -7 -101 61 195 -80 -175 84 73 -20 105 -22 -302 -117 121 107 199
4511 199 144 -228 -336 -67 78 191 276 25 -249 -177 -65 30 190 154 -59 -116 -68 -26 126 114 -66 -94 -39 10
4535 10 158 210 -69 -219 -90 -59 68 288 137 -153 -137 -119 -115 167 305 -2 -134 -87 -162 -16 250 109 -149
4558 -149 -60 -51 -92 138 172 -98 -116 -17 -92 26 231 62 -149 -103 -84 -20 200 172 -84 -125 -101 -58 108 192 31
4583 31 -83 -90 -118 15 183 99 -13 -60 -160 -78 152 133 8 -33 -93 -125 92 157 -22 -28 -2 -157 -30 188 60
4608 60 -62 -17 -118 -155 136 194 -31 -51 -84 -200 -8 202 71 -25 6 -108 -131 72 101 -27 35 -18 -137 -6
4632 -6 104 -6 -33 -35 -88 -7 139 51 -46 -49 -128 -61 105 104 30 50 -85 -181 3 105 41 96 40 -140 -70 86 19 -10
4660 -10 78 -48 -82 103 58 -79 27 10 -134 13 156 4 12 51 -149 -136 102 95 2 63 -17 -153 -16 61 -26
4685 -26 26 71 -63 -52 34 -26 -10 52 -37 -72 61 39 -11 29 -41 -103 27 59 -6 58 10 -106 -17 36 -40 18 111 -53
4713 -53 -85 55 -14 -49 103 20 -122 35 83 -91 4 65 -70 -37 88 -46 -75 86 -10 -98 45 30 -75 39
4737 39 47 -105 -12 78 -46 -33 59 -49 -54 57 -26 -76 29 24 -37 26 2 -68 30 49 -61 11 49 -64 -27 47 -47 -9
4765 -9 97 -21 -67 50 -9 -48 71 21 -95 25 73 -70 14 78 -61 -39 81 -47 -54 107 9 -113 17 26 -50
4790 -50 72 77 -96 -51 49 -42 -8 85 -18 -72 34 -30 -48 95 37 -89 -17 -6 -61 64 73 -80 -59 32 -45 27 105
4817 105 -29 -78 20 -51 -64 111 58 -66 -3 -31 -112 69 130 -52 -68 14 -66 -4 142 5 -75 37 -45 -77 100
4842 100 104 -68 -16 -13 -109 36 163 -5 -62 -2 -91 -34 138 57 -78 -16 -45 -92 70 109 -17 -14 -19 -126 -1 143
4868 143 28 -43 -12 -111 -50 127 78 -37 4 -50 -116 62 120 -14 11 -1 -139 -39 138 50 -5 28 -100 -112 123
4893 123 105 -22 21 -39 -134 33 139 3 13 32 -126 -78 126 66 5 47 -78 -145 57 127 16 31 -33 -162 -18
4918 -18 97 20 19 37 -120 -103 70 58 33 75 -87 -156 24 80 27 66 -30 -157 -37 82 12 43 64 -117 -122 54
4944 54 46 18 100 -50 -182 -4 88 38 98 44 -166 -76 90 31 52 106 -70 -136 40 43 7 110 23 -153 -47 51
4970 51 21 90 75 -121 -104 44 28 38 95 -45 -131 -12 32 21 107 56 -135 -73 6 -7 86 109 -84 -108 12 6 47
4997 47 116 -39 -122 4 -3 -11 103 50 -120 -52 15 -28 90 146 -63 -116 4 -12 24 149 28 -119 -12 9 -51 84
5023 84 97 -66 -43 29 -46 19 121 -42 -106 -10 -8 8 140 38 -131 -45 0 -39 73 118 -32 -66 -23 -70 -5 126
5049 126 30 -62 -17 -49 -37 87 47 -72 -36 2 -38 64 83 -55 -54 5 -62 10 136 40 -73 -19 -60 -66 107 114 -43
5076 -43 -7 -13 -87 20 116 -21 -33 43 -35 -49 83 29 -80 12 -20 -70 78 104 -45 -52 -10 -62 12 131 22 -44 -2
5103 -2 -54 -72 56 58 -18 21 -17 -89 10 74 -18 -7 5 -66 -9 81 -5 -53 5 -38 -57 63 52 -31 5 -17 -113 3 100 12
5133 12 5 27 -91 -49 87 26 -40 40 -2 -77 35 45 -41 11 36 -78 -25 78 19 -19 33 -52 -64 56 50 -36 22 -4
5161 -4 -76 19 60 -36 8 50 -47 -32 39 14 -4 54 -25 -78 28 24 -24 24 9 -65 14 38 -48 1 55 -38 -32 41 -21 -14 51 -8
5193 -8 -63 30 44 -23 33 32 -65 -14 43 -29 -16 63 -8 -38 26 -13 -44 48 39 -57 -9 29 -36 1 44 -33 -20 50 -34 -51 44 -5
5225 -5 -36 35 6 -62 13 24 -48 -16 37 -44 -13 51 -26 -22 41 -15 -38 26 8 -24 37 -4 -73 7 47 -24 20 31 -51 -21 50
5256 50 -21 -6 73 3 -50 5 2 -30 76 48 -57 -7 35 -37 2 62 -43 -32 61 2 -36 44 12 -55 17 36 -33 37 44 -59
5286 -59 -47 27 -25 14 84 4 -77 -2 -24 -45 55 52 -12 -3 4 -58 -13 40 -24 -17 26 -12 6 38 -40 -50 6 -10 -5 86 42 -56
5318 -56 5 -18 -77 37 116 13 3 25 -96 -66 95 28 -30 67 17 -78 15 28 -70 6 75 -34 -19 90 -12 -81 10
5345 10 -20 -42 76 93 -23 -36 -22 -74 -11 69 34 20 31 -49 -60 -13 7 35 63 6 -25 25 -10 -38 10 -11 -12 73 57 -48
5375 -48 -18 13 -78 -10 102 10 4 89 -44 -124 43 62 -40 64 87 -80 -40 66 -61 -68 93 18 -46 61 22 -90
5401 -90 5 31 -67 -2 92 8 -15 5 -45 -49 29 28 -1 5 -13 -28 -12 -33 -19 45 -1 -28 30 -21 -43 36 -2 -81 25 76 -39
5432 -39 -18 51 -68 -51 105 -2 -74 72 42 -126 13 73 -68 7 109 -60 -73 96 25 -78 61 41 -80 23
5456 23 78 -37 -31 66 -11 -38 35 16 -13 23 -2 -38 2 26 14 2 -30 -40 25 -3 2 45 -24 -60 28 6 -54 53 83 -83
5486 -83 -23 66 -62 -19 129 -16 -112 73 64 -89 24 86 -98 -30 102 -19 -54 99 -2 -121 25 50 -40 50
5510 50 71 -93 -66 52 -9 -10 67 26 -53 -7 6 -30 16 23 -3 -8 -29 11 29 -12 -43 12 -22 -22 73 29 -75 -7 18 -83
5540 -83 -1 103 -35 -42 65 -36 -109 82 70 -80 38 58 -101 -17 117 -56 -67 91 1 -96 60 61 -72 3 56
5565 56 -74 -9 107 12 -47 7 -15 -29 44 51 -9 -3 -8 -19 -13 21 15 30 -24 -47 19 0 -14 49 12 -63 18 53 -57 -5 67
5596 67 -65 -49 74 -13 -54 82 35 -120 5 69 -64 7 92 -60 -89 62 -5 -56 66 48 -89 24 55 -49
5620 -49 -8 78 -19 -60 29 10 -20 51 10 -50 -13 18 2 10 9 -8 -15 -12 -5 19 1 -9 13 -16 -58 25 58 -41 -2 37 -54 -19 75
5653 75 -19 -73 54 16 -94 39 74 -64 4 74 -72 -48 91 9 -73 46 26 -68 40 71 -58 -1 82 -34 -58
5678 -58 59 8 -39 39 4 -48 17 33 -4 -3 11 -13 11 3 4 8 5 -9 1 -8 -17 34 28 -41 -10 28 -25 -15 55 -22 -52 49 10
5711 10 -62 33 40 -56 -1 52 -61 -22 76 -17 -72 43 13 -64 22 31 -78 -4 73 -38 -35 46 -14 -43 41 7 -58 23 36 -38
5741 -38 -3 18 -11 4 18 -3 -18 13 3 -13 5 -3 9 21 -15 -8 27 8 -3 27 -26 -20 32 2 -48 7 11 -32 2 30 -41 -17
5773 -17 56 -14 -53 40 8 -53 48 14 -68 6 45 -50 -37 54 -16 -46 32 -16 -50 43 49 -55 -5 40 -27 -7 40 -32 -38 34
5803 34 -3 -22 14 31 -3 2 -11 -37 -3 15 5 -1 -7 -12 10 11 -11 -7 -3 -14 -3 13 -32 -1 28 -33 -46 18 9 -20 24 -6 -63 0
5837 0 47 -34 -10 47 -36 -61 30 -16 -51 33 40 -44 2 43 -45 -15 39 -31 -31 62 20 -37 14 10 -36 17 46 -15 10 46 -23 -32 6
5870 6 18 10 28 12 -18 -11 1 -8 15 14 -1 21 -1 -15 -9 -1 -32 18 21 -13 31 20 -41 -48 11 -13 -3 57 7 -51 3 -8 -58 16 53
5905 53 -24 -8 31 -37 -56 40 2 -46 37 43 -29 3 19 -68 -28 51 14 14 48 1 -50 -15 -9 -18 43 52 -12 -8 -13 -29 0 35 10 21
5939 21 29 -9 -16 -14 -29 -15 36 -1 -11 41 16 -55 -11 -15 -30 58 53 -20 -32 12 -52 -34 41 9 -10 49 -11 -73 3 19 -16 23 43
5972 43 -30 -2 38 -27 -51 33 17 -10 40 3 -36 2 -2 -33 1 50 8 12 12 -55 -36 30 10 -1 31 -8 -26 13 -13 -31 28 31
6004 31 -28 0 15 -44 -10 27 -38 -27 35 10 -15 27 -19 -41 15 7 -30 12 32 -43 -12 20 -15 0 46 -16 -32 23 -8 -29 35
6035 35 14 -31 13 25 -31 -3 18 -22 5 28 -21 -25 38 0 -12 40 16 -20 24 6 -28 16 33 -34 14 37 -27 -6 34 -32 -16
6066 -16 41 7 -17 28 -3 -36 13 18 -27 30 52 -34 -26 14 -23 -9 45 -1 -25 25 -4 -35 11 11 -13 32 24 -47 1 28 -23 -13
6098 -13 22 -13 6 48 -11 -28 11 -19 -12 47 31 -12 12 -2 -66 1 47 9 24 22 -57 -46 29 12 -15 32 0 -38 17 24 -35 4
6130 4 31 -34 -17 41 3 -1 21 -47 -47 27 33 5 24 -17 -64 -11 9 -13 30 30 -36 -27 12 -18 13 55 -3 -35 13 11 -4 40 4 -48
6164 -48 10 27 -11 39 44 -22 -31 13 -22 6 87 20 -54 -10 7 -12 57 47 -29 -22 13 -32 12 53 6 -14 -7 -25 -17 37 28 -21 -21 -33
6198 -33 -32 35 27 -21 -29 -17 -52 5 48 -11 -7 5 -71 -41 59 30 -5 5 -40 -66 35 50 -22 12 8 -54 -14 49 16 -1 42 -20
6230 -20 -55 35 55 11 32 -8 -55 -8 50 24 4 16 -36 -26 12 8 13 35 -13 -46 -11 16 16 32 6 -68 -23 13 3 39 31 -44
6262 -44 -26 -4 -23 6 46 -9 -40 2 -13 -14 53 31 -51 -14 29 -10 24 49 -24 -46 19 -15 -16 52 23 -26 -11 -6 -31 25 38 -15
6294 -15 -23 -1 -14 4 23 6 -30 1 -8 -17 10 12 -16 -13 -22 -35 6 15 -14 -4 -3 -35 -1 13 -38 -26 13 -15 -23 13 -18 -22 16 -1 -47
6329 -47 -14 19 -18 0 27 -30 -24 33 -8 -28 23 23 -28 8 12 -27 18 31 -12 0 12 -6 -12 30 5 -1 34 4 -25 -3 20 10 21
6362 21 3 -27 10 14 9 12 2 -23 -16 16 -1 6 28 -12 -38 6 3 -3 41 2 -60 -15 8 0 21 36 -25 -30 19 4 -2 58 25 -36 -15
6397 -15 -2 -17 44 48 -24 -36 -13 7 10 47 15 -37 -14 -16 3 48 45 -3 -30 -39 -22 28 62 15 -30 -22 -28 16 50 20 -12 -13 -40 -14
6431 -14 43 51 -2 -2 -40 -60 11 59 25 -4 -35 -64 -34 44 41 -6 -13 -38 -52 -2 52 22 2 -16 -69 -23 49 41 20 -9 -65 -57 16
6464 16 49 38 2 -20 -58 -20 31 48 40 4 -52 -61 13 49 52 33 -28 -76 -15 29 40 30 -8 -55 -41 5 31 36 29 -39 -73 -20 21
6497 21 44 50 -18 -75 -45 3 13 44 25 -51 -58 -29 1 27 52 3 -51 -50 -11 13 53 32 -27 -46 -22 11 38 37 -13 -37 -30 -20 -2
6530 -2 55 28 -32 -37 -31 -8 58 63 -4 -29 -27 -16 25 60 33 -17 -6 -30 -12 28 42 -5 -21 -20 -27 5 64 21 -25 -28 -18 2 29 45
6564 45 -8 -24 -28 -29 9 38 19 4 -17 -48 -9 32 24 11 -11 -26 -29 11 10 2 2 -2 -17 15 12 4 24 14 -38 -9 34 20 12 19 -8 -34
6600 -34 5 20 -14 6 12 -23 -16 28 -8 10 28 -17 -28 5 -3 -17 15 10 -24 0 10 -13 -21 26 -4 -6 3 -4 -16 17 10 -9 5 -2 -21
6635 -21 -5 2 -15 16 11 -19 -11 -3 3 13 21 -20 -25 5 -8 -6 40 -10 -10 18 1 -14 36 42 -18 -7 -10 -25 8 58 19 -19 -6 1 -5 39 42
6672 42 -5 -23 -1 -30 11 48 14 -22 -21 -23 1 40 28 -25 -28 -24 -26 15 37 11 -10 -8 -37 -14 26 26 23 -7 -61 -31 35 42 23 3 -33
6707 -33 -46 1 40 13 24 10 -51 -28 33 24 24 34 -45 -64 10 32 31 42 -7 -66 -19 48 18 26 39 -49 -58 10 21 24 43 -5 -74
6740 -74 -39 5 21 47 12 -47 -51 -11 -2 30 35 -19 -45 -38 -24 26 53 9 -49 -35 -26 19 75 29 -47 -26 -39 -28 53 68 6 -17 -24
6773 -24 -52 -12 77 72 -12 -29 -32 -54 34 72 8 -22 -18 -44 -8 58 28 -6 -24 -37 -31 41 68 6 -28 -41 -54 14 56 41 -1 -35
6805 -35 -62 -28 13 31 24 5 -43 -54 6 16 39 33 -26 -67 -11 34 16 30 -3 -56 -43 32 16 17 36 -22 -70 -10 27 26 71 22
6837 22 -58 -64 6 17 33 53 -25 -50 1 6 7 53 30 -27 -39 -15 15 44 25 -33 -35 -11 22 43 36 -17 -39 -19 -22 25 55 18 -12
6870 -12 -8 -41 -31 42 41 -9 -14 -19 -45 10 44 -3 -19 3 -23 -29 40 18 -20 4 -8 -28 30 66 8 -27 0 -22 -3 34 25 -21 -1
6903 -1 -10 -22 8 12 5 -3 6 -18 -10 20 14 5 -5 -31 0 22 -2 0 6 -15 -17 32 -15 -24 12 4 -17 11 20 -19 4 15 -35 -11 40 3 -28 6
6941 6 0 -28 29 20 -25 -7 33 -13 -9 40 -8 -5 17 6 -20 32 30 -26 -11 8 4 27 23 -8 -16 -13 -7 16 27 -2 5 -8 -2 0 35 28 -4 -13
6979 -13 -24 -26 46 25 -16 -24 -14 -36 11 50 -3 -21 -9 -36 -31 49 36 -8 -6 -30 -57 15 40 16 -11 -3 -38 -14 48 22 1 -1 -17
7012 -17 -44 13 39 19 -10 -14 -46 -8 34 54 11 -20 -54 -26 26 54 38 18 -26 -33 -4 16 27 41 -6 -53 -22 21 35 29 12 -58
7044 -58 -43 21 24 15 39 -26 -61 -31 4 17 53 17 -53 -56 4 20 28 42 -36 -65 -25 23 19 35 23 -45 -43 0 18 42 36 -15 -59 -24
7078 -24 8 28 41 -1 -49 -51 -10 25 40 19 -16 -41 -32 -7 29 49 -4 -28 -36 -27 10 48 20 -27 -38 -35 -8 32 23 -18 -27 -25 -40 5
7112 5 46 20 -34 -37 -38 -21 34 41 -31 -39 -24 -27 6 34 2 -25 -21 -31 -30 30 36 -6 -11 -26 -18 14 49 16 -14 -14 -26 11 20 24 4 -18 -19 -14
7150 -14 8 28 17 7 -13 -25 3 7 20 21 -10 -34 -14 11 -3 11 10 -10 -16 11 16 3 19 7 -25 -18 15 4 -6 8 -25 -24 14 23
7184 23 -10 13 13 -22 -1 11 -2 -4 24 -7 -11 -1 3 -5 8 5 -12 7 18 -2 -3 7 5 1 2 0 2 12 -4 0 -8 -4 -9 5 -8 -12 25 15 -21
7223 -21 2 0 -6 6 -4 -24 -23 12 1 -6 25 -4 -20 5 14 -32 -4 14 -29 -10 -2 -18 -12 27 11 -21 4 11 1 9 13 -17 0 5 5 4 5
7260 5 7 1 -3 5 9 13 5 -4 -1 -9 -8 10 10 -7 2 9 -5 16 9 1 2 2 -18 -7 19 8 -5 11 -11 -26 22 16 -25 -4 10 -16 -24 9 2 -16 9
7301 9 -1 -33 11 -7 -14 -15 1 -10 -8 26 -5 -11 1 3 -16 2 -4 4 22 10 -9 -6 -3 4 3 7 3 2 4 -11 21 14 -6 5 4 -13 -4 18 8 -20
7341 -20 -8 -4 -17 8 12 -25 -15 2 -27 -11 11 13 -6 11 -28 -36 10 33 5 2 -10 -29 -6 26 7 6 18 2 -22 -5 11 0 11
7374 11 -4 -10 5 5 8 14 -4 -14 -7 13 10 9 12 -15 -15 -7 6 14 38 5 -27 -17 -8 4 32 9 -27 -21 10 1 4 31 -8 -22 -6 -2 -3 19 11
7413 11 -22 -37 -5 -2 15 29 -6 -34 -17 -13 7 28 3 -21 -22 -20 -10 27 28 -1 -10 -6 -4 15 24 0 -7 -6 -7 11 24 16 -14 -3 -7 -14 31 36
7451 36 2 -6 -4 -29 -4 39 22 -12 -10 -8 -12 27 16 -6 -3 -9 -9 1 25 17 -2 -15 -13 -9 17 21 -11 -28 -36 -17 12 27 1 1 -4 -19 12 20
7489 20 5 20 -9 -32 -14 24 20 13 18 -12 -25 18 13 4 6 3 -11 0 16 1 16 6 -8 -11 6 12 7 11 -7 -23 10 30 11 5 -7 -12 1
7526 1 1 12 17 5 3 -4 -13 5 9 6 -4 -3 12 -7 4 7 -16 -9 5 23 -1 6 6 -20 -10 12 2 11 31 6 -22 -5 15 7 20 25 -8 3
7564 3 20 17 -6 17 10 3 10 23 14 16 14 0 0 13 34 15 6 -10 -13 -5 18 23 -3 -8 -2 -2 -12 4 6 -13 -9 15 -12 -13 13 -6 -26 -11 12 -8
7604 -8 7 16 -19 -17 7 3 -9 17 11 -17 -10 -7 -1 10 18 14 -17 6 0 4 9 -9 -11 5 10 19 -4 -3 -1 0 -7 -7 23 9 -16 -9 -15 -2 14 14 -11 -8 6
7647 6 -7 10 19 3 -17 18 -2 -19 15 16 -11 7 2 -15 -8 22 4 -21 4 5 -17 10 21 -9 -3 0 1 -6 13 0 1 -8 2 -10 6 26
7683 26 -6 -6 -3 -4 7 15 15 1 -3 -3 2 5 12 7 10 -13 -1 25 2 -1 6 1 0 7 -1 -20 -3 5 -14 1 8 -12 -9 13 -7 -12 8 10 -11 5 10 -12
7725 -12 -7 8 -8 -5 7 8 -9 14 -3 -15 8 11 -12 -6 14 5 17 5 -9 -7 10 15 12 7 4 12 8 -3 18 19 12 7 -1 -7 9 6 3 -8 19 21 -2
7766 -2 -13 -9 2 10 16 -6 -19 -4 5 -15 -8 4 -31 -8 7 0 -8 8 0 -11 -2 4 -19 8 6 -9 -9 7 2 3 -6 0 -10 5 15 16 0 0 0 -14
7806 -14 -7 6 8 2 3 -2 -4 -14 12 -3 -5 -8 -6 -9 1 3 2 -16 18 -2 -17 18 0 0 -18 -2 -4 -7 15 0 -24 -3 -4 -3 4 2 -9 1 -10 -17
7846 -17 -11 12 -2 -25 -14 -2 -8 7 14 -18 0 -2 1 1 14 -11 3 -5 -8 0 10 10 -9 6 -12 6 17 3 3 -11 2 -1 11 9 -9 7 13
7883 13 -7 0 16 -4 -3 0 -3 -9 6 18 -9 -6 -1 -16 -5 7 -9 -18 3 -11 -1 13 7 -15 -9 -9 -10 12 14 -9 -14 3 1 -8 -1 -2 -10 -11 10 -8
7923 -8 14 11 1 12 -7 -6 -1 16 2 7 -12 -12 -7 14 -4 -9 7 -5 -5 -8 11 0 7 10 -15 4 8 -1 -1 -8 -18 -6 16 4 -6 -7 -9 -27 8
7962 8 4 -6 2 7 2 -14 13 13 4 1 -7 -7 3 -4 -6 -5 -6 -15 -3 4 0 0 7 -5 -3 5 -3 1 -2 -5 -11 -4 8 4 -6 -3 -16 7 10 -3 4 -5 -12 -7 0 -1 -5 14 2
8011 2 -23 -1 7 -6 -7 3 -24 -16 6 -5 -25 5 -5 -19 -1 -14 -11 -4 -3 -7 -13 -8 1 7 -5 -20 -17 -3 4 -13 -12 -3 -14 2 -3 -8 18 8 0 -13
8051 -13 -10 -9 10 19 -9 -9 9 14 -1 -1 0 -12 -4 2 -3 4 6 -4 -9 -5 -11 2 -3 -1 -8 -3 -7 0 4 0 -7 -7 10 -1 3 3 -11 4 6 -18 -3 10 -2 -5 -6
8096 -6 1 -2 -1 -5 -20 6 6 0 -8 -1 -11 9 5 -9 5 16 9 9 3 12 -6 3 -6 -5 1 11 -1 -4 2 7 -1 7 -6 6 16 2 -3 -6 -13 -14 7 2 -9 -10 -13
8141 -13 -2 3 -5 -14 -6 -7 -3 -7 -2 -5 0 1 -12 -4 7 2 -8 -4 -9 5 -5 5 -9 -2 5 -1 -10 -8 5 0 10 12 -7 8 11 3 7 4 -6 -4 6 -9 -1 -8 0
8186 0 -5 -6 1 12 9
8191I
##END NTUPLES=NMR FID
##END=
