##TITLE=1H_LY-821.1
 CCl4, 8 sc, 
 27.5.2019
##JCAMPDX= 6.0         $$ Bruker NMR JCAMP-DX V2.0
##DATA TYPE= NMR FID
##DATA CLASS= NTUPLES
##ORIGIN= UXNMR, Bruker Analytische Messtechnik GmbH
##OWNER= root
$$ XWIN-NMR		Version 3.5
$$ Mon May 27 14:28:50 2019 Russian Standard Time (UT+4h)  she@DPX200
##.OBSERVE FREQUENCY= 200.1315
##.OBSERVE NUCLEUS= ^1H
##.DELAY= (6, 6)
##.ACQUISITION MODE= SIMULTANEOUS
##.ACQUISITION SCHEME= undefined
##.AVERAGES= 8
##.DIGITISER RES= 18
##SPECTROMETER/DATA SYSTEM= spect
##.PULSE SEQUENCE= zg30
##.SOLVENT NAME= CDCl3
##.SHIFT REFERENCE= (INTERNAL, CDCl3, 0, 15.7039)
##AUDIT TRAIL= $$ (NUMBER, WHEN, WHO, WHERE, WHAT)
$$ ##TITLE= Audit trail, XWIN-NMR		Version 3.5
$$ ##JCAMPDX= 5.01
$$ ##ORIGIN= Bruker BioSpin GmbH
$$ ##OWNER= she
$$ F:/spectra/data/she/nmr/H-F/1/audita.txt
$$ ##AUDIT TRAIL=  $$ (NUMBER, WHEN, WHO, WHERE, WHAT)
(   1,<2019-05-27 14:27:30.51 +0400>,<she>,<DPX200>,
      <created by zg, POWCHK disabled, PULCHK disabled
       configuration hash MD5:
       00 E9 B6 7A A2 85 ED C7 34 08 36 98 17 FE 4E 26
       data hash MD5: 16K
       79 E6 18 AB D4 E3 78 2D 18 EA 57 EE F9 09 5C 0C>)
$$ ##END=
$$ 
$$ hash MD5
$$ 20 32 A6 88 B7 F0 A8 D4 91 D6 5A 71 DC 57 62 CF
##$RELAX= 
##$RELAX= 
##$RELAX= 
##$RELAX= 
##$RELAX= 
##$RELAX= 
$$ Bruker specific parameters
$$ --------------------------
##$DU= <F:/spectra>
##$EXPNO= 1
##$NAME= <H-F>
##$PROCNO= 1
##$TYPE= <nmr>
##$USER= <she>
##$AMP= (0..31)
100 100 100 100 100 100 100 100 100 100 100 100 100 100 100 100 100 100 
100 100 100 100 100 100 100 100 100 100 100 100 100 100 
##$AQSEQ= 0
##$AQ_mod= 1
##$AUNM= <au_zg>
##$AUTOPOS= <>
##$BF1= 200.13
##$BF2= 200.13
##$BF3= 200.13
##$BF4= 200.13
##$BF5= 200.13
##$BF6= 200.13
##$BF7= 200.13
##$BF8= 200.13
##$BYTORDA= 1
##$CFDGTYP= 0
##$CFRGTYP= 5
##$CHEMSTR= <none>
##$CNST= (0..31)
1 1 145 1 1 1 1 1 1 1 1 1 1 1 1 1 1 1 1 1 1 1 1 1 1 1 1 1 1 1 1 1 
##$CPDPRG= <>
##$CPDPRG1= <>
##$CPDPRG2= <>
##$CPDPRG3= <>
##$CPDPRG4= <mlev>
##$CPDPRG5= <mlev>
##$CPDPRG6= <mlev>
##$CPDPRG7= <mlev>
##$CPDPRG8= <mlev>
##$CPDPRGB= <>
##$CPDPRGT= <>
##$D= (0..31)
0 1.2 0 0 0 0 0 0 0 0 0 0.03 0 0 0 0 0 0 0 0 0 0 0 0 0 0 0 0 0 0 0 0 
##$DATE= 1558952850
##$DBL= (0..7)
120 120 120 120 120 120 120 120 
##$DBP= (0..7)
150 150 150 150 150 150 150 150 
##$DBP07= 0
##$DBPNAM0= <>
##$DBPNAM1= <>
##$DBPNAM2= <>
##$DBPNAM3= <>
##$DBPNAM4= <>
##$DBPNAM5= <>
##$DBPNAM6= <>
##$DBPNAM7= <>
##$DBPOAL= (0..7)
0.5 0.5 0.5 0.5 0.5 0.5 0.5 0.5 
##$DBPOFFS= (0..7)
0 0 0 0 0 0 0 0 
##$DE= 6
##$DECBNUC= <off>
##$DECIM= 24
##$DECNUC= <off>
##$DECSTAT= 4
##$DIGMOD= 1
##$DIGTYP= 9
##$DL= (0..7)
0 120 120 120 120 120 120 120 
##$DP= (0..7)
150 150 150 150 150 150 150 150 
##$DP07= 0
##$DPNAME0= <>
##$DPNAME1= <>
##$DPNAME2= <>
##$DPNAME3= <>
##$DPNAME4= <>
##$DPNAME5= <>
##$DPNAME6= <>
##$DPNAME7= <>
##$DPOAL= (0..7)
0.5 0.5 0.5 0.5 0.5 0.5 0.5 0.5 
##$DPOFFS= (0..7)
0 0 0 0 0 0 0 0 
##$DQDMODE= 0
##$DR= 18
##$DS= 0
##$DSLIST= <SSSSSSSSSSSSSSS>
##$DSPFIRM= 0
$$ [...]
##$SUBNAM2= <"">
##$SUBNAM3= <"">
##$SUBNAM4= <"">
##$SUBNAM5= <"">
##$SUBNAM6= <"">
##$SUBNAM7= <"">
##$SUBNAM8= <"">
##$SUBNAM9= <"">
##$SW= 24.9337058887773
##$SWIBOX= (0..15)
0 0 2 0 0 0 0 0 0 0 0 0 0 0 0 0 
##$SW_h= 4990.01996007984
##$TD= 16384
##$TD0= 1
##$TE= 0
##$TE2= 300
##$TE3= 300
##$TEG= 300
##$TL= (0..7)
0 120 120 120 120 120 120 120 
##$TP= (0..7)
150 150 150 150 150 150 150 150 
##$TP07= 0
##$TPNAME0= <>
##$TPNAME1= <>
##$TPNAME2= <>
##$TPNAME3= <>
##$TPNAME4= <>
##$TPNAME5= <>
##$TPNAME6= <>
##$TPNAME7= <>
##$TPOAL= (0..7)
0.5 0.5 0.5 0.5 0.5 0.5 0.5 0.5 
##$TPOFFS= (0..7)
0 0 0 0 0 0 0 0 
##$TUNHIN= 0
##$TUNHOUT= 0
##$TUNXOUT= 0
##$USERA1= <user>
##$USERA2= <user>
##$USERA3= <user>
##$USERA4= <user>
##$USERA5= <user>
##$V9= 5
##$VALIST= <valist>
##$VCLIST= <CCCCCCCCCCCCCCC>
##$VD= 0
##$VDLIST= <DDDDDDDDDDDDDDD>
##$VPLIST= <PPPPPPPPPPPPPPP>
##$VTLIST= <TTTTTTTTTTTTTTT>
##$WBST= 1024
##$WBSW= 4
##$XGAIN= (0..3)
0 0 0 0 
##$XL= 0
##$YL= 0
##$YMAX_a= 58800
##$YMIN_a= -73364
##$ZGOPTNS= <>
##$ZL1= 120
##$ZL2= 120
##$ZL3= 120
##$ZL4= 120
##$ABSF1= 10
##$ABSF2= 0
##$ABSG= 5
##$ABSL= 3
##$ALPHA= 0
##$AQORDER= 0
##$ASSFAC= 0
##$ASSFACI= 0
##$ASSFACX= 0
##$ASSWID= 0
##$AUNMP= <proc_1d>
##$AZFE= 0.1
##$AZFW= 0.1
##$BCFW= 1
##$BC_mod= 2
##$BYTORDP= 1
##$COROFFS= 0
##$CY= 11.3945322036743
##$DATMOD= 1
##$DC= 2
##$DFILT= <>
##$DTYPP= 0
##$F1P= 18.9103706918063
##$F2P= -1.10871071338519
##$FCOR= 0.5
##$FTSIZE= 0
##$FT_mod= 4
##$GAMMA= 1
##$GB= 0.15
##$INTBC= 1
##$INTSCL= 1
##$ISEN= 128
##$LB= 0.24
##$LEV0= 0
##$LPBIN= 0
##$MAXI= 10000
##$MC2= 0
##$MEAN= 0
##$ME_mod= 0
##$MI= 1.114404
##$NCOEF= 0
##$NC_proc= 0
##$NLEV= 6
##$NOISF1= 3.799351
##$NOISF2= 2.8
##$NSP= 1
##$NTH_PI= 0
##$NZP= 0
##$OFFSET= 15.70392
##$PC= 1
##$PHC0= -8933.007
##$PHC1= 11.80026
##$PH_mod= 1
##$PKNL= yes
##$PPARMOD= 0
##$PSCAL= 0
##$PSIGN= 0
##$REVERSE= no
##$SF= 200.130013532006
##$SI= 16384
##$SIGF1= 3
##$SIGF2= 2
##$SINO= 400
##$SIOLD= 16384
##$SREGLST= <1H.CDCl3>
##$SSB= 0
##$STSI= 0
##$STSR= 0
##$SW_p= 3612.71676300578
##$SYMM= 0
##$S_DEV= 0
##$TDeff= 0
##$TDoff= 0
##$TI= <>
##$TILT= no
##$TM1= 0
##$TM2= 0
##$TOPLEV= 0
##$USERP1= <user>
##$USERP2= <user>
##$USERP3= <user>
##$USERP4= <user>
##$USERP5= <user>
##$WDW= 1
##$XDIM= 8192
##$YMAX_p= 0
##$YMIN_p= 0
$$ End of Bruker specific parameters
$$ ---------------------------------
##NTUPLES= NMR FID
##VAR_NAME=  TIME,          FID/REAL,        FID/IMAG
##SYMBOL=    X,             R,               I
##VAR_TYPE=  INDEPENDENT,   DEPENDENT,       DEPENDENT
##VAR_FORM=  AFFN,          ASDF,            ASDF
##VAR_DIM=   8192,          8192,            8192
##UNITS=     SECONDS,       ARBITRARY UNITS, ARBITRARY UNITS
##FACTOR=    0.0002004,     1,               1
##FIRST=     0,             0,               0
##LAST=      1.6414764,     0,               0
##MIN=       0,             -73364,          0
##MAX=       1.6414764,     58800,           0
$$ Real data points
##PAGE= N=1
##DATA TABLE= (X++(R..R)), XYDATA
$$ [...]
$$ plain form
697 1515 1069 -2979 -1800 457 497 2724 1835 -2488 -1267 114 -2491 1028 4721 -1029 -2730 2037
713 2037 -997 -3284 3056 2564 -3082 -98 1907 -1841 155 2255 -1781 -1263 1454 -923 374 3036
729 3036 -1549 -2541 1882 -746 -2266 3672 2191 -3613 -251 1611 -2556 -19 3451 -616 -1659
744 -1659 918 -693 -649 1483 -419 -491 1438 -1285 -1291 2685 -62 -2630 1790 930 -3018 1216 2875
761 2875 -2325 -1105 2022 -1196 -925 2131 -368 -988 1298 -1062 -1116 2273 -423 -1835 2452 170
777 170 -3393 1837 2422 -3148 -101 3099 -2042 -1625 2832 -407 -1968 1783 335 -1590 997 140
793 140 -1135 1469 87 -1909 1523 921 -2544 885 2219 -2316 -555 2597 -1383 -1681 2325 197
809 197 -1678 1020 161 -1200 1063 176 -1104 1267 -7 -1923 1533 1113 -2525 749 2273 -2514
$$ packed form
697A515m46m048J179K257M0K227q89m323J221J381k605L519L693n750j701M767
713B037l034k287O340m92n646K984K005l748J996K100m036N18K717k377J297K662
729C036m585r92M423k628j520N938j481n804L362J862m167K537L470m067j043
744a659K577j611M4K132j902p2J929k723oL976k747k568M420q60l948M234J659
761B875n200J220L127l218K71L056k499o20K286k360n4L389k696j412M287k282
777A70l563N230N85n570L047L200n141M17M457l239j561L751j448j925K587q57
793A40j275K604j382j996L432o02l465L429J334m535J761L152l980k98M006k128
809A97j875K698q59j361K263q87j280K371j274j916L456m20l638L274J524m787
$$ plain form
825 -2514 -844 3100 -892 -2028 2017 -78 -2121 1674 1153 -1598 551 362 -1777 855 1244 -1447
841 -1447 867 1530 -2551 -700 2486 -1073 -1157 2658 -238 -2462 1475 960 -1993 433 1251 -1011
857 -1011 343 955 -1001 -17 337 -1462 453 1784 -870 -57 1515 -1869 -1843 2019 530 -1071 1669
874 1669 539 -2185 -4 605 -1129 796 1401 -866 203 638 -1816 -240 1559 -1201 -363 2665
890 2665 -347 -1958 1179 -264 -2380 1369 2107 -1045 252 1084 -1906 -1192 1020 -184 414 1866
906 1866 -481 -1201 448 -948 -1131 1665 819 -762 1199 506 -2174 -540 851 -609 470 1751
922 1751 -146 -662 -28 -1195 -721 963 392 557 1279 -824 -1553 371 -355 -983 1590 1380 -876 222
940 222 288 -1994 -649 1338 43 352 1521 -527 -1340 62 -759 -692 1745 1055 -664 462 -145 -1943
$$ packed form
825b514J670L944l992j136M045k095k043L795n21k751K149j89k139K632L89k691
841a447K314O63m081J851L186l559q4L815k896k224L937n15k953K426Q18k262
857a011J354O12j956R84L54j799J915J331k654Q13J572l384K6L862j489j601K740
874A669j130k724K181O09j734J925O05k267J069M35k454J576J799k760Q38L028
890B665l012j611L137j443k116L749P38l152J297Q32k990P14K212j204N98J452
906A866k347p20J649j396j83K796q46j581J961o93k680J634J391j460J079J281
922A751j897n16O34j167M74J684n71J65P22k103p29J924p26o28K573k10k256J098
940B22O6k282J345J987j295L09J169k048q13J402q21O7K437o90j719J126o07j798
$$ plain form
958 -1943 -24 1201 -462 361 1593 -524 -1199 249 -493 -756 1025 845 -113 521 -99 -1297 -431
975 -431 106 -20 1141 1076 -594 -573 -219 -986 -89 1197 369 76 510 -635 -1040 201 137 -122 792 322
995 322 -485 299 -25 -1105 -61 614 -220 515 1038 -685 -912 243 -458 -428 1234 755 -553 -16 -265
1014 -265 -1046 207 979 -39 34 381 -532 -413 397 -144 -237 540 103 -315 346 103 -509 -42 12 -229
1034 -229 445 598 -208 -277 -233 -457 188 622 44 26 129 -561 -357 443 80 -53 479 -195 -692 327 388
1055 388 -383 114 242 -541 10 687 -225 -352 334 -217 -431 502 292 -328 161 22 -621 98 609 -62
1075 -62 -123 126 -374 -216 481 167 -182 80 -71 -274 92 214 74 101 -101 -255 15 104 123 237 -134 -376
1097 -376 150 205 -187 143 179 -407 -50 403 -183 -95 457 -223 -527 355 199 -266 381 170 -740 -48 549
$$ packed form
958a943J919J225j663Q23J232k117o75J448p42k63J781j80r58O34o20j198Q66
975d31N37j26J161o5j670K1L54p67Q97J286q28k93M34j145m05J241o4k59R14m70
995C22q07P84l24j080J044O75q34P35N23j723k27J155p01L0J662m79j308N37k49
1014b65p81J253P72j018P3L47r13J19Q10n41r3P77m37m18O61k43o12M67N4k41
1034b29O74J53q06o9M4k24O45M34n78j8J03o90K04Q00l63j33N32o74m97J019O1
1055C88p71M97J28p83N51O77r12j27O86n51k14R33k10o20M89j39o43P19N11o71
1075f2o1K49n00J58O97l14l49K62j51k03L66J22j40K7k02j54K70Q9J9J14l71k42
1097c76N26N5l92L30L6n86L57M53n86Q8N52o80l04Q82j56m65O47k11r10O92N97
$$ plain form
1118 549 -227 -97 506 -284 -494 412 99 -399 331 292 -527 -103 383 -112 -67 274 -179 -311 236 229 -121
1139 -121 -46 26 -90 -69 77 153 11 -88 64 -63 -256 203 377 -250 -200 282 -164 -211 516 21 -567 296
1161 296 328 -584 81 614 -444 -286 581 -255 -480 697 174 -746 210 410 -535 73 595 -466 -343
1180 -343 566 -92 -468 417 223 -459 41 265 -277 -39 380 -67 -335 69 207 -68 -88 163 25 -282
1200 -282 83 315 -283 -162 516 -123 -581 444 346 -605 203 560 -729 -197 949 -330 -660 820 95
1219 95 -934 562 557 -960 155 923 -772 -461 1010 -187 -755 717 136 -887 438 636 -755
1236 -755 -144 664 -351 -391 542 54 -434 204 211 -371 -125 361 112 -296 -52 276 -161 -290 417 123 -616
1257 -616 264 606 -703 -236 931 -375 -732 926 92 -1066 759 705 -1318 88 1245 -915 -506
$$ packed form
1118E49p76J30O03p90k10R06l13m98P30l9q19M24M86m95M5L41m53j32N47pl50
1139a21P5P2j16K1J46P6j42r9J52j27j93M59J74o27N0M82m46m7P27m95n88Q63
1161B96L2r12O65N33j058J58Q67q36k25J177n23r20R56K00r45O08N22j061J23
1180c43R09o58l76Q85j94o82N00K24n42K38M19m47k68M04J38k75k0K51j38l07
1200b82L65K32n98J21O78o39m58J025r8r51Q08L57j289N32J146j279l30J480p25
1219I5j029J496nj517J115P68j695L11J471j197n68J472n81j023J325J98j391
1236g55O11Q08j015m0R33m88m88O38Pn82K46M86k49m08K44L28m37j29P07k94p39
1257f16Q80L42j309M67J167j306l57J658q34j158J825n4k023J406J157k160M09
$$ plain form
1274 -506 1405 -460 -1148 1235 303 -1450 707 1015 -1300 -86 1228 -800 -598 1250 -200 -1056
1290 -1056 779 437 -920 217 615 -599 -179 561 -194 -365 310 186 -267 -164 186 134 -273 -16 387
1309 387 -323 -378 738 62 -914 536 644 -1099 61 1232 -889 -644 1468 -411 -1426 1375 643
1326 643 -1663 635 1236 -1610 -179 1759 -1004 -985 1743 -178 -1563 1202 585 -1579 598 1136
1342 1136 -1346 -166 1427 -711 -824 1072 -53 -906 713 447 -840 38 534 -357 -275 334 188
1359 188 -174 -220 140 148 -405 85 675 -510 -560 910 -30 -1019 795 575 -1292 348 1150 -1267 -318
1378 -318 1649 -781 -1147 1630 4 -1666 1256 790 -1938 560 1710 -1568 -526 1833 -894 -1274
1394 -1274 1755 173 -1560 1070 747 -1655 141 1230 -815 -203 1117 -516 -740 677 -10 -569
$$ packed form
1274e06J911j865o88K383r32j753K157L08k315J214J314k028K02J848j450q56
1290a056J835l42j357J137L98j214M20P40p55j71O75j24m53J03L50n2m07K57M03
1309C87p10n5J116o76r76J450J08j743J160J171k121K45K112j879j015K801p32
1326F43k306K298O01k846J431J938k763J9K728j921j385K765o17k164K177N38
1342A136k482J180J593k138j13J896j125q53J619k66j287Q78M96q91Q2O09j46
1359A88l62m6L60Qn53M90N90j185n0J470r40r89J814k20j867J640Q02k417R49
1378c18J967k430l66K777j626j670K922m66k728K498J150l278J042K359k727l80
1394a274L029j582j733K630l23k402J796J089k045O12J320j633k24J417o87n59
$$ plain form
1410 -569 455 333 -249 63 -17 -229 -69 -100 219 341 -267 112 435 -827 -533 939 -125 -534 1278
1429 1278 111 -1646 498 762 -1509 336 1901 -1021 -812 1506 -858 -1620 1636 594 -1510 1169
1445 1169 1132 -1901 -212 1230 -1323 -309 2112 -239 -1132 1069 -334 -1750 755 1028 -664 629
1461 629 974 -1195 -874 429 -248 -65 962 381 -211 -154 -535 -453 -72 60 738 726 -403 -197 58 -1141
1481 -1141 -483 1167 174 -47 1299 -382 -1849 276 352 -1017 1156 1700 -1154 -469 869 -1610 -1108
1498 -1108 1960 380 -859 1544 255 -2235 68 829 -1289 532 2166 -478 -866 638 -1054
1513 -1054 -1381 1170 905 -225 942 318 -1486 -683 144 -270 674 1218 71 -340 -338 -869 -415 254 327
1532 327 822 668 -486 -419 -332 -1071 1 1222 146 167 1011 -824 -1658 356 171 -561 1482 1231 -1304
$$ packed form
1410e69J024j22n82L12q0k12J60l1L19J22o08L79L23j262K94J472j064m09J812
1429A278j167j757K144K64k271J845J565k922K09K318k364p62L256j042k104K679
1445A169l7l033J689J442k553J014K421k351q93K201j403j416K505K73j692J293
1461F29L45k169L21J303o77J83J027n81n92N7l81Q2L81J32O78j2j129K06K55j199
1481a141O58J650r93k21J346j681j467K125P6j369K173N44k854O85J338k479N02
1498a108L068j580j239K403j289k490K303P61k118J821J634k644l88J504j692
1513a054l27K551k65j130J167o24j804Q03Q27m14R44N44j147m11Kn31M54O69P3
1532C27M95j54j154O7Q7p39J072J221j076K1Q44j835q34K014j85p32K043k51k535
$$ plain form
1551 -1304 -388 427 -1502 -408 1801 127 -427 1227 -456 -1829 431 497 -884 946 1409 -845
1567 -845 -424 439 -1191 -694 1311 472 -162 816 -193 -1289 -168 150 -175 781 829 -251 -278 -352 -698
1586 -698 57 469 115 521 372 -600 -284 -38 -661 160 973 -91 -83 595 -665 -927 509 74 -389 1077
1606 1077 531 -1103 -80 325 -962 117 1231 -346 -343 828 -527 -1005 684 250 -617 703 513
1623 513 -855 49 462 -768 -135 802 -164 -150 567 -358 -613 368 46 -263 529 195 -414 104 -38 -419
1643 -419 316 338 -257 142 160 -448 90 350 -397 23 511 -332 -213 473 -276 -362 571 -67 -515 507 171
1664 171 -652 251 352 -554 188 565 -586 -224 561 -311 -288 634 -117 -503 440 16 -583 398 390 -437 134
1685 134 297 -508 -6 470 -281 -106 482 -173 -272 314 -173 -323 412 103 -292 284 100 -422 108 136 -313
$$ packed form
1551a304R16Q15j929J094K209j674n54J654j683j373K260O6j381J830M63k254
1567h45M21Q63j630M97K005q39o34R78j009j096J121L18l25R56M8j080k7p4l46
1586f98P55M12l54M06j49r72L16K46o23Q21Q13j064QO78j260k62J436m35m63J466
1606A077n46j634J023M05j287J079J114j577LJ171j355m78J689m34q67J320j90
1623E13j368R04M13j230O33R37r66J4P17r25k55R81l22l09P92l34o09N18j42l81
1643d19P35K2n95L99J8o08N38K60p47M20M88q43J19O86p49q6R33o38m48J022l36
1664A71q23R03J01r06P42L77j151L62P85q72K3R22p51l86R43m24n99R81qq27N71
1685A34J63q05N02M76p51J75N88o55r9N86m87j50P35l09l95N76j84n22N30K8m49
$$ plain form
1706 -313 247 382 -342 -82 212 -348 -64 436 -153 -143 420 -192 -425 300 5 -321 405 172 -466 169
1726 169 209 -517 15 406 -303 1 475 -355 -353 396 -119 -340 456 113 -404 260 122 -522 123 383 -286
1747 -286 28 348 -315 -145 337 -168 -208 371 26 -234 208 -27 -294 219 124 -244 171 158 -240 61 123
1768 123 -255 101 273 -259 -35 252 -233 -82 314 -206 -189 394 -65 -355 297 75 -365 258 191 -451 115
1789 115 373 -376 -87 414 -230 -195 400 -157 -342 377 82 -364 221 173 -344 119 225 -313 31 318 -182
1810 -182 -98 208 -125 -95 234 -77 -122 227 -24 -141 149 -59 -158 246 32 -229 191 78 -308 116 141 -279
1832 -279 129 315 -337 -112 322 -212 -166 364 -111 -287 350 5 -418 212 188 -320 134 261 -328 -20 305
1853 305 -258 -150 310 -83 -139 236 -80 -232 214 40 -206 189 66 -189 149 50 -259 149 185 -237 58
$$ packed form
1706c13N60J35p24K60K94n60K84N00n89J0N63o12k33P25k95l26P26k33o38O35
1726A69M0p26N32L91p09L04M74q30KP49n15k21P96l43n17O64j38o44O45K60o69
1747b86L14L20o63J70M82n05m0N79l45k60M42k35k67N13r5l68M15j3l98L01O2
1768A23l78L56J72n32K24K87m85J51L96n20J7N83m59k90O52k22m40O23o7o42N66
1789A15K58p49K89N01o44L5N95n57j85P19k95m46N85m8n17M63J06n38L44K87n00
1810a82Q4L06l33L0L29l11m5L49k51j17K90k08r9M04k14k61M20j13l86M24K5m20
1832b79M08J86o52K25M34n34M6N30m75j76O37l45m23O30k4n08M54J27n89L08L25
1853C05n63J08M60l93n6L75l16j52M46j74k46L95j23k55L38r9l09M08L6m22K95
$$ plain form
1874 58 182 -244 21 281 -252 -120 363 -131 -216 337 -38 -306 324 98 -408 201 260 -354 33 296 -303
1895 -303 -66 361 -205 -216 329 -47 -264 219 5 -230 220 81 -259 86 109 -191 107 101 -212 98 153 -239
1917 -239 18 197 -223 17 255 -269 -101 388 -170 -240 385 -58 -355 376 112 -468 275 332 -476 54 446
1938 446 -378 -131 511 -252 -324 523 7 -441 330 159 -431 204 297 -402 27 339 -272 -112 300 -143 -124
1959 -124 233 -118 -177 211 -27 -120 143 -94 -127 216 -83 -187 245 -26 -282 252 34 -372 273 240 -485
1980 -485 81 408 -432 -38 543 -363 -312 613 -118 -513 549 170 -624 309 357 -628 128 601 -479 -201
2000 -201 591 -251 -352 541 -34 -461 406 178 -451 183 253 -362 33 268 -249 10 285 -197 -137 125 -154
2021 -154 19 259 -161 -57 206 -260 -130 328 -149 -154 428 -158 -456 388 82 -514 365 296 -592 194 511
$$ packed form
1874E8J24m26K65K60n33J32M83m94q5N53l75k68O30k26n06O09N9o14L87K63n99
1895c03K37M27n66j1N45l76k17M83k14k35M50j39l40L45K3l00K98ol13L10N5l92
1917b39K57J79m20K40K38n24J68M89n58p0O25m43k97P31k64n80P43N7q08N30L92
1938D46q24K47O42p63p2Q47n16m48P71j71n90O35R3o99M29L12o11J60M12m43J9
1959a24L57l51n9L88k38r3K63k37l3L43k99j04M32k71k56N34k18m06O45l3p25
1980d85N66L27q40L94N81r06N1R25p31l95J062l79p94R33M8r85P56M73j080K78
2000b01P92q42j01Q93n75m27Q67k28o29O34P0o15L95K35n17K59K75m82O0K62k79
2021a54J73K40m20J04K63m66J30M58m77nN82n86k98Q44l06n96Q79o9q88P86L17
$$ plain form
2042 511 -608 -170 643 -379 -317 777 -71 -590 534 49 -784 410 567 -521 121 484 -648 -266
2060 -266 632 -200 -253 598 -30 -500 270 32 -417 276 255 -290 120 203 -292 -29 71 -252 145 316 -134
2081 -134 57 75 -463 -73 327 -187 103 538 -351 -442 330 -221 -367 706 178 -636 338 262 -784 122
2101 122 609 -540 -43 829 -408 -485 646 -215 -708 643 368 -533 423 343 -882 -143 578 -287 36
2120 36 729 -250 -504 282 -162 -350 497 303 -252 130 -2 -388 75 126 -172 192 185 -162 106 -12 -455
2141 -455 61 242 -233 252 454 -450 -246 287 -446 -194 837 25 -512 426 -98 -811 426 513 -581
2160 -581 227 631 -695 -308 678 -346 -408 781 -6 -602 559 222 -777 165 428 -486 156 655 -400
2179 -400 -322 365 -258 -289 517 157 -231 195 -89 -383 155 172 -94 184 25 -246 113 -1 -266 194 129
$$ packed form
2042E11j119M38Q13j022O2J094q48n19J124m85q33J194J57j088O42L63j132L82
2060b66Q98q32n3Q51o28m70P70k38m49O93k1n45M10Q3m95K63J00l23L97J71m50
2081a34J91J8n38L90M00n14K90M35q89r1P72n51j46J073n28q14R74p6j046R06
2101A22M87j149M97Q72j237p7J131q61m93J351k75r01R56q0j225P39P21q65L23
2120C6O93r79k54P86m44j88Q47j94n55L82j32l86M63N1k98L64pl47K68j18m43
2141d55N16J81m75M85K02r04K04N33p33K52J031q12n37R38n24p13J237Q7j094
2160e81Q08M04j326L87R86j024o2J189p87n96J161l37r99R42K63r14O42M99j055
2179d00P8O87o23l1Q06l60l88M26k84k94N38J7k66K78j59k71L59j14k65M60o5
$$ plain form
2200 129 -291 189 223 -415 39 338 -450 -98 586 -212 -271 518 -236 -579 550 211 -594 361 383 -717
2220 -717 21 583 -490 -151 727 -290 -513 562 14 -529 433 243 -570 200 396 -453 -27 433 -292
2239 -292 -146 388 -148 -206 342 -30 -246 211 33 -185 175 22 -191 153 39 -180 154 42 -218 195
2259 195 82 -358 135 259 -345 32 336 -368 -145 466 -221 -301 488 -30 -493 336 191 -491 251 364
2279 364 -551 -38 492 -319 -161 519 -220 -405 444 16 -421 373 208 -462 73 268 -321 71 375 -254
2299 -254 -175 260 -94 -107 259 -71 -182 189 -14 -105 227 -3 -221 96 -2 -154 296 139 -313 -17 34 -265
2321 -265 193 379 -230 -91 172 -350 -172 447 -22 -220 320 -92 -469 282 217 -402 92 285 -335 42
2341 42 426 -307 -312 286 -100 -158 486 139 -372 26 -74 -361 266 460 -95 -22 26 -401 -97 346 39 6
$$ packed form
2200A29m20M80L4o38M54K99p88L52O84p98n9P89p54l43J129l39q05R55K2j100
2220g17P38N62j073L39Q78j017k23J075n48n43R62j90q13P70J96q49M26M60p25
2239b92J46N34n36n8N48l72k16M57j78k18L60j53k13L44j14k19L34j12k60M13
2259A95j13m40M93J24o04L77L04p04K23O11o87q0P89n18m63Q29j45o82P42J13
2279C64r15N13N30q11J58O80p39j85Q49m28m37P94j65o70N35J95n89L92L04o29
2299b54P9M35l54j3L66l30j11L71k03r1L32k30k18L17r8j52M50j57m52K96N1k99
2321b65M58J86o09J39K63n22J78O19m69j98N40m12l77P51o5o19M94J93o20L77
2341D2L84p33nN98l86n8O44l47n11L98j00k87O27J94n55P3M8m27L04M43l07l3
$$ plain form
2363 6 224 -141 -220 147 -25 -105 189 1 -130 243 94 -235 -11 -109 -272 271 412 -75 -26 -28 -502 -175 406
2386 406 117 74 317 -268 -547 86 99 -79 351 186 -382 -30 163 -294 -41 265 -156 -58 381 -9 -232
2407 -232 95 -177 -312 294 369 28 118 -82 -512 -146 261 145 251 249 -268 -299 -2 -101 55 358 42 -160
2429 -160 67 -75 -171 153 29 -207 155 204 -93 60 -6 -377 -105 255 59 143 281 -231 -399 -3 -27 13
2451 13 430 160 -303 -111 -35 -217 139 268 -97 -30 121 -165 -107 154 -81 -97 175 38 -26 171 -48 -272
2473 -272 -11 66 -4 257 163 -207 -97 16 -160 103 311 -5 -58 62 -192 -143 221 69 -101 148 5 -205
2495 -205 99 82 -206 22 169 -126 -13 163 -126 -135 113 -58 -103 205 63 -131 5 -5 -137 76 101 -80
2517 -80 33 57 -122 -32 60 -53 45 107 -73 -43 61 -62 -23 136 -51 -48 123 -54 -126 146 63 -111 111 35
$$ packed form
2363FK18l65p9L67j72q0K94j88j31L73j49l29K24r8j63N43J41m87M9km74L27N81
2386D06k89m3K43n85k79O33J3j78M30j65n68L52J93m57K53L06m21R8M39l90k23
2407b32L27k72j35O06P5l41R0k00m30L66M07j16J06kn17l1K97r9J56L03l16k02
2429a60K27j42r6L24j24k36L62M9k97J53o6l71K72L60j96Q4J38n12j68L96k4M0
2451A3M17k70m63J92P6j82L56J29l65O7J51k86N8K61k35j6K72j37o4J97k19k24
2473b72K61P7p0K61r4l70J10J13j76K63K08l16n3J20k54M9L64j52j70K49j43k10
2495b05L04j7k88K28J47k95J13J76k89rK48j71m5L08j42j94J36j0j32K13K5j81
2517h0J13K4j79R0R2j13R8O2j80L0J04j23L9J59j87LJ71j77p2K72q3j74K22p6
$$ plain form
2541 35 -191 67 195 -123 -19 159 -135 -83 226 -3 -134 166 -10 -210 103 158 -126 20 78 -191 -49
2562 -49 208 -4 -88 58 -99 -127 123 109 -37 21 -55 -161 -4 88 68 72 -38 -134 -24 50 47 116 2 -177 -9
2587 -9 69 -47 114 117 -174 -117 122 -16 30 253 -65 -303 68 110 -47 208 152 -288 -128 156 -46 51 285
2610 285 -92 -261 65 39 -51 224 91 -272 -90 102 -17 107 155 -140 -196 21 38 46 149 -25 -182 -117 -37
2633 -37 94 176 23 -107 -122 -151 45 247 63 -109 -22 -115 -133 215 206 -113 -32 -3 -228 52 359 -9 -148 61
2657 61 -153 -156 327 216 -207 -12 23 -226 95 350 -44 -143 53 -162 -129 306 175 -139 -36 -69 -165 120 251
2680 251 -22 -88 -68 -113 2 179 95 10 -88 -179 -30 119 91 101 -28 -257 -106 165 50 64 127 -195 -247 144
2704 144 108 -54 202 26 -345 -29 242 -45 84 230 -241 -270 247 125 -85 216 26 -356 24 245 -49
$$ packed form
2541C5k26K58J28l18J04J78k94N2L09k29j31L00j76k00L13N5k84J46N8k69J42
2562d9K57k12q4J46j57k8K50j4j46N8p6j06J57R2k0Mj10r6J10P4lO9j14j79J68
2587iP8j16J61Lk91N7K39j38M6K23l18k38L71M2j57K55n6m40J60K84k02R7K34
2610B85l77j69L26k6r0K75j33l63J82J92j19J24M8k95n6K17J7QJ03j74j57O5Q0
2633c7J31Q2j53j30j5k9J96K02j84j72Q7r3j8L48rl19Q1K9k25K80L07l68j39K09
2657F1k14lM83j11m23J95L5k49L21K55l94r9J96k15L3M35j31l14J03l3r6K85J31
2680B51k73o6K0m5J15J77q4q5r8r1J49J49k8J0j29k29J51K71j15J4O3l22n2L91
2704A44l6j62K56j76l71L16K71k87J29J46m71k9N17j22k10L01j90l82L80K21k94
$$ plain form
2725 -49 60 184 -218 -211 169 110 -3 143 -72 -259 -6 132 49 80 2 -167 -75 44 65 109 20 -116 -79 -49
2749 -49 0 193 79 -173 -73 0 -121 127 242 -163 -187 126 -105 -129 307 93 -291 40 108 -226 127 320
2771 320 -194 -192 168 -92 -96 305 56 -265 75 71 -176 133 234 -161 -87 130 -113 -47 251 17 -186 17 20
2794 20 -70 82 74 -69 -51 -31 -1 75 -8 -21 55 -94 -119 135 76 -118 57 41 -199 23 185 -123 -67 161 -125
2819 -125 -124 222 -31 -170 195 46 -271 132 181 -249 16 259 -203 -120 298 -73 -242 206 75 -218 94
2840 94 128 -169 28 168 -89 -24 106 -74 -25 105 -34 -14 112 -67 -92 104 32 -37 60 -49 -98 69 45 2
2864 2 68 -81 -164 103 54 -100 172 108 -317 -60 200 -127 0 305 -133 -312 165 77 -170 176 134 -263 4
2887 4 180 -111 27 172 -207 -139 205 8 -35 235 -106 -361 88 181 -29 178 151 -269 -196 80 48 125 188
$$ packed form
2725d9J09J24m02PL80n9j13J46k15j87K53J38q3L1p8j69R2J19K1M4q9j36L7L0
2749d9M9J93j14k52J00P3j21K48J15m05k4L13k31k4M36k14l84L31O8l34L53J93
2771C20n14KL60k60mM01k49l21L40mk47L09J01l95P4K17k43O6K98k34k03K03L
2794B0r0J52qj43J8K0L0P6q3j3P6j49k5K54n9j94J75j6k40K22J62l08N6K28k86
2819a25JL46k53j39L65j49l17M03M9m30K65K43m62Q3M18l71j69M48j31k93L12
2840I4L4k97J97J40k57O5J30j80M9J30j39K0J26j79k5J96p2o9R7j09m9J67k4m3
2864BO6j49q3K67m9j54K72o4m25K57K60l27J27L05m38j79M77q8k47L46m2l97K67
2887DJ76k91J38J45l79O8L44j97m3K70l41k55M49R3k10K07k7m20P3K76l2P7O3
$$ plain form
2910 188 -48 -119 -66 -80 106 193 -93 -89 84 -67 -42 239 -52 -295 49 107 -30 217 137 -293 -204 -8 -72 232
2934 232 381 -130 -267 -40 -229 -73 450 157 -246 26 -16 -308 107 316 -140 -112 156 -69 -21 204 -65
2955 -65 -241 -13 28 111 335 55 -285 -152 -125 -83 354 391 -64 -149 -147 -277 3 354 169 2 -23 -216 -108
2978 -108 152 5 -36 127 -65 -83 271 73 -301 -41 5 -213 219 447 -55 -229 -98 -305 -116 412 288
2999 288 -18 -1 -237 -336 122 220 26 186 75 -305 -52 188 -96 -59 169 -56 -65 267 81 -183 -91 -100 -61
3022 -61 251 253 20 -14 -211 -331 51 252 101 168 91 -348 -213 147 24 37 218 -38 -179 77 4 -123 84
3045 84 21 -141 150 163 -115 8 -3 -300 -57 320 74 -21 126 -205 -339 98 164 -23 157 76 -217 -98
3067 -98 59 -48 81 148 -103 -34 104 -64 -50 109 -88 -78 204 82 -89 68 -26 -170 67 145 7 98 60
$$ packed form
2910A88k36p1N3j4J86Q7k86MJ73j51K5K81k91k43L44N8j37K47q0m30Q9J96o4L04
2934B32J49n11j37K27j89J56N23k93m03K72m2k92M15K09m56K8K68k25M8K25k69
2955f5j76K28M1Q3K24k80l40J33K7M2M37L7m55q5Kj30K80L51j85j67k5j93J08
2978a08K60j47m1J63j92j8L54j98l74K60M6k18M32K28n02j74J31k07J89N28j24
2999B88l06J7k36r9M58R8j94J60j11l80K53K40k84L7K28k25rL32j86k64R2rL9
3022f1L12Kk33l4j97j20L82K01j51O7p7m39J35L60j23J3J81k56j41K56p3j27K07
3045H4o3j62K91J3k78J23j1k97K43L77k46r5J47l31j34M37O6j87J80q1k93J19
3067i8J57j07J29O7k51O9J38j68J4J59j97J0K82j22j71J57r4j44K37P8j38R1l8
$$ plain form
3090 60 -182 -34 73 -61 79 157 -134 -88 163 -74 -116 171 10 -166 120 82 -184 41 99 -157 -16 152
3112 152 -69 -58 93 -126 -96 155 5 -95 81 -32 -159 99 106 -120 23 82 -122 -27 129 -30 -30 61 -61
3135 -61 -36 82 -2 -20 50 -60 -49 146 29 -94 70 -8 -126 119 134 -73 2 42 -156 -16 181 2 -22 70
3159 70 -136 -132 162 29 -98 106 8 -195 72 131 -133 -7 111 -150 -61 182 -4 -110 40 -68 -120 130
3181 130 130 -41 -1 -44 -150 51 119 10 52 28 -145 -67 96 21 31 85 -70 -93 91 35 3 72 -47 -89 107
3206 107 78 -27 79 0 -172 26 133 -37 67 121 -178 -147 129 50 -19 139 -25 -186 25 75 -57 75
3228 75 60 -156 -50 79 -67 21 118 -109 -135 77 39 -29 102 -22 -162 -8 63 0 68 43 -112 -52 29 -16 98
3253 98 90 -94 -64 22 -37 34 141 -23 -120 37 9 -31 131 56 -101 -4 24 -77 82 132 -74 -55 47 -70 -2
$$ packed form
3090F0k42J48J07j34J40P8k91M6K51k37m2K87j61j76K86l8k66K25N8k56J41J68
3112A52k21J1J51k19L0K51j50j00J76j13j27K58Pk26J43N9k04R5J56j59%R1j22
3135f1K5J18q4j8P0j10J1J95j17j23J64p8j18K45J5k07P5M0j98J40J97j79k4R2
3159G0k06MK94j33j27K04r8k03K67N9k64J26J18k61Q9K43j86j06J50j08n2K50
3181A30%j71M0m3j06K01O8j09M2k4j73P8J63p5J0N4j55k3J84n6l2O9j19m2J96
3206A07k9j05J06p9j72J98J07j70J04N4k99L1K76p9o9J58j64j61K11N0j32J32
3228G5j5k16J06J29j46Q8R7k27k6K12l8o8J31j24j40J54P1o3O8k5j55O0Q1m5J14
3253I8qj84L0Q6n9P1J07j64r7J57k8m0J62p5j57R7K8j01J59N0k06J9J02j17O8
$$ plain form
3278 -2 164 -12 -128 45 -11 -75 102 83 -105 -22 19 -81 31 105 -52 -70 -10 -97 -10 113 1 -72 2 -46 -64
3303 -64 85 46 -55 22 -1 -88 46 93 -27 2 -1 -88 11 131 -11 -27 61 -57 -58 126 61 -62 55 16 -127 26
3329 26 115 -20 17 34 -107 -50 116 17 -18 58 -57 -77 81 40 -55 50 9 -108 6 83 -15 7 21 -88 -51 40
3355 40 4 3 28 -83 -64 38 -12 -17 78 -32 -105 29 29 -46 58 56 -109 -21 71 -37 29 92 -74 -61 81 -4 -46 113
3383 113 9 -108 65 60 -68 69 93 -101 -42 85 -28 -11 101 -26 -69 49 8 -39 48 27 -77 7 9 -48 40
3408 40 55 -58 -14 11 -36 20 49 -66 -36 19 -51 -21 58 -49 -38 53 -38 -72 93 20 -86 32 19 -96 45 102
3434 102 -95 -37 88 -49 -50 134 -7 -73 95 11 -96 75 84 -73 15 75 -68 11 94 -28 -46 65 -19 -44 49
3459 49 8 -50 32 5 -46 29 29 -25 9 5 -64 19 26 -50 13 23 -52 1 48 -61 5 75 -58 -63 90 -27 -71 92 0 -112
$$ packed form
3278bJ66j76j16J73n6o4J77j9j88Q3M1j00J12P4j57j8O0q7Q7J23j12p3P4m8j8
3303f4J49l9j01P7k3q7J34M7j20K9lq7R9J20j42j6Q8j18jJ84o5j23J17l9j43J53
3329B6Q9j35L7J7j41N7J66r9l5P6j15k0J58m1r5J05m1j17J14P7r8K2J4j09L7R1
3355D0l6jK5j11J9J02n0nR5j10p3J34%p5J04kj65Q8R2j08O6O3j66J3J42q5m2J59
3383A13j04j17J73nj28J37K4j94N9J27j13J7J12j27m3J18m1m7Q7k1j04Q4Kn7Q8
3408D0J5j13M4K5m7N6K9j15L0N5p0L0P9j07J1R1r1l4J65p3j06J18j3j15J41N7
3434A02j97N8J25j37jJ84j41o6J68q4j07J71Rj57Q8O0j43P9Q3j22j8J11q4k5R3
3459D9m1n8Q2k7n1P5%n4L4mo9Q3Pp6O3J0p5N3M7j09O6P0j33nJ53j17m4J63r2j12
$$ plain form
3489 -112 68 79 -111 15 80 -92 -22 113 -40 -32 101 -10 -86 65 27 -61 82 57 -91 26 80 -52 -16 92
3513 92 -28 -23 68 -8 -56 47 19 -21 19 1 -17 15 -27 -45 36 -1 -24 51 5 -114 -1 23 -91 8 78 -66 -37 50
3541 50 -67 -53 77 -10 -53 66 -6 -97 63 31 -119 46 108 -92 -20 107 -71 -95 88 1 -57 93 62 -89
3565 -89 -18 30 -43 45 62 -17 16 34 -63 -21 56 -12 10 71 -24 -50 15 -9 -39 28 14 9 47 -34 -63 15 -37 -69 82 46
3595 46 -83 24 43 -149 -43 123 -41 -53 91 -35 -116 33 16 -91 49 80 -59 6 31 -102 -11 90 -38
3618 -38 -19 115 -20 -78 63 7 -72 78 90 -44 -17 36 -46 -12 35 19 35 24 -29 16 17 -62 38 89 -46 -12 86
3645 86 -38 -82 45 8 -54 60 31 -76 9 3 -88 13 42 -59 17 77 -89 -64 100 -35 -74 107 24 -102 38
3670 38 48 -101 -11 90 -18 -11 50 -26 -27 41 -9 8 68 -18 -12 66 -9 -36 75 40 -55 22 48 -37 2 35 -31 13 44 -35
$$ packed form
3489a12J80J1j90J26O5j72P0J35j53QJ33j11p6J51l8q8J43k5j48J17N4j32L6J08
3513I2j20NR1p6m8J03k8m0M0j8j8L2m2j8Q1l7k3P5m6j19J13K4j14R9P0j44K9Q7
3541E0j17J4J30q7m3J19p2r1J60l2j50J65O2k00P2J27j78k4J83q7n8J50l1j51
3565h9P1M8p3Q8J7p9L3J8r7M2P7o8K2O1r5k6O5k4l0O7j4nL8q1k9P8n2l2J51l6
3595D6j29J07J9j92J06J66j64j2J44j26q1J49j7j07J40L1j39O5K5j33R1J01j28
3618c8J9J34j35n8J41n6p9J50J2j34K7N3q2L4M7j6J6j1n3M5Jp9J00N1j35L4R8
3645H6j24m4J27l7o2J14k9j07Q5or1J01K9j01P6O0j66K5J64j35l9J81q3j26J40
3670C8J0j49R0J01j08PO1p6jO8n0J7O0q6OP8p5k7J11l5r5P7K6q5L9L3o6M4L1p9
$$ plain form
3700 -35 14 41 -50 4 55 -61 -32 107 -12 -93 57 20 -89 55 48 -90 -24 56 -49 -28 57 -23 -25 33 -24 -41 58
3727 58 -3 -57 42 -1 -66 37 51 -72 -1 57 -37 -10 55 -5 -25 38 -15 -1 61 9 -2 54 -24 -37 91 28 -59 40 40
3756 40 -78 20 96 -44 -12 73 -47 -49 75 5 -24 41 -15 -70 57 33 -49 23 22 -84 6 50 -48 -9 58 -47 -50 41
3784 41 8 -32 31 -20 -47 31 15 -16 20 -25 -69 39 44 -32 43 49 -86 -28 60 -11 10 91 -22 -77 28 4 -26 68 25
3813 25 -52 32 23 -59 35 50 -68 -11 63 -36 -16 75 -57 -99 24 39 -7 53 12 -93 -50 -14 -21 63 71 -37 -24 -34 -89
3842 -89 2 88 -4 -31 30 -39 -32 43 -3 -62 22 21 -18 43 19 -74 -32 -7 -23 85 122 -35 -63 -12 -73 -9 142 74 -35
3871 -35 0 -36 -84 45 94 -2 28 23 -58 5 67 -24 -21 20 -29 10 104 19 -89 -31 -37 -44 75 87 -20 -39 -60 -99 4 84
3901 84 39 20 -21 -87 -38 49 21 3 33 -26 -53 41 28 -35 4 -14 -60 48 76 15 -6 -23 -90 11 111 52 20 15 -85
$$ packed form
3700c5M9K7r1N4N1j16K9J39j19q1J50l7j09J44pj38O6Q0j05K1Q5q0kN8n7j7R9
3727E8o1n4R9m3o5J03J4j23P1N8r4K7O5o0k0O3n3J4O2n2j1N6p8j3J28o3q7R9%
3756D0j18R8P6j40L2Q5j20kJ24p0k9O5n6n5J27k4q2P2jj06R0M4r8L9O7j05lR1
3784D1l3m0O3n1k7P8j6l1L6m5m4J08Np6P5Oj35N8Q8p1K1Q1j13n5J05k4l0R4m3
3813B5p7Q4rq2R4J5j18N7P4r9K0R1j32m2J23J5m6O0m1j05M3L6pQ4Qj08J3j0n5
3842h9R1Q6r2k7O1o9PP5m6n9Q4jl9O1k4r3M2K5j6J08L7j57k8N1o1O4J51o8j09
3871c5L5l6m8J29M9r6L0nq1O3O2r1LM1m9L9R4q5j08N8opJ19J2j07j9k1l9J03Q0
3901H4m5j9m1o6M9Q7k8j8L0n9k7R4j3o3L9j8m6J08K8o1k1j7o7J01J00n9l2nj00
$$ plain form
3930 -85 -81 84 77 20 65 10 -100 -1 71 18 27 39 -56 -10 76 22 -21 7 -39 -55 63 48 -10 5 -36 -93 -5 76 25 17 5
3961 5 -84 -39 43 44 35 23 -52 -42 21 6 12 34 -34 -61 39 40 1 40 14 -69 -1 62 27 37 21 -72 -40 60 22 20 56 -29
3993 -29 -71 42 54 -18 31 28 -86 -9 71 26 3 41 -47 -62 46 27 -3 13 -22 -51 10 25 -8 6 -1 -55 -8 51 6 14
4023 14 -11 -57 -41 26 26 8 2 -55 -63 33 11 21 56 -16 -68 11 30 -7 43 37 -74 -14 85 27 18 36 -34 -45 48 51 9 30 -3
4056 -3 -79 17 51 15 21 23 -58 -45 47 24 0 16 -37 -60 22 43 14 0 -27 -48 5 23 2 24 -27 -68 -18 34 25 39 11 -74
4088 -74 -64 29 19 23 40 -54 -70 16 18 5 62 6 -75 -20 51 10 40 60 -73 -57 58 41 10 45 -15 -85 11 63 27 43
4118 43 30 -66 -46 46 36 40 26 -54 -63 13 33 19 26 -24 -72 -23 9 24 38 -6 -56 -26 1 16 63 16 -61 -54 11 -4 43 71
4150 71 -55 -69 9 -1 7 67 8 -80 -8 28 4 62 52 -51 -46 28 7 44 85 -13 -69 13 21 9 55 35 -34 -28 16 9 41 60
$$ packed form
3930h5MJ65pn7M5n5j10R9P2n3RJ2r5M6Q6n4m3K8m6j6J18j5n8J5m1n7Q8Q1n1qj2
3961Eq9M5Q2Jrj2p5J0O3j5OK2o8k7J00Jl9L9k6q3O8O3l5J0j6r3L2J00l8kL6q5
3993b9m2J13J2p2M9lj14P7Q0m5k3L8q8j5J08j9l0J6l5k9O1J5l3J4pn4M7N9m5Q
4023A4k5m6J6O7%j8on7qR6k2J0L5p2n2P9J9l7N0oj11O0R9n8rJ8p0j1R3Lm2K1l3
4056cp6R6L4l6OKq1J3R2k3k4J6n3k3Q2K1k9j4k7k1N3J8k1K2n1m1N0N2rJ4k8q5
4088g4J0R3j0MJ7r4j6Q6Kj3N7n6q1N5P1m1L0K0j33J6J15j7l1L5o0p0R6N2l6J6
4118D3j3r6K0R2j0Mj4q0rP6K0j4Pn0m8M9L2J5J4m4n0L0K7J5M7m7p7PO5j5M7K8
4150G1j26j4P8j0QO0n9q8P2L6k4N8j0j03NP4k1L7M1r8n6Q2Qj2M6k0o9OM4pL2J9
$$ plain form
4182 60 -15 -27 0 3 20 53 2 -31 -17 -10 2 28 7 -35 -11 -32 -25 39 17 -31 -29 -22 -38 20 48 -28 -29 10 -25 -10 54 -4 -37
4215 -37 6 0 -49 38 47 -22 -13 18 -23 11 45 -1 -12 14 0 -10 39 8 -5 10 9 -16 24 38 4 1 11 -13 9 24 5 7 6 -34
4249 -34 -5 19 -12 -14 13 -10 -34 17 -11 -22 20 -3 -34 7 19 -13 2 17 -26 -28 22 -20 -14 37 -5 -39 14 15 -21 26 21 -19 -5
4282 -5 33 -4 5 31 4 -12 17 -1 -4 38 2 -11 14 8 -1 31 26 -2 -9 0 -5 21 28 -27 -14 8 -17 1 24 -20 -26 7 -19 -20 27 -2
4318 -2 -35 2 1 -34 12 36 -40 -30 12 -18 -20 14 -4 -25 -10 -16 -19 35 22 -33 8 1 -29 24 49 1 -13 7 -6 2 31 11 -2 14
4352 14 0 12 26 8 -7 6 -12 2 40 33 -15 -2 -4 -28 23 38 -1 -2 -2 -40 -21 15 -3 -27 16 -11 -36 14 18 -35 -4 4 -31
4385 -31 11 33 -13 -41 -10 -24 -19 36 19 -28 -16 -18 -27 13 32 1 -13 -8 -23 9 32 3 8 15 -5 10 28 6 -4 5 0 18 59 38
4419 38 -6 -25 -36 -25 51 44 -4 -5 -26 -52 -11 48 5 -7 -3 -31 -32 37 23 -25 -5 1 -25 11 27 -38 -37 -17 -26 8 48 9 -44 -33
$$ packed form
4182F0p5j2K7LJ7L3n1l3J4PJ2K6k1m2K4k1PO4k2m8KPj6N8K8p6jL9l5J5O4n8l3
4215c7M3om9Q7Ro9RL1m1L4L4m6j1K6j4j0M9l1j3J5jk5M0J4l4lJ0k4K2J5j9Kjm0
4249c4K9K4l1kK7k3k4N1k8j1M2k3l1M1J2l2J5J5m3kN0m2ON1m2l4N3Jl6M7nm0J4
4282eL8l7RK6k7j6K9j8lM2l6j3K5orL2nk8pRnK6Pn5J3K2k5J8K3m4oL3k6jM7k9
4318bl3L7jl5M6K4p6J0M2l0kL4j8k1J5olN4j3n5M1pl0N3K5m8j4K0j3QK9k0j3J6
4352A4j4J2J4j8j5J3j8J4L8pm8J3kk4N1J5l9j%l8J9L6j8k4M3k7k5N0Mn3L1Ql5
4385c1M2K2m6k8L1j4NN5j7m7J2krM0J9l1j4Nj5L2K3k9NPk0J5J8k2j0RnJ8M1k1
4419C8m4j9j1J1P6pm8jk1k6M1N9m3j2Mk8jO9j4m8K0Ok6L6J6o5JK0rL4M0l9n3J1
$$ plain form
4453 -33 -49 -38 37 44 12 -19 -24 -31 2 34 12 6 -2 -15 14 24 2 4 -10 -9 26 54 27 -2 -22 -40 -10 60 65 22 3 -36 -73 9
4487 9 40 22 4 -4 -34 -26 8 10 -2 24 -26 -35 24 14 -19 -22 -24 -25 13 40 8 -38 -27 -55 -34 28 36 12 -7 -45 -45 3 44 19 6
4522 6 -17 -38 -2 31 22 -4 0 -7 5 37 26 14 -1 -35 -16 55 38 25 12 -37 -41 14 42 24 27 1 -48 -28 18 19 8 13 -25 -43
4556 -43 5 23 -2 4 -23 -46 -10 36 9 -9 -8 -44 -29 19 23 5 -8 -29 -19 9 32 10 12 -12 -27 4 30 31 16 -1 -29 -9 18
4589 18 22 20 21 -19 1 26 17 19 27 -13 -12 16 31 16 30 7 -33 -1 26 11 5 -1 -29 -29 16 20 2 15 1 -40 -15 11 10 14 -2 -27 -24
4626 -24 1 1 -3 -13 -26 -17 5 19 -8 -6 -17 -15 12 33 24 20 -20 -16 9 22 22 24 18 -7 -4 0 2 16 17 -9 -11 20 6 6 22 -3 -10 14 31
4665 31 1 10 11 -21 -18 27 7 -5 4 -11 -30 -12 5 -2 12 12 -13 -10 -3 -19 -10 11 -15 -18 4 -1 -17 -24 -17 -2 11 11 13 13 5 -9 -1 14 7 25
4705 25 12 0 8 12 -1 11 35 6 3 16 3 -3 30 0 -11 0 1 -7 4 12 -7 3 12 -15 -13 8 -13 -9 0 -10 -12 6 -6 -9 1 2 -22
$$ packed form
4453c3j6J1P5Pl2l1npL3L2k2oqj3K9J0k2Kj4JL5K8k7k9k0j8L0P0Nm3j9l9l7Q2
4487IL1j8j8ql0QL4Kj2K6n0rN9j0l3lkjL8K7l2m6J1k8K1O2Qk4j9l8%M8M1k5j3
4522Fk3k1L6L3rk6MpJ2L2j1j2j5l4J9P1j7j3j3m9mN5K8j8Lk6m9K0M6Jj1Nl8j8
4556d3M8J8k5Ok7k3L6M6k7j8Jl6J5M8Mj8j3k1J0K8K3k2Kk4j5L1K6Jj5j7k8K0K7
4589A8MkJm0K0K5rKQm0JK8J5j5J4k3m0L2K7j5ook8%M5Mj8J3j4m1K5K6jMj6k5L
4626b4K5%mj0j3RK2J4k7Kj1KK7K1rmm0MK5J3%Kok5LMKJ4Jk6kL1j4%J6k5pK4J7
4665C1l0RJl2LM5k0j2Rj5j9J8J7pJ4%k5LPj6RK1k6lK2nj6pPJ5J3%K%qj4QJ5pJ8
4705B5j3j2QMj3J2K4k9lJ3j3oL3l0j1J1JqJ1Qj9J0Rk7KK1k1MRj0kJ8j2lJ0Jk4
$$ plain form
4742 -22 2 0 -22 -19 -6 -15 -16 -7 -18 -14 7 -10 -27 -3 -2 -10 13 3 -2 5 13 -1 -2 0 -12 -2 -2 3 8 27 -3 9 18 2 8 16 14 -12 22 15 -7
4783 -7 10 12 -9 1 2 -2 2 17 -13 -22 -2 -2 -10 16 2 -18 6 -1 -5 -1 0 -10 -6 4 -18 -8 8 -12 -24 2 -14 -6 11 2 -29 -8 9 1
4821 1 21 10 -26 -11 18 -2 6 27 11 -10 2 -5 7 20 6 -6 5 4 3 22 16 -17 10 0 2 10 20 -13 -17 13 -20 7 23 -1 -16
4856 -16 3 -11 -1 18 -2 -24 -10 -19 -3 0 2 -24 -16 -17 -18 -6 10 -10 -18 -4 -12 2 31 6 -12 -4 2 -15 15 9 -14 -9 2 -8 9 22
4892 22 1 -3 14 6 13 26 9 -3 8 10 4 21 31 -12 -2 -4 5 5 17 5 -21 -6 -15 -1 16 2 -15 -10 -6 -6 -1 4 -15 -7 -15 -11 5 14 -14
4931 -14 -3 -14 -21 -10 13 6 -13 -2 -14 -7 21 3 -4 -7 3 -8 21 26 -6 2 9 -12 3 32 15 4 14 11 -3 33 21 -6 10 6 -12
4966 -12 10 16 3 -1 -1 -1 1 10 9 -12 -7 -4 -4 19 15 -3 5 -6 -21 10 4 -10 -12 -16 -25 5 13 -11 -6 6 -10 -3 18 1 -6 -14 -8 -17 24 21 -13 2
5008 2 12 -11 3 26 16 -3 7 -1 -14 21 10 -3 4 13 -12 34 21 2 -9 -1 -8 13 23 1 -4 -7 -14 -10 16 6 2 -14 -13 -21 -1 -2 -7 -9
$$ packed form
4742b2K4kk2LJ3rjRj1MK1j7j7K4JqK3j0nPQj4jKj2J0%NNJ9l0J2Rj6OQkk6L4pk2
4783gJ7Kk1J0JmMJ5l0rK0%qK6j4k0K4pmMJj0MJ0k2J0J6k0j2K6j6QJ7rl1K1J7q
4821AK0j1l6J5K9k0QK1j6k1J2pJ2J3j4j2J1jjJ9ol3K7j0KQJ0l3mL0l3K7J6k4j5
4856a6J9j4J0J9k0k2J4rJ6LKk6QjjJ2J6k0qJ4qJ4K9k5j8QOj7L0ok3NJ1j0J7J3
4892B2k1mJ7qPJ3j7j2J1KoJ7J0m3J0kR%J2j2k6J5rJ4J7j4j7NM%NNj9QqMJ6Rk8
4931a4J1j1pJ1K3pj9J1j2PK8j8plJ0j1K9Nl2QPk1J5K9j7j1J0lj4L6j2k7J6mj8
4966a2K2Oj3m%%KRjk1NL%K3mj8Qj1j5L1oj4kmrL0Qk4NJ2j6PK1j7pqOrM1ll4J5
5008BJ0k3J4K3j0j9J0qj3L5j1j3PRk5M6j3j9j1QpK1J0k2nlpMK6j0mj6JqK0jnk
$$ plain form
5046 -9 -14 -16 -8 10 -24 -18 -14 -21 -19 -7 -10 -8 -9 -8 -16 6 12 0 -7 -12 -14 2 15 2 14 17 2 3 21 11 2 22 -2 3 17 20 3 13 19 -6 12 13
5088 13 9 7 5 -3 -2 12 6 0 -5 -1 -22 -5 -3 2 -2 -4 -18 4 -2 -15 -8 1 -15 -15 8 -1 2 -8 -4 -6 10 5 -8 4 -2 -11 -17 3 3 -11 -10 -14 7 13 2
5133 2 1 16 4 -1 16 8 15 22 21 0 11 19 6 6 12 -8 -2 -2 9 -1 -4 -22 -3 11 -7 -8 -16 -6 -12 -7 1 -2 -6 -10 -21 -11 -18 -15 -4 0 -19 -8
5175 -8 -7 -3 -9 -4 -1 -5 -12 3 1 -6 3 -5 2 7 -3 13 14 4 -3 10 2 -1 16 12 9 11 2 4 24 27 -2 2 11 -8 -7 12 -3 -7 12 1 -5 -5 8 -10 7
5220 7 -21 -10 -5 -3 -14 -5 -1 -13 -12 1 -9 -19 -8 -9 -6 -7 -8 -17 -5 -5 -12 0 1 -13 3 11 -6 6 7 15 4 11 7 -5 5 11 -4 14 8 10 9 18
5262 18 11 15 11 -5 6 9 5 13 25 3 -3 6 5 -8 9 8 -8 -12 7 -3 -2 1 -17 -8 -10 -12 6 0 -7 -24 -14 -17 -16 10 -8 -19 -10 6 -14 4 0
5303 0 -18 12 18 -5 -1 9 -1 -1 4 11 12 18 -5 -8 -7 12 -1 14 17 7 4 8 0 5 9 -1 -5 13 2 -11 1 -4 -15 -8 15 3 -3 5 -19 -17 1
5344 1 -10 -14 -4 -5 -21 -16 -6 -16 -7 -4 -5 -10 -15 -12 -8 6 0 9 -2 -8 2 6 -16 -12 5 5 6 7 3 0 18 4 1 18 16 -6 10 7 -7 4 19 12 0
$$ packed form
5046inkQJ8l4OMpKJ2lKjJqK2Oj2pnkJ6J3j3J2Lj5JJ8j0rK0k4NJ4Lj7J0Ok5J8J
5088A3mkkqJJ4oonMk1J7KNmkj4K2oj3PRj6%K3rLj0MkJ6nj3J2oroK0%j4JmK1Oj1
5133BjJ5j2nJ7qPPjk1J1Qj3%Ok0O%J1j0lj8J9J4j8jqJ0oNQlmmj1J0pLJ1Mj9J1
5175hJMoNLmpJ5kpRqPNj0J6Jj0pJ3qlJ7mlKrKK0Lk9MRj9JJ9j5mJ9j1o%J3j8J7
5220Gk8J1NKj1RMj2JJ3j0j0J1jLjjrJ2%pJ2Jj4J6Qj7J2JQj1Pmj2J0Oj5J8oKjR
5262A8pMmj6J1LmQJ2k2oRjj3J7jj6mJ9j0JLj8RkkJ8opj7J0lJK6j8j1RJ6k0J8m
5303@j8L0Ok3MJ0j0%NPJOk3lJJ9j3J5Lj0lMqNMj0mJ8j1j3J2nj1PK3j2oQk4KJ8
5344Aj1mJ0jj6NJ0j0RLjnnLMJ4oRj1oJ0Mk2MJ7%JJmlJ8j4lJ7kk2J6lj4J1J5pj2
$$ plain form
5387 0 10 -9 -3 5 8 -7 4 8 -3 -10 -2 -11 -10 19 6 4 7 -13 -13 -22 -18 -12 -3 5 -16 -17 -8 -16 -5 -16 4 -2 -9 -21 6 7 -11 11 -2 4 -11 -1
5429 -1 -1 -14 13 3 -6 29 12 -7 16 16 2 10 26 7 9 19 7 -6 19 12 -1 14 18 -17 12 15 -7 -10 11 8 -6 0 8 -7 -7 -1 -1 1 -10
5468 -10 -12 -8 3 0 -1 -4 -6 -1 -7 -7 -5 9 -12 9 -2 -12 0 18 -13 -1 15 -8 -9 23 3 -7 24 11 -2 19 30 -4 18 31 1 0
5504 0 29 8 -3 8 3 -2 4 20 4 6 1 3 0 5 -1 -4 7 -5 -11 -6 11 -7 -7 -10 4 -7 -16 -19 4 -34 -8 12 -3 -12 7 -6 -20 17 16 -23
5544 -23 -3 10 -10 6 4 1 -17 18 7 -15 5 24 -10 8 9 0 7 34 6 4 17 1 -1 8 17 8 -2 15 1 4 2 1 12 8 -5 -5 -5 -4 1
5583 1 4 -8 -7 -1 -17 5 0 -19 -16 3 -10 -9 21 -5 -20 1 -6 -16 11 12 -5 15 12 -9 -4 25 -5 -14 8 7 -6 21 15 -6 12 11 0 11
5621 11 22 15 8 12 16 7 11 7 -2 6 4 6 7 10 9 7 10 2 14 0 11 15 -3 -13 2 7 -23 11 -4 -23 -4 11 -8 -11 8 -16 -13 6 -2 -15 15
5662 15 2 -9 0 4 -5 -10 18 2 -8 11 15 1 16 9 -8 14 21 5 17 15 8 1 12 11 12 20 10 9 13 13 13 8 12 7 2 0 4 8 -1 -9 1 10 0 9
$$ packed form
5387@J0j9OQLj5J1Mj1pQrJK9j3kLk0%rMORQk1jRqJ1j1K0opj2K7Jj8K2j3Oj5J0
5429a%j3K7j0rL5j7j9K3%j4QJ6j9KJ0j2j3K5pj3J5Ml5K9Lk2lK1lj4OQj5%O%Kj1
5468a0kMJ1ljlkNo%KJ4k1K1j1j0J2J8l1J2J6k3jL2k0j0L1j3j3K1J1l4K2J3l0j
5504@K9k1j1J1nnOJ6j6KnKlNolJ1j2oNJ7j8%lJ4j1rlK3l8K6K0j5rJ9j3j4L7jl9
5544b3K0J3k0J6klj8L5j1k2K0J9l4J8JrPK7k8kJ3j6kRRrj0J7j4LkjJ1mj3%%JN
5583ALj2JOj6K2nj9LJ9j3JL0k6j5K1pj0K7Jj7K0lk1NK9l0rK2jj3K7ok1J8jj1J1
5621A1J1ppMMrMmrQkKJLjkLqJ2j4J1Mj8j0J5Nl0L4j5j9J9J5j9lJ9k4LJ9qj3L0
5662A5j3j1RMrnK8j6j0J9Mj4J5pj7K2Pj6J2kppJ1jJQj0jM%%nMnnkMMrqJ0Rj0R
$$ plain form
5706 9 5 -15 -3 0 -22 -11 11 -9 -16 13 7 -4 11 11 -10 -1 -3 -6 -11 18 -9 -4 0 -7 0 9 8 7 29 11 13 9 22 12 14 20 11 29 27 -2 6 7 15
5749 15 8 3 -1 12 10 -8 13 -4 -2 7 11 -2 -5 1 -3 -11 -2 -18 -11 -4 -3 -15 -4 3 -10 -12 7 -5 -14 10 4 -11 3 1 -4 3 5 -7 -3 5 5 -11 14
5792 14 2 -11 10 10 4 4 23 3 6 7 22 14 16 12 5 17 9 13 2 9 10 -1 8 -4 18 12 11 10 8 -7 13 1 -5 -6 -11 -9 -3 -1 -6 -4 1 -11 -10 6
5836 6 5 5 5 -5 -22 -6 8 -15 -11 10 5 -5 1 -18 -16 3 6 -2 7 8 10 5 5 -2 11 20 -3 11 14 2 11 15 8 4 8 8 -1 8 8 18 21 5 -11 2
5880 2 12 1 4 2 -7 5 2 -6 -10 -2 -24 -14 1 4 -18 5 -5 -13 6 1 -9 6 2 -1 -15 -7 -9 -11 7 10 -8 0 -6 -6 13 -5 -5 21 24 -2 3 3
5922 3 3 14 14 27 -1 -1 -11 -6 8 0 7 29 3 -11 5 5 -14 12 3 -12 -7 10 -12 -1 1 -2 -6 11 14 -3 5 -14 -37 -12 6 -7 7 6
5960 6 -11 -16 9 -10 4 -1 1 -10 12 -3 -3 9 4 -6 13 16 10 18 21 5 -4 21 3 8 11 16 2 14 -6 8 22 6 5 0 -2 2 12 12 5 7 8
6001 8 0 5 2 6 3 4 -6 -1 7 -5 -3 -7 3 -8 -5 -10 -16 1 2 4 4 -7 -5 -21 -5 -10 -3 7 5 -4 10 0 2 20 8 9 4 11 -4 7 16 7 7 23 7
$$ packed form
5706Imk0J2Lk2J1K2k0pK9oj1J5%k1RklnK9k7NMpPRjjK2j8KmJ3j0KOrJ8kk9QJQ
5749A5pnmJ3kj8K1j7KRMj3lOmqRj6PPJj2J1Pj3kJ9j2rK4oj5J4knPKj2MQ%j6K5
5792A4j2j3K1%o%J9k0LJJ5qKmpJ2qMj1PJj1Rj2K2ojjkj5K0j2ojnKOKnKNj2JJ6
5836Fj%%j0j7J6J4k3MK1nj0Oj9KJ9LqRJKn%pJ3Rk3J4Lj2RMpmM%rR%J0Lj6j6J3
5880BJ0j1LkrJ2lqmQk2J0J5Lk2K3j0qJ9nj0J5mlj4QkkJ8Lj8Qo%J9j8%K6Lk6N%
5922C%J1%J3k8%j0NJ4qPK2k6j4J6%j9K6rj5NJ7k2J1KlmJ7Lj7Qj9k3K5J8j3J4j
5960Fj7nK5j9J4nKj1K2j5%J2nj0J9LoQLj6rK5j8NLNj4J2k0J4J4j6jnkMJ0%pKJ
6001HqNlMlJj0NQj2KmJ0j1LnoJ7JK%j1Kj6J6nPJ0krJ4j0KJ8j2JnPj5J1Rr%J6j6
$$ plain form
6046 7 0 15 5 -1 11 4 -12 10 8 -8 -1 13 2 5 21 3 3 18 0 0 -3 -9 -5 15 2 -14 3 0 -11 6 -12 -4 -11 2 -16 -10 9 -6
6084 -6 -3 2 -8 -12 3 2 -2 25 5 3 12 4 -6 12 17 6 18 26 5 15 24 -3 4 21 9 5 16 7 7 8 13 3 6 7 -3 0 11 -1 12 20 -13
6125 -13 -7 7 -5 -12 -7 -7 0 -10 -5 -1 2 -12 -13 -6 5 4 1 -5 -20 -11 0 -5 -8 0 -8 2 8 -9 -8 9 -1 -11 10 1 6 16 19 6 9 18 4 17 11
6168 11 -2 -1 24 14 15 24 6 -12 15 7 11 13 24 -8 -13 3 -7 16 5 1 -18 -13 -10 -17 8 -9 -9 3 -19 -7 11 9 1 5 -6 -7 -1 11 -14
6207 -14 0 0 -12 -6 15 6 3 11 -4 -7 36 13 -17 -2 0 -7 4 21 3 -3 17 -1 -2 10 9 -2 6 -2 -6 25 29 5 3 -9 -15 -3 0 0 -6 -16
6247 -16 -9 -10 4 -9 -14 -6 -17 -20 1 13 -7 0 -11 -11 0 -6 -9 -7 -7 -11 -8 5 -13 -1 4 3 -9 12 0 11 27 1 -10 17 14 5 19 5 -11
6286 -11 6 13 -4 -1 18 -11 -5 18 18 5 12 5 -15 -1 3 7 10 10 -4 1 6 -5 -13 3 -20 -12 -8 -20 -14 -1 -8 -16 -6 1 -20 -14 -14 -18 1 -2 -16 -7
6328 -7 4 -7 11 8 -5 13 10 -3 -7 7 8 -4 4 5 -4 14 17 -12 0 12 -6 9 4 7 -3 7 3 -3 19 -2 -12 -2 -10 -1 18 18 -6 6
$$ packed form
6046GpJ5j0oJ2pj6K2kj6PJ4j1LJ6j8%J5j8%loMK0j3j6J7lj1J7j8QpJ3j8OJ9j5
6084fLNj0mJ5jmK7k0kRqj0J8Nj1J2Qk1J0Rk7PJ7j2mJ1r%JNj0LJj0LJ1j2J3Ql3
6125a3OJ4j2pN%Pj0NMLj4jPJ1jloj5RJ1nlQqJ0Oj7JJ7j0j0K1rNJ0Lj3LRj4J3o
6168A1j3JK5j0JRj8j8K7qMKJ1l2nJ6j0K3j1mj9NLpK5j7%J2k2J2J8kqMj1jOJ2k5
6207a4J4%j2OK1rlQj5lM3k3l0J5KpJ1J7j8oK0j8jJ2jj1QqmL1Mk4kj2oJ2L%oj0
6247a6PjJ4j3nQj1lK1J2k0Pj1%J1olK%mLJ3j8J2Njj2K1j2J1J6k6j1K7lrJ4j4j6
6286a1J7Pj7LJ9k9OK3%j3Ppk0J4MML%j4NNj1qJ6k3QMj2OJ3pqJ0Pk1O%mJ9lj4R
6328gJ1j1J8lj3J8lj3mJ4Jj2QJrJ8Lk9J2J2j8J5nLj0J0moK2k1j0J0qRJ9%k4J2
$$ plain form
6366 6 -2 -12 12 7 -4 -2 -6 -13 -2 -4 7 -3 1 -21 -10 -2 -6 -7 -7 -20 -17 2 13 3 -11 10 -13 -3 19 8 -5 14 -2 -10 19 34 11
6403 11 9 -4 -5 8 29 12 -6 10 -10 6 13 12 7 14 7 -2 10 12 18 9 -11 -15 3 11 11 3 8 -27 -2 -3 1 -1 14 -12 -31 1 3 11 15 -10 -35
6444 -35 -11 1 5 2 -11 -21 -19 5 9 -5 10 -4 -14 7 12 13 13 3 -4 -5 23 17 24 14 -4 12 5 24 30 30 6 6 6 11 22 33 0 -13 8
6483 8 7 11 14 8 -13 -14 -9 -9 13 12 6 -22 -16 -7 5 14 -3 -18 -11 -4 7 11 8 -18 -5 0 -18 5 14 1 -12 -13 -3 1 23 18 -5 -7 8 -3 24 23
6525 23 -11 -4 6 -2 11 23 14 3 11 -3 11 18 10 10 0 -6 -1 12 13 1 -12 -11 -13 -7 12 2 -17 -11 -13 -12 6 10 -5 -2 -14 -8 -3 7 -3 -16
6565 -16 -13 -19 -9 3 8 1 10 1 -5 13 23 9 15 0 -4 20 11 10 10 1 -11 6 1 9 11 11 3 6 22 9 4 25 7 -2 6 9 7 23 -6 -9 2 5 -14
6608 -14 -3 12 3 -12 -5 -9 0 1 2 -11 3 -5 -8 -8 -1 -15 -13 -14 -12 -9 -2 -7 -20 2 -6 1 9 -3 -13 9 3 -1 12 5 4 5 11 -3 -1 5 12 0 14 -12
6652 -12 -10 19 8 9 10 19 8 11 17 -5 18 18 -2 -6 12 8 18 4 -7 -2 -9 -3 12 16 14 -11 -3 9 -11 0 11 -10 -31 -17 -8 5 3 -10 -20
$$ packed form
6366Fqj0K4nj1KmpJ1kJ1j0Mk2J1Qmj%j3LJ9J1j0j4K1k3J0K2j1j3J9j6qK9J5k3
6403A1kj3jJ3K1j7j8J6k0J6PjnPprJ2KOrk0mJ8Q%qNl5K5jMkJ5k6j9L2KQMk5k5
6444c5K4J2Mlj3j0KK4Mj4J5j4j0K1NJ%j0pjK8oPj0j8J6pJ9O%k4%%NJ1J1l3j3K1
6483HjMLok1jN%K2jok8ORJ2Rj7j5PPJ1Mlk6J3Nj8K3Rj3j3jJ0MK2nk3kJ5j1K7j
6525B3l4PJ0qJ3J2rj1Qj4J4Pq%j0oNJ3Jj2j3JkOJ9j0j9OkJJ8Mj5Lj2ONJ0j0j3
6565a6LoJ0J2NpRroJ8J0j4Oj5mK4rj%rj2J7nQK%qLJ6j3nK1j8rQLkJ6k9lJ1Lj9
6608a4J1J5rj5PmRJJj3J4ql%Pj4KjKLPnj3K2qPQj2j0K2omJ3pjJOj4KOPj2J4k6
6652a2KK9j1JJRj1LOk2K3%k0mJ8mJ0j4j1NpOJ5Mkk5QJ2k0J1J1k1k1J4RJ3kj3j0
$$ plain form
6691 -20 -7 -19 -1 13 6 -7 -3 -3 -4 24 13 8 2 0 -7 24 28 5 2 -2 -2 9 31 15 -2 10 2 -9 20 25 4 -6 -4 -22 5 22 23 -2
6729 -2 -9 -13 -8 8 19 -4 -4 -16 -16 -3 7 9 -6 -25 -18 -14 5 9 0 -12 -35 -8 10 7 -2 3 -18 -7 0 13 28 12 -14 -28 6 18 8 19
6767 19 16 -22 -20 21 7 19 24 -7 -27 7 10 16 27 -1 -12 -12 9 15 26 5 -17 -4 11 6 2 7 -12 -19 -11 -6 13 12 1 -23 -19 -16 -3 20
6805 20 -4 -13 -5 -4 -5 9 10 0 -14 1 -7 20 37 9 -12 1 -6 -1 33 14 -14 -7 16 -6 29 27 0 -11 6 1 9 41 12 2 4 -4 -5 28
6843 28 21 6 5 -2 -4 8 15 -4 -14 -3 -17 2 15 9 5 -16 -20 -4 23 3 2 -7 -25 -23 21 2 -4 7 -3 -29 -3 11 2 13 4 -19 -4
6880 -4 22 7 -7 9 -2 -10 12 24 -6 3 4 -4 5 24 15 9 21 -13 -5 26 24 7 1 0 -6 10 8 -3 3 5 -4 -5 9 5 15 -8 -16 4 3 -2 -2 -3
6922 -3 -27 -10 5 -12 -10 -4 -7 -14 9 3 -16 -5 14 -8 0 18 -7 -2 14 -1 -3 23 18 -4 9 6 2 27 17 -3 -1 9 2 11 16 4 1 -1 -3 7
6962 7 15 16 -3 -13 -3 -4 14 16 1 4 -10 -12 9 12 -9 -3 -4 -13 -2 9 -16 -14 -14 -27 -2 21 -5 -19 7 -13 -14 10 26 7 2 -2 -19 -9
$$ packed form
6691b0J3j2J8J4pj3M%jK8j1nokpL1Mk3lm%J1K2j6j7J2qj1K9Nk1j0Kj8K7J7Jk5
6729bpmNJ6J1k3%j2%J3J0Kj5j9PMJ9Mrj2k3K7J8lrNk1J1PJ3J5j6k6j4L4J2j0J1
6767A9ll8KM1j4J2Nl1k0L4LOJ1k8j1%K1OJ1k1k2J3J5nmNj9pQNJ9jj1k4MLJ3K3
6805B0k4rQJjJ4Jj0j4J5qK7J7k8k1J3pNL4j9k8PK3k2L5kk7j1J7nQL2k9j0KqjL3
6843B8pj5jpkJ2Pj9j0J1j4J9J3omk1mJ6K7k0jrj8KM4j9oJ1j0k6K6J4rJ1rk3J5
6880dK6j5j4J6j1qK2J2l0RJqRJ9roJ2l4QL1kj7ojoJ6kj1OKrjJ4mJ0k3qK0jn%j
6922ck4J7J5j7KOlpK3oj9J1J9k2QJ8k5NJ6j5kK6nk2J3lmK5j0k0KJ0pRNj2lkkJ0
6962GQJj9j0J0jJ8Kj5Lj4kK1Lk1OjrJ1J1k5K%j3K5K3k6j4K6k0jK4J6j9nmj7J0
$$ plain form
7000 -9 27 15 5 7 -15 -2 20 27 -3 -1 -4 0 16 32 22 -1 -1 3 0 25 36 13 8 -12 2 18 24 14 1 -18 -13 -3 23 10 9 -15 -20
7037 -20 -5 15 16 27 3 -30 -14 6 13 -7 -10 -17 -38 -1 9 3 0 -4 -44 -7 10 4 23 10 -19 -15 4 16 10 0 -6 -14 5 18 16 14 8 1
7075 1 10 13 34 28 11 -6 -16 -4 24 22 15 -6 -22 9 12 21 21 2 -12 -3 1 3 21 15 -16 -17 -1 -4 12 19 -22 -20 -13 -1 3 24 11 -10 -12 -6 2
7116 2 14 12 -12 -18 -4 5 7 23 -4 -20 3 18 8 19 24 -5 -2 4 10 24 25 5 -4 7 8 15 28 -6 -14 -4 -5 15 4 -4 -17 -14 -2 -2 2 9
7156 9 -10 -1 -6 -14 1 12 -5 -13 -5 -9 -15 4 6 -20 -13 -10 -15 -2 10 1 -2 14 -6 -3 17 5 -11 -10 -4 -3 0 12 0 0 2 1 -6 10 14 -2 13 -10
7198 -10 7 19 1 13 -6 6 1 -3 7 -1 9 -4 -2 0 11 -17 11 16 -12 -14 -1 -16 -16 5 -12 -14 -7 -16 -23 2 -6 -13 -7 -10 -10 9 8 -9 -1 -4
7238 -4 3 -6 0 0 -6 8 5 -8 -2 17 4 6 6 1 1 20 7 4 0 17 6 11 18 16 13 -1 -7 -4 1 0 3 -1 -2 3 7 -3 2 7 -6 0 0 -9 -4 11 0 -26 -4
7285 -4 -8 -27 6 1 -19 -7 8 -18 6 6 -2 -19 8 2 -9 -4 9 1 17 0 7 17 3 -5 -1 1 1 16 13 -1 3 6 -4 3 22 20 16 -4 -2 -3 3
$$ packed form
7000iL6j2j0Kk2J3K2Pl0KlMJ6J6j0k3%MlK5J1k3nk0J4J6Oj0j3j9NJ0K6j3jk4n
7037b0J5K0JJ1k4l3J6K0Pk0lpk1L7J0olmm0L7J7oJ9j3k9MJ9J2oj0oqJ9J3kkop
7075ARLK1oj7j7j0J2K8kpk1j6L1LR%j9j4RMKJ8ol1jJ6lJ6Pm1KPJ2MK1j3k1kOQ
7116BJ2kk4oJ4RKJ6k7j6K3J5j0J1Nk9LOOJ4Jk0rJ1JPJ3l4qJ0jK0j1qj3LJ2%MP
7156Ij9RnqJ5J1j7qQmoJ9Kk6PLnJ3J2rlJ6k0LK0j2j6JOJLJ2j2%KjpJ6Mj6J5k3
7198a0J7J2j8J2j9J2nmJ0qJ0j3KKJ1k8K8Nk8kJ3j5%K1j7kPrpK5qpOl%J9jj7Ql
7238dPrO%oJ4lj3OJ9j3K%n%J9j3lmJ7j1NPklj4oLNjLmjNMj0NNj3O%rNJ5j1k6K2
7285dmj9L3nk0J2J5k6K4%qj7K7oj1NJ3qJ6j7PJ0j4qMK%J5lj4MLj0PJ9kmk0KjO
$$ plain form
7326 3 9 1 7 -5 -6 6 -7 -6 8 -3 -13 -13 19 -9 -9 -3 -16 -15 -1 1 -14 -3 -18 -24 -8 -9 -1 9 -4 -26 -10 13 10 5 -1 -4 -10 -11 25 -2
7366 -2 10 4 -5 2 -1 15 6 5 -10 -10 3 15 25 12 -21 -4 4 8 -6 10 -4 -17 -11 -4 5 17 9 -16 -11 -5 -12 16 14 -18 -24 -2 6 -6 12 1
7406 1 -19 -11 -1 -8 12 15 -20 -19 -1 2 7 8 -2 -28 -11 -4 8 12 -1 -11 -11 -8 8 8 12 4 -9 5 9 32 27 -2 -14 8 -3 2 24 -3 -14
7445 -14 -11 -3 -13 14 23 -27 -21 -1 -21 12 15 4 -26 -16 -11 -3 10 -4 -19 -21 -3 -13 4 -5 -10 -15 -15 -7 16 5 0 -6 -16 -14 5 17 -6 -3 -2
7484 -2 -10 3 20 9 -6 14 3 1 14 14 -2 -6 -2 -16 12 24 10 -3 5 -6 2 24 7 -12 0 4 1 -4 11 2 6 -6 -4 -3 6 -1 -18 -11 -8 -4
7524 -4 -7 -12 -6 -6 -20 -8 7 -2 3 1 -2 -11 17 19 -10 -10 -13 -9 14 18 -5 -15 -1 -6 3 16 11 -2 3 1 -23 19 16 5 3 2 -4 3 17 6 -6 8 1
7567 1 14 9 7 1 0 1 8 16 6 17 -1 -9 -5 5 13 -5 -4 -16 -16 8 4 -1 2 -1 -9 -5 -2 0 -13 -1 -11 -16 25 21 2 -10 -10 -16 1 17 -2 0 2 -9
7611 -9 -3 9 13 4 9 3 -5 9 17 13 -4 3 -6 1 14 -5 -7 0 -10 -1 8 8 9 -3 -3 -4 0 5 5 -2 -14 -4 3 11 -11 9 -8 -19 -6 -1 -13 -10 11 -20
$$ packed form
7326COqOj2jJ2j3JJ4j1j0%L2k8%Oj3JJ4Kj5J1j5oJ6jQJ0j3k2J6K3lnolojL6k7
7366bJ2orPlJ6rjj5%J3J2J0j3l3J7QMj4J6j4j3OPRJ2qk5NOpK8kl2oK2Qj2J8j1
7406Ak0QJ0pK0Ll5JJ8LNJj0k6J7PJ2Mj3j0%LJ6%Mqj3J4MK3nk9j2K2j1NK2k7j1
7445a4LQj0K7Rn0OK0k0L3Lj1l0J0NQJ3j4j5kJ8j0J7rnn%QK3j1noj0KJ9J2k3LJ
7484bqJ3J7j1j5K0j1kJ3%j6mMj4K8J2j4j3Qj1QK2j7j9J2MlnJ5rMj2KJRpj7PLM
7524dlnO%j4J2J5rNklrK8Kk9%lMK3Mk3j0J4nRJ3nj3Nkk4M2lj1kjoPJ4j1j2J4p
7567AJ3nkojJPQj0J1j8qMJ0Qj8Jj2%K4mnLlqMLKj3J2j0nM1mj9j2%oJ7J6j9KKj1
7611iOJ2MrNoqJ4Qmj7PrPJ3j9kPj0RR%Jj2%jMN%pj2J0PQk2K0j7j1J3Nj2LK1l1
$$ plain form
7655 -20 -14 7 -4 -6 9 -1 -21 7 22 -15 -2 8 -12 8 12 7 -3 15 15 -4 13 18 11 6 3 -6 -2 13 4 4 6 -1 18 20 1 8 7 4 6 5 -4
7696 -4 6 19 -11 8 8 2 0 4 -16 -9 5 -1 -15 -13 7 -6 2 17 -3 -3 8 -1 -16 -8 11 0 5 3 2 12 8 5 -2 7 22 3 13 12 3 8 14 10
7738 10 13 15 13 14 2 -1 9 -4 -10 1 4 1 11 10 -1 7 14 -1 -1 7 -15 0 14 5 -11 15 -1 -21 2 3 -4 -7 6 -13 -13 3 0 -10 -3 12
7778 12 -20 1 6 -5 4 7 -14 -7 2 1 -1 16 8 -2 7 5 14 11 11 1 4 20 22 -5 -7 7 -2 -1 13 3 0 5 -1 3 3 15 8 -1 -3 6 -1 -3 6 -13 -18 -1
7824 -1 -6 -8 -1 1 -9 -20 1 -3 -5 12 -2 -21 5 9 -1 13 2 -18 5 19 -2 -6 22 -3 -18 16 -6 21 20 -3 -4 -2 10 11 12 1 -4 3
7862 3 11 11 6 13 3 12 5 8 2 18 4 -7 4 25 1 6 -1 -25 -1 0 -9 6 0 -17 21 5 -12 -8 13 5 -14 2 1 -3 5 -6 -3 -6 -2 -7 8 8
7904 8 -8 -9 8 -7 5 24 8 -14 9 0 3 14 1 -4 3 7 14 8 3 -4 -5 11 -2 6 3 5 -8 -1 -3 8 25 -1 -12 -2 3 -6 -1 -14 -21 -12 -10 -21
7946 -21 -18 8 -6 -12 -7 4 -11 9 -9 -20 -1 6 -12 -4 8 -22 -20 5 -5 -15 15 2 -6 1 0 13 26 23 -8 -2 13 8 22 6 -1 -1 17
$$ packed form
7655b0OK1j1kJ5j0k0K8J5l7J3J0k0K0Mnj0J8%j9J7NpnlrMJ5r%KpJ9Kj9PjlKjr
7696dJ0J3l0J9%okMk0PJ4oj4KK0j3QJ5k0%J1rj5QJ9j1NkjJ0mlpRJ5j9J0jrNOm
7738A0LKkJj2lJ0j3oJ1LlJ0jj1QPj5%Qk2J5J4rj6K6j6k0K3JplJ3j9%J6lj0PJ5
7778A2l2K1Nj1RLk1PRjkJ7qj0RkRl%j0LJ6Kk7kJ4rJJ4j0lNoM%J2prkRpkRj9nJ7
7824ankPKj0j1K1mkJ7j4j9K6Mj0J4j1k0K3J4k1mK8k5j5L4k2K7jk3jKJ2JJj1nP
7862CQ%nPj0RpLoJ6j4j1J1K1k4Npk4K4JrJ5oj7L8j6j7MK1qj9J6jmQj1LlMnJ5%
7904Hj6jJ7j5J2J9j6k2K3rLJ1j3nPMPonpjJ6j3QlKj3PkJ1J7k6j1J0NrNj3pRKj1
7946b1LK6j4oNJ1j5K0j8j1J9Pj8QJ2l0KK5j0j0L0j3qPjJ3J3ll1OJ5nJ4j6p%J8
$$ plain form
7983 17 4 -3 16 5 7 8 -14 1 9 7 1 -1 -1 -3 6 9 -16 -1 2 -2 -7 2 -7 -3 -5 -26 -9 -7 -18 -6 -2 -15 -10 2 -7 -18 -3 -2 -11 -4 6 -17 -2
8026 -2 9 -14 1 4 3 -5 19 2 6 14 19 1 9 15 -1 14 12 5 13 10 7 -3 4 8 -2 10 5 13 9 11 -4 4 4 -3 1 9 -7 -10 5 -9 -13 5 -4 3 4
8071 4 -8 -21 5 -3 3 -3 -2 -1 -5 4 -20 -6 -4 -6 -10 14 8 1 29 -11 6 16 5 2 8 -6 -5 -1 10 -1 0 11 1 -5 8 2 4 9 -1 3 15 13
8113 13 -3 13 -10 -4 9 20 -7 -8 0 -16 -15 -2 -2 -14 0 -9 -23 -4 -3 -1 -5 -10 -1 -1 8 -8 -6 1 -21 2 -4 -16 7 5 -15 0 8 -8 2
8152 2 13 -11 -8 4 8 -4 3 1 -4 4 10 -4 0 12 5 4 20 17 -9 1 6 -4 4 20 6 8 -1 -13 -4 1 -9 4 -8 -14 -3 -1 -16 6 -18
$$ packed form
7983A7j3pJ9j1KJk2J5Qkok%kRLk5J5LmnRrMkk1J7Kj1J2Mj3NJ2rj1J5JrPJ0k3J5
8026bJ1k3J5LjqK4j7MQNj8QOj6J5kpQllj0PMj0J2nQmKj5Q%pMQj6lJ5j4mJ8rPJ
8071Dj2j3K6qOoJJmRk4J4KkmK4opK8m0J7J0j1lOj4JMJ1j1JJ1j0oJ3oKNj0MJ2k
8113A3j6J6k3OJ3J1k7jQj6JJ3%j2J4rj4J9JKmnR%Rj6KPk2K3oj2K3kk0J5Qj6J0
8152BJ1k4LJ2Mj2PknQOj4MJ2pjJ6lk6J0Nj0QJ6j4Krj2RNj0J3j2oJ1Kj5K2k4
8191a8
$$ Imaginary data points
##PAGE= N=2
##DATA TABLE= (X++(I..I)), XYDATA
$$ plain form
0 0 0 0 0 0 0 0 0 0 0 1 -8 8 -8 8 -8 16 -16 17 -24 25 -32 34 -41 48 -56 64 -73 81 -92 105 -119 133 -147
33 -147 167 -187 208 -232 256 -284 314 -349 387 -427 476 -526 582 -647 720 -806 903 -1018
51 -1018 1155 -1321 1533 -1804 2172 -2701 3526 -5006 8450 -31904 8429 58800 -36262 5261
65 5261 50379 -32920 -50410 35103 12204 -21275 21102 11685 -31340 3211 16313 -10028 4367
78 4367 7901 -25003 -2337 27250 893 -7837 10024 -12926 -26753 8214 28245 7375 -8133
91 -8133 -3204 -4341 -20677 -6481 34320 17630 -28229 -2558 18516 -27355 -12473 44908 -7
104 -7 -40554 18999 20446 -31447 7840 30874 -29667 -19156 28267 -3746 -7393 29702 -10347
117 -10347 -34527 15629 6119 -18901 31076 21449 -43387 -7988 28759 -22119 -9355 44001
$$ packed form
0@%%%%%%%%%JrJ6j6J6j6K4l2L3m1M9n7O6p5Q9j04J20j37J54j73J97k24K52k80
33a47L14l54L95m40M88n40N98o63P36q14R03j002J108j229J367j526J709j921
51a018K173k476K854l337L976m873O227q532J3456m0354M0333N0371r5062M1523
65E261M5118q3299j7490Q5513k2899l3479M2377r417m3025L4551J3102k6341J4395
78D367L534l2904K2666K9587k6357q730J7861k2950j3827L4967K0031k0870j5508
91h133M929j137j6336J4196M0801j6690m5859K5671K1074m5871J4882N7381m4915
104gm0547N9553J447n1893L9287K3034o0541J0511M7423l2013l647L7095m0049
117a0347k4180N0156r510k5020M9977r627o4836L5399L6747n0878J2764N3356
$$ plain form
129 44001 -3869 -38851 15101 16340 -23639 3849 23308 -13262 -16074 12147 8733 -4267 -2563
142 -2563 -647 -2510 -5339 1981 14971 3235 -13873 -2709 2100 -7229 6540 13778 -5404 -5237
156 -5237 864 -10656 2739 17018 -8501 -7863 16239 -9387 -18177 24750 8971 -30598 8017
169 8017 22951 -24828 -5390 33127 -11774 -26567 20785 6870 -21368 13336 15650 -20473
181 -20473 -4636 12953 -7651 -357 13250 -8011 -7652 9534 -4298 -5868 13309 -269 -13721
194 -13721 5952 6894 -8884 1480 8907 -5687 -7273 4156 5299 -627 -3873 642 3338 -5939
208 -5939 -2995 12681 890 -14674 4727 9233 -12349 449 16812 -8485 -12726 11465 767
221 767 -9724 11145 4736 -14187 2431 6784 -9001 4857 10546 -12800 -4416 13071 -6612
$$ packed form
129D4001m7870l4982N3952J239l9979K7488J9459l6570k812K8221l414j3000J704
142b563J916j863k829P320J2990j1736j7108J1164M809r329J3769P238j9182J67
156e237O101j1520J3395J4279k5519O38K4102k5626q790M2927j5779l9569L8615
169H017J4934m7779J9438L8517m4901j4793M7352j3915k8238L4704K314l6123
181b0473J5837J7589k0604P294J3607k1261L59J7186j3832j570J9177j3578j3452
194a3721J9673R42j5778J0364P427j4594j586J1429J143n926l246M515K696r277
208e939K944J5676j1791j5564J9401M506k1582J2798J6363k5297m241K4191j0698
221G67j0491K0869o409j8923J6618M353j5785J3858N689k3346Q384J7487j9683
$$ plain form
234 -6612 -6738 15934 -1752 -17268 8220 9135 -11255 3172 11498 -11045 -8777 9913 2521 -3762
248 -3762 4605 47 -7129 -1028 3040 2812 2737 -1990 -3459 -111 -1417 826 6128 28 -5515 -538
264 -538 -108 -393 5399 1431 -5192 -145 -581 -3682 6620 6079 -7923 -2312 4917 -6660 -1467 13374
280 13374 -923 -11266 4104 2046 -8336 6367 9909 -8461 -5236 5421 -3388 -1841 9158
293 9158 -30 -7224 1422 -161 -3406 6163 4453 -5983 -2034 1489 -3306 1988 7020 -1713 -5356
308 -5356 107 -115 -559 3747 2845 -2237 -3741 -1800 1556 2804 1175 1044 -1115 -5484 -1253 5544
324 5544 1818 -1202 1643 -2767 -5639 3034 5016 -1280 684 866 -5965 -1753 5753 1027 -852
339 -852 2524 -3589 -5588 4129 4287 -2019 1269 609 -6225 -938 6017 804 -1229 1799 -2981 -4826
$$ packed form
234f612j26K2672j7686j5516K5488R15k0390J4427Q326k2543K268J8690p392o283
248c762Q367m558p176O101M068k28p5m727j469L348j306K243N302o100n543M977
264e38M30k85N792l968o623N047m36l101J0302n41j4002N611P229j1577N193J4841
280A3374j4297j0343J5370k058j0382J4703L542j8370L225J0657q809J547J0999
293I158r188p194Q646j583l245R569j710j0436L949L523m795N294N032q733l643
308e356N463k22m44M306r02n082j504J941L356J248j629j31k159m369M231O797
324E544l726l020K845m410k872Q673J982o296J964J82o831M212P506m726j879
339h52L376o113j999R717J58o306L288o60o834N287O955n213k033L028m780j845
$$ plain form
355 -4826 2717 4378 215 187 -1206 -4321 -896 3656 2640 614 -1023 -3171 -2173 1268 2864 2270
371 2270 -151 -2781 -2570 -456 1844 3575 1448 -2905 -3011 -748 424 3078 3612 -1673 -4096 -994
387 -994 -40 990 4325 1699 -4019 -2903 -101 36 3025 4084 -1753 -4436 -1145 233 1563 4115
403 4115 988 -3940 -2684 -71 736 3046 2980 -1760 -3814 -1553 466 2404 3436 378 -3340 -3125
419 -3125 -443 2201 3266 1410 -1755 -3232 -2049 1114 3334 2184 -466 -2378 -3098 -788 3105
434 3105 3286 337 -1747 -2973 -2292 1854 3976 1233 -1285 -2159 -2780 -223 3567 2630 -483 -1676
450 -1676 -2601 -1855 2176 3679 846 -1431 -2426 -2461 718 3569 1911 -756 -1936 -2512 -660 2582 2547
467 2547 289 -1226 -2404 -1770 1421 2838 1245 -579 -2251 -2412 520 2669 1603 66 -1516 -2663
$$ packed form
355d826P543J661m163k8j393l115L425M552j016k026j637k148R98L441J596n94
371B270k421k630K11K114K300J731k127m353j06K263J172K654N34n285k423L102
387i94R54J030L335k626n718J116K802J37K989J059n837k683L291J378J330K552
403D115l127m928J256K613Q07K310o6m740k054K261K019J938J032l058l718K15
419c125K682K644J065j856l165j477J183L163K220j150k650j912p20K310L893
434C105J81k949k084j226O81M146K122k743k518q74o21K557L790r37l113j193
450a676r25P46M031J503k833k277r95l5L179K851j658k667j180n76J852L242l5
467B547k258j515j178O34L191J417j593j824j672j61K932K149j066j537j582j147
$$ plain form
483 -2663 -535 2289 1729 438 -340 -2288 -1953 1432 2284 745 75 -1525 -2573 298 2494 1114
499 1114 81 -809 -2379 -722 2122 1334 70 -17 -1671 -1783 1274 1891 210 46 -882 -2070 184
516 184 2176 841 -225 -810 -1735 -249 1749 967 164 -256 -1852 -990 1628 1000 -15 672 -1090
533 -1090 -2218 938 1876 -265 136 -26 -2020 1 2292 43 -767 166 -1500 -740 2535 969 -1218
550 -1218 242 -1006 -2388 1703 2951 -703 -585 93 -2491 -753 3109 1073 -1210 -23 -863 -1194
566 -1194 1453 1290 -745 -388 -689 -855 1655 1668 -866 -772 -953 -1919 1219 3472 510 -1259 -1156 -2420
584 -2420 -624 2896 1893 124 -183 -2367 -1952 1842 1253 -331 1499 -600 -3273 1372 3016 -1733
600 -1733 -897 1191 -2521 -799 4696 1270 -2801 -475 -1495 -2579 2856 3968 -300 -498 -1421 -4165
$$ packed form
483b663K128K824n60j291p78j948L35L385Q52j539o70j600j048K871K196j380
499A114j033q90j570J657K844p88j264q7j654j12L057O17j681j64r28j188K254
516A84J992j335j066n85r25J486J998p82q03m20j596Q62K618o28j015O87j762
533a090j128L156R38k141M01j62j994K021K291k249q10R33j666P60L275j566k187
550a218J460j248j382M091J248l654J18O78k584J738L862k036k283J187q40l31
566a194K647j63k035L57l01j66K510J3k534R4j81r66L138K253k962j769J03j264
584b420J796L520j003j769l07k184M15L794n89j584J830k099k673M645J644m749
600a733Q36K088l712J722N495l426m071K326j020j084N435J112m268j98r23k744
$$ plain form
616 -4165 54 4014 904 320 1029 -3321 -2775 2972 1611 -1471 907 125 -2290 973 2515 -658
632 -658 -1377 -1105 -1336 1357 2774 935 218 -2001 -4523 -146 4073 1434 882 1413 -3691 -4252 2025
649 2025 2303 44 2229 154 -3667 -345 1556 -641 1162 879 -3036 149 3451 -942 -887 1784
665 1784 -3280 -3331 4501 3058 -1903 1261 -97 -5582 -841 4353 1131 674 1428 -3034 -3108 1129 878
682 878 1082 2268 -1538 -2368 1607 78 -1575 2064 408 -3283 864 2925 -864 -194 734 -2712
698 -2712 -1563 2119 1477 1380 797 -3077 -2093 1331 -455 732 4109 -1001 -4183 1361 823 -2771 2328
715 2328 3227 -3255 -1415 2645 -1047 -931 2235 -1139 -1921 1909 292 -579 2152 -1104 -3214 1763
731 1763 1122 -2054 2514 2402 -4012 -1454 2697 -1224 -679 3380 -386 -2796 799 372 -894 1341
$$ packed form
616d165M219L960l110n84P09m350N46N747j361l082K378p82k415L263J542l173
632f58p19K72k31K693J417j839p17k219k522M377M219k639n52N31n104n61O277
649B025K78k259K185k075l821L322J901k197J803k83l915L185L302m393N5K671
665A784n064n1P832j443m961L164j358n485M741N194l222m57P54m462p4M237k51
682H78K04J186l806q30L975j529j653L639j656l691M147K061l789O70R28l446
698b712J149L682o42r7n83l874R84L424j786J187L377n110l182N544n38l594N099
715B328Q99o482J840M060l692J16L166l374p82L830j617q71K731l256k110M977
731A763o41l176M568j12o414K558M151l921N45M059l766k410L595m27j266K235
$$ plain form
747 1341 182 -1154 1023 -374 -1537 2109 720 -2889 941 1952 -2523 203 3163 -1955 -2158
762 -2158 2333 -93 -1522 1936 264 -1779 930 -40 -1395 1863 501 -2244 1490 1109 -3136 857
778 857 3154 -2632 -1349 3336 -1095 -2504 2664 614 -2560 1265 1180 -1889 458 967 -1231 757
794 757 735 -1879 715 1590 -2163 -36 2579 -1704 -1494 2618 -479 -2270 2041 969 -2194 490
810 490 968 -1275 570 819 -1242 576 662 -1764 768 1696 -2155 -243 2578 -1694 -1658 3012 -43
827 -43 -2758 1578 1041 -2185 1054 1789 -1833 -340 1052 -1319 320 1792 -1217 -281 1561 -1886
843 -1886 -1257 2736 -103 -1891 2017 447 -2796 907 1785 -1864 -168 1800 -814 -448 1074 -860
859 -860 -614 777 -745 109 1889 -675 -1118 1140 -1058 -1813 2185 1425 -1553 647 736 -2267 -349
$$ packed form
747A341j159j336K177j397j163L646j389l609L830J011m475K726K960n118k03
762b158M491k426j429L458j672k043K709r70j355L258j362k745L734l81m245L993
778H57K297n786J283M685m431j409N168k050l174L825q5l069K347N09k198J988
794G57k2k614K594Q75l753K127K615m283K10M112l097j791M311j072l163K684
810D90M78k243J845K49k061J818Q6k426K532R28l851J912K821m272L6M670l055
827d3k715M336n37l226L239P35l622J493J392k371J639J472l009R36J842l447
843a886O29L993k839j788L908j570l243L703Q78l649J696J968k614L66J522j934
859h60K46J391j522Q54J780k564m43K258k198p55L998p60k978K200Q9l003J918
$$ plain form
876 -349 1533 -535 265 1504 -942 -777 718 -1179 -526 1928 -329 -936 2109 -53 -2625 677
892 677 875 -1813 1062 2555 -1259 -1047 975 -1366 -1252 1725 712 -185 1178 -591 -1886 364
908 364 114 -763 1597 1241 -1260 119 503 -2006 -609 1716 134 5 1370 -447 -1494 -90 -384
925 -384 -313 1411 815 -163 417 -901 -1742 540 737 -526 1257 1385 -1376 -800 419 -1313 -439 1989
943 1989 575 -407 803 -654 -1773 236 379 -252 1568 1068 -1346 -479 102 -1401 79 1854 -45
960 -45 -322 1082 -635 -1673 314 364 -433 1019 979 -634 -277 -172 -1140 -190 890 384 693 614 -1050
979 -1050 -1076 73 -239 184 1350 354 -609 -24 -536 -954 477 735 -64 463 277 -752 -127 177 -805
998 -805 23 1035 28 6 650 -760 -1166 454 301 -230 1037 685 -1015 -531 60 -580 319 1210 -55
$$ packed form
876c49J882k068Q00J239k446J65J495j897O53K454k257o07L045k162k572L302
892F77J98k688K875J493l814K12K022k341J14K977j013q97J363j769j295K250
908C64k50q77K360l56k501J379L84k509J397K325j582j29J365j817j047J404k94
925c84P1J724n96r78N80j318q41K282J97j263J783J28k761N76J219j732Q74K428
943A989j414r82J210j457j119K009J43o31J820n00k414Q67N81j503J480J775j899
960d5k77J404j717j038J987N0p97J452m0j613L57J05r68R50J080n06L09p9j664
979a050k6J149l12M23J166r96r63N85n12m18J431K58p99N27j86j029O25L04r82
998h05Q28J012j007k2O44j410m06J620j53n31J267l52j700M84N91o40Q99Q91j265
$$ plain form
1017 -55 -488 190 -388 -474 514 177 -285 418 198 -468 116 175 -508 -88 329 -45 300 472 -402 -532 -57
1038 -57 -86 287 676 -33 -352 -10 -365 -295 577 300 -249 195 -92 -651 276 591 -356 -141 342 -349 -114
1059 -114 673 -120 -568 278 63 -390 426 412 -440 -82 148 -421 69 687 -63 -388 80 -158 -175 486 224
1080 224 -355 -67 32 -191 125 282 3 -66 -101 -207 77 219 65 70 -132 -332 141 323 -179 -25 185 -297
1102 -297 -116 449 -56 -278 326 -72 -549 336 416 -309 71 226 -610 -111 706 -75 -342 396 -125 -545
1122 -545 370 317 -419 147 360 -486 -202 480 -1 -230 216 -61 -297 235 277 -183 -136 51 -29 -24 98 119
1144 119 -42 -147 -1 23 -151 141 343 -232 -328 270 22 -240 361 153 -588 112 471 -458 -132 633 -285
1165 -285 -499 545 11 -580 506 346 -789 17 626 -385 -172 610 -299 -506 546 140 -541 286
$$ packed form
1017e5m33O78n78q6R88l37m62P03k20o66N84N9o83M20M17l74L45J72q74j30M75
1038e7k9L73L89p09l19L42l55P0Q72k77n49M44k87n59R27L15r47K15M83o91K35
1059a14P87p93m48Q46k15m53Q16j4q52L58K30n69M90O18p50l25M68k38j7O61k62
1080B24n79K88R9k23L16J57k79o9l5j06K84J42j54Nk02k00M73J82n02J54K10m82
1102b97J81N65n05k22O04l98m77Q85Q0p25L80J55q36M99Q17p81k67P38n21m20
1122e45R15n3p36N66K13q46K84O82m81k29M46k77k36N32M2m60M7J87q0NJ22K1
1144A19j61j05J46K4j74K92K02n75r6N98k48k62O01k08p41P00L59r29L26P65r18
1165b85k14J044n34n91J086j60j135Q06O09j011K13P82r09k07J052m06o81Q27
$$ plain form
1183 286 362 -478 -88 376 -172 -131 342 -15 -369 74 290 -58 -141 117 68 -213 31 324 -185 -257 401 37
1205 37 -574 283 500 -541 -82 608 -498 -402 897 -44 -863 601 400 -944 253 792 -799 -223
1223 -223 1007 -486 -734 956 144 -934 492 473 -856 171 812 -647 -397 755 -129 -541 488
1240 488 231 -525 93 315 -319 -159 396 133 -324 -86 282 -40 -269 298 241 -549 44 655 -484 -450
1260 -450 862 -48 -889 681 461 -1063 333 952 -1115 -353 1360 -519 -935 1231 25 -1371 909
1277 909 768 -1425 231 1304 -1090 -589 1339 -387 -957 1104 195 -1234 530 779 -906 -79 790
1294 790 -457 -410 620 -38 -488 287 271 -290 -161 217 153 -217 -108 337 -121 -409 546 267 -868 227
1314 227 851 -834 -330 1259 -463 -1022 1242 142 -1531 962 1122 -1622 -17 1541 -1197 -757
$$ packed form
1183B86P6q40L90M64n48M1M73l57l54M43K16l48q3K58m9k81K44K93n09p2O58l64
1205C7o11Q57K17j041M59O90j106R6J299r41q19J464k01j344J197N39j591N76
1223b23J230j493k48J690q12j078J426j9j329J027O41j459K50J152q84m12J029
1240D88k57p56O18K22o34J60N55k63m57K38L68l22k29N67n7p90N93O11j139L4
1260d50J312r10q41J570k20j524J396O19k067P62J713j879m16K166j206j396K280
1277I09j41k193J656J073k394N01J928j726n70K061r09j429J764K49j685Q27Q69
1294G90j247M7J030o58m50P75j6n61J29L78o4l70J09M45m58k88R55k79j135J095
1314B27O24j685N04J589j722n59K264j100j673K493J60k744J605J558k738M40
$$ plain form
1330 -757 1800 -435 -1465 1469 426 -1769 734 1137 -1497 14 1457 -1032 -687 1463 -321 -1188
1346 -1188 971 403 -1040 446 687 -850 -196 714 -225 -370 378 206 -241 -202 123 209 -249 -53 576
1365 576 -282 -680 730 321 -1012 416 874 -1095 -149 1305 -835 -807 1565 -222 -1510 1274 633
1382 633 -1765 663 1317 -1697 -126 1960 -1137 -1207 1807 -205 -1660 1441 782 -1769 476 1201
1398 1201 -1485 -295 1568 -511 -738 1033 -227 -1008 645 376 -629 311 463 -400 -131 77 -212
1415 -212 14 129 182 288 -251 -180 329 -497 -529 1000 327 -762 706 316 -1612 156 1328 -994 -161
1434 -161 1870 -714 -1518 1269 -61 -1655 1406 1282 -1622 296 1369 -1750 -798 1675 -537 -720
1450 -720 1928 27 -1823 600 325 -1524 694 1612 -689 -180 794 -1142 -1070 870 387 -119 781
$$ packed form
1330g57K557k235j030K934j043k195K503M03k634J511J443k489L45K150j784q67
1346a188K159n68j443J486K41j537O54R10r39j45P48j72m47L9L25Q6m58J96O29
1365E76q58l98J410m09j333J428M58j969R46J454k140K8K372j787j288K784o41
1382F33k398K428O54l014J571K086l097p0L014k012j455L101o59k551K245P25
1398A201k686J190J863k079k27J771j260p81J653k69j005R40J52q63K69K08k89
1415b12K26J15N3J06n39P1N09q26l2J529o73j089J468l90j928J768J172k322Q33
1434a61K031k584q04K787j330j594L061j24k904J918J073l119R52K473k212j83
1450g20K648j901j850K423k75j849K218R18k301N09R74j936P2J940m83n06R00
$$ plain form
1467 781 202 -732 -382 -292 -202 367 405 514 417 -675 -683 117 -534 -231 1394 525 -616 508 -313 -1835
1487 -1835 285 1281 -514 564 1528 -1300 -1329 953 -654 -995 2073 967 -1444 549 437 -2187
1503 -2187 -158 1707 -587 21 1938 -614 -1783 435 -210 -1031 1393 1390 -663 -8 105 -1527 -624
1520 -624 926 366 486 909 -403 -999 -375 -399 3 771 560 404 186 -851 -790 -30 -324 298 1433
1539 1433 228 -595 320 -705 -1569 641 1137 -302 810 968 -1616 -1051 818 -600 -319 1960 424
1556 424 -1189 483 -176 -1764 465 1346 -562 374 1263 -1068 -1118 569 -457 -524 1503 745 -754
1573 -754 111 -191 -1272 -6 846 118 483 587 -665 -723 -158 -271 283 771 127 64 102 -707 -477 284
1593 284 -145 199 993 -78 -604 256 -402 -878 659 647 -383 581 489 -1257 -419 747 -440 -22 1272
$$ packed form
1467G81n79r34L50R0R0N69L8J09r7j092qQ00o51L03J625q69j141J124q21j522
1487a835K120R96j795J078R64k828k9K282j607l41L068j106k411J993j12k624
1503b187K029J865k294O08J917k552j169K218o45q21K424lk053O55J13j632R03
1520f24J550n60J20M23j312n96O24k4M02P68k11j56k18j037O1P60k94O22J135
1539A433j205q23R15j025q64K210M96j439J112J58k584N65J869j418K81K279j536
1556D24j613J672o59j588K229Q81j908R36Q89k331n0J687j026o7K027p58j499
1573g54Q65l02j081J266Q52p28L65J04j252n8N65j13N54M88o44o3L8q09K30P61
1593B84m29L44P94j071n26Q60o58m76J537j2j030R64r2j746Q38J166j187M18J294
$$ plain form
1612 1272 -209 -857 574 -172 -1022 685 728 -633 304 600 -879 -294 684 -436 -254 910 19 -516
1630 -516 358 -172 -663 423 380 -318 291 233 -565 -98 190 -291 207 451 -320 -128 209 -338 -58 434
1650 434 -247 -171 498 -197 -409 441 -33 -454 477 164 -587 295 361 -648 51 545 -425 -75 615 -424
1670 -424 -430 625 -39 -440 528 82 -634 283 275 -533 232 536 -457 -145 384 -371 -160 564 -126 -299 411
1691 411 -52 -430 277 60 -335 336 253 -392 78 185 -407 3 310 -216 72 379 -334 -280 284 -148 -142
1712 -142 466 -45 -310 304 -43 -484 269 241 -308 244 279 -484 -20 368 -368 -106 513 -156 -213 416 -203
1733 -203 -452 408 143 -385 340 246 -470 74 271 -436 15 510 -221 -186 355 -190 -296 358 -12 -280 327
1754 327 120 -335 108 97 -280 141 210 -260 27 215 -242 -64 188 -180 -19 295 -191 -173 267 -114 -188
$$ packed form
1612A272j481o48J431p46q50J707M3j361R37K96j479N85R78j120J82J164q91n35
1630e16Q74n30m91J086m3o98O09n8p98M67K88m81M98K44p71J92L37n47K80M92
1650D34o81P6O69o95k12Q50m74m21R31l13p51Q82O6j009O99M94r70L50O90j039
1670d24oJ055o64m01R68m46p16R17qq08P65L04r93L12N29p55K11P24o90j73P10
1691D11m63l78P07k17l95O71q3o45M70J07n92M10L07n26K88L07p13N4N64m32O
1712a42O08n11k65O14l47m41P53k8n49N52L5p63M64L88p36K62O19o69n7O29o19
1733b03k49Q60k65n28P25r4p16N44J97p07M51M95p31L5N41n45j06O54l70k68O07
1754C27k07m55M43j1l77M21O9m70K87J88m57J78K52l68J61L14m86J8M40l81p4
$$ plain form
1775 -188 305 -57 -285 300 73 -399 193 233 -363 99 313 -373 -38 443 -260 -248 438 -72 -321 342 27
1796 27 -403 293 256 -391 93 287 -323 -20 314 -220 -113 332 -115 -239 230 -21 -161 219 2 -197 183
1817 183 50 -221 95 64 -149 173 110 -254 84 162 -268 25 241 -213 -2 328 -245 -234 350 -59 -252
1838 -252 319 40 -362 231 154 -414 119 341 -289 -22 317 -243 -151 345 -112 -223 309 52 -239 186 35
1859 35 -275 181 159 -232 85 156 -213 47 141 -216 49 252 -208 -70 233 -181 -105 301 -155 -225 325 -19
1881 -19 -332 251 97 -352 205 222 -388 56 368 -302 -129 352 -179 -183 373 -75 -309 288 64 -316 161
1902 161 148 -243 113 176 -273 9 215 -153 2 165 -159 2 221 -167 -49 261 -117 -97 274 -146 -188
1923 -188 357 -18 -342 307 116 -394 246 267 -461 84 444 -397 -156 504 -232 -319 468 -83 -449 413 172
$$ packed form
1775a88M93l62k28N85k27m72N92M0n96M62K14o86L35M81p03J2O86n10k49O63l15
1796B7m30O96l7o47M84J94o10L03L34n34J07M45m47j24M69k51j40L80k17j99L80
1817A83j33k71L16l1k13L22o3l64L38P8m30K93K16m54K11L30n73J1N84m09j93
1838b52N71k79m02N93p7n68N33K22o30K67L39n60R2M96m57j11N32k57k91M25j51
1859C5l10M56k2l91L17P1l69K60R4l57K65K03m60J38L03m14P6M06m56p0N50l44
1881a9l13N83j54m49N57J7o10M44L12o70J73M81n31mN56m48k34N97k24l80M77
1902A61j3l91L56O3m49K82K06l68J55J63l24J61K19l88J18L10l78K0L71m20m2
1923a88N45l75l24O49j91n10O40K1p28N45L60q41K41O60p36q7P87n51l66Q62k41
$$ plain form
1944 172 -518 181 316 -420 32 386 -325 -124 412 -165 -230 317 -15 -226 204 1 -223 193 67 -181
1964 -181 106 19 -161 177 50 -228 188 96 -292 155 193 -345 117 338 -407 -80 490 -265 -244 529 -162
1985 -162 -473 532 120 -597 366 377 -632 89 526 -492 -103 675 -322 -433 578 -47 -517 436 167
2004 167 -550 247 337 -463 15 389 -304 -110 358 -156 -123 308 -123 -228 187 -19 -47 264 -75 -194 183
2025 183 -106 -174 333 19 -249 311 2 -487 285 306 -478 148 437 -496 -60 592 -441 -399 674 -96
2045 -96 -505 630 129 -750 313 346 -690 224 743 -497 -258 520 -449 -427 695 41 -455 445 83
2064 83 -633 153 288 -376 153 387 -301 -77 243 -269 -140 201 -114 65 351 -156 -184 96 -297 -93 462
2085 462 -15 -97 392 -248 -578 346 160 -331 534 316 -725 45 451 -611 -59 785 -314 -330 733
$$ packed form
1944A72o90O99J35p36M52L54p11K01N36n77o5N47l32k11M30k03k24M16j26k48
1964a81K87q7j80L38j27k78M16r2l88M47L8n38M62K21p45L27N70p55K1P73o91
1985a62l11J005m12p17R63J1j009P21M37j018L89P78r97j11J011o25m70R53k69
2004A67p17P97R0q00M78L74o93J94M68n14L3M31m31j05M15k06k8L11l39j19L77
2025A83k89o8N07l14k68N60l09m89P72K1p84O26K89r33M36O52j033M2J073p70
2045i6m09J135n01q79J063L3j036R14N19j240K39P78r69K2J122o54m96R00l62
2064H3p16P86J35o64N29K34o88K24L20n12J29L41l15J79K86n07k8K80l93K04N55
2085D62m77q2M89o40l30R24j86m91Q65k18j041P70M06j062N52Q44j099j6J063
$$ plain form
2104 733 -221 -729 543 150 -710 497 621 -619 11 439 -741 -261 817 -38 -252 565 -198 -717
2122 -717 263 167 -314 410 368 -418 -88 109 -323 69 306 -122 64 218 -228 -87 73 -316 40 410 -122
2143 -122 3 362 -413 -429 399 -68 -216 747 147 -748 172 202 -664 300 758 -513 -146 642 -531 -525 752
2164 752 -15 -570 625 228 -750 278 392 -757 -19 675 -323 -116 619 -336 -571 399 19 -325 461
2183 461 244 -416 12 63 -340 143 330 -116 29 70 -247 29 125 -206 119 236 -256 26 273 -332 -122
2204 -122 403 -250 -222 575 -57 -461 391 36 -585 423 450 -588 92 514 -583 -195 712 -259 -388 656
2224 656 -68 -662 447 267 -591 240 410 -546 -18 526 -365 -213 475 -141 -318 352 -6 -329 261 77
2244 77 -332 122 140 -223 81 118 -212 54 130 -195 58 117 -205 71 169 -294 16 342 -244 -130 356 -217
$$ packed form
2104G33r54n08J272l93q60J207J24j240O30M28j180M80J078q55k14Q17p63n19
2122g17R80r6m81P24m2p86L30J97m32L92K37m28J86J54m46J41J60l89L56L70n32
2143a22J25L59p75j6Q28m67j48R63o00q95R20L0q66R64M58j271L67P88j173OJ277
2164G52p67n55J195l97r78J028J14j149P38O94r98K07P35r55k35R70l80l44P86
2183D61k17o60M28N1m03M83J87m46J45M1l17K76R6l31L25J17m92K82K47o05K10
2204a22N25o53K8P97o32m04Q52l55o21J008K7j038O80M22j097L88R07r71j29J044
2224F56p24n94J109j80q58Q31J70r56N28N44q91J52O88o16j77O70l58l23N90j84
2244G7m09M54J8l63L04L7l30K66P6l25K53N9l22K76R8m63L10L26n86J14M86n73
$$ plain form
2266 -217 -267 442 -26 -425 372 149 -535 209 372 -434 55 469 -440 -231 574 -146 -343 475 -33 -482
2286 -482 368 233 -440 194 342 -456 -58 386 -210 -92 374 -185 -300 272 23 -198 207 4 -245 142
2306 142 93 -168 137 48 -260 76 135 -129 170 159 -354 -109 187 -122 115 383 -232 -279 208 -139 -179 455
2328 455 101 -354 176 68 -412 210 386 -361 -48 372 -230 -138 392 -216 -411 318 132 -209 346 132
2348 132 -502 -83 151 -188 234 494 -213 -289 35 -237 -60 434 116 -168 90 -111 -281 137 106 -116 127
2369 127 69 -176 120 87 -303 -77 70 -115 232 403 -201 -269 -26 -270 -61 559 217 -161 70 -237 -497
2390 -497 202 396 -39 185 146 -422 -155 270 -145 -99 319 -41 -157 296 -6 -362 35 30 -195 295 421
2411 421 -129 -155 -113 -377 -19 476 204 11 45 -318 -336 134 131 64 283 -9 -310 -23 8 -144 124 123 -164
$$ packed form
2266b17n0P09m68l99P97k23o84P44J63q06M89M14r09K09Q05p20j97Q18n08m49
2286d82Q50j35o73O34J48p98L98M44n96J18M66n59j15N72k49k21M05k03k49L87
2306A42m9k61L05q9l08L36N9k64K99j1n13K45K96l09K37K68o15m7M87l47m0O34
2328D55l54m55N30j08m80O22J76p47L13M20o02R2N30o08j95P29j86l41N55k14
2348A32o34M19K34l39M22K60p07p6L24k72J77M94l18k84K58k01j70M18l1k22K43
2369A27n8k45K96l3l90K26J47j85L47J71o04o8K43k44K09O20l42l78K31l07k60
2390d97O99J94m35K24l9n68K67M25m15M6M18l60j16M53l02l56L97nk25M90J26
2411D21n50k6M2k64L58M95k72j93L4l63j8M70lo7K19k92l01K87L1j52K68jk87
$$ plain form
2434 -164 80 228 -155 -121 18 -251 -42 380 127 -51 102 -240 -401 121 235 54 279 76 -428 -172
2454 -172 131 -60 131 300 -108 -167 97 -90 -137 171 33 -119 155 81 -125 58 -34 -265 16 206 23
2475 23 101 73 -294 -178 111 -12 81 280 -55 -211 30 -84 -107 250 129 -161 39 45 -198 35 146 -166
2497 -166 -26 214 -81 -108 142 -63 -172 126 43 -113 142 86 -181 -36 68 -89 58 150 -73 -48 74 -82
2519 -82 -43 111 -9 -8 91 -63 -103 77 -1 -48 122 -12 -105 85 1 -146 111 106 -136 20 83 -174 17 212
2543 212 -113 -115 138 -69 -131 196 43 -191 78 71 -199 59 199 -143 -94 97 -112 -52 228 14 -167 7
2565 7 -16 -83 126 141 -69 -45 -20 -108 28 151 43 -6 -62 -140 6 112 42 42 -21 -157 -11 132 -7 19 84 -153
2591 -153 -129 166 69 -36 130 -59 -304 62 231 -51 53 97 -290 -154 253 50 -49 180 -81 -303 71
$$ packed form
2434a64K44J48l83L4J39k69K09M22k53j78J53l42j61N22J14j81K25k03n04K56
2454a72L03j91J91J69m08n9K64j87m7L08j38j52K74p4k06J83r2k31K81J90j83
2475B3P8k8l67J16K89j23R3J99l35j56K41j14k3L57j21k90K00Ok43K33J11l12
2497a66J40K40k95k7K50k05j09K98q3j56K55n6k67J45J04j57J47R2k23K5J22j56
2519h2L9J54j20JR9j54m0J80p8m7J70j34r3J90q4j47K57nk42J56O3k57J91J95
2543B12l25kK53k07o2L27j53k34K69pk70K58J40l42M9J91k09O0K80k14j81J74
2565Gk3o7K09J5k10K4K5q8J36J23j08m9n6p8J46J06p0%o3j36J46J43j39K6O5k37
2591a53K4K95r7j05J66j89k45L66J69k82J04M4l87J36M07k03r9K29k61k22L74
$$ plain form
2612 71 172 -48 114 67 -270 -124 198 60 15 93 -154 -187 106 144 40 69 -61 -181 -44 88 127 129 -40
2635 -40 -171 -92 -10 94 212 32 -209 -66 0 -50 190 203 -189 -144 51 -100 33 327 -21 -291 8 -2 -108
2658 -108 263 192 -287 -141 87 -118 49 329 -81 -284 40 -22 -88 257 161 -251 -142 25 -62 115 238 -83
2680 -83 -210 -44 -12 57 172 44 -107 -114 -99 44 192 82 -14 -59 -195 -29 247 98 -46 29 -130 -212 196
2703 196 216 -95 44 34 -306 -25 347 5 -89 129 -193 -264 278 229 -168 45 45 -317 -1 338 -32 -96 119
2726 119 -176 -214 225 183 -69 17 -61 -232 35 219 28 -37 -33 -149 -51 110 83 42 -16 -147 -72 51 50 146 72
2751 72 -195 -83 97 -16 76 203 -154 -240 146 46 -136 214 122 -333 -46 222 -130 29 316 -169 -294
2772 -294 181 61 -131 224 69 -332 13 174 -139 57 243 -186 -175 164 -11 -72 211 17 -228 3 107
$$ packed form
2612G1J01k20J62m7l37J46L22j38m5P8k47l3K93L8j04K9j30j20J37J32L9Kj69
2635d0j31P9Q2J04J18j80k41J43O6n0K40J3l92M5J95j51J33K94l48k70K99j0j06
2658a08L71p1m79J46K28k05J67K80m10k03L24o2o6L45r6m12J09J67q7J77J23l21
2680h3j27J66L2O9J15j28j51pJ5J43J48j10r6m5j36J66K76j49j44P5j59q2M08
2703A96K0l11J39j0l40K81L72l42r4K18l22p1N42m9l97K13%l62L16L39l70o4K15
2726A19k95l8M39m2k52Q6p8j71K67J84j91o5Mj16R8J61k7m1n8j31P5J23jR6p4
2751G2k67J12J80j13R2J27l57q6L86j00j82L50r2m55K87K68l52J59K87m85j25
2772b94M75j20j92L55j55m01L45J61l13J96J86m29J1L39j75o1K83j94k45K31J04
$$ plain form
2793 107 -40 43 68 -88 -76 18 33 82 5 -53 28 -30 -91 116 123 -138 -14 86 -129 -3 234 -66 -129 166 -30
2818 -30 -146 187 61 -201 127 121 -252 48 266 -201 -86 276 -118 -200 273 23 -291 151 168 -231 4 184
2840 184 -167 -49 189 -73 -113 116 -35 -89 119 -5 -58 83 -21 -107 101 69 -76 15 -5 -100 68 77 -51
2863 -51 13 -40 -126 97 131 -112 60 98 -266 -89 283 -21 -93 235 -81 -338 162 213 -174 67 156 -240 -60
2886 -60 235 -58 -66 171 -124 -164 247 95 -128 120 -63 -326 110 316 -43 0 70 -266 -185 200 158 44 85
2909 85 -101 -196 -16 34 107 156 -112 -162 103 26 -63 160 -11 -271 55 229 -23 51 64 -308 -199 186 103 160
2933 160 257 -223 -379 22 19 20 398 147 -402 -101 114 -188 75 356 -113 -217 160 15 -109 138 -31 -258
2955 -258 53 183 97 181 -54 -383 -140 101 86 303 276 -236 -339 -75 -80 117 396 111 -186 -128 -144 -66 192
$$ packed form
2793A07j47Q3K5j56J2R4J5M9p7n8Q1n8o1K07Pk61J24J00k15J26K37l00o3K95j96
2818c0j16L33j26k62L28ol73L00K18m67J15L62l94q2M73k50l14M42J7l99K35J80
2840A84l51J18K38k62m0K29j51n4K08j24n3J41j04q6K08l2j45R1k0r5J68Rj28
2863e1O4n3q6K23L4k43J72L8l64J77L72l04p2L28l16k57N00N1l87K41Q9l96J80
2886f0K95k93qK37k95m0M11j52k23K48j83k63M36K06l59M3P0l36Q1L85m2j14M1
2909H5j86r5J80N0P3M9k68n0K65p7q9K23j71k60L26J74k52P4J3l72J09L85q3N7
2933A60R7m80j56M01lJL78k51n49L01K15l02K63K81m69j04L77j45j24K47j69k27
2955b58L11J30q6Q4k35l29K43K41j5K17k7n12j03K64nJ97K79k85k97N8j6P8K58
$$ plain form
2978 192 70 -83 88 -7 -121 166 74 -321 -54 171 -38 154 376 -170 -421 -61 -37 32 440 246 -258
2999 -258 -188 -156 -198 206 346 -12 -5 25 -290 -88 276 -1 -114 164 20 -111 172 62 -277 -93 61 46
3021 46 227 197 -138 -176 -155 -172 169 366 47 -44 -50 -327 -175 266 147 -36 117 -44 -231 37 86 -127 48
3044 48 102 -88 75 170 -152 -118 50 -138 -9 374 93 -194 12 -127 -267 177 296 -46 10 33 -231 -95
3066 -95 159 32 33 118 -90 -105 103 -36 -87 105 -8 -93 160 96 -160 -23 22 -137 57 182 -13 -7 12 -166
3090 -166 -46 139 -2 10 138 -118 -143 139 5 -147 140 81 -176 69 136 -176 -31 157 -92 -40 175 -28
3112 -28 -103 94 -32 -91 162 75 -123 53 61 -130 65 137 -124 -31 114 -76 -48 150 0 -76 49 -7 -61 87
3136 87 25 -73 30 -16 -52 115 26 -133 7 47 -88 81 155 -114 -88 69 -95 -26 196 27 -107 26 -73 -122
$$ packed form
2978A92j22j53J71r5j14K87r2l95K67K25k09J92K22n46k51L60K4O9M08j94n04
2999b58P0L2m2M04J40l58PL0l15K02L64k77j13K78j44j31K83j10l39J84J54j5
3021D6J81l0l35l8K1j7L41J97l19r1ok77J52M41j19j83J53j61j87K68M9k13J75
3044D8N4j90J63R5l22L4J68j88J29L83k81k87K06j39j40M44J19l42N6K3k64J36
3066i5K54j27JQ5k08j5K08j39n1J92j13q5K53o4k56J37M5j59J94J25j95OJ9j78
3090a66J20J85j41J2J28k56k5K82j34j52K87n9k57K45O7l12J45J88k49N2K15k03
3112b8p5J97j26n9K53q7j98J76Qj91J95P2k61R3J45j90K8J98j50p6J25n6n4J48
3136H7o2r8J03m6l6J67q9j59J40M0j35J69P4k69K6J57j64O9K22j69j34J33r9m9
$$ plain form
3160 -122 151 97 -137 36 57 -167 32 165 -102 -76 135 -68 -95 181 35 -168 18 17 -76 129 149 -96 -73
3183 -73 -21 -83 59 181 -8 -34 11 -107 -48 137 56 -35 48 -64 -97 89 62 -44 13 -32 -79 78 88 -70 5
3208 5 9 -146 22 189 -11 -37 75 -144 -151 170 113 -69 63 -26 -198 34 153 -28 13 63 -125 -68 132 10
3232 10 -31 92 -66 -138 107 108 -51 32 -1 -149 14 132 6 2 16 -101 -47 72 24 41 69 -103 -109 60 31 10
3258 10 97 -31 -155 28 57 -40 63 48 -137 -48 61 -35 46 106 -98 -101 64 -19 -27 135 -8 -167 14 61 -47
3283 -47 67 84 -122 -61 77 -16 18 112 -39 -98 13 2 9 124 15 -111 5 2 -38 86 71 -82 -7 33 -53 44
3309 44 112 -35 -51 27 -54 11 120 -8 -89 36 -13 -62 107 59 -106 -9 39 -99 11 131 -28 -62 26 -65 -49
3334 -49 105 31 -62 24 -24 -81 54 72 -72 8 39 -81 1 96 -15 -23 31 -45 -28 92 23 -21 11 -51 -53 70 39 -36
$$ packed form
3160a22K73n4k34J73K1k24J99J33k67K6K11k03k7K76j46k03J86jr3K05K0k45K3
3183g3N2o2J42J22j89k6M5j18N9J85q1r1Q3j12l3J86k7j06N7m5m7J57J0j58P5
3208EMj55J68J67k00k6J12k19pL21n7j82J32q9j72K32J19j81M1N0j88N7K00j22
3232A0m1J23j58p2K45Jj59Q3l3j48J63J18j26mJ4j17N4J19m8J7K8j72oJ69k9k1
3258A0Q7j28j24J83K9r7J03j5j85Q9J09r6Q1O0k04lJ65q3qJ62j43j59J81M7j08
3283d7J14J7k06O1J38r3L4R4j51n9J11j1PJ15j09j26J16lm0J24j5j53P5M0q6R7
3309D4O8j47j6P8q1O5J09j28q1J25m9m9J69m8j65R7M8j38J10J20j59l4Q8r1J6
3334d9J54p4r3Q6m8n7J35J8j44Q0L1j20Q2R5j11qN4p6J7J20o9m4L2o2kJ23l1p5
$$ plain form
3362 -36 39 -13 -108 33 64 -57 28 53 -112 -40 110 -9 -18 62 -45 -85 83 34 -65 61 31 -113 17 96 -65
3387 -65 11 98 -89 -76 96 14 -53 59 -5 -97 37 39 -44 28 27 -76 -10 39 -19 36 38 -65 -22 57 -2 22 74 -39
3415 -39 -43 52 -5 -23 70 -2 -59 66 23 -60 76 63 -88 16 69 -65 15 103 -60 -62 101 -7 -76 93 22 -104
3441 -104 43 57 -101 34 92 -69 -35 95 -45 -36 94 -11 -79 64 29 -62 42 31 -50 4 12 -48 17 46 -30 -5
3467 -5 21 -31 10 49 -27 -15 44 -36 1 69 -38 -24 80 -23 -63 81 25 -76 71 54 -106 38 107 -86 -13 112
3493 112 -64 -47 120 -7 -87 76 30 -101 39 78 -63 28 62 -84 -9 94 -36 -34 77 -2 -64 52 6 -65
3517 -65 32 29 -38 10 25 -22 13 -17 -38 41 20 -35 38 17 -90 11 68 -38 4 94 -25 -63 50 -15 -52 92 24 -77
3545 -77 54 32 -96 42 76 -88 9 130 -76 -83 113 -26 -97 94 55 -89 46 53 -107 -41 50 -24 10 63 -30
$$ packed form
3362c6P5n2r5J41L1j21Q5K5j65P2J50j19rQ0j07m0J68m9r9J26l0j44J30P9j61
3387f5P6Q7j87J3J72q2o7J12o4r2J34Kq3P2jj03O6M9n8N5Kj03M3P9n9K4N2j13
3415c9mR5n7j8R3p2n7J25m3q3J36j3j51J04N3j34Q0Q8j63kJ63j08o9J69p1j26
3441a04J47J4j58J35N8j61L4J30j40RJ30j05o8J43l5r1J04j1q1N4Qo0O5K9p6K5
3467eK6n2M1L9p6J2N9q0L7O8j07J4J04j03m0J44n6j01J47j7j60J44O9j93P3J25
3493A12j76J7J67j27q0J63m6j31J40L9j41R1L4j46P5J03j30KJ11p9o2J16m6p1
3517f5R7lo7M8J5m7L5l0k1P9k1n5P3k1j07J01N7j06M2R0j19l8J13o5l7J44o8j01
3545g7J31k2j28J38L4j64R7J21k06pJ96j39p1J91l9j44J35Pj60O6R1p4L4N3r3
$$ plain form
3570 -30 -33 16 -45 -27 57 0 -15 56 -26 -86 7 14 -38 36 30 -7 11 -24 -64 23 34 -38 65 66 -105 -14 64 -104 -34 146
3600 146 4 -94 61 0 -141 48 80 -56 24 90 -70 -31 45 -72 -8 104 1 -52 80 -10 -122 45 39 -81
3624 -81 48 95 -68 -55 32 -32 -18 33 10 7 15 -41 -37 13 -40 12 83 -22 -57 58 -7 -95 56 50 -41 42 48 -65 -6 52
3654 52 -48 6 83 -32 -15 77 -63 -75 104 24 -81 75 73 -109 18 82 -78 -29 101 -5 -48 45 -2 -41 42
3679 42 2 -24 40 -6 -52 26 12 -45 34 53 -67 9 55 -40 -7 41 -27 -20 36 -29 -7 34 -30 -29 63 -34 -53 88 16 -102
3709 -102 55 67 -61 18 95 -76 -39 90 7 -43 68 0 -57 32 -12 -41 47 27 -69 24 25 -57 20 77 -58 -39 69
3736 69 -30 -40 59 -12 -45 27 2 -21 39 2 -37 29 -14 -55 50 37 -81 3 65 -75 -10 86 -40 -65 54 -30 -65 55
3764 55 19 -62 12 -1 -68 44 50 -50 5 35 -68 -4 82 -20 -24 58 -9 -64 41 33 -53 18 12 -41 32 41 -22 -2 -3 -45 39
$$ packed form
3570c0lM9o1J8Q4n7j5P1q2o0R3Pn2P4ol7J8l5m0Q7J1p2J03Jj71R1P8j68P0J80
3600A46j42r8J55o1j41J89L2j36Q0O6j60L9P6j17O4J12j03n3J32r0j12J67oj20
3624h1J29M7j63J3Q7o4J4N1k3lQn6MN0n3N2P1j05l5J15o5q8J51or1Q3Oj13N9N8
3654E2j00N4P7j15J7R2j40j2J79q0j05J56kj82J27O4j60M9J30j06m3R3m7l9Q3
3679D2m0k6O4m6m6P8j4n7P9J9j20P6M6r5L3M8o8PN6o5K2M1o4JR2r7j9J41p2j18
3709a02J57J2j28P9P7j71L7J29q3n0J11o8n7Q9m4k9Q8k0r6R3Jq2P7N7j35J9J08
3736F9r9j0R9p1l3P2k5k3O0l7l9O6m3m1J05j3j18Q4O2j40O5R6j26k5J19q4l5J20
3764E5l6q1P4j3o7J12Oj00N5L0j03O4Q6j02mQ2o7n5J05qq6P1on3P3Ro3K0jm2Q4
$$ plain form
3795 39 54 -33 -7 36 -82 -53 74 13 -20 58 -28 -99 25 43 -32 46 28 -68 9 38 -40 19 75 -57 -34 80 -3 -42
3823 -42 45 -28 -83 38 84 -14 16 4 -92 -30 45 12 49 62 -62 -70 -10 -35 28 97 -8 -70 21 -8 -32 61 26 -48 28
3852 28 54 -13 17 12 -74 -43 35 10 55 87 -73 -120 -12 -2 -10 133 45 -100 -39 -6 -58 35 96 -11 -27 15 -61 -13 59
3881 59 -10 -53 35 16 -4 72 -1 -105 -26 38 7 77 82 -61 -86 -31 -31 46 120 33 -42 -33 -70 -5 89 62 -15 22 -14 -55 53
3912 53 55 -39 -4 22 -16 33 71 -27 -56 -35 -42 38 129 29 -47 -28 -66 -55 95 83 -30 -8 -15 -106 -8 97 3 -14 11 -46
3942 -46 -38 66 23 -56 -13 -14 -28 73 59 -35 -34 -16 -54 33 108 21 -30 -21 -58 -25 69 48 7 -10 -52 -36 58 35 -14 13 -26
3973 -26 -57 39 64 -7 11 10 -66 -11 80 26 -12 0 -52 -23 84 42 -26 16 -22 -80 43 63 -19 -9 22 -77 -29 80 24
4002 24 -30 5 -27 -47 53 51 -21 -3 -8 -36 28 52 -9 -7 11 -48 1 70 21 -15 -18 -39 4 58 47 -7 -14 -45 -30 51 43 -6 27
$$ packed form
3795C9J5q7K6M3j18K9J27o1l3P8q6p1J24J8p5P8j8r6P7K9p8N9N6j32K3J14q3l9
3823d2Q7p3n5J21M6r8L0j2r6O2P5l3L7J3j24qO0k5O3O9j05o2R1k9k4R3l5p4P6
3852B8K6o7L0nq6L1P8k5M5L2j60m7J08J0qJ43q8j45O1L3n2R3O1j07j6M2p6M8P2
3881E9o9m3Q8j9k0P6p3j04P9O4l1P0Nj43k5N5%P7P4q7p5Rl7O5R4k7p7L7l6m1J08
3912E3Kr4L5K6l8M9L8r8k9K1pQ0R1j00p6J9l8J1J50j2j13K2pr1R8J05r4j7K5n7
3942d6QJ04m3p9M3jj4J01j4r4JJ8l8Q7P5q7n1Rl7L3R4k1m1j7m2J6R4k3m9K7l9
3973b6l1R6K5p1J8jp6N5R1n4l8J2n2K9J07m2o8M2l8n8J23K0q2J0L1r9M8J09n6
4002B4n4L5l2k0J00kp2J8nk8O4K4o1KJ8n9M9O9m9l6lk1M3N4j1n4pl1J5Q1qm9L3
$$ plain form
4035 27 -24 -58 11 63 -14 -13 26 -60 -29 67 26 -32 4 -17 -57 62 61 -36 -13 -19 -63 24 73 18 -20 -2 -62 -44 71 44 -12
4066 -12 -2 -30 -45 39 52 8 -11 -25 -27 16 49 22 -2 -22 -50 3 73 40 13 9 -52 -26 73 53 10 24 -35 -59 30 69 11
4097 11 19 3 -75 -11 59 14 -4 27 -58 -57 68 52 -24 -6 -10 -77 16 94 17 -7 -5 -55 -31 47 44 12 0 -58 -48 39 59 6
4129 6 6 -31 -50 19 42 37 6 -14 -52 -9 33 24 39 14 -68 -28 42 51 41 30 -53 -70 42 42 10 46 0 -72 -8 57 1 41 50
4162 50 -54 -59 44 31 6 29 -22 -83 5 37 -6 18 13 -54 -32 43 25 20 19 -22 -40 17 29 30 27 -9 -58 3 22 16 41 -7 -37
4195 -37 -8 9 -2 29 27 -36 -13 18 -21 33 60 -29 -38 28 11 10 54 13 -50 2 18 -20 34 46 -28 -23 36 -11 1 36 -4 -36
4227 -36 18 11 -12 28 18 -31 -9 7 -20 5 20 -11 -8 -6 -15 6 21 -5 -1 11 -21 0 25 -3 -11 24 8 -24 13 30 -9 14 11 -24
4261 -24 -1 25 -14 -1 24 -11 -14 38 6 -20 35 9 -42 11 31 -19 13 33 -25 -29 35 4 -5 17 -4 -22 7 17 -13 30 11 -20
$$ packed form
4035B7n1l4O9N2p7JL9q6L1R6m1n8L6k1m0J19jr7K3om4Q7M9n5l8J8o0J8J15k7n6
4066a2J0k8j5Q4J3m4j9j4kM3L3k7k4k0k8N3P0l3k7mo1K6R9k0m3J4n9k4Q9L9n8
4097A1Qj6p8O4P0m5j8L1q5JJ25j6p6J8mo7R3P8p7k4Kn0K4P8ll2j2n8J0Q7K0n3
4129F%l7j9O9K3nl1k0l8M3M2rJ5k5q2M0P0Rj0j1q3j7J12%l2L6m6p2O4O5n6M0R
4162E0j04nJ03j3k5K3n1o1Q8L2m3K4no7K2P5j8njm1j8N7J2Jll6m9O1J9oK5m8l0
4195c7K9J7j1L1ko3K3L1l9N4K7q9rO6j7jM4m1o3N2J6l8N4J2p4NN9m7J2L5m0l2
4227c6N4pk3M0j0m9K2J6k7K5J5l1LKrK1J5k6MJ2l2K1K5k8qL5j6l2L7J7l9K3ll5
4261b4K3K6l9J3K5l5lN2l2k6N5k6n1N3K0n0L2K0n8mO4l1rK2k1j8K9J0l0M3j9l1
$$ plain form
4293 -20 -1 8 -2 12 22 -33 -22 22 6 14 14 -25 -6 18 -12 12 34 4 -13 19 1 7 39 27 -30 5 28 -17 13 40 -2 -9 20
4326 20 7 -5 25 7 -26 5 7 -15 35 16 -27 -15 20 1 22 36 -14 -16 17 -11 -9 26 4 -30 -7 -3 -7 22 5 -19 -1 -4 3 31
4360 31 19 -39 -13 2 -1 19 51 -20 -29 -1 -7 -8 40 27 -24 8 -5 -11 20 33 -22 -8 26 6 7 38 -12 -38 22 24 8 47 20 -31
4394 -31 -44 1 3 44 34 -8 -32 -16 -2 7 31 4 -6 3 -3 -3 15 6 -21 5 16 15 34 6 -34 -24 -10 12 48 46 -7 -33 -9 -18 16
4429 16 58 21 -21 3 -20 -31 29 34 -20 -5 14 0 19 41 -43 -36 16 19 25 51 9 -64 -31 -1 11 49 62 -26 -41 -19 -14 18 33
4462 33 3 -21 -15 -10 2 24 -8 -18 -1 -4 19 36 6 -44 -31 -25 13 60 57 -11 -42 -39 -37 24 68 10 -9 -13 -31 -21 38 18 -15 8
4496 8 0 -28 19 43 -25 -31 9 -2 27 57 11 -27 -23 -14 19 60 50 -6 -19 -25 -21 21 59 32 -12 -28 -19 -1 36 7 2 -10 -18 11 30
4531 30 11 -11 -12 -30 6 42 41 -13 -28 -30 -40 31 53 16 -8 -5 -40 -1 37 32 -3 -2 -9 -29 23 24 -3 -20 -9 -13 7 47 11 -11 -8
$$ packed form
4293b0J9Rj0J4J0n5J1M4j6Q%l9J9K4l0K4K2l0j7L2j8OL2j2n7L5K3m5L0K7m2pK9
4326B0j3j2L0j8l3L1Kk2N0j9m3J2L5j9K1J4n0kL3k8KL5k2l4K3MmK9j7k4J8lPK8
4360C1j2n8K6J5lK0L2p1rK8ojM8j3n1L2j3oL1J3n5J4L4k0JL1n0k6O0Kj6L9k7n1
4394c1j3M5KM1j0m2k4J6J4RK4k7j0Ro%J8rk7K6J1jJ9k8m0J0J4K2L6kn3k6K4rL4
4429A6M2l7m2K4k3j1O0Nn4J5J9j4J9K2q4PN2LOK6m2p3L3L0J2L8J3q8j5K2NL2J5
4462C3l0k4ONJ2K2l2j0J7lK3J7l0n0J3OL8M7lo8l1LKO1M4n8j9mj8J0N9k0l3K3
4496Hqk8M7K4o8oM0j1K9L0m6l8MRL3M1j0n6j3oMM2L8k7m4j6RJ8L7k9nj2qK9J9
4531C0j9k2jj8L6L6jn4j5kj0P1K2l7k4Ll5L9L8nl5Jpk0N2Jk7j7J1mK0M0l6k2L
$$ plain form
4566 -8 -7 15 33 26 -14 -5 -7 -23 15 35 18 4 -13 -22 13 38 24 0 -23 -24 5 32 28 0 -3 -11 -11 17 12 3 -3 -11 -26 17 21 4 -5 -8 -10 5
4606 5 40 19 -2 -2 -17 -14 39 36 8 3 -4 -20 -2 50 25 9 4 -4 -5 23 17 2 5 -9 -15 20 25 -1 7 7 -10 14 24 19 11 -3 -16 7 29
4645 29 17 21 4 -13 -21 12 28 2 16 2 -15 3 17 10 6 -2 -16 -4 25 1 -4 -2 -12 -4 37 19 -6 4 1 -24 6 19 -4 -3 7
4680 7 -10 2 8 4 13 1 11 0 19 -4 -17 14 4 2 4 6 16 4 3 -26 5 16 10 10 11 -5 16 22 -8 8 20 -5 -15 16 15 -5 32
4717 32 12 -8 15 22 -11 9 21 -5 5 19 3 -4 1 5 -18 6 6 -5 11 7 -4 14 19 1 9 23 1 9 20 15 10 11 -1 -10 12 5 0 7
4755 7 13 -16 9 5 -6 3 8 4 -3 7 -3 0 3 2 -5 10 -12 -21 7 3 5 14 -10 -9 3 3 -2 -3 11 -11 -12 20 4 1 10 -10 -19 11 17 -1 9 -1
4797 -1 -6 7 14 -2 2 15 8 5 17 7 11 24 8 -12 25 12 5 18 2 -7 18 20 8 15 7 -11 -7 13 -5 -1 12 -4 -7 12 8 -4 4 -9 -21
4836 -21 1 18 1 2 8 -16 -6 17 -1 6 24 -12 -7 12 5 10 20 -19 -6 -1 11 -5 7 -7 -25 7 22 9 2 4 -10 -12 7 11 17 15 6
$$ packed form
4566hJK2J8pm0Rkj6L8K0j7j4j7rL5K5j4k4k3jK9K7mk8lq%K8nroqj5M3Mj7rlkJ5
4606EL5k1k1%j5LN3lk8npj6J8N2k5j6nqjK8oj5Lj4oL5Nk6Q%j7K4J0nqj4j3K3K2
4645B9j2Mj7j7qL3J6k6J4j4j7J8J4pmqj4J2K9k4nKj0QM1j8k5J0lk5L0J3k3JJ0
4680Gj7J2OmRj2J0j1J9k3j3L1j0kKKJ0j2jk9L1J1o%Jj6K1Ol0J6J2k5j0L1jk0L7
4717C2k0k0K3Pl3K0J2k6J0J4j6pNMk3K4%j1J6mj1J8Nj8QJ4k2QJ1nnJj2rK2pnP
4755GOk9K5mj1RNmpJ0j0LLjpJ5k2rK8mKRk4JJ2%njJ4k2jL2j6lRk0rL0Oj8J0j0
4797anJ3Pj6MJ3plJ2j0MJ3j6k0L7j3pJ3j6rK5Kj2Pqj8MK0j8MJ3j6lJ9mj2Qj3j2
4836b1K2J7j7JOk4J0K3j8PJ8l6NJ9pNJ0l9J3NJ2j6J2j4j8L2J5j3pKj4kJ9MOkr
$$ plain form
4873 6 -10 11 0 8 22 -2 -23 -2 2 -8 19 8 -22 -22 14 0 0 14 -9 -25 0 9 2 11 4 -24 -8 9 -4 14 22 -8 -1 15 3 3
4909 3 24 -3 -9 12 6 18 10 8 -15 2 6 1 22 15 -10 -2 12 5 23 20 -4 -15 -2 -8 -2 15 0 -22 -4 3 5 7 6 -23 -8 2 -9 7 28
4948 28 -7 -7 2 -6 2 17 0 -18 -16 -5 1 6 3 -15 -10 -7 -2 1 9 -4 -28 1 0 12 25 3 -10 2 -4 3 9 26 -7 -6 3 7 16 12 -11 -12 1 1
4990 1 -2 14 -3 -13 -5 -8 -9 13 5 -10 -3 -3 4 16 23 -7 0 3 -4 5 30 2 -10 14 -7 1 17 -1 -5 -4 -2 -2 17 14 -8 -3 5 -3 13 13 1 -17
5032 -17 -3 1 4 19 8 -5 -5 -2 -1 14 13 2 -5 -5 -5 -1 5 -1 -5 2 -4 -5 9 -2 -12 -10 -5 -15 0 6 -10 -6 -11 -6 5 6 4 -3 -8 -1 -7 13 9 -7 14
5077 14 -11 -8 5 20 -10 11 11 4 12 18 -1 -13 0 -1 -7 10 10 0 -7 -10 -19 16 17 8 5 3 -12 5 13 4 4 0 6 -9 8 6 10 14 10 0 21 12 -5
5120 -5 4 4 3 3 22 -1 -3 -1 -9 -4 16 -2 -17 0 -12 -10 6 -12 -18 -10 6 -12 -3 -5 -15 -6 8 -6 3 7 -15 -1 3 0 -12 14 3 5 -5 -10 -11
5161 -11 3 9 -4 -4 -13 -6 4 17 -10 -3 8 -1 -9 1 -5 -16 8 11 -1 3 4 4 9 10 1 -5 6 -4 0 5 -7 -11 5 -3 -6 -9 2 -6 1 4 -11 0 7
$$ packed form
4873Fj6K1j1QJ4k4k1K1Mj0K7j1l0%L6j4%J4k3j6K5RpRpk8J6J7j3J8Ql0PJ6j2%
4909CK1k7oK1oJ2qkk3J7MnK1pk5QJ4pJ8lk4j1J3oOJ7j5k2J8PKKjk9J5J0j1J6K1
4948B8l5%RqQJ5j7j8KJ1ONlj8NLNLQj3k4K9jJ2J3k2j3J2oPOJ7l3JRMRmk3jJ3%
4990AlJ6j7j0QljK2qj5P%PJ2Pl0PLpRK5k8j2K4k1QJ6j8mJK%J9lk2NQqJ6%j2j8
5032a7J4MLJ5j1j3%LJJ5jj1p%%MOomPojJ4j1j0KNj0J5Oj6MnNJ1JkpnPoK0mj6K1
5077A4k5LJ3J5l0K1%pQOj9j2J3joJ7%j0plrL5Jrlkj5J7Qr%mOj5J7kMMmj0K1rj7
5120eR%j%J9k3kKqNK0j8j5J7j2KJ6j8oQJ6j8Rkj0RJ4j4RMk2J4Mlj2K6j1Kj0nj
5161a1J4Oj3%rPJ0J3k7PJ1rqJ0oj1K4Lj2MJ%NJroJ1j0MNj2mJ6qllJ1qPLj5J1P
$$ plain form
5204 7 -9 1 9 -11 -5 14 3 0 2 6 -4 11 16 2 10 10 0 6 26 11 7 5 5 -4 9 10 16 5 6 -1 -7 11 -8 -1 5 -3 6 3 -15 0 -7 -3 1 0
5248 0 2 8 -1 -4 -8 4 -5 -2 0 7 -15 3 2 1 8 3 -10 -2 12 -6 -2 8 -3 -7 -7 8 -2 -2 4 -12 3 21 7 -9 18 2 12 11 12 15 11 -3
5290 -3 -17 -5 10 7 7 14 -5 6 -3 -16 3 12 -3 -6 7 0 -6 2 -9 -5 9 4 4 8 -4 -18 -4 6 12 9 9 -8 -4 0 5 -3 15 3 -9 4 6
5331 6 -2 2 6 0 0 0 1 -4 1 -4 -1 9 17 -2 11 13 10 -2 4 16 16 16 -10 -4 11 0 12 1 13 7 -6 -9 3 3 12 10 17 9 -6 12 -6 -15 13 1
5375 1 -1 3 -9 -7 1 5 3 12 12 0 -12 15 5 -7 6 12 -8 1 5 -4 -2 -3 -5 -14 19 5 -3 12 13 3 10 13 2 12 8 6 -3 12 4 3 15 7 -1 11
5419 11 -15 7 4 4 4 12 -6 -3 7 0 -9 3 7 -7 26 17 -20 -5 14 -7 6 15 -5 -6 26 -5 -17 14 11 -23 10 8 -9 3 8 -17 -7
5456 -7 12 8 -9 -2 9 -7 10 17 -1 7 8 4 8 6 4 -2 -1 6 0 7 -5 14 10 -10 12 7 -5 12 6 -8 -2 18 4 -8 26 6 -12 13 5 -5
5496 -5 6 13 -7 -5 4 -1 -7 10 5 -8 6 17 -10 22 22 0 8 5 7 4 35 6 1 4 4 7 12 5 -5 4 7 13 11 -1 -5 13 5 -2 16 8 -5 3 5 -2 21
$$ packed form
5204Gj6J0Qk0OJ9j1lKMj0J5Nj4Q%j0OK0j5mk%rJ3JOj1JpoJ8j9POqRlj8J5pMMj
5248@KOrlmJ2rLKPk2J8jjPnj3QJ4j8MJ0j1m%J5j0%Oj6J5J8j4j6K7j6J0jJLmj4
5290cj4J2J5l%Pj9J1rj3J9Rj5lJ3poQj1MJ4n%Mj2j4J4J0Ol%j7MMNqJ8j2j2J3K
5331FqMMo%%JnNnLJ0Qj9J3Klj2OJ2%%k6OJ5j1J2j1J2oj3lJ2%RkPqj5J8j8rK8j2
5375AkMj2KQMkR%j2j2K7j0j2J3Ok0RMrKjkrL3j4qJ5Jj0PLj1J0mkrJ5qjJ2qqJ2
5419A1k6K2l%%Qj8LJ0prJ2Mj4L3rl7J5J9k1J3Rk0jL2l1j2L1ll4L3kj7J2Nk5J0
5456gJ9mj7PJ1j6J7Pj8QJmMkkoJPoPj2J9mk0K2nj2J7oj4OK0j4j2L4k0j8K5qj0
5496eJ1Pk0KRnoJ7nj3J4J1k7L2%k2QlKlL1k9nL%LNpj0RLOkj2mJ8qpJ8qj3QKpK3
$$ plain form
5541 21 31 0 8 15 -4 -2 25 11 -3 15 19 -22 5 20 -8 -3 12 -4 0 15 4 -14 13 13 -7 6 23 5 -2 1 -3 2 17 12 14 11 14 12
5579 12 3 3 12 12 0 17 17 2 9 11 1 2 13 1 6 15 0 -20 22 16 -3 2 20 -2 3 10 2 -9 18 6 -10 3 6 2 4 6 -13 4 7 1 -2
5620 -2 10 -10 -1 1 -1 -5 5 -6 -3 -7 0 -10 11 1 -12 2 3 8 10 5 -6 20 17 2 16 9 1 2 21 -1 3 23 2 -6 11 -3 -5 11 15 -5
5660 -5 -4 4 -6 -9 25 7 2 12 0 -15 1 19 -15 -1 9 -4 4 -5 -5 1 16 9 -4 5 6 13 3 1 -6 2 -6 -4 -3 -1 -1 3 -1 3 5 -10 -7 6 11 10
5704 10 16 6 -17 -5 2 -5 -6 7 -1 -9 17 19 -15 16 5 -10 10 16 -1 -4 23 -9 -14 12 2 -15 3 8 -14 1 4 -8 -4 0 -8 -12 -2 -6 -8
5743 -8 4 6 -2 -5 5 -3 4 3 12 4 6 0 0 2 -14 5 6 -3 0 -1 -7 10 12 -12 4 10 -7 0 14 -1 -9 9 -8 -2 10 20 -2 1 10 -4 4 13 2 4
5787 4 4 12 -13 17 4 -8 -4 13 -5 5 7 -8 -8 0 -2 3 -1 -5 4 -3 13 7 -1 5 12 3 -5 -7 10 3 -3 -7 1 3 1 6 -6 9 9 0 9 6 -2 -3 1 3 -11 12
5835 12 19 -10 10 0 -7 0 17 -7 -3 14 -1 -4 6 6 -20 3 6 -14 -10 2 -5 -10 6 1 4 6 6 -18 6 -8 -2 8 -2 2 2 2 -5 1 3 -1 8 1
$$ packed form
5541B1J0l1QPj9KK7j4j4J8Mm1K7J5k8NJ5j6MJ5j1j8K7%k0J3J7j8pLmNJ5nKlLk
5579A2r%R%j2J7%j5PKj0JJ1j2NRj5k0M2oj9NJ8k2NPqj1K7j2j6J3LmKKj9J7Lol
5620bJ2k0RKkmJ0j1LmPj0K1j0j3J4JNKnj1K6lj5J4pqJJ9k2MK0k1qJ7j4kJ6Mk0
5660eJQj0lL4j8nJ0j2j5J6J8l4J4J0j3Qr%OJ5pj3RJPj0kpQqKJK%MmMKj5LJ3Nj
5704A0Oj0k3J2PpjJ3qqK6Kl4L1j1j5K0Oj7lK7l2nK6j0j7J8Nk2J5Lj2MMqmJ0mk
5743hJ2KqlJ0qPjRqKo%Kj6J9JrLjoJ7Kk4J6Oj7PJ4j5qJ8j7OJ2J0k2LRj4QRj1K
5787D%Qk5L0j3j2MJ7j8J0Kj5%QkNmmRpJ6oqOPrqkJ7pomQKkNj2J5%rRlqjMKj4K3
5835A2Pk9K0j0pPJ7k4MJ7j5lJ0%k6K3Lk0MJ2pnJ6nLK%k4K4j4OJ0j0M%%pOKmRp
$$ plain form
5877 1 -4 9 10 5 5 10 16 15 13 5 5 16 -7 5 9 12 -5 2 1 -15 9 7 -7 13 14 -17 -25 13 -2 -2 12 7 -21 -1 3 1 9 11 13 6 10 -6 -2 1 8
5922 8 5 -1 6 2 -13 1 -7 -10 6 12 10 -14 -12 3 -5 -4 -1 14 11 13 13 7 -4 11 2 -5 11 0 -8 10 2 -2 17 22 4 9 10 -11 -10 8 -5 4 27 3
5966 3 -14 8 1 -8 9 15 3 12 0 -15 -4 5 1 5 21 3 -7 17 -3 -2 8 7 0 6 -3 -2 -11 -7 1 7 11 -6 4 11 -2 8 18 5 22 23 9
6007 9 2 26 11 7 21 13 2 10 17 -4 -1 18 0 5 15 9 7 13 -3 -2 16 5 -3 -5 -9 -3 15 -3 -11 1 16 -6 -9 3 -1 7 18 15 -8 0 0 -11
6049 -11 14 2 -3 18 0 -12 -8 -2 -15 -6 1 -6 -8 12 -4 1 11 3 2 17 -12 -5 10 8 2 0 8 6 0 8 -3 8 15 8 2 11 6 -1 18 2 8 13 -1
6092 -1 0 1 -1 -15 -7 -4 -7 -1 8 -9 -1 13 -1 -2 18 -3 -5 11 -7 -8 5 7 -1 0 8 1 -5 15 4 -2 16 11 1 3 2 0 2 -7 -4 5 16 -11 4 4 -13
6137 -13 -6 13 -7 10 -4 -11 -2 11 23 7 12 7 -8 6 4 -11 6 2 -3 7 4 -6 16 3 -13 -7 19 1 0 -2 -4 -5 4 -1 -3 -8 -5 -13 -8 5 8
6178 8 16 7 -1 2 17 6 16 15 1 -13 10 6 9 4 7 -6 3 -3 9 14 8 -2 2 3 -8 12 20 -19 -15 16 5 2 38 3 -4 5 -11 -5 8 14 -8 2
$$ packed form
5877AnJ3Jn%NOjkq%J1k3J2MLj7Pjj6K4kj4K0Jl1qL8j5%J4nk8K0MkQKKpMj6MLP
5922HloPmj5J4qlJ6Okk4KJ5qJLJ5lK%oj1J5rpJ6j1qJ8qmJ9Nj8NJk1JJ8j3RK3k4
5966Cj7K2prJ7Oj2Rj2j5J1RmMJ6j8j0K4k0JJ0jpOrJrMQOMj7J0Pj3J0J0j3J7Jj4
6007IpK4j5mJ4qj1QPk1LJ9j8NJ0okOj6JJ8j1qkmOJ8j8qJ2J5k2lJ2mQJ1lk3Q%j1
6049a1K5j2nK1j8j2MOj3RPpkK0j6NJ0qjJ5k9PJ5kokQkoQj1J1PpoRnpJ9j6ONj4
6092aJJkj4QLlORj7QJ4j4jK0k1kJ6j8jJ3KqJQpoK0j1oJ8nj0KjkKrLRJ1k7J5%j7
6137a3PJ9k0J7j4pRJ3J2j6Nnj5J4kj5J7mnJ0lj0K2j3j6OK6j8jkkjRnknLqNJ3L
6178HQrqLJ5j1J0jj4j4K3mLnLj3RoJ2Noj0MJj1K0Ql9ML1j1lL6l5pRj6OJ3Ok2J0
$$ plain form
6220 2 -8 -7 -6 25 -2 -13 3 1 -7 24 9 -13 2 7 -10 13 13 0 -8 3 -1 4 11 -7 -6 -5 -15 7 23 1 -5 10 -14 -15 14 10 -3 12
6258 12 -13 -25 13 8 -6 -3 -1 -15 -1 9 -5 -11 -4 -11 -26 6 10 -2 16 -5 -15 11 25 9 13 8 -4 1 2 10 4 0 -15 2 0 5 -7 3
6296 3 4 -1 3 -1 1 3 2 8 8 5 6 8 8 -2 -7 5 7 8 12 4 -1 4 19 5 9 4 -6 15 9 -9 2 7 9 -15 2 -2 -12 8 7 -12 0 6 -11 6 0
6341 0 -4 -4 10 2 4 10 1 -1 8 -8 -8 5 -1 -3 9 -5 -2 13 7 9 7 5 1 6 14 5 11 10 -8 1 3 8 -7 26 12 6 3 -7 -1 12 14 -22 13 -6 1 26
6387 26 17 3 -9 8 2 -9 15 3 -10 2 -1 -6 9 23 1 -10 -9 -5 5 18 5 -6 4 -2 14 14 7 8 15 -2 2 21 1 3 -3 -5 -4 16
6425 16 27 10 9 -1 -11 -4 18 0 0 -6 -11 -12 4 6 -8 -2 -10 -1 7 18 15 2 4 -4 -9 17 3 0 -6 -17 -20 -6 13 3 11 -9 -11 -7 15 16 8 -6
6467 -6 -20 -18 8 18 11 19 -10 -10 5 18 8 13 11 -20 5 20 17 27 8 -1 2 21 29 15 11 -4 -12 -1 13 18 21 -1 -25 -6 18 13 16 21 -15
6506 -15 -14 7 1 12 16 2 -10 4 2 13 20 0 -10 -14 5 5 13 13 -13 -21 -7 4 5 5 -8 -22 -7 -9 10 27 18 -12 -15 -6 13 26 17 -5 -7
$$ packed form
6220Bj0JJL1k7j1J6kqL1j5k2J5Nj7K3%j3qJ1mNPj8JJj0K2J6k2oJ5k4jK9mj3J5
6258A2k5j2L8nj4LKj4J4J0j4oPpj5L2Mj2J8k1j0K6J4j6Mnj2NJQomj5J7kNj2J0
6296CJnMmKKjO%lJK%j0nJ2KJMqnNJ5j4Mnj0K1oj8J1NKk4J7mj0K0jj9J2Oj7J7o
6341@m%J4qKOrkRj6%J3okJ2j4LJ5oKkkmNQrOjj8RKNj5L3j4olj0OJ3Kl6L5j9PK5
6387B6rj4j2J7oj1K4j2j3J2lnJ5J4k2j1JMJ0J3j3j1J0oJ6%pJPj7MJ9k0KokJK0
6425A6J1j7jj0j0PK2j8%onjJ6Kj4OqRQJ1lj3KqnK6j4loj1lJ4J9j0Qk0kMK2Jqj4
6467fj4KK6J0pQk9%J5J3j0Nkl1K5J5lJ0j9rLJ9Qj4mj5qJ1J4NLk2k4J9K4nLNl6
6506a5JK1oJ1Mj4j2J4kJ1Pk0j0mJ9%Q%k6qJ4J1J%j3j4J5kJ9J7rl0lRJ9J3rk2k
$$ plain form
6545 -7 -1 1 14 8 6 -7 -12 10 -3 19 11 -8 -2 -6 10 20 9 -1 -11 -1 -2 0 14 11 -6 -11 -11 -5 9 7 6 -5 -8 -8 14 11 9 -14 -8 -2 6 24
6587 24 -7 -3 14 -3 -8 11 6 -6 1 6 -3 14 20 2 -1 19 -3 8 14 7 8 20 10 -6 9 11 5 6 18 -6 7 18 3 -1 4 10 -5 -2 4 -7
6627 -7 14 -1 2 1 -6 1 10 3 -8 4 6 -2 -4 0 0 3 -1 -4 -4 9 0 3 -3 -12 -19 3 4 -1 13 -4 -20 -5 6 -1 4 25 -10 -20 9 3 -11 5 -10
6670 -10 -22 4 13 -7 11 4 -1 9 8 1 3 1 -20 -14 2 7 20 14 -8 -12 -7 10 8 6 -12 -7 2 -2 4 18 9 -10 -4 0 -10 21 18 8 -11 14 3
6711 3 3 35 11 -8 8 -7 -5 17 35 -1 -12 7 -4 20 35 10 -14 -2 -5 -10 23 12 -16 -12 -8 -13 17 18 19 -11 -20 -6 10 30 8 1
6747 1 -12 -14 5 13 15 7 -10 -20 -9 19 8 1 -8 -20 -15 15 26 15 -8 -12 -24 -7 23 23 12 6 2 -23 15 31 22 12 7 -15 -11 26 18 3
6785 3 18 -13 -7 16 21 -7 2 -15 -17 -1 15 24 23 7 -17 1 16 29 18 -8 -18 -10 16 19 11 16 -1 -15 8 -3 11 11 0 -33 0 5 12
6822 12 22 6 -16 -8 20 -3 21 7 -20 -28 4 2 6 24 0 -36 -14 -8 15 14 19 1 -6 8 18 5 28 0 -17 9 -3 15 13 -11 -17
$$ packed form
6545gOKJ3okj3nK2j3K2qj9OmJ6J0j1j0j0J0jKJ4lj7n%OJ4kjj1l%K2lkk3OOQJ8
6587B4l1MJ7j7nJ9nj2PNrJ7Oj8lK0k2J1OpJJ2j0j6J5KoJJ2k4J3J1j5mNOj5LOj1
6627gK1j5LjpPRpj1J2KqkM%Lml%J3rLorpK2JnJ4j7j6J5J1pNK1l5j0K9oj4J6j5
6670a0j2K6Rk0J8pnJ0jpKkk1OJ6NJ3ok2mNJ7kkj8NRmOJ4rj9OMj0L1lj0j9K5j1
6711C%L2k4j9J6j5KK2J8l6j1J9j1K4J5k5k4J2lnL3j1k8MMnL0JJl0rJ4J6K0k2p
6747Aj3kJ9QKqj7j0J1K8j1prj2NL0J1j1k3mj2J7L0%j1omk5L8J6rj0nk2ML7qj5
6785CJ5l1OK3Nk8Rj7kJ6J6Rjj6k4J8J5J3j1k6j0QK6LqNj7j4K3j1J4%j1l3L3NP
6822A2J0j6k2QK8k3K4j4k7qL2kMJ8k4l6K2OK3jNj8pJ4J0j3K3k8j7K6j2J8kk4o
$$ plain form
6857 -17 -3 -7 3 22 14 -8 -11 -19 0 15 31 -6 -10 -10 -7 3 13 1 -10 13 -4 -6 10 4 -2 1 2 -9 10 20 -8 -12 7 -2 2 10 4 -5 5
6896 5 4 0 20 7 -5 2 11 -2 17 20 14 12 12 8 17 13 15 24 7 -7 11 26 -8 0 0 0 3 26 4 -6 9 -8 -12 3 12 -10 -3 10 -18 -8 15
6937 15 -11 -16 16 2 -18 12 -5 -14 4 8 6 2 4 -32 -17 17 6 -2 3 -1 -12 -1 10 1 16 5 -1 3 2 11 1 12 -7 -5 4 2 24 11 0
6976 0 -1 1 0 18 29 6 -19 4 -6 16 29 7 -10 -10 0 -12 14 24 -4 -11 4 -8 3 22 5 -21 -13 -17 -2 19 19 -7 -8 8 13 35
7012 35 20 6 5 -10 -13 21 27 21 2 -1 -14 4 30 20 4 -2 -15 -3 18 27 20 -5 -14 -15 2 30 23 -1 -7 -14 2 19 31 -7 -2 -14 -8 23
7050 23 38 9 -11 -9 -29 -9 31 10 4 -13 -16 -6 14 19 4 -2 -1 -7 16 32 2 -1 -7 -19 4 22 32 19 -11 -4 -12 29 31 16 5 -4 -11
7087 -11 8 20 20 12 -5 -8 -5 22 18 23 11 -17 5 29 20 15 15 0 -14 9 18 14 15 10 -13 -13 14 16 12 12 -16 -12 20 8 13 10 -12 -25 1 23
7127 23 6 20 -1 -15 -12 19 6 5 11 2 -3 0 24 28 14 8 1 11 17 12 12 9 4 10 -1 14 22 8 -9 -5 -5 -1 10 10 8 -17 -2 1 -6 14 7 -4
$$ packed form
6857a7J4mJ0J9qk2lqJ9J5J6l7m%LJ0J0j2j1K3j7kJ6ooLJj1J9J0k8mJ9rMQorJ0
6896EjmK0j3j2PRj3J9Lok%mRmKRj7j4J8J5l4Q%%LK3k2j0J5j7mJ5Rk2PJ3k8J0K3
6937A5k6nL2j4k0L0j7rJ8MkmKl6J5L4j1qNmj1J1J1rJ5j1oMjRj0J1j9KRkK2j3j1
6976@jKjJ8J1k3k5K3j0K2J3k2j7%J0j2K6J0k8pJ5j2J1J9j7k6QmJ5K1%k6jJ6NK2
7012C5j5j4jj5lL4Ooj9lj3J8K6j0j6oj3J2K1Rpk5rjJ7K8pk4opJ6J7J2l8Nj2OL1
7050B3J5k9k0Kk0K0M0k1oj7lJ0K0Nj5oJoK3J6l0loj2K3J8J0j3l0PqM1Kj5j1rp
7087a1J9J2%qj7lLK7mNj2k8K2K4rn%j5j4K3RmJnk3%K7Km%k8ML2j2Nlk2j3K6K2
7127B3j7J4k1j4LL1j3jOrnLK4Mj4opJ0On%lnOj1J5Qj4j7M%MJ1%kk5J5LpK0pj1
$$ plain form
7169 -4 -2 1 -2 3 8 0 -18 18 1 6 13 6 -17 -4 4 -7 7 6 2 5 18 3 -15 4 6 -8 -2 10 -1 1 7 8 19 15 8 4 8 -2 11 10 3 6 10 6
7213 6 17 7 -9 0 7 1 4 6 8 -5 -4 -3 -9 1 3 -16 -10 -8 -10 0 7 -6 -17 5 -12 -15 -11 9 -10 -4 6 -11 6 4 -5 -8 -4 -8 -7 7 11 -17 -5
$$ packed form
7169dKLlNNqj8L6j7NPpk3J3Qj1J4jmLJ3j5j8J9Kj4OJ2j1KOJJ1mpmMj0J3jpLMm
7213FJ1j0j6RPoLKKj3JJoJ0Kj9OKkJ0Pj3j1K2j7lMK0j9OJ0j7J7krlMmJJ4Mk8J2
$$ [...]
8191d
##END NTUPLES=NMR FID
##END=
