##TITLE=1H_LY-812-40
 CDCl3, 8 sc, 
 11.4.2019
##JCAMPDX= 6.0         $$ Bruker NMR JCAMP-DX V2.0
##DATA TYPE= NMR FID
##DATA CLASS= NTUPLES
##ORIGIN= UXNMR, Bruker Analytische Messtechnik GmbH
##OWNER= root
$$ XWIN-NMR		Version 3.5
$$ Thu Apr 11 16:07:04 2019 Russian Standard Time (UT+4h)  she@DPX200
##.OBSERVE FREQUENCY= 200.1315
##.OBSERVE NUCLEUS= ^1H
##.DELAY= (6, 6)
##.ACQUISITION MODE= SIMULTANEOUS
##.ACQUISITION SCHEME= undefined
##.AVERAGES= 8
##.DIGITISER RES= 18
##SPECTROMETER/DATA SYSTEM= spect
##.PULSE SEQUENCE= zg30
##.SOLVENT NAME= CDCl3
##.SHIFT REFERENCE= (INTERNAL, CDCl3, 0, 15.7039)
##AUDIT TRAIL= $$ (NUMBER, WHEN, WHO, WHERE, WHAT)
$$ ##TITLE= Audit trail, XWIN-NMR		Version 3.5
$$ ##JCAMPDX= 5.01
$$ ##ORIGIN= Bruker BioSpin GmbH
$$ ##OWNER= she
$$ F:/spectra/data/she/nmr/H-F/1/audita.txt
$$ ##AUDIT TRAIL=  $$ (NUMBER, WHEN, WHO, WHERE, WHAT)
(   1,<2019-04-11 16:05:55.75 +0400>,<she>,<DPX200>,
      <created by zg, POWCHK disabled, PULCHK disabled
       configuration hash MD5:
       00 E9 B6 7A A2 85 ED C7 34 08 36 98 17 FE 4E 26
       data hash MD5: 16K
       EB DC 2B F9 B1 59 35 ED 7D 1C 71 9B 2A A7 19 30>)
$$ ##END=
$$ 
$$ hash MD5
$$ DC E7 B4 5F 74 EB 87 49 14 69 5F F0 DC B3 67 98
##$RELAX= 
##$RELAX= 
##$RELAX= 
##$RELAX= 
##$RELAX= 
##$RELAX= 
$$ Bruker specific parameters
$$ --------------------------
##$DU= <F:/spectra>
##$EXPNO= 1
##$NAME= <H-F>
##$PROCNO= 1
##$TYPE= <nmr>
##$USER= <she>
##$AMP= (0..31)
100 100 100 100 100 100 100 100 100 100 100 100 100 100 100 100 100 100 
100 100 100 100 100 100 100 100 100 100 100 100 100 100 
##$AQSEQ= 0
##$AQ_mod= 1
##$AUNM= <au_zg>
##$AUTOPOS= <>
##$BF1= 200.13
##$BF2= 200.13
##$BF3= 200.13
##$BF4= 200.13
##$BF5= 200.13
##$BF6= 200.13
##$BF7= 200.13
##$BF8= 200.13
##$BYTORDA= 1
##$CFDGTYP= 0
##$CFRGTYP= 5
##$CHEMSTR= <none>
##$CNST= (0..31)
1 1 145 1 1 1 1 1 1 1 1 1 1 1 1 1 1 1 1 1 1 1 1 1 1 1 1 1 1 1 1 1 
##$CPDPRG= <>
##$CPDPRG1= <>
##$CPDPRG2= <>
##$CPDPRG3= <>
##$CPDPRG4= <mlev>
##$CPDPRG5= <mlev>
##$CPDPRG6= <mlev>
##$CPDPRG7= <mlev>
##$CPDPRG8= <mlev>
##$CPDPRGB= <>
##$CPDPRGT= <>
##$D= (0..31)
0 1.2 0 0 0 0 0 0 0 0 0 0.03 0 0 0 0 0 0 0 0 0 0 0 0 0 0 0 0 0 0 0 0 
##$DATE= 1554984355
##$DBL= (0..7)
120 120 120 120 120 120 120 120 
##$DBP= (0..7)
150 150 150 150 150 150 150 150 
##$DBP07= 0
##$DBPNAM0= <>
##$DBPNAM1= <>
##$DBPNAM2= <>
##$DBPNAM3= <>
##$DBPNAM4= <>
##$DBPNAM5= <>
##$DBPNAM6= <>
##$DBPNAM7= <>
##$DBPOAL= (0..7)
0.5 0.5 0.5 0.5 0.5 0.5 0.5 0.5 
##$DBPOFFS= (0..7)
0 0 0 0 0 0 0 0 
##$DE= 6
##$DECBNUC= <off>
##$DECIM= 24
##$DECNUC= <off>
##$DECSTAT= 4
##$DIGMOD= 1
##$DIGTYP= 9
##$DL= (0..7)
0 120 120 120 120 120 120 120 
##$DP= (0..7)
150 150 150 150 150 150 150 150 
##$DP07= 0
##$DPNAME0= <>
##$DPNAME1= <>
##$DPNAME2= <>
##$DPNAME3= <>
##$DPNAME4= <>
##$DPNAME5= <>
##$DPNAME6= <>
##$DPNAME7= <>
##$DPOAL= (0..7)
0.5 0.5 0.5 0.5 0.5 0.5 0.5 0.5 
##$DPOFFS= (0..7)
0 0 0 0 0 0 0 0 
##$DQDMODE= 0
##$DR= 18
##$DS= 0
##$DSLIST= <SSSSSSSSSSSSSSS>
##$DSPFIRM= 0
$$ [...]
##$SUBNAM2= <"">
##$SUBNAM3= <"">
##$SUBNAM4= <"">
##$SUBNAM5= <"">
##$SUBNAM6= <"">
##$SUBNAM7= <"">
##$SUBNAM8= <"">
##$SUBNAM9= <"">
##$SW= 24.9337058887773
##$SWIBOX= (0..15)
0 0 2 0 0 0 0 0 0 0 0 0 0 0 0 0 
##$SW_h= 4990.01996007984
##$TD= 16384
##$TD0= 1
##$TE= 0
##$TE2= 300
##$TE3= 300
##$TEG= 300
##$TL= (0..7)
0 120 120 120 120 120 120 120 
##$TP= (0..7)
150 150 150 150 150 150 150 150 
##$TP07= 0
##$TPNAME0= <>
##$TPNAME1= <>
##$TPNAME2= <>
##$TPNAME3= <>
##$TPNAME4= <>
##$TPNAME5= <>
##$TPNAME6= <>
##$TPNAME7= <>
##$TPOAL= (0..7)
0.5 0.5 0.5 0.5 0.5 0.5 0.5 0.5 
##$TPOFFS= (0..7)
0 0 0 0 0 0 0 0 
##$TUNHIN= 0
##$TUNHOUT= 0
##$TUNXOUT= 0
##$USERA1= <user>
##$USERA2= <user>
##$USERA3= <user>
##$USERA4= <user>
##$USERA5= <user>
##$V9= 5
##$VALIST= <valist>
##$VCLIST= <CCCCCCCCCCCCCCC>
##$VD= 0
##$VDLIST= <DDDDDDDDDDDDDDD>
##$VPLIST= <PPPPPPPPPPPPPPP>
##$VTLIST= <TTTTTTTTTTTTTTT>
##$WBST= 1024
##$WBSW= 4
##$XGAIN= (0..3)
0 0 0 0 
##$XL= 0
##$YL= 0
##$YMAX_a= 29619
##$YMIN_a= -33034
##$ZGOPTNS= <>
##$ZL1= 120
##$ZL2= 120
##$ZL3= 120
##$ZL4= 120
##$ABSF1= 10
##$ABSF2= 0
##$ABSG= 5
##$ABSL= 3
##$ALPHA= 0
##$AQORDER= 0
##$ASSFAC= 0
##$ASSFACI= 0
##$ASSFACX= 0
##$ASSWID= 0
##$AUNMP= <proc_1d>
##$AZFE= 0.1
##$AZFW= 0.1
##$BCFW= 1
##$BC_mod= 2
##$BYTORDP= 1
##$COROFFS= 0
##$CY= 11.3945322036743
##$DATMOD= 1
##$DC= 2
##$DFILT= <>
##$DTYPP= 0
##$F1P= 18.9103706918063
##$F2P= -1.10871071338519
##$FCOR= 0.5
##$FTSIZE= 0
##$FT_mod= 4
##$GAMMA= 1
##$GB= 0.15
##$INTBC= 1
##$INTSCL= 1
##$ISEN= 128
##$LB= 0.24
##$LEV0= 0
##$LPBIN= 0
##$MAXI= 10000
##$MC2= 0
##$MEAN= 0
##$ME_mod= 0
##$MI= 1.114404
##$NCOEF= 0
##$NC_proc= 0
##$NLEV= 6
##$NOISF1= 3.799351
##$NOISF2= 2.8
##$NSP= 1
##$NTH_PI= 0
##$NZP= 0
##$OFFSET= 15.70392
##$PC= 1
##$PHC0= -8930.152
##$PHC1= 14.20026
##$PH_mod= 1
##$PKNL= yes
##$PPARMOD= 0
##$PSCAL= 0
##$PSIGN= 0
##$REVERSE= no
##$SF= 200.130013532006
##$SI= 16384
##$SIGF1= 3
##$SIGF2= 2
##$SINO= 400
##$SIOLD= 16384
##$SREGLST= <1H.CDCl3>
##$SSB= 0
##$STSI= 0
##$STSR= 0
##$SW_p= 3612.71676300578
##$SYMM= 0
##$S_DEV= 0
##$TDeff= 0
##$TDoff= 0
##$TI= <>
##$TILT= no
##$TM1= 0
##$TM2= 0
##$TOPLEV= 0
##$USERP1= <user>
##$USERP2= <user>
##$USERP3= <user>
##$USERP4= <user>
##$USERP5= <user>
##$WDW= 1
##$XDIM= 8192
##$YMAX_p= 0
##$YMIN_p= 0
$$ End of Bruker specific parameters
$$ ---------------------------------
##NTUPLES= NMR FID
##VAR_NAME=  TIME,          FID/REAL,        FID/IMAG
##SYMBOL=    X,             R,               I
##VAR_TYPE=  INDEPENDENT,   DEPENDENT,       DEPENDENT
##VAR_FORM=  AFFN,          ASDF,            ASDF
##VAR_DIM=   8192,          8192,            8192
##UNITS=     SECONDS,       ARBITRARY UNITS, ARBITRARY UNITS
##FACTOR=    0.0002004,     1,               1
##FIRST=     0,             0,               0
##LAST=      1.6414764,     0,               0
##MIN=       0,             -33034,          0
##MAX=       1.6414764,     29619,           0
$$ Real data points
##PAGE= N=1
##DATA TABLE= (X++(R..R)), XYDATA
0@%%%%%%%%%%%%%%%%%%%%%%%%kPj3J6j6J6j6J6j6J6j7K1k6L0l2L3l7M2m6N2n7
45b9O3p1Q1r2J02j17J37j64J98k45L17m31O33j046K178r857k4691N0584R8m6411
65b8763L1991K5074m4835J674L5062k3830j2912L0864o899j9785J6491k43j5019
78a1130J4269M978j4600P891N431j5033M569J1252j0340o90J0736o822o323O181
92C69m8o91K793l419J555K866q938K078J1352r767n178J6466n685j6384J4558
107A927O942j7372O802J2917j5597k307J4326r433n375J4560n553q460J3185m928
121A634j3400J6438M253j9450J0590J3381k2078j278K2772j2582j3247K2264K19
134I516k2149J0127J2250j5162M10J4011p861p361Q169q61m629M723N31j690K382
$$ y = [0, 0, 0, 0, 0, 0, 0, 0, 0, 0, 0, 0, 0, 0, 0, 0, 0, 0, 0, 0, 0, 0, 0, 0, 0, -2, 5, -8, 8, -8, 8, -8, 8, -8, 8, -9, 12, -14, 16, -16, 17, -20, 22, -24, 28, -29, 34, -37, 44, -48, 54, -63, 74, -90, 108, -137, 180, -251, 382, -664, 1514, -8343, -33034, 17550, 17648, -28763, 3228, 28302, -16533, -14859, 20203, -3627, -16539, 14325, 7426, -12359, 4132, 3889, -11130, 3139, 8117, -6483, 1408, 6839, -8194, -3625, 7627, -2713, -3403, 7333, 511, -5812, 369, 321, -370, 2423, -996, 559, 3425, -5513, -3435, 7917, -1850, -7028, 9438, 3753, -12631, 1927, 8869, -8503, -1701, 11216, -4381, -6688, 7638, -1795, -7170, 7390, 1837, -6623, 6562, 1634, -11766, 4672, 8925, -10525, 65, 13446, -8632, -9910, 12862, 280, -12967, 9297, 9516, -12633, -2506, 9744, -5418, -5008, 9003, 1142, -6219, 1950, 1089, -3540, 1183, 1714, 24, 2406]
149B406m122k554O775j132m657O670J75q990M073N523p156R34P513n161l796N277
165A778k548k650O618q47n148M310r6n896M692L509o308K069N248o504k360O460
181B327j672k788M733j173m074L135p4k814L995J62m185M189P88p573L612O716
197E304p040j366Q455m995o655Q607J456q604M582O074p590k108O270k151k891
212b652M576L42l664O13Q48n63O57l94N51J834k593k108L288j48k424L566Q32
229B561n033J250L329l485k12M254j991k232K779j432k482L598J068k791J266
244D47M39k810J425J868k203P76K076k485q03J805j451J45L056j743k182K455
260H15o58k304K970R26l280J744K036l959m51L849j159j661K593o40k884J660
$$ y = [2406, -1716, -4270, 2505, 1373, -3284, 3386, 3561, -5429, -1356, 4167, -2989, -2055, 5458, 297, -3499, 1778, -770, -3420, 3198, 2351, -2797, 1513, 1417, -4479, 213, 3722, -2586, -517, 4731, -1773, -4133, 2327, 655, -2133, 2600, 1427, -2647, 488, 414, -2400, 1595, 1757, -2428, 1761, 2549, -5024, -1412, 5304, -1736, -3102, 5353, 358, -6297, 2310, 3766, -4838, -256, 5818, -1772, -3880, 2390, 239, -2652, 1924, 2266, -1398, -785, 63, -500, 157, -237, 314, 2148, -445, -2553, 735, 587, -1837, 1729, 2561, -2472, -1222, 2107, -1378, -1590, 2664, 673, -1559, 1220, -212, -2694, 904, 1972, -819, 447, 886, -1924, -499, 1369, -834, -58, 2018, -467, -1270, 535, -916, -771, 2285, 542, -1640, 815, 157, -2147, 823, 1749, -1531, 213, 2249, -1710, -2161, 1688, 529, -1132, 1461, 821, -2063, -403]
276d03J605j756J28J510n68r82j91J22P21J46j11O85r38j561J629J117k113N26
294d34K372j905j634K174l89j741K460J099l015q3K023j274o92J933j63j232Q13
311C12J2j357L75J245R3l52m10m02K38J17J5N46n9n60L94j29j136O07J498n46
331E01p82N01m65o87J121M77r73L33P06r18n91O22J78J34N69m76q82K52M00l7
351a7K24N2l14K07J2p92R4R74L3l82R0l91m74O83N76o64j48O82k06p35J90L88
373H2j05K77L58o81p11O01O51m61k93O04Mo52J10L42m80J69J046m64j262N19Q84
394E38p27j29R52n00q08R93J56j389M97J522q09j026Q94M2r02Q12P18j197k28
413e91J259l49j160O59P96o22j25N42n45o02R15N73r92k71R62j13q27L72M49o22
$$ y = [-403, 1202, -554, -426, 1084, 516, -466, -657, -535, 186, 332, 221, 906, -32, -1593, 36, 1153, -960, -434, 1938, 33, -1601, 573, 184, -1557, 903, 2002, -1013, -1096, 927, -347, -1039, 894, 731, -501, 312, 324, -1033, -658, 587, 680, 328, -82, -484, -246, -129, -114, 432, 373, -187, 207, 78, -1058, -451, 1047, 501, -281, 220, -245, -932, 189, 666, -307, 26, 732, -186, -777, -155, 23, 157, 726, 250, -632, -380, 20, -17, 207, 259, -55, 152, 164, -628, -534, 440, 473, 91, 181, -210, -684, -1, 575, -89, -237, 445, 239, -496, -306, 82, -23, 254, 612, -69, -780, -179, 472, 11, -282, 322, 326, -326, -216, 126, -354, -185, 861, 397, -865, -346, 538, -189, -318, 634, 134, -674, 319, 475, -914, -417, 1105, 296, -730, 164, 206, -696, 116, 834, -363, -591, 668, 319, -841, -182, 614, -8, -133, 409, -136, -738, 177, 750, -242, -513, 449, 336, -491, -119, 330, -292]
433b92K39Q17q64p86J106L93r85K12O20o85l3P46o22n57J023K63q58N8K91l35
453b49K80M20o16j97O64r8m81J57J27qK84j25n08P4M62L5k32j09J16J03p9m1k3
476d4j77K63M83n38o14P29L56p18J81M96p39L0J005o99r22J176M97j165J19P17
496D36p30q0J020m48r21P79N54q21j90N88q0k00K66r9m71J71O38j08o61R1O37
517C71k65m54M28J11n49M75M68j015k29J225j05r98N25M01q07K69Q15q49n02J161
537D76J04j156K37P87m54k14N66l02o15O49N38p57l58P23J26n86J26L02l73L7
557a44O04l46p22N39O17n66l03M56j08k00M34j20n79L95M99m73k96L19JkK21k59
579c3k98L83J98k77o2%J7K78o0m20J02L76p9j38k7j36J61L08k38k86J56J49J08
$$ y = [-292, -53, 764, -100, -886, 220, 613, -372, -160, 460, -225, -258, 488, -134, -691, 332, 595, -263, -205, 86, -249, 31, 451, -165, -362, 302, 204, -277, -120, 7, -1, 283, 158, -350, -276, 186, 221, -11, -120, -4, 99, 20, -21, -44, -221, 42, 525, -13, -627, 102, 458, -260, -79, 417, -322, -292, 713, 14, -908, 268, 765, -400, -281, 436, -294, -374, 646, 198, -723, 56, 610, -211, -401, 187, 107, -93, 173, 74, -397, -226, 412, 304, -357, -266, 371, 106, -348, 80, 191, -358, 117, 585, -430, -659, 566, 461, -537, -12, 389, -418, -149, 666, -183, -685, 476, 580, -576, -339, 448, -6, -220, 346, 44, -571, 78, 616, -141, -499, 224, 350, -236, -110, 192, -181, -144, 460, 114, -608, -69, 548, -18, -321, 135, 27, -173, 261, 141, -438, -43, 456, -17, -313, 6, 7, 5, 226, -33, -331, 52, 250, -27, -89, -89, -72, 206, 146, -274, -172, 204, 125, -13, -40, -176, -15, 293, 55, -231, -75, 74, 182]
602A82n1l71R8M35k75j72L47l19j45Q35l62j033Q89P11j176J35R11j073j68J569
622I67q09j253J531L50j604O66Q82j309K89J298j246o66J429j82q00P37j62o67
640e49Q33O2q72N61K88n77N07p3r86R49P04j399K74J028j293P5J601j360r07K127
660I93m29j832J604M41j879J289J124k376L15K171j648p65K050j040j207K179
676I90l85k053J758Q14k113Q38J179j929M53J857j822o94K057p45j118J620m17
693B90j436J627L28j787Q80Q79j327M67P75j433M07J356j314k92J322j111k76
710f45J785j153j268K172j83k094J678P83k328J199J731k673k38K814j424j539
726a383K391m48k106K056P17k540R91J760j965k39J720j274n17J907p69j463J519
$$ y = [182, 131, -240, -142, 293, 18, -154, 193, -126, -271, 564, 202, -831, 58, 769, -407, -272, 639, -434, -602, 967, 158, -1095, 436, 786, -818, -152, 730, -579, -290, 1008, -238, -904, 525, 343, -457, 280, 118, -549, 284, 346, -526, 35, 323, -254, 253, 180, -806, 143, 847, -552, -278, 750, -543, -468, 1133, -227, -1134, 993, 564, -1268, 336, 777, -1102, 187, 1311, -1065, -750, 1421, -227, -992, 1058, 18, -1189, 990, 605, -1448, 310, 1124, -989, -151, 1028, -901, -448, 1409, -413, -1107, 950, 205, -913, 707, 290, -1146, 481, 809, -978, -98, 781, -546, -79, 696, -737, -330, 1026, -288, -580, 742, -369, -645, 1140, -13, -1281, 891, 708, -1386, 292, 1075, -1253, -54, 1677, -996, -1234, 1580, 156, -1383, 1008, 560, -1546, 510, 1227, -1313, -322, 1438, -527, -766, 954, -320, -837, 1070, 301, -1162, 357]
743C57K00j289R40L46j305P41P81j323J48R90p93P3P48j111n2J428q75p74J364
762E94m75j031J575k1j857J252J151j909J56J560j353l27J776j082j227J843Q7
779G12j582J046M22j487R23R66j675J64J525j176n86J444o63q70J539q6j600Q55
797a29Q04j021K61O01q95J25P87p36j89P59l62j38N63p33k93J155k32q71P51L8
817B45q56P83L90j145L72R44q83l16P73m59j24Q92n44p51R11J25p58N05J90p23
837d29M88M86q75o7P80k70k49L17l27j02N58j85l89L10Lr5L26l27l98O22J81n94
859b36J56K51l41K03K68n29k7N24j29k19Q0k18J32M52l50l11M18n4k43L15j39
880Cl54N42K09o75N0L48j87J51J69n19Q7M79l52j70M16k56r8N97m05o54P42L62
$$ y = [357, 557, -732, 208, 554, -751, -10, 771, -552, -404, 586, -207, -134, 614, -497, -549, 879, 4, -770, 594, 119, -912, 663, 642, -1215, 37, 1188, -721, -565, 995, -358, -685, 1091, 9, -1218, 625, 712, -870, 176, 598, -889, 34, 1000, -675, -511, 1014, -162, -748, 696, 33, -837, 702, 616, -984, -129, 675, -346, -85, 516, -379, -254, 533, -203, -392, 367, 5, -133, 430, -303, -596, 559, 327, -544, 207, 245, -611, 172, 562, -583, -211, 733, -150, -466, 307, -152, -276, 616, 72, -679, 232, 357, -401, 104, 294, -429, 59, 545, -330, -397, 383, 113, -136, 181, -146, -248, 310, 125, -264, 46, 49, -46, 280, -47, -445, 177, 358, -236, -80, 171, -170, 33, 301, -228, -255, 269, 140, -79, 1, -217, -85, 367, 17, -294, 124, 70, -173, 142, 3, -351, 191, 400, -275, -225, 123, -64, 87, 256, -263, -176, 303, -49, -219, 197, -59, -157, 440, 35, -619, 123, 485]
902D85p16J82L28n84J44O52n67l62P27k4m96K15K9k08M00Q7n25R0K50j36J02k2
924E1k96K71K99m41q2K86j78J29L42n85k31P67j09o05M65J36n62M47L75r19N4
945c86R37m13n76O05l2n17N63J80p72J95O50l64l14K80n1l0K90k04k86K60J19
966A34j23L6j17p6L78k7m45J29K52j57P5J09m05N7M99k24l51K78P7j65J93r9l57
989c29L32L27l97j09K34j21M6K28l05j88M56J9l59J06O8j33K60J03m97L7M73j58
1011I3k62K05n2j08K97k2m48J59M07j68k24R7J1rJ51m6k16M2K14M3k08j73K02
1034a5K16j41j64J02l7l1K60j06m10K74M16l74k63L19L6j97K68j9m34J52M67k59
1056F0l29K52J58j67M4%k06J04L03r1l28L9K64J1j71j8J05k8L3P5k09j28L32J89
$$ y = [485, -231, -49, 279, -305, -161, 491, -76, -438, 289, 265, -231, -16, 13, -195, 205, 292, -233, -143, 107, -29, 73, 51, -245, 26, 325, -116, -198, 88, -90, 39, 381, -204, -435, 332, 223, -382, 83, 219, -343, 104, 479, -440, -386, 551, 138, -438, 167, 135, -382, 181, 361, -411, -216, 434, 70, -244, 36, -15, -45, 245, 41, -245, 15, 134, 11, 47, -70, -146, 232, 205, -240, -111, 141, -16, 59, 168, -237, -180, 319, 95, -256, 22, 99, -66, 127, 28, -329, 3, 330, -67, -176, 58, -63, -17, 211, -94, -282, 174, 193, -166, -60, 8, -125, 135, 238, -259, -222, 251, 93, -169, 36, -16, -124, 173, 151, -297, -138, 269, 101, -123, -26, -15, -24, 127, 81, -135, -93, 121, 164, -44, -217, -15, 201, 60, -104, -2, -39, -70, 190, 84, -326, -52, 364, -10, -273, 46, 82, -115, 153, 134, -300, -148, 319, 60, -269, -17, 141, -26, 18, 18, -188, -84, 219, 128, -200, -161, 103, 114, -57, -75, 30, 2, 35, 110, -99, -227, 105, 294]
1080B94l52j54K58qp9J53q5k24K47K09l46j72K94J50j38m7m6o7J11J53j11j71
1102a31Q8J90m4k57kK07P0q0m3j05o6K29J46k69j29K61J00k48n5J03K1Q1Q1j95
1126d7k15J95K66j48k07J28J21j03l0L7j07N8K88p8m16O7L66q8j82J34J1j62J90
1149G8Q2l62j2M71j7m23N7J97j20M3K00k24j97L29J37l99p8L56M6j77j4oj22J29
1173b6K55j78l01K11K60k36j95K07O7q3J16ml45Q1M10j18l09J43J51j40KN1j34
1196a15O3K74r8l15K2K43M6j24o6O2J3jP4j13j32K45K15l15k32K91M2j22J51m0
1220F8k66K05K38l33j26K66O1o3k4j68J8K36l0j19O0j21K5L01k65l21M64J83m48
1243a59R1J96l75J50M89m53l06N49Rm10K11P2k29K98J16m58K6K70o3M3lk44J85
$$ y = [294, -58, -212, 46, 38, -41, 112, 27, -197, 50, 259, -87, -259, 35, 185, 47, 0, -46, -113, -2, 151, 40, -131, -43, 147, 103, -154, -156, 51, 121, 41, -2, -107, -173, 56, 202, -67, -196, 65, 165, -83, -138, -35, -14, 67, 148, -47, -262, -67, 199, 51, -156, -28, 93, -10, -40, -3, -110, -52, 236, 158, -258, -191, 175, 87, -95, 39, 50, -112, 78, 160, -202, -214, 257, 240, -183, -126, 71, -49, -6, 194, -30, -227, 102, 239, -160, -238, 118, 164, -13, -27, -33, -155, -26, 229, 51, -250, -39, 221, -15, -210, -3, 64, -19, 97, 93, -252, -171, 239, 121, -188, -45, 106, -34, -32, 19, -115, -52, 222, 124, -191, -169, 74, 120, -4, -70, -8, 5, 4, 78, -35, -167, 78, 293, -22, -254, 37, 79, -43, 108, 68, -198, 7, 245, -88, -214, 52, 113, 50, 26, -142, -124, 112, 82, -37, 23, -98, -73, 228, -37, -358, 106, 289, -159, -68, 128, -247, -97, 392, -61, -367, 182, 191, -219, -8, 64, -165, 133, 249, -209, -183, 87, 24, 67, 64, -180, 5]
1266EK25l48j6K80k43R2L82n65k70Q09r2o58N31J54o99M33M60q69J2R56m88n33
1288d42O38r8m89O23J11p43K83M57m59k1K61k97J69L47m86j78M84j42j39L58k93
1309e6k80O03n8n92L69K70m34K26K10o17J49O50m44k68M86j98k49M84j81m96N70
1330A44K69o32Q7L03l76J85M01n23j51O05k35l66M34q2l47N72L1p99L06N84n20
1351a10p7N29m23k79P09j80o92N37M17n80JL21l78N0M98l10l23L99l9k06K18j20
1373c8j91M68j5n38K34K32l19K63K11n95J03O06m69l09N99j58l37N82j93o84O32
1394H4L89p49J85M66o36N8O79n99l57R04j40o91M91P4n54N62K70q16K21N62n64
1415a61m3N16m71p8P21m49n85O80J19n39M10J31o42L27M71n94r1N26k10j18K39
$$ y = [5, 230, -118, -134, 146, -97, -5, 377, -188, -458, 351, 259, -399, 132, 286, -413, 20, 480, -389, -377, 579, 91, -442, 196, 98, -391, 232, 343, -400, -117, 340, -119, -140, 121, -176, -7, 340, -146, -324, 160, 18, -121, 237, -56, -336, 267, 209, -383, -14, 256, -178, 48, 258, -359, -210, 440, -4, -272, 214, 16, -233, 251, 70, -426, 144, 413, -219, -132, 171, -205, -20, 381, -142, -293, 312, 77, -289, 145, 63, -284, 288, 319, -480, -174, 410, -110, -187, 342, -81, -360, 349, 169, -523, 14, 431, -149, -148, 173, -205, -155, 343, 33, -290, 109, 70, -136, 82, -38, -229, 239, 224, -314, -80, 152, -167, 96, 307, -288, -185, 421, -48, -357, 242, 84, -253, 329, 136, -548, 84, 473, -276, -91, 375, -261, -203, 476, -123, -480, 424, 284, -407, 84, 158, -396, 166, 436, -380, -159, 403, -161, -204, 312, -159, -237, 484, 35, -550, 130, 249, -290, 120, 251, -391, -64, 407, -187, -278, 248, 38, -80, 159]
1436A59l12r1M87j19k94K56r2j78L94j38m38M73K38n57J31K76m24J63N04n26k98
1457c86O33p3m64L93M8m19L68K60o16l4N67j78k80K72m3k35K51J45l59j4L08M
1479A48k22l2P7K2N2L5j03j11J14J52j63j26J44J47o9r0p7J1J24Q1p9r4j8Q8R8
1504A09j54r2J75R0r4n5o0n1K13J19k61o1J92n3m3R1j30k3K63o2k95R8J70r0Q7
1529H3%k48R0K43j79j16J62l7K7J11k28j45L36P9k89Q5Q0k07J66J97l56n2M20
1552B22q9l16J53N6j30K10N9l09jK63o0j27L9KP8P9j53j29J50O6k5L4j08r2J98
1577G0P8k58J0K15n2o0P3j90m0L16nl01R3J43j34N9P5k25M8L19j68k85J90J00
1601G1j09R9K6k45P8K44j63j58J45P8k5J4j45o0K08N1j37L4o1o5K26ql11J61K96
$$ y = [159, -153, -244, 243, 124, -170, 86, -6, -184, 210, 72, -366, 107, 345, -212, -81, 195, -229, -66, 438, -88, -386, 247, 174, -290, 103, 151, -268, 100, 360, -256, -290, 277, 99, -181, 91, 48, -187, 64, 209, -150, -164, 144, 148, -74, -106, -29, -7, 45, 80, -23, -134, -20, 132, -31, -157, -13, 134, 65, -25, -102, -91, 33, 114, 35, -59, -77, 11, 109, -45, -137, 38, 128, 34, -21, -81, -132, 81, 200, -61, -122, 70, 17, -26, 65, -65, -88, 175, 113, -182, -84, 86, -4, 83, 83, -165, -75, 168, -11, -127, 35, -2, 25, 136, -92, -237, 99, 178, -111, -26, 54, -153, 13, 210, -146, -198, 222, 133, -183, -30, 26, -104, 106, 165, -144, -145, 118, 58, -69, -30, -28, 50, 129, -24, -153, -3, 63, 38, 72, -36, -128, 70, 148, -110, -100, 115, 63, 3, 76, -114, -154, 162, 157, -144, -51, 92, -42, 17, 92, -133, -85, 234, 66, -219, -29, 71, -38, 61, 87, -158, -80, 164, 1, -157, -12, 66, 41, 55, -90, -150, 58, 109, -28, 6, -55, -120, 106, 98, -213, -52, 244]
1626B44k18j45J69j27m4L36p3l58J76K07k09j4J05r7O5J63k21j46K08P3n4L3j44
1649g1o0K39k8k21J11J25r7O2Jk70J14L13j76j78J42k7n7J84r3k02K47J65k89
1672f6j00J68k2L2J41j53j74J88R2j46m4Q6O0J0p3j01J3J11O8K8j56j04J69R4
1696A21k01k6J93k4o8N8j24j04K67J24k50q2J45qn4O5k7n9J30M9k07j05J60J38
1720A11k5r5o8K3N1L8m7m4P3R1p5j68pJ85O0l3n6j11PJ26L1j31K3J32J1j35n3
1747h6J4P4J26mj78p3J46O1r4k1J00kl1k8r7k4J91J24j70j32O8M1LL1k8k1P4N
1775F9j28r3J21J68jj46r9M5L8L8L1n0l5J26k2k32PK39L3o6j9j12p6J83J18j74
1801c7j6J50m2j38oJ2Q8J37l3j72o5O7R2L2o9mR1k3j49NN8N0J42l2k73n3K43K4
$$ y = [244, 26, -119, 50, -77, -121, 215, 142, -216, -40, 167, -42, -56, 49, -48, 17, 180, -41, -187, 21, 94, 40, 73, -71, -131, 108, 80, -141, -30, 95, -2, 60, 61, -209, -95, 218, 42, -136, 6, -21, -78, 106, 13, -189, 58, 223, -66, -166, 2, -20, 12, 153, 0, -174, 14, 106, -40, -84, 2, 62, 72, -1, -102, -89, 22, 90, 118, -38, -142, 27, 121, -80, -106, 87, 63, -5, 53, -71, -175, 92, 216, -34, -116, 29, 21, -33, 32, 5, -54, 76, 125, -82, -187, -27, 111, 86, -9, -77, -54, -3, 35, -12, -56, 17, 108, 33, -135, -142, 43, 103, 70, 14, -97, -90, 36, 67, -64, -41, 91, 102, -33, -86, -72, 2, 128, 124, -54, -127, 19, 80, -14, -35, 65, 63, 32, 4, -93, -117, 74, 198, 28, -104, -36, 5, 8, 39, 11, -10, 64, 69, -59, -152, -31, 137, 136, -10, -109, -64, -26, 12, 43, -7, -42, 84, 62, -170, -163, 76, 109, 43, 24, -88, -164, 19, 137, -37, -53, 97, 55, -83, -89, -77, 11, 148, 115, -57, -122, -55, 37, 69, 0, -4, 87, 64, -85, -80, -22, 28, 170, 138, -135, -188, 55, 79]
1829G9j01Q1J3j03O1j2k09J30K66q4j76Ll7J7J77j1j51N0Q5j09q2L3O6J52J4k13
1855f1j01Q8N0Q2N1j59jJ75j39k02K20J29j08P4k1l15Q5L63j21j93K07k0j90J07
1879@Jj33J99J86k43j34L7J0J31J10j99qJ51j45j06J68n1OK65j54l85K03K05j57
1903d3R7J07k87L8K45k74j24L92K2k38J12j00k29L20K14l21K2J77k06m1J75j34
1925g6K3L18j67k75R8OJ5K71j15k82K34Q2l50J30K69k21P6K48m27k19N00M3k90
1948a09K06L9l44J77J68l15Q3L67j91j84Q5j40K6L78j21k57J87j8k33J97P0k02
1970a31K36J64m29r7L08o6JK59k32k58L11Ok97K15K31k20M0L4l45R8M09j28j54
1993d5J27j13j03K04o4j35K97K3k94M4J8j61L46K06m53m7L21k65j27M26j18k43
$$ y = [79, -22, 59, 72, -31, 30, 18, -191, -61, 205, 121, -55, -52, -89, -72, 105, 94, -57, -7, 78, -31, -113, -80, -14, 138, 152, -61, -162, -74, -24, 58, 109, -50, -51, 124, -15, -217, 3, 132, 24, 98, 77, -238, -153, 210, 89, -104, 103, 83, -107, 0, 1, -132, 67, 253, 10, -124, -87, -77, 54, 164, -35, -43, 108, -37, -143, 25, -26, -20, 245, 91, -294, -91, 114, -43, 54, 161, -126, -88, 157, -117, -241, 151, 173, -65, 47, -53, -282, 38, 252, -69, -47, 130, -76, -117, 58, -76, -53, 265, 98, -177, -79, -73, -58, 213, 98, -184, 50, 132, -218, -88, 181, -40, 36, 284, -143, -362, 138, 181, -109, 97, 136, -208, -31, 137, -178, -95, 272, 81, -103, -18, -158, -132, 246, 125, -132, 55, 37, -196, 1, 71, -131, 105, 269, -160, -257, 51, -15, -14, 245, 13, -245, 66, 72, -225, -10, 221, 1, 41, 75, -270, -172, 237, 109, -45, 82, -31, -134, 70, 6, -129, 168, 191, -103, -59, -41, -202, 144, 350, -103, -150, 171, -94, -221, 205, 87, -156]
2015a56M25r8n96K75M28l02K3K66m06j35M47j37k67L89P4l27O0lk09K89K45k74
2037A1p4N9j29R9J30j83J01K38k92j57K02j20N9M01k17m11L06Q9l36K47K34l53
2059i6J13K43m79r3M92m4j63K21k23k71L75O9l15K61J59l31L3P6k86J98M13k87
2081F5k14K00j38r2L09o0j92K56Pl38N5J46l8K00J5l40PJ84j15Q2J39j71L8J58
2105A63l17r7L63k9j05K37k38l24M00J50l82J99K83l90l5K64l05m2N44j22m14
2126a97J84O9k51K41J60k81O7J79k55q8J74J3Q8J03k76j28J92k5KJ59j31r8K26
2149A27j37k92L10J73j96Q3L2l70R7M03k26j33K99j22k48K26k8k03L37J70m01
2170i9m7J69j51J05K38k32r6K94j71k48K63O7j50K39l7m28J66K94k05OK37k57
$$ y = [-156, 269, 171, -425, -150, 278, -24, -1, 265, -141, -276, 171, 34, -233, 156, 230, -97, -37, -40, -249, 40, 285, 11, -63, -4, -133, -34, 96, -87, 14, 252, -40, -197, 5, -115, -56, 345, 128, -283, 23, 112, -224, 23, 257, -96, 17, 260, -219, -312, 180, 136, -27, 194, -29, -300, 75, 144, -171, 90, 249, -82, -49, 27, -259, -61, 352, 65, -149, 51, -87, -179, 130, 70, -122, 134, 141, -197, -142, 4, -34, 166, 181, -159, -152, 32, -83, -1, 138, -33, 5, 163, -154, -251, 112, 83, -22, 215, -23, -347, 53, 203, -179, 20, 303, -87, -122, 142, -163, -205, 339, 217, -197, -13, 56, -195, 46, 206, -75, -8, 171, -84, -172, 2, 15, 103, 206, -70, -198, -6, -31, -29, 130, -1, -99, 127, -10, -302, 8, 181, -15, 68, 100, -270, -173, 230, 4, -129, 170, 48, -200, 26, -2, -205, 132, 302, -99, -146, 23, -128, -23, 215, -17, -113, 181, 10, -238, 25, 92, -58, 181, 144, -284, -118, 176, -29, -23, 214, -43]
2192d3r0K88k07k22M16J06l29M9N8k32J78K73k83o4K27j33j36J50m2k2K70j14
2214I8k95J44O4j10K33K0l39J76J92l67RL74j85n4K62k76l10M81J15l77J83J41
2236A79l53R6K55l31K4M30j91k65J84p1r5L19j9l16J69J11k70Q8J40j64J61J69
2258B50l78j04L26q2q5K72j62k63L05M4l69K02K80k60JJ27k77k7L93q0k47J60
2280B6Oj38J11Jj16J79J00k32k2N4n6J50J27k64k9K10j39q9K01n4p6K26q6l39
2304b49J52K68j59kJ28k06n0K15o5j73J88J22j87l1Pl8R4J37j27q4M1NMLn8O7
2330BJ50j22j55P1K7NJ40m5k15P1J67j36p3J61J4q8P2o5j44J15K00q7j33N0J3
2355ek2L0jk4O6L7o9j03kJ26Q5r1p0K7NpN1k1o9R2Q8j57j10J36R0n7J2j9j06O0
$$ y = [-43, -133, 155, -52, -274, 142, 248, -81, -32, 26, -206, -28, 245, -38, -102, 125, -8, -144, 6, -36, -58, 212, 98, -197, -53, 11, -99, 134, 154, -185, -9, 183, -184, -175, 199, 14, -40, 222, -54, -364, 117, 232, -145, 38, 179, -174, -78, 177, -154, -130, 300, 109, -156, 28, -43, -138, 181, 162, -154, 15, 126, -144, -56, 84, -80, 81, 250, -128, -232, 94, 12, -73, 199, 37, -226, 79, 123, -246, -44, 236, -24, -23, 104, -173, -200, 193, 113, -134, 26, 32, -106, 5, 6, -110, 69, 169, -63, -85, -31, -87, 63, 190, -74, -103, 107, -32, -121, 80, 26, -50, 176, 90, -249, -97, 171, 12, 10, 138, -68, -118, 97, 32, -141, 47, 169, -18, -49, -42, -80, 14, 151, 24, -60, -19, -14, -10, -7, -65, 2, 152, 30, -125, -54, -27, -22, 118, 73, -142, -71, 96, -40, -113, 48, 62, -26, 46, -19, -163, -48, 152, 65, -68, -18, -5, -27, 3, 2, -22, 44, 81, 12, -91, -93, 33, 118, 27, -43, -16, -11, -18, 33, 12, -57, 35, 123, -34, -144, -8, 82, 25, 37, 18, -88, -28]
2385b8J10r6q2J24O4j08m7J1QM0R5o1j30L8J14k8r7N0N7k3ml5n4K6J45Rj53l1
2413h6R6L2o8J3L1qJ1L4j07n7J24J06r4j02N1L5j2K8Po8K1J21r6j32P8J31m0n8
2441iLm5J5J03j9j19K7J07l0p8l0N4N1L4o2m7l7P9P4q7q7J13O6r6l3L7k1M1J06
2470A10j22j29J40R5j10j7N7n3K5P2q3q9J20R2p8o9%M1O4l5o0OL4J0K1p4m9J20
2498C9Q3j66l4J05m5J1P8q9r5J43Q3j81j8J24k3j5M2j03k9J28J8q2k5J9M3L6o4
2525a7p7R5N2n7J9m3o5J26O9j73k6J56l2n4O1n3p0J69L0k08L1J35m2l0L9o7%J14
2553H2k9j13L3M0J9K6q6m8J08L4q0pLj5Q0K4j75K1J84n2j09N8j5m3J29qj70M9
2581f0J45r1n7P2m6qJ24o3j48J10Q5o3Pk6m4J05M5j51LJ25n9pO9j22m5K27l5k03
$$ y = [-28, 82, -14, -96, 28, 92, -16, -63, -52, -44, -4, 91, 30, -100, -62, 52, 24, -73, -23, 34, 11, 7, -28, -82, -56, 89, 98, -55, -86, 10, 42, -26, -13, 18, 10, 21, 55, -52, -109, 15, 121, 27, -75, -24, 11, -1, 27, 34, -34, -13, 108, 12, -120, -42, 89, 49, -9, -6, -51, -36, 67, 48, -71, -44, 63, 33, -45, -75, -21, 30, 64, 2, -45, -82, -3, 71, -16, -103, 10, 76, -20, -53, -16, -37, 4, 110, -12, -141, -1, 94, -16, -33, 24, -29, -4, 68, -15, -104, 16, 108, 30, -39, -39, 2, 66, 31, -29, -23, 11, 21, 42, -32, -81, 39, 122, -44, -78, 27, -18, -7, 71, -18, -113, 30, 113, -68, -86, 38, 15, 0, 42, -61, -90, 38, 56, -26, -51, -32, 11, 47, -17, -94, 1, 53, -4, 15, -28, -93, 33, 102, -71, -97, 59, 27, -27, 34, -19, -89, 80, 110, -98, -67, 68, 26, -4, 35, -32, -32, 82, 53, -60, -27, 13, 32, 58, -28, -76, 32, 66, -14, -21, -18, -33, 47, 71, -104, -83, 101, 49, -60, -2, -17, -60, 69, 61, -109, -60, 85, -6, -63, 9, -37, -45, 79, 16, -132, -22, 63, 0, 7, -19, -63, 42, 87, -64, -61, 64, 5, -2, 67, -55, -100, 127, 92, -111]
2609a11Q6R8j12M5P2j57J5K04j02j36Q0N3l0M1n4r2J16M6p9JLm0J04K5j91M8J71
2636A04r0p8J09r9l7K04o6k15J48J22j53L2N7j34O6J76j84r0J69Kq4R7n2j13J57
2661D8O1j80J1J02o4O9Qj43M8J54j08n4Q7o6PJ51j39j49K09O0j75N4N2j08O1J02
2687I8j55m6J62qq0K8o0K4J19n6j24Q0K9n3P6k8j15J26Q6j46m9J01Nk5O5r0n3
2714h9J24Ro6PpK3P4o1j10Q3R0o7J5j1p5O5R4j33k1J05mn7J0n6J1J22J1j41J0
2743d5N4k1K7rn9N0Q6o7q2jO1N9j8r1mN5j1J6Qo2RJ27p8j38J04R5p5K0L1j33L1
2774f1J57r2j00J15N7r3L0k4q1J27R5j49m8Q5k6KP4q8m1J50jj69M1Q0j8K8J4j25
2802f1NJ01j4o8K7QK6L4j01o2J20O0p1On3m4J23L2j37K7J12p7k4N1j16K7K05q8
$$ y = [-111, -25, 73, -39, 6, 78, -79, -64, 140, 38, -98, -18, 35, 5, 46, -8, -100, 16, 62, -17, -16, -13, -53, 51, 76, -115, -67, 104, 14, -64, 45, -54, -91, 113, 47, -168, -20, 102, -51, -19, 38, -96, -30, 146, -38, -128, 41, 43, -41, 56, 4, -109, 48, 109, -71, -60, 42, -22, 47, 55, -88, -40, 114, 6, -48, 39, -27, -20, 131, -8, -157, 52, 112, -63, -9, 43, -65, -4, 98, -57, -103, 59, 51, -29, -1, -61, -37, 82, 26, -98, -18, 11, -42, 34, 6, -109, 17, 103, -43, -92, 9, 14, -11, 54, -36, -89, 35, 44, -22, -15, -22, 1, 75, 14, -96, -13, 77, 10, 25, 14, -61, 4, 98, -35, -56, 49, 45, -12, -2, -58, -47, 75, 86, -55, -45, 9, -12, 15, 6, -53, -3, 83, 16, -66, -67, -6, 53, 35, -56, -60, -5, -16, 0, 8, -54, -45, 82, 4, -134, -30, 65, -10, 10, 41, -92, -61, 96, 4, -96, 19, 76, -17, 13, -11, -92, 35, 130, -19, -67, 18, -8, -6, 68, -20, -61, 89, 88, -81, -40, 40, 22, 50, 64, -61, -56, 45, 31, -37, -10, -2, 24, 58, -43, -105, 15, 75, 4, 10, -43, -87, 36, 68, -69, -42, 70, -7, -31, 20, -96, -69, 136, 48]
2830D8j76J30M6j30R0P7j96J05J61k02j12K31l1r5J57p4j86J76J12k05L7J34j02
2853eK6M5j58jK38q0j35R7m5n3J65k3j90J40R9j73j3R7r3O1J50j69j01J54j0p0
2879d7R7m8j00J77j5j99R7J07q4L9M5k01O8K00j48q3J70o3r6J68q1j67K32R6k37
2904g3K0J24j50N5J70j60q9K23n7j64R8M4p3J20J3k03N2J39r9qP4q8J5J27j33
2929b3j09J66L6r1M9l6j05J33O8j50RJ11n6j2J0p5L7J27l8j02K0pK1P2n0r1R4
2956HM7j13MN7m8Q9O5j86k9J58jr6Q1j2p8J06%j37M2J47m8p2K8m1pJ01j9r2L6
2985a0N6l7j6k8NO3N2j03n0M4J6K9Ln6j7R5k8q7J8M4L8Pm7p2M3P0%l0k1j0N5p
3017A9o9pQ7Pj8l3n6L4R3j5q7L4L3k3J3j9m8Q6P2q7p4L9M1nL4l7o2N9M0p4k1M9
$$ y = [48, -128, 2, 48, -82, 8, 85, -111, -6, 155, -47, -159, 72, 41, -54, 103, 29, -157, 19, 131, -74, -37, 97, -5, 21, 66, -92, -93, 145, 65, -70, 27, -18, -71, 94, 71, -119, 21, 120, -53, -66, 31, -62, -1, 149, -20, -121, 33, 23, -47, 50, 2, -98, 79, 64, -135, -38, 69, -15, 24, 69, -132, -64, 136, -12, -95, 75, 12, -84, 84, 3, -164, 68, 164, -73, -53, 71, -79, -24, 146, -14, -103, 120, 63, -101, -3, 41, -32, 88, 101, -102, -50, 89, -10, -18, 56, -32, -17, 110, -23, -132, 34, 70, -21, 28, -8, -113, 20, 88, -62, -53, 58, 2, -10, 0, -75, -38, 89, 51, -51, -31, -38, -17, 55, 5, -86, 8, 55, -58, -54, 3, -45, 44, 109, -77, -106, 52, 51, -45, 36, 24, -54, 52, 52, -85, -43, 104, 56, -16, 12, -29, -36, 65, 46, -46, -10, 46, 9, -7, -35, -30, 33, 85, -18, -68, -24, -8, 21, 24, -32, -49, 46, 18, -69, -51, -7, 31, 38, -9, -81, -38, 32, 32, 2, -19, -29, 26, 19, -50, -57, 30, 37, 19, -14, -70, -36, 57, 42, -45, -11, 22, -1, 12, -7, -55, 31, 103, 16, -58, -19, 22, 17, 51, 14, -48, 11, 51, -23, -44, 5]
3049EK0K3k8r5L0O7lrj5k8L0L8o1m2Q3L6m2j3l4l0R3L4q4j7M8LoJp0N2Q7n0o1
3082c8J3J8LP6n3r5P9P9q2l2M2j1L3N1j06n5J05M1o6j0K2k5M2Lq2K1P6ql1j6n9
3113f5N4R3p7o1P1Ml9M4m3n6J15N9j44k4Q0rj4M4n7l7J03lr8K6M1JL8l3j01N6
3143c2Q0j9n0K9k7L4O5j11m5J23J4q4M0l2n2J13M6j40lJ11l8n4O8o4j7J33l4j34
3171h0M9P2l4J4j0o8M9P5q8m9N6J5J4M2j17k3J31k1r4O1Mo2J11Oj69O5J51p7r1
3200f8P9l3rJ06m8j24J12N9q8MJ5m3O9P1j38k1J08l3l1P1o8n5J63j9j58O4Q1p0
3228dK7K8j25M6J21q8q3R7rk6O7n3j00J16P1j15jM4m8N6J8j11J4J13m1n7M3n3
3256e3J0J45q7j37J25P5j04J5O8j25L5J52j30r4J40L8p5L5k5n9J00J8r5JO7l5
$$ y = [5, 25, 48, 20, -75, -45, 22, 19, 10, -5, -33, -3, 35, -26, -68, 15, 51, 9, -4, -38, -68, 25, 59, -25, -42, 6, 9, 3, 4, -66, -14, 73, 23, -38, -25, -7, -4, 72, 19, -76, 3, 82, 0, -32, 10, -1, 32, 83, -23, -78, 27, 68, 2, -8, 14, -11, 31, 34, -48, -27, 49, 41, 10, -6, -65, -11, 82, 5, -56, 15, 19, -20, 24, -19, -75, 40, 99, -45, -69, 11, 2, -12, 32, -25, -62, 41, 38, -60, -34, 7, 8, 46, 13, -88, -32, 48, 29, -21, 8, -19, 15, 80, -31, -76, 47, 61, -23, 17, -15, -67, 46, 92, -48, -51, 60, 22, -32, 36, -28, -45, 88, 54, -80, -31, 41, 7, 21, 11, -57, -8, 67, -21, -70, -14, 1, 15, 57, -60, -83, 48, 27, -67, -6, -2, -64, 47, 53, -116, -51, 100, 23, -68, 11, -22, -31, 75, 27, -97, 15, 74, -14, -10, 5, -38, 31, 102, -36, -57, 51, 18, -13, 58, -10, -65, 98, 79, -79, -15, 66, -4, 23, 51, -74, -28, 93, 5, -78, 19, 10, -16, 51, -2, -102, 14, 85, -30, -31, 13, -35, 21, 39, -72, -58, 55, 14, -43, 0, -53, -43, 102, 15, -122, 3, 78, -26, -11, 57, -68, -33, 119, -11, -105, 35, 73, -2, 33, 8, -51, 49, 67, -28, -27, 40, 5]
3282EK9Kj08M0J54j00q4Q9om4P0jj28P7J02j19m5O2okP3r5m8R7J4p1L3pj5Q8j9
3313C7j15L2Q3k2k7J5n7N2N5n6p4Q6K6m9N5n4p3J15Q3j42m2J23j6o2N2j1p0Q2
3341B6O1r8m2O0N6m1l5nK2J3j8J1l3pO5L4j18m2J25J2o5K3Ln2N3L5r0j6R6Qo7
3372b6j8LJ2O2op8LN8Rl2j0JJ9M1k8n4jO3M2n6m9M2N3m8NOl6K0Q1n6r4O9O3k5
3406C5m0knM1Pm2j5K2QL5l6q7N8J04p3p9P0lm1O6%j05M0J06n1p9K6L9J5J3p7%
3438e0O2%Llq1M2J08p2j01J05M2o8L9Jr0M9J18j15o0J06j1l4N7m9r0J35O9j64
3466e2NJ18p8jQ7r8n1J41k3j02M3J2j0O4n7q9R4M5q7M2K0j11Q4J01j52o6J92l4
3494C7j19J01qj06J15P3j70J4J22n2l2L5m6J2R2o3o7P8qk1J00p9j04J50N2j58
$$ y = [5, 34, 36, -72, -32, 122, 22, -62, 27, 21, -23, 47, 46, -82, -5, 97, -22, -67, -5, -11, -13, 60, -35, -83, 14, 28, -43, -10, -17, -32, 56, 37, -78, -46, 37, 15, -12, 3, -54, -2, 53, -3, -77, 9, 35, -14, 41, -13, -86, 29, 112, -30, -72, 51, 35, -27, 25, 14, -56, 26, 87, -11, -53, 7, 63, 22, -13, -18, 4, 17, -1, 10, -23, -30, 35, 69, -49, -91, 34, 46, -19, 4, 7, -45, 8, 43, -47, -63, 33, 41, -26, -44, -41, -29, 33, 27, -51, -48, 10, 19, -13, -23, -22, -3, 38, 10, -44, -45, 18, 60, 4, -45, -3, 50, 2, 7, 13, -23, -3, 78, 22, -72, -3, 60, 35, -5, -7, -12, 29, 36, -6, -21, 1, 9, 44, 8, -79, -21, 83, 10, -69, 1, -2, -43, 23, 23, -82, -42, 64, 13, -66, -40, -1, 14, 27, -50, -50, 12, 12, 15, 12, -69, -27, 81, 9, -92, 13, 55, -13, 26, 27, -63, -14, 104, -11, -71, 35, 24, -10, 47, -2, -92, 43, 112, -52, -47, 71, -7, -8, 79, -19, -70, 71, 48, -54, -11, 1, -9, 55, -2, -91, 3, 48, -39, 3, 23, -88, -4, 97, -55, -121, 71, 37, -82, 19, 11, -95, 20, 93, -77, -63, 59, 7, -25, 10, -36, -24, 68, 5, -62, 16, 8, -13, 87, 8, -96, 54, 106, -52]
3520e2K3Q8r0J9J11j19q1J86%j71Q5N1r0O0N4j40JJ55m9q7O3j6k4P4k6j05P1P5
3548F6p9j6K1k3M3M8j08j1P6k0j4M9p8j9J44j9j53P0Q0q0K7N5j11J5J30o1j11
3575g9Q8M3n6L3po8O2O8j04pM5k8M1O0j47j7J62m1j09P4Mp6J10K4j73L5J60p6
3603B1q4O7pl8R5k5j09O8O8m7l1rj7O5L5q1j3M9j9L0op7L2J17o5q0P4rk6P3j2
3634C9j24R8Q7j15l6Q2m6%Q3o0q7J05O5q0m2M3lK1%o1J2N7k5j1rm1O0O5r1m6P0
3665A0Nl0M0j7p0O2O9q8n3O5M0k6k2j4RK1K6l0k3j8O4Kn2j4P1kj4Om3k5J01Pj06
3698d9J3P7l4j4L0m7mR4j1j06J6P7k3k0J7l1JM3mn7pO2J3l9m6M1K6j9K0j7m0K5
3730a3N8m6q3Q9L6l3j9nl9N7O3q0l4M2K9j9oj8KO5Mq0mM4nK6j5m6J1O1k0m4J8
$$ y = [-52, -29, 59, -31, -12, 99, -20, -101, 85, 85, -86, -1, 50, -40, 20, 74, -66, -65, 90, 41, -46, 17, 1, -23, 51, 25, -80, -9, 66, -13, -29, -8, -31, 12, 60, -48, -59, 17, -3, -17, 32, -46, -65, 79, 60, -93, -23, 57, -23, 4, 59, -52, -37, 93, 32, -79, 9, 52, -4, 29, 22, -46, 16, 84, -20, -27, 18, -10, 31, 91, -56, -73, 89, 48, -61, 13, 17, -59, 51, 75, -98, -63, 97, 21, -63, 4, -3, -41, 54, 29, -80, -12, 56, 9, -22, -31, -48, 17, 52, -29, -42, 7, -12, 18, 12, -65, -33, 84, 19, -61, 13, 4, -22, 51, 39, -85, 13, 100, -15, -51, 31, -15, -15, 68, 8, -79, 26, 91, 11, -31, 12, 9, 30, 30, -31, -19, 38, 13, 2, -7, -48, 12, 77, -14, -60, 10, 15, -15, 25, 8, -62, 0, 69, -19, -72, -7, 33, 7, -15, -29, -20, 1, 27, -3, -26, -44, 20, 22, -30, -44, 27, 25, 11, 17, -26, -51, 50, 57, -49, -36, 41, 7, -7, 23, -24, -28, 66, 55, -51, -35, 42, 19, -1, 16, -15, -14, 29, 25, -32, -39, 23, 36, -3, -49, -8, 18, -1, 19, 2, -38, -13, 45, -1, -84, 5, 41, 8, -11, -16, -55, 2, 65, -15, -49, -7, 22, 3, -3, -21, -19, 46, 50, -30, -34, 10, 5, 31, 16, -30, -19, 42, 22, -22, -4]
3763dMM4J0p2j3N4K2k7j8kj9L9K9o9l0J00K1p2l9K6J1L3Mn3k5L2L4k4l1MM0L1
3795D0n6k9K0K3K9kn2k4P1K5p3oM8lQjo9MR5np5K0J7j2M0lp2L9P2n1m8M4j5K5
3829B4M5n7o1O0M7n5j6J6k6O0Mq4jP5j0k1J5m8MP8k1q2L6M2k9Oj1m5N0O5o0m0
3861d0RJ0K2J6n8J5Q4l7n4L2JpO4pj16L3J11p1l2N6l5j8J02n8j17R4P2o6j9K5
3891A1l4L1M1n3l1M3K2j8j8j6mQ5k4q2L6J4rL1k2o1O2N8q5k6M6kmN5o9o5J03N0
3923F5r0j5M9j6kL6o0k5Q8J6n8k3J8L3K8l7m2M8J9k9J2j6l3O4N2r4l6Q1km3L7
3954B5mn4M7O9j01m7J01K4n1j4Kk5L9K6k6m9K0N3k7l9rO1mk3j4Pj4L2M8p7m6J01
3986C1J8q3QK9k2K4N2q1m5J04K5p9MM1l2LN6p1k3J01%p1j4L1J9J0Pl8nK0K0k1
$$ y = [-4, 0, 44, 54, -18, -31, 23, 45, 18, 0, -2, -21, 18, 47, -22, -52, 48, 69, -3, -42, -16, -5, 28, 32, -21, -46, -14, 20, -4, -35, -31, 9, 40, -16, -45, -25, -2, 27, 25, -27, -51, 20, 45, -28, -34, 14, 11, 19, 18, -51, -47, 48, 43, -32, -12, 5, -7, 33, 30, -42, -3, 69, 18, -30, 14, -1, 24, 69, 12, -49, 11, 58, 3, -13, 3, -23, 37, 41, -43, -44, 31, 21, 0, 15, -33, -29, 49, 28, -54, -18, 24, -5, 1, -10, -55, -5, 60, 0, -40, -31, -21, 1, 17, -41, -26, 58, 21, -33, -1, 0, -7, 57, 50, -66, -33, 78, 7, -25, 31, -4, -22, 80, 22, -95, -1, 71, 5, -14, 11, -23, 8, 49, -4, -35, 8, 30, 12, -6, -22, -26, 59, 35, -47, -11, 3, -6, 25, 3, -58, 4, 62, -23, -49, -3, -5, -9, 46, -23, -88, 15, 65, -25, -40, 9, -7, -9, 27, -33, -58, 30, 46, -12, -35, -17, 16, 44, 7, -35, 13, 32, 3, 15, -1, -34, 30, 82, -12, -48, 33, 31, -12, 25, 21, -33, 14, 83, -18, -65, 36, 60, 9, -5, -3, -28, 11, 37, 11, -38, -18, 35, 8, -31, -40, 21, 17, -6, -20, -13, -27, 5, 53, -24, -70, 31, 49, -34, -26, 3, -19, 5, 57, -24, -69, 35, 60, -19, -15, 26, -6, -3, 53, -18, -41, 60, 60, -11, -25, 6, 25, 35, 42, 4, -1, 19, 39, 18]
4018A8n8K1P3j1p8OM8j1%L2n8m6R3L0j20J5Q6kn8K0k7j8N3L7n2m4O7J6l8l7L1
4049a2L6Kj7l4%%N4J7n7m3Q4K6q0K1M2l3LN5q6l9J08M2r2j5O0m2QM6p7k6J12m
4081E9j08J4N1j4QK0l8m4O4L0o3k0L7M8k8o8K3M1j1qM2o0n3J20K0j56N0J26r0
4110hm3Q5m3o7J38J3j32J7Q9n0k2L8k4QN6l3n3K1L0K2J6p7k6R2j9o6O3J3p0P4
4140D2L3j51K8J59p7r3R4l2o7J14Qj31M1J11q2o8P5kk8P7k6p9L8L3Kk0l8J5P5
4169E1m4q3P1K6n2O3J2j15J5J44p0r0J09J7q8N3L4j13L0J28o8r4O7J4k4N2k5m2
4197b2N1K2m8m4M1oN6Lj07K3P3m8j0L9m1MP0m3j06R1O1p3j3N9p7MJ10o0p9Q1N9
4228G0p9m2L2J6J9K2l6l0j0M6K8l0m2N7M4q7j6O8l5KR5o4j29J10Q3j14j2R2m8
$$ y = [18, -40, -19, 54, 43, -35, -29, 19, 8, 8, 40, -18, -64, 29, 59, -61, -46, 40, 38, -20, 0, -27, -45, 8, 45, -7, -51, 16, 32, -6, -43, -12, 24, 26, 9, -25, -25, -25, 29, 46, -11, -54, 30, 56, -24, -3, 39, 6, 9, 64, -22, -61, 47, 89, -3, -18, 42, 0, 8, 54, -23, -49, 63, 59, -49, -35, 16, 2, 10, 30, -8, -52, 12, 42, -21, -41, -4, 44, 16, -52, -29, 12, 1, -7, 35, -25, -78, 42, 62, -94, -44, 82, -8, -51, 34, -9, -76, 62, 75, -57, -40, 49, -1, -23, 15, -9, -1, 55, 22, -31, -10, 20, 42, 58, -19, -45, 47, 28, -38, 25, 38, -32, 42, 75, -76, -48, 111, 34, -59, 35, 3, -64, 50, 58, -73, -32, 79, -3, -71, 4, 2, -26, 51, 25, -54, -16, 17, 19, -1, -39, -24, 51, 7, -76, -5, 21, -31, 32, 44, -71, -56, 88, 18, -72, 37, 54, -34, 19, 53, -60, -30, 98, 30, -64, 3, 17, -7, 45, 20, -22, 29, 51, 3, -41, 0, -6, 50, 53, -54, -31, 42, -6, -16, 23, -18, -14, 56, 13, -93, -2, 59, -14, -27, 32, -45, -41, 69, 9, -70, 11, 70, -9, -51, -19, -3, 16, 38, 2, -28, -38, 8, 36, 6, -36, 21, 65, -22, -38, 30, -5, -3, 92, 28, -101, 9, 92, -22, -34, 58, 10]
4257A0m4R1m7q8R7Q4j04m7O0%j9L8m4j4M4Mk9l1nP9J7o5l1M0nMK6k2n2N7M1r2
4289d7rO9J4k5K0l9m1O0N6p3j1M2KJ0k7l3N4J1Mk5k9k3P0K2p6LP4l3m1L9j1j5
4321hN4J8r1l3Q9Om5J2J7l3J4L6n7l6P5M6n0o3K0M2j3J0jk7pN8j5q7M6Q3m9l1
4353b0J3j6mP0j3o2K1L3j0l7kL4K9kk9j3JJ7L4l0l9K4N8m0m9L1J3nL7k7o6L4P3
4386E8m9l8M3%k2J0Km0K2O3k9o3LL9L4l7j7J1j0K2J0k0n2O5M9o6m7N9J0k3L9j7
4418In5M7O0p3l8O3J7j3j1j7j0L4L3m8rRL0kk3m0M4L7k6l8J7j7K0N4o0m7O7L8
4450E2p5qL5olM3m7n6M9M7l0l4K5PJ7j6k4MRL2J6o5k1O7K0p0K8L5n3J6L7m8m7
4483f4J12J6q8OM1l8K5N2n8n1Q4J9p5j4N8J3pk3k0K0mJ7On6RO1j3p9L0N6k4k6
$$ y = [10, -34, 57, 10, -78, 19, 103, -1, -48, 12, 12, -7, 31, -13, -27, 17, 21, -8, -39, -44, 35, 52, -13, -44, -4, -9, -5, 21, -1, -53, 4, 45, -47, -56, 13, 27, 2, 22, -17, -58, 2, 58, -15, -26, 16, 18, 28, 1, -32, 22, 33, 37, 12, -17, -40, 30, 52, -24, -21, 53, 20, -21, 18, 7, -8, 46, 64, -27, -60, 29, 35, -10, 2, 19, -14, 0, 36, -21, -57, 18, 64, 14, -49, -29, 13, 0, 10, 9, -18, -25, 33, 18, -69, -23, 60, 11, -20, -7, -23, -27, 43, 30, -32, -11, 22, 12, -25, -27, 7, 36, 34, 5, -8, -7, 10, 44, 14, -25, -1, 57, 17, -32, -1, 12, 7, 44, 17, -49, -15, 58, 9, -29, 14, 14, -8, 2, 4, -36, -14, 49, 20, -43, -40, -1, 33, -4, -21, -10, -20, 2, 12, -8, -60, 5, 54, -12, -59, 0, 10, -13, 26, 9, -46, 1, 61, -12, -50, 13, 30, 17, 6, -11, -21, 13, 46, -2, -11, -2, 28, 26, 3, -37, 7, 44, 18, -20, -3, -20, 0, 54, -6, -53, 14, 52, -23, -31, 4, -2, -5, 38, -9, -65, -16, 31, 1, -33, -8, -1, 16, 0, -24, -20, -11, 21, 37, -28, -49, 18, 38, -32, -4, 31, -22, -6, 31, -17, -64, 48, 64, -24, -18, 23, -15, 10, 62, 4, -47, 37, 56, -19, -33, 25, 38, 31, 8, -12, 8, 4, 21, 27, -29, -20, 41, 28, -51, -21, 35, 11, -15]
4515a5L7o4k2Q8J2j02J9P0k9k8J6kpN6Ko9LL4J1j3j0j2L3Qk0Oj7J4O4l0q4J5Q4
4548D8j3o3N8k5l0P8Pj08L3J10n7o5M0Km0N9J5q7J2Q0l4l7k2L8J3Lk7%oOM6k8
4580Fn3L2M5l7n4M3K5k9L2Rq1K4Q7m5m3K7J9k5L9j7n4N1M2l2m5J6K4J4J0m9RL2
4612B2%k6J5k0K4L9k7p3M7M4l5oJ7l8J1O3m8p2P5M5o7PJ2k4qO8l6o1M2M5k9k3
4644a7j5K8J5nl1LkK4L7m0m9N3M7o8j4N4j9j3N8l2p4N9O1n4l1L3Kk2K6j8k6O0
4676C0J4l4j8oJ6J9mk3mL2nj9rNK4L4n9l6L1K7rjml8L2M9p6j7N9K0l9j1Qk2K5
4711iM0l7m5O2Nl0j1J0RL2j3k0k8J9M6J8n4k8M5K6l7k9N4k0J7L1n5n2P2M9o9j3
4743a5L9j4k0L4k7l2P6K4p8k3L6qK0J8m2l3O4nn0J5K0LJ7j7n3K9L2qpj0j9K3L1
$$ y = [-15, 22, -42, -64, 24, 36, -66, -47, 23, -6, -34, -18, -20, -27, 29, 31, -38, -35, -1, 10, -3, -13, -25, 8, 16, -4, 2, -15, -1, 63, 33, -51, -36, 48, 35, -28, 30, 5, -25, 53, 60, -48, -15, 95, 38, -27, 13, 15, -25, 34, 49, -38, -26, 54, 20, -17, -39, -1, 12, 15, -12, -12, -18, -12, 34, 6, -47, -15, 30, -7, -61, -18, 7, -22, 10, 19, -62, -38, 49, 4, -39, -12, 7, -18, 21, 4, -50, 1, 43, 11, -34, -18, 6, 20, 30, -19, -10, 22, 22, -4, 11, -9, 15, 54, 27, -46, 1, 45, 10, 4, 21, -17, -6, 57, 9, -63, 12, 57, -10, -3, 9, -15, -23, 45, 9, -52, -10, 35, 6, -17, -32, -4, 11, 6, -25, -22, -24, 0, 37, -3, -52, 1, 48, -20, -34, 20, 1, -12, 46, 14, -60, -1, 60, 6, -25, 8, 10, -12, 14, -4, -30, 30, 44, 10, -8, -14, 2, 21, 17, -6, -10, 22, 17, -2, -11, -6, 18, 52, -7, -43, -12, 15, 6, 5, 1, -37, -5, 44, -32, -49, 10, 30, -9, -20, -12, -34, -9, 31, -6, -51, 11, 16, -14, -25, -15, -6, 26, 13, -7, -35, -16, 30, 48, -6, -34, 11, 37, 0, -29, 25, 5, 22, 53, -2, -54, 18, 67, -2, -15, 24, 10, -10, 24, -3, -35, 41, 65, -13, -36, 0, -8, 12, 30, -12, -45, 19, 14, -36, -21, -1, 2, 19, 2, -51, -22, 10, 2, -5, -15, -34, -11, 20]
4776B0k9k8M6J3k1kl5QM9J8m4j2K5llJ4l4KO7m1k8J5K3j6N2k8o8N4M8o5k0M7j0
4809A4j9M9n2n9Q1N3r6pM7l8J0M7m1m2P4J3o4k3N1mL3k3m3jN5j3j4lj3M6J3o3
4841c2pN5j5PK0l4k9O3K2q0J4N4l6jK4m7jP5j1p6L3L5l9L3j2m0L6M2n0m1N6pK
4874A3K8n8l0N8L2o0rL6l1J8K9p1kP5j1m0JPrL3lm5L1L1j3k9%mL2L7n1k1K1lK3
4909A5Mm0J5M4j4n6J7L3mQJo4J9O3j9l7K5K0l3K2k2l3M4M3l0m4QJ1J0J8j8k8J9
4942cK4l1rJJL5qm7mL5K0k6nPNQj6j4lM9Mk5k9J3K0J6lk9J8OJ7l6k0L1M2j6k6
4979Bj1KJ5K4k1l0J7L5rl5rK5J9%k9k8J3N0j6k7LmLJ2j8j1J5L9k7l4JK8OJ4l4
5014b0LJ5J5j9l0K2RK3j6k4RK0J5j5k7J7J9jk2mLK5J4k9rMJ9K4j8j9pK1Ql0qJ5
$$ y = [20, -9, -37, 9, 22, 1, -1, -36, -28, 21, 39, -5, -17, 8, 5, 2, 16, -18, -16, 51, 10, -18, -3, 20, 4, 56, 28, -40, 14, 62, -3, -23, 24, 14, -5, 44, -8, -67, 14, 67, -29, -36, 11, -27, -17, 30, -11, -53, 21, 34, -30, -53, -2, -6, 27, 4, -39, -40, 15, 2, -12, -15, -28, 18, 31, -32, -39, 16, 1, 8, 28, -6, -35, 28, 50, -30, -16, 38, 2, 1, 25, -22, -23, 52, 41, -35, -2, 33, -6, 27, 15, -25, 11, 53, 3, -38, 18, 11, 13, 41, -17, -47, 11, 43, -17, -26, 10, -21, -3, 26, -45, -47, 28, 17, -23, -22, -15, -24, 9, 6, -39, -8, 23, 10, -19, -19, -23, 9, 46, -5, -26, -5, -8, 15, 19, -21, -6, 38, 24, -32, -15, 18, 14, 22, 23, -41, -22, 41, 22, -15, 10, 30, -3, 19, -3, -36, 8, 51, 21, -23, -15, -4, 6, 24, 6, -22, -3, 21, -10, -19, -18, -17, 18, 10, -37, -41, -6, 14, -12, -17, -10, -5, 3, -13, -27, -30, 19, 23, -2, -31, -18, 2, 18, 15, -14, 4, 10, 27, -9, -29, 2, 44, 28, 2, -9, -7, 8, 32, 11, -19, -2, 33, 24, -11, -20, 5, 24, 24, -5, -33, -20, 30, 14, -13, -10, -14, -11, 1, -17, -28, -13, 26, -1, -35, -34, -6, 0, 14, -20, -17, -2, 13, -6, -36, -14, -5, 18, 2, -22, -13, 7, 22, 7, -20, -3, 16, 15, -7, -11, -8, 17, 31, 2, -7, -3, 16, 40, 22, 3, -4, 17, 25, -5, -13, 2]
5050BK2%l0j5J0M0ql1j1K0J5j0j1pJ2J6Rl3j7J5L3k1j7kJ0RJrk6L2K2l1okJ9K
5086BK1k3m2M6K2m0oL8jj1J3k0k6L2L1l6j5M1lj3KqjJ7Qk5l3J6L7Ll8%OJ6Jj4
5122ck6jM7j1m1lL4J2onl9OO2k8l5J2L7j9Mlk6J1M5nn4K6RJ0j1j2j7L5K5k6k8
5157b4J8K3Mll4jK3K4k0nqOJ4ll4NM4ll0qnK3J1rl1J9K1pk8j8K4K8pl9LJ4jJ9
5195Epl4QM3j7m3J1K6MJ0ql2J5N3k1m6L0J9m%k1k1J8N1k3m0J7K0J0lk4j6K8J8
5229B6j0l1NJ5M1m0l8J2L3ok0Ok2L2L3m1m7L4M0k3j4J4l8J8K9j2m7K4M3k7rmJ2
5262a2J0J4k9j5J1J4L3l6k4L5L8m3pJ6j9J3M1k7m8N2L6n1j3K5pK0ol5jM3Pl2r
5295fNmJ5J1m0%L9mj6j0j4K1L0l1j7J5NLkk8oL3J6l8oL3r%kj1KK3mk9%K0J8kj2
$$ y = [2, 24, 24, -6, -21, -11, 29, 21, -10, -21, -1, 14, 4, -7, -14, -2, 14, 23, -10, -27, -12, 21, 0, -17, -19, -9, 0, 1, -8, -34, -2, 20, -11, -17, -19, 0, 2, 23, 0, -42, 4, 26, -14, -20, 18, 17, 6, 19, -1, -27, 5, 36, 0, -15, 26, 23, 10, 12, 4, 3, 20, 28, 3, -30, -14, 23, 26, -12, -12, -6, 10, 11, -3, -29, -30, 17, 6, -35, -38, -4, 8, 2, -3, -42, -36, 26, -2, -37, -25, 12, -7, -3, -6, -32, -21, 24, 19, -35, -9, 0, 10, -1, -13, -30, 5, 30, 4, -24, -6, 17, 21, 18, -16, -17, 6, 30, 10, 5, -3, 3, 17, 14, -20, -15, 29, 26, -4, -12, -17, 6, 17, 8, -23, -4, 17, 10, -18, -36, -12, 16, 9, -30, -27, -13, -14, 5, -2, -36, -28, 15, -2, -45, -34, -8, -4, 6, -2, -34, -19, 34, 13, -33, -3, 16, 12, 12, -9, -30, -12, 39, 16, -24, -7, 13, 23, 20, -4, -20, 8, 26, 16, -15, -10, 5, 46, 6, -32, -20, 13, 7, -13, -7, -29, 3, 36, -5, -52, -18, 22, -1, -15, -1, -39, -21, 8, -4, -51, -27, 16, -11, -20, -24, -12, -2, 12, -17, -32, -21, -7, 26, -10, -34, 1, 39, -4, -11, 5, -14, -1, 40, 13, -35, 17, 53, 2, -11, 14, 7, 27, 21, -14, -15, 28, 35, 3, -6, -1, -5, 10, 21, -19, -19, 20, 16, 0, -10, -24, -3, 27, -4, -21, -6, -1, 2, 0, -28, -34, -1, 15, -23, -29, 4, -5, -5, -7, -18, -16, 7, 3, -26, -26, -6, 12, 10, -2]
5334bk2K3K5rj7j0J2J6J7l9j0M6mk2kNk5M3Km8qM4Rl2qJ0JK5ol6j7M5K0m0j8J0
5370b2K4Lj2j2j4K4K6l1j1J4QlKj3oK6K3l4l3J8M2qk6jQMJ7pk4NN1j0l6%K6rL
5407A2opLL1j0k7kK1J6k4rj5PK2J2l5NJ4Jkj3k9L5K0k5k1J8pK1lk4j3L1K5l6j3
5443b7J4OOJ2m3J8L1Nm7J0J5kK5k1k8J4L2Jj6j0j5M3J0l8j1L4orRk0oL5J0m5L
5478a1L6k3MRl9mO9l6l9K5OjOkm4L1M2m3l1K3J7KJ1l3j9M5J8m6OOJ0K2j0l7J5
5513a5L8j7j0omJ7M5m2k9L9J7l6J3oj9L3K1m8JK3%j9K0k7k1N7km0NK4oRj0k5J
5548a9N4l2l9L9j1MJ2k5k6M4Pk6nJ4pJ0K4l8k5M9J0j7j2%J0J8nk7J3K4mj2Jk8
5582b5L5L3l9j6K0RKJl6KL9Nl7kJ7Ljj0j0j3N1rm7J1J4LMrk3OM1k7k4RK0%jj6
$$ y = [-2, -24, -1, 24, 15, -2, -12, 0, 16, 33, -6, -16, 30, 26, 4, 2, 7, -18, 25, 27, -21, -29, 15, 24, -8, -16, -6, -5, 20, 14, -22, -39, 6, 26, -14, -32, -22, 2, 5, -7, -19, -33, -9, 17, -14, -25, -11, -3, -6, -4, -17, -23, 3, 26, -8, -41, -23, 19, 11, -15, -16, -8, -4, 13, 6, -18, -13, 38, 28, -8, -8, 18, 9, 12, 6, -1, 2, 33, 23, -4, -6, 15, 31, 7, -2, -17, -10, 12, 24, -11, -6, 8, 9, 7, -6, -35, 0, 20, -5, -26, -8, -15, 6, 3, -21, -34, -3, 22, -14, -27, -13, -7, -1, 11, -32, -14, 17, 22, -25, -15, 0, -2, 23, 2, -26, -12, 20, 21, 5, -5, -20, 23, 33, -5, -16, 18, 12, 3, 12, -8, -14, 21, 31, -14, -11, 25, 2, 6, 15, -24, -28, 41, 5, -34, -9, -3, -4, 2, 0, -44, -13, 29, -14, -45, -22, -5, -3, 8, -25, -44, 1, 19, -27, -21, -15, -5, 17, 7, -30, -15, 23, 6, -4, -10, -14, 3, 48, 6, -23, 16, 33, -3, 10, 4, -15, 18, 39, -9, -8, 15, 15, -4, 16, -11, -32, 25, 23, -17, -12, 12, 6, 15, 5, -20, -19, 35, 3, -36, 3, -8, -4, 8, -17, -43, 1, 8, -18, -23, -9, -16, -6, 18, -20, -45, 4, 14, -3, -15, -15, -5, 13, 8, -19, -6, 18, 14, 2, 3, -25, 10, 43, 4, -12, 8, 17, 19, 20, -16, -14, 25, 30, -7, -9, 8, 11, 10, 0, -10, -23, 28, 19, -28, -17, -3, 0, 4, -5, -28, -22, 19, -8, -32, -23, -3, -3, -4, -20]
5620b0j4PL9k0k2JK2J0Jk4j9M7Oj9rj0L6Qj6k3kN0pk0k%J3Pj3k2K5J0lNl2%L4
5657B4j0j5j1K1Kjlk3QJ7mj7qJ2OJ9k7k7J6L4j2j1j5J1J3mpj6J7K8qk5jJ4OMp
5694@k1PL2j7j0pK6J1k1j3j2L0NJ0l1QJ8J3j7j6OQJ4j2k2OJ4jPj6j5J8Pk3kJ5
5730aKkjj2PJ4Jk6j7J6K2Ok7J0qK0%k4jJ1J7j1j8rL1JMkk0L2J5j2l1J0PRmrj7
5769a7J7L0k4j2rK6Nnj6j0K8J2k6j3NJ0J4j6loJ2Qk8rJ2jK2ok8JJ6Nk1LKJ7J6
5806A1l1j0J2K5j1k3PLK7jj7j2J7K0j7jj6RL1pk8J5K0k6K1Kk6ML6j5l2K0J7j6
5840HMmm1L5K4l0j9K3lRKl5%K8nj7MN%K8k0k0J0K5j2oj0rJ4K1k1l7N0mLLj0j2
5878a9L9Ll6OJ6llOk7KM5j6k1kJ4PNpk9K0L8l5j8K2j2QQk3j7L9J5k7oKRjJ5m4
$$ y = [-20, -34, -27, 12, -8, -30, -29, -7, 3, 4, -20, -39, 8, 14, -5, -14, -24, 12, 20, 4, -19, -21, 29, 22, 2, 0, 0, 13, 20, 7, -15, 10, 20, 17, 22, -10, -10, 24, 14, -1, -12, 9, 11, 10, 7, -16, -8, 9, 5, -12, -20, -8, -2, 17, -10, -37, -21, 13, 1, -10, -25, -14, -1, -5, -12, -28, -11, 17, 9, -16, -17, -3, 3, 7, 0, -21, -14, 18, 1, -9, -16, 10, 21, 0, -13, -25, 5, 10, 20, -11, -3, 15, 28, 11, -5, 1, 9, 23, 11, -11, -5, 9, 8, 15, -1, -16, 2, 9, -14, -16, -1, 1, -1, -2, -14, -7, 7, 8, -18, -35, -19, 3, 9, -18, -8, -16, 4, 4, -20, -21, -10, 7, -4, -22, -31, 0, 1, 5, 3, -17, 15, 30, 18, -13, -3, 4, 13, 9, 0, -17, 0, 30, 6, -6, -15, 11, 16, 11, -5, -15, 13, 25, -1, -14, -9, 1, 15, -1, -4, -10, 2, 10, -18, -27, -15, -16, 6, 0, -28, -27, -11, -6, -27, -24, -22, -5, 11, -20, -30, -18, 7, -4, -27, -20, -17, 10, 9, -8, -20, -3, 17, 0, -1, -17, -8, 23, 16, -12, 3, 23, -3, 18, 20, -6, -2, 34, 19, -13, 7, 24, 8, 12, 8, -33, 2, 26, -4, -23, 0, -3, 6, 8, -27, -27, 1, -4, -21, -17, -12, -12, 16, -4, -24, -14, 11, -1, -7, -17, -26, -12, 9, -12, -49, 1, -3, 0, 3, -7, -19, 20, 23, -13, -7, 9, 6, 3, 9, -18, -16, 29, 13, -8, -10, 4, 11, 16, 9, -20, 0, 38, 3, -15, 7, -5, 3, 11, -12, -29, 10, 25, -2, -8, -6, 3, 2, 17, -27]
5916b7PL3rk7Rj3J9K3k6k9K3J2j2J1j2k2L8K8m3j0L0Jj1%pmL4Pm6PK8QrNk1JK6
5953B2rk0MJ1RJ0k7ONOqj3lQMRl1LK8%l4rJ4lK4ll0j5N5j3kj2pKK8ol3LK1Kj1
5994a5lKJ3Oj3mJ4J1L%k5mK7Pj4jkjK3k1j5ML5j8j5NjOK3j8k9J9J8k1omPJ8Pl5
6034a7oJ3J5j3Nl2J7OJ1l2OK0Jj1mjK2poj3oJ3J7J1l2K1J4j0kj7NJ2J6k0okK1
6071INj4nNJ9j1Ql1J8J1Kpk0J4JQj3j6LK9kl8J1J9Qj8Kj9MK8k4j5PL4j3qprLL3
6111A1rl0lK4kJ9k8PJ7J5k3k3K3LJ7kl2PK3oolqJ8K0l1JJ9lMj5lj6K4Rk6oK1n
6150B%jk1NK8km0NK6j2nOj8J0J5j0j7J2JJ3qj0mJ2QnkqJ4J3j4n%K4Pk3qRjL8k4
6191A0lpJ8%qppJ3K1j8j2MJ2pOpqRPk2j2KJ8Pqk4NK2J4l6kK0nkRl5QL2j0j4oK0
$$ y = [-27, -20, 13, 4, -23, -14, -27, -8, 15, -11, -40, -17, -5, -17, -6, -18, -40, -2, 26, -17, -27, 3, 4, -7, -7, -14, -18, 16, 23, -23, -16, 12, 20, 11, 16, -5, -4, 22, 13, -7, -3, 8, 17, 27, 0, 6, 11, 17, 9, -4, -7, 1, 5, 14, -17, -14, 14, 14, -20, -29, -15, -18, 6, 3, -27, -42, 13, 0, -2, -14, -21, -19, 9, 3, -30, -27, -6, -4, -15, -18, -16, -3, 3, -10, -14, 0, 11, 14, 14, -11, -15, 12, 19, 5, 4, 2, 1, 24, 3, -12, -8, 27, 9, -6, -1, -2, 4, 27, 9, -20, -1, 17, -4, -10, -14, -7, 11, 18, -17, -23, -10, 5, -8, -3, -35, -18, -12, -1, -33, -27, -7, -6, -17, -21, -22, 0, -7, -13, -26, -32, -19, -2, 9, -23, -2, 12, 2, 0, -17, -12, 0, 16, -4, -10, -12, 9, 14, 0, -5, 0, 19, 8, 16, -15, 3, 14, 16, 9, -11, 3, 4, 12, -1, -17, -14, 15, 13, -25, -14, 5, 13, -5, -3, -22, -18, 10, -14, -29, -22, 12, -1, -9, -16, -25, -22, 11, 2, -28, -31, -7, -9, 10, -18, -11, 6, 21, -2, -25, -2, 1, 18, 16, -16, -9, 14, 8, 2, -1, -9, 9, 29, -2, -1, 18, 15, 19, 4, 1, -15, 9, 18, -8, -14, 7, 2, 2, 1, -20, -15, 13, 11, -29, -24, 2, -10, -15, -9, -27, -17, -2, -12, -29, -17, -16, -3, -11, -21, -25, -13, -5, -10, -12, -20, -6, 7, -7, -12, -12, 12, 19, -4, -12, -3, -4, 34, 10, 7, 0, 18, 18, 10, 3, -4, 9, 30, 12, 0, 4, 16, 9, 15, 8, 0, 9, 16, -6, -18, -16, 2, 9, 1, -23, -18, 4, 18, -18, -20, 0, -5, -7, 2, -33, -25, 7, -3, -17, -23, -3]
6233cnjLrJ4J6qk1j1L2%lOk5J6J5j1LrMK1j8k6J8K7j2jrj2J7J7j8j3JPLj4Kj2
6272a9K3J4k4j0MRjQk7OK2pj2j0J9Omj7j0J4J0J2j3nmKJ5j4j0K8J4j4j7JJ3KJ1
6309A5j6j4J1J6%j1OJ1pRk3mNK7k7jJ5Noqkj0J3Lj7oK4pJ%j3KRoj4mRJ6kj8kJ3
6351hOoJ0oj3J4J0k2KKK8k4Nj6J4J2%qj1J6Knj1lK3J%pmQOPj3oJK4j9k2J5J8q
6392A2%j5j1J1K6k5k2K3pkMkjNPj3olJ2l%lPpJ3%k5OK5Jk7JJ9QlJ3k5mK9Rm6P
6434a2K6Mj9KJj4L4K8n4rJ9J9j3j4%J0Kj0%qQjJ4k5JJ3j0lJLJJ2j8poJ9J1k1m
6473b0KmJ6Kk9J4L1k0mQj6K0Qj0l3L2J1k1JJ0mK3J9m2MJ8jJKk5kK4Kk9J5LrJ0
6511GJm7L5J1j0j4MPJ3j5j2mJ1Pj7K4j9jJ1Lj8QK4j3k5J9pNK3k3rJ3J4onJ8k3
$$ y = [-3, -8, -9, -6, -15, -1, 15, 7, -14, -25, 7, 7, 4, 10, -15, 1, 16, 5, 8, -1, 3, 24, 6, -20, -2, 25, 13, 12, 3, -9, 8, 25, 7, -6, -5, 2, 5, -9, -7, -19, 4, 18, -6, -16, -12, -3, -4, 4, -23, -17, 5, -2, -14, -24, -5, 1, -3, -20, -30, -16, -6, 6, -7, -12, -16, -14, 1, -13, -23, 5, 19, 5, -12, -11, 2, 4, 15, -1, -15, -4, 12, 12, 1, 7, 18, 11, 20, -3, -7, -2, 25, -2, -3, 12, 17, 11, 3, 1, -9, 4, 7, -10, -16, 8, 1, 2, 2, -11, -9, 0, -6, -20, -24, -15, 1, -1, -19, -21, -8, -2, -8, 2, -4, -17, -3, 7, -15, -13, -11, 17, -7, -2, -18, -4, 8, 8, 0, -11, 5, 7, 2, -9, -12, 11, 12, 12, 5, 1, 9, 15, 22, 9, 3, 4, 28, 9, -13, 2, 20, 12, 12, -3, -14, -3, 23, -2, -24, -1, -8, -10, -6, -8, -9, -4, 3, -10, -16, -19, -7, -10, -10, -13, -6, -13, 0, 0, -25, -19, 6, 7, -20, -19, 0, 8, 5, 18, -7, -11, 18, 27, -19, -12, 14, 18, -1, 1, 2, -12, 22, 50, -4, -13, 6, 25, 12, -2, -2, 8, 10, 0, 0, -8, 0, -1, 13, -12, -11, 2, -8, -11, -10, -7, -6, 6, -12, -19, -25, -6, 5, -16, -20, -18, -22, -6, -4, -33, -19, 12, -8, -12, -4, -20, 0, 8, -2, -35, -3, 8, -13, -12, -2, -6, 17, 36, -6, -2, 16, 15, 16, 18, -7, -9, 15, 17, -12, 3, 6, -3, 7, 8, -39, -4, 7, -3, -17, -13, -6, 7, -8, -20, -24, -13, -6, -23, 1, -18, -19, -8, -5, -23, -15, 9, -4, -29, -10, -17, -12, 11, -12, -21, -8, 6, 0, -5, 13, -10]
6548a0jK8k4j3K2Nmkk3K4K8Jk5pJ3LLLk3J8J0k7QrnmL8j9k6RK4k1lOj9J7Lk5k
6587b9L1nj8O%j3K0%j7kK4nmqOj0L9j0k9J4PJPj1MJ5%qj6K3pQj0%lJ1Nj3pRmJ8
6629A9j8j1J6J1k1nLJ0j1K4k5j6L2j7qJkqK3J1l0QQKj3OJNnkkMQ%mmjJ3Lj0k2
6670b7J4J7%j0OKOKqOj2J3K4k0j1J3Mj7Nk4J6K3j0k1mK0kN%k9J5JQqj7J9lQj1
6709g%%ljkKoJ7rj1%J9Lj2Rl2K2K4j5k1PK9j1J4mk2NK4j2j2lJ4J1j5j3J9Jkkk
6749ClJ4Kk5jJ5kJJ3k2j7K9lpk6K8Qj9QrrJ1K0j2k4K0Jj0qJ0oJ2J1k1nJ9J4pj0
6788gj0KJ1mJ1jJ0J1j5poPJ1lNrMJ3j7Nj5K1jrLoJJ1jk2NJ0%j7PjRKj4j4RJ7j3
6831gj5NmJ2kjj2J6J2j0Nj9J5Qlk0rJ6J5oj0PLM%%KJJ4j3Rj3J1kMlj3J9pj1mK
$$ y = [-10, -11, 17, -7, -20, 2, 7, 3, 1, -22, 2, 30, 31, 6, -1, 12, 15, 18, 21, -2, 16, 26, -1, 7, -2, -7, -11, 27, 8, -18, -9, 15, -6, -9, -3, -22, -5, -2, -27, -29, 2, -3, -21, -15, -15, -28, -8, -8, -25, -27, -3, -8, -12, -20, -14, -24, 15, 5, -24, -10, -3, -2, 5, -6, -2, 13, 13, 5, -11, 12, 5, 13, 3, 3, 0, 11, 16, 3, -4, 5, 1, 19, 1, -10, 6, 17, -4, -9, -6, 4, -7, 17, -8, -24, 8, -9, -17, -16, -18, -26, -3, 8, -22, -14, -6, -4, -17, -11, -10, -5, -10, -12, -14, -10, -2, -2, -6, -10, -11, 2, 5, -5, -27, -13, 4, 4, -6, 0, 2, 8, 10, 2, 8, -4, 9, 33, 13, 2, 15, 19, 2, 7, -17, -1, 22, 12, -9, -13, 7, 5, 10, 10, -19, -4, -3, 5, -3, -20, -1, -4, 4, -7, -7, -7, -10, -11, -13, -11, -17, 0, -9, -20, -20, -1, 2, -10, -1, -33, -11, 13, -2, -23, -16, 13, 2, 16, 12, -10, -5, 19, 7, -5, -8, 6, 17, 2, -11, 8, 9, 7, 5, 3, 0, 14, 16, -9, -10, 5, 3, 4, 17, -5, -22, 7, 4, -3, -29, -1, 7, -12, -4, -13, -22, -11, 9, -3, -27, -7, -6, -16, -24, -14, -20, -8, 3, -18, -23, -4, 10, 3, -7, -17, -15, -4, -8, 3, 2, 12, 23, 8, 1, -5, 2, 13, 10, 15, 6, 10, 23, 6, 11, -4, 17, 16, 7, 10, 4, 5, 16, 15, -7, -2, 8, 8, -9, -2, -3, 6, 8, -6, -20, -11, 6, -7, -22, -17, -21, -9, -11, -12, -24, -8, 4, -6, -1, -20, -5, 3, 0, -20, -29, -13, 2, -4, -14, -7, -4, 0, 0, 0, 2, 3, 17, 4, 13, 0, 11, 9, 13, 10, -3, 16, 9, -2, -6, -4]
6873dK5j0mKlqPJ2k2qK4j0j6j0J0J0Rk9lQJ6Kj3KKLlJqPJPrk1J9K4pk0J3RNk2
6915a2RnQNkJNjOOj6%J3Lj1j2J2Rj5%%jlJ0rj0PNnj3oJ3QMok1lK3jj0POj0JNj1
6961a7NKJ1j3jRJ5j2qpnK0J1j0rJ6%j5K1rj2J8Qk0rJ8NoRoqJ1j0rPMmKPj7OOo
7004bj1K5k3J5k6NOJ8j5KRj6lKMmmJ9pQk1J2%Pnj3J7l%MnQJ0kj3LOKJ5j2rJ1Q
7047B2lj8KPNj3J0mj1K4jj3j5OJ7j9OknLjlj0RJ7oj9JJJ3mJqJ2j7J0LpJ6j2j1
7088a7J4j0KJ3Oj4oJ3J3j9J0oJ3J9k3pjJ8Mj7OoO%orJ3J1j0l%j1J8npj2J1lQj
7128EloN%j3jJ6j0Pj1MJ6k0OqLMNNnj1J3pqK0l%J8k4pJ9k%lMkmK1qj2J9Pj1rn
7173DRjmJ6j5J3pnqkJjJ1k0J2rkPk4J8jJJmQlj7J6jj0OJ6j6kJKJ1%nj0J2J1mj4
$$ y = [-4, 21, 11, 7, 9, 6, -2, 5, 17, -5, -13, 11, 1, -15, -25, -15, -5, 4, -25, -28, -20, -4, -2, -15, -13, -11, -8, -11, -10, -18, -11, -10, -3, -12, -33, -14, 10, 3, -17, -4, 5, 10, -12, -3, -8, 0, 5, 3, 4, 9, 8, 14, 20, 4, 4, 17, 20, 9, -3, 9, 18, 3, 3, 3, 2, -1, 9, 0, -10, -3, 2, -3, -16, -22, -9, -1, 3, -3, -24, -27, -4, -5, -15, -8, -2, -12, -11, -6, -17, -12, -10, 1, -12, -13, -4, 11, -1, -9, -16, -21, -1, 10, 0, -9, 7, 7, -8, 13, 4, -8, 10, 18, -2, -11, 7, 12, 6, 15, 9, 1, 12, 2, -7, 0, 4, 0, 2, 9, -8, -2, 4, -2, -13, 12, -11, 4, -22, -17, -11, 7, -8, -6, 3, -13, -16, -14, -10, -14, -18, 1, -6, 2, -19, -7, -7, 0, -5, -18, -1, -4, -4, 0, -5, 3, 13, 11, -2, 1, 7, 9, 24, 12, 3, 14, 22, 19, 1, 3, 10, 15, 2, 12, 8, -3, 21, 20, 7, -8, -2, 15, -4, 2, 0, -5, -2, -3, -6, -16, -7, 10, 4, -15, -14, -13, 0, -4, -3, -11, 1, -16, -6, -3, -10, 6, -6, -17, -3, -13, -11, 2, 8, -6, -12, 1, 14, -5, 5, -1, 12, 31, 8, 1, 0, 18, 22, 5, 11, 5, 11, 11, 5, -4, 9, 20, 10, 7, 7, -4, 14, 9, 2, -10, 1, -2, 6, 5, 2, -4, 1, 1, -12, -13, 3, -7, 0, -11, -7, 9, -11, -5, -13, -10, -6, -1, 4, -1, -12, 1, -6, -14, 6, 3, 3, 21, -3, -10, 9, 7, 7, 4, 8, 6, 2, 23, 15, 3, 22, 29, 18, 9, 4, 13, 12, 8, 24, 9, 22, 15, 10, 2, 0, 1, 0, 11, -9, 3, -6, -8, -1, -25, -7, -8, -7, -6, -10, -2, -5, -22, -6, -7, -17, -11, 5, -11, -13, -12, -10, 1, 1, -4, -14, -2, 9, 5, -9]
7217iJ3K%j0J3rJ0rPlLQqJ0k4J2Po%oRJ1nrj4J4Nj0JoJ0j3Pjj4J1j%qpJ3J3k5
7260a8J8nmJ3j2noJ3J6j3mJQmNrqJ7J1j3oRnJ1Mj6MnK2j3m%RPlpkkJ9pj0pK4j2
7304A1j4j1L0j0j1OllQj4Mj2J8Mk4K0qkKLlkj0K4lj0jlJ4j1QJ%nJ5j7%J3JJj3
7345gK6j0jQj1j2J4MloJ4krJ2j5nK7j2j3J4mlpKj2OJ4ropJ5JLk1N%KQqJpJ4%j3
7389a3nOJ4olMjQJKqJ1mNok%OrJ2JlMLlk5L6j7rJ0NrPNk2J0QJlj3J2j4J0Kj4j
7435gJ6j4ooPMJmlJ6o%Qk1MJ7j1jOj1J5j2%lMJ9Jj8%MJ4j2J6pl%LkjJjMkpPJj
7482Ilj1J0kmL%jrNJmjJ0Nk9MOKPPj1j2J3rJ2rK0k1kPPjj2PQRj0%Kj1J7kj1RK
7528GopK1okjJ5j3N%Oj7kNl%RJ3j7kjjj9J8qMPqj1J2LpjJMJ0j4KlMokLrPLJ0j0
$$ y = [-9, 4, 6, 6, -4, 9, 0, 10, 1, 8, 5, 8, 16, 8, 18, -6, 6, 13, 7, 7, 1, 10, 21, 16, 7, -7, 7, 12, 2, 3, -3, 7, -6, 1, 0, -14, -3, -4, -4, -12, -19, -6, 7, -18, 0, -5, -9, 4, -8, -13, -19, -6, 10, -3, -7, -6, 2, -2, 3, -6, -14, 3, 14, 1, -5, 4, -1, 10, 14, -2, 2, -3, 19, 6, 2, 2, 11, 18, 15, 8, 6, 4, 23, 16, 6, -1, 23, 11, -3, -14, 16, 6, -5, 1, -2, -5, 3, -11, -7, -19, -1, 3, -21, -1, -9, -11, -9, -6, -9, -11, -21, 3, 0, -10, -11, -14, 0, -11, -3, -2, -2, -7, 8, -9, -9, 4, 5, 6, -7, 19, 9, 8, 16, 5, -7, 7, 11, 8, 2, 16, 14, 5, 17, 2, -3, 24, 12, -1, 13, 9, 6, -1, 1, -11, -5, 9, 0, -6, -13, 2, 3, 6, -15, -10, -10, -8, 0, -8, -7, -14, 0, 0, -13, -18, -12, 2, -4, -7, -3, -4, 4, 5, 7, -1, 10, 6, 11, 5, 3, 3, 9, 0, 12, 13, 10, 14, 17, 14, -11, 25, 8, -1, 9, 14, 5, 12, 17, -5, 5, 13, 14, 11, -2, 10, -4, 6, 8, -6, -7, 9, -5, -11, -17, -10, -6, -5, -9, -12, 4, -2, -2, 6, -15, -11, 6, -5, -6, 0, -11, 4, -8, -8, -11, -7, 12, 13, -5, -5, -1, 13, 1, 17, 10, 7, 7, 10, 8, 7, 8, 7, 11, 9, 2, 9, 10, 9, 6, -5, 5, 3, -1, 2, 2, 1, -8, -3, -2, -6, -7, 3, 8, -21, -17, -11, -9, -2, 5, -6, -18, -5, -14, -2, -11, 9, -12, -14, -7, 0, -1, -13, -6, 2, 11, 1, 1, 3, -8, 9, 7, -4, 5, 7, 1, -6, 15, 9, 7, 6, 21, 8, 13, 13, 19, 2, 0, 5, 2, 2, 11, 24, 7, 5, 4, 3, -16, 2, -6, -2, 5, -3, -14, -2, 1, -6, -7, -6, -2, 8, -6, -4, -7, -3, -9, -11, -8, -17, -10, -7, 3, -7]
7576gNpOJMqJ7knlKlpK2nlJ1mkj3MmK0j6Rk2J2J5kj1n%Oj3LkJ3lOj0pJ0Rj8rQ
7622hJPkj5J5%lj2J0qJ5j6PlJ3jMkmq%MQj0J1PrJ1kojRj9NJ4Jj0RrlRnMrLOj1
7669ckMMlKjk0K6k4%Nj%J%njOkNrJ1qJ4j3jJ2OmJ0k5J4Or%LKJNj3J0jkJ2llNJ1
7717B2k1J%J3K%j2J0j5J2lj8J7Qj2j2QMqRKk2J0qPQj3qLJ3orK3j8QmJKkNj0J5
7759BorJ2KorJ8j2QmLLJ4j3NnQ%%oPM%rqJ3qKNm%lKoqJ0ppK0j4pK0rrlJ3j6nR
7808a3Oj1K%lQnjNMj3J6nJ1OjJJ2j0Lj2J1j2%K0j6NJ0j3MnPKQqj4LLmJ4j0loK
7852bJ6j1Prp%JJooKKQojjLJQj7jJ0PlrJRLpmlJ6JmlKMljnJ5mj6J0OqJ9Lj7J9
7902B0k3NkQmmjJnNllJ2jkLj0qQlKj0PojQ%OrM%J0j8R%jjoPKljOjqJ8KjqK%Rp
$$ y = [-7, -2, -9, -3, -2, 2, -6, 11, 9, 4, 1, 3, 0, -7, 15, 10, 7, 18, 14, 12, -1, 3, -1, 19, 3, 12, -10, 2, 17, 15, 4, -1, -1, 5, -8, -5, -7, 6, 3, 9, -1, -8, 2, 11, -7, -16, -8, -7, 0, -2, -17, -2, -2, -5, -17, -7, -15, 0, -16, -9, -12, 1, 0, 4, 2, -2, -10, -10, -6, 2, -8, 3, 10, 1, 12, 10, 4, 3, 12, -7, -2, 12, 13, 3, 12, 3, 0, 9, 4, 8, -1, 2, 8, -3, -5, -1, 3, 0, 2, 1, -19, 7, -17, -17, -12, -13, -13, -12, -12, -17, -18, -12, -14, -9, -18, -7, -15, -1, -14, -15, -3, 3, -1, 9, -16, -2, 4, -5, -5, -2, 0, 1, 6, -7, 3, 2, 0, 12, 9, 6, 11, 22, 1, 2, 2, 15, 17, 17, 5, 15, 0, 12, 9, -9, 8, 16, 4, -8, 0, 4, -4, 5, 7, -15, -5, -13, -6, 2, -11, -19, -16, -3, -9, -18, 5, -13, -5, -9, -8, -6, -8, -3, -13, 2, -4, -13, -1, 1, -5, -14, 4, -8, 0, -4, -1, 2, 16, 3, 8, 3, 11, 11, 11, 5, 12, 16, 16, 7, -1, 12, 4, 6, 11, 7, 7, 4, 6, 0, -8, 2, -5, -12, 8, -6, -13, 7, -2, -11, -14, -1, -17, -22, -13, -7, -18, -16, -16, -19, -11, -16, -17, -12, -8, -21, -5, -10, 1, 7, 6, 7, 19, 9, 12, 0, 11, -1, -1, 19, 3, 8, 18, 5, 9, 4, 11, 13, 21, 13, -1, 2, 5, 1, 15, 5, 2, -4, -2, 14, 3, 10, 1, -6, -6, -5, -4, -10, -16, -14, -12, -4, -10, -11, -12, -9, -8, 0, -17, -18, -8, -1, -4, -13, -12, -3, 0, -7, -11, -14, 2, 3, -1, -4, -2, 2, -1, -2, -7, 8, 4, -12, -2, 4, -4, 15, 18, 1, 20, -3, 2, 0, 8, 4, 0, -1, 0, -5, 0, -3, -6, 6, 5, 3, 6, -4, -12, -4, -7, -5, -15, -8, -14, -15, -7, -7, -1, -10, -6, -6, 4, -14, -5, -5, -6, -7, -13, -6, -4, -7, -8, -2, -3, -11, 7, 9, 8, 0, 2, 2, 11, 4]
7955DOMJ4rpQj3MmLj4J3Rpj7KJ7j9J0mPqKj6K0k0J2LLj8JJ9j0jkJ4oj0mRqKNn
7999a1J0KJoPkj0KJRJ0okjJ3j2J1kkMlJQj2qNkRrj1MRj1NmOJ3mrNj6lPMqplJ8
8047@jnj1L0k4mJMK0j6J0j9MJ5qNo%mK4j6oJ6J6j9Pj5J0JKplJ6j3J0Lj0kQjj0
8088BJ7j3LPj0J1j0JOpqNq%j6OPMJlNrNKpmJJ0oKj0J0KLjk0K7oo%J2LoOj0J3O
8135A7j8J7rmK0j5lQJMpPpPloJ5j0oLj0J1j4NQnnpJ2roRnkqKRLj7LlJ0J0mmMj0
8182a2RnJ1onNJ0lk
$$ y = [4, 10, 14, 28, 19, 12, 20, 7, 11, 7, 10, -4, 9, 18, 11, -6, -4, 13, -6, 4, 0, 7, -1, 1, -15, 5, -15, -3, 0, 3, -15, -14, 5, -5, -6, -8, 6, 0, -10, -14, -5, -13, -11, -6, -11, -1, 1, 2, -4, 3, 1, -9, -7, -6, 3, 13, 7, 5, 4, 17, 5, 16, 14, 12, 16, 13, 14, 22, 10, 2, 7, 5, 14, 5, -6, -2, 7, -4, 1, -3, 3, 16, 12, 3, 8, -8, -11, -4, 0, -8, -15, -18, 0, -1, -6, -17, 13, -11, -15, -14, -10, 10, -6, 4, -15, -11, 4, -4, 1, -5, -5, -9, 15, -1, -7, 9, 25, 6, 13, -2, 8, 9, 11, 4, 1, 17, 4, 14, 17, 7, 5, 13, 12, 2, 19, 6, 9, 16, 6, 17, 7, 8, 14, 7, -1, 4, -4, -4, -20, -14, -7, -3, -2, -5, 0, -9, -4, -2, -9, -13, -12, -2, -8, -6, -16, -6, -4, -1, -2, -22, 5, -1, -7, -7, 5, 8, 2, 8, -2, 11, 17, -1, 16, 7, 3, 23, 8, 5, 13, 14, 18, 11, 18, 11, 18, 15, 9, 24, 14, 8, 11, 1, 12, -2, 3, 11, 6, 1, -6, 6, -3, -9, 0, -5, -7, -15, -13, -4, -1, -18, -15, -18, -8, 2, -2, -6, -2, -12, -3, -8, 3, -3, -8, -3, 7, 4, 2]
8191B
$$ Imaginary data points
##PAGE= N=2
##DATA TABLE= (X++(I..I)), XYDATA
0@%%%%%%%%%%%%%Qj6J6j6J6j6K4l2L2l3M1m8N6o4P2q6R4j04J20j36J52j68J85
36I7k08K32k57K86l16L51l91M32m77N30n90O54p26Q14r16J035j180J360j593J901
56A038k329K977m077O422j9019K1165K3442n5627K0530L4657l9443j3443M3790
69B0083j5259k3470K8785K823k8036J3813R350j6525Q299J1245j6508J965J0319
82F884j2381l78J4731q317o044J1051l828r188P593K983l538K174j793j523L832
97B258n418q15J1131n734r259J3630j16j7577J0688J2722j6869oJ6033j2310q187
112i829J6235l901j0471J3292k17j2865J0050K143j4413J1468R918j9180K962
125d808J7392j7361p852K3972n771j8921J8362O697k3621N529J8089j3362n685
$$ y = [0, 0, 0, 0, 0, 0, 0, 0, 0, 0, 0, 0, 0, 0, 8, -8, 8, -8, 8, -8, 16, -16, 16, -17, 24, -24, 32, -32, 40, -46, 48, -56, 64, -72, 80, -88, 97, -111, 121, -136, 150, -166, 185, -206, 226, -251, 279, -311, 343, -383, 431, -485, 550, -630, 730, -863, 1038, -1291, 1686, -2391, 4031, -14988, 6177, 29619, -26008, -5478, 29179, -10264, -23707, 20083, 4824, -18646, 10139, 12962, -15074, -1261, 8089, -8436, -137, 11108, -5400, -3435, 6884, -5497, -5875, 8856, 539, -5505, 5546, 1718, -7470, 123, 3106, -432, 1742, -51, -1574, 2258, -3160, -3975, 7156, 1422, -7837, 5793, 5677, -11900, -1212, 11510, -5359, -5365, 10668, -1642, -9829, 6406, 2505, -7966, 5326, 5109, -7756, 2294, 4437, -9976, 1492, 11410, -7770, -4808, 12584, -4777, -12629, 11343, 5572, -13349, 5013, 11710, -11911, -6382, 11707, -1655, -7340]
138g340J5357n072j1232Q776L054o606L655K505l951J148j285k900O080J164o208
153b855L978K495q523K051P915n836k310P806l556o164N650P17m172N168R45o569
169c260K666K725n517K698N257n865r00O076m735m049P102M35m901L531O44m965
185c058K453K260l257K341J754m616J923K779o229J462P774n508m448Q052j976
200A706q011P279M373q991J718P576o650m217P402r6m640L754J409m544L00K313
216F81p01K32J91l25J140j657k224L164J272k993J908J687m692J28M537k437j765
233a854M200j102l606K552L98k736K858J933l512L6J685k297O36K671j944n91
249f73K272j892j622K419k95q66K503j064k959K192Q68k507K049J788l379L15
$$ y = [-7340, 8017, 2945, -8287, 489, 3543, -3063, 592, 3097, -854, 294, -991, -3891, 2189, 3353, -2855, 1123, 3618, -4905, -2854, 5061, -775, -3085, 4721, 1165, -4999, 651, 1368, -2804, 2364, 3309, -3260, -594, 2131, -3386, -688, 4569, -1296, -2196, 3880, -855, -4904, 2198, 2633, -2268, 1263, 1907, -3058, -605, 1655, -1602, 739, 2493, -2123, -200, 2579, -3650, -2188, 5586, 78, -4370, 3682, 1706, -6305, 974, 5347, -3644, -1926, 5650, -1000, -5217, 2185, 2089, -2551, 1203, 2612, -1932, -1632, 681, -20, 212, 403, 78, 1218, -439, -2663, 501, 1773, -1220, 688, 2375, -2317, -2189, 2348, -89, -1854, 2346, 1244, -2362, 190, 588, -2148, 710, 2643, -869, -833, 852, -1445, -809, 1862, -82, -673, 1599, -293, -1915, 504, 209, -657, 1846, 782, -2177, 15, 883, -1624, 425, 2213, -1166, -851]
265h51K762l046j255M232l34k914J959L93k945J327K397j755o99J672n42j314
281i13K60N36N90J49n41J52m02j228J325J550j860l60K296j346k184K164P44j976
299a044J518J447k981o52K647o00j329J769K18j741M84O00j130L22J411j82q38
316h1l42j26L85L72r2K52l9o73J34K56p44M35J455o13j287M94J39n85R02O72j106
337a92j12Q23p18o56Q95M30k43J95l92q09M01P09j11m5N1l71M5J49n00J03R61
358F13l4p57j2k3l05O04N99o72l86O40p9p35K50O24j16o8J88n46n60O71P46n04
380A38m79N28J01o66N0N55k59o5P37l48j223M97J150o04n17Q58k21r32P66M93
400E59j194K09J511p02j344Q52N62r12M39Q45j052n16J257o5j242N59J011o66
$$ y = [-851, 1911, -1135, -2390, 1842, 1508, -1406, 553, 946, -1999, -672, 1725, -30, -729, 943, 401, -913, -653, -117, 473, 622, 81, 233, -169, -1397, -72, 1478, -382, -742, 1554, 208, -1976, 188, 932, -1044, 474, 1921, -1060, -1712, 935, 335, -994, 775, 993, -748, -264, 336, -794, -472, 939, 757, -81, -423, -549, -164, 208, 116, 368, 329, -344, -210, 46, -698, -263, 1192, 579, -708, -214, -75, -660, 242, 914, -192, -304, 519, -199, -855, 40, 470, 227, 422, 30, -779, -378, 331, 220, 175, 226, -145, -100, 49, -451, -348, 613, 579, -178, -190, -213, -518, 86, 685, 13, -373, 267, 188, -547, -297, 327, 211, 143, 331, -215, -775, -104, 642, 138, -341, 187, 288, -378, -328, 227, -32, -97, 640, 292, -931, -434, 716, 112, -405, 453, 232, -700, 66, 559, -635, -426, 1085, 383, -961, -109, 453, -459, -20, 825, -227, -743, 514, 449, -793, -234, 777, 111]
418A11m70N55k38n59P75O02r72m50R88O9r34K75O77m99j02P07n77q36J031O32
438G85j089r7Q31m74l48P51k94o68Q71M28j014j10O25k34J7M01m75l35O65M9n99
459c14J64L07r9R7o6m53J30N07ql55r1J69J24r8r5M9m5J28L25l95o01O48N50p44
483a66j20O55m97k57R08l53r92R61P35j232j96R94m55m16R34k02j025O69P40q46
503a61l53P35M0l97J69Ol37J66N52j26o79P0O90j74n84L72L07n11J71N22p63l61
525f46J166P8j174L34P28p02n7Q49n84o96J039L12j207P9J019l56n16N23o3o05
545d79N06N87p14m72P68K41o70LM60k65j28M86j92o86M58O89n80m64N24R4l44
566a78K97M3n40K83N74m72m13M17J63j81J44j44k92L36K75l50j44J53L4J41l6
$$ y = [111, -359, 196, -42, -601, 174, 776, -196, -646, 342, 411, -523, -248, 429, -70, -172, 535, -42, -878, 153, 785, -304, -401, 430, -44, -392, 359, 65, -603, 268, 696, -318, -428, 197, -37, -20, 381, -94, -429, 236, 285, -314, -150, 157, 58, 155, 89, -364, -234, 273, 265, -90, -181, -12, 112, 14, -81, -32, -77, 51, 376, -19, -620, 28, 578, -166, -286, 369, -128, -385, 523, 170, -822, 139, 874, -358, -554, 440, -15, -431, 503, 301, -724, -55, 685, -161, -514, 221, 261, -136, 33, 39, -298, -132, 420, 294, -385, -315, 375, 201, -383, -11, 296, -215, -44, 478, -285, -646, 520, 598, -576, -242, 486, -216, -273, 576, -8, -704, 335, 647, -560, -481, 538, 182, -334, 189, 126, -479, 27, 614, -100, -572, 196, 437, -233, -230, 230, -35, -163, 323, 131, -555, -97, 592, 12, -452, 72, 166, -178, 119, 162, -378, -95, 479, 7, -406, 11, 174, -7, 137, -7, -299, 37, 312, -38, -182, -29, 5, 146, 110]
587A10l53P3M28j00k64L1j5J08K29k28k99K25K16l6j00k38O2M33j83l55L54o2
609C6k75N91p6r85O18R59j101l29J102n97o04J380l01j505J229Q40j658J78J326
628H28j072k84J380q46j035J463K24j199N33L33p95N62L94r39K91O47o51J08L06
647B48q19N39R38j249k79J323q26n43J578p42j379J850K76k117J056J260j875
664g61M41J631j986m43K448j053j569J989j38j775J741M55k279J144J531k091
680g15K7J792j510l90K048j229j368K095m1j719J301L59j676J142R36j840L26
697d62J417j233j98J179j062j87J529r52r24J453m27q93J567m24j687J774O01
714A071k298R99J573k145J99K158k053j069K938o17k335K035N63k396J348J516
$$ y = [110, -243, -170, 258, 158, -106, -75, -90, 18, 247, 19, -280, -55, 161, 125, 25, -213, -151, 282, 99, -256, 98, 36, -239, 352, 276, -709, -91, 868, -233, -562, 540, -57, -661, 719, 418, -1087, 142, 982, -676, -498, 828, -244, -528, 852, 6, -1029, 434, 658, -541, -8, 325, -470, 92, 486, -453, -162, 485, -166, -58, 248, -571, -32, 906, -343, -622, 701, -125, -668, 910, 168, -1211, 639, 915, -1202, -146, 1114, -761, -320, 1311, -675, -1118, 1330, 277, -1292, 697, 559, -1216, 525, 980, -1299, -155, 1376, -715, -688, 1104, -406, -796, 1252, 23, -1345, 750, 709, -1010, 291, 650, -1026, 116, 1052, -788, -462, 955, -278, -476, 703, -359, -546, 983, 31, -893, 560, 133, -760, 807, 383, -1304, 470, 1071, -1227, -228, 1345, -800, -601, 1557, -496, -1565, 1373, 756, -1579, 456, 1019, -1377, -29, 1487]
730A487k455J73K277j628j030J993n98j184J747j67j828J249Q68j506M33Q74j231
747e26K38J133j141l28J273n52n01Q61o24m73J383m25j211J199J82j292J085N58
765H39j827O62J604j685n12J849q14j045J708l80j634J576P11j852N15J060j358
782e83K82J331j401m41J728p25j147J426m1j240J195L79j683N37J286j023k81
799d01Q68o50k49R11m71n05Q35j21n22N18l14m61J024O7j124N35M77q77M06O97
819F43j031j5J116p00o76R10n9n05P46k23r13P88M70q90K11N23o86J58O47p31
839b17k78Q93j30n40L27o8k27N03n1n21K93J90k39J92j04m24N08L27o52%M52k98
861f4j7L48l84j88N96q4m09J33J1JL84k33m31L93J43l66J97Q7l69L60K83o45q3
$$ y = [1487, -968, -795, 1482, -146, -1176, 817, 219, -965, 782, 615, -1213, 36, 904, -602, -169, 705, -526, -288, 845, -296, -624, 649, 97, -404, 457, -167, -640, 743, 318, -893, 306, 488, -804, 281, 839, -988, -326, 1278, -407, -919, 930, 116, -929, 779, 399, -1235, 341, 1052, -800, -285, 775, -583, -301, 1030, -371, -812, 916, 191, -956, 470, 429, -811, 384, 763, -920, -383, 903, -120, -401, 467, -183, -432, 479, 8, -497, 338, 217, -305, 213, -101, -562, 462, 529, -595, -60, 417, -460, -54, 643, -388, -403, 713, 13, -663, 247, 188, -317, 429, 206, -707, 81, 551, -339, -128, 395, -291, -133, 514, -217, -495, 398, 268, -272, 55, -13, -240, 263, 212, -309, -16, 174, -65, 127, 23, -401, 107, 434, -218, -218, 234, -64, -81, 267, -117, -305, 291, 207, -202, -69, -58, -57, 327, 94, -337, 56, 199, -167, 30, 117, -252, 108, 391, -254, -337]
884c37N66j31j08K01l80n6N55k25l67M46p1k77M39j63o53O06N49p70j07N63m22
905a42r0O79l88n39O90J65o58J40K80k31K19J50n17RM27j38q0Q9k26J21L37l76
927g9k13M18n0j27K98l46l37P08Q4p25K96M11n69J84M71p08j54R64k33q15N57
948C5K64n87L31L79p18kP41k93n04L54J21j67J91r5l18K57K06k09j7J0p7K69K8
971A99m40R3L77j59j09J49k80rM71j33m65K78K33k59O2N2k94K41L66m04k26L28
993G1rj03J91j80k48M21J23m58O3K30j33R2J44m23k3N08j01l77K00J07j76J78
1015I7N4m06J10M45j81l18J29J21o0R3l7j82N4K12J3k39j01K18K04j77k19J35
1037c5P0o8J54m8l28J81M21l34l48L69J61k46J02Q3l73J00M70k35l86K58K39k19
$$ y = [-337, 229, 98, -10, 191, -189, -245, 310, 85, -282, 164, 93, -184, 255, 92, -561, 45, 594, -176, -283, 280, -142, -232, 447, 59, -480, 210, 375, -283, -143, 137, -94, 125, 275, -242, -233, 194, 56, -24, 65, -161, -40, 297, -79, -292, 126, 76, -51, 247, -99, -436, 272, 356, -369, -73, 338, -231, -47, 424, -284, -438, 526, 293, -522, 35, 299, -288, 43, 422, -296, -298, 443, 150, -354, 0, 121, -46, 145, 50, -268, -11, 195, -14, -31, -21, -98, 171, 199, -241, -148, 229, 70, -39, 110, -170, -179, 292, 159, -306, -28, 205, -54, 8, 60, -234, 7, 373, -31, -257, 71, 62, -41, 150, -30, -278, 143, 266, -192, -129, 101, -32, 60, 204, -219, -242, 266, 165, -212, -12, 95, -81, 97, 151, -255, -145, 300, 119, -199, -70, 51, -9, 84, 47, -135, -81, 131, 144, -95, -196, 22, 226, 49, -170, -35, 35, -33, 121, 73, -255, -74, 347, 13, -335, 34, 195, -51, 51, 134, -239, -139, 331, 96, -290, -32, 207, -12]
1059a2n8P5j13N2K81j08l46P9L00pk12k0J37nl1M4j22r9K76J87l83j86L15Q8j71
1084c9Q3Lj99J80K12l18k09L57J77k63r2M5j8J12J15j25j58R5J86r0k01K0K33
1107A06O1j63p7pj1J70J18k42j60K77J16k73o3J76N0k7L1j47j66K15K57j73k45
1130a77J49J64j32p8P7l5J4K15r4l64Q0M05o8k76J09Q8j52J02J03k58k9M08j4
1153B37m68M4L13r3o8J69j34k17K73J76l80q1L82O9k88n1J04o2Q1K01j46k92J89
1176d2K80k28k42K60J33j72K4L0k33O1L97j02l77J25K48j66p7J08q2K2K25j14
1198G8l14P1K99K1j89o2R1L8k9L2m6j17J95K01l19k40L23J31k10P0M3k44J43K69
1222B35k94j84L20J01j83l7p5L0K31l6j94O1Lm9K27j34l19L71K83m78p8L34k27
$$ y = [-12, -70, 5, -108, -56, 225, 117, -229, -150, 150, 143, -69, -89, 48, 43, 12, 56, -66, -165, 111, 298, -85, -271, 44, 132, -39, 44, 47, -152, 28, 240, -78, -287, 70, 247, -16, -108, -63, -81, 31, 146, 21, -137, -42, 144, 54, -147, -127, 106, 167, 4, -73, -80, -91, 79, 197, -45, -205, 72, 188, -85, -148, 28, 78, 51, 82, -65, -231, -16, 241, 68, -177, -28, 136, 4, -74, 3, -32, -18, 197, 103, -261, -181, 224, 156, -120, -11, 77, -75, 27, 130, -128, -157, 251, 237, -231, -187, 126, 33, -35, 134, 0, -217, 56, 232, -148, -229, 153, 222, -66, -117, -13, -75, 6, 207, 61, -231, -42, 238, 10, -232, 28, 161, -11, 13, 43, -190, -129, 268, 166, -211, -86, 162, -4, -81, 27, -55, -33, 192, 78, -236, -165, 134, 155, -34, -96, -5, 33, 4, 36, -10, -127, 68, 269, -50, -290, 33, 164, -46, 24, 67, -177, -34, 235, -59, -243, 77, 178, -5, -42, -117, -87, 144, 108, -86, -25, -22, -71, 156, 22, -297, 74, 357, -121, -199, 135, -92]
1245i2j0M62l35m21N36J48n11J17K80k46J07J90m02m3L87o7j14O4j89R2K67k94
1267g4j15L42j18j22L40l29l64P21R9p59L18M25o63J39O36o97k37R91k89p86N95
1288E3K14n76M03L06p29R5O30m16k40L99j51p1L51l53k79N33jl21K79o9l68M98
1310A87J04o30K27M58m28k2L41m57k7O78l09n10M99M4m08L78M9n22L99M03o54
1331b00q2M84k47n1M08l75l11O12m6n13L73J46m27L38K19p37J41P51m41l53N67
1352B56j89m67O19O8p34L81N85o27k07M82k10j27M84k18m36L96J27l29J60O0k29
1373a55K92J10n62J28M32k77lK95m52q0O56l14m79N95P0n13L75Q8o71M32N89p29
1395a73j30O56m44k45P45l58n67Q11J24q73L52M02n61K72M50p50l2P32m18l24
$$ y = [-92, -102, 360, 25, -396, 140, 288, -223, -106, 174, -72, 35, 225, -177, -220, 167, 100, -14, 50, -139, -47, 220, -74, -189, 153, 35, -87, 253, -76, -440, 281, 380, -379, -61, 364, -299, -160, 476, -221, -458, 533, 244, -542, 53, 267, -309, 94, 400, -329, -234, 396, -20, -260, 139, -12, -83, 268, -85, -364, 169, 168, -153, 126, 57, -311, 187, 291, -339, -112, 346, -82, -104, 237, -220, -247, 431, 122, -388, 111, 155, -253, 125, 174, -348, 51, 454, -200, -282, 202, -45, -96, 312, -63, -374, 238, 192, -321, 52, 198, -229, 109, 328, -409, -268, 483, 42, -311, 256, 67, -400, 219, 287, -447, -66, 519, -108, -315, 167, -43, -170, 314, 96, -340, 56, 183, -146, 14, 74, -155, 137, 247, -315, -187, 245, -32, -35, 260, -192, -272, 384, 70, -409, 186, 256, -257, 118, 206, -465, -33, 556, -173, -303, 353, -91, -336, 409, 51, -516, 295, 419, -454, -102, 300, -261, 11, 461, -289, -321, 411, -7, -331]
1415c31O04k19l62O45j89p04N81L84o39J74L58n79J04N86n11k53O04r0l59K41
1435D5r6j65M55l9m29K08J12k53K80L3m51L28L72n64n7M28k81m5N01l93m36O17
1457A70J15n78K44L00m38J57L70n36j60O50q9m32K33J05k63J63K02l47m3L52j6
1478A59k68k8J53L5MNr8q3J20J30j39j21J41J39j04j23k7M4J38L0j15q1K3J00
1502C4N0j06q3J50R3j32q8K7KJ41R5k56q6K32Mj26P9l6p8K33l6l25J07K47r6m5
1528AN6j99M9K69j47j89J79N6q4P4j26j54L33J14l57K3J98j75M5K24k82j12M13
1551B09n2l75J31J98j50P3J17k86l3L00l3j99N2P6J1M8j29j12J80R9r8k2k3r6
1575a14J66J00k42l9K58m5j32P5q7n4K70Rl13L7K34j14n1J17j54j0K89j33l31
$$ y = [-331, 273, 54, -308, 337, 148, -556, 25, 409, -230, -56, 302, -277, -173, 413, -98, -351, 253, 163, -196, 45, -51, -216, 239, 200, -229, -21, 91, -162, 118, 151, -300, 28, 400, -164, -221, 207, -74, -119, 382, -11, -447, 170, 285, -293, -49, 251, -187, -30, 340, -196, -356, 294, 205, -227, 6, 111, -152, 11, 213, -134, -177, 175, 159, -109, -137, 16, 51, 55, 60, -38, -121, -1, 129, -10, -131, 10, 149, 45, -78, -105, -61, 77, 107, -8, -89, -66, 34, 84, -22, -105, 45, 138, 6, -82, -55, -53, 88, 183, -73, -159, 73, 77, -49, 30, -6, -84, 149, 113, -212, -105, 142, 46, 1, 57, -142, -93, 176, 29, -160, 19, 75, -9, 65, -61, -215, 118, 232, -125, -102, 96, -79, -34, 190, -92, -204, 209, 157, -218, -87, 111, -39, 34, 151, -135, -168, 132, 99, -100, -48, 28, 39, 87, -42, -154, 26, 125, 27, 5, -18, -114, 52, 152, -90, -129, 129, 84, -48, 27, -60, -114, 156, 165, -148, -111, 123, 9, -42, 75, -79, -89, 200, 67, -264]
1598b64K03K16j72J5P4j92L1K62j28k09J75R7r2k0p4n2K22N1j83k1N2o1J40M6
1622A16k74P4L17j97k47K29J4j09K34j4l77J34K93k03j17J81n6j0J41j74j60K42
1644C7J24j39j4m6o9J94M2k49O0K04j45j4L4j71Q3L01j59k56J67O3j16J27oj99
1668a47J60K03k77j43K51L0p2R0r6j76J85J39j78o3J25M3k5p8q0O9J14K2m2j33
1692g9n5J55J14j85n4J93j3j35N1l6o6K01J28k75j31K31K7j08M7L0o3O6M2j86
1716a01o9K08J33j10j38j6M9P5J8m9l9N6O3p3j44M5J87L4j01q0m2L7J16J4j10
1741c7oJ22j6j33k3P1Q3M9l6j67n9J76R7j23o0J06Jo9ql6KJ72P5k13j27J05J06
1768E2k4Nl3j9M7J7j13o2J67J23o1j76m8R9P1J0ol2o1P7J1j76J3K49L2j73l1l6
$$ y = [-264, -61, 155, -17, -2, 72, -120, -89, 173, 45, -164, 11, 108, 16, -4, -78, -130, 92, 143, -40, -61, -9, -70, 70, 116, -158, -84, 233, 36, -211, 18, 32, -77, 157, 143, -234, -100, 193, -10, -127, 54, -2, -12, 129, -45, -205, 37, 161, 22, 8, -38, -107, 87, 129, -120, -60, 144, -1, -15, 19, -152, -69, 232, 73, -183, -16, 47, -69, 58, 52, -147, 13, 216, -61, -204, 47, 77, 5, 95, -1, -177, 8, 147, -31, -94, 31, 74, 49, -29, -109, -40, 74, 96, 54, -79, -134, 21, 135, -50, -104, 89, 76, -59, -8, -44, -110, 91, 219, -56, -187, 44, 71, -37, 10, 40, -23, 43, 85, -101, -170, 38, 171, 61, -77, -93, -44, 31, 49, 0, -39, 17, 80, 7, -137, -92, 95, 129, 28, -52, -94, -57, 59, 73, -37, -43, 79, 63, -70, -93, -22, 61, 110, 74, -93, -152, 24, 121, -2, -62, 44, 45, -24, -32, -68, -66, 106, 181, -32, -159, -54, 52, 28, 33, 0, -19, 28, 45, -68, -130, 37, 160, 99, -77, -125, -26, 45, 55, 49, 17, -44, 33, 44, -132, -119, 130, 162, -11, -42, -78]
1796g8l5J68J01j79n9J50k0j37OJ04N7O0q3j72k2J26R4pp8l5P4j3j26K9J29K3
1822G7J0n2k09lK67N8j83M3K9j06M5L9j23O9K71j26k57M7O8J8J26J6j94L1J01
1847F2q5q0R5P3N5l4j90q5J81R0k1K7j19n2J65q3j77J97J90j89m5M6k08O4L84
1872B61j11k91J59P7k07O7J01j01R7J62k47j87J77Q1M8O1j83p9J70o2j34J88K9
1895G6q3J43r7l46J99L30j83o4J38k06o1K94j50j87L61P2l46L6P1j73K36K39l44
1918d5j03K38j16j27K16k1p3K26j29l16J51J66m6J42o9l15J80K12k99N0L13j88
1940D7j20K46k71k57N37J34m31J02J52l08P6K88k58l7L64j77l16J71L0l6K96p7
1962A55l62J57J30k25J14J92j93N9J85l53j45M06L0j73J85j38l00K92J45l05J29
$$ y = [-78, -113, 55, 156, -23, -82, 68, 48, -89, -83, 21, 78, 138, 55, -117, -139, -13, 81, 74, -4, -39, 35, 22, -104, -75, 54, 77, 87, 35, -174, -177, 90, 148, -35, 8, 37, -69, -24, 15, -108, -39, 232, 106, -151, -104, -36, -18, 108, 124, -70, -39, 62, -23, -103, -8, 65, 120, 86, -104, -189, -8, 82, 61, 88, -31, -83, 82, -1, -178, 19, 209, 20, -25, 21, -187, -123, 261, 150, -141, 18, 95, -112, -45, 56, -45, 52, 214, -33, -220, -43, 38, 86, 147, -36, -115, 55, -7, -141, 47, 76, -7, 136, 39, -307, -108, 222, 39, -25, 113, -93, -154, 140, -10, -197, 164, 236, -110, -74, -3, -176, 60, 299, -45, -148, 90, -26, -153, 63, 42, -31, 195, 66, -250, -99, 67, 21, 163, 94, -221, -41, 171, -128, -78, 235, 47, -73, 173, -98, -355, 182, 316, -115, -13, 139, -169, -93, 195, -63, -100, 264, 87, -229, -58, -28, -64, 232, 155, -207, -50, 80, -145, -31, 161, -32, 27, 212, -141, -286, 120, 150, -23, 162, 24, -276, 16, 161, -144, -15]
1983a5K74k60r8J18j93M2M29j18l22J26lj21J88M0j71J79Q3l50J6J76q6J72K08
2006C14m35j58L99j01k20L65L2l76K70P3n31J96N60l14j98K62k45k09M66J7l61
2027a94K80J57l88rJ69j54J93K41l10j86J77l8K1J90j54j9K02k33k02K89M0r5
2049b3K75j34m61K60K68l07R9L02l25p4K82l09j56N30L7l71J31l4k68L19J90l36
2071a05J04K40l29q8K36j62O7L82k61l44K33L3j32K60K3k86J63Q9l29N9K54l7
2093G0K8J7k98k1K62k8k7J45j49q1J64j86j29L80O2k57J17q3k93L32K85m10K6
2116g4L35l34j55L37j39j34M60n7n47J79K33k09J31K09k97m4K23j70j42K45N6
2137A06m2M1k06j45K69P6r1J16r6j48J73k9k69K64K60k77p1J32k55L6M15j60k78
$$ y = [-15, 259, -1, -99, 19, -174, -132, 297, 179, -143, -17, -20, -141, 47, 87, -84, 95, 178, -172, -156, 20, -66, 106, 314, -121, -279, 120, 19, -201, 164, 196, -180, 90, 163, -368, -172, 388, 74, -124, 138, -107, -316, 150, 167, -194, 86, 243, -145, -154, 15, -139, 54, 295, -15, -201, -24, -62, -41, 149, -5, -24, 178, -55, -257, 32, 72, -23, 252, 118, -343, -83, 185, -122, -23, 279, -46, -120, 162, -147, -303, 227, 264, -107, 24, -10, -278, 41, 231, -105, -1, 239, -90, -178, 58, -104, -37, 345, 84, -260, -27, 6, -126, 134, 157, -129, 34, 123, -206, -147, 107, 70, 98, 115, -183, -204, 58, 30, 3, 148, -1, -82, 82, -104, -233, 147, 209, -48, 69, -14, -307, 25, 310, -100, -74, 261, -73, -228, 109, -30, -164, 296, 239, -308, -129, 104, -105, 26, 235, -62, -106, 117, -53, -195, 50, 106, 64, 105, -101, -246, 23, 99, 8, 124, 28, -120, 53, 24, -245, 19, 279, 2, -69, 63, -192, -156, 259, 99, -179]
2160a79K76j5k93J65J40k01J95K03m23j09L07n5k7K36k04k01K82l4k85K48J68
2181A94k18P4M1l54J30L83j80j69K37j49j85L01n8k62L20J79m10m5K12j46P8K82
2203B55k43j96K59k9k07J78O2j08J65o1l16J44K08j33J03P4l27P5K74k79r0M18
2225B26j14k39K19j12l04M14K18m45N1K65l08l1L31k01j23M00j30l79K18J14j56
2246h6K24M1l57R8K17k34kK28j18j5J82l02j49L99J1k23J95m9l10K59J79l65J02
2269g5L46k55j70K20j55o5L86o1l32J18J11j74Q3J07j39J13J04k34p3J57j0O5
2291F7J12k48r9K43n9j48J89L5j64J45ql01J28L34j57j38J29r8j07K17%k07J58
2314B3J44j97j01J00LP2Q5j33r5N7M0NJ1m7L9Q5q1j77J01J18l8N9k9j81M4K09
$$ y = [-179, 97, 82, -211, -46, 94, -107, 88, 291, -132, -241, 66, 11, -16, 220, 16, -185, 97, 63, -222, 26, 194, -24, 50, 91, -263, -133, 250, 70, -99, 138, -11, -196, 105, 47, -215, 105, 284, -126, -171, 41, -105, -27, 255, 12, -184, 75, 46, -161, 17, 79, -29, 136, 75, -241, -97, 111, -22, 81, 155, -172, -97, 177, -102, -192, 226, 112, -127, 92, -20, -324, 90, 308, -137, -86, 179, -129, -160, 171, -30, -153, 247, 117, -262, -44, 70, -86, 138, 179, -178, -80, 137, -97, -99, 129, 11, -4, 178, -124, -273, 126, 137, -86, 109, 60, -250, 9, 188, -177, -75, 271, 16, -154, 66, -89, -154, 232, 171, -161, -43, 68, -106, -23, 84, -55, 58, 162, -72, -145, 12, 2, 67, 179, -69, -168, 75, 16, -132, 57, 92, -72, 73, 65, -236, -108, 226, 69, -69, 60, -38, -145, 72, 72, -135, 23, 167, -30, -131, -31, -28, 44, 129, -4, -99, -42, -2, 3, 14, -33, 6, 91, 10, -167, -66, 52, 14, 73, 44, -137, -93, 116]
2340A16j00j24J66L7j35K8J1j11R9K04j22j72M6Q6l3OOj3K2L2o9p9M0J27M8r9
2366A7r9N0N0j6L6Op0M7O7j27j06J60J11j08k6Kp4N5J33r1j10J14P5j18p7P6K7
2393DJ3O1q9j09O7J20k4r7L2P2l7m2oj5K6J24k1j56m6J45L6p6pM7j5%J3o7k6J09
2423C6R1j16j22Q2N4qk0J7m9J0R7o1j21O9J50n9r4LJ9%Q0lj12K0J00k3r8PQ2K7
2453E8l1m8k2mO4O6q4r2J02P2j00n2P0MPO3o9j32J38J08j25n1P2j0jM2n8o7J16
2482C6P0j03q6N1N9J9k8o5J4M9JOn9m6J18P2j54o9J37om3Q4p5j02J43J05j81n2
2510a05J53j5n9L2n2l7J32K4j25k2N4K6L4n7n7Q5N2p1j0J0n0Q1R4j67o2J87mj22
2538e1O8oo6J14M8j91j3J96l2r2L5j7j9R5k8j12L0Q6mk6m4m0J05M7j15j2L0PL7
$$ y = [116, 16, -108, 58, 95, -40, -12, -1, -112, -13, 191, 69, -103, -57, 29, -4, 2, 8, -5, 17, 49, -20, -99, -59, 68, 116, 17, -82, -32, 18, 2, 38, 44, -26, 21, 88, -39, -145, 15, 126, 18, -8, -6, -80, -25, 108, 17, -93, 21, 96, -22, -99, -23, 4, 17, 78, -11, -120, -53, 67, 43, -54, -22, 50, 13, -29, -35, -50, -24, 100, 79, -77, -123, 22, 58, -18, -25, 22, 7, 7, 20, -47, -73, 36, 127, 11, -111, -29, 25, 17, -3, 14, -35, -25, 72, 11, -110, -41, 109, 50, -44, -41, -22, -22, 58, 55, -57, -37, 63, 40, -58, -51, 31, 58, 27, -21, -43, -47, 17, 83, -1, -93, 9, 81, -19, -71, -1, 3, 10, 73, 4, -128, 10, 118, -7, -58, 14, 4, 3, 45, -13, -80, 36, 106, 3, -83, -32, 27, 46, 18, -47, -33, 16, 17, 23, -36, -82, 36, 108, -46, -115, 22, 16, -27, 57, -18, -120, 23, 128, -53, -105, 48, 33, -26, 6, -46, -83, 49, 73, -52, -74, -20, 6, 40, -17, -74, 11, 63, -8, -18, -8, -58, 23, 117, -50, -112, 75, 71, -51, 17, 11, -55, 59, 107, -84, -97, 99, 67, -25, 10, -7, -26, 69, 41, -71, -41, 45, 41, 15, -29, -69, 36, 83, -32, -44, -14, -7, 30]
2567C0K2j34J3J72m2j49P5K7m8R2J0j73K5J93q8r8P4J4k9Q0n0j30R8J23j05m7
2593d5K7m0Q6M0j25l1J56l3o0M8n9n6J82J5k23O3J59j05l1J05j27j8J85n5j86
2618a28Q9R9o9J3k7n9Q5P5j09j8N6m0O8M0j63J2K02q8j27J04k1p4J55Pk16R6J83
2645A45j53n2J02q5J5J58j38j34J83M8j43N4K9j19J24Q2j99jJ47l5l4M0j05K4
2669d7J65r1j25J19Ln9J04o9j51J87J03j89k6J32q9jJ27j21r0J71K2j26RJ9%R6
2695G3m7j43R1P7o7J1K8j01P9J12j44q9J36M1o7L9o2m2J11L3j07kN0j1M7o0p8
2722i2Q4J04r0l7K5l8L6R1r9o3J10K6q6jQk3R5L3j45pQ8Kj9J6m4%R2n2q4J5R6
2753D1J6l5p6kO5Rk1J0l4JJ12o0j50J04J26q8m6M8q7MJ59n2j51J21O5j10KL2n3
$$ y = [30, 52, -82, -69, 103, 61, -88, -13, 14, -34, 58, 68, -105, -80, 113, 25, -73, 1, 15, -14, 66, 16, -114, -16, 107, 2, -45, -18, -58, 28, 68, -57, -88, 68, 35, -25, 23, -36, -92, 90, 105, -118, -55, 104, -1, -32, 73, -54, -72, 113, 58, -128, -39, 60, -9, 4, -23, -82, 3, 78, -31, -49, 7, -33, 35, 75, -88, -76, 126, 38, -89, 15, -6, -80, 75, 82, -134, -38, 145, -8, -60, 42, -43, -28, 130, -8, -142, 41, 89, -54, 0, 29, -90, 34, 116, -83, -84, 63, 28, -6, 34, -71, -47, 118, 27, -98, 21, 24, -35, 69, 0, -151, 36, 139, -50, -76, 56, -33, -34, 93, -28, -118, 53, 75, -51, -42, -23, -23, 73, 26, -117, -26, 51, -16, -5, 23, -78, 1, 113, -31, -120, 16, 57, -10, 29, -33, -75, 36, 69, -38, -40, 10, -1, 46, -14, -92, -8, 96, 6, -31, -6, -44, -8, 83, -16, -79, 31, 57, -29, -30, -22, -45, 50, 83, -62, -69, 19, 21, 2, 18, -26, -26, 66, 14, -70, -55, 41, 57, 22, -54, -56, 9, 18, -3, 7, -27, -26, 86, 26, -124, -20, 106, 18, -28, 20, -67, -63, 96, 44, -107, 14, 79, -31, -29, 3, -50]
2782e0P4J02j51p0J16nj6M9m8p3J17L6j82J7J51k4l1Qq8JJ30j6q0J0L8nrm9l3
2811h1J01M9q7k5J7m4R5M9j51J8J29o7p7P9m1rJ49l6k14J03J31j48M1Q4j34J4
2837e5J91j57j52K31N1j70Q3J6j80J30J64k03k5J71r8m7J08j26k0K03l6j94Q7
2860b8N7j02J25L1k02P9J62j70o8J67o0j0J33j33j51J88M5j09O2pj03J29L5j95
2884a25N8J82j17k9P5j45OK28j05j60J86Nj53J18J8j67J60J46k49o4K11r0l4J75
2908A30j28j38K23Qk19P6J27j00M6M7j88K4J72n8q2Q2m4k8J11p4j09J45Q7j35
2932b5j5L4q6J05R0j45l2J34m7p8O0k3mJ20m5j31L9O4j2K5j3q9O9O3j05j7J07
2959D3l7MO0j40m5J74J9j27M5L9p8N2N7j41J4J76o9j02L0J3j3Q6Lj22K7P2l2m3
$$ y = [-50, 24, 126, -25, -95, 21, 16, 0, 49, 1, -72, 45, 81, -101, -84, 67, 43, 12, 20, -68, -67, 63, 47, -33, -23, 15, 10, 1, -48, -81, 20, 69, -18, -43, -26, -70, 25, 74, -77, -59, 70, 3, -74, 5, -36, -45, 104, 68, -146, -43, 88, -60, -19, 65, -69, -55, 136, -21, -173, 58, 109, -61, 22, 38, -142, -12, 152, -51, -76, 95, -3, -50, 58, -68, -88, 115, 79, -115, -28, 29, -73, 52, 83, -119, -40, 122, -48, -116, 51, -9, -19, 114, -19, -170, 18, 63, -46, 16, 9, -94, 35, 70, -125, -67, 115, -2, -31, 44, -101, -95, 133, 28, -132, 54, 59, -94, 24, 42, -125, 35, 181, -68, -132, 79, -11, -45, 130, 2, -136, 87, 95, -124, -48, 79, -21, 25, 72, -116, -92, 80, 22, -60, 22, -22, -50, 61, -13, -122, 23, 110, -25, -40, -6, -92, 13, 103, -42, -74, 60, 13, -65, -5, -28, -32, 88, 43, -88, -49, 15, 3, 28, 15, -74, -5, 58, -47, -64, 43, 6, 10, 70, -70, -115, 59, 78, -49, -4, 35, -43, 9, 66, -75, -61, 115, 46, -56, -26, -13, -26, 60, 63, -59, -32, 40, 8, -35]
2987c5J1ON9J5r3n4O6M2qNn2j3Q8rr6L9N8Mqm4m1L9P5j6o4qK7L3j5o4J1Q8jn2
3021gk3l5L7J02l3q7L3J6k4J2kk7L1Q6o5j05P1M1J5j9k8m6O7M5p2l6O9K6j3l8
3051io4L2Q7j3m1kj7L2L6n6m8P0N6o5m1KRQ0K9r3k7O0rk1J0l2L6Q4o0r9M9M8j3
3084A0K9rq9M6P7o9m0N0L0k8K9o0o3J07N3q4l0L8LK2Rp3PR8k3n9j0j4L4Q2o0r2
3116g9Q9K5n8J0J2n6P8P9j30o1J12ml4L8m3l7Q1K9j11K1O9j9Pj6o8M3R4l6n5J3
3146gnJ7L8o7m6J08L9j19J9K2m4N7Q1j46k1J34l3q9P0qm9J15qj43L8J09m4l2J7
3175Cm3L1O3o5o7Q2K5mj0n7l1J28Mj15M1M6o6M4L5j32K0J71o9j26Q1K7m1O6rj17
3205h5P5J00r8l4O5l9L2O8j33m0J30Mq1N4j3o6J04L4j62M0J30p0m4N3q1J5J30
$$ y = [-35, -24, -18, 41, 56, -37, -91, -25, 17, 9, 14, -38, -51, 37, 28, -68, -29, 29, 33, 25, -19, -60, -21, 54, 38, -26, -34, -7, 26, 11, -53, -42, 46, 45, -7, -30, -65, -28, 74, 41, -46, -13, 3, -21, -9, -11, -38, -7, 79, 14, -91, -20, 21, 36, 17, -11, -57, 10, 55, -17, -53, 16, 42, 29, -9, -73, -41, 46, 33, -8, -10, -27, 5, 41, -15, -63, 7, 63, -2, -43, -41, -32, 48, 77, -16, -43, 17, 8, -13, -3, -35, 1, 85, 25, -74, -25, 23, 10, 39, 30, -59, -13, 64, -5, -45, 5, 35, 7, 36, -24, -87, 20, 73, -11, -41, -3, 0, 22, 31, -42, -35, 63, 40, -19, -29, -43, -9, 73, 13, -79, 10, 35, -23, -13, -1, -57, 21, 100, -30, -91, 21, 17, -17, 21, -22, -59, 22, 51, -60, -39, 30, 11, 18, 2, -66, -23, 71, 35, -20, -7, -12, 5, 43, -24, -70, 38, 77, -42, -23, -1, -45, 12, 93, -53, -74, 60, 27, -62, 8, 0, -49, 66, 58, -85, -47, 62, 18, -14, 3, -40, -9, 54, -11, -78, 4, 29, 25, 15, -42, -73, 55, 59, -56, -15, 31, -35, 9, 44, -88, -68, 103, 34, -92, -11, 16, -25, 41, 32, -85, -10, 90, -8, -42, 23, -16, 16, 84, -49, -89, 41, 45, -36, 18, 5, -61, 43, 77, -85, -45, 85, 15, -29, 24, -57, -42, 88]
3232H8o4j28J12L3p2L8oq5R5Q1j27j9P8j7j3M4p8j5J22l9q4N1kk3R5l2j49J07
3260iJ10j17m8J26r4j3J46q4j31J38P4j22LK8m6N6N0j15NQ8l4j3J5p3J7J39o4
3287C2j51J25L1p1M8Lj05O2J22r6q1R3Mj9N8p3o2J07K3q2J5J8j7N4Kj09K0J07
3315E8k1p4J9j5J6O9n8o2P4M0n4JRo2Q4Q3j38o6J48pq9M9Lm1N1N7r2n2R7M8n7
3346A8m7J2L1J3k0j8jk9O6K8j05l1J18L3j03JM8m0L1L3p7k8J15J3r3qK8LN0k4
3376A7o4KQ9rn0KjK5K1k3o0K7O6J8o2n8L9O1l2l3K5j6J1N2m8p2M9Q4l1n6J3J3
3408aJ3K1o0oL5RK3l8p0M0J12n9q3N0L2n3L9K2r1L7R8n1j07O0N5kk5l2NM9nk3
3440fJ4l4J3P8l0j29Q5Q8j06J7M5q4J7J19r7q8J20L8j05O3pr2J04Q1j53l0J48
$$ y = [88, 24, -104, 8, 41, -31, 7, 1, -84, 11, 92, -35, -54, 24, 7, -6, 38, -40, -55, 67, 28, -56, -5, -7, -30, 65, 33, -116, -9, 101, -16, -64, 62, -32, -45, 101, 17, -114, 24, 98, -24, -21, 7, -39, 17, 67, -48, -43, 45, 11, -2, 13, -60, -43, 96, 32, -119, 6, 37, -34, 14, 17, -88, -26, 96, 0, -81, 12, 16, -3, 55, -18, -80, 27, 50, -32, -17, 1, -16, 38, 40, -69, -49, 58, 37, -37, -18, -33, -17, 52, -6, -68, 6, 46, -8, -7, 2, -60, 24, 107, -31, -97, 51, 44, -45, 4, 7, -34, 17, 74, -18, -70, 27, 75, 18, -29, -17, 14, 27, 7, -11, -12, -41, 25, 53, -52, -83, 35, 68, -35, -34, 14, -26, 5, 38, -39, -67, 48, 61, -32, -40, -12, -9, 41, 17, -47, -45, 44, 35, -15, -13, -14, 11, 32, 9, -51, -24, 42, 60, -2, -60, -21, 40, 8, -25, 0, -16, -5, 47, -1, -73, -24, 60, 29, -27, -14, -1, 12, 33, -27, -33, 2, 11, 34, -4, -74, -34, 78, 19, -64, -14, 18, -35, 4, 26, -65, -28, 70, 19, -88, -28, 27, 25, 0, -32, -27, 22, 17, -6, 8, -26, -13, 65, 35, -94, -9, 79, -27, -10, 35, -49, -32, 87, -10, -98, 22, 60, -45, 18, 11, -81, 23, 104, -49, -79, 69]
3467F9m2n7O7o0m2J11Pj20L7N6l2L0k5q1Q3P3r6jM6p4L7J04j35r1J93J9j56O4
3495a6N8j15P6R8j59k1J33j4p9M7j7k3J03m0j09P9L5m5M4l4q8J14Q0j65k6J52
3521F8o0m8J02o2r8J49L8j80M6J07r0J7O7j02l5J64l1j29P5L1m4N4j3j01N8Q7
3547G0p0m9M5j1K5M4q9l3J03j3n3M4k8m9J33Jj49L1J33q2l5Q5p2l4J37l2j34Q0
3575bO9p6J4K0o0M3P2r7k1O3k6kN0q9m4J51%j53O7O0q6N5O8j56PJ81p9j11P7K8
3605B3n4N9jr9M5R1n5l7J3oK9L0r0qQ3Kl3J2m5K5Q6n4q9N6M2n1M5J8j19O2J23
3636A03j08o1R6ll9M6j6r1Q1P3r4l8N4jJ3kn1J5N5j2n4J1k5O3M4p1q5R1N0o3J5
3667dJ8n2M0O7q8o1Q6M1l5l5KOM1Kk8l0K3L1J3q3J3O9j1m6J8k2k1Q4K4j24J5Q4
$$ y = [69, 27, -30, 37, -23, -65, 46, 53, -67, -30, 26, -6, 24, -1, -82, 1, 74, -22, -23, 23, -51, -14, 90, -45, -136, 57, 76, -80, -16, 42, -73, 3, 101, -58, -79, 54, 40, -39, 8, -9, -32, 71, 31, -78, 1, 36, -9, 35, 1, -87, 27, 107, -58, -84, 68, 8, -40, 62, 0, -98, 51, 89, -91, -45, 62, -28, -11, 56, -46, -81, 83, 52, -77, -2, 29, -15, 39, 26, -75, -17, 70, 0, -49, -4, -15, 10, 54, -35, -68, 35, 22, -31, 13, -15, -64, 69, 70, -79, -48, 85, 3, -32, 53, -19, -53, 84, 52, -82, -2, 67, -9, 5, 25, -35, 8, 80, -17, -38, 25, -1, -3, 47, -42, -86, 65, 65, -88, -21, 39, -47, 8, 76, -80, -73, 108, 29, -82, -5, 23, -31, 28, 27, -72, -27, 64, 9, -28, -15, -21, 8, 38, -52, -60, 23, 25, -8, 4, -41, -16, 70, 16, -73, -17, 25, -26, 19, 37, -82, -20, 103, -5, -66, 30, 27, -12, 34, 18, -73, 8, 81, -13, -51, 3, 2, 15, 13, -38, -23, 32, 20, -34, -23, -48, 15, 59, -12, -97, -6, 44, -19, -4, 14, -38, 2, 69, -19, -80, 6, 47, 12, -23, -21, -15, 26, 28, 0, -30, -7, 24, 37, -46, -33, 36, 25, -21, -3, -25, -46, 38, 62, -62, -47, 37]
3699C7k9k8K8j9k0R2k0j11J5J04k6m3J6mlK3Mn9JO8K4p3j8L3K7pj1mm2K4O4m0
3731Co9O9M9o1j2J0k8M0N0o5k4L9L6l9Kj3rO1kp6qO6lPk0m3JP3j5n8J9L3MJ3n4
3766b4k8O3M1n0k6RjJ5K2m4k0O7K5p6j7M4J3OKm9k2O7J2l8k5J7L8ml3l1M0K5J2
3799C0j0n1JO0J4q2jO2Jk8J3l8nQ3kr4OO0k6K0J1p4L2O5m0o7N6J7oL1m8m6M3O8
3833E5n5l0L3KJ3J4q1RQ4j2l8loj2P9l7p6M5N6l6k8J7k6K9O6o6n1M7K6Lnn4RR2
3867F3l5o9K8K7k4L4J5j16M2J16p8l9N7j0l7P1k8r6P4Q2o6n4M0j4NM5m5m4O8J0
3897B2l7pn%O5j5q1L1M3l1L2lo6M4N8n4o6P7J7k8K5l2p0P8P2q2m4Q2j1k1J2k7
3929b2k0P6K4p1l1L5K4K5l0m5L5N1n2mRl1M1O4j06n8J14J6q3L4K1m4J8O8p8n3
$$ y = [37, 8, -20, 8, -11, -31, 61, 41, -70, -55, 49, 23, -20, -4, -8, -11, 12, 16, -43, -42, 26, 50, -23, -41, -8, 19, 12, 1, -3, -45, -21, 43, 3, -66, 3, 52, -9, -21, -11, -39, 1, 51, -14, -38, 1, 37, -2, 0, -13, -22, 39, 37, -39, -47, 19, 16, 23, 3, -40, -39, 34, 19, -39, -20, 13, 17, 30, -24, -52, 11, 52, 2, -24, -15, -16, -1, 21, -23, -43, 24, 49, -27, -44, 0, 13, 19, 21, -28, -50, 17, 29, -9, -34, -17, 21, 17, -16, -47, -7, 18, 30, 20, -31, -30, 30, 44, -38, -39, 23, 24, -4, 9, -29, -34, 49, 47, -47, -41, 19, -7, 13, 24, -50, -18, 47, 7, -60, -4, 13, 7, 38, -10, -56, -13, 55, 0, -30, 3, 5, 18, 32, -49, -40, 44, 32, -6, -9, -15, -27, 52, 15, -61, -16, 40, 4, -24, -7, -33, -4, 62, -4, -55, -8, 18, 21, 16, -38, -29, 63, 28, -41, -13, 14, -10, 24, 39, -77, -35, 81, 3, -36, 21, 11, -26, 45, 17, -79, -5, 77, 11, -43, -3, -17, -12, 33, -12, -56, 12, 22, -15, -22, -27, -27, 38, 23, -58, -27, 16, -15, 17, 14, -52, -8, 50, -4, -70, 7, 24, -4, 21, -11, -81, -3, 69, -13, -57, 25, 14, -7, 5, -22, -42, 34, 58, -13, -44, -9, 15, 40, 10, -35, 0, 51, -1, -5, 4, -27, 14, 78, -28, -86, 28, 44, -39, -5, 16, -28, -10, 58, -20, -73]
3959g3Q7M6p7k4L4nJ8K0k4l3J9N3k6n3%O1J6n6j7L6k1L1L4o0m5P8L9p9oN6j3k6
3991a0M7p4l3J05M0j02pN2k5PL0m5l0Q9K5j12mN6J3j5Jl1NL4J2k8l8L0M8j1r7
4022f8J1R3j5k3K4l8m5O2M5q4j7J03k2o0K5Ql0N6K1n5l5M0N5n7k0L1L2nm8k1K0
4053a7K6J8K5p3k9O9K1o0mO3k7k0L8l3m1R2L1r7k2P9l0k4M2k4n4R2K2j18nJ09
4083D9k1l9K8k8m3O2L6p5j6L9L2j7n1NO8%m0L2l3o0J11M4j43K2J35p6r8R2Mq4
4113f5J16L0j48k0J36k8n3M1Jj7M4l2m8L5M1j7J2o3k5J00Jq6M1M5q1M8L0r9oJ72
4143A05n4j33Q3K4p9O2O1j34K0J20p0j00Q4L9m9L8lo9K8O0j3j6k4J4N4l9p6O0
4171gN6m9KM6j09KJ54n6j16R3O4j21J5Q4r9RJ29o6j30R5L9n2J8Pm8M4M6p9k2N7
$$ y = [-73, 14, 60, -17, -41, -7, -12, 6, 26, 2, -31, -12, 41, 15, -38, -38, 23, 39, -17, -34, 2, -19, 12, 46, -14, -59, 19, 58, -21, -27, 29, 16, -10, 37, -37, -70, 35, 75, -27, -34, 18, -7, 0, 30, -15, -45, 44, 69, -43, -47, 9, 22, 7, 8, -23, -18, 16, 28, 0, -38, -8, 40, 29, -68, -57, 36, 21, -2, 22, -16, -61, 1, 46, -38, -55, 48, 26, -34, -9, -1, -31, 25, 46, -9, -44, -4, 51, -6, -26, 5, 37, 32, -16, -37, -17, 9, 27, 52, -21, -50, 19, 40, -20, -24, 39, 12, -8, 30, -3, -44, 48, 79, -18, -40, 39, 9, -15, 27, 3, -51, 41, 63, -55, -60, 49, 28, -11, 17, -11, -54, 8, 44, -31, -47, -8, 24, 7, -44, -39, 29, 29, -11, 21, -12, -72, 39, 83, -60, -38, 97, 21, -77, 15, 19, -65, 51, 81, -67, -87, 49, 21, -32, 9, 10, -7, 37, 5, -43, -8, 33, 16, 28, -35, -60, 40, 41, -45, -4, 41, -40, 8, 38, -61, -67, 105, 51, -82, 1, 25, -54, 8, 69, -65, -45, 75, 5, -95, -11, 28, -21, 17, 14, -55, -27, 33, 20, 4, -20, -6, 48, 9, -67, -7, 49, 0, 2, 48, -61, -59, 95, 39, -77, 16, 80, -41, -26, 58, -41, -32, 97, 31, -99, -4, 35, -17, 1, 8, -40, 4, 50, -29, -51, 6]
4201FJ4J6rp3NQ9l1m9M3j7l1P5k8j04Q0R8q3n1N8j8l0J04k9j05O8O1p4m5O1J3
4231A4QNk1m3L6L3Rm2k7L7N2p8k4P3j4k6O8l8j10P9J08j16l5R4j8p1N8J6j06P7
4261bR2j17n9R4J1j1K0j8l6L2J3l9j7J0N9K6p3k4M9Qk2J8rm7N1L6p8k1R7jn8J1
4293ej5k6O5L6p1j5L9RJ2l7j9N5Lj7l1knN3K5q0lO8j7p9M1J7l3O3J5q0k9R4J4
4326D5o8J1K6l0%L1k1l4O4K9p1m6M4N8l0k1L3l5j2N2j2p4N2O4k8o2J5J7j1N1j
4357C6o1oO6j9m5K7L1J4k8l3jK6J8J4k6l2J0N7m6m3M5K4l3Q%n3L3P0m3n6L8K1
4389A3j4j3J3k7L2L9l3n4RN4lk3jJ8LpRl4rM8M7q7m1O0L7k8qOk5OO7n7n3P8Rk6
4425El1PQK5J3l6k5L0J5Rl4l6N9L5l7l0K6k0K8L9n1n5N8N5q2j1M5mj0L1m3j9L7
$$ y = [6, 20, 36, 27, -46, -41, 48, 17, -32, 11, -6, -37, 38, 10, -94, -14, 84, 1, -50, 8, -10, -40, 64, 35, -70, -2, 59, -15, -60, 1, 14, 22, 27, 6, -37, -1, 32, 41, -1, -28, 9, 61, -17, -41, 32, 18, -8, 60, 22, -88, -9, 99, -17, -52, 42, 24, -47, 11, 27, -79, -2, 90, -27, -86, 8, 19, 8, 28, 10, -26, 6, 19, -20, -37, -27, 32, 58, -15, -39, 10, 18, -4, 14, 5, -42, 9, 45, -33, -54, 43, 42, -16, -5, -20, -46, 19, 55, -16, -31, 8, 17, 29, -8, -27, 28, 31, 14, -17, -19, -24, 29, 54, -26, -29, 39, 22, -57, -16, 1, -32, 31, 46, -34, -63, 31, 45, -23, -12, 14, -16, -16, 15, -6, -40, 24, 53, -18, -64, -20, 38, 8, -13, 20, -15, -27, 25, 13, -61, -9, 55, 27, -35, -20, -3, -14, 37, 36, -25, -31, 35, 16, -29, -2, 29, 43, 15, -18, -19, 7, 25, 39, 13, -19, -9, 48, 2, -41, 4, 28, -5, 3, 3, -50, -17, 53, 10, -46, -8, 13, -1, -14, -1, -28, 4, 43, 10, -44, -35, 19, 16, -7, -8, 10, 13, 6, 15, -19, -28, 20, 67, -20, -61, -1, 36, 8, 0, 6, -19, -13, 54, -3, -56, 22, 31, 5, -26, -19, -11, 14, 27, -9, -34, -4, 11, 20, -14, -50, 9, 44, 7, -23, 3, -17, 11, 50, -1, -56, 2, 57, -25, -36, 9, 5, -5, 26, -17, -36, 1]
4458AL5m3k5J6J6J7l1kJ6J0J1J3o8j6P8L1r4QN8l6j3N3n1m0R8K9j04j1Q6n0j7
4489b5M7k0o1R1J2q6NO1J3l7k0mJ4K2Lpk3oM4mo7J3O8k3l8J9k3k0P6K7j05RQ0
4522C5j1o4K2Qj6L5J7p4J0O4ok0k5J6J3J6k1j3LK8K2j6p8K3R0l4o5M4Rm6M6K6
4554C8r2K8R2m9q3N1M1n1M2J9q4J6P7k0p3J7N1nol3lK8oJ9j4l2QP1n0n9N4L8m8
4587a8QJ9n6J5R6l9q5O3N2o4RJk4K8L7l4l7K5K7nll7rN3Jl4kLLK7j1o0L5M8k8
4622Dk1K2l1QM1k1q2P3P2q5j6L3j4jN4k8o9M9M6m1k7J7K7Nj1l3OJ7J7K3k5n3M3
4655aM4n8l1N7J1k6L3l6m0M2P5m2n1K0MnJ1rj5L5K9n5k9J9K8J6j2n4K3M0k1k5
4687b3JK0J1J6m0l9K3M7l0OJk4K9L1l0l7M9L1n1j6J6j6K7L9m9n9O1L2l3k7L8J4
$$ y = [1, 36, -7, -32, -16, 0, 17, -14, -16, 0, 10, 21, 34, -34, -50, 28, 59, -35, -27, 31, -5, -18, 35, -16, -56, 42, 71, -33, -44, 42, -8, -25, 22, 2, -59, 32, 44, -42, -37, 24, 37, 0, -20, -24, -10, 12, 15, 8, -15, -21, 23, 19, -48, -35, 33, 10, -28, -9, -32, -52, 24, 51, -54, -45, 35, 24, -40, -18, -10, -26, 9, 26, -48, -38, 26, 20, 0, -25, -9, 4, 20, -1, -14, -11, 17, 39, 23, -55, -32, 58, 24, -41, 3, 12, -34, 12, 38, -54, -26, 66, 17, -66, -15, 26, -25, 17, 36, -48, -32, 45, 25, -48, -31, 20, 15, 9, -24, -27, 1, -5, 14, 0, -32, -24, 47, -3, -62, -8, 30, -18, -10, 9, -47, -32, 64, 25, -60, 3, 55, -9, 0, 1, -23, 5, 42, 8, -29, -4, 23, 18, 15, -22, -31, 22, 23, -11, -13, -10, -7, 20, 9, -51, -16, 32, 4, -17, 5, -26, -18, 23, 2, -80, -7, 65, -20, -36, -3, -17, -18, 36, 8, -61, -12, 34, -7, -34, -17, 10, 15, 4, -29, -23, -6, 11, 34, 9, -44, -1, 43, -15, -46, 11, 22, -4, 29, -7, -47, -5, 70, 28, -23, -3, 1, -4, 7, -2, -17, 18, 47, -8, -37, -18, 10, 26, 14, -40, -17, 23, 2, -23, -22, -2, 9, 25, -15, -54, -31, 16, -14, -8, -7, -31, -2, 29, -1, -38, 11, 42, -9, -25, -9, -25, 2, 41, -8, -67, -6, 26, -7, -34, 4, 18]
4719A8Mom1KL0J2J1l4l4M4J9l8j7N0qk0L6l7m4P0N2p4l3N4j5j2J6pm7O6K7q0j3
4752d9M7Mj5K1k7k1N6Qo1LN3roj3l3K9L5j7k3NnQL2j3m8O2Ml5j0QnM3Qn1j1N9
4788C3k3j7J6l0RM8l1n8L7K8j2J3No0L6O8p1l5O8j0l9L4j3o2N4P0q1n0P6j7mK4
4820Fj5l4N9J7o9%L5jJ0qn1K7M6pk5kJ1J9J3m9k0O6%k6mj1j9O1K6q8jP5l8l1M3
4855A5j7l3P9rq9L4N0k6j5K5l4PN9m1n2M0J5j1J6j7n7O6L4n7j4M7j8JJ6n0oQ2
4887D0j4n3j1K7KJ8Jm6K6L9k9k0J6MK6Nm5k1M9Pj1Rl5lM5Pp2QO1k0pOm0%Q0k1
4923B8o0K8K0k3qPj9J4N4l1n4J8J6LJ8k7NK1J2l2k1K0J9j1J4l9%K7J9k7rJ5oJ7
4957HJl7JN8Ln1kJ6J7K6k2l5J4J8J4l0j4K6K9j7m3LJ4J4Kj0l1J6L3j9l2J2J5J0
$$ y = [18, 22, 16, -25, -23, 7, 19, 30, -4, -38, 6, 25, -13, -30, 20, 12, -8, 28, -9, -53, 17, 69, -5, -38, 16, 1, -11, 5, -2, -49, 17, 44, -36, -49, -2, 2, -13, 8, -19, -40, 16, 24, -37, -34, 19, 10, 4, -9, -42, -13, 22, 5, -18, -13, -18, -10, 22, 9, -39, 23, 27, -8, -18, -10, -15, 28, 36, -15, -26, 33, 10, -7, 9, -21, -12, 36, 5, -53, -16, 12, 0, 13, 18, -42, -6, 62, -9, -44, 24, 14, -25, 9, -4, -66, -12, 58, -23, -73, 3, -14, -18, 6, -9, -43, 16, 33, -36, -36, -1, -2, 8, 0, -51, -24, 22, 15, -10, -12, -1, 18, 31, -18, -38, 28, 28, 2, -2, -13, -32, 29, 55, -33, -34, 41, 3, -28, 15, -2, -35, 44, 35, -54, -20, 30, 4, -11, 14, -20, -13, 46, 5, -47, -7, 8, -3, 13, -4, -61, 5, 39, -18, -32, 15, -3, -2, 14, -36, -42, 40, 26, -27, -38, -11, -9, 9, 10, -36, -10, 29, 0, -20, -4, 0, 26, 31, -14, -35, 14, 21, 10, 19, -16, -19, 26, 33, -39, -31, 30, 10, 3, 9, -31, -31, 49, 28, -32, -4, 16, -7, -15, -8, -27, -13, 41, 10, -44, -26, -10, -7, 11, -16, -11, 10, 22, -10, -31, -11, 8, -3, 11, -28, -28, -1, 18, -9, -18, -3, -9, 8, 9, -28, -27, 31, 34, -17, -19, -3, 14, 40, 18, -17, -3, 15, 29, -1, -15, 11, 40, 23, -20, -17, -3, 11, 13, 3, -28, -12, 21, 2, -30, -18, -3, 7]
4991Gkk6k5L5M7k3m5K5J3Mj4j6nK8J9j6l8OK9Nr%j4jK7k0j9K9J3J3l1jj9L0K6
5026C2m3oKK6J2l5PPPK4m5k8L6L0Jk4k0QL0qk3j0J7J0qk5j0K5L2ol5j6L0K6k7
5061gj6jK2QJl0j0L9K8l3j7MJ4Nonj5L1K1k9l9L6K5j5mrk6K6M2o4j8M4K1j9rp
5097a2k2N0L0m4l7L7J7k7pJ1j7K6J5l1k4K9K0ql0mJ3K0lj2j2J1K4rm4nM8J6k3
5130djk2qN3jm8ON7j3k4Nj6J6L0pn7J2M0Lj6j6k5L8K3m0k3K6K4jj6r%K7K3l9J
5166bLJJ0k2k4J2M0mk8j0K0jJ1k4j0J0K3jk4j5J8L8j2n1J0K5J4%ol1J1L2k5k6
5200c8J5M2rj3Nk9J7N1l2m2K0M0j8j2pj8RM3k8k6J3K3Jj3mj6K5J4l8MLK8kj0l3
5235c5J5L5j0j3j1QNK2k9n1N8K1j9k5L1l9K9J3l0k2L4M7l3k6j0M3j%j7jQJ5J1
$$ y = [7, 5, -21, -46, -11, 36, 13, -32, -7, 6, 10, -4, -20, -25, 3, 22, 6, -32, -26, 3, 8, -1, -1, -15, -16, 11, -9, -28, 1, 14, 27, -4, -5, -24, 6, 32, -11, -17, -15, 11, 23, -12, -5, 2, 9, 33, -12, -40, -4, 26, 27, 3, -17, -9, 21, 13, -10, -20, -3, 7, -1, -26, -36, -11, 21, 15, -20, -36, -6, 20, -7, -23, -24, -2, 6, 7, -23, -33, 6, 34, 1, -16, -12, 2, 7, 1, -4, -19, 12, 33, 4, -35, 1, 26, 11, 7, -2, -28, -2, 40, -24, -42, 2, 23, 4, -5, -12, -34, 16, 46, 2, -35, 2, 19, -8, -15, -4, -21, 5, 20, -11, -35, -6, 14, 6, -24, -28, -15, 5, 2, -10, -22, -11, 13, 4, -40, -45, 3, 19, -4, -5, -27, -35, 18, 17, -31, -25, 32, 19, -5, 0, -16, 0, 30, 23, -34, -22, 18, 21, 5, -11, -36, 2, 25, -15, -38, -12, 12, 11, -5, -14, -14, 13, 36, -3, -2, 1, 2, 12, -10, -34, -22, 18, 14, -14, -24, -4, -5, 6, -18, -28, -18, 5, 4, -20, -35, -17, 21, 9, -42, -32, -7, 7, 7, 1, -30, -19, 13, -12, -38, -23, 19, 10, -3, 2, -27, -10, 41, 9, -33, -13, 27, 9, -3, -10, -28, -19, 24, -4, -30, -17, 6, 7, -6, -10, -26, -1, 13, -25, -21, -18, 10, 8, -2, -35, -20, 15, 5, -8, -19, -11, -6, 16, -13, -64, -6, 15, -4, -29, 2, -37, -8, 5, -25, -47, -13, 34, 1, -25, -35, 8, 7, 7, -10, -11, -3, 12, 23]
5268B3k9k6L6K4k3k9L1K2k0L1l8m5M7N0o0j8L9j3%J5k0l3M5J4k9k3K1nK5ll6P
5300b0K3Rk4KKJ1Ok3k0K6J0rkj3nL5J4o6J5L8%mqj3OK4J1l7kJ4Rn%k2K0K4k0j2
5338fkK2J2Ln3KK9Mj9pRnRJ2l7pM7J5n2KJ7%J1kk5qM7Ll0k7L6J2onj3NQK4j1m7
5378c3J9M7j8k8J5j5KK8j7k9QN5k9k6LK2Pj7Lj0J0M4k1k9j7L0J0j3omj5K9J3m1
5412b3OJ2J5j5mk1J9K9ql5oL2j0kj6NJ5K3j9l0J6J6Jkqj2K5J6k2k2K4J1%qk2J1
5448iK9Km8NL5j4J1j3j6J4K9j4l1J1J5Rqj7j3L7Nk2kKk4M3J0m8PL5k1lJ4l0j5
5483c5O3k9n3K9N1m4nJ2j0J1M0k8l9L7QJm%l4M6Pl8J1LkJ3Ll2JO0l1l2J4Q%K7
5519B9l3l1M3K3l8%J6j9OL4n2j1N1k0j2J2%rK4K6n7pM1k3mLk2LN4l7l4L1J3qJ3
$$ y = [23, -6, -32, 4, 28, 5, -24, 7, 29, 9, 40, 2, -43, 4, 54, -6, -24, 15, 2, 2, 17, -3, -36, 9, 23, -6, -29, -8, -13, 12, 9, -27, -20, 3, 12, -12, -10, -8, 3, 9, -14, -34, -8, 2, -7, -9, -22, -27, 8, 22, -44, -29, 9, 9, 5, -3, -16, -10, 14, 25, -12, -14, 0, 9, 4, 4, -18, 2, 26, 6, -6, -8, 14, 26, 29, -24, -22, 7, 11, -8, -15, -6, -11, -2, 10, -27, -34, 13, 28, -24, -22, -5, -5, 6, 4, -21, -29, 18, 21, -9, -36, 0, 12, 6, 1, -12, -7, 1, 25, 14, -33, -14, 33, 15, -13, 2, -13, -11, 17, 0, -29, -21, 34, 5, -21, -18, 4, 11, -6, -3, -13, -3, 41, 20, -9, -26, 4, 14, 1, -5, -9, -24, 5, 18, -23, -17, -5, 10, -5, -9, -30, -11, 18, 10, -25, -31, 1, -9, -11, -27, -22, -7, 16, -3, -33, -17, -1, 0, -2, -10, -22, 3, 19, -3, -25, -1, 10, 10, 2, -20, -9, 20, 22, -26, -21, 14, 0, 11, -2, -18, -4, 25, 11, -20, -9, 6, 15, 7, -10, -23, 14, 19, -3, -5, -3, -27, 16, 26, -22, -15, 20, -1, -4, 10, -20, -35, 28, -1, -54, -25, 26, -18, -23, -11, -21, -10, 30, 2, -37, 0, 8, 9, 5, 5, -29, 17, 24, -14, -3, 0, -2, 11, 14, -18, -17, 43, 12, -20, -6, 2, 2, 29, -4, -35, 8, 31, -7, -7, 9, -10, -4, 30, -22, -33, 18, -2, -14, -2, -2, -11, 13, 39, -18, -25, 16, -7, -11, -8, -30, -27, 27, -10, -44, -13, 0, -8, 5]
5554Ej2k9M0K3l4k8M2j3PRj2j5K3J4l1oK4kRj3k0J0K3Rk7Oj5K4J6k7j2J5Pmj7
5589a1j7J3K5J0m3LJ8Oj1noQK8pl8lK5nMOl5J4L2rm2K1LQJ3l1qK0K9j1j8JJJ1
5627aJk2qL9nprKJ3J3Ll4K2L1k4k3j4JL2%j4j8OK2mpj8J3J9J3l2LJMPqj5RL1j9
5667Cj8rJ1K0lj9j5J9L9k3l1J5RLjk2jK0J4j6j6JK1J0k3OnJ4K1j7k4OL3Ok0k2
5703a4J2J5J0ok1rL0opk7J0K2qpj0J6RJ2j8j4qJ7J9l1qOK9j3jj6J9PJj5nOJ7n
5741Hj3qJ3J1j3lqNK4mk8NK1jqrpJ2J8j3j1J3L2k7j6KlJ4K6k6j6QK1kj0j3%MJ9
5780A7k0k9J8K1nj3j0PJ6Mj7j3J8KlJqlL2pj7j7K6OJ5k2k0J2J4Nk4OJJ4Om0PL5
5818A5Rj5j1qKK6j5k8QL3kj8J6j9MK4j0m3L7Qnj6J1j4J4J3k1j7J1J3okj8JK9P
$$ y = [5, -7, -36, 4, 27, -7, -35, 7, -6, 1, 10, -2, -17, 6, 20, -11, -17, 7, 5, 14, 1, -19, -9, 14, 23, -4, 2, -13, 11, 27, 0, -12, 3, 10, 6, -11, -28, -15, 10, 20, -23, -20, -2, 4, -7, -12, -18, -10, 18, 11, -27, -30, -5, -10, -6, 0, -35, -21, 11, 2, -40, -19, -16, -8, 5, -26, -34, -14, 15, 4, -14, -13, -12, -1, 0, -22, -30, 9, 4, -3, -12, -10, 3, 16, 19, -15, 7, 38, 14, -9, -23, -22, 10, 10, -4, -22, -16, 6, 2, -5, -23, -10, 9, 22, -10, -7, -6, -2, 5, -3, -18, -9, 22, 3, -15, -24, -13, 7, 4, -15, -30, -11, 28, 5, -26, -11, -2, 1, 0, -22, -23, -3, 11, -5, -21, -20, 1, 11, -12, -6, -11, 3, 24, 7, -17, -11, 22, 28, 8, -14, -2, 13, 23, 17, -4, -13, 17, 11, 4, -23, -13, 9, 1, -6, -16, 0, 9, 21, 3, -11, -19, -2, 17, -14, -22, -16, 13, 0, -1, -17, 2, 9, 10, -5, -10, -4, 13, 8, -5, -13, 0, 11, -2, -5, -13, -8, 16, 12, -16, -11, 10, 9, 1, -8, -15, -3, 15, 2, -9, 4, 36, 9, -7, -5, -8, 6, 32, 6, -10, -2, 19, 17, 7, -6, -6, -2, 17, -3, -32, -14, 7, 2, -11, -21, -14, 2, 6, -11, -24, -6, -4, -7, -6, -14, -17, 15, 8, -9, -26, 0, 6, 21, -1, -21, -9, 5, 10, -14, -8, -7, 7, 13, -27, -20, 15, 24, 9, -2, -10, -8, 18, 3, -25, -17, 16, 14, -4, 12, -7, -3, 21, 11, -32, 5, 13, 8, -8, 3, -11, 3, 16, -5, -22, -11, 2, -4, -6, -24, -23, 6, 13]
5854A3k9J4JMJ1rl7K0M3l0jJnPL5l6k3L2J6l7K2Jj9J6J3k3j6L0KpmklJ8j4k2J3
5891eJ9j1jqj3J4L1l1k3L1Pk0J2ol0M0Kk2nJ7LrKk3J1K5oj3okK4Pl2j5L4J4l3
5928b1J0Mj9L1J6l0j5L8J0l1J1pmL7Ro1OL2Pk4Mj4jK6Nl5J1KJ4j0j5j2L6Qj6k
5964@j1PLJk0jJ0K6l9K3Lj6J7J5l9qL2j0m%J1mJ6j4k9J3K2J1k6j3J7J3Rj8%KM
6001CJ2j6j4PL3j7k1J1J1pJ3j1k3mL4mk6K2J%Nj0k7J3K5j4j4J4MoKj9NK2Nok4
6038b1J6%J1j6krK6Qk1j0OJ4J8l0j8J5J6J4j5j2J4J1J2k7MOJ4j1qpLJ7j6rpJ8
6074DRrj6lJ2K5j7j4jNPmlj2QK1ol3QL7j6j3%rQK2Jm0lM2nj1lj5K7J4j9k4QK4
6114Fkj1Rj5NK8j8j6J5J6nj5qMK5j0j1mjJ7J5k8j2K8K3k6Jk0oJ6J8l8jK6%j4P
$$ y = [13, -16, -2, -1, 3, 14, 5, -32, -12, 31, 1, 0, 1, -4, 3, 38, 2, -21, 11, 27, -10, 12, 13, -6, 10, 23, 0, -16, 14, 16, 9, 5, 3, 0, 18, 4, -18, -5, 14, 3, 2, -6, -19, -5, 26, -5, -28, 3, 10, -10, 2, -4, -34, 6, 8, -14, -19, -2, 1, -8, -6, -29, -18, 7, 1, -12, -18, -20, 4, 11, -21, -36, -2, 12, -21, -11, -7, -26, 5, 21, -9, -24, 14, 24, -7, 4, -3, -7, 30, 39, -22, -16, 16, 23, -1, 3, -11, -12, 14, 19, -16, -5, -3, 11, 1, -14, -26, 10, 18, 2, 0, -11, -4, -1, 0, -20, -21, -11, 15, -24, -1, 2, -14, 3, 18, -21, -29, 3, -7, -11, -11, 0, -4, 12, -2, -31, -18, 4, 15, -11, -24, -7, 6, 15, -3, -3, -1, 3, 15, -1, -15, -8, 25, 8, -13, -2, 9, 2, 15, 4, -19, -23, 11, 7, -19, 3, 4, 4, 9, -1, -28, -15, 10, -4, -18, -4, 0, -6, -4, -23, -18, 4, 9, 3, -21, -5, -5, 6, -10, -12, -21, 5, 13, -8, -18, -12, 2, 20, -10, -28, -13, 3, 17, 2, -10, 4, 15, 27, 0, 4, 10, 24, 13, 5, -2, 1, 18, 2, -7, -14, 4, 13, 4, -12, -15, -3, 22, 5, -9, -10, -5, 2, -2, -5, -17, -9, 12, 6, -27, -19, 18, 2, -11, -11, -20, -12, 10, 11, -29, -32, 10, 5, -6, -9, -24, 3, 17, -2, -26, -18, 6, 4, -7, 2, -13, -8, 20, 2, -14, 1, 17, 12, -3, -11, -7, 18, 8, -3, -7, -8, 9, 24, -4, -16, 12, 35, 9, 10, -10, -16, 0, 18, -20, -21, 5, 5, -9, -2]
6151bj2j9L8Ol4lJ9J9j6NolJ2J2l0j5M1prj5RJ3J8kl9J3J5Rk5qJ4J6Qk5qK3kj4
6189dRj3kK0lnnJRMj4j4L1Kpk2PJKOj9kJ2J1j7%oJK3Lj1j6K5jrjnjK0lj2qJ7L
6233GJj4JJ1J6j0k4MJ6Rj8pKK0Oj3rj0K5Mk0k0J3K5noj1MLK3j9j5J3Rj9n%J3p
6272gJ1j8j3J8J8j1nnPKlJj5PJ6j0%mK0Nlj6nJ8lJ3j7j0J4J2j7rRJ2Mpj3JMKj
6313Bj8K6O%k6J7k1L1pj8oj6L4kj5J5j2K2oLk2J1J4%j5pJ3KoojLPjrj3RM%qQn
6355a3K2Qj0k7J8K4j4j0LJ0lRk7J0kJ4lojORj0j4J1MqMNk4J3J5j1l0K1Pj1jJ0
6393bj6QJ1j5nJ5QoJj2LLJ2j0j5PK1nj7jJ1%Qj3jpK9Ll1QJ6mr%J5j5J9Pl5LK9
6434A8%j9MNlQKk6%K0J3l0pLRQlk3jK0kJ1k7OJ7J3k1mK1j5%kk4J0J3J5l1J2nJ0
$$ y = [-2, -14, -33, 5, 11, -23, -26, -7, 12, -4, 1, -5, -8, 4, 16, -14, -29, 12, 5, -4, -19, -10, 3, 21, 19, -20, -7, 8, 17, -8, -16, -2, 14, 22, -3, -11, 12, 10, -4, 5, -8, -10, 10, 7, 2, -3, -2, 7, 11, -3, -17, 14, 16, 9, -13, -6, -5, -3, 3, -16, -18, -6, 5, -12, -12, -18, -17, 6, 9, -2, -18, 7, 6, -3, -4, -9, -10, 10, 7, -5, -13, 4, 7, 8, -6, -5, 6, 22, 12, -12, -8, 8, 17, -1, -8, -6, 14, 20, 7, -2, -12, 13, 17, -3, -23, -10, 15, 10, 4, -7, -3, 0, 23, 4, -11, 2, 11, -8, -13, -13, 0, -7, 4, -14, -27, -9, 9, -2, -7, -12, -5, -3, -6, -5, -20, -13, 3, -7, -7, -11, 9, 14, 11, -5, -10, 8, 5, 18, 1, -9, 5, 17, 0, -9, 0, 12, 16, 9, -4, -3, 1, 3, 2, -16, 10, 16, 16, -10, 7, -14, 17, 10, -8, -14, -30, 4, 2, -13, 2, -10, 12, 6, 9, -13, -2, 12, 12, -3, -10, 3, 5, -1, -7, -8, -5, 2, 1, -8, -21, -12, -8, -8, -16, -8, -13, 9, 17, 7, -20, -2, 22, 8, -2, 1, 11, 8, 17, -10, 0, -2, 12, 9, 3, 2, 8, 17, 7, -7, 4, 8, 0, 4, 9, -15, -2, 13, 2, -28, -7, 0, -11, -12, -2, -18, -10, 1, -14, -19, -4, 4, -2, -1, -13, -10, -7, 5, -5, -20, -13, 8, 3, -14, -15, -4, -4, 4, -9, -10, -17, 12, 15, -16, -8, 8, 4, -5, -5, 10, -5, 14, 21, -14, -11, 18, 18, -1, 3, 8, 5, 13, 15, -11, -11, 9, 22, -8, -15, -12, -3, 5, 2, -21, -22, -2, -4, 7, -20, -14, 3, 16, -5, -9, 12, -3, -3, -5, -29, -19, -6, 9, -22, -10, -15, -5]
6474eJ6pl1J8K6ok3J3jRNj7j8J0K4k0kJ1j1J2J8j7j0K4j1J0j2qj1PJ9l3J3J5o
6509Aj1Qj7QJ8j4pJLJ4Kk3kL0jk1oJ3mOPl0MK7Pj8MJ6j2J3k2rJ9J3k1pJ9j0J0
6548HJ1j9j3K4J4j9Qk3J0J5kk0NJ7prQj5J0OJk8kK3kjlj2J5K3l4pJ3jkOj6jK2
6587CLj9kMLPMj8J1K1knj5nOJ6pj5K3Mj6mQqRQk3j0K6J7j6nj4QJ4Kj4m%J0olk6
6630c0K8K2l5%KJ5QMk3oJK2k0J4pkj4J3j2JK2Kj8%K3onOqjL3lj8j9J2J0Nj9LK
6670BJ2qjqQKJ7k6PQj8K1lk4KL0j9j5MJ6pLMj2KPj0J0j3MNJ2j6JmJ1j3j3J1kR
6711doj0LJ9Mj4j8QL8j6j1j1kJ9J7Ok7PQk1QJOqJ5Ql2J1K0%j3rjRJ2k2llJ4j2
6751a0oRnJ6j0Pk1j1K4K2k0k3L4kj7JKKJ0lj3lL0oj5KL%NJ4l2mJ1J9j3oQLNkn
$$ y = [-5, 11, 4, -27, -9, 17, 11, -12, 1, 0, 9, 14, -3, -21, -11, 13, -7, -9, 2, -9, 3, 21, 4, -6, 18, 7, 17, 5, -3, -14, -7, 12, -21, -8, 7, 1, -10, -2, -19, -11, 7, -7, -14, -13, -10, 4, 6, -17, -19, 11, 10, -11, -17, -4, -8, -2, 5, -25, -21, 6, 13, -5, -1, 15, 3, 16, -6, -15, 4, 17, -4, -11, 8, -2, 8, 19, 0, -13, 11, 25, 6, 14, -9, 1, 16, 14, -6, -1, 16, 9, 0, 8, -7, 3, 9, 10, -18, -20, 3, 1, 0, -3, -15, 0, 23, -11, -18, -5, -6, -8, -2, -18, -19, 3, 6, -13, -15, -11, -8, -1, 3, -15, -4, 17, 15, 10, -5, -10, -4, 12, 5, -10, 13, 17, 1, -3, 5, -3, 6, 14, -9, -19, 7, 24, 8, 3, -11, -3, 11, 13, -1, -5, -5, 5, -1, -4, -30, -2, 20, -15, -15, -13, 2, 10, 14, -9, -15, -14, 8, -12, 2, -5, -7, -21, -8, -20, -19, 3, 5, -13, -13, 10, 4, -1, 5, -3, -4, 29, 26, 8, -11, 1, 11, 16, -3, 0, 2, 14, 6, 5, -3, 5, 7, 24, -2, 5, 13, -5, 16, 13, -11, -9, 21, 2, -13, -9, 7, 0, 3, 7, -5, -3, 4, -6, 4, -9, -5, 0, 12, -4, -3, -7, 4, -9, -22, -11, -13, -4, -10, -20, -17, 2, 6, -8, -26, -18, 20, 4, -7, -18, -20, -1, 16, 22, -5, 2, 10, -11, -3, -2, 4, -4, 11, 19, -13, -2, 18, 18, 5, -4, -5, 4, 16, -6, -9, -12, 2, -10, -16, -7, -12, 4, -6, 1, -20, -31, -7, 15, -5, -28, 6, 4, -13, -12, -10, -8, 2, -1, -14, -17, 13, 7, -8, -6, -3, -3, 2, 16, -16, -20, -9, 10, -3, -9, -1, 2, 7, 5, 0]
6792@mJ9mjj2kL2ok4Jj0J0M%ojK5k6j8ROPnLj0jJ5lk0K2j6J0Kj1pJ4J7j3mKLP
6834DQmj3K5j0orJ0POk2j1J6%Rj7J4qoRqNNPqJ1oj7K3nj5qK6j3KKj5PJ4Qj4j4
6876a1jJ2mMj3nK9j7j7J7j5LQJj8J1OmKPJ0lkrMjN%j0lPPlMkKnJ3j1mJ4j1MJq
6921flJ3mOroK0j6MjJ5j6lJ1njmKk1K0LJk3J5j4J1J1oj2PRnlnMJ6j0jj4J6J6r
6963CkpK0oKrnQRMj5j0J7k%%J1k3K6j0qj2%J0JnNQjjj6LJ1J2j3q%jJ2pqkOmk3
7008c0J4KJ4J0j0k6J6mK7k7j%J4J0j2mPJ4j4lPQrJ1k2QpJ2Nj7J1MlMPj8QNj2l
7048dJKRk0NjMmLj1J5LRj3loMpQloK1lnpRPj3LklLjLp%ONj4J1rJ6JKj1%oK1j6
$$ y = [0, -4, 15, 11, 10, -2, -4, 28, 22, -2, -1, -11, -1, 3, 3, -3, -4, 21, -5, -23, -14, -8, -1, -6, -3, -13, -14, 1, -2, -22, 0, -16, -6, -4, -15, -22, -8, 9, -4, -8, -6, -3, 4, 12, 8, -5, 20, 10, 4, -5, 5, 12, 18, -4, -15, 1, 1, 10, -7, 7, -1, -7, 2, -6, -1, 4, 11, 3, 14, 8, -9, 14, 9, -6, -14, 12, -1, 1, 3, -12, -5, 9, 17, 3, -11, -12, 0, -4, 0, -13, -18, 11, -6, -23, -6, -21, -18, -10, -9, -27, -16, -10, -14, -12, -5, 5, 2, 0, -9, -5, -6, -1, -1, -11, -14, -7, 0, -3, 1, -1, 1, -4, 9, -2, -6, 8, -3, 1, 2, -6, -9, 4, 0, 6, -3, -9, 11, -5, -1, -2, 13, -3, -6, 5, 0, -1, -5, -3, -24, -4, -1, 0, -23, -8, -22, -11, 0, -6, -18, -11, -2, -7, -10, -15, -11, 5, -5, -6, -20, -4, 12, 3, 1, -6, 14, 8, 10, 1, -4, 4, 13, 17, 2, -8, 9, 7, 7, 7, 18, -5, 21, 11, 3, -9, -9, 1, 2, -3, 2, 10, 9, 8, -8, -5, 6, 18, 5, -3, -3, -4, 8, 1, -7, -9, -3, -7, -30, -16, -14, 0, 10, 0, -26, -10, -14, 13, -14, -15, -15, -1, 9, -3, -7, 0, 14, 0, -3, 4, 12, 3, 14, -8, 0, -7, 5, 10, -7, 4, 8, 5, 9, 16, -2, 6, 11, -1, -4, -3, -1, 8, -12, -7, -8, -4, -8, -5, -16, -1, 2, 11, -2, -5, -11, -7, -14, -6, -9, -15, 6, 3, -2, -9, 0, 7, -6, -3, -5, -8, -5, -6, -3, -10, -10, -4, 1, -13, -2, -11, 5, 6, 8, -3, -3, -9, 12, -4]
$$ [...]
8190bk
8191d
##END NTUPLES=NMR FID
##END=
