##TITLE=1H_LY-812.24
 CCl4, 8 sc, 
 11.4.2019
##JCAMPDX= 6.0         $$ Bruker NMR JCAMP-DX V2.0
##DATA TYPE= NMR FID
##DATA CLASS= NTUPLES
##ORIGIN= UXNMR, Bruker Analytische Messtechnik GmbH
##OWNER= root
$$ XWIN-NMR		Version 3.5
$$ Thu Apr 11 16:15:51 2019 Russian Standard Time (UT+4h)  she@DPX200
##.OBSERVE FREQUENCY= 200.1315
##.OBSERVE NUCLEUS= ^1H
##.DELAY= (6, 6)
##.ACQUISITION MODE= SIMULTANEOUS
##.ACQUISITION SCHEME= undefined
##.AVERAGES= 8
##.DIGITISER RES= 18
##SPECTROMETER/DATA SYSTEM= spect
##.PULSE SEQUENCE= zg30
##.SOLVENT NAME= CDCl3
##.SHIFT REFERENCE= (INTERNAL, CDCl3, 0, 15.7039)
##AUDIT TRAIL= $$ (NUMBER, WHEN, WHO, WHERE, WHAT)
$$ ##TITLE= Audit trail, XWIN-NMR		Version 3.5
$$ ##JCAMPDX= 5.01
$$ ##ORIGIN= Bruker BioSpin GmbH
$$ ##OWNER= she
$$ F:/spectra/data/she/nmr/H-F/1/audita.txt
$$ ##AUDIT TRAIL=  $$ (NUMBER, WHEN, WHO, WHERE, WHAT)
(   1,<2019-04-11 16:14:42.93 +0400>,<she>,<DPX200>,
      <created by zg, POWCHK disabled, PULCHK disabled
       configuration hash MD5:
       00 E9 B6 7A A2 85 ED C7 34 08 36 98 17 FE 4E 26
       data hash MD5: 16K
       5C 38 56 7E 6D B3 6D 93 23 14 A4 37 59 6C 92 90>)
$$ ##END=
$$ 
$$ hash MD5
$$ 82 B1 32 91 D7 C8 E9 47 E4 98 D7 22 8B 1E 5C A5
##$RELAX= 
##$RELAX= 
##$RELAX= 
##$RELAX= 
##$RELAX= 
##$RELAX= 
$$ Bruker specific parameters
$$ --------------------------
##$DU= <F:/spectra>
##$EXPNO= 1
##$NAME= <H-F>
##$PROCNO= 1
##$TYPE= <nmr>
##$USER= <she>
##$AMP= (0..31)
100 100 100 100 100 100 100 100 100 100 100 100 100 100 100 100 100 100 
100 100 100 100 100 100 100 100 100 100 100 100 100 100 
##$AQSEQ= 0
##$AQ_mod= 1
##$AUNM= <au_zg>
##$AUTOPOS= <>
##$BF1= 200.13
##$BF2= 200.13
##$BF3= 200.13
##$BF4= 200.13
##$BF5= 200.13
##$BF6= 200.13
##$BF7= 200.13
##$BF8= 200.13
##$BYTORDA= 1
##$CFDGTYP= 0
##$CFRGTYP= 5
##$CHEMSTR= <none>
##$CNST= (0..31)
1 1 145 1 1 1 1 1 1 1 1 1 1 1 1 1 1 1 1 1 1 1 1 1 1 1 1 1 1 1 1 1 
##$CPDPRG= <>
##$CPDPRG1= <>
##$CPDPRG2= <>
##$CPDPRG3= <>
##$CPDPRG4= <mlev>
##$CPDPRG5= <mlev>
##$CPDPRG6= <mlev>
##$CPDPRG7= <mlev>
##$CPDPRG8= <mlev>
##$CPDPRGB= <>
##$CPDPRGT= <>
##$D= (0..31)
0 1.2 0 0 0 0 0 0 0 0 0 0.03 0 0 0 0 0 0 0 0 0 0 0 0 0 0 0 0 0 0 0 0 
##$DATE= 1554984882
##$DBL= (0..7)
120 120 120 120 120 120 120 120 
##$DBP= (0..7)
150 150 150 150 150 150 150 150 
##$DBP07= 0
##$DBPNAM0= <>
##$DBPNAM1= <>
##$DBPNAM2= <>
##$DBPNAM3= <>
##$DBPNAM4= <>
##$DBPNAM5= <>
##$DBPNAM6= <>
##$DBPNAM7= <>
##$DBPOAL= (0..7)
0.5 0.5 0.5 0.5 0.5 0.5 0.5 0.5 
##$DBPOFFS= (0..7)
0 0 0 0 0 0 0 0 
##$DE= 6
##$DECBNUC= <off>
##$DECIM= 24
##$DECNUC= <off>
##$DECSTAT= 4
##$DIGMOD= 1
##$DIGTYP= 9
##$DL= (0..7)
0 120 120 120 120 120 120 120 
##$DP= (0..7)
150 150 150 150 150 150 150 150 
##$DP07= 0
##$DPNAME0= <>
##$DPNAME1= <>
##$DPNAME2= <>
##$DPNAME3= <>
##$DPNAME4= <>
##$DPNAME5= <>
##$DPNAME6= <>
##$DPNAME7= <>
##$DPOAL= (0..7)
0.5 0.5 0.5 0.5 0.5 0.5 0.5 0.5 
##$DPOFFS= (0..7)
0 0 0 0 0 0 0 0 
##$DQDMODE= 0
##$DR= 18
##$DS= 0
##$DSLIST= <SSSSSSSSSSSSSSS>
##$DSPFIRM= 0
$$ [...]
##$SUBNAM2= <"">
##$SUBNAM3= <"">
##$SUBNAM4= <"">
##$SUBNAM5= <"">
##$SUBNAM6= <"">
##$SUBNAM7= <"">
##$SUBNAM8= <"">
##$SUBNAM9= <"">
##$SW= 24.9337058887773
##$SWIBOX= (0..15)
0 0 2 0 0 0 0 0 0 0 0 0 0 0 0 0 
##$SW_h= 4990.01996007984
##$TD= 16384
##$TD0= 1
##$TE= 0
##$TE2= 300
##$TE3= 300
##$TEG= 300
##$TL= (0..7)
0 120 120 120 120 120 120 120 
##$TP= (0..7)
150 150 150 150 150 150 150 150 
##$TP07= 0
##$TPNAME0= <>
##$TPNAME1= <>
##$TPNAME2= <>
##$TPNAME3= <>
##$TPNAME4= <>
##$TPNAME5= <>
##$TPNAME6= <>
##$TPNAME7= <>
##$TPOAL= (0..7)
0.5 0.5 0.5 0.5 0.5 0.5 0.5 0.5 
##$TPOFFS= (0..7)
0 0 0 0 0 0 0 0 
##$TUNHIN= 0
##$TUNHOUT= 0
##$TUNXOUT= 0
##$USERA1= <user>
##$USERA2= <user>
##$USERA3= <user>
##$USERA4= <user>
##$USERA5= <user>
##$V9= 5
##$VALIST= <valist>
##$VCLIST= <CCCCCCCCCCCCCCC>
##$VD= 0
##$VDLIST= <DDDDDDDDDDDDDDD>
##$VPLIST= <PPPPPPPPPPPPPPP>
##$VTLIST= <TTTTTTTTTTTTTTT>
##$WBST= 1024
##$WBSW= 4
##$XGAIN= (0..3)
0 0 0 0 
##$XL= 0
##$YL= 0
##$YMAX_a= 78697
##$YMIN_a= -87840
##$ZGOPTNS= <>
##$ZL1= 120
##$ZL2= 120
##$ZL3= 120
##$ZL4= 120
##$ABSF1= 10
##$ABSF2= 0
##$ABSG= 5
##$ABSL= 3
##$ALPHA= 0
##$AQORDER= 0
##$ASSFAC= 0
##$ASSFACI= 0
##$ASSFACX= 0
##$ASSWID= 0
##$AUNMP= <proc_1d>
##$AZFE= 0.1
##$AZFW= 0.1
##$BCFW= 1
##$BC_mod= 2
##$BYTORDP= 1
##$COROFFS= 0
##$CY= 11.3945322036743
##$DATMOD= 1
##$DC= 2
##$DFILT= <>
##$DTYPP= 0
##$F1P= 18.9103706918063
##$F2P= -1.10871071338519
##$FCOR= 0.5
##$FTSIZE= 0
##$FT_mod= 4
##$GAMMA= 1
##$GB= 0.15
##$INTBC= 1
##$INTSCL= 1
##$ISEN= 128
##$LB= 0.24
##$LEV0= 0
##$LPBIN= 0
##$MAXI= 10000
##$MC2= 0
##$MEAN= 0
##$ME_mod= 0
##$MI= 1.114404
##$NCOEF= 0
##$NC_proc= 0
##$NLEV= 6
##$NOISF1= 3.799351
##$NOISF2= 2.8
##$NSP= 1
##$NTH_PI= 0
##$NZP= 0
##$OFFSET= 15.70392
##$PC= 1
##$PHC0= -8939.686
##$PHC1= 26.00026
##$PH_mod= 1
##$PKNL= yes
##$PPARMOD= 0
##$PSCAL= 0
##$PSIGN= 0
##$REVERSE= no
##$SF= 200.130013532006
##$SI= 16384
##$SIGF1= 3
##$SIGF2= 2
##$SINO= 400
##$SIOLD= 16384
##$SREGLST= <1H.CDCl3>
##$SSB= 0
##$STSI= 0
##$STSR= 0
##$SW_p= 3612.71676300578
##$SYMM= 0
##$S_DEV= 0
##$TDeff= 0
##$TDoff= 0
##$TI= <>
##$TILT= no
##$TM1= 0
##$TM2= 0
##$TOPLEV= 0
##$USERP1= <user>
##$USERP2= <user>
##$USERP3= <user>
##$USERP4= <user>
##$USERP5= <user>
##$WDW= 1
##$XDIM= 8192
##$YMAX_p= 0
##$YMIN_p= 0
$$ End of Bruker specific parameters
$$ ---------------------------------
##NTUPLES= NMR FID
##VAR_NAME=  TIME,          FID/REAL,        FID/IMAG
##SYMBOL=    X,             R,               I
##VAR_TYPE=  INDEPENDENT,   DEPENDENT,       DEPENDENT
##VAR_FORM=  AFFN,          ASDF,            ASDF
##VAR_DIM=   8192,          8192,            8192
##UNITS=     SECONDS,       ARBITRARY UNITS, ARBITRARY UNITS
##FACTOR=    0.0002004,     1,               1
##FIRST=     0,             0,               0
##LAST=      1.6414764,     0,               0
##MIN=       0,             -87840,          0
##MAX=       1.6414764,     78697,           0
$$ Real data points
##PAGE= N=1
##DATA TABLE= (X++(R..R)), XYDATA
$$ [...]
394G41j037r74J812O19j750L74J221j739o85K465K9k184J070J346k062n50K253
411I49m09j585J566P46k313j36K189n23j446J321O93j812j02J725o81j280J576
428D78Q65k102l17J964o17j391J690N99k198M24J904j577j116K310J32k122R30
445a44J131j776KJ965q62j346J369L73j437K97J027n55l23P01k57p34L34O62k16
464B11m89K73L37n08j66O14j93m60P58Q9j110L35Q99p69j46R60p06n93J238k61
484C13j242J067P02j357K68R65j184j95J523o39j086J217K39j229M59O95q29J40
502a73P99o63n12O18J22k21R3q7K1N6k02J29J74l41K50M89q32l63J115j83q83
523e94R17K11j315O12J058j337l02J649m98j340J088M44j276N12J133j116o87
$$ plain form
394 741 -296 -1270 542 1161 -589 -215 1006 -733 -1418 1047 1076 -1108 -38 1308 -754 -1304 949
411 949 540 -1045 521 1267 -1046 -1182 1007 484 -962 359 1052 -760 -862 863 182 -1098 478
428 478 1343 -759 -1076 888 271 -1120 570 1169 -1029 -605 1299 -278 -1394 916 1048 -1074 -144
445 -144 987 -789 -787 1178 316 -1030 339 712 -725 -428 599 44 -279 422 165 -569 -235 427 211
464 211 -278 -5 332 -176 -342 272 79 -381 377 466 -644 -309 590 -179 -325 635 -71 -664 574 313
484 313 -929 138 840 -517 -249 716 -468 -663 860 221 -865 352 591 -638 -179 516 -313 -173
502 -173 626 -37 -549 69 191 -30 63 -24 -3 53 -149 -20 154 -187 63 552 -280 -643 472 289 -594
523 -594 323 534 -781 -169 889 -448 -750 899 401 -939 149 593 -683 -171 962 -154 -841
540h41J246J11j080L59Q04n70m81O44O4p34K88Q91n47q86P81N24r65J06R45p05
560d6n86J089r3j159P37R06j055k82R36m65n32R61Rr83M70O28p40j61O78j93l28
581b09M03o5n01K46M68k17l30J28J98j36r4K23p7k26L19J40n87P7O84m23l92O81
603C10k38o46R28K01j320N56J078j252k19J497r49j009J850j34j978J410J236
620A321k144J32J909j530p95K245o20j878J645O45j811O65J114j336P3J099r79
637b45l32J031l88j99N43p54m7J080q81l68J412q49j003J851m53j918K097Q23
655A400k779J028J940k660M6L025k204j630L352p91k857K848P91l316J844J948
671A985l494M08L196k529j076L225j546k074L161l09k892K468J026l109J334J839
$$ plain form
540 -841 405 516 -564 -205 599 29 -452 192 256 -478 -190 701 154 -732 49 573 -392 -286 659 -46
560 -46 -632 457 364 -795 -58 848 -207 -489 447 -18 -550 411 420 -563 -93 535 -205 -366 312 119 -209
581 -209 194 129 -372 -126 342 125 -205 -77 121 -15 -109 114 37 -189 130 270 -317 -240 444 21 -371 310
603 310 72 -574 354 555 -765 -209 869 -383 -602 895 -54 -1063 787 653 -1325 85 1321
620 1321 -823 -691 1218 -312 -1107 1138 518 -1360 285 930 -881 -216 898 -438 -365 734 -245
637 -245 -577 454 66 -133 410 -344 -391 689 -192 -560 852 3 -1000 851 398 -1520 577 1400
655 1400 -1379 -351 1589 -1071 -1025 2000 -204 -1834 1518 727 -2130 718 1509 -1807 37 1985
671 1985 -1509 -1101 2095 -434 -1510 1715 169 -1905 1256 947 -1945 523 1549 -1560 -226 1613
687A613k771M53K519k356p88K716j280j387K368p43j774K213j5k103J752M88k188
704a283J559Q74k654J369K038l103J74L038k731j103M081j753l188L984M31m382
720b649K670K616m397N53L916l478j629M538j233l207L260M26l478K083J868l105
736a246O06K368k330n53K349j311q82K187q90j564J775p7j398J579K4j765J506
753C78N10k175J213J483k345M01K149k355p08L124j259k233K754J65k873J903
769A32J516k936N74K455k205p75K439j083j267K080n54j725J946K88k061J358
785A82Q79k246R01J777k195l01K393j372j419K222k02j792J613N27k050P32J286
802I35j318J17J042j150j27J170r21l20J359o58q13J227m41j138J531L75j639
$$ plain form
687 1613 -1158 -705 1814 -542 -1330 1386 106 -1281 1087 344 -1430 783 768 -1335 417 905 -1283
704 -1283 276 1150 -1504 -135 1903 -1200 -1026 2012 -719 -1822 2259 506 -2682 1302 1733 -2649
720 -2649 21 2637 -1760 -1207 2709 -769 -2398 2140 907 -2300 960 1386 -2092 -9 1859 -1246
736 -1246 -640 1728 -602 -1155 1194 -117 -999 1188 298 -1266 509 432 -966 613 637 -1128 378
753 378 888 -1287 -74 1409 -936 -535 1614 -741 -1449 1675 416 -1817 937 1102 -1771 132
769 132 1648 -1288 -714 1741 -464 -1239 1200 117 -1150 930 376 -1349 597 885 -1176 182
785 182 1061 -1185 -284 1493 -702 -1003 1390 18 -1401 821 619 -1173 440 967 -1083 -351 935
802 935 -383 -266 776 -374 -501 669 -252 -572 787 129 -684 543 102 -1036 495 870 -769
819g69O88Q22j453L41J293j228k45J455q98r75J405r8j027J176J25j474O65R10
837G13j091Q0R44p32k92P44m67l41P52j07l46L50l81j92P97l27o16Q43J8r37O73
858H5L93j064L92R78r07m27R30k59n36O26k3m88M39R4m43J51M2j07M10j57m79
879c50M74Q3n75M32K61o77L97N31r38r4R17m87l16Q92m79p32R72O3j031P06N98
900F47j009J62O89q69p3J067m34o18O34j10m91N65K9m88M99J03o47K56K14m05
920b79M43K82q00J46N71o17K5P28n96k59Q98n16p73J013J51r01O88L19j195M54
940b18R94j099k18J290o18q44J097p7j055Q85O32j213P6Q89o53k63P81l00m45
959c59O16m8n36K57J88j75K19r6l25L42O4l86L18J28m96L51L68p89kQ39m17m41
$$ plain form
819 -769 -81 741 -712 -371 922 -306 -551 904 6 -969 436 338 -689 487 612 -862 -197 713
837 713 -378 -298 646 -86 -378 366 -101 -442 310 203 -143 207 -174 -366 431 104 -512 331 349 -588 85
858 85 478 -586 -194 784 -123 -550 380 121 -415 211 188 -300 139 233 -210 -59 -17 -124 286 129 -350
879 -350 124 207 -368 64 325 -352 45 576 -362 -456 461 -26 -342 550 71 -661 311 374 -657 49 647
900 647 -362 -200 489 -380 -453 614 180 -438 196 86 -405 160 189 -299 200 303 -344 -88 126 -279
920 -279 164 446 -354 -208 363 -254 -229 499 -97 -356 542 26 -747 266 417 -484 204 523 -672 -218
940 -218 776 -323 -541 749 131 -713 384 307 -748 137 769 -444 -368 521 -132 -395 386 86 -359
959 -359 257 209 -327 -70 118 -57 162 66 -259 83 147 -239 79 207 -289 62 430 -359 -361 478 61 -380
981c80P17j88p17P18L20r34K75P71o75k95O92l37l47P17m6o86L48L15m69J13L18
1002B30l53O7L49l87k11M18l0j75K70j69k84L46J10l95J64K87k66l5J75k59nL56
1024B03o7k66J07K9q4J22j9j17J72M0j72J5j7o3K36R4l63J9K94j90j47L11o5k74
1048b02L49Q5n53R4N23k20k81L54l5l85K72K66m21n9M94q7m49J27K46j48j2K51
1070B09j40k95J90K21k44j56L52J23l45q8K70j65j11M23Rn20J33M16l41k53M86
1091A74O1l89J93J22m24L2N40j23l81K02J32k77J0K35p0r3K00Ml55n7L60P5k06
1114c5O8Q5k36l8K64j02j65L21J23m40j05L10j6o8K03n5k65P2J45r5o9J43J51
1137A96q5k60k9K01J3k7J76r6l37J83K66l43q4N17m1m55J11J80k80J13M18k09
$$ plain form
981 -380 337 149 -568 150 470 -464 -189 582 -93 -388 304 -33 -380 337 291 -395 -47 268 -201 -88 230
1002 230 -123 -56 293 -94 -305 113 83 -92 178 9 -275 71 181 -214 -50 237 -29 -64 111 -148 -153 203
1024 203 136 -130 -23 6 -78 44 25 -92 80 120 -52 -37 -54 -117 119 213 -150 -131 163 -27 -174 137 72 -202
1048 -202 147 232 -321 -227 296 76 -205 149 114 -271 1 267 -154 -213 281 194 -255 -128 118 -30 -42 209
1070 209 69 -226 -36 185 -59 -215 137 260 -85 -173 97 -68 -179 244 253 -267 -134 282 -59 -312 174
1091 174 235 -154 39 161 -263 -231 309 186 -195 7 139 -138 -128 107 37 -56 144 148 -207 -264 96 171 -35
1114 -35 33 118 -118 -156 108 6 -159 162 285 -155 -260 50 34 -34 169 114 -151 -79 66 -29 -98 45 196
1137 196 111 -149 -178 23 36 9 185 89 -248 -65 201 -142 -226 291 250 -205 -94 86 -194 -81 337 128
1159A28l78K24J83k92n3L39L4k20J6O7k35kL96N7m14M5K83k36j91L48O9k79K10
1182I9J29m95m8N59o4l28K30P0l82J01L15k39j10L99Mm57PK96n1p4J76l0k82M6
1206a29K77j48k15L16K23l88j74L14p0k00L63J16m94K8M28k68k61L79J17k93R1
1227A2N7k76Q2L24j04j45O4j1k4M1j09O1K05j17j26P5j47j0L50p3l03K01J01k94
1251a66J07J83k52J42K96l86j73L29p1q2K82j87k10L44j29l30M12K5l36M55kp83
1273e32M25O25p83J4Q48o99m75J046k86r32J015M33j196K97P09q76QR92n96m83
1293d46P97k17n85N65L0m02N49l4o89M10K21n14M71K33p91L50N32r06R6R27p18
1314a21k35R97p21p21J307p2j177J004M00j393N76R25j335J02J421r93o86J262
$$ plain form
1159 128 -250 -26 157 -135 -188 151 185 -35 -19 48 -187 -189 207 264 -150 -105 178 -58 -249 99 168 -111 99
1182 99 228 -267 -315 244 180 -148 82 152 -230 -129 186 -53 -163 236 240 -217 -210 86 35 -39 137 107 -175 -129
1206 -129 148 0 -215 101 324 -64 -238 76 6 -194 169 285 -209 -181 247 -21 -282 97 214 -79 12
1227 12 69 -207 -125 199 95 -50 14 3 -21 20 -89 -28 177 60 -66 9 -138 -148 202 129 -174 27 128 -166
1251 -166 -59 124 -128 14 310 -76 -249 80 9 -73 209 22 -188 156 27 -303 109 134 -202 253 251 -532
1273 -532 -107 518 -265 -251 597 -102 -577 469 183 -749 266 699 -497 -200 509 -367 -359 633 37 -446
1293 -446 351 134 -451 114 144 -258 291 257 -432 -22 199 -315 156 389 -402 -52 480 -426 -330 597 -121
1314 -121 -356 641 -80 -801 506 434 -743 261 661 -732 -156 769 -566 -464 957 -36 -722 540
1332E40m67q34J271k9j215R37M20j311N20Q46j146K09J150j153n21J382m35q73
1350g09J162J5j138P36M69j089L06Q55o67j43N39n59j16O99l43k64N98l41l61
1369c51O21k65m96Q64Q3r19M62L56q70M22P74r38j28J021o78o55J076q7q56R01
1389C37K39j276M20R71r39j73J082n85p05R76o3r53P30N77r03L5O06o17r1P75
1409D43l44m83O42o3n85L78K04m35L36L08o35l0M68k27j20L60j62j96K60j33k37
1430b51L09M5j27K34k35l38M90P5m74L84K49o82J97N37p31p9J003m09p53Q12J3
1451B69q97P13N54j041J28R16p54m94R78j69o47P09J46r21L24O18n43j17M91k07
1471E6k44K49k8j76J59Q4J3r3k35J69K55l02j6L61k85j76M23k13l72N30J58n40
$$ plain form
1332 540 73 -761 510 481 -734 203 623 -688 -168 678 -468 -259 891 -262 -783 599 164 -709
1350 -709 453 468 -670 66 535 -554 -248 607 -60 -203 336 -223 -339 360 17 -247 351 10 -351
1369 -351 270 5 -491 373 456 -463 -1 355 -515 -93 681 -257 -385 636 -42 -697 379 292 -564 337
1389 337 576 -700 -280 691 -248 -421 661 76 -629 347 284 -669 61 638 -265 -230 376 -241 -332 443
1409 443 99 -384 258 195 -390 -12 192 -243 93 401 -234 -264 204 -23 -143 217 55 -141 119 -14 -251
1430 -251 58 103 -24 210 -25 -363 127 202 -272 112 361 -321 -124 413 -318 -397 606 197 -556 256 269
1451 269 -628 85 639 -402 -274 642 -112 -606 372 203 -444 265 411 -510 -186 432 -111 -228 263 56
1471 56 -188 61 33 -143 16 100 113 20 -215 -46 209 -93 -109 252 -33 -209 214 1 -371 159 317 -223
1493b23J55K73m37J19M19l93r7M73k50k94L24m8j77L67m6m09K13J28k31J58J18
1514A42k45J58J09l69M7L12j58mK15k90j62L67n8k10K47Nj83J28j00j54K90N7
1536A44k32K12o7l93M13K40n76J52N16n04k35O11k72l90O64N2p26K92M04m85N4
1557a26M20l43r5L56k35k23L19rj15K29j92k35L49J3l22K82J10l41J70J77m45
1578b56J18M52l00j68L31k09k29M45n2m20L63K22m92N1L18k78rL97k14l37K90
1599B3J07k47P1J35p4K2qj25L3P5j8J21k1k90J22K63k78j19L98n7l13K27O9l90
1623b74J82M32l12k49L04j4k66J89J48j97M8J68k06j34J68P4%K5j09n3R8m1n1
1646g0J16J2p7R7p2k13J65K32j54o6J14j57o2K37p2j64K42Q3l21J1J59j16L9K52
$$ plain form
1493 -223 -68 205 -232 -113 306 -87 -184 289 39 -255 69 21 -156 211 165 -244 -31 97 -134 24 142
1514 142 -103 55 164 -205 -158 154 -4 -8 207 -83 -245 122 64 -146 101 106 -77 51 -49 -203 87 144
1536 144 -88 124 57 -336 77 317 -259 -107 409 -95 -330 281 9 -381 283 335 -391 -99 305 -180 -126
1557 -126 294 -49 -144 212 -23 -246 73 64 -51 178 -14 -249 100 113 -209 73 183 -158 12 189 -256
1578 -256 -138 314 14 -154 177 -32 -261 184 132 -288 75 297 -195 -144 174 -104 -113 284 70 -267 23
1599 23 130 -117 -46 89 15 37 29 -96 -63 12 -6 115 94 -196 -74 189 -89 -208 190 133 -180 47 116 -274
1623 -274 -92 340 28 -221 83 69 -197 -8 140 -57 -9 159 -47 -181 -13 61 61 86 -23 -76 22 -19 -70
1646 -70 46 58 -19 78 6 -207 -42 190 36 -30 84 -73 -135 102 30 -134 108 191 -130 -119 40 -76 -37 215
1670B15j60k53J79J27j98J6J88l3r4J0j8j01O2K11Nk19m1J64n2j64J77J39j93
1693c3LJ51k22j58L74J34l28J2J78j82j08K59J2j78J67J07l10j12K58R0j05M4
1715E3K8j81k7J90l7r6J55P9j96j36R2O5L8J01k4j80l1R3Pn5R9J13p3j38k7PL6
1742d5J39R8j64j69J11N2j15P5J92r5j25P9j22j32K68K18k29j28J22q9q3J93O0
1765A11j20Q7M3k24r1J60J59Ko2p1m8n0L5J29J1o4Q7nk90k6L43J6j27J14n9l10
1791b50J40K60j95oK80j13l06P3R4n3J87J18k20j43N2J8M7N5K7O3n2k23j1J45
1815a3nJ27J38k54k32K50J4j81K34J69k89j4J03k57JM41j3k65O6m1j99J70J74
1838A24j16M7J17k23j39Q2O5J38J28j82j27L5r7P4K35r1q8K21k00l53K89K35k02
$$ plain form
1670 215 55 -198 -19 108 -90 -74 114 81 -13 -3 -21 -122 -60 151 156 -63 -104 60 8 -156 21 160 -33
1693 -33 -30 121 -101 -259 115 249 -79 -67 111 -71 -179 80 92 -86 81 188 -122 -234 24 114 9 53
1715 53 81 -100 -127 63 26 -70 85 164 -32 -168 -76 -11 27 128 104 -76 -107 -14 -7 -62 37 150 77 -61 -88 -81 -45
1742 -45 94 192 28 -141 -30 22 -93 -18 174 79 -46 33 -89 -221 47 265 36 -92 30 -59 -142 51 111
1765 111 -9 78 121 -103 -194 -34 125 127 65 -6 -54 -104 -69 60 71 7 94 89 -201 -227 116 132 5 119 60 -250
1791 -250 -110 150 -45 -51 229 116 -190 -117 -23 -76 111 229 9 -134 -82 -64 -17 38 65 128 76 -147 -158 -13
1815 -13 -18 109 247 -7 -239 11 25 -156 78 247 -42 -56 47 -210 -209 232 219 -46 20 -21 -220 -50 124
1838 124 8 55 172 -51 -190 -108 -43 95 223 41 -86 -51 -148 -74 161 70 -18 203 3 -350 -61 174 -28
1861b8J44J71m92j05M62j17k23M23L0m40O9J35k48K04L58k18k00O6j42L7K25r8
1883A3L7K18l05k52K90k9j24M69qo20J72L13m32J36N36l57k38M03l05l95N91J97
1905C10m09K27M9n65K06M24l61O8M60m24k66L56k12j33O56j05n29L00j2m58M72
1926E4L04n48K46L62p86n1P34l45j68P53l88p80O85J88o84N03M73p43K4M47o12
1947c32l6Q21k77l41M38l65m06O92j5m73O13N1q35L35L79o68L92P65q45l32P60
1968C21m50m06R63r1p11O15M6r44M78O60o40J82N16q41j99Q33l77k77Q28k67o59
1989d20N58o9o58P51M36q44K06L92q45J43Q89n75k62Q81m93q05Q21J44o83O98
2009B65L86j070M9P02n72p7Q61l53n05N36k29n51O45K94m63K28K8o22K51M51m24
$$ plain form
1861 -28 116 287 -205 -310 152 35 -188 235 265 -175 -106 29 -219 -15 343 125 -75 -9 -151 -114 111 13
1883 13 50 268 -37 -289 1 -28 -152 317 309 -311 -139 174 -258 -122 414 57 -181 222 -83 -478 113 310
1905 310 -99 128 177 -388 -182 242 -119 -51 409 -15 -281 75 -137 -270 386 281 -248 52 40 -418 54
1926 54 358 -190 56 418 -368 -419 315 -30 -198 555 167 -613 72 260 -424 79 552 -191 -167 280 -332
1947 -332 -368 453 176 -165 273 -92 -498 194 179 -294 319 370 -465 -130 249 -419 -27 738 -107 -439 321
1968 321 -129 -535 428 337 -374 241 287 -657 -179 481 -159 23 539 -302 -501 332 -45 -322 506 239 -420
1989 -420 138 69 -589 162 598 -246 -40 352 -493 -350 539 -36 -298 583 90 -715 106 250 -433 265
2009 265 651 -419 -370 332 -240 -317 544 191 -314 222 -7 -558 87 381 -82 146 174 -448 -197 254 -170
2030a70K12M55o24j93M94m27j00R00k24o95N03k0p22O39N42q01J73O14q69l09
2050f22R57k07l96P68k15r10N27L74o39M20N27p22q5M69n72p4Q73k06m90M59k42
2071fn83O60K79n67L51L09p56l4N27l31N7O25m14m75M00r8k66N59O9m37K58j9
2093A08n54L26L77l10K23J98p02J2N65l67n6O99m05n11N69j63n91P96L83q36J73
2114f6M00p67M8Q84m15l46O79k84o78M96K19l74M15J80o16PK63k10J55L09k86
2135A3JJ27m37M9M64j87kL72n02l59N97n4l56N62O0o57K44K48n78K75O51m94k12
2158a75M02m14k15O80r7l78M80j06o17L80K21m19M26L42p34o5N04m02n2O70k83
2179A48m12M64j54n23N08L09m17J66J38n50Q7M40k57J9L46l29j94K73k24n4N29
$$ plain form
2030 -170 42 497 -127 -320 174 -253 -353 547 323 -372 131 111 -611 28 570 -231 -58 556 -313 -622
2050 -622 335 128 -268 500 285 -625 -98 276 -363 57 584 -138 -223 246 -326 -400 473 267 -223 236 -6
2071 -6 -589 71 350 -217 134 443 -313 -347 180 -151 -94 531 117 -358 42 -56 -322 237 306 -131 127 108
2093 108 -446 -120 257 -53 170 368 -334 -322 243 -124 -180 519 114 -397 172 9 -582 214 597 -239 -66
2114 -66 334 -433 -385 499 84 -262 417 133 -545 -49 170 -204 211 391 -225 -218 45 -165 -10 299 13
2135 13 14 141 -296 -247 217 30 28 400 -102 -461 136 82 -274 288 348 -309 -65 183 -395 -120 531 37 -175
2158 -175 227 -187 -402 278 181 -197 283 177 -440 -60 161 -258 168 510 -224 -289 215 -187 -239 431 148
2179 148 -264 200 46 -477 31 340 -77 89 227 -323 -236 204 -53 -34 312 -17 -211 62 -162 -216 313
2200C13j11l44K52j61l69N29J87n08K91K99o87nN97l69j11O83l32o54N34J49n09
2221c26L96L59n98K4L75m57r6O17j29k58K96k23l53M32J29l39K95J26n05J14K71
2242A50l64J41M99l66l29L67j38k58M73R5m42K32J42m75O6M17k09kK81l54k14
2263b88L54k9j41L00n3k93J65J1l17L24K71l32K2J59m11L9M93k47k09M66j89m70
2285c75M02J07l91L55L16n94p4M22k68q7M83j78l09L15o6l70L18K03k64J36Q3
2306A64m16J04L23k32k0L40k52k14L12j55j91M16Q0m10J24J02l08J77K79k63k4
2327f4K42k32j63K66k9q1K69j19k86J58O8j36J77Q7k40R6Q6k88O5L10j56n5J96
2350A71k35j85L54J2k51K24J00l32O5J73k17M6L26j87k08J60n7p9K08J5j58J02
$$ plain form
2200 313 202 -142 110 -51 -420 109 296 -212 79 378 -309 -314 283 -86 -197 486 154 -500 34 183 -326
2221 -326 70 429 -169 -145 230 -227 -323 294 165 -93 203 -20 -373 59 188 -151 144 270 -235 -121 150
2242 150 -214 -73 426 60 -269 98 -40 -298 175 270 -172 60 202 -273 -207 210 1 -1 280 -74 -288
2263 -288 66 37 -104 196 143 -150 15 26 -291 33 304 -28 -6 153 -258 -219 274 27 -182 284 95 -375
2285 -375 27 134 -257 98 414 -180 -254 168 -100 -187 296 118 -191 124 58 -312 6 209 -55 81 164
2306 164 -252 -148 175 -57 -77 263 11 -203 109 -46 -237 179 259 -151 -27 75 -233 -56 223 -40 -64
2327 -64 178 -54 -217 49 20 -61 208 89 -197 -39 29 -107 70 157 -83 13 99 -189 -124 186 30 -25 171
2350 171 -64 -249 105 117 -134 90 190 -142 -77 96 -121 -75 251 64 -144 16 -41 -120 88 103 -55 47
2372D7J7j75N6R6o7R2Q0k31n5J91o5k9J38m2j19Q9qj49J11J46q5l1J3j12K2J37
2398F7m4l3O5k7o7L1j9j6J28oj17qK5k8O9O9j11PR2j02n2R1Mj8Q1m3j48P5J00
2427F5n8j6O2m3m1P0o1l9R3O6r1l4J%N9J9n5nN2m7k8L7m5L0J22q3j10O2M5m0M2
2458B9K1p0J0N3o2m5P7K9j4j2p6J4P4Jl4K8j3k2N6j8r5P6Q9q1m3L0k3mQ2j8q9
2489e0O1K2l4j5JJ0O6j5j01L1L6qK0J8q7%J03o0o2J02Km7N1n3p1Q9N7o8j3L4m2
2520b3K1K5o7OJ02l9o0M2l6J2J01p4p4J09k0q3J03lj16J13R4k23LK00j13p2J75
2547A03j05j25K00J6k13J03J32j45L5O8j42M9J28j12m1J17j17J7J54j45r9K31
2569A09m6k01J78L7k14J78J35l04J0K92j85j18K57r8j76K45ok57J70J29k00O6
$$ plain form
2372 47 64 -111 -55 41 -26 66 146 -85 -140 51 -14 -43 95 53 -66 23 15 -134 -23 123 38 7 20 -92 -70 67
2398 67 23 -10 55 28 -39 -8 -27 -43 85 79 -38 -46 -21 -49 20 89 -22 -15 77 -25 -77 14 18 0 81 38 -110 -35 65
2427 65 7 -9 53 10 -31 39 -22 -61 32 98 7 -27 -26 -26 33 52 -3 -8 44 -3 -31 6 -39 -9 113 30 -80 -18 27 -13 29
2458 29 50 -20 -10 43 -19 -64 13 42 28 16 -60 -46 28 29 -5 23 10 -12 44 26 -69 7 96 15 -28 2 -21 -25 57 39 -50
2489 -50 11 33 -1 -16 -15 -5 61 46 -55 -24 12 4 24 42 -45 -45 58 -2 -64 38 40 -7 44 -9 -80 9 66 -2 -15 19 -23
2520 -23 -2 23 -44 -38 64 25 -35 7 -29 -17 84 10 -64 45 25 -58 45 42 -74 39 133 -90 -87 113 0 -72 103
2547 103 -2 -127 73 89 -124 -21 111 -34 1 69 -73 -24 104 -8 -49 68 -49 -32 122 -23 -122 109
2569 109 63 -138 40 77 -137 41 176 -128 -118 174 -11 -129 128 30 -146 99 93 -164 6 135 -65 1
2591AP3j91Q8J87k17k8K06j52o8K49j70j46L23m6l06K09J28k92J44J98l26KL41
2614B07k11j81K94n3k20K74ll10K10J73k91O2J95k32%K62k27j18L16p5k25K34
2636H1Lk49K41Q7l31J04K65k65m9K66j88j29L22p7k67K39J07k70Q4J66k27K2K14
2659A49j62j01J77m5n0J07r5p7K24r6j73K19J6k49K11J42l90J02L50k99j82M09
2681A87j15l04L36O5m08J91L00l55m7L21j93j37L03j03k17K57K8k36J35O4j84
2702a12J36J22k74N1K03j77k1K02j76o1K48j39j73K67j2k10K03L5l13J80K33l26
2724a14KL01k08j16K64j04j96K90J4k68J13R8j73J29Q5k12O3J70k09l6K20j28
2746a5r4K65j07k54K36J11k45Q3J65j87j9J32q4p7J32M0q1l2j4L7L8n0J6O3p7
$$ plain form
2591 1 74 -117 -29 158 -59 -87 119 -33 -101 148 -22 -168 155 109 -197 12 140 -152 -8 190 -136 -134 207
2614 207 -4 -185 109 56 -164 110 107 -203 7 180 -111 -49 146 -86 -86 176 -51 -169 147 72 -153 81
2636 81 84 -165 76 163 -168 -64 201 -64 -113 153 -35 -164 158 81 -186 53 160 -110 -26 140 -87 -65 149
2659 149 -13 -114 63 18 -32 75 -20 -97 127 31 -142 77 93 -156 55 197 -193 -91 259 -40 -222 187
2681 187 72 -232 104 169 -239 -48 252 -103 -150 171 -22 -159 144 41 -176 81 109 -127 8 72 -112
2702 -112 24 146 -128 -77 126 -51 -72 130 -46 -107 141 2 -171 96 84 -126 77 112 -201 -21 212 -114
2724 -114 -112 189 -19 -135 129 25 -171 119 133 -135 -22 76 -97 32 117 -95 -32 138 -71 -107 113 -15
2746 -15 -109 156 49 -205 31 142 -103 -20 145 -42 -61 71 -13 -90 42 82 1 -31 -45 -8 30 -20 -4 59 -18
2771a8j8Q7o8p1J78K7j88O0O8j17L8J24j19l3J24o5q9P4K7j9M5j9p9RM9K5j7l4
2799a9K6M9j02l3J12l1n6J51m7k09J12J47j65RJ84j29j03J67n6j32J67O9j60K3
2823b6K8r2J02P1j35N4J00j71kJ40j19kK27j22j97J78K2j70J53J01k15L9J61j87
2847f2n8K35o8p6J24r7j15J61L5j61J24N0j65O9O2j74Q9J95j88n3J56j26p9K45
2871A23o5j88K18M4k80R0J79k26O7K39k36j58K79l5k12K28N9k25Q5J11k16M8K06
2894A35j30k9J10j40n9K21p5j32K05k1k15J39O5k18J47K05k77n0K37j52r1K54
2916A29m6k05J90L4k52J10J44j44N5J10k09OJ79j10n4J88j08j23J99p2j98K45
2938F8P2k42R1J18k48Q1K48k24r8L08j41k07K41Pk13K16R8l06N4K14k02kK16j59
$$ plain form
2771 -18 -36 51 -17 -88 90 117 -71 -11 57 -60 -22 102 -17 -50 74 9 -80 -6 21 2 47 28 -51 -42 7 32 15 -19
2799 -19 7 56 -46 -79 33 2 -54 97 50 -159 -47 100 -65 -56 128 -1 -104 63 7 -125 42 111 -49 -26
2823 -26 2 -90 12 83 -52 2 102 -69 -71 69 -50 -52 175 53 -144 34 56 -114 39 140 -75 -36 125 -62
2847 -62 -120 115 47 -29 95 -2 -117 44 79 -82 42 92 -73 -4 58 -116 -27 168 -20 -73 83 -43 -122 123
2871 123 58 -130 88 132 -148 -58 121 -105 -38 201 -35 -193 86 51 -161 67 126 -99 -14 97 -119 -71 135
2894 135 5 -24 86 -54 -113 108 33 -99 106 85 -130 9 74 -144 3 208 -69 -119 118 -34 -125 129
2916 129 83 -122 68 102 -150 -40 104 -40 15 125 -84 -78 101 -9 -63 125 17 -106 93 21 -177 68
2938 68 140 -102 -11 107 -141 -60 188 -36 -134 174 33 -174 67 74 -139 77 175 -131 -77 137 -65 -67 149 -10
2962a0o9J96q5j78J87L7j39J34jk01J41R9j82M7J70j70j7J42j54o9K62o4j81J28
2986B3L2j73J34J08k05N3J57j67n1J64q5l4J64j16j30J70kj28J24L9j76J25P2
3009I8k19M9K08j34o7J67j13j07J97j3j57J23P1j65L9Q2j32M9J42j13n7J01l3
3032A6o1J03j8r3J07J8j46N4P1p0L7N4j18pJ05m9l8O8l1k3O9o2o1R8L3r2N1%q6
3061g1O3Q9j34K2J03o7n3R5o2p0J51lj31M5Q5r6K3O5p5j0J11n6j03P9L7n7M5K
3089B7p2M1M1l7mK4j6J1J6p3J2P8k7m2K3j0l8Q6j4q0M3O9p2rK7m3L1M2l4l0L0
3120@J9k2Rl6J4M8j4n8L0K4m1N9Oq6K5Q1p1k8O2k3oN1l8o3N2N5o4KK6k3J8J9m6
3153a9j9O2lk3Mk6NO0l9m0N5Jl9K0J6o4O0M3q9j7O8j9j5L4k9j5M2ql5J7pkO2m2
$$ plain form
2962 -10 -79 117 32 -146 41 78 -61 73 72 -129 12 111 -71 -24 146 -24 -41 101 -53 -122 140 76 -105 23
2986 23 55 -118 16 124 -81 -28 129 -38 -89 75 -10 -44 120 4 -126 44 42 -86 38 77 -99 26 98
3009 98 -121 -72 136 2 -65 102 -11 -118 79 66 -91 32 103 -62 -23 59 -73 -24 118 5 -52 49 16
3032 16 -45 58 40 -53 54 72 -74 -20 51 -19 18 72 -46 -53 52 3 -35 33 2 -21 48 -14 -75 23 56 -36 15 15 -71
3061 -71 -8 81 -53 -31 72 5 -48 47 -15 -85 66 63 -68 -23 62 -34 -11 54 -21 -31 80 24 -79 0 37 -20 25 27
3089 27 -45 -4 37 0 -4 20 4 15 31 -42 -30 48 21 -21 2 -8 -46 40 26 -54 -11 58 -14 -23 4 -39 -8 34 0 -30 0
3120 0 19 -3 6 -30 -16 32 18 -40 -10 14 -27 32 38 -48 -23 58 -13 -41 21 -2 -8 43 5 -58 -6 49 -15 -13 13 -10 8 27 -19
3153 -19 -38 24 21 -2 2 -24 -19 41 2 -38 17 18 -21 -1 15 -49 11 54 -35 -52 16 -3 -18 16 -13 -28 14 6 -29 -12 -19 -21 41 -1
3187ap1Q6L6r5M4M2q0J7J01j04m4J09J6j05N8K0r0P8M3j01PJ10p5n0P4l9k6R6
3215E6k3p6M5J9m8M5k1m1Q6Qj16M9P2j18O3J11j59m6J89m6j66J49N6j72Q1R6j69
3242g6j0J96q0r3R4k7n4Q0j8n7Q6j1o7O3qj03J19Q6j96K0J57j25o9J80o6j11J54
3269F4Qj78R1J12j27J7J10j30k6J49q5r5J38kr4P6Nj25Q9Q1j22M5M1q1K5O3j15
3296f6J4J63j16r6J78o1j48K01N3k77J13K00k28o8K58r4j52K16mk12R1J33j31
3319c3OQ1p4RN5r3K6R4r3JR7j31l1J69k4j58J51K9j78Q1J04j66N2J69j66p9J64
3346F2m9j07J60Kj77J37P0j93M9J32j09k2J20j00n0J14j4p0Q1k8n6Q7k3j10J19
3371B5O3j46L9R5j37qJ79q7j37J48N2j55L0J06q3j1P8m2n1L5M2pj2l8M7K4r1o
$$ plain form
3187 -1 -72 14 50 -45 -1 41 -39 -22 79 -25 -69 40 56 -49 9 29 -61 17 60 -41 -34 76 1 -49 25 -14 -40 56
3215 56 33 -43 2 21 -27 18 -3 -44 42 50 -66 -17 55 -63 0 111 -48 -94 95 49 -117 32 88 -84 -3 93 -76
3242 -76 -86 110 30 -63 31 4 -50 30 12 -45 41 30 -37 26 18 -85 34 120 -76 -56 101 -24 -93 87 21 -90 64
3269 64 72 -106 -15 97 -30 -13 97 -33 -59 90 5 -90 48 46 -48 28 33 -92 -3 78 -44 1 42 -39 -14 49 -66
3296 -66 -52 111 -5 -101 77 16 -132 69 122 -155 -42 158 -70 -138 120 26 -126 90 86 -126 -35 98 -33
3319 -33 -27 54 -20 -11 44 -49 -23 71 -22 -21 76 -55 -86 83 59 -99 52 81 -97 -16 88 -78 -26 143 -23 -102 62
3346 62 13 -94 66 68 -109 28 98 -95 -46 86 -23 -45 75 -25 -75 39 25 -45 36 8 -48 39 16 -94 25
3371 25 88 -58 -19 76 -61 -69 110 23 -114 34 86 -69 -39 67 -16 -27 51 9 -42 -7 35 28 16 -22 25 49 -42 -48
3399d8R4l5n5R8j6j14N9R1r4k7R8l9n4N5J4p8N5P3q6m8N6%k6K9K5o4J6O4m9o4
3429g0Q2N4r4nP5n4l6Q0Nr1K7Q0m9n5M9K7k7oK2Jm5J9P4o0n1N6O6r8k0Q1j7o6
3461d6Q5J4j14K6R0o3n9Q7Mm1RL2n3K8L5k7j4OrK9Jp2L1O3o1j8N5l1k4Q6j7j13
3493h1P0P3j01J7Q0r1nJ23q1j09J40M1j31N1Q2j20oJ43p6j17J45K3j18L6N3n3
3519a2J3M3n5j7M5l4K6J2p4N5O3j00l4J33n7p2J20Pj60P7J31j58k1J55q6o4J07
3546D3m1p5J10J5j07N9J6q3P2M5j30O1J15j33k9J28r7l1J67p7j50J65M0j74R5
3571DJ04j77L4J72j65p0J96l1j65J47J0j60J18Q1j59J7J32r4m9R2n8j0Q9m6m7
3596c5N3l9nQ0o4o2J36j2j51Q8Q3j41L5J45j48p6J90l2j37J12N7j44N7P6j15J
$$ plain form
3399 -48 46 11 -44 54 38 -76 -17 74 -20 -47 51 12 -42 13 27 -51 4 77 -9 -57 -1 -1 -27 2 27 -37 -21 43 -6 -70
3429 -70 12 66 -28 -33 42 -12 -48 32 37 -54 -27 53 4 -51 -2 25 -2 -8 14 15 -30 -11 63 3 -48 8 74 -24 -44 37 20 -46
3461 -46 39 53 -61 -35 55 -8 -67 20 24 -17 -8 24 -29 -1 34 7 -7 -1 -10 19 20 -52 -21 42 -19 -37 18 -13 -37 49 32 -81
3493 -81 -11 62 -39 -22 58 -33 -38 85 4 -105 35 76 -55 -4 78 -42 -48 95 19 -98 47 70 -48 -12 41 -12
3519 -12 1 44 -11 -28 17 -17 9 21 -53 2 65 -35 -69 64 7 -65 55 62 -98 -21 110 -48 -69 86 0 -64 43
3546 43 2 -73 37 52 -55 4 20 -63 9 54 -76 -15 100 -33 -62 66 -31 -62 105 28 -122 43 83 -91 4
3571 4 108 -69 -35 137 -28 -98 98 67 -98 49 59 -101 17 98 -61 -44 88 -6 -55 37 -21 -31 58 12 -35
3596 -35 18 -21 -26 54 -10 -72 64 52 -99 -11 72 -69 -34 111 -37 -113 77 45 -92 20 77 -67 -10 66 -49 -48
3622d8J08m8m2M8l1MN8m1n9R6j3o5M9J8q7O6O1j16qJ11m8o2J06l6q1R1K0j06K4
3651c1R7o6l9P0k8m7O5K7q5OO6l9j8J3QqQ%nk3K0L9k0m9K8N7n8k9O0k3l3N6Rr0
3685f2K7J07o7o0Q9k8n0O1J8p1K6O1m4m0M8qj3L7k3n2L1M5m6J5Oj8QL1n9PN5j2
3717A9k3Nj5k0N1om1M0K0n0J2K3m4J8M5k5m5L6K4m3J2K2k4LJ8qk8K3J6Pj6k6J1
3750iL4k3J4Oj7jJ6j6k7L8J0j1j9Lj4L0J8k7k1J6J7j3j1J4MkJ4k9j5K2L2k8pN
3784Ck8JL6k0l3O2J2n2kL5j7QK3l3k7N2j8j6J3%j8L2Mn2J6M6k4rK6k3j9N8po4
3818c5N1L0n3lJ9k3RL2k5lMqRJ8k2qN7m2l8L4Jl0N1Qr5N0M6o6mP6m4k7P7m7p1
3853g2R1L2j00M8M6q2J4O1n4l8J08l5n6L9Pk4L7J3o1K3K3j8QRm2M3N0r7j4R2l6
$$ plain form
3622 -48 60 12 -30 18 -13 -9 49 8 -51 45 32 -33 16 34 -53 13 74 -42 -50 61 13 -49 57 21 -60 31 51 -55 -31
3651 -31 66 0 -39 31 3 -44 21 48 -37 -31 35 -4 -22 -9 -1 -9 -1 -1 -6 -29 -9 30 10 -39 -11 46 -12 -41 19 -4 -37 19 28 -62
3685 -62 -35 72 5 -55 34 6 -44 17 35 -36 -10 51 7 -33 15 7 -6 31 8 -44 -13 32 -14 1 7 -11 -3 28 -31 -24 31 19
3717 19 -4 1 -14 -34 17 11 -30 10 30 -20 -8 15 -29 -11 34 9 -36 0 24 -19 -7 15 -9 -6 12 4 -24 -1 15 22 6 -20 -9
3750 -9 25 2 16 22 5 4 20 4 -23 15 25 14 -5 -2 -16 14 32 5 -16 0 17 4 -7 7 11 9 23 -6 -21 1 33 5 -2 3
3784 3 -25 -24 12 -8 -41 21 33 -19 -21 14 -3 5 28 -5 -32 20 2 -14 -1 -1 -19 13 17 -35 -19 27 3 -6 20 -3 -22 36 29 -35
3818 -35 16 46 -7 -10 9 -14 -5 27 2 -1 3 -5 4 22 0 -8 49 7 -31 3 4 -26 25 33 -62 -12 34 -32 -36 40 -4 -31 46 -1 -72
3853 -72 19 51 -49 -1 45 -37 -23 38 -16 -54 54 19 -37 2 9 -15 22 35 -26 -3 20 2 10 19 -23 20 70 -27 -41 51 15
3884A5n9R8k7r5Q0N1j10J9R5o8k9O9l8n2P5J6p7L8K9m5K0J0l7K1K6l9j4M2l8K
3914b2Q3p2n3J06j0r2P3L3q4L2P9j13l6J36l3q5Q2J2p8L7P7r9nJ02n0m2L5ll3
3943b3N1ql6L2rj8K5lk3N8Pj06N2N8q1J4Q9r7n2J26k0j25J19M2j13J7R5j31jJ36
3973G5n7q4R1K1r4L4N0o4L5K5n1J0J1k6L7M8r4jJ01q4l2J11k1j02J10J3j35M2
4001c1J13r5l6J07m3p8R1jo3O7K3o2mRm2N9K1n9J8L8o7LP3o0j4R1m2p1N9J0l9
4032b5M2L0r5NQ7n3m6J02j8o9O2Pp8K3J01m1p4M4J7m0lL9%l5J8K9m5j1M9M4n9
4063Gm1O0Pp3L1O6p1j1Q9k8j11N5R8o8l3P7l5q5Q3K7q4J8P4m0o1M9Kj2L4j1l1
4094a8jK5k3jL2j7J5j8l0QM7k0J9On8JP2m0n7Q9K7q2K0O0j04J1J31o4r0Q1L8j09
$$ plain form
3884 15 -44 54 27 -68 12 63 -47 -28 67 -1 -30 39 1 -51 24 40 -37 1 30 -15 5 15 -22 -1 25 -14 -28 14 -24 -22
3914 -22 61 -11 -64 42 32 -60 13 46 -38 -6 73 -40 -76 60 27 -58 24 36 -42 -5 72 -27 -32 70 20 -22 13 10 -23
3943 -23 28 20 -16 16 7 -11 14 11 -12 46 53 -53 -1 57 -24 -10 79 -18 -70 56 36 -89 30 72 -41 -24 71 -60 -61 75
3973 75 18 -66 25 46 -48 -14 36 -28 7 32 -19 -9 2 -24 13 61 -33 -34 67 -17 -49 62 41 -61 49 62 -73 -31
4001 -31 82 -13 -49 58 15 -63 28 27 -36 31 54 -8 -12 -3 -45 14 35 -24 -6 32 -35 -32 41 -19 -33 58 16 -55 4 14 -25
4032 -25 17 47 -48 -43 44 -9 -55 47 29 -40 22 29 -49 -26 75 34 -40 4 21 -19 -22 17 17 -18 0 29 -16 -27 22 66 7
4063 7 -34 26 33 -40 -9 57 -14 -25 64 36 -75 -20 78 10 -23 54 19 -66 17 44 -40 -22 52 12 -49 0 2 -10 24 13 -18
4094 -18 -19 6 -17 -18 14 -3 12 -6 -36 -28 19 -1 18 24 -34 -33 39 -1 -58 31 58 -24 -4 56 -48 -37 94 30 -60 21 59 -50
4126e0K2R5o6k6O5j0p9L4O2k3m1J0K5j2m6K9M2m9j2Q2l2j10R5P3j15nJ17q5p0
4155h0J29rj17Q2Q9j21l9J05m5l1Q1j6p8M7M5o4LM1qJ0j5k6OK7j5J0K3m4j9P8
4185D9m1n3Q5Qq4N1K8r6K4J29q6q0J14lr9N2O2r2J5O2l5o6M9L3qj1qjRl1J1N7
4217D4p4j0R8n5j20J38N8j53N6R7j24l8J60n8j21J49N4j69L4J06r0k4J19n9p3
4242e5Q3jn6J7M4j7pJ9k9J0Qj2M6k6p7P0L4j08L6R6p2m3R7n6r2J06P0j23QQ0o3
4273a3m0Q1j4m3N8Oo1rK2K7Kk2pL3j9n1Q4po4M1O7j11j9J34m5q0Q9%r1M9P2q6
4305a7k7J12k6q1L8K0m0J8N7m2l6K0K9l7j1L9J3m3lL5k5k6O7Jp1LP1m3l9N8J3
4336B7o3K9L4o1j7P6pn5K0M6m6j5M1Mk1K0J3k8l8M4K5k7k6N7k8l7M0L1n3jO4k9
$$ plain form
4126 -50 -28 67 1 -25 40 30 -49 -15 47 24 -17 -7 18 6 -40 -11 31 -18 -30 52 20 -90 5 78 -37 -42 75 -10 -80
4155 -80 49 40 -77 5 94 -27 -66 39 -6 -37 44 28 -50 -3 42 -22 -19 22 14 24 9 -17 -11 16 1 11 34 -10 -29 49
4185 49 8 -45 40 48 -36 15 43 -53 -29 100 14 -66 48 45 -54 -2 60 -32 -17 45 10 -56 -7 26 18 7 -1 -2 7 -24 -13 44
4217 44 -30 -40 58 3 -117 21 79 -74 -18 79 -45 -83 77 19 -102 47 101 -68 -34 72 -18 -42 77 18 -55
4242 -55 28 27 -29 -12 32 15 8 27 -2 8 16 4 50 24 -53 17 51 -57 -21 75 3 -40 57 1 -91 15 85 -38 -30 50 -13
4273 -13 -53 28 14 -29 29 35 -26 -35 -13 14 16 -6 -13 20 1 -50 34 27 -37 4 71 -40 -59 75 30 -50 39 39 -52 -3 69 -17
4305 -17 -44 68 42 -39 -1 19 -21 -3 54 12 -24 -4 25 -12 -23 16 29 -14 -17 18 -7 -33 34 35 -36 -33 38 -5 -44 14 27
4336 27 -36 -7 27 -34 -51 25 18 -37 -17 29 -17 -32 9 13 -8 12 25 -3 -41 3 28 1 -25 32 4 -33 7 38 -15 -16 48 19
4368A9o1M7L8l7lL6j6n5M4J5n5J6M3%m8OK4k5lK6ql8M4J7n4J0N1j5l8K6Oo2M3
4401gL7k8l8M2J5n2JL9j4J0Rj5nj2L3Qk3j0J2jj1J8Nk7J9K4l8k5M5J2m3J3L0k1
4435Bj2K8j6j4RK3k0JrK4j2j7J7J7l3PJ7k5j8M6K7p6J9N4m7k7Q0m1n1O0J9o3K
4468b9P2k4l2J9Jl3K4L3l1j1L0jk0mnK7j4KK0k9l0M7J4n7K9L9l7l9O6j0n6O2K1
4501D4p5JO1l2k8N0j5l3M0ok8J3J1JKk7j2M9j2l9L0J5l9K9K8o0nO5k2m8O2Nm5
4534b0J7M8p4KN7k8l0J6L1j3Qjk3J1J7j7NJ2j2K3qn2L5K8m1JN0o6pO5j6p1O3L9
4568D9p3J1M7n3qO9l1m8L2K6m9L5Nk1lK4k3oK1j0RJ8m3KN4m4j9M9k0l4N7Kp3L8
4602a0O9p6k6P8k4m4N7jm7L6L4n8j1L7k9K3Lk5JJ9j0rL2k1j6M1k5l5N5Nm2L0J3
$$ plain form
4368 19 -42 5 43 6 3 39 23 -32 12 27 -28 -12 31 31 -17 -11 13 -12 -15 11 3 -35 9 26 -28 -18 33 18 -20 6 12 -50 -7
4401 -7 30 2 -36 6 21 -31 -30 9 -5 5 14 -1 -6 -18 15 23 0 -10 2 1 -10 8 13 -14 5 29 -9 -34 11 23 -20 -7 23 2
4435 2 -10 18 2 -12 -3 20 0 1 -8 16 4 -13 4 21 -12 -5 12 -13 -31 15 42 -34 -15 39 -8 -35 45 4 -47 13 32 -31 -29
4468 -29 43 19 -13 6 7 -26 -2 31 0 -11 19 18 -2 -6 -11 16 2 4 24 -5 -35 12 26 -31 -2 37 0 -39 27 17 -39 23 44
4501 44 -31 -30 31 -1 -29 21 6 -27 13 7 -21 -8 3 4 6 -21 -33 16 4 -35 -5 10 -29 0 28 -32 -37 28 6 -42 20 25 -20
4534 -20 -3 45 -29 -27 30 2 -28 -12 19 6 14 13 -10 1 18 1 6 18 6 29 21 -31 4 32 -9 -8 42 -24 -31 34 18 -53 10 49
4568 49 -24 -13 34 -19 -27 42 11 -37 -5 21 -28 7 12 -9 -12 12 -11 -17 4 -6 3 21 -22 -20 34 -10 -29 20 0 -34 23 25 -48 -10
4602 -10 59 -17 -43 35 11 -33 24 23 -24 12 46 -12 -23 14 -15 8 11 -14 -13 6 -4 -13 19 -2 -18 23 -2 -37 18 23 -19 11 24
4635B4p3K1O9n8l2P6k2m4M8J1o4L5N5p1qO1l3j0L6k2k3M8j0m0K9OqJ4Qo5N1L1
4667D0o6L2K7k9k8O9m2l5N4K3o1NN2m4j7M2k8j4K3Nj9Rk1K3J7k7j5K9pk8M0J5
4699B4n3NM3l7k0L9Rn2N6lo5L7M6n4kO8m1l2L1J3l3L5L1o1qM0nk5M3j3k2J7Nk3
4733gJK9Nj2j9j8L2kl2L2Mk1PK2m4KO2l0k0K6Ln9L9K3l2QK0k6nJ6j6J1K2qm1K7
4769aJ4j8NJ5k9NK5k2m2O2Rk9nJ7k1LL1J2m9L3J3k2NlOqK6k5k6K6MoqRNj6PkN
4808ElJ0lj8pK2J0k6K1%j5k1J7%j2K9Ok4RQl0J5K8j6j4J5J7l5J0J1j1JK0k5j8
4843b4M4j1lQmj7K9j2k9M0J0j9qK4l5QM1l1k6K7Kl1K5%qOK0l4j2M0j3Rkk7kK9
4879A4k4qK4kpK4j9l3L0K4l8LM5n2QL5l3k3N0K0o8J9Rj5J2L2l1jL3k1k8L8Lj5
$$ plain form
4635 24 -49 -28 41 -17 -49 27 5 -39 9 20 -44 -9 46 -25 -33 28 -5 -15 21 -1 -24 24 14 -26 3 9 1 15 23 -42 9 40
4667 40 -26 6 33 4 -24 45 3 -32 22 45 -16 -11 41 -3 -20 22 -6 -20 3 8 -11 -2 -23 0 17 -10 -25 4 -3 -31 9 24
4699 24 -29 -24 19 -18 -38 1 10 -42 14 11 -54 -17 29 -25 -27 41 0 -32 -1 12 -21 14 45 -16 -24 16 11 -14 29 16 -6 11 16 -7
4733 -7 -6 23 28 16 -3 -21 11 9 -23 9 13 -8 -1 21 -23 -21 41 11 -9 17 20 -39 0 23 -9 -1 19 -7 -12 4 -12 -1 21 13 -28 -1
4769 -1 13 -5 0 15 -14 -9 16 -6 -48 14 23 -6 -11 6 -15 -12 19 31 -18 15 28 6 11 8 14 6 32 7 -19 7 11 5 -3 6 11 -5 2 0 5
4808 5 2 12 9 -9 -16 6 16 -10 11 11 -4 -25 -8 -8 -20 9 15 -9 0 8 -22 -7 21 5 -9 6 23 -12 -2 9 -2 -1 19 -6 -24
4843 -24 20 9 6 14 10 -7 22 10 -19 21 31 12 4 28 -7 1 42 11 -15 12 14 -17 8 8 0 6 26 -8 -20 20 7 16 14 -13 -15 14
4879 14 -10 -18 6 4 -3 21 2 -31 -1 23 -15 -12 33 -19 -11 24 -9 -32 18 38 -30 -11 -2 -17 -5 27 -4 -5 28 7 -21 17 20 5
4913EJ6nl4J2K1j8JL0l5RK1l0qM5ml4QmqK7Mj9j6K5j3j8PjJ3Rjk3J1j6K1Lrj2
4951b0J4J2k4J1K6m4K9J8m3j0M4Pn0L8Ll9K9K5l3KM7k1k8J2J6k8J8J2k9kK1j1
4983Bj9J1J6o%qJLj4J5PJj0J1nj7MNJ1j7%j4J4QjlpQqJ1k1J8J5qj5MomK2Qj6%
5025dK4k4LK1j7qK8ln5K0L5j7JJ6jk8J2Nj2kL2j7j5RKrPJ5rk7J6K1l5lK8j3j6
5062b0J9j3rJ8Pj6j5L8lm6M6qj1J0L3l9k1M6qj5J6lj8J0J1pJQkj4lMl%M%NLPj
5102A1k7L3opPok4L2J0k1k0K1qj0J9omj0K9j9k9K8J0k1J3kj3J9lj0J1J8j7nmm
5138a5qJ7J3k5J4J2kj8lmL5j0MLmnQMqOKj8KOjqL1k7j5J4J2j5J6Jj9J6Qk8lK6
5178A4oj3noLRJ9k5j1K2Mj3NlmJ8j6prL1j1jRj5J5J1k1oJ6OLQl0pK5Oj9QQj6R
$$ plain form
4913 5 21 16 -18 -6 15 -3 -2 28 -7 2 23 -7 -15 30 26 -8 0 -4 -12 15 19 0 -16 9 -4 -22 -15 -16 -3 6 5 -18 -7 -23 -2 1 -8 -20
4951 -20 -6 6 -18 -7 19 -25 4 22 -21 -31 13 20 -30 8 11 -28 1 26 -7 -5 42 21 -7 5 21 -7 11 23 -6 -8 13 2
4983 2 -17 -6 10 4 4 -4 -3 0 -14 1 8 9 -1 10 5 -12 -8 -3 8 -9 -9 -23 -9 -1 -2 -5 -12 -4 -12 -1 -22 -4 11 3 -12 -8 -14 -18 4 12 -4 -4
5025 -4 20 -4 -1 20 3 -5 23 20 -35 -15 20 3 4 20 19 -9 3 8 -4 -6 26 9 -6 3 5 -4 3 18 9 -18 -2 19 -16 -19 9 -4 -20
5062 -20 -1 -14 -23 -5 2 -14 -29 9 6 -40 6 -2 -13 -3 30 -9 -30 16 8 -7 9 6 -12 -2 9 2 3 11 9 -5 -8 -4 -7 -7 -3 -3 2 5 12 11
5102 11 -16 17 11 4 11 5 -19 13 23 2 -18 3 -5 -15 4 -2 -6 -16 13 -6 -35 -7 3 -18 -5 -7 -20 -1 -4 -14 -3 15 -2 -7 -11 -15
5138 -15 -23 -6 7 -18 -4 8 6 -12 -15 -19 16 6 10 13 9 4 12 16 8 14 16 -2 0 6 5 -3 28 1 -14 0 12 -3 13 14 -5 11 19 -9 -12 14
5178 14 8 -5 -10 -16 -13 -4 15 -10 -21 1 5 -8 -3 -6 -10 8 -8 -15 -24 7 -4 -5 4 -11 4 15 -6 -12 4 10 13 21 -9 -16 9 15 -4 4 12 -4 5
5219EJ5k7J0K8ok4%QnQ%j0QJ1j4oNqJ1j2j7NK0j2mK2k7pK8Lk8J5K1l0PJ7k8j1
5257b9L3mk5K4J5l2RJ1j4MK3kk0QJ1JmkOmlqJ6kqOPl5J1K7j2j7K3rj1K7k3j7K7
5296HRj9qJ3k3PJ9lj3J5Ok3K2j0j8K4kl2J9J3j4J1J7m6J3K2ok4K7J8l5J8Pl1J1
5331hL5j6j8K1nnNp%qJ3%j0qJ7J6l0OK1mk0J9qj5J0K3m3nK6Lk2K0Nm0RM2k9k5
5369c5M9mk8LK7k5j0L8j5k2K4J1k7pJ0O%kJlKJ4oj0NRKrQk%oJ1j2nK4j0joJ4o
5410Gj0J1jnJ4Pk3j1MJ7Kj6mJ0j4%J3qoJ4Qj1j4K5J0l6QRjqK5ok4J9Oj5j8J7Q
5449CLLKj4QJ4j3j6K3nj1K0lqjLRj0JJ5Jk5QqjJ3opJO%j5LJ3Lj4J8nk6K4K0l2
5491fJ0Rj9pJ2rlJ1Ok5J6Rj2PQk2J5QLj7NJ7k6J9oj4J7Rj4KOj0LJ7k4qK8J4l7
$$ plain form
5219 5 20 -7 3 31 25 1 1 9 4 12 12 2 10 21 7 1 6 -2 9 -3 -20 -15 5 -7 -11 11 -16 -23 5 8 -20 -5 16 -14 -7 10 -18 -29
5257 -29 4 0 -25 -1 14 -18 -9 2 -12 -8 15 13 -7 1 12 13 9 7 13 9 6 -2 14 12 4 10 17 -18 -7 20 8 -9 14 5 -6 21 -2 -19 8
5296 8 17 -2 -10 3 -20 -13 6 3 -10 5 11 -12 10 0 -18 6 4 -28 -9 4 -10 1 18 -28 -15 7 1 -23 4 22 -13 5 12 -19 -8
5331 -8 27 11 -7 14 9 4 9 2 2 -6 7 7 -3 -11 6 22 -8 -2 19 15 -5 14 6 -9 1 24 -19 -24 2 5 -17 3 8 -32 -23 19 -10 -35
5369 -35 14 10 -18 -15 12 -13 -23 15 0 -22 2 13 -14 -21 -11 -5 -5 -7 -6 -9 -7 7 1 -9 -4 5 7 -2 6 4 4 -2 9 -3 -8 16 6 5 -1 13 7
5410 7 -3 8 7 2 16 23 0 -11 -7 10 12 -4 -8 2 -12 -12 1 -7 -13 1 9 -2 -16 9 19 -17 -9 0 -1 -9 16 10 -14 5 11 -4 -22 -5 3
5449 3 6 9 11 -3 5 19 6 -10 13 8 -3 17 14 6 5 8 17 7 8 23 24 -1 7 -1 -2 11 5 -2 -1 5 5 -10 -7 6 9 -5 13 8 -18 6 26 -6
5491 -6 4 13 -6 -13 -1 -10 -13 -2 4 -21 -5 4 -8 -1 7 -15 0 8 11 -6 -1 16 -10 9 3 -11 6 15 1 3 9 -1 2 19 -5 -13 15 29 -8
5530hJ4MmJLk5J1J9k1jRj8QQoOqJ7mloj2K7Pl3J0J0j1RNj9j3M0Mm1J5J6oMmno
5572gK2j4j9L0j0lJJ7j5mK1j2pJ6ljQk0j3L3j2r%Jj2K2jj9J1J0j6kRj3J8lj4M
5610fPQnKj2j%Oj6RKJ0j3QOk8J6Rj3J1RqqJ8qlJ9ok0J0kLMmr%K8k3j0L0jk2J5
5653A2rKjJ2j5lJ4qjkqqK5Pk0Qk0QJ2lj0jK3j5lJ1j9J5Pj9pOkJ7j5LJ5lNk8mK6
5695Dj2oJ8j7MJ5kolK3LrJj0RJ%pkO%q%mQrMj0nJ9%mjkQj1n%kJ5Qj3j8NRpNKp
5744a3J1J7k1J0rJ4lklj5J8J6j7mJ5j0oJ2pmLJ1moJ4jM%j4oJ8j9Rj4J9njqrLJ1
5785Dj3%Lj5K4kmj2K2j4Nmq%J0Jk5K0%PqpMJ3Mk7OL1p%lj5LK1j5pjJ8J%Prj1K3
5829B0nlLKlj7J5Qk3LJ5pmJ1Lj4Mok0J7J9j3jProj0OlKQj6J3LMj9J3mJ6nj0kK8
$$ plain form
5530 -8 6 10 6 7 10 -15 -4 15 -6 -7 2 -16 -8 0 -6 0 -8 9 5 2 -4 -16 11 18 -15 -5 5 -6 3 8 -11 -24 16 20 -21 -6 10 4 8 4 -1 -7
5572 -7 15 1 -18 12 2 -1 0 17 2 -2 19 7 0 16 13 12 20 0 -13 20 8 -1 -1 0 -12 10 9 -10 1 11 -5 -7 2 -11 7 4 -10 -6
5610 -6 1 9 4 6 -6 -7 -7 -1 -17 -8 -6 4 -9 -1 5 -23 -7 2 -11 0 9 1 -7 11 3 0 19 13 -7 3 1 4 8 4 -5 -5 23 0 -10 20 19 -3 12
5653 12 3 5 4 16 1 -2 12 4 3 1 -7 -15 10 17 -3 5 -15 -7 5 2 -8 -9 14 -1 -4 7 -12 3 10 -9 -16 -10 -12 5 -10 -7 8 5 10 -18 -22 4
5695 4 -8 -14 4 -13 -9 6 4 -2 -5 18 21 12 13 3 12 13 13 6 4 10 10 2 2 -2 6 -3 1 -9 -14 5 5 1 0 -2 6 -5 -10 -10 -12 3 11 -2 -20 -15 -6 -13 -8 -6 -13
5744 -13 -2 15 -6 4 -5 9 6 4 1 -14 4 20 3 -1 14 4 -2 10 3 -1 2 13 9 3 17 16 20 20 6 0 18 -1 8 -6 13 8 7 -1 -10 -7 4
5785 4 -9 -9 -6 -21 3 1 -3 -15 7 -7 -2 -6 -14 -14 -4 -3 -28 -8 -8 -1 -9 -16 -12 1 5 -22 -16 15 8 8 5 -10 -7 14 -1 -8 -9 9 10 10 17 8 -3 20
5829 20 15 12 15 17 14 -3 12 20 -3 0 15 8 4 15 18 4 8 2 -18 -1 18 5 4 11 2 -4 -14 -8 -11 -9 -1 -17 -4 -1 3 -16 -3 -7 9 4 -6 -8 20
5872B0k0NRj0jkRmj5K4mj6K0j2LJ9j3j8J8Pl0J2OnPKnrj0J5%Nk0J3MokJJ8k0J3
5913HPj1k5L0pj1NPj9J3Pk4J2kKONj1PJ0j3lOKLlj3PJ6Lk1RK6l3J0Rj4jK7mk8
5954fJ2J2ooJ4k0KRnnOnPpkPnj%Lj0JJ1%k6K0Mj2jJ3qj3L2j3j8J3J6l3K1J7k2
5995dmJ8lk5J4RqLRnqJ1J5k7J6J2orj0K1j1j4K4k1OLMKk0J9Kk7J0J1jmJ5k2j0
6034a5PRj1j0OJ9%kk5J1J5Qj1j1N%PjJQMpkKJkOrj3K6kj0J0j3L%K1j8j6K1Lqp
6077@K3j8LnJ9j7k6K3Jk0J7J0j1j0J0lj2J5Mk9OJ6Kj0pK0Rj8J2rj8J1J6j7lL3
6113A7qj6K1ok0OL0k2j5K3mpJ7lj1J3Kk0NJ5jj2Qj6J0PorJ9j5k%j3KJ6%k6L2j4
6152cj1K6%k9%K8j0j9RKj3J3J0j1ONJ2j6jnjRoj8K6jJJ2qk6K9Lk3J0J2mMJj8O
$$ plain form
5872 20 0 5 14 4 3 1 10 6 -9 15 11 -5 15 3 6 25 12 -6 12 19 -11 1 7 2 9 11 6 -3 -13 2 2 7 -13 0 4 -2 -4 -3 15 -5 8
5913 8 15 4 -21 9 2 -9 -4 3 -16 -3 4 -20 -8 -10 -8 -2 3 -8 -1 9 -4 -7 -1 1 4 1 -12 -5 11 14 -7 2 28 -5 5 14 0 -1 26 22 -6
5954 -6 6 18 12 6 20 0 2 11 6 1 7 2 9 2 0 7 2 1 1 4 -6 -5 6 6 -20 0 4 -8 -9 4 -4 -17 15 2 -16 -3 13 -20 1 18 -4
5995 -4 -8 10 7 -18 -4 5 -3 0 9 4 -4 7 22 -5 11 23 17 8 -2 19 8 -6 18 -3 3 6 10 12 -8 11 13 -14 -4 7 6 2 17 -5 -15
6034 -15 -8 1 -10 -20 -14 5 5 3 -22 -11 4 12 1 -10 -5 -5 2 1 2 10 14 7 5 7 8 6 12 3 -10 16 14 4 14 1 4 4 25 7 -9 12 15 7 0
6077 0 23 5 8 3 22 5 -21 2 3 -17 0 10 -1 -11 -1 -4 -16 -1 3 -26 -20 -4 -2 -12 -19 1 10 -8 4 -5 -23 -12 4 -13 -16 17
6113 17 9 -7 14 8 -12 -6 24 2 -13 10 6 -1 16 13 2 15 17 -3 2 17 16 4 12 -4 6 13 7 -2 17 2 0 0 -13 -11 5 5 -21 11 -3
6152 -3 -14 12 12 -17 -17 11 1 -18 -9 -7 -20 -7 3 -8 -2 3 15 -1 -2 -7 -8 1 -5 -23 3 2 3 15 7 -19 10 13 -10 0 12 8 12 13 -5 1
6192AJ6Jj7jjkJ2j1PNOj3lkJOmllKPllj3PJMk0J8Ljj0Mlj1K5Jk4J3J0pqJ8j1o
6237a2K6j3Jj8J8Oj2LJQoj2J5mJ7rrjjK6j4j4J8j0jJJ0j9QJ5%j2pmkJ4Jj8LJ2
6277Ej2lMJRj7krJ3%PkjOrnKJ3j0J1ljlJ2oPqQpoL%jJ6Qk1JMnONpmQKj0OJ4j5
6326DMjjqJ3nooK3j3mMj5JMjj8J0K3pj6J0Rj0Prj0J5P%j4KLJ1Nj6MRnLNMj5NJ2
6371A7j3MmQPrqMOj2oJ4kkK1j2j9J0kqkJ1Mj8MKj2JJ8j8J8rpOKjj0K1kk2J3J0
6413Cj5J3nJj1POopLJ9lorK5j1J2nj5QRJk1RQj6K3Kj2pJ7Kl2J5Pj0LKKoJ1plj4
6457a3K3Jj8J4k1J0J7j4nkLNoOrJ5l%Pj8OOnKKK0l1RJ6k0oJ9%k2J9J7k0PJj6R
6498EkqJ0J3j6POmj5J8j2j1J3ljK%kj6K6j5j0K3j9jJ1J1l3J5J6k9RMKkK0j9lJ0
$$ plain form
6192 1 17 18 1 0 -1 -3 9 -2 5 10 16 3 0 -2 -1 5 1 -2 -5 -3 4 1 -2 -15 -8 -7 -3 -23 -5 -2 -3 -13 -9 -12 -23 2 3 -21 -8 2 -5 -13 5 -6 -12
6237 -12 14 1 2 -16 2 8 -4 -1 0 8 2 -10 5 1 18 9 0 -1 -2 24 10 -4 14 4 3 4 14 -5 3 18 18 6 -1 -5 -7 7 8 -10 -7 5
6277 5 -7 -10 -6 -5 4 -13 -15 -24 -11 -11 -4 -6 -7 -1 -10 -15 -13 0 -10 1 -2 -3 -6 6 0 7 -1 7 0 -6 -3 -3 -4 12 20 -1 0 4 -1 5 10 3 -1 7 9 -1 5 19 4
6326 4 8 7 6 -2 11 6 0 -6 17 4 0 4 -11 -10 -6 -7 -25 -15 8 1 -15 -5 4 -6 1 -8 -18 -3 4 4 -10 -8 -5 6 11 -5 -1 8 3 6 11 15 0 5 17
6371 17 4 8 4 12 19 10 2 6 12 0 -6 8 6 4 25 13 -6 4 2 -6 -8 3 7 -11 -7 -5 -17 -16 2 -16 2 -7 -14 -8 -6 -7 -17 4 2 -20 -7 3
6413 3 -12 1 -4 -3 -14 -7 -1 -7 -14 -11 8 5 -1 -10 15 4 16 11 -4 4 13 14 -7 2 10 -6 17 19 7 0 17 19 -13 2 9 -1 2 4 6 0 11 4 1 -13
6457 -13 10 11 -7 7 -14 -4 13 -1 -6 -8 -5 0 -6 0 -9 6 3 3 10 -8 -2 4 -1 1 3 23 -8 1 17 -3 -9 10 10 -12 7 24 4 11 12 -4 5
6498 5 3 -5 5 18 2 9 15 11 -4 14 2 -9 4 1 0 2 2 0 -16 10 -5 -15 8 -11 -12 -1 10 -23 -8 8 -21 -12 -8 -6 -8 12 -7 -10 0
6537@oj1J0JrK3jk4J0K9k8J5J1j6nK8j0k2K0%k9K2Pl1K3K1k9%OMnQqjnJ5k1K3
6575A5qk7J8Rl4J8jRpMj7PJ4rqK0kj6J3jk2J3K0l8J5K3pj8J8%k0K4Mj9J5jj1Q
6613AJ6k1mK3l1J0J8Pj4J0j2pJ6Ll4J9Nj2J3Lj6j0J9rk0K5j2kJ8oj5OOknJ7j0
6650gmPqm%J6j7J1jj7J5Qj0%J8j4J6qj3J3pK0k0J0Pj3NqK0j5OpmnJ8klj6MJ9j5
6691eMPjrO%k1RJ8mj3NQj8Rlj1kK8j9%NnnKJ0%j6K7j4qJ1lQqMloJ4Nj8LJ4%n%
6737@J0q%J0k9QNJ7j1ONkjMlr%kMrj0J2OnKj4QNNk3K2kj6JOjj0K0j2j0J7%k3J3
6781a4Oj0K0mkj4K5qjJ0kk6J9NmQJ1j9Qjk0jK0jlLj0J0J1j0j5K2j4Mj0J6j5J2
6819FRk8KJ9j3j2%JNJ0Kk0KJ7j3OLJpmJJ0PMj2Pj6KK8j4j8J7KjRrj9K0J3pn%O
$$ plain form
6537 0 -6 -17 -7 -6 -15 8 7 -17 -7 22 -6 9 20 4 -1 27 17 -5 15 15 -14 8 15 -16 7 28 -1 -1 5 9 4 12 4 3 -2 13 -8 15
6575 15 7 -20 -2 7 -27 -9 -10 -1 -8 -4 -21 -14 0 -9 -17 3 1 -15 -2 -3 -25 -12 8 -30 -15 8 1 -17 1 1 -19 5 9 -10 5 4 -7 1
6613 1 17 -4 -8 15 -16 -6 12 19 5 15 3 -4 12 15 -19 0 5 -7 6 9 -7 -17 2 -7 -27 -2 -14 -16 2 -4 -19 -13 -7 -9 -14 3 -7
6650 -7 -11 -4 -12 -16 -16 0 -17 -6 -7 -24 -9 -1 -11 -11 7 -7 9 1 -12 1 -6 14 -6 4 11 -2 3 -5 15 0 6 -1 -5 -10 8 6 3 -13 -9 10 -5
6691 -5 -1 6 5 -4 2 2 -19 -10 8 4 -9 -4 4 -14 -5 -8 -19 -21 7 -12 -12 -7 -12 -17 -15 -5 -5 -21 6 -8 -16 -5 -8 0 -8 -4 -7 -13 1 6 -12 -9 5 5 0 0
6737 0 10 2 2 12 -17 -9 -4 13 2 8 13 11 10 14 11 2 2 0 4 -5 -15 -3 3 -2 0 -14 -6 -1 4 -19 3 1 -15 -14 -8 -9 -19 1 -11 -21 -4 -4 -27 -14
6781 -14 -8 -18 2 -2 -4 -18 7 -1 -2 8 6 -20 -1 4 0 8 19 0 8 7 -13 -14 6 5 2 5 -5 5 16 6 -9 13 -1 3 -7 9 -6 6
6819 6 15 -13 -11 8 -5 -17 -17 -16 -11 -1 1 -19 -17 0 -13 -7 -4 -3 -10 -14 -13 -3 4 8 -4 3 -13 -11 17 3 -15 2 4 3 12 3 -16 4 17 10 5 5 11
6862A1K%%rRj2PPNj0jJ1qj2QMk7K7k0M%J3j3j7J6J3j5KRpRoj1pMmJ0lQpQk0KJ7
6906cJNn%pRQj6KJ9kj6QmOR%k8K1Rqj2J1K%L%j7MJ6j4J3pqPjKl4L3%p%nMKNj3
6953hJpJ2j8K5k8K1JqkOj2K1%j8J9%npJJ6Mknjj3PK1qJj0KQjoPMJj8KM%nJ0p%
6999Ej1RMrLMr%lmQ%KJj4J6kj3M%JjklQpJ8j7J0J1rLLj6J9oJ1j2qJ4j4J0J3j4
7043CJPpJ5lK%roNNoLJj8J2q%nKMQj6KMlJ1ljonJ0j2oK8j7oOj%%PkjpJ9rkmMN
7094A%nrJ2LRj9pOLKPQoR%k1J0Rkj5J6qnmLJMJ2j6JnJP%lj2kKjJ5k0JK9k8jJ7
7141aoqJ3Kj9OJ1rrK0pj3J7K1l4K8J0j9j5NJ0j0K0LrJ1MrrNj4J1J0k2J2%j4J7
7179IKj9kK6k1j8K8j1jJ5pj1lO%nNmKrqJ2J1j1jKJ8k0J3Jj4OJ8j1rK4j8j1K5P
$$ plain form
6862 11 13 13 13 4 13 1 8 15 20 10 9 20 12 0 8 12 -15 12 -8 -4 -4 9 -4 -21 -5 8 -7 -5 4 -3 6 0 -11 -18 -14 -18 -8 -11 -3 -10 -2 -22 -20 -3
6906 -3 -2 3 -2 -2 -9 0 8 -8 -6 13 11 -5 3 -1 5 14 14 -14 7 16 8 -4 7 9 9 12 12 -5 -1 15 1 14 7 -1 6 5 7 -27 6 6 -1 -1 -6 -2 0 5 -8
6953 -8 -7 -14 -2 -20 5 -23 -2 -1 -9 -11 -5 -17 4 4 -14 5 5 0 -7 -6 10 14 12 7 6 -7 0 21 13 14 4 6 14 13 7 14 18 19 1 3 7 7 2 12 5 5
6999 5 -6 3 7 -2 1 5 -4 -4 -7 -11 -3 -3 -1 0 -14 2 0 -13 -9 -9 -8 -9 -11 -14 -6 -13 5 -12 -2 9 0 3 6 -10 9 3 14 2 -6 8 -6 4 17 3
7043 3 4 11 4 19 16 18 18 9 3 8 13 7 10 11 -7 5 -3 -3 -8 -6 -2 6 -10 -8 -4 -7 4 1 0 -6 -11 -1 -13 -19 9 -8 -14 -8 -9 -9 -9 -2 -4 -5 -12 7 -2 -4 -8 -4 1
7094 1 1 -4 -13 -1 2 11 -8 -15 -9 -6 -4 3 11 5 14 14 -7 3 12 10 -5 11 3 -2 -6 -3 -2 2 14 -2 -1 -6 -5 2 2 -1 -13 -15 -13 -14 1 -19 -18 11 -17 -18 -1
7141 -1 -7 -15 -2 0 -19 -13 -2 -11 -20 0 -7 -20 -3 18 -16 12 22 3 -12 -7 3 -7 13 16 7 18 22 13 4 9 -5 6 16 -6 6 6 -8 9
7179 9 11 -8 -10 16 -5 -23 5 -6 -7 8 1 -10 -13 -7 -7 -12 -7 -11 -9 -18 -26 -14 -3 -14 -15 -13 5 -15 -2 -1 -15 -9 9 -2 -11 13 -5 -16 9 16
7219A6k7J9J0j0oJ0oJPj6jJ8j4J6j0rNKmrK1j0kJlj0K4Knk5K1j4rJ7rj2J6J4j5
7258fj7K4rpPJ0k9J4J4ojOKOj9MJ1KpJJpqK1j8J1J2JoJ1j1kORk1kJ5j3j0J3oJ0
7300F%%poK1Mqj3J2pmq%Oj3J0Kj6LK3j1rJ6rj0J4Kj3MJ8lmnJJ4j7%Rlj0J5qLP
7344FJ1lj6J4J1mrLjj0mlK4j2mJ4kj1mRJqOk4K6%j2j1J4mj4L2j8j6OK0k0jJ5n
7384dj6J7qQj%J4j6KQj8K1j3J6j0lMMrJ7Pk7J6jqpK9Jk4QJ2j2j2J5%lkJj2K5j6
7425CKLqK0ok1KP%qjJ0k1LQjj7L6k5lNJKJJ8j1j0J5Kj4K4Jj7MOokKKQj7OJ5%k4
7470fJ2J9k8LK0Jk7J6Ok3MK9m0QK5k0qKJ5k0kK6j1j4J2j6KQMkMk2QJ8j7%J5j1
7508a0JJ4opMOk4K3QJk5K6j0LJ1j7qQK0%j8jRLOlnoJ5j2kOPjk8J1K1j9MLJ1k2
$$ plain form
7219 16 -11 8 18 8 2 12 6 7 14 -2 -3 15 1 17 7 -2 3 5 1 -8 13 3 1 2 -1 -11 13 15 10 -15 6 -8 -17 0 -9 -21 -5 9 -6
7258 -6 -23 1 -8 -15 -8 2 -27 -13 1 -5 -6 0 2 8 -11 -7 4 6 -1 0 1 -6 -14 7 -11 0 12 13 7 18 7 5 11 20 -1 -3 12 -1 -11 2 -4 6
7300 6 6 6 -1 -7 14 18 10 -3 9 2 -2 -10 -10 -4 -17 -7 -5 -21 -18 5 -6 -15 1 -8 -18 -4 -2 -15 -11 7 4 0 -5 -4 10 -7 -7 2 -1 -11 4 -4 -1 6
7344 6 17 14 -2 12 23 19 10 13 12 2 -2 -5 19 7 3 17 15 4 0 9 10 2 8 -16 10 10 -2 -13 1 -3 -17 15 -3 -19 -13 7 -13 -14 1 -4
7384 -4 -20 -3 -11 -3 -4 -4 10 -6 -4 4 -14 7 -6 10 0 -3 1 5 -4 13 20 -7 9 8 0 -7 22 23 -1 7 19 7 -5 10 10 7 5 6 -6 19 3
7425 3 5 8 0 20 14 -7 -5 2 2 -6 -7 3 -18 -15 -7 -8 -25 11 -14 -17 -12 -11 -9 -8 10 -1 -11 4 6 -8 16 17 0 4 10 4 2 4 6 14 -3 3 18 18 -6
7470 -6 6 25 -3 0 20 21 -6 10 16 -7 -3 26 -14 -6 19 -1 -9 -7 8 -12 -14 12 1 -13 -1 -17 -15 -7 -3 -5 -1 -23 -15 3 -14 -14 1 -10
7508 -10 -9 5 -1 -8 -4 2 -22 1 9 10 -15 11 1 4 15 -2 -10 -2 18 18 0 -1 8 11 17 14 9 3 18 6 4 10 17 16 -12 -1 20 1 5 8 19 -3
7550crJ9j2pMNj0R%j8K5NkmrPj0PmKqJ5rMOkJkJlPrLJ0j0RJ3k4KJ1J2j6kJ3j3
7595Dj4J9lj0RJ7j5qNJ4j4pQj3%J1%nj3J4oj5J6PrlONqQJ3k2mRpPoMlmK3%k8K0
7639BJ5rrJ5j0kJ4omj0J7nJLMj2L%JlJm%mjK4k2PKq%Mmj1QjJorJ2lJ2k1KlPJ0
7686bol%Qj5J7nnPnJ%jJ0nnjRj0J0Mm%J0Lj5QKj3oJ7QmjNj7OJ4mk0%J0JRj1j0
7732iJPJoj2J7kNj1NlkMJ3j2QJJk3J1R%rJ1j5PK2j3j5K1Kj3MJqQJ3lk2J1j3J3
7774ENj0mRnJ1Nk2J6%Jj0J0Kk2RJ0r%J3k7lK7j4j0J3j7kJ2Ok1J0%pJ6oj1J4J%
7814ej3K7mj3QmKPlnJMrJ8jj4NJ0Pk7L0Mk4J8nmnP%lmPKmj0mK1j1rOopMRj6jK2
7861Hqk0K8j4j1J2J6l7K7m%j0Pj0JK0pj3J7j6J0NjlRnrK4prjJ2j0PQjk7J8JmJ8
$$ plain form
7550 -3 -12 7 -5 -12 -8 -3 -13 -4 -4 -22 3 8 6 2 -7 0 -10 -3 -7 -5 -13 2 -7 -3 3 1 2 0 1 -2 5 -4 -1 9 -1 8 21 -3 -1 10 22 6 4 17 4
7595 4 -10 9 6 -4 5 22 7 -1 4 18 4 -3 5 -8 -8 3 3 -2 -15 -1 -7 -22 -6 1 -8 -11 -5 0 -8 0 13 -9 -13 -4 -11 -4 -10 -6 -9 -13 10 10 -18 2
7639 2 17 8 -1 14 4 2 16 10 6 -4 13 8 9 12 16 4 7 7 8 5 6 2 2 -2 -3 21 -1 6 8 0 0 4 0 -11 -3 -4 -3 -9 -18 -6 -9 3 -18 -16 -19 -12 -2
7686 -2 -8 -11 -11 -3 -18 -1 -6 -11 -4 -9 -8 -8 -9 1 -4 -9 -10 -1 -11 -1 3 -1 -1 9 12 -3 5 7 -6 -12 5 13 9 8 13 -4 2 16 12 -8 -8 2 3 12 1 -9
7732 -9 -8 -1 0 -6 -18 -1 -3 2 -9 -4 -7 -9 -5 8 -4 4 5 6 -17 -6 3 3 -6 5 -10 -3 19 6 -9 12 14 1 5 6 -2 6 19 16 -6 5 -8 5
7774 5 10 0 -4 5 0 11 16 -6 10 10 11 1 11 13 -9 0 10 1 1 14 -13 -16 11 -3 -13 0 -17 -19 -7 -1 -22 -12 -12 -19 -3 -9 -20 -6 -5 -5
7814 -5 -18 9 5 -8 0 -4 -2 5 2 -3 -2 2 -7 11 10 -4 1 11 18 -9 21 25 1 19 14 10 5 12 12 9 5 12 14 10 0 -4 17 6 -3 3 -3 -10 -6 3 -13 -14 8
7861 8 0 -20 8 -6 -17 -5 11 -26 1 -3 -3 -13 -6 -16 -15 5 -2 -15 2 -14 -4 1 0 -3 6 1 -8 16 9 0 -1 11 1 8 16 15 -12 6 7 3 21
7902B1mk2lK1ppJ5qRKkj9lJ2j3Qj2kJ0Mj8lK3j5OPj3MPj2p%J3j1J4mkRNj0QkJ
7945@LJ3qk3L4j8kMkoJ2J2j5OKKj3NnMNjj2J5pJqNpQlpNkrlJ7j4J4%Kj3jRKol
7992h%Jj3QJ0j0PjRj0oL3k0Rj4PNOPj2lL%lJMKj0J4krmJ4orKJ0j1Njp%J1k6NP
8038eJ2j3QLj0j0J8j0nLOrM%qJ1jPkokNJJNnmMJ0nkJ4k0NJJ5j7JJ8j6J6qqqJ4
8083HMKj0J2Oj4qNQnJpoqK1j0KmNrj3QPj2J6nj4RNQqmj2pRK5l0K1JmJ0j8J0ML
8128BqJ4Jj1PJ0j0qOjPj2J8j9QRj2MJ5nj4j3J8KpNl%JpRmlL%j4J4mLqJ4oj1J7
8172Gj1jlJ7k4LJ3qj2K6j2nkJ1J6pOj2k
$$ plain form
7902 21 17 -5 -8 13 6 -1 14 6 15 17 15 -4 -7 5 -8 0 -12 -14 -4 0 -18 -21 2 -13 -7 0 -13 -9 -2 -14 -21 -21 -8 -19 -5 -9 -11 -2 3 -7 1 -1 0
7945 0 3 16 8 -15 19 1 -1 3 1 -5 7 19 4 10 12 14 1 6 1 5 10 9 -3 12 5 6 -2 3 -4 4 1 -6 -1 -3 -12 -15 2 -12 2 2 4 -9 -10 -1 1 -5 -8
7992 -8 -8 -7 -20 -12 -2 -12 -5 -6 3 -7 -13 20 0 9 -5 2 7 13 20 8 5 8 8 5 6 10 12 2 16 14 5 1 15 9 0 2 12 1 6 5 -2 -2 9 -17 -12 -5
8038 -5 7 -6 2 5 -5 -15 3 -7 -12 -9 -3 -12 -8 -8 -16 -5 -6 1 -1 -7 -9 -4 -3 -2 3 -2 -6 -2 8 3 1 15 -5 0 1 16 -1 0 18 2 18 10 2 -6 8
8083 8 12 14 4 16 22 8 0 5 13 8 9 2 -4 -12 9 -1 1 -3 2 -7 -20 -12 -5 -17 -1 -6 -20 -11 -6 2 -6 -10 -22 -29 -20 5 -25 -4 -3 -7 3 -15 -5 -1 2
8128 2 -6 8 9 -2 5 15 5 -3 3 2 9 -3 15 -4 4 13 1 5 20 15 1 -12 6 8 1 6 3 3 4 -3 6 2 -1 2 2 -12 2 -2 1 -7 7 1 -10 7
8172 7 -4 -5 -8 9 -15 -12 1 -7 -19 7 -5 -10 -12 -1 15 8 14 2 0
8191@
$$ Imaginary data points
##PAGE= N=2
##DATA TABLE= (X++(I..I)), XYDATA
0@%%%%%%%%%Qj6J6j6J6k4L2l3M1n2O0p2Q8j02J16j34J52j69J93k22K52k84L19
32A69l57L97m43M97n54O15o83P58q39R28j029J141j264J400j553J726j924K154
50A139k422K742l128L603m213N024o161P878j0794J7006n0215N5669O2569j47691
64f8994N4277R3098j04608l8131J15838l7396o2122P3825Q518p3038L4476K4829
76B0572m1804K0306K8908m0604N146K4306l2316K51L8066k0985j4941K7057j0444
89C518k2153J9266N974p883O913n536m147J0457j5392l165L1418j3401k6822L4439
103A3486K546m6035K4942L4714m1978k676M2129k8750k4202L9353o096k6227L1213
116A2419R42l2210K3368P100l5492K5761K6031m5239M928M3118m0681k2563N8029
$$ plain form
0 0 0 0 0 0 0 0 0 0 0 8 -8 8 -8 8 -16 16 -17 24 -28 32 -40 48 -54 62 -72 80 -89 104 -118 134 -150 169
32 169 -188 209 -234 263 -291 324 -359 399 -440 488 -541 600 -664 736 -817 909 -1015 1139
50 1139 -1283 1459 -1669 1934 -2279 2745 -3416 4462 -6332 10674 -39541 16128 78697 -68994
64 -68994 -14717 78381 -26227 -64358 51480 14084 -48038 25787 34305 -38733 -4257 20572
76 20572 -21232 -926 27982 -12622 -7476 16830 -15486 -15235 22831 1846 -13095 13962 3518
89 3518 -18635 631 6605 -1278 5635 99 -4048 6409 -8983 -12148 19270 5869 -20953 13486
103 13486 16032 -30003 -5061 29653 -12325 -15001 27128 -1622 -25824 13529 7433 -18794 12419
116 12419 13361 -18849 4519 11619 -23873 1888 27919 -17320 -12392 30726 -9955 -32518 25511
129B5511r216m7678M0597K0050n5441Q620M4508k8813j6833L6233p563k8375J6766
142a634R470j3716O595O352p857J316l116n979J2907K425j2943R372N840j9639
156a0607L016J7693j1447m857J6921p770j3957J2319J545r755J1507L505j4489
169f376N254O341j3346M604J4175j1430m865J3283p711j0818J3641L563j0508
182d193N661L590r641K030M548m948M589L889r158K658O268j1888Q82J6103q872
197A518j0485J5744j166j8154J1226J2458j5945n56J5818r824j1337J2785L101
210E183r718M802N538p101k380L547K2L19M62M9K007l283m569N474K834n791L291
227F86M876q259k134Q085l292m049Q266k58q093L612K550o006L384N742n416j572
$$ plain form
129 25511 16295 -31383 9214 29264 -26177 -17557 26951 -1862 -18695 17538 9975 -18400 -1634
142 -1634 7836 -5880 715 7067 -790 526 -2590 -8569 4338 6763 -6180 3192 9032 -10607
156 -10607 -7591 10102 -1345 -6202 10719 2949 -11008 1311 2856 -6899 4608 8113 -6376
169 -6376 -1122 5219 -8127 -3523 10652 -778 -5643 7640 -71 -10889 2752 6315 -4193
182 -4193 1468 5058 -4583 -2553 1995 -2953 1636 5525 -3633 -975 5293 -6595 -5713 10390 1518
197 1518 -8967 6777 5611 -12543 -1317 11141 -4804 -5360 10458 634 -10703 2082 5183
210 5183 -4535 267 5805 -1296 -3676 -129 -107 212 674 723 2730 -553 -5122 352 3186 -2605 686
227 686 5562 -2697 -4831 3254 -38 -4087 4179 3921 -4172 -560 1990 -4016 -632 5110 -306 -1878
243a878M177l826j962N418m83k307L124j596l797K736P82j583L567j63m696K314
259a73J513m729K743N068m954j517N208l872m279O750J722n701K325L068n358
274b186q86M826r05k048K560L24k815p02J303J301j00q36J190Kl305O55L668k141
292i5j588M451r44n414K676L248m017O80M755l363l546L987K50l652K680K902
308C010l147j128J948j246j131K254J077j274o97J17m3m92L7J605N89j763k04
325d88R49j598l72L046L0k595J055R98k598J84K879q54j356J787m38k551J000
342i22J968q38k20R71r41j119P12M96j85M91L19n22o16m05K84Q93K21l62J02l13
362A4q09L45P78k84L3P64n03j224K64Q11j20R5N56m71r05K39N86l02p1Q40J40
$$ plain form
243 -1878 2299 -1527 -3489 1929 1446 -861 2263 667 -3130 -394 388 -1195 2372 2209 -2487 -173
259 -173 1340 -3389 -646 4422 -532 -2049 3159 -713 -4992 1758 3480 -2221 104 3172 -2186
274 -2186 -3072 1754 849 -1199 1361 1685 -1130 -1832 -529 772 672 -164 1026 1028 -2277 -1622 2046 -95
292 -95 -1683 2768 1824 -3590 -914 2334 -1683 -1003 3752 389 -3157 830 1080 -2572 108 3010
308 3010 -137 -1265 683 -563 -1694 560 1637 363 -334 -217 -260 -752 -715 890 1479 -284 -488
325 -488 461 -1137 -1509 1537 1567 -1028 27 1025 -1573 -1389 1490 636 -720 1067 629 -1922 -922
342 -922 1046 208 -12 959 18 -1101 -389 107 -78 413 732 210 -406 -811 -527 366 587 225 327 14
362 14 -795 -450 328 44 77 841 338 -886 -622 189 69 164 720 249 -656 -417 169 -133 -204 636 776
383G76j139m12P72K6l50Q93L57j458k95J352m78j085J516Q58j874k25J510j070
401c26r48K236L96k415M70J780j632r51K316P5j991J003J154k041m17K358j67
418I00j839R14J020j616l92J831k48j505J132J070j922o29K109r8j699J175J005
435A208k050j19K155j016j550K037O39k334M05J690j413n56J972m73j724J138
451IQ52j475L9J301m95o59O32l6p22L53P22k77n91K20M02l86k61N97K5n61M52
472A41K89r89J25J085n84n46R31k95q57J020K05j316O98J059j291k52J237p81
490a21o05J462k44j383R73O66j294J73J017p20k62Q54m64o74O85L28m45J5N3q2
510f8J17j18NK29k15qM28n67m49J019J28j048N59N79j198K18J254r89p46J575
$$ plain form
383 776 -363 -775 -3 23 -327 566 923 -535 -830 522 44 -1041 475 1333 -541 -766 744 -326
401 -326 -1274 962 1358 -1057 -587 1193 -439 -1390 926 1001 -990 13 1167 -874 -1291 1067 900
418 900 -939 -25 995 -621 -1013 818 570 -935 197 1267 -655 -1284 825 727 -972 203 1208
435 1208 -842 -961 1194 178 -1372 665 1304 -1030 -625 1065 -348 -904 1068 595 -1129 9
451 9 861 -614 -575 726 231 -428 204 168 -554 -201 521 244 -347 -127 275 -111 -372 225 250 -311 141
472 141 430 -559 -434 651 67 -479 452 157 -700 320 525 -791 -93 966 -325 -577 660 -121
490 -121 -726 736 492 -891 82 748 -546 -373 644 -76 -338 516 52 -622 63 391 -54 -39 14 -68
510 -68 49 -69 -64 165 -50 -58 370 -197 -646 373 501 -547 12 591 -607 -389 865 -124 -870 705
530G05j07j580Q34R62j235L9J242q66r50J238L96j172J63R62n03o61N98L03o71
549c03R2Q26m19r28O62P56r05k03R91m20q19R26K62j165M33J087r48o14J033j07
569B37p58P69K71j028K61Q13o56l84P64l4n37L14J29m71J81M90k32l94J60K57
589A52j31j40J92Kk36J94K10m73n1O93k58n83N69J02p01O13M71j196J65J280r34
610f0p22J458l63j340J454M86k023Q06J722j894n92K145q68j428K002Q1k199J229
628a06J307j842N6J570j119n47J335o17p63J125n9p02N60l16l44J011l95q36J235
647E53k29j346J444L55k022J312J507k614N2K555j938j044L075j193k520K954
663I01M71l344J972J977l310N43K831k872q38L636j576k314L111k76k873K570
$$ plain form
530 705 598 -982 -148 814 -421 -382 860 -6 -956 282 678 -494 -331 631 128 -533 65 368 -303
549 -303 -211 615 196 -732 -70 686 -219 -422 569 149 -670 256 518 -647 -214 873 -75 -689 344 237
569 237 -521 248 519 -509 -248 565 -91 -475 289 255 -282 32 161 -310 -129 361 129 -265 -105 152
589 152 21 -119 73 75 -161 33 243 -230 -281 412 154 -429 140 242 -459 154 625 -571 -406 874 -60
610 -60 -782 676 313 -1027 427 913 -1110 -304 1418 -476 -1068 1077 209 -1219 783 864 -1335 -106
628 -106 1201 -641 -585 985 -134 -681 654 37 -726 399 340 -362 198 -118 -462 549 154 -682 553
647 553 324 -1022 422 777 -1245 67 1574 -1040 -988 1567 -371 -1415 1660 467 -2053 901
663 901 1372 -1972 0 1977 -1333 -790 2041 -831 -1669 1967 391 -1923 1188 912 -1961 609
679F09R48l274J515K104l030J87K669k237p40K884j562j779K779l28k205K025
695E65L23k274J622R74k376R79J427k197N65J745k305K02K598k398j062L333j499
712B22k291L635k88l922L035J974m471J196L754l791j110M425k152k923M308J79
728A780m137K418J917l643R53K854k803o49K925j640j547K566m33j730J908m7
744F92k051J489Q01j721R16P72j864P98J273k000L58K012j919o29K428j456j563
761a664K951k63k886K123J290l012R42K353k605m97K898j517j715K510k04j989
777a285J741L78k092J378J103k193N72J603j931J1K180j668j146K466n78k019
793a480J932O41k156R93J203j974J58J807j136o15J288p27o51J296m26q21J259
$$ plain form
679 609 1557 -1717 -202 1902 -1128 -941 1728 -509 -1249 1635 73 -1706 1073 745 -1460 565
695 565 888 -1386 236 1210 -1166 -187 1240 -957 -392 1353 -952 -750 1848 -550 -1612 1721 222
712 222 -2069 1566 1278 -2644 391 2365 -2106 -910 2844 -947 -2057 2368 216 -2707 1601 1780
728 1780 -2357 61 1978 -1665 -712 2142 -661 -1310 1615 -25 -1572 994 561 -1169 739 692
744 692 -1359 130 931 -790 126 898 -966 -168 1105 -895 -537 1475 -444 -1073 1355 -101 -1664
761 -1664 1287 1024 -1862 261 1551 -1461 -519 1834 -771 -1268 1630 113 -1602 908 704 -1285
777 -1285 456 834 -1258 120 1223 -970 -398 1205 -726 -715 1465 -203 -1349 1117 539 -1480
793 -1480 452 1093 -1063 -70 1133 -841 -683 1124 -12 -627 661 -66 -717 579 153 -668 591
810E91j92j225J029K36j281J069Q19j726J57J318j163k41J507q46q50J430l77
827B55j285J275M49j278O63O00j426K95J281r27m25J093m69o77Q12j08n61O90
845B57R7o08K71k1l28O58l4p80O11L49r62L36P27r18LJ098p03p55R70O7p66N12
867H1K56o12K78K86m90N0K57j65K21nn02L11L08n47J98M60n97M6O45p13l49J017
889D34j93o62P34r7q79P62M46j053L41Q88r37k55R18n45l92J043k03r20N88K51
909B69o23M19K71n77K57L20o46Q5N02l57J21L78p02q8P50l89l05P33l03n84P90
930C21j14q96Q20N05j036K84O54j017P4J165q15o36J260k03j162R19M04j140N36
949g7Q86j146k73J111l92n99P83m7o50N10J77o28K09L93k66M4M5l22K44K24l82
$$ plain form
810 591 399 -826 203 439 -842 227 1046 -680 -523 795 -368 -609 898 52 -798 632 255
827 255 -1030 245 694 -584 79 679 -747 -452 829 -98 -523 570 101 -576 236 128 -433 257
845 257 354 -254 17 -4 -332 326 292 -488 123 472 -490 -154 573 -345 -342 756 53 -702 268 335 -431 81
867 81 337 -275 3 289 -201 -151 106 -59 162 157 -345 -34 274 -273 -75 385 -212 -166 479 -234 -583 434
889 434 241 -421 313 216 -663 99 545 -508 -167 721 -216 -471 447 -98 -490 553 350 -570 18 269
909 269 -354 65 336 -241 16 336 -310 -225 277 -80 41 419 -283 -371 379 -10 -315 418 115 -469 321
930 321 207 -689 131 636 -400 -116 538 -479 -405 760 -55 -691 569 366 -796 123 527 -613 -77
949 -77 809 -337 -610 501 109 -490 293 246 -404 106 283 -345 -136 257 -9 35 80 -242 2 226 -156
970a56J26K97m42Q0M67n82j98Q61k04p10O22J25p73M97N54q84oR04n33n69P34
991B10ln57N49J75p81K27N32m63p9M33k48j52L66k49l03M51J01l15J55ll14K74
1013FK29l87M1L41k35j61K07j07o5L27k8l32P9J36p8N0M4j31J05P5j81l9J09l3
1037b8J34P6l15o1L48q4k28K58M5k93J78J72m57L0N53j73m14K91J29m01J68L54
1059B82l40j74M56l2m88J29L53j38j30J94o8k62J47K67k00k10L24J56l84j21L06
1080F7k2j76K95Q1n09N2M71k25l16M12J62m60O1K55l17k2N25r5m88J62K50k57
1102i4l9K84l4j81J36K9k95rL90M4k93qJ43j63o0K78l0k26K12J44m24j10L97P9
1126A70j91R6rk51O1K12n9j07J41P9j26k14K0K46O3j06O3m4k72J19L16k40j71
$$ plain form
970 -156 -30 267 -175 -95 372 -210 -408 453 249 -461 161 286 -487 10 564 -320 -326 578 45 -524 210
991 210 207 -350 199 374 -407 -180 352 -111 -190 243 -5 -157 209 -40 -343 108 209 -106 49 46 -268 6
1013 6 235 -152 -111 230 -5 -166 41 -66 -131 196 168 -164 -85 51 -27 23 67 -64 41 116 -65 -104 5 -28
1037 -28 106 182 -133 -194 154 70 -158 100 145 -148 30 202 -255 -225 328 155 -259 32 161 -240 -72 282
1059 282 -58 -232 224 192 -296 -167 186 48 -82 112 44 -218 -71 196 -4 -214 110 266 -118 -239 67
1080 67 45 -131 164 245 -264 -212 259 34 -282 130 292 -168 -107 148 -169 -191 334 239 -249 -87 163 -94
1102 -94 -133 151 117 -64 72 101 -194 -203 187 231 -62 -70 73 -90 -150 128 98 -128 84 228 -196 -306 91 170
1126 170 -21 75 66 -185 -124 88 29 -78 63 142 16 -198 -178 68 131 25 88 44 -228 -109 207 -33 -204
1149b04M47%n05Q9L16k16J7L65k00m11K29K70k56o9L05L0k81l5J34j04j6L29L4
1172B68m43l5L73j48k34L13J52l44M9K13l69p4N41Pm70J46K07l30J0L76j63k10
1194a65L19M2m58OM04j3j79J04J6k68N4K92r0k42K33K39l72k20L56O2k41K26J58
1217B63m57m9M70j36l48L42K05l77pJ67k11L8L33q6k60P5N3n2N0l9J6J57r7j80
1241a30R9lo0K83k6l60J22K23k79QK87j92k6K75k91k68M18O2k17J92o0k82K73
1264D8O7l60K84K06m21K11K10o72K21P71o18l45Q48l56p33R28J23j039O93P15
1284G81j179q3J013o15l66J007l33p98P55J24p60M71L33n43K79K00o92K44N24
1303C62n15J27M25o99L5P41o79k35J000m32o55R18k65r35J115L78j332N47Q41
$$ plain form
1149 -204 243 243 -262 -173 143 -73 -56 309 109 -302 -73 197 -59 -128 177 207 -74 -109 25 -79 -95 234 268
1172 268 -175 -210 163 15 -219 94 246 -98 -49 164 -205 -279 262 269 -201 -55 152 -178 -168 208 45 -165
1194 -165 154 196 -262 -256 148 135 -44 60 76 -192 -138 154 64 -178 55 294 -78 -298 58 120 -121 105 263
1217 263 -194 -243 227 91 -257 85 290 -87 -94 73 -138 -100 233 147 -113 -38 15 -37 13 -26 -10 147 50 -130
1241 -130 -31 -34 -94 189 163 -197 -75 148 -131 -123 164 -28 -54 221 -70 -338 80 142 -75 117 57 -225 48
1264 48 115 -245 39 245 -176 35 245 -427 -206 565 -53 -398 450 94 -639 289 412 -627 66 781
1284 781 -398 -481 532 -83 -449 558 225 -573 182 306 -454 17 350 -193 86 286 -406 -162 362
1303 362 -153 -26 399 -300 -265 476 -203 -438 562 130 -525 393 128 -807 308 686 -646 -99 742
1322G42j293R7J266j029m30J476o08j134J207J17j106R45M33j352N24Q70j221
1339d96O7J199r04l52J237p58r09J368P7j206Q52M74j257L87Q72r93n9J043n49
1358I3n25O60k61l47P06j23n25N08o3n36N33Q4n90N76L07r73K11O98p15K8Q96
1379F42p10n10J039k87q91R37L30j025M95N77j156Q9J220p31o04J096k60r47Q35
1398A39L44r98M39P97r13k67Q14l71l49P64j47o65N14J96o61K68M24m32P0L83
1418C49n38j78N89q6l21L48l9l42K43L4k75K69J67k48Q2n8l28L86K61n12J42L89
1440C34n50r0O85m71l37R21j57r49O12M13q78L80P68r34k13J011m86p11R32J69
1460D49q71M79L93q76J22Q03m44l78N45p3l80K50Q8k14J44J09j05q3j14J24K46
$$ plain form
1322 742 -551 -454 812 -217 -647 829 221 -913 294 411 -695 250 683 -669 -145 725 -496
1339 -496 -429 770 -134 -486 751 -7 -916 452 529 -677 175 649 -608 -221 651 -342 -401 642 93
1358 93 -432 228 -33 -380 326 203 -322 186 123 -413 120 204 -386 190 497 -476 -265 433 -282 -254 642
1379 642 -68 -578 461 174 -717 220 550 -475 20 597 -559 -470 750 19 -585 511 251 -696 139
1398 139 483 -515 -76 721 -192 -459 355 -16 -365 399 252 -413 101 297 -364 -96 328 -104 -34 349
1418 349 -189 -367 222 136 -185 163 124 -218 25 59 -216 53 220 -28 54 -4 -332 54 315 -197 -55 334
1440 334 -216 -306 379 -92 -429 492 335 -614 -2 411 -467 -87 681 -253 -466 545 59 -652 280 449
1460 449 -422 57 450 -426 -304 499 55 -323 222 149 -231 19 107 -107 37 146 41 -42 -156 -32 214
1481B14k16j36L16j31k95L65J5m36M05K79n92JM24l11o6M62k82k75M54r4m07L26
1503B0J47k86K42N0m21J28L06k46K5J99k17jK16k98m5L87j04j80J90j59j96L66
1525A23N2l06J62R4k27O8N0j58K23J36l11P1Q7l02K52L37n11o2N85l53m30O15
1547A95k2n11M85K29p59J29O13m12j62M57k10k88L91q0l25L27J08k36J21l4k57
1568b41K98J37l57J59K19l27RK84l41pM84k20l47L38k5l06L68J00m49K16L23m60
1590a45p3M13j66j60L71j35l91K69K26k87J8J75q0o8N1j06M7J15k7J1Jk24N1L12
1614A98j97j95L41K1l66J43J89l16Q2M25k64l62L28J21l09J22K30k18l8J81j59
1635d3j43K11J08q4j7p2o4J33L7r8R0L5j29L0Nj67J45K40j51j66J32n2j11K21
$$ plain form
1481 214 -2 -138 178 47 -248 117 132 -304 101 380 -212 -211 213 -98 -164 298 16 -259 195 101 -306 20
1503 20 167 -119 123 173 -248 -120 186 -60 -35 164 -53 -54 162 -136 -181 206 102 -78 112 -47 -243 123
1525 123 175 -131 31 125 -102 -34 16 -142 81 217 -94 -23 64 -238 14 351 -160 -222 363 10 -420 195
1547 195 173 -338 147 376 -383 -254 359 -53 -215 242 32 -256 135 55 -270 57 165 -71 50 16 -241
1568 -241 57 194 -163 -4 215 -112 -103 181 -160 -167 317 97 -250 88 63 -243 125 225 -224 -8 315 -145
1590 -145 -218 195 29 -131 240 105 -286 -17 209 -78 -60 115 35 -33 18 -88 -41 74 47 58 59 -165 -114 198
1614 198 1 -194 147 168 -198 -55 134 -182 -100 325 61 -301 27 148 -161 -39 191 -27 -65 116 -43
1635 -43 -186 25 133 49 32 -40 -104 29 66 -32 58 93 -36 -6 -1 -168 -23 217 66 -100 32 -20 -131 90
1659I0Oj98J48J34l12l6K48n3o0K06j20k89K02J76j92l4K10n4j43jM1m0O7J60
1683A56m6k19l8J92nj51J36J48j97r0J72r8j53L22J61l77q0K56r2j46K45M7k10
1706f7O9J36k45j17L20J03j98k2M4j15j5J88J8j42Q7P5j87j25J55J20k2L3m9j60
1730a16lJ38L3p2O2N9j01j25LJ12M9P2J0j60j59J43J23r9K9J58j00j81P2K0j04
1755a37K24K02k92j93J84Qr7J74R7j76j4O3j51o0K25J40q4j27m7k7K6O3J01Lj16
1780a1J8J8k08NL55M1k52L6Mk26J10L16j39j59K45q1l11J02K21o4O4Q0k28j66
1804b30J57R8J4K3j0j1m5j77K8K28J6oM9j96k20K57J54j87J16J78k85j28J97r1
1828g1l7L68%l81J4R7j36J41K24j62p3J02j75j19J81J34L5J6j84j58J03M8J8J90
$$ plain form
1659 90 96 -102 46 180 -132 -168 80 27 -33 173 53 -236 -34 142 -50 -84 126 72 -71 -72 -31 -71 -4 156
1683 156 110 -109 -147 45 40 -111 25 173 -24 -114 58 -40 -193 129 290 -87 -167 89 -3 -149 96 143 -67
1706 -67 2 138 -107 -224 96 199 1 -21 23 -92 -107 81 99 -43 44 119 -68 -193 -38 82 60 93 44 -116
1730 -116 -119 19 52 -20 42 101 0 -125 -122 -10 39 111 121 -39 -198 -55 68 -31 -2 156 56 -125 -53 -33 -137
1755 -137 87 289 -3 -196 -12 -4 -101 73 170 -6 -20 43 -108 -168 57 197 113 -14 -61 -88 -62 1 102 105 -11
1780 -11 7 25 -183 -178 177 218 -34 2 6 -220 -110 206 67 -92 153 72 -239 -137 84 20 84 164 -64 -230
1804 -230 -73 25 39 62 52 41 -4 -181 -153 75 91 85 134 -62 -282 -25 129 -58 58 236 -49 -177 20 -71
1828 -71 -108 260 260 -121 -107 -10 -146 -5 219 57 -16 86 -89 -208 -27 107 142 158 -26 -184 -81 -33 -15 175
1852A75o2k01J29p0k90K74L47k46r5J84l40j53N28Kl46K93J24m96J3L25j63O6
1874bL35k67l11J64K3j8K44n3j49J44j58k63L22J54k07K55N9o20Q3N04k85r2N30
1897C92k64m58M04n0m15N24L26n54KK25m41R3N68k91k13M43k93m04M34O5k67M82
1919C08No83K06K90l95K76M47n65n9M66n45k41Q44j10n01N73j41q27N81N11o82
1940b42K01N97p13k69O52l22k23P81j40o55L68j7m52N95K42o32L24K61q07J45
1960c06O99n26J6P69o93o12Q64n5o11P92J63r30L54M09q39K53Q82n94k55N88n72
1981b04l74R06p5n85O59qq50M36L33o26M78N89q85j53O48n54j09R54l70o28P45
2002C27j43r14P12N65p92L00N35r71j98R78l32l80P97j85p82M89J31n62N22M46
$$ plain form
1852 175 113 -88 41 -29 -319 -45 302 56 -39 145 -195 -348 180 182 -164 129 253 -243 -230 95 -68 -2
1874 -2 333 66 -245 -81 -58 -76 168 115 -34 110 -48 -311 11 165 -42 213 272 -348 -265 239 -46 -138 392
1897 392 128 -330 74 24 -391 133 459 -95 -93 132 -309 -216 352 61 -152 291 -2 -406 28 93 -174 308
1919 308 313 -370 -164 126 -269 7 454 -111 -170 296 -249 -490 354 244 -257 316 175 -652 -71 440 -242
1940 -242 -41 556 -157 -426 226 -96 -319 462 322 -333 35 18 -434 161 403 -229 95 356 -451 -306
1960 -306 393 -133 -117 652 -41 -653 211 156 -455 337 500 -430 -76 333 -506 -253 629 35 -220 368 -204
1981 -204 -578 328 253 -332 327 319 -531 -95 238 -388 90 679 -206 -359 289 -265 -374 580 210 -418 327
2002 327 184 -730 -18 547 -245 55 590 -381 -579 399 67 -313 484 299 -483 6 137 -425 97 543
2022E43o08n4K51m90J40O06l41j31M60m80l62N95q0k93P03p6q98L68L83o56L87
2043c3P01p88k28P15n42m87J007R0p43N25N8r23M12P16n88J8O25o47l48O41k29
2064d8k82Q00o4p70L33J12n32M96N02o54J5M53o34j74P09j21k45N27k98o33M46
2085f2K27l36L76J70n67P4K18m36K15N38l52j02K57n19j21P14j70l00N58k25o88
2106e31N34J89n97N25N49r09j49O55m88j71R19k37o75N49J3p16M45M94m41J04
2126F2K59n82r9N04j34KK92k94j78K14k25l9N26j17k73K85k81m06N90K15n15L23
2148A29K25o95O5N22m33M9O73m37m99M84j18l08O06P2n85L22J00o08K81M74m06
2169h7R8M08o38k49O87j63k94N99j40o00L80J34n15L80M72n02q7K80m14j0N51
$$ plain form
2022 543 -65 -119 132 -358 -218 388 47 -84 376 -104 -466 129 49 -244 459 383 -515 -147 236 -420 -33
2043 -33 668 -120 -348 367 -175 -662 345 435 -308 217 275 -648 -236 480 -108 -90 535 -112 -460 181 -48
2064 -48 -330 470 406 -364 -31 81 -451 45 547 -107 -92 361 -273 -447 262 141 -104 423 125 -508 -62
2085 -62 165 -171 205 375 -192 -118 100 -336 -121 417 65 -37 220 -299 -420 294 124 -176 382 157 -531
2106 -531 3 192 -405 120 669 -240 -389 266 -222 -393 526 289 -386 163 176 -540 -95 399 -42 62
2126 62 321 -261 -360 144 10 12 304 10 -168 46 -179 -218 308 191 -82 203 -78 -484 106 321 -194 129
2148 129 354 -341 -276 246 -187 -138 535 98 -401 83 -35 -343 263 335 -250 72 172 -436 -155 319 -87
2169 -87 11 419 -219 -468 219 56 -238 361 221 -379 1 135 -380 0 472 -30 -117 163 -251 -261 290
2190B90j69k10L02k11k98L10Qj50M22m1n17K01J07l32L74L27n47L2L97n20j60
2211c85O98j72l66N40j40p29M70M40n47J62M65n62k11N28k71k19O01k5n04K25
2231bJ2l38L70K78m24J01K12m37KM05k13n1M63k99m67L90J05l15L49K05n23P0
2253a07L01l90qM94j54k07K37k20k71L97J24k59J92M3l75J20J77k60J87L28l67
2274a8j59K59k33o8N31j45l94L68k7m89L05L56m21J49L45n33j96N40j03k47M13
2295B33n1m48K54J19l62K39L21l38k0J70l18K5M40j84j86K91j58k69K98L6k60
2316a68L22J21m52K7K59k28O2L35k42j75K65j28k22K77Q6j79J60n1k99J42K09
2337A21j55P4J08k35j2J77j84l5L45j02k19J99j13k14L29J21l15R4J82l00mK60
$$ plain form
2190 290 121 -89 213 2 -296 14 22 -128 294 253 -264 -63 44 -288 86 413 -134 -102 295 -225 -385
2211 -385 313 141 -225 315 175 -554 -84 356 -191 -29 436 -126 -337 191 -80 -299 302 277 -227 -2
2231 -2 10 -328 42 320 -104 -3 209 -228 -226 179 -34 -85 378 79 -388 2 107 -208 141 346 -177 -107
2253 -107 194 -196 -204 290 136 -71 166 -54 -325 72 196 -63 129 172 -203 -83 94 -166 21 349 -18
2274 -18 -177 82 -151 -219 312 167 -227 141 114 -375 -70 286 -135 14 359 -174 -370 170 67 -180 233
2295 233 182 -266 -12 107 -255 -16 305 -33 -53 117 -201 -176 264 80 -106 185 27 -242 56 92 -168
2316 -168 154 275 -177 -150 109 -119 -57 278 36 -139 126 -2 -224 53 139 -40 120 69 -230 -88 121
2337 121 -34 40 148 -87 -99 78 -106 -141 204 102 -117 82 -31 -245 84 205 -110 -16 166 -134 -138 122
2359A22j27o8K84j34k90J81P4j09J48M3j91M9Q3j66K6J87p2j7R0j94o8K20J3j12
2383b8R8Lj55P3N1j18P5J48j18j00M9l9RJ43l5j03N3Kp1M5K2j8Q4Rj41k2R1k9
2411b2L0O3r5l9J01m2r8J26M5p8K0mj15O9J33p6o1P7k7q1R2j1m4Q2M6r9n6N5j
2440a0M3L0o4j4M0k3l5M5Rj3O6n4j17P5Q9o3J7J2o8lP5l5n6P8K3l8m1%pQ4ln3
2472a1kJ4k3K9Jn5M0R6q7q4P5J6rN2j7r2M7O1o4j3K5OL6j1r2K1R0l3KJ9p1J1J00
2505G7n3r1J02K7r3L3Nm9M8Q9j04l8O5qk1L4l8qP7k5r5M2R%P5m1j11R2N1j11N2
2536hM8j24P4J26j82m6K18p4j06J30j8j64J66P7k13M8J67j32l5J12r3k1J60r0
2560B0j07J30k7o9J54q3j51K17K4k28J13J40k16N4K15k64q3L34j13k23K27K3k25
$$ plain form
2359 122 -5 -73 211 77 -213 -32 42 -67 81 124 -67 -18 65 -101 -75 112 40 23 113 -81 -149 71 84 -28
2383 -28 70 73 -82 -9 42 -76 -1 147 29 -71 -22 -61 -52 91 56 -47 6 8 -63 -18 4 -14 70 79 -62 -84 7 -22
2411 -22 8 71 -24 -63 38 -4 -102 24 69 -9 11 7 -108 -39 94 18 -43 34 7 -74 18 7 -37 45 91 -8 -64 -9 -10
2440 -10 33 63 -1 -15 25 2 -33 12 21 8 74 20 -97 -22 67 4 21 33 -35 -38 37 2 -54 24 47 9 -32 -32 -39 45 42 -11
2472 -11 -13 1 -22 7 8 -47 -7 89 2 -82 -7 9 0 52 35 -57 -10 51 -13 -26 -1 5 41 30 -62 -41 49 16 18 37 -34 -23 77
2505 77 24 -67 35 62 -31 2 7 -42 6 95 -9 -47 18 10 -11 23 -15 -23 54 29 -66 -24 -15 -15 60 19 -92 0 51 -60 -8
2536 -8 40 -84 -10 116 -66 -112 106 32 -74 56 38 -126 40 117 -96 -48 119 -13 -48 64 -29 -50 110 20
2560 20 -87 43 16 -53 101 18 -133 84 108 -120 -7 133 -83 -29 186 -78 -161 173 60 -163 64 87 -138
2583a38J76Q9k73J01K00j94m2J64j42kJ87j46j01K19p8j37K05n8k05K65O9l55
2605a96J47K20k73J5K73k60q9L56j37k69K79N9k72J80J09l05J03K77k83m9K52
2626A37j48r0K53j23k05K92J2k89J73J03k42J29J72k93%L05j95j54K75q4k17K88
2648I9K6l32J89K06k83j6K36j58p7K22r9j57J94J1j43J09j2j07J58Qk08J51J12
2671A29k55J02J96l10k2M05k14k92L88K5l72K43J88l90P9L80l11j77L61q3k33
2692a63K78k0k75K13J13k79Q9J53j82K9J82k27l6K56j21j26K17q5j51K33n9k14
2714a75K26Q4k61J19J07k64J01K71k69j12L21j20k06K56Kk35K02J11l03M9K18
2735A22j70LJ63j78k3K19j68j07K39m0j72K08rk75J81K00k54k6K16j38j00J77
$$ plain form
2583 -138 38 127 -146 -45 155 -39 -81 83 -59 -61 126 -20 -121 98 20 -117 88 30 -175 90 159 -196
2605 -196 -49 171 -102 -87 186 -74 -163 193 56 -213 66 125 -147 33 142 -163 -60 217 -66 -115 137
2626 137 -11 -101 152 29 -176 116 128 -161 12 115 -127 2 174 -119 -119 186 -9 -163 112 28 -189 99
2648 99 125 -207 -18 188 -95 -111 125 -33 -110 112 13 -144 50 61 -82 27 15 -92 66 74 -134 17 129
2671 129 -126 -24 172 -138 -160 245 31 -261 127 152 -220 23 211 -179 -100 280 -31 -208 153 70 -163
2692 -163 115 95 -180 33 146 -133 -44 109 -73 -44 138 -89 -125 131 10 -116 101 16 -135 98 39 -175
2714 -175 51 135 -126 -7 100 -164 -63 208 -61 -173 148 28 -178 78 80 -155 47 158 -145 -96 122
2735 122 -48 -45 118 -60 -83 136 -32 -139 100 60 -112 96 87 -188 -7 193 -61 -87 129 -9 -109 68
2757F8l1j20J23N9j16m5L8RN9l9k2O1m3o7R8l4o8J12O1j82j2J42p4qJ16q2q0J12
2785C5j0j02O0P7n5K6jr0OP1L0k8l1K7K3p2k9J06Rq6J03j6j92Q9K00j43r9K04
2813A12p8j57J66j2j23J27J03j91k1R2p3O1R4j28j6J13j17m1J41n2p2J89n1k69
2837b03J74J38k00P2J57k10l2K07j40r9K28J6j80Q5jj59J71R9j77M9R9j50JJ32
2861G7j24KK06j36j35J50j7j28K01J5k48J53J24k66L5K52j69p4K45j55k22K82
2883F8O3k41J21J33k43K7J79j82j8K30q8j44J37o8r9K12oj92J58L8k28P9J58j91
2907i7O0K32k33j49K59l2j67K12K7k44J16J40k53M7K23j34m7J32j50o7K22m9j35
2930h7J74k5j72J34L7j91J60J49k48k0J99j87rK65j55j93K85l3k89K20J16k39
$$ plain form
2757 68 37 -83 40 99 -17 -62 -24 -15 44 5 -17 44 1 -66 32 -2 -70 42 103 -79 -91 51 -23 -31 85 3 -77 35
2785 35 25 -77 -17 60 5 31 30 -60 -54 17 47 19 -12 15 38 -34 -63 43 52 -34 69 53 -139 -50 150 7 -92 112
2813 112 34 -123 43 31 -92 35 138 -53 -74 18 -55 6 100 -28 -44 69 -48 -89 52 0 -72 117 66 -203
2837 -203 -29 109 -91 -19 138 -72 -104 103 -37 -136 92 108 -72 13 12 -147 24 123 -54 -5 94 -56 -55 77
2861 77 -47 -45 161 25 -110 40 23 -105 96 111 -137 16 140 -126 -91 161 -8 -82 163 8 -214 68
2883 68 131 -110 11 144 -99 -72 107 -75 -93 137 49 -95 42 -26 -125 87 81 -111 47 85 -143 -64 94 -97
2907 -97 -37 195 -38 -187 72 40 -127 85 112 -132 -16 124 -129 -82 141 7 -40 92 -58 -125 97 48 -87
2930 -87 87 62 -110 24 61 -130 30 179 -69 -89 110 -77 -86 179 24 -169 116 83 -206 14 130 -109
2952a09J05J70k97j1K62j14j20K15o8j65J90j8j98J75J02j79M8P1j77N9J89j76
2974d6k2J73j08j12J79n0j25K08J8k57J23J00j63P7J26j73kJ67j37r0J94k7q5
2997c2J25o1j57J49O8j66Q9Q1j69L9J40j84j8K32j01j39J56l6j33J55N5k00P4
3020c3J28j47j1J17q8j7J45r5j23J33K8r0Q0Jr6P6M9j24J1J17o6LM4p3k8J01r
3047C3q2P4nm1L4kp8Q2O1q8J2K8q1L9R2q5m4J12m8q4R1Nq5J02K3j31J2J18q8j6
3077d0J00o6n4J05j3j36R5O2p7J5K7o2J2P0l6k6L9qj2J4l1j6Q2rp1M2Kl8M0K4
3107C4q2L3O7n8l8N8lpK9j4o4N3J9l3LMj5L6j4n2K4L7j9RJ1o4J6P6m2n4P5nm9
3140b9M1mp2N4O7o7k0L4j5%K3j6k0M9Om9PlLM4l6l1N2Rn5L8K2o2M7N5q1m3O9J3
$$ plain form
2952 -109 -4 166 -131 -142 120 6 -114 101 33 -132 58 40 -158 17 119 -60 -12 59 -118 -59 130 -46
2974 -46 -68 105 -3 -115 64 14 -111 97 115 -142 -19 81 -82 -5 121 -52 -54 113 -24 -114 80 53 -32
2997 -32 93 32 -125 24 92 -74 15 96 -73 -34 106 -78 -96 136 35 -104 52 16 -117 38 93 -107 -33
3020 -33 95 -52 -63 54 -34 -51 94 -1 -124 9 37 -53 27 28 -68 8 57 -67 -56 61 -5 -2 42 -31 -59 42 33
3047 33 -49 25 20 -21 13 11 -67 15 76 -12 0 28 -53 -14 78 -7 -51 61 13 -71 20 25 -60 42 65 -66 -54 64 -24 -40
3077 -40 60 -6 -60 45 32 -104 -9 53 -24 -9 18 -44 -32 38 2 -24 15 7 -5 9 -22 -38 44 35 -36 6 8 -30 10 34
3107 34 -48 -15 52 -6 -44 14 11 4 33 19 -45 8 27 -6 -3 1 -14 22 8 -44 -20 17 -2 7 18 -46 -30 46 4 -50 25 20 -29
3140 -29 12 8 -64 -10 57 -10 -30 4 -11 -11 12 -4 -24 25 31 -18 -11 -14 -11 33 -3 -34 18 27 -28 10 32 -30 17 72 -9 -52 17 30
3174C0n4M2%m1M3J0o2K5J9j5M6l2q2N7O2q3PQ6q3k4R8m4r4J31K9j29M1O1j02L2
3204b6R7j07j4J03l0r8Q2kl9P4or7N2L7n7L9Jn0N9M9j26J7J16r6KJ07j05r4J85
3233G3Jj79J15J08j77NJ61j44n0J74k5j50R3L7r2N1K4p0O7J1q6L8M7q2N1J00j52
3260e1m5J81o9j17J41Kj42J19M5j68N9J43j03n5J33q0p5J40j9j43J29N9j37M2
3284a1O3j17M6J20j13m0J09n9m1J06p1m8J47m9j42J60J1j74J56R2k61M1K61k02
3308a6j43K69j2k23J56P4k23O1J76j38m2J00l6n2P8l2l6J13q1n0R4n8p2J56J4
3333G7j76R5J05j81L6J28j10l6J87j07j55J81J3j28J00O0j77O6J26j69j6J87p2
3356C4j05J30n4r1J28L4j14M2K5o6N8J2q7O6R2j34k5J16q4o1J70l0j66J16R1j58
$$ plain form
3174 30 -24 18 18 -23 20 30 -32 -7 12 -3 43 11 -71 -14 48 -35 -28 58 -25 -49 49 5 -89 42 71 -58 -17 44 -58 -26
3204 -26 71 -36 -50 53 23 -75 7 5 -34 40 34 -63 -11 26 -31 8 9 -41 18 67 -59 -42 74 -22 -20 87 -18 -112 73
3233 73 74 -105 10 118 -59 -54 107 -37 -87 87 62 -88 5 42 -50 1 25 -45 22 33 -53 -15 32 -50 1 101 -51
3260 -51 -96 85 16 -101 40 42 -100 19 64 -104 -45 98 -5 -60 73 -7 -82 58 39 -104 25 84 -53 -11
3284 -11 52 -65 -19 101 -12 -52 57 -2 -43 63 -8 -56 91 42 -100 60 71 -103 53 145 -116 -75 186 -16
3308 -16 -159 110 98 -125 31 105 -118 -57 119 -19 -61 39 3 -49 29 -3 -39 74 -7 -57 37 -21 -93 63 77
3333 77 -99 -4 101 -80 -44 84 -26 -62 125 18 -137 44 57 -71 29 89 -88 -22 104 -65 -81 106 34
3356 34 -71 59 5 -86 42 76 -38 4 29 -37 21 33 -54 12 104 -30 -55 61 -23 -84 86 56 -110 6 97 -61
3382f1jJ35o7n8Q8k6o8N1L3pj7l0J9M3n6k7Q5Kp5N7Pr6N4J04q7o0J03kp9L8K7
3413B9n9K9O2n6o0N7L8n3J2M7o2j5N9k4o1O4N4p9l0O9k5m8O8L0r5J2R4m5q4N5
3443a7N5m3j1MQk3J0M9l2o9N8O5p9m2J15j2r8N6O9j12J2J14m7r3Q1M3p9LN5n0
3473a0LN1l0k0%J6qL0n6K7M7l3m4M7pm1O4%r9L7R5q2j7Q4m5o2J09k8j29J26P9
3504A04j64K4J23j14m2J46m9j29J12O4j32J5Q6n5j5N5m6k3N8mk1L2m4OQ4p1o4
3531f4J06K0j25Q5N0j61N7J63j54m6J33qj20R0jq6P3O1j08J2O4q3M9M9r3QJ22
3558I3j03q1J51n4r8J56Mj97J26J08j87M1J45j57j7J73j05j30K04Nj73R3Q1j65
3582h7N6J34j38l6J47l9j03Q7Km4N7jp4M1J9l4N2j4q6J09J8j32L3J33j22l1J54
$$ plain form
3382 -61 -62 73 6 -52 36 10 -58 -7 26 19 2 -28 -9 34 -22 -49 36 38 -37 20 27 -69 -15 89 2 -58 45 43 -36 2 29
3413 29 -30 -1 61 5 -55 2 40 -13 -1 46 -16 -31 28 4 -57 7 61 -18 -48 21 -4 -52 16 46 -49 -37 57 12 -72 -17
3443 -17 38 -5 -16 -12 -4 -27 -17 32 0 -69 -11 54 -25 -67 48 36 -62 -6 63 -49 -37 77 30 -63 18 61 -18 -15 40 -10
3473 -10 -7 44 14 -6 -6 10 2 32 -24 3 50 17 -27 20 13 -28 36 36 -63 -26 69 -13 -30 54 9 -53 56 28 -101 25 104
3504 104 -60 -36 87 -27 -69 77 28 -101 11 75 -57 -42 44 -11 -26 29 -17 -40 18 14 -7 25 -19 -13 71 0 -64
3531 -64 42 62 -63 22 72 -89 -32 131 -23 -69 64 56 -64 26 25 -61 12 73 -35 -23 41 -42 7 56 -37 -29 93
3558 93 -10 -91 60 6 -92 64 68 -129 -3 105 -82 -41 104 -53 -70 103 -2 -132 72 77 -96 -3 78 -87
3582 -87 -31 103 -35 -71 76 37 -66 21 23 -21 36 35 -39 2 21 -13 39 25 -61 48 66 -66 -33 100 -22 -53 101
3609A01j11r5J67K7j75O1J15j40K8P8p5k9J11l2r6Q6j4m3O1j0o6O5K1q7L7L5o8
3636d8L1P3r7l3J38m5q6R9Mr2N3O7j05oJ08n0o1P5lm9N0M0r8PP4k1m8M0on%J5
3668B1j0j7QL8j5n5K5M9l7m5O9nn8M0K9q5J8R3m6q1O7K1o6L8L6n8J4N6n1m2O1
3699A2kl1M4j9m6M5K8m0k2M8k4jK9l8mM6mm2J2J0l1N1On4L7K7l9j9M5l1ON3m9
3732Ck7J8L2k6qJ8jj9K3Mk9QK9rk5k5J3L1j6nJ1j1mK0pk3J5K8k4j9J1%K0Qk0j5
3768b1K9K4m1PPJ3j2Jk2OK6Pk1k1K1mPK6ml7K2K5n3j0M1j1lJ8k3k5M3Ql1%K3k4
3804iJ0Pk8PN0j8n4L8j2k1L5Qm7K5L6m6rL3mkJ9k0k4M2k3RK3m1KM2k1n8M6L2m2
3839a5K1L2p3J1P8o4k8P2j3n9O5Lr8P6O2j07pQ5n9MO3m8o1R2J4q8K6N5m8J0L2
$$ plain form
3609 101 -10 -105 62 89 -86 -25 90 -50 -22 56 -19 -48 63 31 -65 21 7 -36 25 15 -51 14 35 -52 -15 20 -48
3636 -48 -17 56 -41 -74 64 19 -67 32 36 -56 -3 64 -41 -47 61 11 -50 25 22 -27 23 63 -35 -28 46 25 -23 17 11 6 6 21
3668 21 11 -6 2 40 25 -30 -5 44 7 -38 31 26 -32 8 37 -48 -30 63 17 -64 3 24 -42 -4 32 -26 -12 44 -7 -49 12
3699 12 10 -21 23 4 -42 3 31 -9 -31 17 -7 -8 21 -17 -21 25 21 -21 -9 1 -30 21 27 -27 10 37 -2 -21 24 -7 -1 52 3
3732 3 -24 -6 26 0 -8 10 9 -10 13 17 -12 -4 25 16 -9 -34 -21 10 -6 -11 0 -11 -15 5 -2 -25 -10 18 -6 -25 -14 -14 6 14 -6 -21
3768 -21 8 32 -9 -2 5 18 6 7 -15 -9 17 24 3 -18 3 -1 6 32 28 -9 13 38 -15 -25 16 5 2 20 -3 -28 15 23 -8 -8 15 -9
3804 -9 1 8 -20 -13 37 19 -35 3 -9 -30 5 13 -34 -9 27 -19 -28 5 1 -1 18 -2 -26 16 -7 2 25 -16 -14 28 7 -51 -5 27 -15
3839 -15 6 38 -35 -24 54 -10 -38 34 21 -38 27 30 -68 8 70 -37 -44 41 -18 -14 49 1 -60 32 46 -42 -16 39 -9 1 33
3870C3o7J5K6j4j1L5l8NO5q7j8R1ro9O9Lr3O0P3j02k0J12l6p2P6j1o4P0L3r1J8
3901a8M3l3jL0l2J0N0o0k6N2j0qN3l2o8P5J2r3M2Q5r5rR0p6n9J30Mj14N8M8r8
3932e0J8Q2p4k9R7k2q3O2K0k8J7J5o3L4J5l5K4J1l8M0K2p8K0P4m8j6O8o6m8J09
3962E0Pj39R0P9j32kJ16q2m8J39k5j24P8N7j01L0N0m7qO6o0j6M5l7K5K8o6k8R6
3991D1l1r0J11J5j05N9N9j26%J57q2q4J03rp2O0L4p8L2N7p7mK7oK2L1n6j1N1k5
4021Cl2O0l1k3P1l0p4N7N7p5J9M3q1mR7l8o7Q1J7q3J2N4o9oJ12m1r3M0O8o5KM4
4053B5lm8J1K4l6mM0N3o1n2O4J8p0K3P6o0m3P0Oj04M5J13p8o5Q6jq2M7O5p5j9
4084c5Q6l3o8M5L6k8OJ3l6pL7rj2K2j1mpk2LN9l4mK9l9k6N4mm4L5M9r6MQ1o6k2
$$ plain form
3870 33 -34 -19 7 -7 -18 17 -21 -16 49 -38 -56 35 26 -43 26 29 -64 -4 69 -33 -53 59 23 -49 27 16 -48 22 55 -36 -18
3901 -18 25 -8 -9 21 -11 -1 49 -11 -37 15 5 -3 50 18 -50 25 37 -56 -14 71 -24 -33 57 -19 -78 52 56 -58 0 48 -50
3932 -50 -32 50 -24 -53 44 22 -61 1 21 -7 10 25 -38 -4 11 -24 0 11 -27 13 35 -43 -23 51 3 -13 55 -11 -59 50
3962 50 57 -82 8 87 -45 -47 69 -13 -61 78 53 -71 7 64 -37 -7 43 -4 -12 54 -6 -22 23 -14 11 39 -27 -55 41
3991 41 10 -80 31 46 -59 0 59 -67 -67 90 8 -76 27 18 -54 6 40 -38 -6 51 -26 -30 -3 -9 13 44 -12 -23 28 3
4021 3 -29 31 0 -23 48 18 -56 1 58 -17 2 45 -36 -40 57 19 -48 33 50 -33 -21 33 -36 -42 70 29 -64 -24 44 -21 -19 25
4053 25 22 -26 -15 9 -27 -31 9 62 1 -51 13 31 -39 -16 60 0 -43 27 33 -71 -26 87 9 -56 30 29 -53 -6 59 -16 -35
4084 -35 51 18 -50 -5 31 3 9 22 -14 -21 16 7 -5 17 6 2 -5 -27 -24 35 1 -3 26 -13 -39 15 11 -33 2 51 -45 -41 40 -26 -48
4119d8J16k5j27P5N0p9kJ02m9o5O8j1o4L3O7qn5j1L8Nm8K7M3k5m9P6j4r7P2R1
4149H6q8n3J12m3j00J14N0j29L5J06j04o4J13Op7N5L1r0J8O3n3j4N4k1k7J7j7
4176b0mL8ml0K9l7kN8mp2P5K6r8J7P7r0nJ27o1j05R7N1j26N3O8n5l6O7l0p2P4
4207FL1k9Nk3LK1l7QO2l6m1P6k5j11J03Q2j38pJ34j03p7J53j4j38R4R0j64LJ32
4236F0o8m5J02k4j12P3M5p6ON7j7j5J3k5J4J8k8N4qq1N1O1q8nJ01n2p9R7kj04
4266g7R6P5j13m1J23n8o5Q8Qo7M1K2n0j8N0J9k0pl1K8Pl3M1L0p8RQ1j01k3J16
4296E2rq7M9M3j10K5R8p7l5J04k2r5N1M7m3lM1j8n4L3L0k5pK0L1n3qL5qk7M3J3
4328C4o5NO3k3m9M4M4q3J0M6m8j1P2J1q0K6K1k1j8J8Rk3J2K1k1l8M5L0l6l4M2
$$ plain form
4119 -48 68 43 -84 -9 41 -38 -40 62 13 -52 16 5 -59 -26 41 33 -22 -33 5 10 -38 -11 32 7 -42 34 20 -77 -5 86
4149 86 -2 -55 57 14 -86 28 78 -51 -16 90 -14 -78 35 41 -36 19 50 -40 -22 41 -12 -26 28 7 -20 -3 -20
4176 -20 -24 14 10 -20 9 -28 -30 28 24 -48 27 53 -45 -28 49 -41 -46 81 20 -85 12 63 -63 -10 58 3 -33 34 4 -68 6
4207 6 37 8 13 -10 -7 14 -23 -15 47 11 -30 46 21 -90 13 95 -43 -50 84 -19 -96 57 43 -95 -1 89 -75 -72 60
4236 60 -8 -53 49 25 -87 -14 31 -45 -39 18 1 -14 -1 -26 -12 6 -22 32 24 -57 -6 55 -33 -38 63 11 -68 29 27 -77
4266 -77 19 94 -19 -60 63 5 -60 28 36 -31 10 32 -18 -36 14 33 13 6 -25 3 10 -23 18 48 -30 -21 60 -41 -64 52
4296 52 43 -44 5 48 -62 -37 61 -16 -51 53 31 -64 -13 34 -9 -12 29 11 -43 -10 20 -5 -12 8 39 -14 -22 13 5 -22 21 34
4328 34 -31 -26 37 14 -35 9 53 -30 -20 26 -22 -33 39 50 -30 -4 17 -4 -22 -4 5 -18 -6 15 -6 -44 1 31 -5 -39 3
4359CJ8m5NM0l2j4O0k3o1L4M6k5l2L0Jl3M2K0o2ON0qm3NM5j2l1M4lm3J9L2n6K
4393b1O0k0l8J5J8k0mN6l6l9K8K9k8j5L1j0k2L8k8mJ1Pjl6KK5Ol3J5K9k2rL9l2
4427ik6M4J5m6%L7j8k1L8j2mJ4Kmk5PJ7kk0K6Lj3k5M1j4l2N5J6o6j0P1j7n2M9
4461A9on8N5L0m7k5P9k3n6L9J8n8L5K3k5l2M3Pl0lNL1k4j6M3k0m0N0K1o5J1N9
4493D0m8l7N2Qn3M3L7p0j7Q1k1n1M8J2l8J2K0l3PL6j2pj8JK5Jk7J3J7l6JL8l3
4526ik4O5j0p0M7K9p4L2N1n6nN7j8n6M0J9k6jJ8k7J0J1rrJ5j7M0j6m0L2L1k9j6
4559a5M5l2l1N8Qo8M2L4o2LN7l5k8O7j4o4M0L8m3mM1m1j0M7l5nK3mmNk6%M6k1
4593A2m3M5%n7M9L3q0J2Q0n6m0N6Km1M2J9p6K6N8n6j1M5j9mJ6j6j3L0jk1K4ok2
$$ plain form
4359 3 21 -24 -19 21 -11 -25 35 12 -49 -15 31 6 -26 4 5 -28 14 34 -28 -22 28 20 -23 -18 27 15 -16 28 25 -18 1 33 -23 -21
4393 -21 39 19 -19 -4 14 -6 -10 46 10 -29 -1 28 0 -15 16 6 -16 22 -6 -10 1 8 7 -29 -27 -2 4 -29 -14 15 -7 -16 23 -9
4427 -9 -35 9 24 -22 -22 15 -3 -24 14 2 -2 12 14 10 -15 -8 9 7 -13 13 16 3 -22 19 5 -27 28 44 -22 -32 39 22 -30 19
4461 19 13 -45 10 40 -7 -32 47 24 -32 7 25 -33 2 25 0 -32 11 18 -12 -15 -10 21 -3 -19 24 4 -36 14 35 -30 -19 40
4493 40 -8 -45 7 15 -38 5 42 -28 -45 36 15 -36 12 24 -14 -2 18 -15 -8 28 16 9 -9 -8 17 18 -9 4 21 -15 -14 24 -9
4526 -9 -33 32 22 -48 -1 28 -46 -14 37 -19 -24 33 15 -41 -1 18 -8 -9 9 -18 -8 3 -6 -15 0 -17 23 7 -33 -1 30 1 -15
4559 -15 30 -2 -33 25 33 -35 7 41 -21 -18 39 4 -24 43 29 -35 5 43 0 -4 37 -4 -14 33 -2 -7 16 12 8 13 -13 -13 33 12
4593 12 -31 14 14 -43 6 39 -41 -29 51 -5 -45 11 13 -28 14 33 -43 -17 41 -15 -26 19 0 -4 12 -4 -17 13 12 -9 15 9 -13
4626a3L7j1l9K7L0k8j0L8m9j0Q8m8m3N3jm9L3K6n8K4M5m5l8O7rm1L3J3n3L0K1
4657B0l6lL7j9J1pl6J5M6m4nL9k3k5M9on7M0L7n8j7O8l4j9L5Ml6L4jk4J2jKL1
4691B9j7l7L0J8l4K0K2n8J5O1n0l6P3kn8K7L2p6K7O9n6m5P3j5n9N7Jm5L2L4m3
4722a1k9N1Rm5K8Nl9J9J3j9lQJ6Jk5%K9Mk7L2rm0J8K0k2mM7j5n2L5J9l5J6L3l3
4757ej7L0j1j9M4j2mM%l7J4L6k2oJ7j6j3M3k1m4L9K5l1nRj1rM2rm3J6L0l1NK6
4792A4mj5Qk1oJ0K6J0l2mK0k0OJJ1Rj0J6k8j6L1J5rj6J7j8j5L0j2mK7J7n8J2K7
4827A9k0qL1j9j8K9J2m7LM4j2l0K7l1mL8j0k6J3J8k5J1Qk9K9K2m1k3M1plL2rm8
4861c3M2Rn1K3J5jj5K8k6lM0k0mJLk2J2plK0K0l0jK6m5K2M4n3PL3k0l1M2j7l1
$$ plain form
4626 -13 24 13 -26 1 31 3 -7 31 -18 -28 60 12 -31 22 21 -28 5 31 -27 -3 42 -3 -41 26 17 -24 9 22 -31 -1 20
4657 20 -16 -19 18 -1 10 3 -33 -18 28 -16 -21 18 -5 -30 19 13 -44 -4 33 -25 -42 26 -8 -27 8 12 -24 10 9 -15 -3 -4 -2 29
4691 29 12 -25 5 23 -11 9 31 -27 -12 49 -1 -37 36 34 -24 3 35 -41 -14 55 -1 -46 27 12 -47 10 11 -34 -2 32 -11
4722 -11 -40 11 20 -25 3 8 -31 -12 1 -18 -21 -13 3 4 -21 -21 8 12 -15 17 8 -32 -14 6 -16 -20 27 12 -40 -5 14 -21 -5 28 -5
4757 -5 -22 8 -3 -22 22 10 6 10 10 -27 -13 23 1 -5 12 -4 -17 26 5 -39 0 25 -6 -11 -2 -13 -22 20 11 -32 -16 14 -17 -12 14
4792 14 10 -5 3 -18 -24 -14 12 22 -10 -14 6 -14 -8 -7 4 13 3 19 -9 -25 6 21 12 -4 13 -5 -20 10 -2 -6 21 38 -20 -8 19
4827 19 -1 -9 22 3 -15 14 26 -21 -18 26 14 -16 11 -20 -24 14 4 -22 -9 9 -16 -5 3 -26 3 25 -16 -39 2 -5 -8 24 15 -33
4861 -33 9 18 -33 -10 5 4 -11 17 -9 -12 28 8 4 5 8 -14 -2 -9 -12 8 28 -2 -3 23 -22 0 44 -9 -2 31 11 -20 22 5 -26
4896b6N5J0p4K2L3l0RK8k7k1K0J1l7L2K7n1J4K2m1J4L5k8rJ9k0LJ9j1pK8Nm0J5
4929aJ3k4J5L1k9j3L2k1j3J7Qkk0J8j7lK0KoPk7J3Rk6J0K4jk5K3k4j9N9jm4J4
4964aJ9l1pM0j8k6N1k2k5J2J1k3K6Rk5j7K6Kj3J6J5%k4%jRNkNj0j1J7ppJ9Qj3
5001Gj1Lj1J2J7lj4LQplkJ1nJ0k0%OoK1%k9MJ3mj4KK4k6J6Ol4J4K9Jk6RKj5J1
5041aK0l8J0L0l2j5L4nMj3K0j2qQK2l6kM7%n1J4J6k6K0K2pk5K2J3m6K9Mmj6K0
5076A8j0k8L0Qk1J2Nj1j0K2j0nJ9j3k3J3PoJ5k1K2k3J1Nqj4J3Ok6K1JpJ0K7k6
5111Ck3K0K1l1J0J0j6J7Nj3j6J9LrJ0Kj0j5K6rj5L2j4j1%jK2J1k6JrJ3j8NPj5
5147a4K0kmj1OJ1rPk2J1MolK6rj4K3j6nOJ3j5j0J6pLRj2j5M5ok6mJ3kPK0k2k0
$$ plain form
4896 -26 29 39 -35 -13 20 -10 -1 27 0 -21 -1 10 -27 5 32 -19 -5 17 -24 -10 25 -3 -12 7 -13 -10 9 -2 -9 19 24 -16 -1
4929 -1 12 -12 3 34 5 -8 24 3 -10 7 15 13 -7 11 -6 -9 11 13 7 14 -13 0 9 -17 -7 17 16 -9 14 -10 -29 30 29 -15 -1
4964 -1 18 -13 -20 20 2 -24 27 5 -20 -8 3 -20 6 15 -10 -27 -1 1 -12 4 19 19 -5 -5 -6 3 8 6 11 1 -10 7 0 -7 12 20 7
5001 7 -4 -1 -12 0 17 14 0 3 11 4 1 -1 10 5 15 -5 -5 1 -5 16 16 -13 -9 4 0 -14 -12 12 -14 2 8 -26 -12 17 18 -8 1 3 -12 -1
5041 -1 19 -19 -9 21 -11 -26 8 3 7 -6 14 2 -6 2 24 -12 -14 33 33 -18 -4 12 -14 6 28 21 -4 18 31 -15 14 18 14 -2 18
5076 18 8 -20 10 18 -3 9 14 3 -7 15 5 0 19 6 -17 -4 3 -3 12 -9 13 -10 1 6 -2 -16 -3 3 -23 -2 -1 -8 2 29 3
5111 3 -20 0 21 -10 0 10 -6 11 16 3 -13 6 9 0 10 12 2 -13 13 4 -11 21 7 -4 -4 -5 17 28 2 3 -6 7 -11 -6 1 -14
5147 -14 6 4 0 -11 -5 6 -3 4 -18 -7 -3 -9 -12 14 5 -9 14 -2 -7 -1 12 -3 -13 3 -4 -1 8 -4 -19 26 20 -6 -10 3 1 8 28 6 -14
5186a4K3njnJ3KKNl0mK0J2j1j6J4Rj6JMJ2k2J2%qkK2lj2j1K7l1mL6j7j0J4Qk8
5224a4mK5j8KJ5k2JMLPQjkMqj1J1Oj1QnoJ8Ol5J4L6l1mK2j2j9L2J9m2OJ9k2qL0
5264B1j8j4L3j1k1KK8j1r%PJ1j4kj3J7kRmk9K2J1rj6K0mk3L5nk4K8Pj0k1K7j2
5300FkK7j6k1J5J6l2J6qMJ4qk0KJ7jrRj2j4L1nk6J8K0k7oK9l1QJ7j0k7L2J4j4
5336FrJ1j5jJ6j7j6J0K2Jqj0NJLmJ0j9K2Pk4j5N0nm6K4J9k4kK3%l4K4K6j9j0R
5373A1nqJ8j1j4K1Nk1%J6j0J7j1Jj2PPoj%Rkk5J2J5oj2Oj1kRJ1k1jJ2KKNqj7L0
5414A2rnj3J0mQNk2K0NJ3k2lNRLk2kJ9%j8K0Mk4MK3mk3J2J4j6oK3j5j5J9Kj6N
5453dJ1nj9J4JJ0qJj6RJ1nj0J2J0k6J1KoJ3Kj2J9l1K5llj1J8J1l5L2j0j8J5K5
$$ plain form
5186 -14 9 4 3 -2 11 13 15 20 -10 -14 6 18 7 -9 5 14 -2 -1 3 15 -7 5 5 -3 -5 17 14 2 -9 18 -13 -17 19 2 -8 6 14 -14
5224 -14 -18 7 -11 -9 6 -16 -15 -11 -8 -1 7 6 4 8 0 -11 0 6 -5 3 -2 -8 10 16 -19 -5 31 0 -4 18 6 -13 19 38 -4 2 21 -1 -9 21
5264 21 3 -11 22 11 -10 -8 20 9 0 0 7 18 4 2 -11 6 4 13 9 -20 2 13 4 -12 8 4 -19 16 11 -13 15 22 12 -9 18 6
5300 6 4 31 15 -6 9 25 -7 9 1 5 19 11 -9 -7 10 9 0 9 -3 -17 14 9 -17 1 21 -6 -12 17 -14 -6 11 1 -26 6 20 6
5336 6 -3 8 -7 -8 8 -9 -25 -15 7 8 0 -10 -5 -4 -1 -5 5 -14 8 15 -9 -24 26 21 -25 -1 18 -6 -8 15 15 -19 5 31 12 2 11
5373 11 6 -2 16 5 -9 12 17 -4 -4 12 2 19 8 9 -3 4 11 5 4 4 13 11 -14 -2 13 7 -5 1 -10 -12 -3 8 -13 -14 -2 0 2 7 -1 -18 12
5414 12 3 -2 -15 -5 -9 -1 4 -18 2 7 20 -2 -5 0 9 12 -10 -12 7 7 -11 9 13 -11 -7 16 12 -11 1 15 -1 -7 16 1 -14 5 7 -9 -4
5453 -4 7 2 -17 -3 -2 8 0 1 -15 -6 5 0 -10 2 12 -14 -3 -1 -7 6 8 -4 15 -16 9 6 3 -8 10 21 -14 18 8 -10 5 30
5489C0n0J7J9%j2lNoM%j4J0J6j0j2J6j4j2K7lj7J5Nj5J1qk9K8J0j6jK2j9oM2k9
5525Aj4J1J0k4LK0k0%J6RnKj1%J4k5J6jrj2K8%j3NMk1K4Lk0LK3kk8RPj0K4%k4
5564gJ1LJj3K5k1j2K6j3k4QK0mj0PkJ2Nj2rNoJ2%kj0J6Jk0KJ9j3J2nopJ9Jj5K
5604dJK1j6Lj2PJ0j0Nj5PJ1J3k3lK4j8j0L0rk1J8%l1K1K0j7lNrNJ3j0j5NJ7j4
5641dJ0Oj2j1K7j8j6J4J5j1MjrPOKpOk3RMPj6J0%JoJ2lJ0Nj5nKnNJ1JM%j7RQr
5685Gj3J6qlK7qj9POj1j3KQjK0l0J2jJ6j6lJ2j3JJ9k2kPJ5j1j0L0k4MQkk3K5j
5724HqjlO%Lj2LRj0QrNoQQoKlj1J6j%%Oj8K0j6mK0j8Kj4K5nMj4jKJ8j2pLj2L0
5769A5j6oKmPNolJ2qLJJ2j0mNj7OK%%OJRNj6OMJ2pj4J1mOJlk3%K0Kj4ljJ3LqK
$$ plain form
5489 30 -20 -3 16 16 4 1 6 0 4 4 -10 0 16 6 -6 10 -4 -16 11 8 -9 6 11 -4 7 -1 -30 -2 8 -8 -9 13 -6 -12 30 1
5525 1 -13 -2 8 -16 -13 7 -13 -13 3 12 7 9 -2 -2 12 -13 3 2 -7 -19 9 9 -4 1 5 -16 8 11 -9 -6 17 15 -13 -4 3 -7 17 17 -7
5564 -7 4 7 8 -5 20 -1 -13 13 0 -24 -16 4 0 -10 -3 -5 7 12 0 -9 -4 -10 2 2 0 -10 6 7 -13 -11 8 -5 7 2 -4 -11 8 9 -6 -4
5604 -4 -3 18 2 5 -7 0 10 0 5 -10 -3 8 21 -2 -5 19 1 -9 21 12 -9 9 9 -22 -1 19 2 -1 4 -5 0 13 3 -12 -7 10 -4
5641 -4 6 12 0 -11 16 -2 -18 -4 11 0 4 3 -6 1 7 9 2 8 -15 -6 -2 5 -11 -1 -1 0 -6 6 3 13 18 3 -2 0 -5 0 11 12 16 16 -1 8 16 7
5685 7 -6 10 2 -1 26 18 -1 6 12 1 -12 -10 -2 -3 17 -13 -1 -2 14 -2 -5 7 -6 -5 14 -8 -10 -3 12 1 -9 21 -3 1 9 7 -16 9 8
5724 8 0 -1 -4 2 2 5 -7 -4 5 -5 3 -6 -1 -7 1 9 3 5 2 -9 7 6 6 6 12 -6 14 -2 -6 14 -4 -2 -16 9 4 8 -6 -7 -5 13 1 -6 -3 -15 15
5769 15 -1 -7 -5 -9 -2 3 -3 -6 6 -2 1 2 14 4 0 5 -12 -6 -4 -4 -4 2 3 12 17 1 7 11 23 16 2 13 9 15 16 13 -10 -10 10 12 -2 -5 -6 7 10 2 4
5816DLKqkkMqJ0k%LjpqROq%JKLQj0qMjJ4rlP%j0J6j3pRJ2oLjpRnoRqJ1j8J7j7
5866iJ6J3lj7OLk4K4ooJ8kk0jJ8Jj7J3lk3K0J3j6nJ3mk0J9%mPoj6J3J4j0Okj1
5905hJ3oq%J3j0J4%rj7K6Nk2ROj1J7q%nJ7j3nMnNQj2oJ1lnQj2J0Rj0j1LK3qj6
5947iJ9j8mL0j8j6J7kPpMqqL2j5j5RJ9j6kj0J2mR%j8J6MJ5j0l1K0K9l5jJ2kj8
5985a3K5kl2L7Jl3J0L3j7k2K1ml2K7J2j4j7J6qJ4mKj7lK8j3pj6K4J3l1J3lklK7
6021A0qk9J9J2k2J4Nmj3K0pj1J5J3k1LJ9j2j8J4j2J1J4plPj8JJ3J6l6OPj4RJ1
6057DqLNomjK1j1JMk3nJ8rMPJ8j9j2J5kLkRj3k0J9J3j2kJ3mk%Mj1J3jnj4L5k0
6099Cj1kK0ok1J6lpJ3J4j9qK7qj8MK6k6PK6k4k0K2%j2nJ2j6J7Nj8LJ2j9K0jmM
$$ plain form
5816 4 7 9 1 -1 -3 1 -7 3 1 1 4 3 -4 -12 -3 3 -5 -5 -4 -2 1 9 -1 -9 -5 -6 8 -1 -4 3 3 -7 9 -4 -11 -2 10 4 7 6 -1 8 3 -3 6 -2 9 -9 8 -9
5866 -9 7 20 17 0 6 9 -15 9 3 -3 15 13 -7 -8 10 11 -6 7 4 -19 1 14 -2 -7 6 2 -18 1 1 -3 4 -2 -18 -5 9 -1 5 3 -8
5905 -8 5 -1 -9 -9 4 -6 8 8 -1 -18 8 13 -9 0 6 -5 12 4 4 -1 16 3 -2 2 -3 2 10 -2 -8 3 0 -5 3 -9 1 10 0 -11 -8 15 7 -9
5947 -9 10 -8 -12 18 0 -16 1 -1 6 -1 3 -5 -13 19 4 -11 -2 17 1 -1 -11 1 -3 6 6 -12 4 8 23 13 -18 2 31 -4 -5 7 5 -13
5985 -13 12 10 -22 15 16 -17 -7 26 9 -13 8 4 -28 -1 11 -3 -20 -4 -12 2 -2 0 -17 -20 8 -5 -12 -28 -4 9 -22 -9 -12 -14 -17 10
6021 10 2 -27 -8 4 -18 -4 1 -3 -16 4 -3 -14 1 14 -7 -4 15 3 -15 -1 -13 -2 12 5 2 9 -9 -8 5 21 -15 -9 -2 -16 -7 4
6057 4 -4 -1 4 -2 -6 -7 14 3 4 8 -15 -20 -2 -11 -7 0 18 -1 -13 2 0 3 1 10 -3 -23 -4 9 -3 -5 8 4 2 2 6 -5 8 7 2 -12 23 3
6099 3 -8 -10 10 4 -17 -1 -4 -11 2 16 -3 -11 16 8 -10 -6 20 -6 1 27 3 -17 5 5 -7 -12 0 -16 1 6 -12 -9 3 -16 4 3 -1 3
6137CLokJ3j6j5J4qnL2j3mQQk8J2J7k3J0K7j0k6J0j%J0nplRMoOj3J3Ol5JK8mq
6178dR%j9K1Nj6lJ9j5lJ0qoL2k3k1J2J3j8J0J7j7lJ2j4j1J1J6j2J1j3rJ0Lj2J7
6214A%mLOk3NK0kj7J5j5PJ6lk8K4Mj3rJ5Pj4J5o%j6J3P%qMjkLrK0j6lJJpnJ0p
6258a1NK1j3j3J3qOJ4j5lMmnJ0KmLKkpRQj1RQrqN%KjJ5j7Rj3J0mLQj8j2J5J4j6
6302AnJ0JqNj1NMOj6oJ2LlMMj6ORplOlj1J7mj7J9kloK8j3j6J4M%kOpj7J4J6j8
6346@NllmPqKROooJ0Mj2%RKjj4mlJ9qj1oMJ1JrRj1KJ8j5OMJj2Ljj3J9lj0QRjr
6394ejJ2j8J3J5j1j4K2j4mJLj3J1J1ppO%jPj3pPJ4rMrJ0jj2QRmPj1noK2pj9OJ9
6437Ij8%j%j7L8Ml4MJ2qmK1Kk0J5lj6K0kloK6k2j0K7j0pPRj5J3j3JMjoPmrJ9N
$$ plain form
6137 3 6 0 -2 11 -5 -20 -6 -14 -19 13 0 -4 4 12 -16 -4 13 -10 0 27 17 -9 1 0 0 10 5 -2 -5 4 8 2 8 -5 8 14 -21 -20 8 4 -4
6178 -4 5 5 -14 7 12 -4 -7 12 -3 -6 4 -4 -10 22 -1 -22 -10 3 -15 -5 12 -5 -8 4 -10 -21 -10 6 -6 5 -8 -17 -7 -4 -16 1
6214 1 1 -3 0 6 -17 -12 8 6 -11 4 -11 -4 12 9 -19 5 9 -4 -13 2 9 -5 10 4 4 -12 1 8 8 0 4 3 1 4 -5 15 -1 -4 -3 -2 -9 -14 -4 -11
6258 -11 -6 15 2 -11 2 -6 0 14 -1 -4 0 -4 -9 1 3 -1 2 4 2 -5 4 12 1 10 18 9 1 6 6 8 7 22 5 14 1 11 7 10 18 0 -12 3 17 1
6302 1 -4 6 7 -1 4 -7 -2 2 8 -8 -14 -2 1 -2 2 6 -10 -4 5 -2 -5 1 -2 -13 4 0 -17 2 0 -3 -9 19 6 -10 4 8 8 6 12 5 -12 2 18 0
6346 0 5 2 -1 -5 2 -6 -4 5 11 5 -1 9 13 1 1 10 12 11 -3 -7 -10 9 1 -10 -16 -12 -1 0 -9 0 -11 -9 9 -6 0 4 5 -7 -4 -5 -18 1 -2 -12 -4 5 4 -5
6394 -5 -6 6 -12 1 16 5 -9 13 -1 -5 -4 -1 -14 -3 8 1 -6 0 0 -1 6 -7 -14 -7 7 -2 2 -7 3 2 -10 -2 7 3 10 -1 -6 -12 10 3 -16 -10 9
6437 9 -9 -9 -10 -10 -27 11 15 -19 -15 -3 -11 -15 6 8 -12 3 0 -16 4 2 -1 -7 19 -3 -13 14 4 -3 4 13 -2 11 -2 -1 3 2 -4 3 -1 -10 9 14
6479A4k5MJ9k2KJ1j3mK3pj7J3J3k1LJ7j7QJ6l3nK1oMLqnJ9jj4mK4k9J6kj5J2K6
6517B0j4k0J1Ok2J8Pj3J0Rj2j0K8k4OPlk5K5Mj3QJk1K1J8l8RJ2nqJ6k7QJ5ok8
6554c0K6J0k9J8J1k3J5J7k7j3K7j6J0Pmj8K2mj4P%jO%mPK6k4j7K4rj9K3pl0M2
6590Inl7K8%lMJ8j6kQKk7K2Nj7QJ2j9%J7kk4K4j0j5J9Rk3J3orJ5kj8K6jlqOMj6
6631a4J2okRJj8K3j4lOPpJK8l7%J5Kj0Q%j3K5Oj0nQqJJ2k0%K2k2qROkJ1Kk6kK
6674a1NNpMJJQJj4o%OPj7J8qJj%JjkLj7L4kj8nRj0JK1jpJJ3k1jK2mrMj1K%NKj9
6722a7K3Pk3JJ4j0jPqj1J1%LlJ3j2nNj4KK2qj2RnrK0pllKQnKllK6l9K2J6j5Nk
6765@nJ3kmk8J8J1j1J9rj0MJ3oMJ0j1rQj3j0K7Mj7kJ4j8kK0j3J2j0pMlmjJ5jn
$$ plain form
6479 14 -11 -7 12 -10 -8 3 -10 -14 9 2 -15 -2 11 -10 -7 10 -7 1 17 -16 -21 0 -6 -2 1 -7 -12 7 6 -8 -12 12 -17 -1 -3 -18 -6 20
6517 20 6 -14 -3 3 -19 -1 6 -7 3 12 0 -10 18 -6 0 7 4 -21 4 8 -5 3 4 -17 4 22 -16 -7 5 0 -8 8 -19 -11 4 -2 -30
6554 -30 -4 6 -23 -5 6 -17 -2 15 -12 -25 2 -14 -4 3 -1 -19 3 -1 -15 -8 -8 -9 -3 -3 -7 0 26 2 -15 9 0 -19 4 -3 -33 9
6590 9 4 -33 -5 -5 -8 -4 14 -2 -4 4 6 -21 1 6 -11 -3 9 -10 -10 7 5 -19 5 -5 -20 -1 8 -15 -2 -8 -17 -2 -4 -22 4 3 0 -8 -2 2 -14
6631 -14 -2 -8 -10 -1 0 -18 5 -9 -12 -6 1 -6 -5 23 -14 -14 1 3 -7 1 1 -12 13 19 9 4 12 4 5 17 -3 -3 19 -3 -11 -2 4 2 13 15 -11 -13 -11
6674 -11 -6 -1 -8 -4 -3 -2 6 7 -7 -13 -13 -7 0 -17 1 -7 -6 -7 -7 -6 -7 -9 -6 -23 11 9 -9 -14 -5 -15 -14 7 6 -1 0 13 -8 -9 13 9 0 4 -7 -5 -5 0 2 -17
6722 -17 6 13 -10 -9 5 -5 -6 1 -7 -18 -7 -7 -4 -7 6 -6 -11 -6 -20 -18 4 -4 -16 -7 -12 -21 -1 -8 -11 -14 -12 -4 -9 -7 -10 -13 13 -26 -4 12 -3 2 0
6765 0 -5 8 6 2 -26 -8 3 -8 11 2 -8 -4 9 3 7 17 6 -3 5 -8 -18 9 13 -4 -6 8 -10 -12 8 -5 7 -3 -10 -6 -9 -13 -14 1 0 -5
6805eoK%J5j3j6J6Pl1K8J5l0K0Rk0QKOj5NK0k0mOqONLj4J5%j2K0j3KMoj1J7pj0
6846a0K2n%j4J4j9NK0k7KJ6j7kJ4Rj2oJ2j5JK1j0k6J9OojRk1L5Jk2LJ2mj7jJ2
6884bnJ0kjMLmJ0j8j4J5J4moJ7j2j4J1LoPJ5j8LoJNlJj2J9%lj4Pj3J1Qk2OJ3j2
6926hnMRj3J6j4k0K3J5rRrJmJ2nj4J5jl%rJ9OJjj0oJ4rLk0J5J2j4RNj4KMOj3J
6969@pJ3NK%j1J3k1JK0mlj0Mj8PNoJ3j1OmpJ7j3QJ1j7LpJ4n%OprRMj0J0%P%j3
7013ejJ4Mj8J3pJmJ0mQj1Njj2J8kj2J7j2%K6k7j2MOkJ3rj4J1pLJ0j1NPj8RJ5j1
7054aOj2j0J5LJ4j7j7K2pqLJ1jkPj5NMJ2j4J0JlqJ1mrJ4j1J0j0Lo%JJ4oJ9j5j
7095HpOpK%qJ3oj6J6J0k1jJ4poL0k2oJ0jj0J7nnQ%qj0JK0k4K4rqMPj%pJ0J1Jk4
$$ plain form
6805 -5 -11 -9 -9 6 -7 -23 -7 0 -31 -3 12 -18 2 11 -9 -1 1 7 -8 -3 17 -3 -7 -1 -9 -3 2 5 -9 6 6 -6 14 1 3 7 1 -10 7 0 -10
6846 -10 12 7 7 -7 7 -12 -7 13 -14 -12 4 -13 -15 -1 8 -4 -10 2 -13 -12 9 -1 -27 -8 -2 -8 -9 0 -21 14 15 -7 -4 8 4 -13 -14 -2
6884 -2 -7 3 1 0 4 7 3 13 -5 -19 -4 10 6 0 17 5 -9 2 5 -1 6 21 3 6 0 1 6 3 4 -8 11 11 8 -6 1 -12 -1 7 -15 -9 4 -8
6926 -8 -13 -9 0 -13 3 -11 -31 -8 7 -2 7 -2 -1 -5 7 2 -12 3 2 -1 -1 -10 9 15 16 15 5 -1 13 4 7 -13 2 14 0 9 14 0 2 6 12 -1 0
6969 0 -7 6 11 13 13 2 15 -6 -5 15 11 8 -2 2 -16 -9 -4 -10 3 -8 -2 -6 -13 4 -9 -1 10 -7 -4 -11 3 -2 -2 4 -3 -12 -3 1 -9 1 1 8 8 -5
7013 -5 -6 8 12 -6 7 0 1 -3 7 3 11 0 5 4 -8 10 8 -4 13 1 1 27 0 -12 -8 -2 -4 9 0 -14 -3 -10 -7 3 -8 -3 4 -14 -5 10 -1
7054 -1 5 -7 -17 -2 1 15 -2 -19 3 -4 -12 -9 2 1 -1 6 -9 -4 0 12 -2 8 9 6 -2 9 5 -4 10 -1 9 -1 2 -4 -4 -3 11 5 24 9 8
7095 8 1 7 0 2 2 -6 7 1 -15 1 11 -10 -11 3 -4 -10 20 -2 -8 2 1 -9 8 3 -2 6 6 -2 -12 -11 9 -15 9 0 -8 -4 3 2 2 -5 5 16 17 -7
7139gJ9Lj6JRj7NJ4k2MJ1J1j2MRj0kMpk0J6kj1J7NpkJ5pmQrQoj3OJ4j2j0L0j5
7180BnJ2j4j0L0j4j%Oj0J0Oj0oLJ4j3kmoL6j3qJ0j1j8K9Jpj3K1k2j6J9J8j5J0
7217IQk5%K6j9j6K2j2J6qrj0K7mj0pPj1K4j2j3J2Rj6jPj5J0QJj0L3k3j1K5Kl3
7254a9QL1j9j6K5Kj6J1opLJ1moJ6Oj6Oj4J3L%nKj8J6J2k4J4j4OnMMolJ4l1J0J9
7294Gj4lNlkK2j1oL%j%mLOjoOJnrJ4nj3K7mKmqQj0QJnNQj0j4K2JMj3KJNj4K3k5
7342fJ4lo%NOj1j7QlNLRpnJ1lJ0k5J6KrJ9j1j1RJj1j3K6Nk0J4Rj9J4J4oj7J2M
7383A3jj7K2j0nK0j8j0J6KjprJ2LoJ4oj5ORj1jJ8lk0J0kj3kJ8k4PN%kRpj4K5M
7424Ij0JJ0j5rJ5%L%noQoPKj6MK5Jk2Pj1Mj1K2jk4L1moJnNpNJ0J%Jj4j4NQJ5j6
$$ plain form
7139 -7 12 15 -1 0 9 -8 -3 11 -11 -7 4 15 3 7 16 6 4 8 1 -19 -3 -5 -16 1 6 -1 -3 12 5 1 9 0 8 2 -11 -5 9 -3 -13 17 2
7180 2 -3 9 -5 -15 15 1 0 0 6 -4 6 12 2 -4 -1 13 0 -2 -6 -12 24 11 3 13 2 -16 13 14 7 -6 15 -7 -23 -4 14 -1 9
7217 9 17 -8 -8 18 -1 -17 5 -7 9 1 -8 -18 9 5 -5 -12 -5 -16 8 -4 -17 -5 4 -12 -13 -6 -21 -11 -3 -2 -12 21 -2 -13 12 14 -19
7254 -19 -11 20 1 -15 10 12 -4 7 1 -6 -3 8 4 -2 14 20 4 10 -4 9 12 12 7 9 -9 7 19 -5 9 -5 1 -4 0 4 -2 -5 9 -22 -12 7
7294 7 -7 -10 -5 -8 -10 12 1 -5 -2 -2 -3 -3 -7 -4 2 1 -5 1 2 -3 -12 2 -3 -16 11 7 9 5 -3 5 -5 3 4 -1 4 12 2 -12 10 11 15 2 4 5 10 -4 19 -6
7342 -6 8 5 -1 -1 4 10 -1 -18 -10 -13 -8 -5 4 -3 -8 3 0 10 -15 1 3 -6 13 2 -9 0 1 -10 -23 3 8 -12 2 11 -8 6 20 14 -3 9 13
7383 13 12 -5 17 7 2 22 4 -6 10 12 11 4 -5 7 10 4 18 12 -3 3 12 1 0 18 15 -5 5 3 -10 -12 6 -18 -11 -6 -6 -8 1 -6 -20 5 9
7424 9 -1 0 10 -5 -14 1 1 4 4 -1 -7 1 -5 2 4 -12 -8 17 18 -4 3 -8 -4 -15 7 6 -18 13 9 3 4 -1 4 -3 2 12 13 13 14 0 -14 -9 -1 14 -2
7469b%Pj1nJ3Mj6ROj4jK4j5j7K1pKlJ4k9K6Kj8QLoRJJokJQmj1J2J5j5j4J9Nk9
7511a5K3Kj4KJ9ok0K2mj5PQqnK1j9j0J1mJlj4J4PqOLj4oJ6lJ0j5J6j8J1qJ1j3
7550a2J3mkN%ljRj0LPmnLJ1j2PrJ2j3PmJ3j2kNj2J2PRj7MLj2%J4jk1J2Koj3NN
$$ plain form
7469 -2 -2 5 -6 -11 2 6 -10 -1 5 -9 -10 14 -1 -18 3 -4 -2 -5 9 -20 6 8 -10 -2 1 -5 4 5 6 0 -2 -1 7 3 -8 4 19 4 -10 9 14 -15
7511 -15 8 10 -4 -2 17 11 -9 13 9 -6 1 9 1 -4 17 -2 -12 -1 -5 -4 -7 -21 -7 0 -8 -2 1 -13 -19 -3 -6 4 -11 5 -13 -2 -10 1 -12
7550 -12 1 -3 -5 0 0 -3 -4 5 -5 -2 5 1 -4 -1 10 -2 5 -4 8 -5 2 -2 11 -1 -3 2 -10 2 9 18 1 5 8 -4 -4 10 9 -12 0 2 -4 -17 -12 -7
$$ [...]
8191e
##END NTUPLES=NMR FID
##END=
