##TITLE=1H_LY-811.60
 CCl4, 8 sc, 
 10.4.2019
##JCAMPDX= 6.0         $$ Bruker NMR JCAMP-DX V2.0
##DATA TYPE= NMR FID
##DATA CLASS= NTUPLES
##ORIGIN= UXNMR, Bruker Analytische Messtechnik GmbH
##OWNER= root
$$ XWIN-NMR		Version 3.5
$$ Wed Apr 10 16:03:58 2019 Russian Standard Time (UT+4h)  she@DPX200
##.OBSERVE FREQUENCY= 200.1315
##.OBSERVE NUCLEUS= ^1H
##.DELAY= (6, 6)
##.ACQUISITION MODE= SIMULTANEOUS
##.ACQUISITION SCHEME= undefined
##.AVERAGES= 8
##.DIGITISER RES= 18
##SPECTROMETER/DATA SYSTEM= spect
##.PULSE SEQUENCE= zg30
##.SOLVENT NAME= CDCl3
##.SHIFT REFERENCE= (INTERNAL, CDCl3, 0, 15.7039)
##AUDIT TRAIL= $$ (NUMBER, WHEN, WHO, WHERE, WHAT)
$$ ##TITLE= Audit trail, XWIN-NMR		Version 3.5
$$ ##JCAMPDX= 5.01
$$ ##ORIGIN= Bruker BioSpin GmbH
$$ ##OWNER= she
$$ F:/spectra/data/she/nmr/H-F/1/audita.txt
$$ ##AUDIT TRAIL=  $$ (NUMBER, WHEN, WHO, WHERE, WHAT)
(   1,<2019-04-10 16:02:54.04 +0400>,<she>,<DPX200>,
      <created by zg, POWCHK disabled, PULCHK disabled
       configuration hash MD5:
       00 E9 B6 7A A2 85 ED C7 34 08 36 98 17 FE 4E 26
       data hash MD5: 16K
       DB BF D7 18 3C D6 86 92 02 AA ED 37 CA 91 67 D7>)
$$ ##END=
$$ 
$$ hash MD5
$$ 8D 12 61 65 B0 3A E4 30 2F 9E 5A 66 15 7C 20 22
##$RELAX= 
##$RELAX= 
##$RELAX= 
##$RELAX= 
##$RELAX= 
##$RELAX= 
$$ Bruker specific parameters
$$ --------------------------
##$DU= <F:/spectra>
##$EXPNO= 1
##$NAME= <H-F>
##$PROCNO= 1
##$TYPE= <nmr>
##$USER= <she>
##$AMP= (0..31)
100 100 100 100 100 100 100 100 100 100 100 100 100 100 100 100 100 100 
100 100 100 100 100 100 100 100 100 100 100 100 100 100 
##$AQSEQ= 0
##$AQ_mod= 1
##$AUNM= <au_zg>
##$AUTOPOS= <>
##$BF1= 200.13
##$BF2= 200.13
##$BF3= 200.13
##$BF4= 200.13
##$BF5= 200.13
##$BF6= 200.13
##$BF7= 200.13
##$BF8= 200.13
##$BYTORDA= 1
##$CFDGTYP= 0
##$CFRGTYP= 5
##$CHEMSTR= <none>
##$CNST= (0..31)
1 1 145 1 1 1 1 1 1 1 1 1 1 1 1 1 1 1 1 1 1 1 1 1 1 1 1 1 1 1 1 1 
##$CPDPRG= <>
##$CPDPRG1= <>
##$CPDPRG2= <>
##$CPDPRG3= <>
##$CPDPRG4= <mlev>
##$CPDPRG5= <mlev>
##$CPDPRG6= <mlev>
##$CPDPRG7= <mlev>
##$CPDPRG8= <mlev>
##$CPDPRGB= <>
##$CPDPRGT= <>
##$D= (0..31)
0 1.2 0 0 0 0 0 0 0 0 0 0.03 0 0 0 0 0 0 0 0 0 0 0 0 0 0 0 0 0 0 0 0 
##$DATE= 1554897773
##$DBL= (0..7)
120 120 120 120 120 120 120 120 
##$DBP= (0..7)
150 150 150 150 150 150 150 150 
##$DBP07= 0
##$DBPNAM0= <>
##$DBPNAM1= <>
##$DBPNAM2= <>
##$DBPNAM3= <>
##$DBPNAM4= <>
##$DBPNAM5= <>
##$DBPNAM6= <>
##$DBPNAM7= <>
##$DBPOAL= (0..7)
0.5 0.5 0.5 0.5 0.5 0.5 0.5 0.5 
##$DBPOFFS= (0..7)
0 0 0 0 0 0 0 0 
##$DE= 6
##$DECBNUC= <off>
##$DECIM= 24
##$DECNUC= <off>
##$DECSTAT= 4
##$DIGMOD= 1
##$DIGTYP= 9
##$DL= (0..7)
0 120 120 120 120 120 120 120 
##$DP= (0..7)
150 150 150 150 150 150 150 150 
##$DP07= 0
##$DPNAME0= <>
##$DPNAME1= <>
##$DPNAME2= <>
##$DPNAME3= <>
##$DPNAME4= <>
##$DPNAME5= <>
##$DPNAME6= <>
##$DPNAME7= <>
##$DPOAL= (0..7)
0.5 0.5 0.5 0.5 0.5 0.5 0.5 0.5 
##$DPOFFS= (0..7)
0 0 0 0 0 0 0 0 
##$DQDMODE= 0
##$DR= 18
##$DS= 0
##$DSLIST= <SSSSSSSSSSSSSSS>
##$DSPFIRM= 0
$$ [...]
##$SUBNAM2= <"">
##$SUBNAM3= <"">
##$SUBNAM4= <"">
##$SUBNAM5= <"">
##$SUBNAM6= <"">
##$SUBNAM7= <"">
##$SUBNAM8= <"">
##$SUBNAM9= <"">
##$SW= 24.9337058887773
##$SWIBOX= (0..15)
0 0 2 0 0 0 0 0 0 0 0 0 0 0 0 0 
##$SW_h= 4990.01996007984
##$TD= 16384
##$TD0= 1
##$TE= 0
##$TE2= 300
##$TE3= 300
##$TEG= 300
##$TL= (0..7)
0 120 120 120 120 120 120 120 
##$TP= (0..7)
150 150 150 150 150 150 150 150 
##$TP07= 0
##$TPNAME0= <>
##$TPNAME1= <>
##$TPNAME2= <>
##$TPNAME3= <>
##$TPNAME4= <>
##$TPNAME5= <>
##$TPNAME6= <>
##$TPNAME7= <>
##$TPOAL= (0..7)
0.5 0.5 0.5 0.5 0.5 0.5 0.5 0.5 
##$TPOFFS= (0..7)
0 0 0 0 0 0 0 0 
##$TUNHIN= 0
##$TUNHOUT= 0
##$TUNXOUT= 0
##$USERA1= <user>
##$USERA2= <user>
##$USERA3= <user>
##$USERA4= <user>
##$USERA5= <user>
##$V9= 5
##$VALIST= <valist>
##$VCLIST= <CCCCCCCCCCCCCCC>
##$VD= 0
##$VDLIST= <DDDDDDDDDDDDDDD>
##$VPLIST= <PPPPPPPPPPPPPPP>
##$VTLIST= <TTTTTTTTTTTTTTT>
##$WBST= 1024
##$WBSW= 4
##$XGAIN= (0..3)
0 0 0 0 
##$XL= 0
##$YL= 0
##$YMAX_a= 57964
##$YMIN_a= -64366
##$ZGOPTNS= <>
##$ZL1= 120
##$ZL2= 120
##$ZL3= 120
##$ZL4= 120
##$ABSF1= 10
##$ABSF2= 0
##$ABSG= 5
##$ABSL= 3
##$ALPHA= 0
##$AQORDER= 0
##$ASSFAC= 0
##$ASSFACI= 0
##$ASSFACX= 0
##$ASSWID= 0
##$AUNMP= <proc_1d>
##$AZFE= 0.1
##$AZFW= 0.1
##$BCFW= 1
##$BC_mod= 2
##$BYTORDP= 1
##$COROFFS= 0
##$CY= 11.3945322036743
##$DATMOD= 1
##$DC= 2
##$DFILT= <>
##$DTYPP= 0
##$F1P= 18.9103706918063
##$F2P= -1.10871071338519
##$FCOR= 0.5
##$FTSIZE= 0
##$FT_mod= 4
##$GAMMA= 1
##$GB= 0.15
##$INTBC= 1
##$INTSCL= 1
##$ISEN= 128
##$LB= 0.24
##$LEV0= 0
##$LPBIN= 0
##$MAXI= 10000
##$MC2= 0
##$MEAN= 0
##$ME_mod= 0
##$MI= 1.114404
##$NCOEF= 0
##$NC_proc= 0
##$NLEV= 6
##$NOISF1= 3.799351
##$NOISF2= 2.8
##$NSP= 1
##$NTH_PI= 0
##$NZP= 0
##$OFFSET= 15.70392
##$PC= 1
##$PHC0= -8932.487
##$PHC1= 15.20026
##$PH_mod= 1
##$PKNL= yes
##$PPARMOD= 0
##$PSCAL= 0
##$PSIGN= 0
##$REVERSE= no
##$SF= 200.130013532006
##$SI= 16384
##$SIGF1= 3
##$SIGF2= 2
##$SINO= 400
##$SIOLD= 16384
##$SREGLST= <1H.CDCl3>
##$SSB= 0
##$STSI= 0
##$STSR= 0
##$SW_p= 3612.71676300578
##$SYMM= 0
##$S_DEV= 0
##$TDeff= 0
##$TDoff= 0
##$TI= <>
##$TILT= no
##$TM1= 0
##$TM2= 0
##$TOPLEV= 0
##$USERP1= <user>
##$USERP2= <user>
##$USERP3= <user>
##$USERP4= <user>
##$USERP5= <user>
##$WDW= 1
##$XDIM= 8192
##$YMAX_p= 0
##$YMIN_p= 0
$$ End of Bruker specific parameters
$$ ---------------------------------
##NTUPLES= NMR FID
##VAR_NAME=  TIME,          FID/REAL,        FID/IMAG
##SYMBOL=    X,             R,               I
##VAR_TYPE=  INDEPENDENT,   DEPENDENT,       DEPENDENT
##VAR_FORM=  AFFN,          ASDF,            ASDF
##VAR_DIM=   8192,          8192,            8192
##UNITS=     SECONDS,       ARBITRARY UNITS, ARBITRARY UNITS
##FACTOR=    0.0002004,     1,               1
##FIRST=     0,             0,               0
##LAST=      1.6414764,     0,               0
##MIN=       0,             -64366,          0
##MAX=       1.6414764,     57964,           0
$$ Real data points
##PAGE= N=1
##DATA TABLE= (X++(R..R)), XYDATA
$$ [...]
$$ plain form
540 1031 -280 -593 462 146 -522 202 402 -398 -196 552 39 -638 47 594 -114 -305 255 -66 -409
559 -409 387 400 -578 -177 633 -159 -531 356 156 -367 321 191 -691 51 677 -266 -339 389 -169 -313 485
580 485 -37 -582 406 406 -572 -85 357 -232 68 437 -428 -388 547 138 -374 114 131 -192 77 134 -193 -95
602 -95 220 181 -255 -309 336 356 -420 -58 399 -488 -154 966 -324 -969 926 445 -1273 399 1017 -1096
622 -1096 -134 1298 -983 -922 1572 93 -1360 752 436 -1160 460 828 -972 -75 873 -535 -379
639 -379 474 -191 66 417 -582 -193 506 -348 110 643 -811 -257 1113 -666 -801 1377 -83 -1195
657 -1195 1110 177 -1653 1058 1228 -1690 39 1423 -1309 -340 1725 -962 -937 1757 -366 -1496
673 -1496 1343 318 -1349 1079 470 -1724 724 1195 -1470 109 1240 -1280 -207 1546 -1019 -784
$$ packed form
540A031j311l13J055l16o68P24K00q00K02P48n13o77O85N47p08j91N60l21l43
559d09P96J3r78M01Q10p92l72Q87k00n23O88j30q82P42O26r43p3P28n58j44P98
580D85n22n45R88%r78M87M42n89L00L69q65M0R35m09n12M88J7l23K69N7l27R8
602i5L15l9m36n4O45K0p76L62M57q87L34J120j290o45J895m81j718J672O18k113
622a096R62J432k281O1K494j479j453K112l16j596J620L68j800Q97R48j408J56
639c79Q53o65K57L51r99L89O99q54M58N33j454N54J370j779j35K178j460j112
657a195K305r33j830K711J70k918J729J384k732R69K065k687K5K694k123j130
673a496K839j025j667K428o09k194K448M71k665J579J131k520J073J753k565K35
$$ plain form
689 -784 1617 -391 -1223 1153 52 -1071 1047 272 -1387 585 723 -900 358 445 -1021 446 706
706 706 -1161 303 1098 -1216 -103 1339 -1259 -534 2131 -678 -1712 1712 222 -1870 1446 1069
722 1069 -2215 462 1802 -1841 -554 2197 -788 -1260 1619 -325 -1619 1497 785 -1593 394 863
738 863 -1177 116 1054 -776 -214 929 -566 -594 644 -70 -90 520 -560 -400 736 -272 -351 886
756 886 -414 -863 1134 64 -1422 978 972 -1539 96 1269 -1261 -332 1795 -764 -1349 1459 221
773 221 -1352 911 585 -1330 483 912 -1204 16 1172 -730 -374 880 -619 -389 1244 -299
789 -299 -998 798 159 -797 675 359 -881 352 501 -830 59 679 -396 34 335 -765 1 870
807 870 -406 -287 651 -493 -454 874 -204 -701 897 174 -1060 346 449 -706 449 645 -972
$$ packed form
689g84K401k008q32K376j101j123K118p75j659J972J38j623J258Q7j466J467K60
706G06j867J464P95k314J113J442k598P25K665k809j034L424j490k092L316l77
722A069l284K677J340l643J287K751k985m72K879j944j294L116p12k378J987M69
738H63k040J293R38j830N62J143j495k8J238p14k0O10j080J60J136j008p9J237
756H86j300m49J997j070j486K400ok511J635J173k530R29K127k559n85K808j238
773B21j573K263l26j915J813M29k116J220J156j902L56J254j499K30J633j543
789b99o99J796o39r56J472l16j240J233J49j331Q89O20j075M30L01j100P66Q69
807H70j276J19R38j144L9J328j078m97J598p23j234J406J03j155J155J96j617
$$ plain form
824 -972 -192 846 -473 -275 801 -313 -513 699 -174 -766 665 477 -645 27 261 -424 129 441
842 441 -267 -155 189 -41 40 -17 -183 285 196 -410 42 254 -309 144 430 -515 -253 679 -88 -483 342
863 342 57 -348 341 122 -488 167 300 -313 -47 158 -163 122 189 -358 -141 258 17 34 27 -235 88 192
885 192 -274 9 310 -209 10 313 -474 -255 746 -10 -574 398 103 -603 388 442 -656 45 687 -452
905 -452 -435 512 15 -199 399 -95 -465 265 231 -210 72 60 -129 141 -18 -260 186 179 -136 99 -93 -358
927 -358 339 308 -489 43 415 -398 -89 502 -443 -311 813 -71 -812 447 352 -650 244 527 -701 -118
947 -118 790 -351 -576 580 171 -458 267 151 -472 167 386 -317 -171 262 10 -42 48 -158 30 215
967 215 -69 -67 23 -124 121 237 -261 -119 370 -70 -240 248 -58 -249 432 134 -584 97 449 -301 -95
$$ packed form
824i72P80J038j319J98J076j114k00J212q73n92J431j88j122O72K34o85N53L12
842D41p08J12L44k30Q1n7j66M68q9o06M52K12n63M53K86r45K62R32p67l95Q25
863C42k85m05O89k19o10O55J33o13K66K05l21K85O7n47K17L99k41J7pk62L23J04
885A92m66K83L01n19K19L03p87K19J001p56n64R72k95p06R91N4j098P01O42j139
905d52J7R47m97k14N98m94l70P30l4m41K82j2j89K70j59k42M46pl15K35j92k65
927c58O97l1p97N32L72q13L09N91r45J32J124q84p41J259r5j002Q94K83j228N83
947a18R08j141k25J156m09o29P25j16o23O39K19p03J46M33k52n2R0k06J88J85
967B15k84KR0j47K45J16m98J42M89m40j70M88l06j91O81k98p18O81L52p50K06
$$ plain form
988 -95 371 -284 -198 482 -136 -479 379 267 -377 50 129 -317 111 343 -323 -177 323 -71 -177 166 -93
1009 -93 -134 316 5 -369 77 224 -98 30 58 -156 46 201 -112 -129 99 80 45 -35 -169 48 178 -68
1031 -68 -47 63 -110 18 226 -168 -253 302 180 -283 12 123 -209 67 273 -250 -206 352 57 -326 78
1052 78 136 -140 91 142 -275 -124 299 59 -217 7 93 -50 -23 21 -74 -17 160 83 -185 -175 162 162 -135 -56
1076 -56 119 -72 -64 159 -55 -226 224 259 -301 -188 252 28 -89 196 -18 -247 139 192 -221 -93 248 67
1098 67 -114 -49 -54 -42 140 115 -101 -107 28 80 -10 -90 29 122 22 -90 -82 -54 75 177 5 -182 -26 97 -9
1123 -9 -62 -4 36 76 -8 -112 -114 29 157 80 -112 -138 50 65 -70 -1 77 -23 28 77 -181 -169 284 214 -210 -82
1149 -82 141 -95 -51 219 -32 -180 193 163 -314 -137 309 82 -127 93 -20 -230 70 238 -117 -172 219
$$ packed form
988i5M66o55Q6O80o18l43Q58j12o44M27P9m46M28K32o66J46N00l94j06L43k59
1009i3m1M50l11l74M46J47l22J28K8k14K02J55l13j7K28j9l5q0j34K17J30k46
1031f8K1J10j73J28K08l94q5N55j22m63K95J11l32K76K06n23M4N58k95l83M04
1052G8N8k76K31N1m17J51M23k40k76K24Q6j43K7M4r5N7J77p7k68J0L37%k97P9
1076e6J75j91QK23k14j71M50L5n60J13M40k24j17K85k14k29L86N3m13J28L41j81
1098F7j81O5nJ2J82k5k16oJ35N2r0q0J19R3j00j12QK8J29J02j72j87J56J23j06
1123in3N8M0M0q4j04kJ43J28p7j92k6J88J5j35O9P8j00N1M9k58J2M53p0m24J28
1149h2K23k36M4K70k51j48L73l0m77J77M46k27k09K20j13k10L00J68l55n5L91
$$ plain form
1170 219 133 -232 -116 147 49 -15 111 -49 -251 39 244 -100 -191 182 120 -203 -47 96 -128 46 296 -126
1192 -126 -324 148 183 -175 6 150 -94 -23 131 -139 -175 210 197 -106 -126 18 29 14 14 20 -20 -24 103 23 -198
1217 -198 1 294 15 -188 27 8 -98 139 86 -192 37 194 -132 -148 67 14 91 96 -194 -111 146 -16 -60
1240 -60 122 -104 -88 227 -92 -314 185 223 -160 17 45 -242 67 262 -161 -129 197 -6 -134 13 -47 -4
1262 -4 177 14 -115 -57 -47 121 128 -193 -23 265 -155 -193 253 -107 -204 470 51 -619 182 441 -390 -33 479
1285 479 -306 -254 484 -122 -462 369 273 -347 10 101 -212 113 209 -169 -58 109 -83 -2 -18 -162 185 197
1307 197 -268 -85 127 -163 81 265 -255 -130 339 -119 -266 259 22 -201 296 1 -461 180 318 -247
1327 -247 -6 214 -219 -18 233 -224 -117 326 1 -164 68 -121 -82 328 -4 -274 189 104 -293 76 161
$$ packed form
1170B19q6l65J16K63r8o4J26j60k02K90K05l44r1L73o2l23J56J43k24J74K50m22
1192a26j98M72L5l58J81J44k44P1J54k70l6L85j3l03k0J44J1j5%Om0mJ27q0k21
1217a98J99K93k79k03K15j9j06K37n3k78K29J57l26j6K15n3P7Nk90Q3K57j62m4
1240f0J82k26J6L15l19k22M99L8l83J77K8k87L09J95m23L2L26k03j28J47o0M3
1262dJ81j63j29N8J0J68Pl21J70K88m20l8M46l60r7O74m19o70Q01K59q31L57N12
1285D79p85N2P38o06l40Q31r6o20L57R1l13L25R6l78J11J67j92Q1j6j44L47J2
1307A97m65J83K12k90K44J84n20J25M69m58j47N25k37k23M97k95m62O41J38n65
1327b47K41K20m33K01K51m57J07M43l25j65K32j89L9M10l32k70M63q5l97L69Q5
$$ plain form
1348 161 -239 90 345 -251 -328 250 143 -177 67 96 -198 -40 156 -105 -140 194 147 -159 -140 4 20 53
1370 53 92 -70 -96 45 15 -61 -12 14 62 89 -117 -175 61 109 25 51 -52 -125 102 41 -179 69 184 -88 9
1395 9 77 -241 7 371 -91 -234 202 -17 -203 218 16 -259 258 175 -360 -14 173 -182 155 237 -363 -64
1417 -64 379 -247 -211 399 -72 -266 375 -73 -535 313 362 -371 4 245 -308 -59 303 -184 -155 294 -12
1438 -12 -206 15 -48 32 218 -95 -167 109 -64 -54 203 -95 -153 335 -16 -383 181 188 -244 175 221 -413 -35
1461 -35 459 -205 -289 352 55 -299 193 76 -326 123 349 -184 -224 179 70 -128 38 89 -77 -9 138 -49
1483 -49 -211 30 218 -32 -131 22 17 -36 57 -6 -67 66 78 -59 -87 -55 55 156 -43 -139 50 -5 -73 105 23
1508 23 -132 164 136 -282 -69 202 -44 25 173 -198 -161 291 16 -232 162 124 -160 50 38 -193 115 232
$$ packed form
1348A61m00L29K55n96p7N78j07l20K44K9k94J58J96k61l5L34m7l06J9J44J6L3
1370E3L9j62k6J41l0p6M9K6M8K7k06n8K36M8q4K6j03p3K27o1k20K48J15k72R7
1395IO8l18K48L64m62j43M36k19j86M21k02k75N17q3n35L46J87l55L37Q2o00K99
1417f4M43o26L6O10m71j94O41m48m62Q48M9p33L75K41n53K49L62m87K9M49l06
1438a2j94K21o3Q0J86l13p2K76j73J0K57k98n8M88l51l67N64Pm32M19M6o34L78
1461c5M94o64q4O41k97l54M92j17m02M49K26n33m0M03j09j98J66N1j66O8J47j87
1483d9j62K41J88k50r9J53nn3R3o3o1J33J2j37k8L2J10J01j99r6J89n5o8J78q2
1508B3j55K96k8m18K13K71k46O9J48l71L7M52k75k48L94l8k84K10j2k31L08J17
$$ plain form
1530 232 -118 -66 18 -95 119 94 -219 59 230 -201 -91 227 -166 -86 396 -122 -443 269 210 -341 77 234
1552 234 -264 -20 270 -202 -194 265 69 -146 21 -59 -52 142 -15 -113 83 -2 -62 87 -80 -121 240 121 -236
1575 -236 14 116 -145 52 161 -170 -58 268 -43 -231 124 82 -89 122 50 -240 16 228 -86 -153 134
1596 134 77 -110 -21 14 -94 20 180 -28 -189 -11 150 -13 -95 33 50 -39 -24 33 -67 -57 132 115 -180
1619 -180 -164 144 64 -130 26 118 -119 -26 140 -121 -189 232 176 -221 -78 106 -84 -2 159 -65 -110 140 34
1642 34 -157 -25 91 63 47 -58 -113 45 56 6 25 -32 -57 105 -2 -189 54 154 -73 -31 48 -182 -46 265
1666 265 -33 -243 155 99 -214 -6 121 -122 17 239 -117 -255 117 150 -96 -33 89 -51 -70 49 -12 -107
1688 -107 38 195 -10 -210 -18 156 -36 -38 109 -20 -134 86 91 -196 -14 270 -19 -225 34 69 -100 87
$$ packed form
1530B32l50N2Q4j13K14k5l13K78J71m31J10L18l93Q0M82n18l21P12n9n51M18J57
1552B34m98K44K90m72QM59j96k15J67q0PJ94j57r8J96q5o0J49j67m1L61j19l57
1575b36K50J02k61J97J09l31J12L26l11j88L55m2j71K11p2k90K56K12l14o7K87
1596A34n7j87Q9L5j08J14J60k08j61J78J61j63q2J28J7q9J5N7j00J0J89j7k95
1619a80J6L08q0j94J56R2k37R3J66k61o8M21n6l97J43J84j90Q2J61k24m5K50j06
1642C4j91J32J16k8j6j05n5J58J1n0J9n7k5J62j07j87K43J00k27M2P9k30J36L11
1666B65k98k10L98n6l13K08J27k43J39K22l56j38L72L3k46O3J22j40j9J19o1r5
1688a07J45J57k05k00J92J74j92kJ47j29j14K20Nk87J82K84k89k06K59L5j69J87
$$ plain form
1710 87 172 -157 -118 176 -14 -206 68 190 -42 -49 21 -134 -56 188 84 -142 -52 79 -48 -89 2 51 21 24 -44
1735 -44 -139 -73 107 120 -63 -100 41 -6 -96 29 72 -43 47 101 -177 -194 192 148 -107 14 63 -149 -24 169
1759 169 -57 -84 205 77 -226 -75 103 20 51 88 -81 -131 33 64 -33 -37 71 97 -76 -173 6 90 33 100 53
1784 53 -194 -98 196 -24 -162 160 125 -186 -56 73 -150 14 291 -49 -256 23 61 -102 30 105 -25 -1
1806 -1 21 -118 -92 69 148 82 -80 -129 25 46 -55 74 100 -110 -12 89 -208 -105 307 106 -212 19 14 -193
1830 -193 88 225 -135 -51 208 -106 -231 87 107 -10 104 -16 -218 -45 110 28 19 22 -14 -2 -92 -145 70 111
1854 111 -1 60 -52 -277 22 254 -112 -92 239 -81 -258 130 31 -187 228 249 -311 -172 198 -44 -45 228
1876 228 -3 -163 70 -14 -145 74 146 86 34 -170 -149 169 73 -66 153 27 -243 83 115 -262 109 400
$$ packed form
1710H7Q5l29L9K94j90j92K74J22k32pP0j55P8K44j04k26R0J31j27m1R1M9l0Lo8
1735d4r5O6J80J3j83l7J41m7r0J25M3j15R0N4k78j7L86m4k55J21M9k12J25J93
1759A69k26k7K89j28l03J51J78q3L1L7j69n0J64L1r7mJ08K6j73r7J79Q4n7O7m7
1784E3k47R6K94k20j38L22l5l11J30J29k23J64K77l40k07K79L8j63J32P5j30K4
1806aK2j39K6J61P9o6j62m9J54K1j01J29K6k10R8J01k97J03M12k01l18K31nk07
1830a93K81J37l60Q4K59l14j25L18K0j17J14j20k02J73J55q2rLl6J2r0n3K15M1
1854A11j12O1j12k25K99K32l66K0L31l20j77L88r9k18M15K1n60J39L70k42jK73
1876B28k31j60K33q4j31K19P2o0n2k04K1L18r6j39K19j26k70L26L2l77L71K91
$$ plain form
1898 400 -150 -233 147 -130 -148 365 75 -314 118 115 -308 33 241 -83 69 172 -289 -184 224 24 -8 154
1920 154 -121 -137 125 -117 -121 273 53 -166 115 -142 -321 314 278 -328 56 230 -386 -87 406 -170 -130 473
1942 473 -72 -490 172 174 -184 220 177 -314 -22 147 -180 34 230 -52 30 53 -333 -22 334 -47 -55 217
1964 217 -231 -241 300 -39 -261 369 167 -405 12 122 -273 176 383 -290 -206 241 -154 -154 305 19 -141
1985 -141 217 -113 -364 149 198 -64 161 0 -321 75 155 -214 118 306 -212 -105 182 -274 -121 541 47
2006 47 -363 202 42 -407 209 342 -277 26 346 -308 -315 320 121 -99 223 -39 -335 61 151 -76 94
2027 94 127 -87 -43 -99 -169 158 214 -64 26 -52 -308 89 305 -187 -29 348 -232 -345 260 -18 -216 443 160
2050 160 -557 13 304 -290 59 427 -216 -193 287 -201 -291 380 165 -166 140 -103 -330 234 200 -197 171
$$ packed form
1898D00n50q3L80k77j8N13k90l89M32lm23L41K08l24J52J03m61J05M08k00l2J62
1920A54k75j6K62k42mL94k20k19K81k57j79O35l6o06L84J74o16K99M93n76M0O03
1942D73n45m18O62Kl58M04m3m91K92J69l27K14J96k82Q2K3l86L11L56l81qK72
1964B17m48j0N41l39k22O30k02n72M17J10l95M49K07o73Q4M47l95%M59k86j60
1985a41L58l30k51N13M9k62K25j61l21L96Q0l69L32J88n18J07K87m56J53O62m94
2006D7m10N65j60m49O16J33o19L03L20o54pO35j99k20L22k62k96L96R0k27J70
2027I4L3k14M4n6p0L27N6k78R0p8k56L97K16m92J58L77n80j13O05k78j98O59k83
2050A60p17N70K91n94L49L68o43K3M80m88r0O71k15l31L06k43k27N64l4l97L68
$$ plain form
2071 171 161 -339 -16 169 -239 126 434 -219 -280 185 -122 -137 389 38 -272 173 10 -349 115 219 -51
2092 -51 139 25 -365 -9 197 -70 113 148 -267 -34 143 -303 22 450 -126 -193 245 -273 -303 520 129
2113 129 -417 260 159 -521 86 379 -280 51 457 -322 -383 301 47 -129 295 29 -281 71 33 -174 140
2134 140 153 -21 76 -140 -261 189 171 -101 165 63 -355 71 199 -260 71 431 -177 -269 190 -143 -145 425
2156 425 63 -327 128 57 -292 121 195 -137 120 122 -344 -104 247 -34 66 198 -244 -178 229 -81 -156 312
2178 312 80 -235 90 -35 -277 222 333 -195 -81 148 -179 -99 258 12 -81 195 -16 -265 -4 116 40
2199 40 120 1 -150 -17 9 -15 101 45 -59 99 -41 -269 58 247 -52 -15 124 -224 -171 267 22 -198
2221 -198 200 138 -301 -54 138 -142 62 298 -156 -253 123 13 -116 144 73 -129 70 -4 -214 47 184
$$ packed form
2071A71j0n00L23J85m08L65L08o53o1M65l07j5N26l51l10M45j63l59M64J04k70
2092e1J90j14l90L56K06k67J83L5m15K33J77m46L25M28n76o7M38n18l0Q23l91
2113A29n46O77j01o80O07K93o59L31M06p79o1O84k54j76M24k66l10L52l8k07L14
2134A40J3j74R7k16j21M50j8k72K66j02m18M26J28m59L31L60o08r2M59l33kN70
2156D25l62l90M55p1l49M13P4l32K57Km66K40L51k81J00J32m42O6M07l10p5M68
2178C12k32l15L25j25k42M99J11n28J14K29l27Q0L57k46r3K76k11k49K61J20p6
2199D0Q0j19j51J33K6k4J16n6j04J58j40k28L27J89k99L7J39l48N3M38k45k20
2221a98L98o2m39K47J92k80K04K36m54r7L76j10j29K60p1k02J99p4k10K61J37
$$ plain form
2242 184 11 39 2 -214 3 192 -55 -1 185 -74 -125 91 -88 -90 291 113 -261 -5 67 -155 100 201
2264 201 -133 -48 176 -139 -173 148 80 -2 91 -94 -173 68 61 -16 70 -21 -88 61 -75 -155 153 161 -104 5 10 -222
2290 -222 38 246 -106 -84 193 -61 -202 114 29 -93 184 90 -257 -50 128 -24 52 115 -79 -41 76 -83
2312 -83 -72 131 78 22 17 -127 -64 129 62 -14 69 -14 -89 68 -8 -102 123 159 -89 -82 2 -45 48 134 -13 -90 34
2339 34 12 -71 -20 30 65 42 -68 -85 -17 28 76 74 -91 -90 74 -13 -115 44 111 -35 10 7 -153 -11 188 17 -93
2366 -93 44 16 -76 34 30 -38 65 96 -57 -108 -9 66 69 27 -34 -12 1 0 17 -11 0 90 45 -119 -69 89 40 6 59
2395 59 -51 -80 71 39 -86 0 116 -5 -80 -2 -40 -21 106 46 -95 -53 47 20 -40 -23 35 44 -5 -50 -36 -4 37
2422 37 74 -19 -109 8 85 -40 -34 64 -1 -23 65 -31 -116 81 136 -68 -75 57 -5 -24 60 -8 -51 84 62 -82 -43 40
$$ packed form
2242A84j73K8l7k16K17J89k47N4J86k59n1K16j79kL81j78l74K56P2k22K55J01
2264B01l34Q5K24l15l4L21o8q2R3j85p9K41pp7Q6r1o7J49j36q0L08Qk65J09Nk32
2290b22K60K08l52K2K77k54j41L16q5j22K77r4l47K07J78j52P6O3j94L8J17j59
2312h3J1K03n3n6nj44O3J93o7p6Q3q3p5J57p6r4K25L6k48PQ4m7R3Q6j47p7J24
2339C4k2q3N1N0L5k3j10j7O8M5M8kj65JJ64q7j02J59O7j46M5lj60J42J99j71j10
2366i3J37k8r2J10mo8J03L1j53n1R9P5Lm2o1K2J3jJ7k8J1R0m5j64N0J58m9l4N3
2395E9j10k9J51l2j25Q6J16j21p5P8l8J9J27o0j41M2J00k7o0J7N8Rm9m5J4L2M1
2422C7L7r3r0J17P7j25OR8o5k2Q8r6q5J97N5k04pJ32o2j9Q4o8m3J35k2j44L9Q3
$$ plain form
2450 40 40 32 -19 -47 1 34 26 8 -26 -28 66 21 -118 -7 94 -5 -38 25 -78 -56 127 11 -159 35 100 -80 -45 48
2478 48 -57 0 125 -36 -126 26 86 -5 -10 -1 9 18 6 -24 -3 7 55 74 -86 -88 110 65 -89 31 80 -84 26
2505 26 106 -94 -78 172 43 -153 7 41 -53 42 60 -101 -30 87 10 -74 -18 14 48 4 -85 -6 34 -6 51 0 -112
2532 -112 13 138 -76 -108 91 20 -81 69 -5 -131 83 133 -115 -72 85 4 -21 57 -32 -50 68 15 -68 -15
2556 -15 6 55 46 -77 -30 93 6 -34 61 -29 -73 143 47 -172 36 155 -66 -59 107 -64 -64 161 3 -164 63
2581 63 106 -64 -40 40 -33 17 54 -40 -51 21 45 36 -36 -69 54 64 -83 -47 60 -36 0 102 -89 -106 133 63 -142
2608 -142 -4 97 -45 6 97 -74 -65 145 38 -101 3 42 18 45 -19 -54 42 50 -50 4 -5 -31 87 36 -129 -16
2634 -16 147 -52 -60 95 -54 -81 154 18 -218 66 166 -136 -55 122 -96 -65 184 -45 -191 120 113 -150 -10
$$ packed form
2450D0%qn1k8M8L3qj8l4kR4m5j39J11J01r9l3O3j03K2J83j16j70J94O5j80L5R3
2478D8j05N7J25j61r0J52O0r1nRJ0Rj2l0K1J0M8J9j60kJ98m5j54J20M9j64J10
2505B6Q0k00J6K50j29j96J60L4r4R5J8j61P1J17p7q4N6L2L4m4q9P9M0m0N7n1j12
2532a12J25J25k14l2J99p1j01J50p4j26K14N0k48M3J57q1k5P8q9j8J18n3q3N3
2556a5K1M9rj23M7J23q7m0R5r0m4K16r6k19K08J19k21PJ66j71%K25j58j67K27
2581F3M3j70K4Q0p3N0L7r4j1P2K4rp2l3J23J0j47L6J07r6L6J02j91j7K39p0k05
2608a42J38J01j42N1R1j71RK10j07j39J04L9k4K7o4l5R6Qj00N4rk6J18n1j65J13
2634a6J63j99qJ55j49k7K35j36k36K84J00l02Q1J77k18L1K49k29j46L11pk63J40
$$ plain form
2657 -10 72 -74 12 84 -78 -57 62 31 3 -25 -59 68 76 -114 -12 98 -71 -11 170 -127 -136 232 67 -228 101
2682 101 145 -172 47 164 -185 -41 231 -59 -153 114 3 -69 107 -22 -119 101 62 -121 49 23 -68 120
2704 120 50 -188 43 138 -111 -17 109 -120 -14 170 -127 -138 172 37 -115 63 -18 -142 110 90 -165 13
2726 13 118 -60 -30 40 -75 39 139 -78 -75 55 -37 35 102 -93 -57 150 -43 -141 107 43 -84 118 48 -197
2750 -197 17 170 -60 -69 74 -12 -30 40 -28 -45 60 59 -14 -48 -77 39 79 -53 -37 66 -35 -60 68 -36 -83
2775 -83 147 67 -159 -45 67 -33 20 72 -73 -52 72 -7 -90 21 75 30 -13 -53 -43 22 55 60 -19 -76 33 68
2801 68 -75 -35 128 34 -48 66 -48 -131 120 142 -116 -37 106 -54 -65 69 -10 -32 100 34 -135 -37 61 10 24
2826 24 -16 -63 2 29 -62 -23 32 -6 33 3 -115 -43 125 29 -75 8 -2 -51 26 14 -59 21 99 -34 -79 -8 11 31
$$ packed form
2657a0Q2j46Q6P2j62K1J19l1k8k8l4J27Qj90J02J10j69O0J81k97rL68j65k95L29
2682A01M4l17K19J17l49J44K72k90r4K67j11p2J76j29r7K20l9j83J70k6r1J88
2704A20p0k38K31R5k49R4J26k29J06J84k97j1L10j35j52J78q1j24K52k0k55J78
2726A3J05j78L0P0j15J14J00k17LJ30r2P2O7j95L6K07j93r8K48o4j27K02p0k45
2750a97K14J53k30rJ43q6j8P0o8j7J05jp3l4k9J16M0j32J6J03j01k5J28j04m7
2775h3K30q0k26J14J12j00N3N2j45K1J24p9q3J11N4m5m3m0J0O5L3Np9n7J09L5
2801F8j43M0J63r4q2J14j14q3K51K2k58P9J43j60j1J34p9k2J32o6j69R8R8n1J4
2826B4m0m7O5K7r1L9N5l8L9l0j18P2J68r6j04Q3j0m9P7j2p3Q0P8j33m5P1J9K0
$$ plain form
2854 31 61 -28 -46 32 22 -33 -16 7 32 72 -44 -83 21 74 2 53 7 -89 34 89 -91 -16 160 11 -75 55 -41
2881 -41 -108 155 111 -159 -33 100 -81 -53 105 -54 -25 129 -49 -180 53 78 -32 51 -13 -119 23 56 -81
2904 -81 28 87 -46 11 41 -122 2 185 -16 -90 49 -31 -55 116 12 -101 96 76 -126 -34 51 -19 66 69 -117
2929 -117 -50 92 -34 -23 61 -38 1 88 -83 -91 112 35 -43 76 -42 -130 109 60 -166 44 132 -106 -32 83 -117
2954 -117 -35 202 -37 -174 66 29 -103 73 28 -114 47 74 -125 -60 86 -1 18 32 -81 -34 83 -8 -24 51
2978 51 -2 -4 59 -63 -71 117 45 -53 20 -22 -86 86 64 -101 16 103 -52 -54 39 -38 29 107 -60 -108 40 10 -33 54
3006 54 -27 -56 65 5 -134 13 58 -39 39 12 -145 -12 130 -53 -84 85 -27 -77 73 -39 -110 103 90 -117
3030 -117 -45 62 -52 -2 69 -55 -57 86 4 -78 10 39 13 30 -25 -60 23 40 1 27 -11 -16 64 -14 -95 44 89 -38
$$ packed form
2854C1L0q9j8P8j0n5J7K3K5M0j16l9J04N3p2N1m6r6J23N5j80P5J76j49q6J30r6
2881d1o7K63m4k70J26J33j81K8J58j59K9J54j78j31K33K5j10Q3o4j06J42L3j37
2904h1J09N9j33N7L0j63J24J83k01p4J39q0k4J71j04j13J97k0k02R2Q5p0Q5Lj86
2929a17O7J42j26J1Q4r9L9Q7j71qK03p7p8J19j18q8K39m9k26K10Q8k38P4J15k00
2954a17Q2K37k39j37K40l7j32J76m5j42J61K7j99O5J46q7J9J4j13M7J17r1j6P5
2978E1n3kO3j22qJ88p2r8P3m2o4J72k2j65J17Q7j55kR3p7O7P8j67m8J48l0m3Q7
3006E4q1k9J21o0j39J47M5r7P8k7j57J33J42j83l1J69j12n0J50j12p1K13j3k07
3030a17P2J07j14N0P1j24kJ43q2q2Q8K9k6J7n5l5Q3J7l9K6l8nQ0p8q1J39M5j27
$$ plain form
3058 -38 -2 17 -95 2 129 -47 -79 93 21 -73 38 -2 -60 85 54 -123 -44 54 -23 -3 31 -68 -13 79 -48 -76
3084 -76 52 6 -23 66 -51 -108 91 72 -89 11 36 -66 6 63 -95 -38 137 9 -101 23 12 -21 59 14 -71
3109 -71 35 63 -26 -9 -1 0 71 14 -83 -7 57 -22 19 24 -101 -2 108 -62 -89 83 43 -78 25 -1 -102 43 85
3136 85 -83 -48 63 -2 -24 1 -47 -7 74 6 -55 -5 -7 27 37 -68 -62 80 17 -72 20 9 -55 78 43 -139 -4 135
3164 135 -49 -67 58 -26 -47 98 -4 -108 37 97 -33 -41 11 5 24 27 -1 -9 8 22 30 -49 -69 81 92 -98 -32 81
3192 81 -48 -38 106 -47 -122 102 70 -166 -23 117 -34 -14 70 -81 -71 97 21 -90 8 47 -17 -8 -31 -36 42 31
3218 31 -17 -26 -43 -3 69 -12 -96 51 71 -71 2 53 -97 24 138 -79 -136 119 58 -106 49 61 -99 13 98
3243 98 -96 -79 117 42 -50 7 -20 -6 46 -7 -37 31 -13 -5 50 -89 -83 132 40 -164 21 77 -106 5 112 -122
$$ packed form
3058c8L6J9j12R7J27j76l2J72p2r4J11m0n8J45l1j77P9R8p7K0L4r9N5R2j27k8
3084g6J28m6k9Q9j17n7J99j9j61J00K5j02P2N7j58N7J75j28j10J24j1l3Q0m5q5
3109g1J06K8q9J7QJP1n7r7P6O4p9M1Nj25R9J10j70k7J72m0j21J03k6j01J45M2
3136H5j68L5J11o5k2K5m8M0Q1o8o1N0kL4J0j05OJ42o3q9R2j1o4J33l5j82J35J39
3164A35j84j8J25q4k1J45j02j04J45O0j30qN2oJ9Lk8qJ7J4Qp9k0J50J1j90O6J13
3192H1j29J0J44j53p5K24l2k36J43J40j51K0Q4j51J0J68p6j11R8L9o4Rk3nP8j1
3218C1m8rj7M0P2q1q4J47K0j42P3N1j50J21J14k17n7K55o1j64J55J2j60J12Q5
3243I8j94J7J96p5r2N7k7J4N2n3l0O8m4QN5j39OK15r2k04J85N6j83J11J07k34
$$ plain form
3269 -122 -70 168 -24 -151 63 43 -81 61 27 -121 33 106 -68 -20 55 -14 11 32 -84 -16 85 -2 -15 28
3293 28 -59 -2 104 -67 -91 135 32 -111 84 22 -139 102 153 -179 -69 176 -55 -103 139 -10 -122 97
3315 97 44 -157 0 99 -24 -9 -8 -61 27 40 -82 8 36 -57 21 57 -138 -50 158 -14 -118 68 16 -94 62
3340 62 36 -119 36 115 -77 -65 56 -11 2 64 -70 -43 78 6 -46 38 4 -20 57 -15 -88 46 51 -31 5 -12 -66
3367 -66 39 63 -79 -33 118 -26 -89 41 -19 -90 97 74 -142 -50 96 -11 -73 25 31 -39 2 27 -55 -50 60 60 -54
3394 -54 -85 37 61 -54 -40 51 -29 -40 83 3 -120 40 117 -57 -70 57 17 -35 59 10 -69 42 83 -53 -48 53
3420 53 21 -5 23 -14 -40 49 64 -43 -37 45 19 -31 -3 0 -24 15 53 -38 -82 37 64 -39 -60 16 7 -22 2 13 -65 7
3450 7 67 -17 -81 -2 47 -6 -43 -13 8 -4 -5 5 -19 -39 51 45 -72 -59 63 19 -59 13 14 -45 34 44 -60 -33 51 39 -15
$$ packed form
3269a22N2K38j92j27K14k0j24J42l4j48J54P3j74M8P5o9K5K1j16O8J01q7j3M3
3293B8q7N7J06j71k4K26j03j43J95o2j61K41N1l32J10K45k31m8K42j49j12K19
3315I7n3k01J57R9j23J5Jn3Q8J3j22R0K8r3P8L6j95Q8K08j72j04J86n2j10J56
3340F2k6j55J55P9j92J2J21o7J3O2j34K7J21p2n2Q4l4k4P7p2p3J34Nq2L6j7n4
3367f6J05K4j42M6J51j44o3J30o0p1J87k3k16R2J46j07o2R8Op0M1K5q2NJ10%j14
3394e4l1J22K4j15J4R1q0j1J23q0j23J60P7j74j3J27m0n2R4m9p9J11M1j36NJ01
3420E3l2k6K8l7k6Q9J5j07OQ2k6n0K8Lk4L9L8r1m4J19K7j03k1P6rk9K4J1p8P2
3450GO0q4o4P9M9n3l7L0K1j2jJ0k4k0R0oj17J3J22m4p8P2Jn9P9J0j04K7Q4j2n4
$$ plain form
3481 -15 -22 -5 13 45 -18 -14 25 4 4 9 -65 -25 83 5 -65 27 2 -31 46 -3 -109 40 78 -67 -29 48 -61 -7 102
3510 102 -83 -109 111 24 -112 32 40 -83 58 36 -109 -6 98 -28 -43 26 -61 21 81 -54 -52 105 -5 -60
3534 -60 60 -13 -72 115 63 -147 31 99 -57 -9 71 -48 -14 107 -46 -78 50 31 -17 18 -58 -55 82 -10 -73 48
3560 48 1 -73 68 17 -123 54 115 -84 -49 75 -62 -22 127 -54 -115 110 36 -117 24 38 -51 50 60 -116
3584 -116 -26 119 -10 -52 51 -17 -34 70 6 -78 42 68 -32 -23 -1 0 41 42 -39 -6 37 -22 5 21 -49 14 89 -45
3612 -45 -76 60 39 -32 28 6 -76 28 85 -58 -47 61 -6 -20 10 -44 -37 73 14 -70 -1 20 -18 21 -3 -74 18 70
3640 70 -53 -59 40 -10 -4 57 -47 -49 82 32 -74 20 17 -41 56 27 -102 17 100 -39 -57 57 -17 -22 71 -5 -87 56
3668 56 60 -56 -20 17 -13 6 47 -60 -22 28 15 -12 -24 -44 28 54 -54 -47 48 -11 -30 35 -57 -60 93 27 -103 10 43
$$ packed form
3481a5pJ7J8L2o3ML9k1%Np4M0J08p8p0R2k5l3P7m9j06J49L8j45L8P7j09N4J09
3510A02j85k6K20q7j36J44Qj23J41k2j45J03J04j26j5O9q7Q2O0j35KJ57j10n5
3534f0J20p3n9J87n2k10J78O8j56M8Q0j19L4J21j53l2J28j9m8L5p6LJ37r2o3J21
3560D8m7p4J41n1j40J77O1j99L5J24j37M0J49j81o1K25p4j53J41J4q9J01J0j76
3584a16R0J45j29m2J03o8j7J04o4q4J20K6j00RK2JM1Jq1L3M3n9K7J6p0O3P5j34
3612d5l1J36k1p1O0k2q2J04N7j43J1J08o7j4L0n4PJ10n9q4O9K1l8L9k4p1R2N2
3640G0j23oR9n0OO1j04kJ31n0j06R4ln8R7k9j29J19Q3j39j8J14p4nR3p6q2J43
3668E6Mj16L6L7l0J9M1j07L8N0j3k7j2k0P2K6j08PR5n9j9O5r2lJ53o6j30J13L3
$$ plain form
3697 43 -64 28 44 -95 -9 116 -62 -101 54 32 -46 47 -9 -71 54 75 -48 -39 35 6 8 12 -37 10 47 2 -8 -21
3725 -21 -26 49 51 -63 -46 54 17 -22 28 -18 -26 67 13 -73 -2 70 6 -10 5 -26 11 46 -18 -41 15 9 -14 -10 -38 -16 51 15
3757 15 -47 -18 5 7 9 -30 -30 11 40 -10 -46 2 20 33 11 -38 -15 35 31 -8 -20 12 25 20 -12 -12 -8 23 35 -14 -55 17 52 -2
3791 -2 -21 1 -5 12 30 -33 -30 50 35 -11 -27 -32 1 37 -5 -37 25 25 -9 11 -9 -36 28 51 -46 -70 28 17 -21 9 -9 -34 31
3824 31 22 -51 -25 28 32 3 -38 -33 34 29 -8 7 -1 -20 42 18 -81 -9 79 -3 -42 26 -2 -33 65 23 -95 14 80 -33 -50
3855 -50 45 -11 -6 61 -25 -94 17 58 -25 -27 16 -10 8 20 -42 -34 34 24 -30 -49 -9 24 28 -32 -21 22 -6 -12 24 -13 -38 70
3887 70 45 -101 -34 64 1 -17 53 -26 -50 74 21 -71 18 72 -17 -8 8 -35 19 63 -8 -32 10 -2 8 30 -42 -11 75 1
3917 1 -78 24 16 -37 61 21 -122 10 85 -73 -60 73 -20 -41 61 -53 -100 67 58 -83 -11 33 -59 3 46 -78 -23
$$ packed form
3697D3j07R2J6j39Q6J25j78l9J55k2p8R3n6o2J25K1j23RP4k9KMm9M7L7m5j0j3
3725b1nP5Kj14J7J00l7l9N0m6qR3n4q6P1P2o4j6J5l1L7L5o4k3N6ok3Mk8K2O7l6
3757A5o2K9K3KKl9%M1K9n0l6M8J8J3k2m9K3N0ml9j2L2J3nl2%ML1J2m9m1P2L5n4
3791bj9K2oJ7J8o3LQ0j5m6j6nL3L6m2l2O2%l4K0k0k7O4K3r7k4R8j1l8L0j8k5O5
3824C1rp3K6N3Mk9m1NO7nl7J5qj9O2k4r9P2Q8q2l9O8k8l1R8m2j18J09O6j13j7
3855e0R5n6NO7q6o9J11M1q3kM3k6J8J2o2QO8j0n4j9M0L3Mo0J1M3k8oL6l7k5J08
3887G0k5j46O7R8o3j8P0p9k4J24n3r2Q9N4q9RJ6m3N4M4p1k4M2j2J0K2p2L1Q6p4
3917Ap9J02qn3R8m0j43J32P5j58J3J33r3k1J02j14m7J67rj41P2M4r2O2M3j24N5
$$ plain form
3944 -23 91 -23 -49 17 -22 5 73 -33 -81 46 21 -52 27 -3 -51 71 39 -110 1 79 -39 10 50 -65 -10 106
3970 106 -30 -96 68 40 -58 15 5 -73 54 77 -61 -44 28 -14 -7 9 -38 -3 75 -28 -65 32 4 -17 56 -26 -97 25
3998 25 62 -56 -43 51 -8 -35 11 -47 -42 56 27 -31 -23 -12 15 42 -12 -36 41 26 -62 -17 12 -23 35 66 -51 -84 56 41
4028 41 -41 5 40 -19 -8 25 -44 -29 63 21 -45 -20 -13 -1 50 14 -56 9 45 -25 -44 10 -4 -9 30 -32 -79 10 42 0 -21
4059 -21 -13 -2 12 -14 -50 6 42 -14 15 2 -69 -2 78 -20 -65 42 34 -53 4 36 -30 17 59 -50 -64 35 41 9 0 -19 -11 25
4091 25 -18 -40 33 16 -18 36 -25 -87 46 91 -51 -38 63 -21 -55 38 -1 -50 65 54 -99 -51 37 -7 3 40 -36 -55
4119 -55 35 5 -72 -2 33 -16 -6 -18 -53 5 58 -13 -44 -11 -4 -11 12 -31 1 58 -18 -56 4 -16 -29 82 13 -104 25 95
4149 95 -73 -48 95 -15 -39 68 -24 -105 40 97 -57 -16 25 -37 -1 21 -34 0 29 -18 -17 -7 -71 13 93 -71 -74 76
$$ packed form
3944b3J14j14k6O6l9K7O8j06m8J27k5p3P9l0m8J22l2j49J11P8j18M9M0j15N5J16
3970A06j36o6J64k8r8P3j0p8J27K3j38J7P2m2PJ6m7L5P8j03l7R7k8k1P3q2p1J22
3998B5L7j18J3R4n9k7M6n8NR8k9n8QJ1K7K7n4k4P7j5q8M5K9l5N8L1j17l3J40j5
4028D1q2M6L5n9J1L3o9J5R2m2o6K5PJ2N1l6p0O5L6p0j9N4j4nL9o2m7Q9L2m2k1
4059b1QJ1J4k6l6N6L6n6K9j3p1O7Q0r8m5J07qq7N7L2o6M7M2j09j4R9Ol2rj9QL6
4091B5m3k2P3j7l4N4o1o2J33M5j42J3J01q4l4R3l9m9J15j1j53M8Q8m4J0L7p6j9
4119e5R0l0p7P0L5m9J0j2l5N8N3p1l1L3PpK3m3L2N7p6l8O0k0j3J11o9j17J29P0
4149I5j68K5J43j10k4J07r2q1J45N7j54M1M1o2L6K2n5L4K9m7JJ0o4Q4Q0j64lJ50
$$ plain form
4177 76 -24 -83 92 10 -102 93 78 -168 -24 132 -44 -33 101 -66 -106 111 15 -120 54 69 -86 -13 26
4200 26 -70 19 69 -39 -45 9 -12 34 38 -54 34 81 -48 -43 57 -41 -17 126 -38 -135 83 70 -119 23 99 -86 -26
4227 -26 95 -91 -87 107 36 -88 14 1 -50 41 20 -54 16 35 -39 -35 -7 -35 55 62 -85 -44 54 -45 -42 81 -34 -57
4255 -57 77 6 -121 15 90 -34 -9 38 -62 -47 77 3 -65 23 34 -28 -26 -4 -2 37 28 -19 -39 -26 23 48 -28 -44 58
4284 58 31 -76 -6 44 -38 3 88 -63 -110 66 50 -85 12 58 -63 -29 41 -58 -62 79 41 -87 -35 32 -16 -12 14 -19
4312 -19 -14 12 -1 -24 -36 9 56 -5 -69 -2 21 -16 8 33 -39 -30 65 -13 -81 20 81 -24 -21 9 -33 9 66 -3 -50 3 40
4343 40 -20 -42 1 24 18 10 -8 -40 -31 29 36 -43 -44 51 -6 -44 -5 11 -31 14 18 -72 -56 64 42 -61 -11 25 -13 -12 20 -21 -28
4376 -28 34 41 -50 -43 44 43 -24 -7 14 -20 -23 38 -20 -45 45 68 -50 -47 21 5 -12 33 8 -40 20 50 -3 -50 12 59 -5 -40
$$ packed form
4177G6j00n9J75q2j12J95j5k46J44J56j76J1J34j67m0K17r6j35J74J5j55P3L9
4200B6r6Q9N0j08oN4k1M6Mr2Q8M7j29NJ00r8K4J43j64r7K18j3j89J42P6j85O0
4227b6J21j86MJ94p1j24J02j3n1R1k1p4P0J9p4MK8k8R0Pj47M1R8r9LJ23j15k3
4255e7J34p1j27J36P5j24K5M7j00J5J24p4o8Q8J1o2KK2KL9rm7k0J3M9K5p6j6J02
4284E8k7j07P0N0q2M1Q5j51m7J76j6j35R7M6j21L4P0r9mJ41l8j28N2O7m8MK6l3
4312a9NK6j3k3j2M5M7o1o4O7K3l7K4K5p2RR5p8o8J01O1j05LL0m2M2N7o9m7N3L7
4343D0o0k2M3K3oqj8l2RO0Pp9jR5n7l8L9J6m2M5Mr0J6J20k2j03N0L6l8JL2m1p
4376b8O2Pr1PQ7jo7J7K1l4lO1n8k5R0K3j18LO8j6j7M5k5m8O0L0n3m7O2M7o4l5
$$ plain form
4408 -40 18 16 -18 25 22 -60 -29 75 -9 -101 24 59 -40 -12 24 -62 -40 78 8 -101 10 55 -36 -39 23 -22 -27 39 -1 -59
4438 -59 -33 57 31 -70 -17 44 -6 -30 25 -14 -34 60 52 -83 -44 80 5 -50 43 9 -69 26 40 -69 -26 74 23 -34
4466 -34 16 5 0 39 13 -30 -8 25 9 -21 -38 24 52 -15 -61 27 14 -19 25 26 -61 11 48 -40 -60 43 19 -34 13 -4 -61
4497 -61 9 52 -24 -27 17 22 6 -16 -7 17 21 13 -2 -20 -14 34 36 -41 -23 68 -2 -46 31 15 -51 65 53 -86 -20 94 2 -65
4529 -65 36 -1 -57 40 11 -66 -5 61 -16 -52 -20 4 0 11 -20 -28 -8 -4 8 -9 -64 0 50 -52 -63 23 24 -35 32 12 -68
4560 -68 17 76 -55 -63 48 3 -34 16 -7 -27 54 42 -54 -11 16 4 8 -5 -22 19 29 -24 -11 6 -12 26 45 -44 -38 66
4590 66 4 -46 35 7 -56 51 19 -115 -8 92 -47 -60 39 -22 -55 55 11 -73 14 60 -24 -43 10 9 30 -4 -34 -3
4618 -3 2 -13 25 -6 -55 19 59 -55 -58 53 11 -46 32 1 -81 21 67 -69 -28 72 -6 -49 8 -26 -14 47 16 -52 3
$$ packed form
4408d0N8kl4M3lq2L1J04q4r2J25L5r9K8L6q6K2J18p0j09J11M5r1lO2m5nO6m0n8
4438e9K6R0k6j01N3O1n0k4N5l9k0R4qj35L9J24p5n5R3l4p8R5J4j09M3J00n1n7
4466c4N0j1nL9k6m3K2L3j6l0j7O2K8o7m6Q8j3l3M4Jq7P2L7q8k0J03k4n3M7j7n7
4497f1P0M3p6lM4Nj6k2RK4Mqj5j8OM8Kp7J8R1p0m4P7j6o6J16j2j39O6J14r2o7
4529f5J01l7n6R7k9p7O1O6p7l6L2K4mJ1l1qK0MJ2j7n5O4N0j02j1Q6Jn9O7k0q0
4560f8Q5N9j31qJ11m5l7N0k3k0Q1j2r6M3K7j2Mj3j7M1J0n3J3J7j8L8J9q9OJ04
4590F6o2n0Q1k8o3J07l2j34J07J00j39j3R9o1l3J10m4q4Q7M6q4j9N3jK1l4l0L1
4618cNj5L8l1m9P4M0j14lJ11m2n7P8l1q2J02M6j36M1J00p8m3N7l4J2O1l1o8N5
$$ plain form
4647 3 23 -5 25 -14 -17 8 17 -42 -30 2 -8 30 6 -62 0 56 -21 -48 51 1 -41 39 -5 -98 19 83 -45 -44 46 -18 -31
4678 -31 56 -1 -66 32 60 -53 -35 30 24 -5 -1 -14 -26 3 14 9 -11 -3 32 12 -43 -8 38 14 -14 22 -26 -28 54 32 -51 -5
4710 -5 46 -12 -10 5 -40 0 62 -16 -65 17 22 -23 18 20 -35 8 28 -37 -65 36 14 -23 -1 -18 -20 31 22 -35 -23 20 -11 -7 -9 7
4744 7 18 40 4 -45 -16 25 26 -6 -5 -22 7 28 -1 -16 18 39 6 -18 -24 6 27 25 15 -10 -8 25 20 -14 -1 23 11 -20 -18 -6
4778 -6 -9 17 38 -26 -40 22 34 -35 -1 33 -19 8 16 -47 -35 61 22 -48 -11 7 -31 19 38 -30 -1 57 -25 -55 13 7 11 35 -3
4811 -3 -36 18 40 -24 -1 24 -7 18 6 -34 -11 45 3 -9 -13 -22 17 37 -22 -20 32 9 -18 20 -23 -15 67 18 -65 -12 37 -39 5
4844 5 41 -36 -20 66 -35 -70 29 31 -25 9 -1 -62 18 52 -34 -24 46 -19 -28 6 -21 -9 43 11 -53 -16 17 4 18 7 -22
4875 -22 31 31 -15 -15 5 11 28 17 -49 -22 51 10 -27 20 4 -24 34 10 -48 3 53 -8 -23 2 -16 14 31 -39 -24 17 -3 -24
$$ packed form
4647CK0k8L0l9lK5Rn9J2L2j0L8k4o8O2N6p7k7R9n0m2Q0m4r3J17O4j28JR0o4j3
4678c1Q7n7o5R8K8j13J8O5ok9Mj3j2K9J1nk0QL5k0n5L5M6k4k8L6m8kQ2k2q3M6
4710eN1n8KJ5m5M0O2p8m9Q2Nm5M1Kn5M3K0o5k8J01k2l7K2j7kN1rn7J2M3l1MkJ6
4744GJ1K2l6m9K9M1Jl2Jj7K9K1k9j5L4K1l3k4oL0K1kj0k5KL3nl4J3K4j2l1KJ2
4778flK6K1o4j4O2J2o9L4L4n2K7Qo3J2R6l9p0L7J8l8N0J9o8K9N8q2l0O8oMK4l8
4811cl3N4K2o4K3K5l1K5j2m0K3N6m2j2mrL9K0n9KN2k3k7L8m3QQ2m9q3N3M9p6M4
4844EL6p7J6Q6j01l5R9Kn6L4j0o1Q0L4q6J0P0o5rL4k7J2N2l2o4L7L3j3J4j1k9
4875b2N3%m6%K0OJ7j1o6K7P3m1l7M7j6k8N8k4n8N1N0o1j5K5j8L0J7p0J5M1k0k1
$$ plain form
4907 -24 5 -18 -28 36 8 -60 2 22 -18 4 8 -40 -10 48 -44 -44 28 36 -37 -2 -2 -50 16 43 -38 -35 38 11 -20 5 -4 -5 29 13
4941 13 -23 -22 16 30 11 -21 -6 23 -8 -5 22 10 14 28 -1 -58 -2 46 -7 -24 24 -10 -22 38 -4 -29 28 31 -13 -41 -8 -18
4973 -18 11 17 -27 -21 10 1 -7 -7 -7 -5 19 -18 -49 13 21 3 -4 -7 -15 2 13 -17 -21 22 27 -12 -23 4 4 24 33 -15 -32 32 33 -14 -5 23 0
5012 0 5 16 -34 -20 35 31 -36 -17 4 -15 -4 11 -18 -27 27 -5 -37 -21 7 25 -9 -20 -17 -9 0 -2 -10 -20 9 8 -11 -35 0 19 0
5047 0 3 -22 -30 1 23 -29 -7 17 4 -19 6 -36 -8 57 12 -26 -10 16 -20 31 38 -32 20 61 -41 -35 41 13 0 28 2 -50
5079 -50 26 48 -30 -28 31 -2 -5 18 -25 -23 29 18 -46 -43 3 2 -11 2 -7 -9 6 -7 -24 -29 14 27 -17 -42 -3 7 -18 7 -8 -29
5113 -29 11 46 -48 -38 42 27 -29 12 -3 -42 23 48 -35 -26 42 -3 -22 15 -13 -23 46 19 -52 -11 49 12 -9 11 -22 -9 20
5144 20 -6 -33 13 36 2 -13 -9 -22 9 15 -23 -25 3 -11 -4 -24 -17 14 17 -20 -13 -3 -6 5 34 -21 -29 34 13 -26 -1 8 -8 20 22 -27
$$ packed form
4907b4K9k3j0O4k8o8O2K0m0K2Mm8L0N8r2%P2Qp3L5%m8O6K7q1LP3k7l1K5rjL4j6
4941A3l6JL8J4j9l2J5K9l1LK7j2MJ4k9n7N6M8n3j7M8l4j2O0m2k5N7Lm4k8L3j0
4973a8K9Om4OL1rq%%KK4l7l1O2Qj8plqJ7J1l0mM3Nl9j1K7%K0Rm8j7O4Jm7RK8k3
5012@NJ1n0J4N5mo7J9K1j9J1J5k9rN4l2l2J6K8J8l4j1LQRkqj0K9jj9k4L5J9j9
5047@Lk5qL1K2n2K2K4j3k3K5m2K8O5m5l8J6K6l6N1Pp0N2M1j02OP6k8j3K8k6n2
5079e0P6K2p8KN9l3lK3m3KN2j1o4LM6jj3J3rkJ5j3j7nM3J3m4k5L9J0k5K5j5k1
5113b9M0L5r4J0Q0j5n6M1j5l9O5K5q3RO8m5j9L7k8j0O9k7p1M1O0l7k1K0l3J3K9
5144B0k6k7M6K3l4j5Mj3L1Ol8kK8j4Pk0PL1Ll7PJ0lJ1K9n5qO3k1l9K5Rj6K8Km9
$$ plain form
5180 -27 -16 38 17 -20 1 -10 -4 24 3 -37 24 31 -22 6 -3 -14 27 27 -27 -14 33 2 -5 9 -20 2 33 15 -40 15 23 -12 15
5213 15 -6 -30 13 42 -36 -25 32 -3 -34 8 -25 -28 34 16 -49 -10 12 -6 -2 2 -18 14 22 -22 -19 1 3 30 29 -28 -8 38 2 -25
5247 -25 10 5 -2 15 7 -44 16 26 -10 -27 8 -15 6 18 -19 -20 32 34 -19 -17 -9 -13 9 10 -50 -6 24 -3 -24 -1 -18 12 27 -17 -37
5282 -37 6 5 -6 -3 -14 -20 14 10 -31 -25 26 9 -17 -3 -16 -6 17 18 -28 -4 22 5 -14 -12 -9 12 15 -10 -1 7 10 26 6 -36 -14 42
5318 42 13 -32 13 6 -15 17 0 -50 12 47 -23 -44 17 -1 -8 18 -10 -53 27 24 -33 -15 18 7 2 9 -32 -27 32 4 -14 -1 -7 2
5352 2 7 -24 -12 16 9 0 1 -11 -12 35 4 -50 8 32 -7 8 5 -31 1 41 -17 -26 1 7 -4 10 -8 -6 25 16 -23 -9 13 -7 7 0
5388 0 -24 -9 25 4 -16 -15 6 -1 -13 -13 -25 -3 3 -23 -30 -11 6 -7 -6 -2 -17 8 23 -23 -18 -10 16 0 -3 -10 -9 4 -3 -10 -27 8 26 -4
5426 -4 -5 -6 -3 -4 8 -4 -16 17 24 -1 -26 -4 29 0 -10 -6 -4 1 15 -2 -44 0 33 -13 -21 0 -9 -8 19 -18 -39 7 20 -22 -30 -14 -3
$$ packed form
5180b7J1N4k1l7K1j1OK8k1m0O1Pn3K8rj1M1%n4J3M7l1pJ4k9K2L1j8n5N5Ql5K7
5213A5k1k4M3K9p8J1N7l5l1M2l3lO2j8o5L9K2j8MMk0L2Qm4LK0KK7jn7K0M6l6k7
5247b5L5npJ7qn1O0J0l6j7L5k3K1J2l7jN2Kn3KQmK2Jo0M4L0k7k1K3j7L0J5m4k0
5282c7M3jj1Lj1oL4mm1ON1j7k6J4j3J0K3Jm6K4K6j7j9KLK1Lk5RQLJ6k0m2K2N6
5318D2k9m5M5pk1L2j7n0O2L5p0k1O1j8pK6k8m3Q0ln7J8L3j1nPm1NN9k8j8J3oR
5352BNl1J2K8prJj2jM7l1n4N8K4l9J5ll6L2M0n8rK7Oj1J4j8KL1rl9J4K2k0J4p
5388@k4J5L4k1k0JK1pj2%j2K2Ok6pJ9J7j3JMj5K5J5m6NQK6j6lpJJ3ppj7L5J8l0
5426djjLjJ2j2j2L3Pk5k5K2L3k9j0MKNJ4j7m2M4L3m6qK1rJK7l7k1M6J3m2qJ6J1
$$ plain form
5463 -3 -5 25 -24 -40 17 17 -26 -7 13 -6 0 3 -17 -6 28 13 -7 1 0 11 2 -10 -17 9 17 -8 6 -3 -7 30 2 -35 -3 25 16 3 0
5500 0 -22 12 31 11 -25 18 5 -2 7 -8 -13 27 18 -25 -18 10 -9 14 -4 -35 -11 21 -2 -38 3 0 -21 1 -4 -20 -2 8 -18 -19 16
5535 16 2 -2 1 -22 -17 40 20 -23 23 18 1 15 10 -24 -17 36 -9 -11 15 9 22 22 1 -2 18 7 -15 -4 -2 5 24 10 -27 5 32 -4
5571 -4 -8 9 -20 5 36 -16 -24 25 6 -11 -3 0 -18 24 18 -29 -12 23 2 -9 -2 -8 2 11 -8 -29 0 18 5 0 -4 -27 21 12 -33 -8
5607 -8 6 -3 15 -2 -17 9 30 -2 -26 6 -5 -6 15 3 -10 10 20 -16 -11 6 13 4 11 -4 -4 17 14 -13 -14 -8 -3 12 -24 -15 -4 8 4
5644 4 -3 -25 -24 1 -3 -23 -21 7 1 -12 -2 -15 -11 10 -1 -33 -18 22 9 -22 -12 2 -5 -2 -2 -14 -8 20 -6 -13 -2 -1 22 17 -5 -5 7 22
5682 22 14 -16 -13 3 13 1 -4 -6 7 3 -6 -6 -10 9 17 -3 -15 0 14 -5 -12 -22 -5 13 13 -17 -13 8 10 -5 -1 -21 -3 14 -1 -21 -10
5719 -10 8 10 -14 -28 -11 -2 5 -3 -6 -2 5 7 2 -13 -5 18 2 -4 -5 7 20 11 7 -14 2 33 8 -6 -3 14 11 -5 -5 -27 3 28 -4 -24 1
$$ packed form
5463ckL0m9j6N7%m3J9K0j9OLk0J1L4j5k0QjJ1rj2pK6Qk5J4rmL7k8l7L2K8rj3l
5500@k2L4J9k0l6M3j3pRj5nM0rm3PK8j9K3j8l1K4L2k3l6M1lk1K2nj6J8J0k6jL5
5535A6j4mLk3NN7k0m3M6nj7J4nl4PN3m5kK6oJ3%k1lK0j1k2J1KPJ9j4l7L2K7l6
5571dmJ7k9K5L1n2qM9j9j7QLj8M2om7J7L5k1j1PoJ0Rj9k1K9J8j3nmk3M8rm5K5
5607hJ4rJ8j7j5K6K1l2k4L2j1jK1j2j3K0J0l6NJ7PrPj5%K1lk7jONJ5l6RJ1J2m
5644Dpk2JK5mk0KK8oj3J0j3MK1j1l2J5M0j3l1J0J4pL%j2OK8k6pJ1JK3nk2%J2J5
5682B2ql0LJ6J0j2nkJ3mr%mJ9Qk0j2J5J4j9pj0J7J8%l0MK1Kj5Mk0J8J7j5k0J1
5719a0J8Kk4j4J7RPqlMPKnj5QK3j6ojJ2J3rmk1J6L1k5j4LJ7lj6%k2L0K5l2k0K5
$$ plain form
5758 1 7 11 -8 -5 -22 7 15 -18 -24 2 16 4 -3 -16 -8 9 11 -8 -19 3 4 -1 -13 -18 12 23 -5 -6 -4 -11 20 11 -26 -16 26 16 -2 4 6
5797 6 11 34 7 -27 12 36 -6 -12 3 0 12 16 -18 -13 12 5 -8 4 -5 -18 30 12 -29 -3 17 -6 -6 -9 -24 6 24 -25 -30 1 16 -10
5833 -10 1 -11 -19 12 4 -25 -17 8 10 17 1 -28 3 28 -3 -5 1 -7 0 12 -19 -12 29 6 -11 -7 1 -4 20 3 -27 4 33 -12 -4 5 -6 4
5871 4 34 -1 -17 15 13 -10 -3 7 -1 1 15 -23 -32 13 4 -10 -19 -9 7 10 -22 -23 -15 12 -3 -1 -11 -7 23 10 -29 -8 6 -8 4 3 -26
5908 -26 -8 31 -1 -19 24 20 -7 10 2 -26 18 22 -18 -12 16 8 4 19 -8 -4 21 18 -16 -7 14 2 15 -3 -17 7 14 -23 -14 1 -14 14
5944 14 4 -21 -20 20 5 -17 -9 1 0 25 5 -20 1 23 -4 -18 -2 -15 6 30 -18 -9 19 7 -6 3 -13 -6 29 12 -19 -1 28
5977 28 8 -3 3 -31 -10 20 -2 -27 19 16 8 10 -19 -5 17 27 -7 -8 2 13 0 -4 -3 5 1 -5 -17 -11 -15 16 2 -23 -26 9 0 -36 -1
6014 -1 -1 -13 8 8 -44 2 23 14 -23 2 -15 -20 7 1 -27 -11 23 -3 -21 -11 -1 -9 15 -1 -16 -3 35 -1 -12 3 14 10 -6 -14 -8
$$ packed form
5758AOMj9Lj7K9Ql3oK6J4j2pj3QJ7Kj9j1K2Jnj2nL0J1k8jKpL1rl7J0M2j0j8OK
5797FNK3k7l4L9K4m2oJ5lJ2Ml4NK5pj3J2rj3M8j8m1K6K0k3%lj5L0J8m9nL1J5k6
5833a0J1j2qL1qk9QK5KPj6k9L1K5l1kOqPJ2l1PM1k3j7MQnK4j7l0L1K9m5QRj1J0
5871DL0l5j6L2kk3PJ0qKJ4l8rM5rj4rJ0J6Ll2jQK7j5Kj0ML0j3l9K1J4j4J2jk9
5908b6J8L9l2j8M3mk7J7qk8M4Mm0OK8qmJ5k7MK5ll4RK1j2J3j8j4K4Pl7RJ5j5K8
5944A4j0k5JM0j5k2QJ0jK5k0k5K1K2k7j4J6j3K1K4m8RK8j2j3Rj6PL5j7l1J8K9
5977B8k0j1Ol4K1L0k2k5M6lqKk9J4K2J0l4jJ0J1j3mJQmoj2OmL1j4k5lL5rl6L5
6014a%j2K1%n2M6K1rl7K5j7nK7ok8J6L4k6j8J0J0qK4j6j5J3L8l6j1J5J1mj6qO
$$ plain form
6049 -8 2 9 11 -11 -28 11 26 -7 0 22 2 -20 16 -7 -16 20 19 -36 -23 14 9 -11 18 -5 -6 27 7 -31 -10 21 -3 7 -5 -14 4
6084 4 16 -4 -13 1 4 8 6 -10 -1 14 16 -11 -4 7 23 10 7 -17 9 8 1 8 -4 0 14 11 -8 -8 13 15 2 -1 -5 7 15 -9 -25 11 30 1
6124 1 -3 1 -14 11 17 -19 -13 12 10 -24 -1 -1 -6 28 18 -32 -25 14 12 -1 8 11 -16 9 6 -13 -3 28 4 -11 -8 -1 5 16 5 -8 -6 11 7
6163 7 -5 -21 16 27 3 -7 -4 14 10 14 -1 -14 23 17 -17 0 24 -3 0 11 -23 -18 29 32 -17 -1 3 -12 -5 -3 -25 -4 14 4 -29 -12
6199 -12 7 14 15 -14 -24 10 -5 -10 -11 1 -8 13 13 -22 -11 3 11 -5 -10 -1 11 7 4 -9 10 24 -2 3 -7 -7 26 21 -4 4 2 6 -2 2 -4 13
6239 13 26 -7 -28 3 11 10 -3 -4 -8 10 18 -9 -8 10 0 2 -14 -20 -4 5 10 -8 -25 7 2 -4 -17 -3 7 3 -1 -14 -10 26 6 2 -13 -2
6277 -2 -4 13 -3 4 9 13 27 -8 -15 1 29 7 -12 6 -6 5 11 11 -20 6 24 2 -23 -1 2 12 11 3 -2 7 12 -8 1 7 6 2 -1 -25 -3 -8
6317 -8 11 -16 -11 0 -3 -2 -15 -9 0 23 -9 -6 -24 -1 19 13 -11 -14 10 -9 19 21 -16 23 24 -6 -22 11 15 -18 7 6 -16 20 18 -10 -11 15
$$ packed form
6049hJ0PKk2j7L9J5l3PK2k0k2L6k3rL6jn5J3L7nk0K9k3jL3k0l8K1L1k4J0j2rJ8
6084DJ2k0rJ4LMkj6RJ5Kk7PJ1J6j3lk4K6jpPj2MJ4lj9%K1Kj3lmJ2Qk4j6L6J9k9
6124AmMj5K5Ol6OK5kl4K3%nL4j0n0PL9kj3RLk7K5lj9J0L1k4j5LPOJ1j1j3KJ7m
6163Gj2j6L7J1k4j0LJ8mMj5j3L7ol4J7K4k7LJ1l4NM7Lm9J6Mj5PKk2K1J8j0l3J7
6199a2J9PJk9j0L4j5njJ2rK1%l5J1J4Qj6nRJ2mlj3J9J4k6Nj0%L3nk5QkMqMoJ7
6239A3J3l3k1L1Qjj3jmJ8Qk7JJ8j0Kj6oJ6RNj8j7L2noj3J4J0mmj3ML6k0mj5J1
6277bkJ7j6PNMJ4l5pJ6K8k2j9J8j2J1O%l1K6J8k2k5K2LJ0jqnRNk0ROjmlk4K2n
6317hJ9k7NJ1lJj3ORK3l2Lj8K3K0ok4lK4j9K8Kl7L9Jl0j6L3Ml3K5jk2L6kk8jK6
$$ plain form
6355 15 21 0 0 8 -1 33 14 -17 -18 33 1 -5 17 4 5 4 6 -31 -15 14 22 -24 -4 3 -14 7 8 -16 -25 15 13 -19 -17 18 -1 -12 6 -16
6393 -16 -21 12 24 -20 -4 14 14 -19 0 6 10 7 23 1 -8 24 25 -17 -4 23 0 2 17 -6 -19 29 7 -18 -10 11 2 5 13 -16 -17 16 19
6430 19 -18 -9 17 -3 -4 -11 -13 -15 14 -17 -14 -9 8 11 -20 -14 -1 11 -5 -13 -21 -21 11 7 -18 -22 24 17 -5 0 1 -5 21 13 -21 3 23 1 8 9 -3
6471 -3 -2 40 -3 -11 20 28 -3 -4 -9 -14 16 17 -8 -3 14 2 -5 -8 -16 -6 16 -2 -10 -16 -2 17 1 -14 -20 13 7 -23 -6 -5 -11 15 3 -32 1
6510 1 30 -3 -20 9 -17 2 26 -10 -20 15 20 -12 -9 -1 0 -2 19 -13 -16 13 14 7 -4 -1 4 16 6 -5 -1 12 21 2 -12 -3 11 14 -15 -14
6548 -14 -7 9 6 -9 -15 0 13 4 -26 2 3 -2 2 -8 -43 1 10 -26 -26 -8 6 7 -11 -19 -3 17 10 7 -5 -11 2 0 1 -20 4 8 -1 -13 -4 -1
6588 -1 15 20 -11 -12 4 17 8 -8 1 10 26 -1 -8 6 8 21 6 -2 -11 8 12 -14 -10 7 5 4 -3 -17 -9 11 3 -13 -11 0 -3 0 -20 -7 3 7 -10
6629 -10 -15 4 -2 7 -4 3 -6 8 12 -11 -9 -18 13 10 -14 -12 6 -4 -9 10 -12 -6 22 9 -19 6 2 0 15 5 -8 0 22 2 -13 4 -2 4 9
$$ packed form
6355A5Ok1%QrL4j9l1jN1l2oK2j3JjKl7J6K9Qm6K0Pj7K1Jk4rM0kl2KL5j9j1J8k2
6393a6nL3J2m4J6J8%l3J9OMlJ6k2rL2Jm2J3K7k3KJ5k3j3M8k2k5QK1rLQk9jL3L
6430A9l7RK6k0jpkkK9l1LNJ7Ll1OJ3J2j6qq%L2mk5mM6pk2NJoK6ql4K4K0k2PJj2
6471cJM2m3qL1Ql1jnnL0Jk5NJ7j2plqJ0K2j8qoJ4J9j6j5oL3ol0J7JoK6j2l5L3
6510AK9l3j7K9k6J9K4l6j0L5Nl2LQJkK1l2lK9Jpj1LNJ2j0j1MJ3Rj9j4RJ4Lk9J
6548a4PJ6lj5oJ5J3rl0K8JnMj0l5M4Rl6%J8J4Jj8qJ6K0plj2oJ3kJk1K4Mrj2RL
6588aJ6Nl1jJ6J3rj6RRJ6k7pJ4KJ3j5qrJ9Mk6MJ7kjpj4QK0qj6KJ1lLk0J3J0Mj7
6629a0nJ9oRj1PrJ4Mk3KrL1lk4KJ8j0nJ9k2OK8j3k8K5mkJ5j0j3QK2k0j5J7oON
$$ plain form
6668 9 -8 -4 18 10 -11 1 11 6 9 -17 -17 -14 6 -2 -7 -15 -9 10 6 -25 -4 -8 -16 -1 -18 -28 1 5 -12 -12 20 7 -9 10 -6 -1 21 31 -11
6707 -11 -6 10 -6 4 5 7 -2 10 9 -15 -3 12 7 3 -4 -17 10 7 0 9 -11 10 18 7 -16 20 6 -8 10 4 -23 19 21 -17 -22 12 3 -17
6745 -17 -2 -1 -21 13 10 -23 -21 17 6 -13 5 -2 -8 4 4 -23 -8 20 7 -1 -18 -5 20 0 -4 8 -7 7 18 3 -2 24 29 0 5 24
6781 24 -10 8 24 -5 -14 21 24 -11 3 15 -10 4 21 -17 -19 28 4 -21 8 -3 -10 12 -15 -10 14 30 -2 -19 -7 -15 -2 8 -16
6814 -16 -11 14 3 -4 -2 -7 -6 9 -7 -17 6 -3 1 22 -1 -18 10 21 -5 -5 17 5 7 16 -12 -4 42 -1 -16 10 15 -14 10 15 -14 10 31
6851 31 -1 -23 -3 12 3 10 1 -11 11 14 11 -18 8 23 -2 -13 -15 2 -1 3 -12 -15 -16 13 8 -15 4 13 -7 -14 5 -16 -9 27 15 -33 5
6888 5 10 -6 -7 15 -11 -4 30 -8 -19 -2 20 4 0 12 -2 -1 17 14 -6 16 29 0 -28 0 13 3 14 2 -13 -6 13 6 -15 -8 8
6923 8 -5 -4 -7 -6 1 2 -8 -14 -21 8 -12 -16 -1 5 -11 -1 -6 -17 -2 15 -4 -16 -2 -5 -5 9 -2 -18 5 15 2 -16 12 17 9 -8 -13 0
$$ packed form
6668Ij7MK2qk1J2J0nLk6%LK0qnqOJ9ml1K1mqJ5j7j0K9Mj7%L2j3j6J9j6NK2J0m2
6707a1NJ6j6J0JKrJ2jk4J2J5nmpj3K7lpRk0K1Qj1k3L6j4j4J8ok7M2Kl8nL4rk0
6745a7J5Jk0L4ll3KL8j1j9J8poJ2%k7J5K8j3qj7J3K5k0mJ2j5J4J1j5nK6Nk9NJ9
6781B4l4J8J6k9rL5Ll5J4J2k5J4J7l8kM7k4k5K9j1pK2k7NK4J6l2j7J2qJ3J0k4
6814a6NK5j1pKnJJ5j6j0K3rMK1k3j7K8J1k6%K2j2KRk8QM6m3j5K6Nk9K4Nk9K4K1
6851C1l2k2K0J5rPrj2K2Llk9K6J5k5j1kJ7lMj5ljK9nk3J9Rk0pJ9k1PL6j2m8L8
6888ENj6jK2k6PL4l8j1J7K2j6mJ2j4JJ8lk0K2J3k9k8K8J3j0J1j2j5PJ9pk1PJ6
6923Hj3JlJPJj0opK9k0mJ5Oj6J0nj1J5J7j9j2J4l%J4j1j6K3J0j3j8K8Nqj7nJ3
$$ plain form
6961 0 13 17 0 -2 0 11 4 1 -17 10 22 12 -20 -10 -5 12 21 -16 2 4 15 -3 -11 -11 -3 3 -2 -13 -24 -10 -5 5 -16 0 -9 -5 -21 0 -6
7000 -6 9 5 -9 -13 -11 7 4 -17 -13 -2 -7 -6 1 -7 9 28 0 -5 2 14 -3 10 14 -12 -4 16 -2 -19 14 18 -12 -7 -1 -8 6 22 0 -10 0
7039 0 1 1 -15 8 -1 8 -7 -23 -14 -5 14 -8 -18 -20 -2 -16 -9 -1 2 -10 2 -7 -23 -9 15 10 -28 -9 -13 -6 9 10 -25 16 10 -2 -8 8 8 14
7079 14 16 -2 10 6 25 4 -1 5 11 5 -2 -17 -1 26 12 7 0 -5 -5 14 -7 -13 13 3 -7 -11 -13 -4 12 17 -4 -13 5 3 0 -8 -8 10 9 -14 -10 1
7121 1 -2 -6 8 -23 -23 28 12 -21 -10 12 -9 -14 20 -13 -11 22 20 -18 4 11 9 27 17 -8 -7 13 -4 -20 1 27 23 -14 -16 0 5 -4 13
7158 13 14 -18 4 19 -17 -19 28 5 -14 4 6 -26 5 27 -10 -21 17 2 -25 3 17 -12 12 5 -15 -15 12 9 -17 -15 -3 -4 -20 -1
7192 -1 -2 -11 4 19 -16 -20 5 23 -4 -12 22 -10 -6 15 2 -14 14 27 1 -21 15 8 13 19 -24 -10 -5 8 -10 -10 4 2 -3 0 -28 -11 16
7229 16 -2 -13 -16 -10 -2 11 -15 -3 5 -2 -8 -9 -13 -7 8 3 -15 -3 4 -5 -3 -24 -14 13 4 -1 -7 -6 8 15 0 -18 -4 22 -2 -13 4 -4 7 7
$$ packed form
6961@J3Mj7kKJ1plj8K7J2j0l2J0NJ7Rl7J8KJ1j8q%QOnj1j1J4NJ0k1J6rMj6K1o
7000fJ5mj4mKJ8lk1MJ1nJPqJ6J9k8nPJ2j7J3Mk6QK0j8j7L3Ml0NOpJ4J6k2j0J0
7039@J%j6K3rRj5j6RRJ9k2j0kJ8j4PQLj2J2rj6J4K4nl8J9mPJ5Jl5M1oj2oJ6%O
7079A4Kj8J2mJ9k1nOOopj5J6K7j4npn%J9k1oK6j0j0mkRJ6Nk1rJ8klq%J8jk3MJ1
7121AlmJ4l1%N1j6l3J1K2k1nL4l3KL3kl8K2PkJ8j0k5JK0j7j6K1K6ml7kJ6NrJ7
7158A3Jl2K2J5l6kM7k3j9J8Kl2L1K2l7j1L8j5k7K8J4k9K4pk0%K7lk6KJ2jj6J9
7192ajrJ5J5l5mK5J8k7qL4l2MK1j3j6K8J3k6k2L6pNOm3J4NJ3j8%J4knLk8J7K7
7229A6j8j1lOQJ3k6J2QpojmOJ5nj8J2PrKk1J0K7rnoJJ4Pj5j8J4K6k4j1J7qJ1%
$$ plain form
7269 7 -4 -17 9 27 -8 -17 10 3 -3 12 -5 -5 7 17 -3 -14 8 8 -2 -8 5 -6 -26 -2 10 -14 -4 26 -5 -26 -10 -6 -11 -1 5
7304 5 -20 -1 17 -1 -34 12 -1 -8 -2 -12 -3 8 15 -1 -32 -14 7 11 -14 3 6 5 4 3 -13 -4 31 16 -21 -3 9 5 -19 11 2 -10 13
7341 13 7 -19 -9 15 19 -2 -13 2 -3 -1 -9 -19 -16 3 2 -2 -18 -20 -1 -2 -5 -9 -11 5 10 -2 -21 5 10 -2 -8 -6 3 3 10 -6 -9 8 12 -7 -6 10
7383 10 8 20 0 -6 10 13 -2 10 -3 -5 22 23 -13 3 22 3 -9 17 -3 -19 27 6 -25 -4 6 1 -1 12 3 -8 1 -13 -24 0 3
7418 3 9 3 -21 -6 10 -9 -10 -4 -8 -5 18 -14 -26 -5 18 -23 -14 5 -16 -11 14 -22 -10 15 10 -23 -3 1 2 12 13 -7 -6 23 2 15 -2
7455 -2 5 12 7 -4 -12 9 8 4 5 -20 -5 25 6 -9 1 1 3 -3 6 -12 -7 11 -5 -27 5 -5 0 -8 -6 -12 0 -10 -17 -1 -16 -6 6 -15 -16 26
7495 26 18 -1 -11 2 -9 0 24 -2 -8 15 12 -11 4 2 20 1 4 1 -4 18 25 -1 -12 -5 8 4 2 -4 -3 -13 -5 -2 -18 -6 16 -4 -29 -3
7533 -3 -6 -9 -6 -1 -30 0 21 -12 -19 11 9 -13 1 -7 -22 3 7 0 -16 -12 12 -12 -20 -1 -2 -5 11 -4 -26 -11 21 -7 -17 -7 7 0 -10 -10
$$ packed form
7269Gj1j3K6J8l5rK7poJ5j7%J2J0k0j1K2%j0oJ3j1k0K4J2k4J0L0l1k1J6MnJ0O
7304Ek5J9J8j8l3M6j3pOj0RJ1Pj6l1J8K1Mk5J7Ljjjj6RL5j5l7J8J2mk4L0rj2K3
7341A3ok6J0K4Mk1j1J5nKqj0LJ9jmj6kJ9jlmkJ6Nj2j9K6Nj2oKR%Pj6lJ7Mj9JJ6
7383A0kJ2k0oJ6Lj5J2j3kK7Jl6J6J9j9j2K6k0j6M6k1l1K1J0nkJ3rj1Rj4j1K4L
7418COok4J5J6j9jOmLK3l2j2K1K3m1RJ9k1NK5l6J2K5nl3K0MJJ0Jk0JK9k1J3j7
7455bPPnj1qK1jmJk5J5L0j9j5J0%KoRj8NJ8j6k2L2j0NqKoJ2j0pJ6j5J0J2k1jM2
7495B6qj9j0J3j1RK4k6oK3lk3J5kJ8j9LlnK2Pk6j1PJ3mkoJj0QLj6J2K2k0k5K6
7533cllLNk9L0K1l3pL0kk2J4qj5K5Mpj6MK4k4qJ9jlJ6j5k2J5L2k8j0J0J4pj0%
$$ plain form
7571 -10 -5 10 17 12 -12 -7 12 29 -2 -11 8 5 7 3 -9 1 7 16 -8 -14 -2 13 -5 0 -14 -9 3 10 -8 -20 -10 11 -3 -11 -11 16 -14 0
7609 0 -4 -17 -17 2 -6 -20 -13 8 -3 -8 -11 -11 0 -6 -9 -17 -11 3 -2 -18 10 16 -8 4 19 -11 -5 30 15 -17 2 32 4 2 3 6 -10 7 -5
7648 -5 -21 -1 5 7 -8 -20 -2 8 -12 -7 -14 -17 -7 11 -17 -26 -14 4 -22 -2 6 1 -9 15 -19 -14 24 9 -18 -8 -9 -3 8 10 -11 9 0
7685 0 9 1 -3 2 9 5 5 0 5 13 5 16 -17 0 10 2 -8 2 17 -17 6 4 -16 1 31 -19 -15 10 0 5 3 2 -4 7 -3 -25 -9 -7 -11 10 -14
7726 -14 -25 7 1 -12 -16 8 -12 -6 5 -16 -15 17 1 -14 6 -3 -20 14 6 -16 -7 29 1 -1 -11 -2 -2 8 -15 -18 7 5 -1 0 -4 -8 15 13 -20
7765 -20 7 13 -4 -1 0 -28 2 30 -2 -20 17 11 -8 1 8 -18 3 21 -23 -16 14 0 -16 0 -24 -19 -4 -4 -26 -16 2 8 6 -10 -22 2
7801 2 21 -16 11 7 -12 22 19 -35 5 31 -3 -7 16 -15 -2 24 8 -19 15 24 -14 -8 3 -17 9 6 -30 -19 15 0 -20 18 -16 -12
7835 -12 12 -1 -29 3 9 -14 0 3 -34 14 16 -20 -13 -2 -8 -25 11 -31 -11 23 3 -45 -7 1 -21 0 5 -35 9 -5 -34 -10 8 -21
$$ packed form
7571a0NJ5Pnk4NJ9J7l1rJ9lKmj2J0ORk4oJ2J5j8Nj4NJ2Pj8j2J0K1j4q%K7l0J4
7609@mj3%J9qj4PK1j1nl%J1olqOJ4nj6K8Ok4J2J5l0OL5j5l2J9L0k8kJLj6J7j2
7648ej6K0OKj5j2J8J0k0NplJ0J8k8rJ2J8k6K0Qnj0K4l4NL8j5k7J0jOJ1Kk1K0r
7685@RqmNPm%nNQqJ1l3J7J0qj0J0J5l4K3kk0J7L0n0MK5j0NkjoJ1j0k2J6KmK1k4
7726a4j1L2oj3mK4k0OJ1k1JL2j6j5K0rj7L4qk2RL6k8kj0R%J0k3lK5koJmmK3kl3
7765b0K7Oj7LJk8L0K8l2j8L7oj9RPk6K1J8m4PL0j4j6J6k4NJ5%k2J0J8Okj6j2K4
7801BJ9l7K7mj9L4ln4M0K6l4mK3l1J3K6j6k7L4Rl8OJ1k0K6ll6J1L4j5k0L8l4M
7835a2K4j3k8L2Ok3J4Ll7M8Kl6PJ1oj7L6m2K0L4k0m8L8Qk2K1Nm0M4j4k9K4J8k9
$$ plain form
7869 -21 0 24 -16 -9 20 -11 -23 15 1 -8 19 6 -28 10 27 -14 8 24 -15 9 21 -16 -11 13 -6 -14 4 -12 -13 10 -14 -29 -8
7902 -8 11 -12 -16 -11 -25 14 13 -22 -20 9 -14 -19 3 -25 -19 12 -6 -20 -3 0 -20 5 -3 -32 -2 16 -13 -13 -2 0 -6 17 -11 -5 15 10 -9
7939 -9 -4 12 -1 9 -14 -8 -1 25 3 -4 0 0 17 15 -1 -18 18 -1 -6 -2 -8 -14 2 7 -29 -13 4 -11 -3 3 -11 -6 7 0 -22 0 3 3 4 -3 -13
7980 -13 5 -1 -6 3 10 7 3 -12 -14 -5 13 2 -3 -7 7 -1 14 -8 -7 17 14 -8 4 1 11 8 4 0 11 11 10 -5 2 8 12 6 -8 0 8 -16 -1 -5 -15
8023 -15 -8 3 -3 -10 -9 -5 0 8 -18 -14 13 0 -7 -24 -9 -10 -9 -3 -8 -13 10 -10 -3 3 -2 10 9 -9 -4 10 -12 -13 9 -7 -12 11 9 -17 2 18 -11
8064 -11 0 3 1 8 4 5 -11 3 0 11 0 1 -11 0 -4 -2 -11 6 -8 4 -4 -13 -3 -1 -21 1 -5 -10 9 -1 -32 -29 30 -4 -17 -8 -2 -6 5 10
8104 10 -14 0 19 -7 -11 -2 3 3 12 0 -9 5 -2 5 5 -1 0 12 -2 -20 -7 7 6 3 -9 -6 0 24 -6 -14 4 16 -11 -8 -2 -8 -5 13 -3 -20
8144 -20 -3 -3 5 -9 -7 -1 8 -13 -8 -12 -12 -1 11 -22 -19 6 8 -9 -19 -6 -8 -7 5 -15 -9 18 -2 -5 -11 5 7 6 3 -2 0 -2 4 -5 -19 2 15 0
$$ packed form
7869b1K1K4m0PK9l1j2L8j4rK7j3l4L8J7m1K2J6l9K4J2l7NK4j9qJ8j6jK3k4j5K1
7902hJ9k3mNj4L9jl5KK9k3nK2k8OL1j8j4J7Lk0K5qk9L0J8k9%J1KoK3k8OK0nj9
7939iNJ6j3J0k3OPK6k2pM%J7kj6j7L6j9nMooJ6Nl6J6J7j5QOj4NJ3pk2K2L%Jpj0
7980a3J8onRPlmj5kRJ8j1nmJ4qJ5k2JK4lk2J2lJ0lmmJ1%jj5POMoj4QQk4J5mj0
8023a5PJ1opJMNQk6MK7j3pj7J5jJOnnK3k0POnJ2jj8NJ4k2jK2j6nK3kk6J9J6k9
8064a1J1LkPmJj6J4lJ1j1Jj2J1mKrJ7j4J2qrJ0Kk0K2onJ9j0l1LN9l4j3ROmJ1N
8104A0k4J4J9k6mRN%Rj2rJ4pP%oJJ2j4j8J3J4jlj2LOK4l0qJ8J2k7LOoLJ8j6j7
8144b0J7%Qj4KORk1Nm%J1J2l3LK5Kj7j0J3kJJ2k0OK7k0loJ6KjlnKkOrj4K1J3j5
$$ plain form
8186 0 -12 9 0 3 12
$$ packed form
8186@j2K1rLR
8191A2
$$ Imaginary data points
##PAGE= N=2
##DATA TABLE= (X++(I..I)), XYDATA
$$ plain form
0 0 0 0 0 0 0 0 0 0 0 0 -8 8 -8 8 -8 16 -16 16 -24 24 -32 32 -40 48 -54 62 -70 80 -88 99 -112 128 -142
33 -142 159 -177 198 -219 244 -271 300 -334 367 -407 451 -499 554 -616 686 -766 858 -969 1098
52 1098 -1257 1457 -1715 2064 -2566 3344 -4730 7922 -28950 16296 56464 -56737 -5527 57964
66 57964 -28523 -40951 46581 778 -36334 27962 17112 -34664 7223 15476 -20692 5593
78 5593 19747 -17103 -2571 13928 -14162 -5323 18750 -5141 -8730 11285 -2288 -10920 5536
91 5536 3672 -856 1974 -3785 678 4096 -10118 1138 15522 -10170 -9692 19242 -4455 -20899
105 -20899 17299 10641 -21875 6859 16446 -19313 -3261 18296 -11296 -6032 17834 -8116 -10301
118 -10301 16009 -6900 -13712 21015 1263 -22065 16017 10430 -27641 6264 24586 -20374
$$ packed form
0@%%%%%%%%%%qJ6j6J6j6K4l2L2m0M8n6O4p2Q8j02J16j32J50j68J87k11K40k70
33a42L01l36L75m17M63n15N71o34P01p74Q58r50J053j170J302j452J624j827K067
52A098k355K714l172L779m630N910q074J2652l6872M5246M0168j13201N1210O3491
66E7964q6487j2428Q7532m5803l7112O4296j0850n1776M1887Q253l6168K6285
78E593J4154l6850J4532J6499k8090Q839K4073k3891l589K0015j3573q632J6456
91E536j864m528K830n759M463L418j4214J1256J4384k5692M78K8934k3697j6444
105b0899L8198o658l2516K8734R587l5759J6052K1557k9592N264K3866k5950k185
118a0301K6310k2909o812L4727j9752k3328L8082n587l8071L3905J8322m4960
$$ plain form
130 -20374 -8131 26636 -10402 -21865 20193 7306 -19176 8589 11828 -15616 -2752 10980
142 10980 -4866 -1828 7398 -3205 -2908 2176 -4733 1348 7778 -4398 -2783 6380 -5212 -5988
156 -5988 8896 1442 -6393 5334 1635 -8379 1966 4398 -3790 3053 3527 -6999 -45 4789
170 4789 -5469 472 8354 -4892 -4940 7172 -2381 -7028 7446 3648 -6976 2003 2996 -5794 975
185 975 4193 -3184 1276 2902 -5266 507 4346 -5839 281 9009 -5450 -6320 9034 -1121 -9620
200 -9620 8028 5854 -10424 1444 8446 -8072 -4226 9558 -609 -5812 4633 1024 -5670
213 -5670 1361 3097 -1343 500 695 -1154 85 -1424 -794 3779 381 -2981 2020 40 -4324 2475
229 2475 3546 -3478 534 3326 -4225 -1774 4302 -1400 -1290 4555 -1751 -4602 3214 942 -3325
$$ packed form
130b0374J2243L4767l7038j1463M2058j2887k6482K7765L239k7444J2864J3732
142A0980j5846L038R226j0603K97N084o909O081O430j2176J615R163j1592p76
156e988J4884p454p835J1727l699j0014J0345K432q188O843M74j0526O954M834
170D789j0258N941P882j3246m8J2112r553m647J4474l798j0624Q979R93q790O769
185I75L218p377M460J626q168N773L839j0185O120Q728j4459q70J5354j0155q499
200i620J7648k174j6278J1868P002j6518L846J3784j0167n203J0445l609o694
213e670P031J736m440J843J95j849J239j509O30M573l398l362N001j980m364O799
229B475J071p024M012K792p551K451O076n702J10N845o306k851P816k272m267
$$ plain form
244 -3325 3260 2239 -4338 342 2294 -3316 234 3939 -1435 -1291 1530 -2161 -936 3048 -667
259 -667 -1031 2566 -1559 -2774 2757 170 -2694 3241 1847 -4436 -30 2877 -2417 -469 3713 -1029
275 -1029 -2576 1747 231 -2110 938 1806 -316 -627 -443 -259 111 -221 904 1293 -1434 -1006 1696
292 1696 -866 -1907 2556 1444 -2578 438 1412 -2734 -181 3390 -947 -1881 2152 -210 -2717 1239
308 1239 1635 -1372 525 1450 -1842 -1362 1395 475 -380 669 124 -879 -424 98 265 286 285 489 -372
327 -372 -1448 -10 1282 -107 -205 971 -587 -1428 758 602 -971 770 1388 -1231 -1131 794 -125
344 -125 -336 1334 242 -1366 45 543 -740 51 1086 -28 -433 127 -538 -559 805 734 -342 -188
362 -188 -5 -444 -134 388 113 40 347 -64 -681 -353 406 437 94 14 -206 -476 -73 387 -64 -126 575 136
$$ packed form
244c325O585j021o577M680J952n610L550L705n374J44K821l691J225L984l715
259f67l64L597m125j215N531k587k864N935j394o283M406K907n294J948M182m742
275a029j547M323j516k341L048Q68k122l11J84J84L70l32J125L89k727M28K702
292A696k562j041M463j112m022L016R74m146K553L571m337r34M033k362k507L956
308A239L96l007J897R25l292M80K757r20q55J049n45j003M55N22J67K1jK04q61
327c72j076J438J292j389r8J176j558q41K186j56j573J741O18k619J00J925r19
344a25k11J670j092j608J411M98j283P91J035j114m05N60o65k1J364p1j076J54
362a88J83m39L10N22k75p3L07m11o17L28P59L1l43q0k20k70M03M60m51o2P01m39
$$ plain form
384 136 -850 -224 428 -127 217 754 -528 -920 622 352 -818 399 923 -742 -422 761 -577 -726
402 -726 1358 584 -1365 33 895 -837 -338 1209 -193 -894 870 355 -1335 54 1295 -266 -655
419 -655 604 -28 -896 446 851 -688 -433 1000 11 -1155 263 850 -584 -154 933 -592 -1001
436 -1001 1061 546 -1291 225 1168 -881 -605 1089 -382 -942 1229 506 -1491 119 1092 -784 -406
453 -406 1055 -280 -785 796 216 -1078 207 1001 -350 -568 397 51 -454 289 500 -504 -367 732
471 732 109 -919 215 842 -564 -319 861 -414 -869 1069 440 -1403 290 1234 -945 -576 1169
488 1169 -400 -906 1204 332 -1471 293 1097 -791 -440 925 -179 -673 557 204 -785 87 803
505 803 -142 -636 114 391 -233 -154 447 -100 -574 448 472 -842 -136 1089 -250 -834 636 172 -873
$$ packed form
384A36r86O26O52n55L44N37j282l92J542k70j170J217N24j665L20J183j338j49
402g26K084p74j949J398Q62j732M99J547j402p01J764n15j690J389J241j561l89
419f55J259o32q68J342M05j539K55J433r89j166J418N87j434M30J087j525m09
436a001K062n15j837J516R43k049K76J694j471n60K171p23j997J610R73j876L78
453d06J461j335n05J581n80j294J285P94j351k18R65l46n05P43K11j004J37J099
471G32o23j028J134O27j406K45J180j275m55J938o29j843J693R44k179L69J745
488A169j569n06K110q72j803J764Q04j888L51J365j104m94J230l53r89Q72P16
505H03r45m94P50K77o24P9O01n47m74J022K4j314P06J225j339n84J470m64j045
$$ plain form
524 -873 616 777 -1070 -269 1173 -366 -868 856 319 -857 373 541 -912 -128 1095 -147 -835
541 -835 388 366 -514 48 470 -308 -318 475 120 -617 15 645 -88 -490 157 123 -342 214 423 -504 -312
562 -312 627 -1 -606 273 363 -406 74 291 -548 -86 740 -163 -554 348 73 -387 350 168 -569 234 509
583 509 -544 -245 508 -93 -161 350 -282 -445 515 285 -477 -1 266 -173 -21 193 -126 -101 217 118 -218
604 -218 -237 300 383 -377 -241 423 -204 -297 773 -60 -1043 637 764 -1160 -54 1215 -791 -638 1252
623 1252 -451 -1176 1355 532 -1573 351 942 -1047 35 1073 -797 -470 978 -301 -662 608
639 608 76 -248 352 -374 -366 629 -62 -243 552 -489 -527 1037 -185 -1046 1105 422 -1397 616 772
658 772 -1482 461 1579 -1470 -676 1673 -737 -948 1666 -330 -1463 1462 306 -1760 949 992
$$ packed form
524h73J489J61j847Q01J442j539n02J724n37j176J230J68j453P84J223j242o88
541h35J223k2q80N62M22p78j0P93l55p37O32O30p33m02O47l4m65N56K09r27J92
562c12R39o28o05Q79R0p69M80K17q39M62Q26r03l91R02k75m60P37j82p37Q03K75
583E09j053K99P53o01o8N11o32j63R60k30p62M76K67m39J52K14l19K5L18r9l36
604b18j9N37Q3p60J36O64o27r3J070q33r83J680J27j924J106J269k006J53J890
623A252j703p25K531q23k105J924N91j989J082J038j870L27J448j279l61J270
639F08n32l24O00p26QR95o91j81P95j041l8J564j222q61K151o83j819K013J56
658G72k254J943J118l049P94K349k410k11K614j996j133K925j156k066K709M3
$$ plain form
674 992 -1484 410 974 -1543 147 1592 -1202 -603 1462 -772 -794 1551 -451 -1264 1445 197 -1567
691 -1567 863 685 -1231 547 696 -1338 191 1145 -849 -191 753 -808 -11 984 -877 -246 1264
708 1264 -813 -712 1416 -578 -1039 1824 -53 -2085 1280 1063 -1900 661 1589 -1972 -334 2154
724 2154 -1241 -1236 2180 -151 -1859 1285 473 -1726 1009 1277 -1689 -201 1298 -888 -384 1224 -511
741 -511 -684 924 -241 -826 706 265 -426 348 -278 -545 724 87 -621 622 -19 -989 787 521
759 521 -1356 464 1278 -1352 -497 1512 -701 -869 1626 -240 -1688 1181 822 -1511 408 1034 -1232
776 -1232 -44 1206 -919 -459 1277 -431 -839 894 -146 -690 1010 43 -1227 595 609 -870 303
793 303 638 -874 -12 737 -668 -213 831 -282 -377 406 -443 -205 912 -210 -664 552 -137 -620
$$ packed form
674I92k476J894N64k517J690J445k794N99K065k234k2K345k002q13K709j248j764
691a567K430j78j916J778J49k034J529R54j994O58R44j561P97R95j861O31J510
708A264k077J01K128j994m61K863j877k032L365k17k963K561R28l561J638K488
724B154l395NL416k331j708L144q12k199K735K68k966J488J499k186N04J608j735
741e11j73J608j165n85J532m41o91P74o26k67J269o37p08J243o41r70J776k66
759E21j877J820Q14k630Q55K009k213j68K495j866j448K869l59k333J919O26k266
776a232J188J250k125M60J736j708m08J733j040n44J700r67j270J822J4j479J173
793C03L35j512Q62P49j405M55J044j113r5P83q49K38J117j122m54J216o89m83
$$ plain form
811 -620 756 168 -838 574 457 -1081 78 828 -558 6 730 -780 -451 981 -145 -591 707
828 707 -35 -735 565 187 -781 481 669 -710 -225 480 -266 -35 485 -224 -306 259 45 -81 58 -106
848 -106 162 217 -386 -106 376 -180 -84 412 -359 -372 629 72 -629 223 276 -388 157 249 -448 8 409 -280
870 -280 -183 256 -77 -35 186 -293 -185 339 61 -131 4 -165 -15 257 -185 -115 349 -117 -206 290 -251 -314
892 -314 658 143 -708 211 372 -539 157 587 -547 -215 719 -283 -587 531 249 -366 222 28 -476
911 -476 219 385 -261 -69 142 -162 25 64 -223 109 241 -204 -54 22 -275 214 368 -428 -151 469 -249
932 -249 -289 485 -172 -457 646 111 -880 260 616 -586 -57 626 -523 -342 795 -136 -721 499 376
951 376 -563 67 306 -413 20 469 -258 -285 321 74 -149 45 -70 -6 225 -50 -173 41 -24 50 212 -201
$$ packed form
811f20J376n88j006J412j17j538J159P50j386N64P24j510L29J432j126m46J298
828G07p42p00J300l78r68J262J88j379M85P05p46K31N20p09q2N65k14j26J39j64
848a06K68N5o03K80M82n56R6M96p71j3J001n57p01Q52N3o64N45R2o97M56M01o89
870b80R7M39l33M2K21m79J08N24k78j92J35j69J50K72m42P0M64m66q9M96n41o3
892c14R72n15q51R19J61r11O96M30j134L32R34j002l04J118k82o15N88j94n04
911d76O95J66o46J92K11l04J87L9k87L32J32m45J50P6k97M89J54p96K77O20p18
932b49m0P74o57k85J103n35r91J140L56j202N29O83j149J81J137r31n85J220j23
951C76r39O30K39p19M33M49p27k7O06k47k23J94j15O4K31k75j23K14o5P4J62m13
$$ plain form
973 -201 -196 323 5 -337 168 105 -264 235 194 -552 -11 555 -234 -288 349 -114 -318 411 26 -517 274 382
995 382 -425 -114 267 -209 -1 364 -238 -290 337 36 -273 131 39 -165 209 70 -379 43 309 -97 -99 82
1017 82 -101 -5 196 -80 -163 125 104 -43 -61 -94 35 192 -50 -125 80 -14 -23 189 -101 -266 247 223 -313 -95
1041 -95 222 -112 -44 250 -180 -276 305 119 -363 8 246 -131 -42 125 -212 -152 282 92 -274 -37 147 -48
1063 -48 -59 35 -27 -9 105 35 -188 -131 177 176 -136 -125 120 0 -115 118 21 -197 137 252 -271 -233 279 110
1087 110 -168 92 27 -236 80 232 -181 -149 253 81 -218 -60 41 -4 113 66 -136 -118 49 95 -19 -85
1109 -85 18 108 -15 -150 -72 17 85 113 -46 -199 -37 120 18 -76 18 66 14 -43 -89 -64 92 148 20 -142 -145
1134 -145 76 110 -48 -28 96 5 -38 42 -112 -110 238 214 -250 -161 172 3 -79 175 24 -205 112 164 -270 -149
$$ packed form
973b01NN19l18l42N05o3l69M99m1p46N41N66p89n4O37m63k04P29l85n43P91J08
995C82q07L11L81m76K08L65o02n2O27l01l09M04r2k04L74j39m49M22K66m06kJ81
1017H2j83R6K01k76q3K88k1j47j8l3J29J57k42p5K05r4rK12k90j65N13k4n36K18
1041i5L17l34O8K94m30r6N81j86m82L71K38l77Q9J67l37O0M34j90l66K37J84j95
1063d8j1R4o2J8J14p0k23N7L08jl12J1K45j20j15K33r7k18L34J15n23L8N12j69
1087A10k78K60o5k63L16J52m13L2M02j72k99J58J01m5J17m7k02J8J67M6j14o6
1109h5J03R0j23j35P8Q9O8K8j59j53J62J57j02r4R4M8n2n7m6K5J56N6j28j62l
1134a45K21L4j58K0J24r1m3Q0j54KL48k4m64Q9L33j69q2K54j51k29L17N2m34J21
$$ plain form
1158 -149 332 133 -222 -9 44 -172 30 246 -96 -213 164 140 -250 -127 189 91 -76 16 -41 -203 45 256
1180 256 -66 -240 130 133 -209 -97 149 -43 -20 237 -97 -338 147 255 -162 -79 165 -59 -94 139 -38 -143
1202 -143 180 197 -157 -170 59 86 28 9 -6 -19 -15 47 26 -137 -4 269 6 -273 14 106 -71 87 90 -192 -38
1227 -38 199 -103 -174 115 85 7 48 -156 -131 176 50 -113 71 -41 -150 149 1 -291 145 279 -199 -110
1249 -110 93 -153 13 286 -120 -209 174 44 -184 30 52 -14 143 13 -181 -20 38 97 123 -147 -96 235
1271 235 -72 -262 228 81 -258 283 148 -591 56 570 -315 -257 455 -148 -401 415 68 -505 282 382
1291 382 -410 -148 244 -135 5 228 -167 -161 128 -43 -54 48 -102 99 194 -270 -171 221 -33 -32 228 -178
1313 -178 -216 313 11 -320 224 165 -248 153 96 -405 107 431 -224 -174 263 -131 -135 256 -104 -175 304 50
$$ packed form
1158a49M81j99l55K13N3k16K02K16l42j17L77k4l90J23L16r8j67R2n7j62K48K11
1180B56l22j74L70Ll42J12K46j92K3K57l34k41M85J08m17Q3K44k24l5K33j77j05
1202a43L23J7l54j3K29K7n8j9j5j3MO2k1j63J33K73k63k79K87R2j77J58Lk82J54
1227c8K37l02p1K89l0p8M1k04K5L07j26j63J84j12j09K99j48k92M36J34m78Q9
1249a10K03k46J66K73m06q9L83j30k28K14K2o6J57j30j94J61N8N9K6k70N1L31
1271B35l07j90M90j47l39N41j35p39O47N14q85N8P12o03k53Q16l47n73P87J00
1291C82p92K62L92l79J40K23l95OK89j71j1J02j50K01R5m64R9L92k54JK60m06
1313a78l8N29l02l31N44n9m13M01n7n01N12L24o55N0M37l94mL91l60p1M79k54
$$ plain form
1335 50 -259 54 23 -84 246 59 -340 95 196 -255 -15 237 -161 -40 301 -198 -368 255 238 -227 -36
1356 -36 114 -153 -78 164 -44 -147 153 134 -203 -176 82 87 36 57 -78 -122 37 39 -45 -8 45 40 36 -105 -143 104
1382 104 179 -31 -37 -25 -102 76 96 -135 -1 218 -82 -103 89 -125 -35 335 -47 -322 152 101 -228 120 139
1405 139 -250 130 220 -346 -109 306 -71 -26 223 -293 -187 388 -100 -334 359 75 -364 234 98 -486 211
1426 211 499 -372 -192 334 -185 -163 335 -49 -252 266 43 -282 27 86 16 150 -52 -194 109 54 -87
1447 -87 163 -4 -185 222 79 -387 101 321 -217 -2 254 -332 -145 479 -86 -381 306 153 -359 73
1467 73 189 -271 21 350 -172 -300 190 144 -170 -23 117 -70 -70 96 -34 -183 52 212 -30 -179 8
1488 8 63 -37 19 20 -67 44 69 -79 -87 16 77 118 -37 -160 44 77 -55 84 76 -115 67 139 -218 -98 284
$$ packed form
1335E0l09L13l1j07L30j87l99M35J01m51K40K52l98J21L41m99j70O23j7m65J91
1356c6J50k67P5K42k08j03L00j9l37K7K58Nn1K1j35m4J59Kq4L7N3nmj41l8K47
1382A04P5k10oJ2p7J78K0k31J34K19l00k1J92k14R0L70l82k75M74n1l29L48J9
1405A39l89L80R0n66K37M15l77M5K49n16J06N75m88k34O93k84m39N98j36n84O97
1426B11K88q71J80N26n19K2M98l84k03N18k23l25L09N9p0J34k02j42L03n5j41
1447h7K50j67j81M07j43m66M88K20n38K15K56n86J87O24n65k95O87j53n12M32
1467G3J16m60K92L29n22j28M90m6l14J47J40j87%J66j30j49K35J60k42j49J87
1488HN5j00N6Jq7J11K5j48qJ03O1M1j55j23K04L3j32J39qj91J82P2l57J20L82
$$ plain form
1513 284 37 -103 128 -99 -194 260 104 -255 100 192 -199 -39 112 -128 54 228 -125 -160 61 -16 49 120
1535 120 -177 -42 227 -146 -182 224 -28 -163 296 -22 -452 192 344 -308 -68 296 -196 -150 279 -95 -239
1556 -239 261 126 -230 -18 45 -38 122 38 -139 49 57 -91 34 -4 -119 183 151 -244 -70 188 -67 -41 181
1579 181 -129 -123 233 -6 -255 115 166 -107 30 55 -196 -25 261 -46 -201 105 102 -127 -39 66 -53 -3 143
1602 143 -32 -206 -12 159 10 -112 30 59 -41 -47 40 -12 -41 103 89 -163 -147 157 134 -126 -15 125 -79
1625 -79 -78 133 -43 -171 193 182 -244 -118 178 -10 -51 137 -19 -139 100 87 -146 -20 125 37 -14 -79 -98
1648 -98 48 95 -8 -3 -34 -63 64 31 -161 39 198 -80 -116 48 -89 -55 230 19 -275 76 163 -202 -55
1671 -55 179 -68 -47 186 -82 -271 123 212 -109 -92 85 -13 -91 55 40 -78 17 145 -22 -214 -16 186 18
$$ packed form
1513B84k47j40K31k27r5M54j56l59L55R2l91J60J51k40J82J74l53l5K21p7O5P1
1535A20k97J35K69l73l6M06k52j35M59l18m30O44J52o52K40L64m92M6M29l74j44
1556b39N00j35l56K12O3q3J60q4j77J88Qj48J25l8j15L02l2l95J74K58k55K6K22
1579A81l10OL56k39k49L70N1k73J37K5k51J71K86l07j55L06lk29Q8J05j19N0J46
1602A43j75j74J94J71j49j22J42K9j00oQ7n2k9J44j4k52J6L04k3k60J11J40k04
1625g9JK11j76j28L64j1m26J26K96j88m1J88j56j20K39j3k33J26J45q8n1o5j9
1648i8J46M7j03Nl1k9J27l3j92K00J59k78l6J64j37L4K85k11k94L51Q7l65J47
1671e5K34k47K1K33k68j89L94Q9l21J7J77r8p8J46j5j18R5J28j67j92J98K02j68
$$ plain form
1694 18 -77 80 23 -133 58 115 -134 -23 262 0 -271 18 163 -66 21 140 -127 -144 155 56 -192 35
1716 35 197 -58 -142 12 -39 -43 166 88 -176 -86 90 -28 -87 45 78 -22 -35 -59 -103 -11 126 104 -93 -126 29
1741 29 34 -60 20 91 -40 -19 75 -140 -156 189 190 -157 -84 77 -92 -57 174 15 -112 132 77 -244 -80 164 56
1766 56 -14 35 -87 -143 43 97 -23 -35 57 46 -99 -144 30 151 16 -6 -8 -156 -96 199 39 -183 96 138 -206
1791 -206 -114 135 -42 -21 220 -44 -308 28 162 -46 -2 103 -37 -67 18 -63 -51 117 127 2 -135 -124 62
1814 62 119 -31 27 94 -108 -83 106 -73 -82 284 120 -276 -60 108 -107 64 230 -112 -154 163 -46 -229 111
1837 111 196 -42 -6 -30 -213 -28 170 45 -35 -5 -44 -36 -47 -79 101 147 -46 -69 -46 -187 44 293 -58 -183
1861 -183 162 -14 -274 115 167 -158 102 218 -316 -237 263 82 -109 153 15 -219 29 85 -106 67 161
$$ packed form
1694A8r5J57n7j56J91N7k49J11K85k62k71K89J45k29Q7J19k67j7K99r9k48K27
1716C5J62k55q4J54n1mK09p8k64R0J76j18n9J32L3j00j3k4m4R2J37k2j97l3J55
1741B9Nr4Q0P1j31K1R4k15j6L45Jl47P3J61j69L5K31j59j27K44n5l21J64K44j08
1766E6p0M9j22n6J86N4j20j2R2j1j45m5J74J21j35k2kj48O0K95j60k22K79M2l44
1791b06R2K49j77K1K41k64k64L36J34k08M4J05j40l0Q5q1J2J68J0j25j37J1J86
1814F2N7j50N8O7k02K5J89j79rL66j64l96K16J68k15J71J66l42m2L17k09j83L40
1837A11Q5k38L6k4j83J85J98j25q0L0l9Qj1l2J80M6j93k3K3j41K31K49l51j25
1861a83L45j76k60L89N2l25K60J16n34P9N00j81j91K62j38k34K48N6j91J73R4
$$ plain form
1882 161 -3 -66 -122 -104 181 152 -105 28 41 -231 14 194 -165 0 352 -146 -357 148 59 -161 279 127
1904 127 -389 2 211 -237 -42 288 -51 -102 122 -213 -195 283 111 -118 57 -77 -184 136 21 -117 222
1925 222 91 -247 21 8 -231 258 345 -348 -113 297 -250 -170 443 -18 -279 340 8 -522 142 359 -175
1946 -175 44 193 -306 -114 262 -76 -37 236 -58 -136 45 -199 -34 372 -8 -219 128 -123 -262 288 117
1967 117 -281 215 220 -446 -81 291 -151 36 355 -260 -336 254 5 -224 281 104 -249 77 15 -303 142
1988 142 306 -103 -26 31 -278 25 270 -140 1 287 -203 -235 220 -72 -148 454 82 -503 67 222 -300
2009 -300 115 429 -248 -177 310 -198 -352 359 239 -211 58 3 -315 54 269 -56 -18 112 -131 -105 -1
2030 -1 -55 151 218 -130 -125 -5 -198 68 336 -133 -186 257 -122 -375 263 189 -220 234 196 -565 -107 468 -140
$$ packed form
1882A61j64o3n6J8K85k9k57J33J3k72K45J80l59J65L52m98k11N05q9k20M40j52
1904A27n16L91K09m48J95L30l39n1K24l35J8M78j72k29J75j34j07L20j15j38L39
1925B22j31l38K68j3k39M89Q7o93K35M10n47Q0O13m61k61O19l32n30O64K17n34
1946a75K19J49m99J92L76l38L9K73k94p8J81k44J65M06l80k11L47k51j39N50j71
1967A17l98M96No66L65L72m42J87L19o15p6N90k49k29N05j77l53L26o2l18M45
1988A42J64m09P7N7l09L03K45m10J41K86m90l2M55k92p6O02l72n85N70J55n22
2009c00M15L14o77P1M87n08j54P11j20m50K69n5l18L69K15l25L8J30k43K6J04
2030an4K06O7l48NJ20j93K66K68m69n3M43l79k53O38p4m09M54l8p61M58N75o08
$$ plain form
2053 -140 -103 395 -166 -348 246 -4 -282 343 256 -307 -13 37 -267 198 330 -228 -28 189 -291 -101 299
2074 299 -105 -17 382 -216 -430 207 89 -160 301 85 -378 39 134 -283 78 306 -110 -51 18 -300 -31
2095 -31 306 -27 -37 108 -234 -127 213 -149 -61 405 -84 -369 173 -42 -270 437 249 -507 55 296 -428
2116 -428 -38 508 -169 -168 402 -219 -450 358 245 -210 158 73 -323 27 162 -124 101 197 -105 -26 -44 -185
2138 -185 182 253 -152 -2 63 -297 -10 296 -164 -64 366 -159 -381 193 57 -169 318 118 -417 16 187
2159 187 -235 45 274 -146 -71 127 -257 -119 322 35 -96 126 -167 -234 259 67 -191 236 135 -317 -14
2180 -14 133 -179 157 351 -201 -226 184 -46 -114 261 68 -176 91 18 -258 12 217 44 23 -37 -156 -28
2202 -28 90 3 77 44 -96 0 0 -198 62 288 -52 -143 87 -138 -194 262 102 -245 86 170 -285 -113 245
$$ packed form
2053a40L7M98n61j82N94k50k78O25q7n63K94N0l04M65J32n58K00K17m80J90M00
2074B99m04Q8L99n98k14O37j18k49M61k16m63M17R5m17L61K28m16N9O9l18K69
2095c1L37l33j0J45l42J07L40l62Q8M66m89k85N42k15k28P07j88p56N62K41p24
2116d28L90N46o77JN70o21k31Q08j13m55L68q5l96L50J35k86K25R6l02P9j8j41
2138a85L67P1m05J50O5l60K87L06m60J00M30n25k22N74j36k26M87k00n35M33J71
2159A87m22K80K29m20P5J98l84J38M41k87j31K22k93o7M93j92k58M27j01m52L03
2180a4J47l12L36J94n52k5M10k30o8L75j93k44K67p3k76K70K05j73k1o0j19J28
2202b8J18q7P4l3j40R6%j98K60K26l40r1K30k25n6M56j60l47L31Q4m55J72L58
$$ plain form
2225 245 -47 -31 256 -121 -301 155 149 -128 92 113 -157 -6 66 -160 36 243 -18 -73 7 -137 -4 236
2247 236 2 -93 140 -48 -166 98 42 -84 214 114 -304 -74 166 -78 27 190 -115 -139 142 -72 -165
2268 -165 158 140 -85 -6 -71 -172 81 148 -54 -4 -9 -116 19 8 -118 105 176 -145 -107 56 -130 18 278
2291 278 -85 -180 159 10 -204 121 140 -100 98 103 -251 -74 214 17 -27 97 -66 -90 83 -25 -59 129
2313 129 88 -46 -32 -80 -52 155 84 -72 7 -1 -100 41 44 -70 74 132 -131 -147 57 18 14 101 -46 -123 21 43
2339 43 -65 -5 65 39 -11 -86 -88 33 67 38 32 -79 -97 78 54 -93 60 123 -63 -52 17 -100 -5 172 30 -139
2365 -139 14 42 -49 16 68 -19 37 74 -58 -105 42 95 39 -13 -50 -24 4 23 12 3 2 52 22 -109 -63 116 57 -43
2393 -43 -6 -33 -86 47 60 -78 -25 112 3 -117 -12 29 12 61 41 -91 -51 76 33 -42 -15 22 19 -21 -37 8 30
$$ packed form
2225B45k92J6K87l77j80M56ok77K20K1k70J51P2k26J96K07k61n5Q0j44J33K40
2247B36k34r5K33j88j18K64n6j26K98j00m18K30K40k44J05J63l05k4K81k14r3
2268a65L23j8k25P9o5j01K53O7k02N0nj07J35j1j26K23P1l21L8J63j86J48K60
2291B78l63r5L39j49k14L25J9k40J98Nl54J77K88j97m4J24j63k4J73j08l4J88
2313A29m1j34J4m8K8K07p1j56P9qr9J41Lj14J44N8k63j6K04l9mQ7j47p7J44K2
2339D3j08O0P0k6n0p5kJ21L4k9oj11j8J75k4j47J53O3j86J1O9j17R5J77j42j69
2365a39J53K8r1O5N2q7N6L7j32m7J47N3n6n2l7K6K8J9j1rjN0l0j31M6J79n9j00
2393d3L7k7n3J33J3j38N3J37j09j20J05M1j7M9k0j32M0J27m3p5K7L7lm0j6M5K2
$$ plain form
2420 30 56 52 -28 -98 23 107 -25 -55 78 32 -58 35 20 -82 71 153 -68 -109 57 42 -42 41 18 -66 41 52 -62
2447 -62 -50 59 48 0 -35 -47 10 42 8 -3 -30 -31 40 13 -106 -31 121 6 -67 13 -22 -48 102 47 -142 24 122
2474 122 -76 -68 80 -8 -19 106 -2 -129 48 132 -10 -35 12 6 17 10 -12 12 12 43 35 -60 -86 119 96 -94 -8 81
2502 81 -56 -21 114 -59 -96 147 60 -172 -11 98 -35 8 60 -94 -58 98 15 -82 -3 43 25 -13 -61 -2 74
2527 74 -1 -15 11 -85 -7 127 -40 -120 96 65 -92 34 41 -101 48 146 -105 -109 107 49 -52 34 2 -25 62 23
2553 23 -57 5 46 45 21 -63 -50 85 22 -67 36 13 -85 90 67 -156 -9 175 -58 -137 87 -12 -87 115 27 -172
2579 -172 21 146 -74 -75 57 -21 -28 35 -31 -79 35 53 0 -40 -53 46 67 -67 -50 83 0 -28 85 -28 -100 116
2605 116 109 -136 -27 135 -17 -39 81 -17 -69 110 50 -112 -7 71 17 18 0 -40 38 47 -37 -9 24 -11 58 49 -121
$$ packed form
2420C0K6mq0p0J21Q4j32l0J33m6r0R3j5j02J53Q2k21m1J66j5q4Q3k3q4J07J1j14
2447f2J2J09j1m8l5j2N7L2l4j1k7jP1k7j19P5J52j15p3Q0l5k6J50n5j89J66R8
2474A22j98QJ48q8j1J25j08j27J77Q4j42k5M7oJ1pk2K4%L1qr5k6K05k3j90Q6Q9
2502H1j37L5J35j73l7K43q7k32J61J09j33M3N2j54L6J56q3r7P9M6j8l8m8N9P6
2527G4p5j4K6r6P8J34j67q0K16l1j57J26Pj42J49R8k51mK16n8j01Q6l2k7Q7l9
2553B3q0O2M1jk4q4J3J35o3q9J03k3r8J75k3k23J47J84k33p9K24r9p5K02q8j99
2579a72J93J25k20jJ32p8pO3o6m8J14J8n3m0j3R9K1j34J7J33q3k8J13j13p2K16
2605A16pk45J09J62j52k2J20r8n2J79o0j62J05P8n4Jj8m0P8Rq4K8L3l5O9rj70
$$ plain form
2632 -121 -35 144 -27 -115 83 6 -103 112 71 -188 27 207 -112 -119 133 -36 -105 150 -3 -215 90 155 -159
2655 -159 -71 108 -46 -33 88 -53 -85 84 40 -33 -14 -28 51 64 -81 -41 119 -13 -64 122 -61 -153 184 95
2679 95 -240 34 211 -135 -43 171 -124 -98 225 -16 -204 112 94 -98 59 36 -131 68 83 -131 -13 54
2701 54 -71 43 66 -172 -13 167 -91 -90 108 -72 -73 145 -59 -166 162 88 -156 28 44 -123 73 130 -139
2724 -139 -45 155 -41 -71 65 -18 12 103 -56 -92 78 27 -10 77 -51 -69 137 7 -151 81 106 -93 37 77
2748 77 -156 -19 195 -36 -121 74 16 -69 22 3 -47 55 47 -44 -74 -37 39 86 -56 -79 54 -22 -80 57 4 -99
2774 -99 88 69 -166 -76 112 5 -23 68 -55 -83 80 22 -81 27 79 2 -45 -33 -10 53 48 20 -13 -63 15 89 -48
2801 -48 -57 127 54 -99 13 -3 -92 105 142 -115 -105 110 -21 -93 75 36 -71 56 23 -126 -14 109 14 -21
$$ packed form
2632a21Q6J79j71q8J98p7j09K15m1k59K15J80l19pK52j69o9K55j53k12L05O5l14
2655a59Q8J79j54J3J21j41l2J69m4p3J9j4P9J3j45M0J60j32n1J86j83r2L37q9
2679I5l35K74J77l46R2K14k95K6L23k41j88L16j8j92J57k3j67J99J5k14J18O7
2701E4j25J14K3k38J59J80k58JJ98j80jK18k04j07L28p4k44J84J6j67J96N7k69
2724a39R4K00j96l0J36q3L0R1j59l6J70n1l7Q7j28j8K06j30j58K32K5j99J30M0
2748G7k33J37K14k31q5J95n8q5R1j9n0J02qr1l0L7P6M7j42k3J33p6n8J37n3j03
2774i9J87j9k35R0J88j07k8R1j23k8J63n8j03J08N2p7m7J2K3O3nk8l3n0P8P4j37
2801d8rJ84p3j53J12j6q9J97L7k57J0K15j31p2J68l9j07J27l3j49J12J23r5l5
$$ plain form
2825 -21 -27 -56 -6 46 -33 -22 49 -16 -22 -2 -83 -29 116 42 -100 -31 23 -57 24 38 -43 4 82 -48 -99 16 51 15 24 -39
2855 -39 -61 25 38 -20 -6 33 29 28 -47 -81 36 95 -1 -5 0 -78 19 107 -50 -51 129 5 -126 17 22 -79 90 111 -167
2884 -167 -85 134 -51 -83 93 8 -91 86 -9 -153 55 134 -44 -28 7 -101 22 106 -50 -17 89 -53 -39 43
2908 43 -57 -6 162 -5 -145 30 39 -63 84 50 -108 54 102 -118 -39 110 2 7 74 -98 -67 120 6 -44
2932 -44 66 -13 -35 67 -45 -110 111 73 -86 11 -2 -121 82 101 -150 -17 145 -85 -93 90 -62 -61 184 -9
2956 -9 -190 48 87 -98 31 76 -104 11 101 -96 -71 113 37 -33 24 -60 -43 106 27 -46 40 4 -23 49 -30 -69
2982 -69 119 76 -78 -17 4 -57 65 86 -92 -14 105 -51 -73 36 -12 0 100 -42 -127 57 53 -36 34 3 -68 43
3008 43 31 -121 -3 99 -34 -27 22 -105 -12 144 -28 -117 81 22 -92 33 20 -91 79 107 -118 -64 92 -6
$$ packed form
2825b1ok9N0N2p9J1P1o5oK0q1N4J45p4j42O9N4q0Q1J4q1M7P8j30n1J15L5l6Ro3
2855c9k2Q6J3n8J4L9mjp5l4J17N9r6mNp8R7Q8j57jJ80j24j31J43Nj01J69K1k78
2884a67Q2K19j85l2J76q5r9J77r5j44K08P9j78J6L5j08J23Q4j56L3J06j42J4Q2
2908D3j00N1J68j67j40J75Rj02J47l4j58J62M8k20P9J49j08NO7j72L1J87j14n0
2932d4J10p9k2J02j12o5K21l8j59R7j3j19K03J9k51J33J62k30qJ83j52JK45j93
2956ij81K38L9j85J29M5j80J15R0j97K5J84p6p0N7q4J7J49p9p3Q6l6k7P2p9l9
2982f9J88m3j54O1K1o1J22K1j78P8J19j56k2J09m8J2J00j42q5J84mq9P0l1p1J11
3008D3j2j52J18J02j33PM9j27R3J56j72q9J98n9j14J25j3j11J70K8k25N4J56r8
$$ plain form
3032 -6 -27 62 -37 -65 75 30 -93 -5 82 10 -1 -20 -54 34 68 -8 -4 -14 -17 41 8 -84 30 97 -45 -55 23 -58 -15 115
3062 115 -25 -112 56 48 -86 10 33 -56 29 68 -124 -69 91 6 -26 30 -77 -54 80 -28 -88 63 41 -45 25 -19
3088 -19 -103 79 106 -86 -26 89 -33 -16 73 -55 -50 138 23 -123 27 60 -18 40 24 -83 10 66 -26 -29 34 9
3114 9 40 -2 -78 -10 84 -4 -14 29 -56 -24 112 -20 -114 84 79 -88 -10 33 -73 25 92 -75 -89 70 9 -62 -9 -4
3142 -4 -13 49 -13 -79 -11 21 23 28 -46 -63 82 19 -84 22 42 -48 54 53 -117 -16 141 -13 -82 58 31 -58 54 24
3170 24 -101 27 131 -32 -88 32 27 8 16 -27 -5 25 1 12 -26 -47 66 74 -100 -65 66 -11 -70 87 -4 -120 72
3197 72 90 -153 -51 138 -15 -64 53 -34 -78 101 52 -91 -5 81 -14 -20 10 -4 25 49 -12 -19 -3 11 59 15 -73 38
3225 38 93 -60 -23 80 -44 -13 145 -54 -136 118 115 -114 6 105 -77 -29 109 -75 -85 114 68 -86 -22 5
$$ packed form
3032fk1Q9r9k8J40m5j23Q8Q7p2j1j9l4Q8L4p6Mj0lN8l3r2J14O7j42j0P8q1M3J30
3062A15j40q7J68qj34R6K3q9Q5L9j92N5J60q5l2N6j07K3J34j08o0J51k2q6P0m4
3088a9q4J82K7j92O0J15j22J7Q9j28NJ88j15j46J50L3p8N8j6j07R3N6r2lO3k5
3114IL1m2p6O8R4q8j0M3q5L2J36j32r4J98nj67P8M3j06R8O7j67j4J59o1p1N3N
3142drO2o2o6O8L2KNp4j7J45o3j03J06K0r0J02jj70J01J57j54o9J40k7q9J12l0
3170B4j25J28J04j63n6J20nj9Qm3K2L0k4J1l8k1J13Qj74L5J31p7n9J57r1j16J92
3197G2J8k43J02J89j53m9J17q7m4J79m9j43Q6Q6r5oL0j4K9K4o1pJ6J4M8m4q8J11
3225C8N5j53L7J03j24L1J58j99q2K54lk29J20R9j82M8J38j84j0J99m6j54O4K7
$$ plain form
3249 5 -16 38 6 -43 30 -7 -29 19 -46 -87 112 52 -165 -14 130 -91 -40 130 -86 -101 151 13 -178 54 99
3274 99 -92 5 35 -113 1 118 -48 -56 67 19 -14 36 -41 -17 111 18 -54 29 -17 -25 92 -30 -115 105 64 -126
3300 -126 36 80 -111 41 160 -155 -121 176 8 -154 91 42 -121 54 71 -151 -25 124 -22 -52 4 -37
3322 -37 15 46 -58 -25 67 -44 -27 68 -81 -49 161 26 -154 48 84 -77 34 75 -101 6 128 -67 -83 86
3346 86 22 -22 59 -39 -64 81 30 -53 22 38 -42 13 -3 -79 29 84 -37 -30 17 -41 31 81 -67 -70 95 8 -104 39
3374 39 34 -84 59 62 -124 -76 122 16 -96 8 37 -38 -15 24 -35 -31 60 57 -59 -80 35 68 -42 -47 55 -4 -35
3401 -35 52 28 -88 27 116 -46 -92 63 52 -36 44 21 -77 18 85 -44 -54 60 63 -34 -1 1 -44 46 69 -62 -47 52
3429 52 26 -52 -12 26 -17 13 27 -49 -68 32 63 -38 -86 30 26 -32 -10 3 -36 2 61 -16 -87 6 63 -4 -60 -6 24
$$ packed form
3249Ek1N4l2m9P3l7k2M8o5m1J99o0k17J51J44k21N1J70k16j5K52j38j91K32M5
3274I9j91R7L0j48J14J17j66qJ23m8l3N0p7K4J28r3p2Q3m6qJ17j22q5K20m1j90
3300a26J62M4j91J52J19l15L4K97j68j62K45m9j63J75J7k22J26J49j46l0N6m1
3322c7N2L1j04L3R2j11J7R5j49L2K10j35j80K02L6j61J11M1j76J07J22j95j6J69
3346H6o4m4Q1r8k5J45n1q3P5J6q0N5j6p6J08N5j21PM7n8P2N0j48lJ65q7j12J43
3374C9nj18J43Lj86M8J98j06j12J04K9p5K3L9n9MR1lj16k1J15L3j10nJ02n9l1
3401c5Q7k4j16J15Q9j62m6J55j1q8Q0k3r8R5O7j29j0J14Lr7L3Km5R0K3j31J5R9
3429E2k6p8M0L8m3L0J4p6j9J00L1j01m8J16mn8K2J3l9L8N9p7p1R3N7o7n6N4L0
$$ plain form
3458 24 13 -10 4 -3 -17 41 63 -65 -68 66 41 -68 2 41 -18 18 39 -61 -35 70 29 -45 -17 4 27 39 -23 -33 22
3487 22 12 -9 -3 -38 -15 73 9 -107 -9 37 -23 23 11 -90 25 94 -77 -55 80 -21 -45 76 -29 -112 109 66
3513 66 -123 12 73 -51 6 66 -83 -37 117 -9 -58 29 -4 -6 71 -54 -80 99 34 -76 39 28 -62 86 77 -130
3539 -130 -16 114 -29 -40 73 -24 -46 87 -27 -88 41 46 -27 8 -38 -58 71 17 -94 15 47 -78 14 40 -112
3564 -112 7 124 -89 -109 73 -24 -63 91 -30 -124 73 68 -115 -1 80 -51 7 63 -87 -61 124 16 -89
3587 -89 32 22 -36 35 34 -67 15 71 -37 -45 9 16 45 33 -56 -17 60 6 -7 17 -26 1 79 -42 -88 53 49 -59 -8
3616 -8 26 -64 16 77 -62 -78 67 25 -54 -6 -12 -27 37 18 -79 -13 50 -19 -15 8 -60 6 64 -37 -65 51 25 -24 37 -25
3646 -25 -52 58 39 -84 10 59 -18 25 48 -71 -7 98 -20 -81 69 30 -43 67 25 -90 25 78 -66 -29 41
$$ packed form
3458B4j1k3J4pj4N8K2j28lJ34k5j09P0L9n9L6K1j00K6J05m1p4K8K1K3J2o2j0N5
3487B2j0k1Ol5K3Q8o4j16R8M6o0M6j2j01J15O9j71K2J35j01k4J21j05q3K21m3
3513F6j89J35O1j24N7O0j49M6J54j26m9Q7l3kP7j25k6J79o5j10J15j1r0J48rk07
3539a30J14J30j43j1J13r7k2J33j14o1J29Np3L5m6k0J29n4j11J09L2j25R2K6j52
3564a12J19J17k13k0J82r7l9J54j21r4J97nj83J14Q1j31N8N6j50K6J85j08j05
3587h9J21j0n8P1jj01Q2N6j08qN4PK9j2q9L9P7n4j3K4m3K7P8j21m6J41mj08N1
3616hL4r0Q0O1j39j6J45m2p9M8oj5O4j9r7O6O3o9MK3o8O6N8j01k8J16k6m9O1o2
3646b5k7J10j9j23R4M9p7M3K3j19O4J05j18o1J50l9p3J10m2j15J15N3j44L7P0
$$ plain form
3671 41 2 3 19 -51 -30 69 1 -41 3 -19 16 42 -46 -66 61 13 -48 3 -21 -46 64 22 -108 -10 73 -41 -17 76 -66
3700 -66 -37 100 -5 -102 53 65 -51 11 15 -63 28 82 -36 -49 49 26 -1 11 2 17 42 -2 -32 7 0 47 49 -45 -52 60
3730 60 20 -44 12 26 -29 38 18 -76 -7 77 -6 -32 -11 -24 0 49 -2 -58 6 16 -18 -24 -36 -7 50 1 -64 -34 16 14 -7
3761 -7 -22 -30 8 34 -25 -38 5 24 20 4 -31 -22 34 31 -10 -13 11 40 18 -12 -10 2 29 34 -22 -44 7 51 1 -26 12 8 4 10 -20 -30
3797 -30 28 34 -34 -37 -20 10 29 3 -47 6 35 -13 -11 -10 -33 37 48 -57 -73 33 44 -28 -7 8 -21 19 26 -32 -18 45 29 -10
3829 -10 -34 -21 37 22 -17 -3 10 -8 17 36 -51 -5 96 14 -64 9 30 -23 44 36 -83 -2 82 -16 -66 48 18 -26 29
3858 29 -25 -102 18 86 -44 -54 28 6 -28 9 -17 -25 25 42 -42 -36 -14 27 12 -33 -38 19 9 -15 11 -14 -35 47 51 -85 -61
3889 -61 81 20 -29 32 6 -39 57 42 -77 3 88 -10 -31 18 -6 19 78 2 -49 32 24 -13 15 -13 -24 74 9 -76 9 46
$$ packed form
3671D1l9JJ6p0K1R9o8m2M4k2L5K6q8k0J27m8o1N1k4k5J10m2j30R8Q3j14K4R3j42
3700f6K9J37j05r7J55J2j16O2Mp8R1N4j18j3R8k3k7J2rJ5K5m4l0L9pM7Kr4pJ12
3730F0m0o4N6J4n5O7k0r4O9Q4q3k6K1j3K4M9n1n6O4J0l4oj2K9N7m9o5L0N0kk1
3761gj5qL8K6n9j3M3J9mj6l5RN6lm1lK4K9k2l0KJ2K7Nn6k2N1M4n0k7L8mmOl0j0
3797c0N8Oo8lJ7L0J9k6n0N3K9m8KJk3P0J1j05j6J06J1p2K1J5k9M0Pn8J4O3j6l9
3829a0k4J3N8j5l9J4J3j8K5J9q7M6J01q2p8P3K1n3O7qj19Q1Q4r8n0J14l0m4N5
3858B9n4p7J20O8j30j0Q2k2l4L7k6qN0J7q4OK2M1j5m5nN7j0k4K6k5k1Q2Mj36K4
3889f1J42o1m9O1k6m5R6j5j19Q0Q5r8k1M9k4K5N9p6n1Q1ql7K8k8j1R8o5q5Q5L7
$$ plain form
3919 46 -25 35 36 -97 3 109 -44 -82 84 25 -72 52 -11 -114 40 82 -90 -46 55 -37 -17 51 -53 -37 83
3944 83 -9 -94 10 15 -1 44 -5 -82 43 38 -48 8 26 -44 27 38 -97 -9 95 -7 -44 57 -40 -28 94 -1 -116
3971 -116 45 69 -63 -20 22 -54 26 77 -59 -67 53 16 -17 15 -28 -14 52 -14 -80 20 28 -45 7 -6 -77 20 78 -46
3999 -46 -40 53 -1 -40 6 -18 -25 48 32 -46 -25 14 14 31 -7 -35 29 35 -36 -23 36 -6 0 60 -37 -80 69 65 -51 -16 47 -12
4031 -12 -22 30 -15 -33 65 28 -58 -23 3 -5 31 21 -47 -7 39 -29 -47 -2 14 -5 9 -27 -79 2 62 -21 -49 -6 -6 7 -13
4062 -13 -39 6 44 -9 -12 -4 -42 7 72 -7 -76 32 34 -63 -10 51 -19 13 49 -37 -77 47 61 -3 -12 -1 -3 38 7 -37 38 31
4094 31 -22 9 -14 -62 34 91 -43 -71 46 11 -63 48 18 -44 32 44 -82 -66 61 12 -25 7 -37 -62 26 17 -56 -4
4122 -4 39 -22 -43 -15 -36 7 64 -23 -63 7 11 6 15 -11 -6 55 -6 -67 5 20 4 60 28 -96 -10 117 -55 -63 87 9 -74
$$ packed form
3919D6p1O0Jj33J00J06j53l8J66n9r7J24o3j03J54M2j72M4J01r2K0O8j04J6J20
3944H3r2q5J04Nj6M5m9p7J25nq6N6J8p0P1J1j35Q8J04j02l7J01r7J2J22r5j15
3971a16J61K4j32M3M2p6Q0N1j36qJ20l7l3L2m3J4O6o6o6J00Qp3N2j3p1R7N8j24
3999d6OR3n4l9M6k4pP3j6p8K1L9%J7l8k8O4Op1J3N9m2OO0r7m3J49mj16L5O3n9
4031a2j0N2m5j8R8l7q6L5K6qL6j0o8M0M6o8j8M5J6j9J4l6n2Q1O0q3k8M3%J3k0
4062a3k6M5L8n3lQl8M9O5p9o9J08Kr7N3O1p0L2L6q6m0J24J4o4rJ1kM1l1m4P5p
4094C1n3L1k3m8R6N7j34k8J17l5p4J11l0o2P6J2j26J6J27m9l7L2m4k5Q8rp3N2
4122dM3o1k1K8k1M3N7q7m0P0MnRk6NO1o1o1P2J5j6N6l2j24Q6J27j72qJ50p8q3
$$ plain form
4153 -74 55 9 -103 44 113 -68 -59 43 -7 -14 39 -15 -26 54 -15 -36 -2 -36 15 76 -57 -95 67 25 -93 38 45
4180 45 -105 29 91 -144 -48 160 -30 -109 87 -20 -113 97 41 -129 16 96 -69 -58 56 -32 -6 88 -41 -61
4204 -61 28 17 4 40 -43 9 73 -41 -68 62 17 -50 103 -5 -133 64 124 -89 -27 125 -67 -60 98 -36 -90
4229 -90 106 56 -112 -19 28 -34 8 32 -67 -14 41 -48 -33 13 -15 30 42 -85 -69 80 -2 -62 48 5 -72 42 25
4256 25 -116 5 114 -28 -50 38 -31 -35 79 25 -70 19 60 -20 -31 27 14 31 15 -28 -28 -5 11 45 -17 -53 29 39 -67
4285 -67 -18 62 -19 -10 53 -48 -121 70 77 -89 -21 82 -49 -62 53 -5 -60 55 40 -85 -41 57 5 -22 16 -28 -29 14
4313 14 3 -12 -17 27 47 -4 -68 -1 63 6 -11 40 -21 -28 53 6 -62 30 91 -31 -26 13 -1 -1 68 8 -52 16 51 -21 -26 8
4345 8 27 13 -20 -26 -25 -13 35 26 -52 -51 41 5 -72 -2 35 -18 -16 24 -54 -55 63 43 -65 -26 35 -16 -30 12 -11 -19 22 29 -54 -51
$$ packed form
4153g4J29m6j12J47O9j81RJ02n0pN3n4j1Q0o9k1L4l4N1O1j33l8J62m2j18J31P
4180D5j50J34O2k35R6K08j90p9J96j07r3K10n6j70J45Q0j65J1J14q8K6R4j29k0
4204f1Q9j1j3L6q3N2O4j14k7J30m5o7J53j08j28J97O0k13O2J52j92PJ58j34n4
4229i0J96n0j68R3M7o2M2K4r9N3N5q9J5M6k8M5J2j27J6J49q2o0J10m3p7J14j7
4256B5j41J21J09j42k2Q8o9mJ14n4r5Q9M1q0j1N8j3J7j6m3%K3J6L4o2l6Q2J0j06
4285f7M9Q0q1RO3j01p3J91Pj66O8J03j31j3J15n8n5J15j5j25M4R8n2k7L8m4jM3
4313A4j1j5nM4K0n1o4O7O4n7j7N1o1pQ1m7o8R2O1j22NL9j4%O9o0o0O8L5p2nL4
4345HJ9j4l3oJJ2M8rp8JR2l6p7P0L7n3KM0p8jJ18k0j08L9O1n1j4M2k3qM1Pq3L
$$ plain form
4379 -51 43 47 -39 -31 30 -7 -17 26 5 -44 26 68 -36 -51 36 41 -23 10 32 -34 10 50 -19 -38 21 56 -10 -45 8 29 -10
4410 -10 20 24 -50 -42 73 7 -83 18 53 -31 -33 33 -39 -20 68 18 -93 4 68 -38 -50 35 15 -13 23 18 -60 -15 58 21
4440 21 -47 -10 35 2 -43 33 11 -22 42 54 -81 -46 103 24 -60 31 44 -44 14 56 -49 -25 79 13 -71 -10 26 5
4468 5 15 0 -28 -2 11 14 -14 -18 10 36 -6 -60 13 16 -41 4 5 -52 -5 61 -20 -68 44 38 -38 -11 -3 -41 2 52 -23 -50 27
4501 27 27 -13 -9 7 5 24 -1 -15 1 2 41 42 -38 -35 65 23 -40 39 40 -36 11 67 -73 -35 115 24 -88 4 28 -40 22 43
4533 43 -56 -2 65 -17 -64 8 32 1 -3 -19 -30 5 -2 2 0 -46 -8 39 -27 -58 37 44 -46 2 24 -56 -4 78 -34 -55 55 29
4565 29 -51 13 7 -22 44 44 -49 -21 32 10 -1 6 -16 15 38 -29 -29 24 9 21 36 -43 -31 68 21 -43 24 33 -50 23 43 -91
4597 -91 -25 105 -18 -85 47 19 -50 36 36 -60 7 77 -13 -51 20 28 9 -6 -34 -8 16 -16 17 3 -30 13 73 -34 -44
$$ packed form
4379e1R4Mq6QO1l7j0M3k1m9P0M2j04j5Q7No4L3K2o6M4M0o9j9N9L5o6l5N3K1l9
4410a0L0Mp4QJ15o6r0J01L5q4kO6p2J9Q8n0j11R7O4j06j2Q5k0k8L6np8M5P3l7
4440B1o8L7M5l3m5P6k2l3O4J2j35L5J49p9q4R1J3q8N8M2j05K4J04o6q4O1L6k1
4468EJ0j5k8K6J3Lk8mK8K6m2n4P3Ln7M5Jn7M7O6q1m8J12op6K7Ql8M3N0p5k7P7
4501B7%m0MJ6kJ9k5j4J6JL9Jq0LJ00m2o3P9Jp6M7N6j40L8J50r1j12R2K4o8O2K1
4533D3r9N4O7q2m7P2K4l1mj6j1L5pMkm6L8M7o6l1R5Pr0M8K2q0N2Q2j12k1J10k6
4565B9q0O4ok9O6%r3K8N3k2j1Pk2L1K3o7%N3j5J2J5p9J2R9m7o4O7Rq3P3K0j34
4597i1O6J30j23o7J32k8o9Q6%r6O7P0r0l8P1Qj9j5k8K6K4l2L3j4l3M3O0j07j0
$$ plain form
4626 -44 81 37 -28 23 29 -63 30 80 -45 -37 63 22 -46 28 20 -24 46 36 -43 -6 31 5 12 17 -25 13 38 -23 -25 26 1 1
4658 1 13 -42 -11 61 -5 -37 25 9 -50 22 19 -74 24 87 -38 -73 49 16 -41 40 23 -63 15 67 -41 -57 48 34 -1
4687 -1 -6 -5 -11 21 42 22 -1 -8 42 28 -22 4 63 37 -4 4 1 -6 65 51 -40 -12 42 -7 -21 22 8 -11 58 -2 -55 13 41 -9
4721 -9 -11 15 -37 7 46 -13 -35 30 29 -35 -20 -6 -27 27 23 -38 -30 13 14 -9 -5 10 6 18 -9 -40 -1 40 28 -9 -3 -2 5 16 -10 -17
4757 -17 19 34 4 -25 -1 33 38 14 -8 -24 8 17 18 -8 -20 23 31 -23 -23 17 12 11 20 -25 -51 21 35 -39 -14 36 -5 -16 12 -34
4791 -34 -33 62 19 -75 -18 37 -20 -1 38 -30 -14 49 -11 -40 24 23 0 20 -10 -44 36 50 -13 -16 22 7 6 9 -21 3 46 11 -7
4824 -7 1 -6 20 41 -11 -15 34 18 -23 17 9 -20 50 19 -69 -13 53 -16 -12 33 -26 -43 38 -13 -82 20 52 -32 -11 8 -53 0 63
4857 63 -40 -49 41 6 -28 12 -3 -18 32 18 -47 -10 22 3 -2 -8 -19 8 40 -18 -9 31 10 9 23 -28 -24 78 31 -32 16 20 -23
$$ packed form
4626d4J25m4o5N1Or2R3N0j25QJ00m1o8P4qm4P0j0p9L7L7k6PNm2L8K5o1kN1k5%
4658AJ2n5L1P2o6l2O2j6n9P2lr3R8O3j25l5J22l3n7Q1j7q6P8N2j08j6J05j4l5
4687anJoL2K1k0k3pN0j4n0K6N9k6m1QlpP1j4r1K8N4m9j4M3j4j9O9o0n3O8K8n0
4721ikK6n2M4L9n9k2O5jo4J5J4k1N4mo1QM3Jk3MJ5mJ2k7l1L9M1j2l7OJPJ1k6p
4757a7L6J5l0k9K4L4Nk4k2j6L2RJk6j2M3Qn4%M0njRm5k6P2J4p4K5N0m1j1K8m6
4791c4JR5m3r4N7N5n7J9L9o8J6O3o0k9O4jk3K0l0l4Q0J4o3lL8j5jLl0K4M3l5j8
4824gQpK6K1n2mM9j6m1M0qk9P0l1q8N6O6o9MM5n9j7Q1n1o9J02L2q4K1J9o1N3O3
4857F3j03rR0l5l4M0j5j5N0j4o5L7L2j9noj1K7L2n8RM0k1jJ4n1MJ02m7o3M8Mm3
$$ plain form
4890 -23 1 27 -29 -2 49 -13 -42 13 24 20 32 -10 -23 28 18 -23 4 8 -4 36 -3 -64 -4 50 -1 -3 12 -22 -10 36 -13 -51
4922 -51 59 40 -43 -14 7 -26 11 48 -13 -37 40 35 -19 22 14 12 20 21 -20 -9 47 28 -4 -9 4 16 3 -5 13 16 30 9 2 -37
4956 -37 12 51 16 -21 19 -1 -10 14 10 -32 8 37 -29 -30 -1 10 6 20 -35 -14 21 20 -13 0 8 12 -6 -13 -30 15 36 -1 -9 -10 -5 5
4992 5 31 -9 -23 34 29 -16 -11 23 23 30 30 -8 -25 37 43 -7 -5 31 -2 2 17 7 -15 46 39 -21 -13 17 3 1 13 -5 -8 25 9 -36 -13
5029 -13 19 17 -8 -34 -20 17 7 0 -21 -8 11 3 -32 -25 7 21 10 -18 -19 -30 9 40 -21 -8 20 8 -8 15 -9 -10 53 12 -52
5062 -52 8 44 -10 6 25 -26 9 50 -6 -44 36 37 -21 24 10 -36 18 54 -32 -27 38 7 -23 12 10 -20 25 19 -35 -41 37 19 -12
5095 -12 3 -15 2 0 2 -26 -16 12 31 -9 -48 -6 32 -3 8 6 -26 8 37 -13 -50 37 39 -26 5 30 -27 14 53 -19 -28 56 22
5128 22 -37 15 26 -9 28 19 -35 -19 53 8 -20 8 0 7 22 5 -33 11 26 -8 -35 -10 -16 14 20 -28 -32 5 7 -12 -11 -3 2 12 -14
$$ packed form
4890b3K4K6n6K7N1o2k9N5J1mJ2m2j3N1j0m1K7Mj2M0l9o1O0N4n1kJ5l4J2M6m9l8
4922e1J10j9q3K9K1l3L7L7o1k4P7nn4M1qkQJm1J1N6j9l2nJ3J2j3qJ8LJ4k1pl9
4956c7M9L9l5l7M0k0rK4mm2M0K9o6jK9J1mJ4n5K1L5jl3J3QMj8pj7M5K1l7qjNJ0
4992EK6m0j4N7nm5NL4%P%l8j7O2On0KL6l3MJ5j0k2O1po0QL0j4kJ2j8lL3j6m5K3
5029a3L2kk5k6J4L7j0pk1J3J9ql5PL2J4j1k8jj1L9L1o1J3K8j2j6K3k4jO3m1o4
5062e2O0L6n4J6J9n1L5M1n6l8Q0Jn8M5j4m6N4L6q6NO5l1l0L5kl0M5on4oP8j8l1
5095a2J5j8J7kKk8J0K8J9m0l9M2L8l5J1kl2L4K9n0l7Q7Ko5L1K5n7M1L9p2rQ4l4
5128B2n9N2J1l5L7rn4J6P2m5k8K8qPJ5j7l8M4J5l4k7K5oL0Om8mL7Kj9JQNJ0k6
$$ plain form
5163 -14 -36 5 14 0 -7 -20 -34 25 28 -29 -1 16 -7 11 16 -26 -13 45 11 -32 12 4 -9 28 17 -23 27 39 -16 -23 6 -8 16
5196 16 37 -26 -22 32 -6 -12 -1 -4 -7 30 -5 -50 13 30 -23 -19 0 -22 12 37 -27 -40 35 0 -40 -3 -7 -29 27 5 -44 -19 34
5229 34 2 -5 5 -10 4 25 -14 -14 10 11 2 20 -16 -21 43 9 -29 6 35 -8 17 0 -33 5 46 -11 -28 2 3 1 19 -8 -23 22
5263 22 10 -27 -19 -4 -11 10 4 -32 -19 28 -1 -24 6 1 0 16 -18 -37 17 2 -20 -16 -14 -24 1 19 -41 -28 27 4 -18 -6 1 4 17
5298 17 12 -24 0 28 12 -4 -10 -16 6 21 -15 -1 13 11 19 16 -13 0 37 18 -30 11 21 -8 2 26 -36 1 50 -21 -33 20 21 -10
5332 -10 12 -8 -36 28 25 -41 -14 14 2 -6 -7 -34 -18 20 4 -34 -20 7 1 -9 -22 -20 16 13 -32 -14 -8 -7 26 6 -28 0 33 4
5366 4 -3 14 -16 3 40 11 -25 22 33 4 6 -3 0 31 13 -12 -7 17 1 7 0 -21 -6 30 6 -26 -3 15 2 2 -20 -21 1 12 -9
5401 -9 -38 0 13 -9 -16 -14 0 1 11 -14 -26 -1 13 5 -7 -3 7 16 14 -17 -23 17 15 -8 -12 14 31 5 1 -8 7 11 32 4 -23 16 18 2
$$ packed form
5163a4k2M1Rj4pj3j4N9Ln7K8J7k3J8Nm2J3N8l4m3M4qj3L7j1m0N0J2n5pK9j4K4
5196A6K1o3MN4l8oJ1llL7l5m5O3J7n3MJ9k2L4K5o4j3P5l5m0L7mk2N6k2m9K5N3
5229C4l2pJ0j5J4K1l9%K4JrJ8l6nO4l4l8L5K9m3K5j7l3L8M1n7j7L0JkJ8k7j5M5
5263B2j2l7QJ5pK1ol6J3M7k9k3L0njJ6l4j9N4j5k2MKj0K5J8o0J3N5k3k2J2PLJ3
5298A7nl6K4K8j6j6ooK2J5l6J4J4kQlk9J3L7j9m8M1J0k9J0K4o2L7M9p1j2N3Jl1
5332a0K2k0k8O4lo6K7K8j2qjk7J6L8j6l8J4K7oj0j3KL6lm5J8OJL3k0l4K8L3k9
5366DpJ7l0J9L7k9l6M7J1k9KrLL1j8k5NK4j6Opk1J5L6k4l2K3J8j3%k2jK2J1k1
5401ik9L8J3k2pKJ4JJ0k5j2K5J4qj2MJ0Rkl1oM0kk3mK6J7k6mrJ5MK1k8k7L9Kj6
$$ plain form
5439 2 -11 -4 1 -2 17 -6 -22 -4 27 -6 -39 5 -3 -16 6 -5 -34 -1 36 -16 -23 23 1 -15 5 -25 -31 18 14 -25 -18 9 -9 5 0
5474 0 -16 -16 23 4 -31 -7 13 21 2 -3 -14 14 18 -5 5 2 -4 19 21 -13 -7 14 13 -6 6 -1 0 22 5 -13 7 18 -4 0 8 -3 16
5511 16 15 -26 -17 28 10 -20 -8 -22 -12 24 0 -41 -7 12 -20 -5 -1 -23 4 27 -20 -25 9 7 -11 -6 -20 -28 25 24 -33 -8 29 -18
5545 -18 8 1 -17 -4 36 1 -28 1 8 9 10 -12 -14 19 19 -16 -7 12 6 20 1 -36 -5 24 3 -20 9 -8 4 24 -32 -38 21 10 -15
5580 -15 -16 -10 -20 16 10 -43 -29 22 7 -25 -6 -16 -13 5 -8 -34 -6 18 -12 -8 -7 -12 17 12 -21 -18 25 5 -7 -4 -13 -1 22 4 -19 23
5616 23 22 4 8 13 -13 13 37 -12 -10 15 11 8 9 -11 0 25 5 -10 5 5 16 1 -15 -11 17 2 -8 -12 -18 -2 -1 -3 -39 -22 8 7 -22
5653 -22 -12 -6 -7 13 2 -20 -12 25 6 -21 -9 5 5 5 1 -22 -17 35 11 -15 -10 17 5 4 -5 0 20 28 6 -3 5 17 24 0 0 9 9 19 6
5692 6 -8 0 12 14 -26 -21 4 15 -11 -8 -12 -3 8 -4 -13 -17 8 21 5 -25 -4 -2 7 -12 -13 -6 5 16 -6 -20 -20 10 11 -8 -20 -2 8 7
$$ packed form
5439Bj3PNlJ9k3j6J8L1l3l3M4qj3K2j1k9L3L7n2pM6k2j6K0l0oM9ml9PK7j8J4n
5474@j6%L9j9l5K4K0Qj9nj1K8Mk3J0loK3Kl4OK1jj9J2pJK2j7j8K0J1k2MQj1J9
5511A6jm1RM5j8l0J2j4J0L6k4m1L4J9l2J5Mk2K7K3m7nL4kj8Nj4qN3jn7K5L7m7
5545a8K6pj8J3M0l5k9K9PJJk2kL3%l5RJ9oJ4j9l7L1K9k1k3K9j7J2K0n6oN9j1k5
5580a5jOj0L6on3J4N1j5l2J9j0LJ8j3k6K8K4l0MJnK9nl3LM3k0j2LrJ2K3j8k3M2
5616B3jj8MNk6K6K4m9KK5mlJk0J1K5k0j5J5%J1j5j6MK8j5j0moJ6Jkl6J7L0jk9
5653b2J0OjK0j1k2QL7j9k7J2J4%%mk3NN2k4k6NK7j2jrNK0Qk2rQJ2Pk4%R%J0j3
5692Fj4QJ2Km0NK5J1k6LmRJ1j2rmK5J3j6l0K1KRj9jPJ1J1k2j4%L0Jj9j2J8J0j
$$ plain form
5730 7 10 -5 2 29 10 -23 1 19 15 10 -5 -7 6 31 16 -19 -3 15 2 -8 4 -2 8 22 0 -21 -1 20 11 -2 -2 -11 8 12 -14 -16
5766 -16 2 17 0 -2 -12 -12 7 4 -19 -14 5 -10 -2 -2 -11 16 27 -16 -19 6 4 9 8 -18 -20 26 21 -16 -3 23 12 21 1 -16 10 33 -2
5803 -2 -8 2 6 10 27 -12 -14 22 19 -4 -6 -3 -7 6 5 -24 -1 25 -8 -18 -7 1 2 19 -5 -36 7 19 -22 0 -10 -21 13 2 -25 -11
5839 -11 10 4 -14 -16 -16 0 19 -15 -22 -1 1 -4 -11 -23 -13 23 7 -9 6 8 1 22 3 -20 0 33 1 -2 12 11 2 12 1 -26 19 37
5875 37 -15 -13 12 15 -2 18 -8 -26 15 11 -18 9 11 6 8 -6 -15 0 -3 -3 -11 -19 1 7 1 -29 -13 20 -8 7 5 -7 -7 26 -5 -26 6 18
5913 18 -7 -6 10 -10 16 48 -4 -13 22 24 -1 13 3 1 26 19 -15 -3 26 20 10 6 -10 6 14 -5 -8 7 14 4 1 -25 -10 18 20 -16
5949 -16 6 -4 -7 13 -1 -37 -1 34 -12 -23 -4 -5 12 9 -11 -23 14 23 -9 -3 5 -12 16 6 -36 -15 26 4 6 2 -17 2 40 -13
5983 -13 -23 20 38 2 0 4 -5 17 14 -3 -12 20 20 8 12 -6 24 22 -6 -8 -3 6 15 4 -17 -14 27 17 -10 3 10 -2 -2 -6 -11 -17 22 5 -24
$$ packed form
5730GLj5PK7j9l3K4J8mnj5kJ3K5j5l5J6J8j3j0J2oJ0J4k2k1K0K1rj3%rJ9Mk6k
5766a6J8J5j7kj0%J9lk3NJ9j5Q%rK7J1m3lK5kNjk6kM6nl7J3K6j1Rk0j7K6K3l5
5803boJ0MMJ7l9kL6lk3kLmJ3jk9K3K6l3j0J1QJJ7k4l1M3J2m1K2j0j1L4j1k7J4
5839a1K1oj8k%J6J9l4pK1Knpj2J0L6j6j6J5KpK1j9k3K0L3l2lJ4jrJ0j1k7M5J8
5875C7n2KK5Lj7K0k6j8M1mk9K7KnKj4rJ5l%qqK0Ool0J6L3k8J5kj2%L3l1k1L2J2
5913A8k5JJ6k0K6L2n2rL5Kk5J4j0kK5pl4J2K9oj0mj6J6Qj9lJ5Pj0lk6J5K8Kl6
5949a6K2j0lK0j4l6L6L5m6j1J9jJ7lk0j2L7Rl2OQj7K8j0m2K1M1k2Kmj9J9L8n3
5983a3j0M3J8l6kMrK2lj7rL2%j2Mj8L0kk8kNRRj1k1LM1j0k7J3Pj2%mnoL9j7k9
$$ plain form
6022 -24 -11 14 -7 13 10 -16 -14 22 7 -19 -2 31 23 4 12 -1 9 24 20 -14 7 26 12 -6 9 13 9 17 16 -4 -2 16 24 -8 -12 14
6058 14 11 -9 -7 5 -14 25 28 -39 -18 17 3 -19 -1 16 -16 12 9 -30 -12 25 3 -10 -13 -11 -5 12 -14 -24 -13 18 -2 -12 -8 -3 24
6093 24 -5 -12 -14 4 13 5 3 2 23 20 -5 -12 16 10 11 17 -10 -3 21 33 -18 11 17 13 13 6 -10 17 15 3 -18 9 3 0 12 -4 -21 7 13 -23
6133 -23 -3 5 -18 -3 15 -17 -29 27 4 -5 -8 3 0 -2 0 -14 -4 19 15 -24 -16 -3 3 10 -3 -10 12 9 -3 0 1 8 26 -4 -18 9 6 11 20
6172 20 1 -14 24 14 -3 -5 9 11 -11 16 -3 3 29 24 -6 -10 5 -1 -10 -4 -8 2 26 -4 -21 -2 0 0 1 -6 -17 5 14 -9 -12 7 -1 13
6210 13 1 -30 -8 31 13 5 -2 3 0 5 0 1 1 17 8 -14 -2 7 32 1 -5 -5 4 7 15 -4 -5 21 24 -4 -19 -2 26 -4 -6 -6 -21 13 13 -16
6250 -16 -17 12 10 3 -26 -14 -11 12 8 -12 -19 -1 7 2 -11 7 -4 6 3 -17 -5 5 18 3 -18 -3 11 3 1 -8 2 7 7 -1 -4 11 25 11
6288 11 -18 -9 19 11 12 18 2 10 36 5 -10 22 24 12 5 10 -22 -3 5 -11 9 -10 -3 3 -14 1 -18 14 10 -26 -13 1 4 -4 -9 -16 4 2 -1
$$ packed form
6022b4J3K5k1K0lk6KL6j5k6J7L3qj9Qj3J0J5ml4K1J9j4j8J5MmQjk0KJ8Ql2mK6
6058A4lk0KJ2j9L9Lo7K1L5j4k2J8J7l2K8ll9J8L7k2j3lKOJ7k6j0J1L1k0j0MNK7
6093B4k9pkJ8RqkjK1lk5pK8oJOk7PK4J2n1K9Om%pj6K7kj2k1K7olJ2j6j7K8Ol6
6133b3K0Qk3J5J8l2j2N6k3rlJ1lkKj4J0K3ml9QJ3OPj3pK2lj2LJPJ8l0j4K7lNR
6172B0j9j5L8j0j7kJ4Kk2K7j9OK6nl0mJ5orOmJ0K4l0j7J9K%Jpj1K2Rk3lJ9qJ4
6210A3j2l1K2L9j8qpNlNnJ%J6rk2J2RK5l1o%RLQj9jK6Lk8j5J7K8l0k%j5L4%k9
6250a6jK9kpk9J2LK3mk0pJ8Qnj3J8j1J0lk0J2J0J3j5k1J5J4qkrJ0N%qlJ5J4j4
6288A1k9RK8qJOj6QK6l1j5L2Kj2pNl2J9Qj6K0j9POj7J5j9L2ml6J3J4LqnpK0kl
$$ plain form
6327 -1 -15 -7 3 21 -8 -15 -7 -1 -1 -11 -4 -17 12 23 -8 -17 8 12 1 -10 2 -25 9 26 -8 -5 26 12 -9 2 4 2 24 13 -15 -3
6363 -3 21 0 -21 1 4 -11 3 9 -24 -18 22 4 -26 -23 1 -10 -18 8 -15 -12 7 6 -19 -19 9 0 -22 -2 -10 -2 22 8 -11 -21 20 13 -23
6400 -23 -17 20 12 0 9 4 -8 23 31 -11 -12 19 8 1 27 1 -8 17 22 -30 -1 37 18 -9 17 3 -9 16 7 -11 5 17 -8 -10 -5 12
6436 12 -1 7 1 -23 -9 8 -3 -21 -23 -14 5 -9 -29 -8 -18 -1 20 -26 -24 15 18 -7 4 -8 2 21 5 -30 9 29 5 3 15 4
6470 4 2 25 8 -9 21 27 4 -6 12 3 24 23 -15 -18 12 21 1 -5 -1 -2 17 -1 -11 4 9 7 -2 -21 -5 12 -3 -14 -1 -9 -5 13 -3 -30
6508 -30 0 27 -18 -11 0 -5 -16 13 -3 -14 19 26 -8 -14 11 8 0 27 0 -22 4 19 2 -15 8 15 0 -8 -4 5 20 16 14 -4 5 25 22
6545 22 1 -3 20 7 -8 -8 -13 1 14 5 -32 -12 2 -6 13 -5 -27 10 19 -14 -23 3 5 -8 2 -12 -36 -3 17 -17 -12 0 -15 -9 -20
6580 -20 -23 3 6 -7 -15 -14 1 12 5 -7 4 8 11 10 -3 13 15 5 -5 -9 8 11 11 18 2 -10 18 13 -19 -12 -4 7 -10 4 -16 0 24 4
$$ packed form
6327aj4QJ0J8k9pQO%j0Pj3K9J1l1rK5Mj1j1J2k7L4J7l4LL1j4k1J1KkK2j1k8J2
6363cK4k1k1K2Lj5J4Ol3OM0j8l0LK4j1qK6k3LJ9jk5%K8rk2K0qQK4j4j9j0M1pl6
6400b3OL7qj2Rnj2L1Qm2jL1j1pK6k6rK5Nn2K9L8j9k7K6j4j2K5rj8J6J2k5kNJ7
6436A2j3Qok4J4J7j1j8kRJ9j4k0K1j0J7K1m6KL9Lk5J1j2J0J9j6l5L9K0k4kJ2j1
6470DkK3j7j7L0Ok3j0J8rK1jl8lL0Rk0oMjJ9j8j0J5Nkrj9J6J7j5j1J3qMJ8j6k7
6508c0L0K7m5PJ1nj1K9j6j1L3Pl4oK5lqK7k7k2K6J5j7j7K3Pj5qMRJ5mkj8RK0l
6545B2k1mK3j3j5%nJ4J3rl7K0J4qJ9j8k2L7Rl3rK6Kj3J0j4k4L3K0l4NJ2j5Oj1
6580b0lK6Lj3qJJ5J1pj2J1MLjj3J6Kj0j0mJ7L%Pj6j2K8nl2PQJ1j7J4k0J6K4k0
$$ plain form
6618 4 -15 -6 3 6 -3 -8 -21 -1 10 -9 -12 -7 5 -4 -13 -16 -14 7 9 -19 -14 -10 14 3 -10 -10 9 5 11 -2 -9 -7 27 5 -1 15 28 1 12 9 -7
6659 -7 7 22 9 -14 2 19 2 14 -11 -9 18 4 -9 -10 6 13 9 -13 -15 0 8 3 -7 -9 7 7 0 -20 -1 10 1 14 -8 -23 8 23
6695 23 -11 -14 5 -6 -2 13 -1 -22 16 8 -25 -17 8 -9 2 20 2 -2 24 21 -17 -8 23 22 10 -4 5 22 12 8 8 -4 23 31 2 -17
6731 -17 17 8 2 4 10 -15 0 13 -5 -27 16 7 -14 -22 4 -15 -10 5 -30 -14 21 1 -1 -7 8 -7 4 -4 -19 -9 14 -5 -3 -14 0 16
6767 16 22 14 -2 5 3 8 7 -18 10 29 -16 -12 14 16 2 34 7 -21 17 22 -8 -6 24 2 1 31 -3 -12 28 20 -16 1 22 -9 7 2 -17
6804 -17 2 20 -8 -15 -5 -9 6 3 -12 -16 8 3 -8 -8 -8 5 22 -15 -24 -10 -5 -3 -2 -6 -5 27 21 -11 -12 24 14 7 17 -9 -9 39 16 -22 12
6843 12 32 1 16 25 -7 7 27 5 -24 0 21 7 -1 -4 -10 7 10 4 -8 -1 -2 -1 -6 -8 3 5 8 -5 -29 -15 13 8 -21 0 11 -12 -21 -2
6881 -2 -11 -14 21 4 -50 -2 22 4 2 6 1 -6 14 7 -13 13 37 6 -2 14 15 4 18 19 -4 5 26 12 -9 3 16 17 0 8 -13 10 17 11
$$ packed form
6618Dj9RRLrnj3K0J1j9lNJ2rrlKK1Kk8NMK4j1j3%J9mOj3pKL4k2oJ6J3k7J1lj6
6659gJ4J5j3k3J6J7j7J2k5KK7j4j3jJ6Pmk2kJ5Qnj0kJ6%pk0J9J1rJ3k2j5L1J5
6695B3l4lJ9j1MJ5j4k1L8ql3QK5j7J1J8j8mK6ll8RL1jj2j4RJ7j0m%j2K7Qk9j9
6731a7L4roKOk5J5J3j8k2M3rk1qK6j9NJ5l5J6L5k0koJ5j5J1qj5J0K3j9Kj1J4J6
6767A6Oqj6PkNjk5K8J9m5MK6Kj4L2k7k8L8Nl0KL0k2jL0l4rM0ql6J7K1l1J6nj9
6804a7J9J8k8pJ0mJ5lj5mK4nj1%%J3J7l7rJ4NKJmJL2ol2jL6j0pJ0k6%M8k3l8L4
6843A2K0l1J5Rl2J4K0k2k9K4K1j4qloJ7Loj2PjJnkJ1KLj3k4J4K8nk9K1J1k3rJ9
6881brlL5j7n4M8K4j8kMnpK0pk0K6K4l1qJ6Jj1J4Jk3RK1j4k1J2J3Jj7Qk1K3Po
$$ plain form
6919 11 -4 -9 14 -12 -14 -5 0 0 3 -5 -32 -11 14 5 -11 0 1 7 -3 -11 -7 3 22 5 -25 -11 3 0 -5 -3 -3 -3 5 -8 -8 7 28 8 1 -10
6959 -10 5 17 15 4 -9 10 9 10 3 -2 9 27 13 1 1 16 9 4 -18 -15 0 2 -5 -21 -7 -1 -5 -11 -16 2 1 13 -19 -10 -5 4 -1 -8 -4 -4 -8 -6 -13
7002 -13 -14 -6 3 2 -17 -13 15 1 4 3 14 10 12 4 -29 3 23 19 15 21 -3 1 25 9 -12 15 24 17 1 1 3 24 21 0 -3 5 21 2 -13 9 3
7043 3 14 0 -21 -9 9 3 10 -11 -16 5 4 -19 1 3 -4 -3 -1 -15 -11 11 14 -20 -4 1 0 11 -1 -13 -6 16 1 -5 2 18 4 13 -9 2 33
7082 33 16 11 1 1 2 17 7 -2 23 26 14 7 14 0 14 23 7 -2 5 8 -15 4 10 5 18 6 -27 -9 7 12 10 -15 -13 -6 9 -13 -8 13 7 -4
7122 -4 -7 -22 -15 4 8 -10 -14 8 -9 -7 5 -17 -1 29 19 -24 -10 21 8 11 -5 -2 -10 3 6 -9 11 20 17 3 -12 4 11 -9 8 11 -11
7159 -11 8 20 3 -4 35 18 -11 -11 20 -5 2 27 -12 -25 12 7 -31 -6 13 -13 -7 -2 -25 -10 26 -1 -10 4 8 -4 -12 15 -3 -6 10
7194 10 22 -4 -22 -4 32 4 -5 14 14 -3 15 19 -9 7 38 -8 -9 16 8 22 23 7 -15 21 32 2 7 17 -4 -2 -3 -1 -3 20 -7 -14
$$ packed form
6919A1j5nK3k6kRN%Lqk7K1K5rj6J1JOj0qMJ0J9j7l0J4J4lnK%%Qj3%J5K1k0pj1
6959a0J5J2kj1j3J9jJpnJ1J8j4j2%J5pnk2LJ5Kpj6J4OmonJ8jJ2l2RNRnpM%mKp
7002a3jQRjj9MK8j4LjJ1mKql3L2K0mmOk4MK4j6k1K7Rpj6%KK1lk1lQJ6j9j5K2o
7043CJ1j4k1J2J8oPk1nK1jk3K0KpJKj4MK2Ll4J6NjJ1j2j2PK2j5oPJ6j4Rk2J1L1
7082C3j7nj0%JJ5j0rK5Lj2pPj4J4Rj6rPLk3J9OnJ3j2l3J8J6Nkk5KPJ5k2NK1oj1
7122dlj5PJ9Mj8mK2j7KJ2k2J6L0j0m3J4L1j3Lj6LqJ3Lj5K0Rlj4j5J6Pk0J7Lk2
7159a1J9J2j7pL9j7k9%L1k5PK5l9j3L7nl8K5J9k6ONk3J5L6k7rJ4Mj2qK7j8lJ6
7194A0J2k6j8J8L6k8rJ9%j7J8Mk8J6L1m6jK5qJ4Jj6k2L6J1l0NJ0k1KjKkK3k7p
$$ plain form
7230 -14 -10 -6 7 1 -11 -2 7 7 -11 -12 -14 2 11 3 -27 -17 1 -14 -4 -15 -12 3 10 -10 -13 0 -2 1 4 -27 -10 18 5 -11 17 21 -5 20 16
7269 16 -8 -4 45 1 -17 8 3 14 11 9 -9 21 19 1 2 8 20 10 -15 -9 11 7 2 11 -11 -19 30 15 0 3 20 -2 4 1 -30 -5 12 -2
7307 -2 -30 -4 18 0 -9 -1 -3 5 13 3 -21 -3 25 12 -9 -12 16 6 10 8 -1 0 26 19 -15 -3 12 16 7 8 11 0 13 14 -3 1 29 11 5 1
7347 1 7 -4 11 13 -10 -7 9 1 0 -13 -2 17 6 -29 -5 -3 -7 10 0 -13 1 12 -7 -4 6 9 16 5 7 -4 13 17 -4 -4 6 -5 9
$$ packed form
7230a4MMJ3oj2RR%j8jkJ6Rql0J0J8j5J0j1LJ5Pk0lJ3kLLl1J7K8j3j6K8Mk6K5m
7269A6k4MM9m4j8K5nJ1lkj8L0kj8JOJ2j0k5OK0mnRk2qM9j5j5LJ7k2Oll1K5J7j4
7307bk8K6K2j8rQkQQj0k4J8K8j3k1lK8j0MkrJK6pl4J2J5MrJLj1J3Jj7MK8j8om
7347AOj1J5Kk3LJ6qjj3J1J9j1l5K4KmJ7j0j3J4J1j9LJ0LPj1Kj1J7Mk1%J0j1J4
$$ [...]
8191B4
##END NTUPLES=NMR FID
##END=
