##TITLE=1H_LY-811.40
 CCl4, 8 sc, 
 9.4.2019
##JCAMPDX= 6.0         $$ Bruker NMR JCAMP-DX V2.0
##DATA TYPE= NMR FID
##DATA CLASS= NTUPLES
##ORIGIN= UXNMR, Bruker Analytische Messtechnik GmbH
##OWNER= root
$$ XWIN-NMR		Version 3.5
$$ Tue Apr  9 14:32:57 2019 Russian Standard Time (UT+4h)  she@DPX200
##.OBSERVE FREQUENCY= 200.1315
##.OBSERVE NUCLEUS= ^1H
##.DELAY= (6, 6)
##.ACQUISITION MODE= SIMULTANEOUS
##.ACQUISITION SCHEME= undefined
##.AVERAGES= 8
##.DIGITISER RES= 18
##SPECTROMETER/DATA SYSTEM= spect
##.PULSE SEQUENCE= zg30
##.SOLVENT NAME= DMSO
##.SHIFT REFERENCE= (INTERNAL, DMSO, 0, 15.7039)
##AUDIT TRAIL= $$ (NUMBER, WHEN, WHO, WHERE, WHAT)
$$ ##TITLE= Audit trail, XWIN-NMR		Version 3.5
$$ ##JCAMPDX= 5.01
$$ ##ORIGIN= Bruker BioSpin GmbH
$$ ##OWNER= she
$$ F:/spectra/data/she/nmr/H-F/1/audita.txt
$$ ##AUDIT TRAIL=  $$ (NUMBER, WHEN, WHO, WHERE, WHAT)
(   1,<2019-04-09 14:31:34.60 +0400>,<she>,<DPX200>,
      <created by zg, POWCHK disabled, PULCHK disabled
       configuration hash MD5:
       00 E9 B6 7A A2 85 ED C7 34 08 36 98 17 FE 4E 26
       data hash MD5: 16K
       7C ED 54 39 B0 36 05 E1 4E 0F 1E 40 4E 55 C3 3D>)
$$ ##END=
$$ 
$$ hash MD5
$$ C8 73 66 EB 9B 87 A5 26 FA 8F E3 D0 1F 7A 28 2E
##$RELAX= 
##$RELAX= 
##$RELAX= 
##$RELAX= 
##$RELAX= 
##$RELAX= 
$$ Bruker specific parameters
$$ --------------------------
##$DU= <F:/spectra>
##$EXPNO= 1
##$NAME= <H-F>
##$PROCNO= 1
##$TYPE= <nmr>
##$USER= <she>
##$AMP= (0..31)
100 100 100 100 100 100 100 100 100 100 100 100 100 100 100 100 100 100 
100 100 100 100 100 100 100 100 100 100 100 100 100 100 
##$AQSEQ= 0
##$AQ_mod= 1
##$AUNM= <au_zg>
##$AUTOPOS= <>
##$BF1= 200.13
##$BF2= 200.13
##$BF3= 200.13
##$BF4= 200.13
##$BF5= 200.13
##$BF6= 200.13
##$BF7= 200.13
##$BF8= 200.13
##$BYTORDA= 1
##$CFDGTYP= 0
##$CFRGTYP= 5
##$CHEMSTR= <none>
##$CNST= (0..31)
1 1 145 1 1 1 1 1 1 1 1 1 1 1 1 1 1 1 1 1 1 1 1 1 1 1 1 1 1 1 1 1 
##$CPDPRG= <>
##$CPDPRG1= <>
##$CPDPRG2= <>
##$CPDPRG3= <>
##$CPDPRG4= <mlev>
##$CPDPRG5= <mlev>
##$CPDPRG6= <mlev>
##$CPDPRG7= <mlev>
##$CPDPRG8= <mlev>
##$CPDPRGB= <>
##$CPDPRGT= <>
##$D= (0..31)
0 1.2 0 0 0 0 0 0 0 0 0 0.03 0 0 0 0 0 0 0 0 0 0 0 0 0 0 0 0 0 0 0 0 
##$DATE= 1554805894
##$DBL= (0..7)
120 120 120 120 120 120 120 120 
##$DBP= (0..7)
150 150 150 150 150 150 150 150 
##$DBP07= 0
##$DBPNAM0= <>
##$DBPNAM1= <>
##$DBPNAM2= <>
##$DBPNAM3= <>
##$DBPNAM4= <>
##$DBPNAM5= <>
##$DBPNAM6= <>
##$DBPNAM7= <>
##$DBPOAL= (0..7)
0.5 0.5 0.5 0.5 0.5 0.5 0.5 0.5 
##$DBPOFFS= (0..7)
0 0 0 0 0 0 0 0 
##$DE= 6
##$DECBNUC= <off>
##$DECIM= 24
##$DECNUC= <off>
##$DECSTAT= 4
##$DIGMOD= 1
##$DIGTYP= 9
##$DL= (0..7)
0 120 120 120 120 120 120 120 
##$DP= (0..7)
150 150 150 150 150 150 150 150 
##$DP07= 0
##$DPNAME0= <>
##$DPNAME1= <>
##$DPNAME2= <>
##$DPNAME3= <>
##$DPNAME4= <>
##$DPNAME5= <>
##$DPNAME6= <>
##$DPNAME7= <>
##$DPOAL= (0..7)
0.5 0.5 0.5 0.5 0.5 0.5 0.5 0.5 
##$DPOFFS= (0..7)
0 0 0 0 0 0 0 0 
##$DQDMODE= 0
##$DR= 18
##$DS= 0
##$DSLIST= <SSSSSSSSSSSSSSS>
##$DSPFIRM= 0
$$ [...]
##$SUBNAM2= <"">
##$SUBNAM3= <"">
##$SUBNAM4= <"">
##$SUBNAM5= <"">
##$SUBNAM6= <"">
##$SUBNAM7= <"">
##$SUBNAM8= <"">
##$SUBNAM9= <"">
##$SW= 24.9337058887773
##$SWIBOX= (0..15)
0 0 2 0 0 0 0 0 0 0 0 0 0 0 0 0 
##$SW_h= 4990.01996007984
##$TD= 16384
##$TD0= 1
##$TE= 0
##$TE2= 300
##$TE3= 300
##$TEG= 300
##$TL= (0..7)
0 120 120 120 120 120 120 120 
##$TP= (0..7)
150 150 150 150 150 150 150 150 
##$TP07= 0
##$TPNAME0= <>
##$TPNAME1= <>
##$TPNAME2= <>
##$TPNAME3= <>
##$TPNAME4= <>
##$TPNAME5= <>
##$TPNAME6= <>
##$TPNAME7= <>
##$TPOAL= (0..7)
0.5 0.5 0.5 0.5 0.5 0.5 0.5 0.5 
##$TPOFFS= (0..7)
0 0 0 0 0 0 0 0 
##$TUNHIN= 0
##$TUNHOUT= 0
##$TUNXOUT= 0
##$USERA1= <user>
##$USERA2= <user>
##$USERA3= <user>
##$USERA4= <user>
##$USERA5= <user>
##$V9= 5
##$VALIST= <valist>
##$VCLIST= <CCCCCCCCCCCCCCC>
##$VD= 0
##$VDLIST= <DDDDDDDDDDDDDDD>
##$VPLIST= <PPPPPPPPPPPPPPP>
##$VTLIST= <TTTTTTTTTTTTTTT>
##$WBST= 1024
##$WBSW= 4
##$XGAIN= (0..3)
0 0 0 0 
##$XL= 0
##$YL= 0
##$YMAX_a= 42407
##$YMIN_a= -54551
##$ZGOPTNS= <>
##$ZL1= 120
##$ZL2= 120
##$ZL3= 120
##$ZL4= 120
##$ABSF1= 10
##$ABSF2= 0
##$ABSG= 5
##$ABSL= 3
##$ALPHA= 0
##$AQORDER= 0
##$ASSFAC= 0
##$ASSFACI= 0
##$ASSFACX= 0
##$ASSWID= 0
##$AUNMP= <proc_1d>
##$AZFE= 0.1
##$AZFW= 0.1
##$BCFW= 1
##$BC_mod= 2
##$BYTORDP= 1
##$COROFFS= 0
##$CY= 11.3945322036743
##$DATMOD= 1
##$DC= 2
##$DFILT= <>
##$DTYPP= 0
##$F1P= 18.9103706918063
##$F2P= -1.10871071338519
##$FCOR= 0.5
##$FTSIZE= 0
##$FT_mod= 4
##$GAMMA= 1
##$GB= 0.15
##$INTBC= 1
##$INTSCL= 1
##$ISEN= 128
##$LB= 0.24
##$LEV0= 0
##$LPBIN= 0
##$MAXI= 10000
##$MC2= 0
##$MEAN= 0
##$ME_mod= 0
##$MI= 1.114404
##$NCOEF= 0
##$NC_proc= 0
##$NLEV= 6
##$NOISF1= 3.799351
##$NOISF2= 2.8
##$NSP= 1
##$NTH_PI= 0
##$NZP= 0
##$OFFSET= 15.70392
##$PC= 1
##$PHC0= -8930.637
##$PHC1= 13.40026
##$PH_mod= 1
##$PKNL= yes
##$PPARMOD= 0
##$PSCAL= 0
##$PSIGN= 0
##$REVERSE= no
##$SF= 200.130013532006
##$SI= 16384
##$SIGF1= 3
##$SIGF2= 2
##$SINO= 400
##$SIOLD= 16384
##$SREGLST= <1H.CDCl3>
##$SSB= 0
##$STSI= 0
##$STSR= 0
##$SW_p= 3612.71676300578
##$SYMM= 0
##$S_DEV= 0
##$TDeff= 0
##$TDoff= 0
##$TI= <>
##$TILT= no
##$TM1= 0
##$TM2= 0
##$TOPLEV= 0
##$USERP1= <user>
##$USERP2= <user>
##$USERP3= <user>
##$USERP4= <user>
##$USERP5= <user>
##$WDW= 1
##$XDIM= 8192
##$YMAX_p= 0
##$YMIN_p= 0
$$ End of Bruker specific parameters
$$ ---------------------------------
##NTUPLES= NMR FID
##VAR_NAME=  TIME,          FID/REAL,        FID/IMAG
##SYMBOL=    X,             R,               I
##VAR_TYPE=  INDEPENDENT,   DEPENDENT,       DEPENDENT
##VAR_FORM=  AFFN,          ASDF,            ASDF
##VAR_DIM=   8192,          8192,            8192
##UNITS=     SECONDS,       ARBITRARY UNITS, ARBITRARY UNITS
##FACTOR=    0.0002004,     1,               1
##FIRST=     0,             0,               0
##LAST=      1.6414764,     0,               0
##MIN=       0,             -54551,          0
##MAX=       1.6414764,     42407,           0
$$ Real data points
##PAGE= N=1
##DATA TABLE= (X++(R..R)), XYDATA
0 0 0 0 0 0 0 0 0 0 0 0 0 0 0 0 0 0 0 0 0 4 -8 8 -8 8 -8 8 -8 11 -12 16 -16 16 -20 22 -24 27 -28 32 -36 38 -44 46
42 46 -52 60 -66 73 -81 91 -104 119 -138 162 -194 237 -296 388 -538 809 -1395 3088 -16197 -54551
62 -54551 41966 12746 -50276 36101 23124 -49641 14297 23811 -33352 12457 23352 -26301
74 -26301 1205 11705 -16414 10139 10997 -15922 5559 3177 -14767 11666 8177 -13222 5831
87 5831 3008 -12592 5694 7290 -4108 1230 -2836 -1941 3854 -4894 4723 8198 -14230 334
101 334 13046 -15024 508 20607 -15565 -8844 19007 -10958 -7920 20321 -7609 -10473 13899
114 13899 -7968 -6195 15602 -7257 -4230 12755 -14413 -3711 20648 -12765 -6713 21803 -15436
127 -15436 -13735 26124 -6515 -16547 23213 -3887 -23046 18121 7054 -17074 10717 5767
139 5767 -16359 4173 8297 -5984 2729 2260 -5500 387 -658 1327 6549 -4802 -4040 5475 -4889
154 -4889 -1654 10623 -3865 -6525 6679 -3479 -4666 9373 -285 -5559 3896 -3337 -2986 7855
168 7855 -1404 -3495 5018 -4787 -3894 8395 -1616 -3995 6733 -3614 -6613 7074 1278 -3957
182 -3957 4144 -1425 -4433 3370 -10 -414 3611 -3531 -1448 3663 -4677 910 8080 -6390 -3882
197 -3882 8051 -5150 -4194 10896 -2668 -7957 7861 -903 -8005 7845 3522 -7603 2054 2190
211 2190 -4885 2251 3854 -2265 -1005 -76 -627 516 -1 2084 1020 -4385 -162 3062 -2332 1431
227 1431 3637 -4854 -1559 4122 -2608 -105 4834 -3178 -2690 2959 -1984 -6 4620 -2439 -2682 2296
243 2296 -1646 -252 3749 -1452 -1581 1449 -2177 -247 3236 -652 -541 357 -2671 819 2668 -1621
259 -1621 700 1177 -3642 511 2891 -2293 1013 2757 -4172 -1249 3755 -1275 -549 2904 -2197 -2305
275 -2305 2421 95 -972 1805 66 -1956 -507 826 1002 75 -151 136 -1605 -511 2476 -257
291 -257 -1370 2030 -894 -2921 2366 1501 -2024 1479 382 -3430 1201 2556 -1869 255 1582 -2338
307 -2338 -749 1992 -269 -23 1177 -1298 -1450 960 956 112 -32 -320 -559 -447 493 1030 -120 -241
325 -241 71 -1258 -247 1991 224 -1148 374 -496 -980 1386 756 -960 414 -19 -1524 476 1455
342 1455 -223 -207 -153 -984 203 1083 -5 -153 16 -595 -271 355 337 542 -13 -999 -342 538 293 343
362 343 143 -692 -331 395 -75 75 735 -129 -899 -125 350 206 453 94 -821 -332 575 84 -180 570
382 570 119 -902 -140 552 -46 295 489 -947 -667 1047 189 -675 708 162 -1190 343 705 -737
400 -737 482 924 -1404 -603 1468 -194 -683 1007 -283 -1143 917 368 -1023 733 772 -1376 -299
417 -299 1144 -279 -334 752 -457 -820 873 361 -943 434 794 -1015 -395 1005 -238 -359 850
434 850 -513 -926 1094 291 -1120 640 612 -1104 183 702 -773 302 860 -1067 -391 1051 -276
451 -276 -402 640 -291 -398 548 -179 -380 631 127 -646 -22 300 34 63 -7 -239 -57 276 18 -341
471 -341 251 339 -510 -149 409 -245 73 473 -714 -238 985 -436 -633 939 -139 -722 779 -157 -785
490 -785 1066 193 -1285 518 673 -867 256 588 -760 78 651 -641 -179 810 -111 -585 169 249
508 249 -81 71 131 -293 -152 493 -34 -547 490 429 -810 7 674 -485 47 667 -828 -293 1169
527 1169 -389 -783 931 -21 -861 684 200 -807 651 398 -1132 170 977 -537 -380 594 -249
544 -249 -369 611 -21 -619 425 394 -719 -59 757 -216 -424 393 -124 -327 631 38 -768 393 495 -665
564 -665 8 543 -358 -64 350 -447 -19 673 -320 -465 425 38 -197 257 -163 -179 370 -83 -346 285 179
585 179 -193 -22 -79 23 291 -108 -293 94 161 -6 -109 -82 90 53 -58 -17 -124 102 281 -411 -188 648
607 648 -209 -434 545 -265 -378 977 -351 -1017 1119 170 -1209 940 337 -1274 893 462 -1470 910
625 910 927 -1624 270 1040 -1076 313 819 -1218 157 956 -857 -1 656 -560 104 147 -537 608
643 608 174 -730 440 -136 -442 1092 -437 -993 1338 -293 -1207 1509 -150 -1345 1589 -312 -1719
660 -1719 1966 228 -1980 1476 232 -1782 1721 271 -2054 1628 483 -2109 1432 630 -1823
675 -1823 1368 310 -1959 1605 635 -2038 1229 572 -1726 1377 418 -1919 1384 599 -1853 1137
691 1137 606 -1538 1086 272 -1504 1286 389 -1518 924 200 -969 1185 -317 -1134 1439 -364
707 -364 -1087 1639 -569 -1149 1887 -865 -1438 2512 -554 -2058 2211 -304 -1909 2483 -173 -2508
723 -2508 2265 361 -2518 1973 759 -2403 1416 661 -2180 1532 1041 -2207 759 916 -1521 934
739 934 698 -1588 747 645 -1360 715 663 -1030 525 88 -910 1024 157 -1035 773 -122 -762 1253
757 1253 -366 -1126 1518 -263 -1457 1565 42 -1494 1489 -34 -1728 1670 442 -1975 1122
772 1122 661 -1559 1054 473 -1599 1009 601 -1502 857 566 -1307 810 294 -1271 1155 443 -1656
789 -1656 782 693 -1241 817 494 -1448 672 728 -1202 505 689 -974 246 291 -659 749 243 -980
807 -980 420 176 -509 814 -109 -868 857 -18 -933 970 240 -904 645 -87 -826 1061 215 -1072
825 -1072 565 140 -706 777 53 -809 765 33 -970 690 370 -681 385 -2 -629 593 258
842 258 -589 216 127 -216 232 -175 -74 446 -307 -242 388 -249 35 471 -587 -108 746 -449 -379 596 -173
863 -173 -156 409 -393 -181 540 -180 -182 218 -175 64 115 -389 247 338 -419 -37 121 -208 391 101 -567 267
885 267 194 -428 301 108 -358 428 -128 -640 647 265 -647 346 13 -620 685 209 -836 472 348
904 348 -803 232 437 -447 269 126 -657 273 439 -353 46 62 -262 270 4 -280 375 24 -343 172
924 172 -116 -26 530 -339 -402 546 -152 -283 535 -307 -289 699 -426 -561 902 -65 -691 631 -118 -603
944 -603 818 -5 -874 665 299 -825 331 354 -541 312 202 -651 231 429 -407 -45 175 -130 103
963 103 -39 -216 250 55 -243 69 -104 -27 364 -246 -303 407 -64 -297 319 -96 -198 453 -222 -447 564
984 564 118 -477 252 21 -315 420 18 -500 369 190 -484 154 203 -227 226 2 -430 277 251 -334 67
1005 67 108 -200 186 6 -326 272 238 -409 -22 207 -113 119 70 -297 92 245 -209 -102 167 25 -41 -80
1027 -80 -79 108 73 -70 -52 -91 76 186 -223 -139 331 -50 -292 176 24 -127 275 -79 -407 329 257 -414 52
1050 52 277 -239 -2 190 -270 47 383 -260 -308 284 109 -159 66 10 -143 106 68 -195 30 274 -77
1071 -77 -334 70 226 -97 -49 95 -174 -12 273 -170 -210 382 24 -434 111 229 -147 110 53 -363 95
1092 95 351 -226 -157 273 -37 -218 52 64 6 112 -65 -235 2 241 35 -169 -1 112 -98 -81 102 32
1114 32 45 53 -206 -136 286 150 -194 -50 64 -41 9 54 -26 35 50 -156 -143 169 235 -92 -207 33 47 -29 113
1139 113 -14 -141 132 33 -322 99 404 -171 -260 139 -75 -53 320 -84 -335 242 126 -365 93 350 -155
1160 -155 -157 99 -128 -1 334 -54 -371 135 223 -227 -56 281 -49 -195 73 -44 -88 324 92 -420 15
1181 15 309 -163 -69 259 -87 -141 192 -134 -154 389 78 -402 13 205 -91 48 97 -176 -2 158 -135 -102
1203 -102 250 112 -250 -139 145 43 -17 95 -104 -173 213 70 -292 162 277 -275 -132 199 -66 79 211
1224 211 -283 -133 278 -56 -141 121 22 0 -45 -168 139 194 -127 -17 -21 -176 267 116 -346 168 237 -367 16
1247 16 250 -176 149 154 -458 62 378 -201 -45 164 -169 33 81 -201 152 163 -167 -25 -92 -10 353 -164
1269 -164 -296 332 -139 -267 459 -182 -320 622 -262 -656 741 158 -670 499 32 -689 604 251 -759
1288 -759 438 361 -689 157 337 -343 262 124 -521 197 247 -227 184 -37 -209 315 -185 -282 500 -41
1308 -41 -334 303 -213 -174 615 -222 -420 514 -158 -368 511 -161 -305 570 -296 -499 664 2 -409 434
1328 434 -177 -369 557 -131 -408 529 -77 -444 349 -110 -156 546 -274 -446 537 -106 -324 538 -162 -405
1348 -405 561 -155 -550 646 189 -619 228 138 -390 369 218 -486 139 245 -342 23 246 -74 38 -58
1368 -58 -216 179 170 -97 35 -88 -111 227 -56 -180 305 9 -344 135 63 -107 350 -87 -455 301 160 -353
1390 -353 276 135 -432 246 95 -510 379 373 -581 47 302 -409 218 339 -547 102 381 -499 33 432 -292
1411 -292 69 173 -530 205 462 -451 36 334 -445 116 390 -454 157 461 -555 -125 486 -201 11 268
1431 268 -404 -39 351 -214 -25 204 -152 29 -37 -196 342 126 -349 138 2 -225 408 0 -455 390
1451 390 74 -544 353 223 -420 326 75 -635 381 412 -579 87 340 -448 75 338 -381 54 395 -360
1471 -360 -216 356 18 -154 99 -44 -121 98 81 -113 -34 194 -32 -267 81 224 -92 -6 23 -159 78 166
1493 166 -158 -24 168 -88 -122 22 42 128 23 -181 -38 45 54 96 -100 -44 148 -113 -133 194 26 -54 67
1516 67 -224 -51 343 -64 -196 166 -68 -108 171 -86 -71 246 -141 -236 160 53 11 55 -220 6 227 -170
1538 -170 -7 185 -189 33 179 -343 95 474 -341 -210 366 -176 -102 377 -228 -208 384 -121 -290 297 75
1559 75 -156 75 -122 -61 235 -35 -130 62 -55 13 45 -151 93 207 -242 -115 173 -77 40 145 -256 -22
1581 -22 270 -199 -104 255 -86 -90 124 -194 -33 361 -124 -287 197 27 -173 160 13 -168 171 24 -267
1602 -267 101 251 -116 -88 18 -16 74 46 -51 -15 -1 9 4 -103 94 230 -193 -205 209 41 -105 192 -72 -221
1626 -221 246 47 -318 209 209 -298 -50 123 -116 129 147 -258 -50 167 -71 -39 81 -25 35 -51 -165 120
1648 120 157 -91 -13 -64 -83 194 23 -198 129 55 -222 56 75 -90 188 5 -351 104 243 -178 14 120
1670 120 -203 41 155 -205 32 284 -151 -215 132 75 -3 79 -57 -117 43 77 -43 -37 128 59 -214 -70 204
1693 204 25 -52 67 -147 -120 260 22 -219 159 118 -275 -22 200 -43 30 94 -254 -86 290 26 -163 85
1715 85 16 -138 9 69 2 83 20 -211 -75 203 118 -90 -58 -10 -43 20 61 8 38 21 -158 -124 149 177 -65 -95
1741 -95 -28 -33 66 125 -50 -46 85 -89 -170 159 189 -94 -84 -45 -102 126 189 -134 -89 125 -89 -139 139 92 -51 -37
1767 -37 -144 -130 174 171 -96 -128 -3 1 -32 31 105 8 -84 -61 -67 41 243 25 -275 -10 123 -75 66 155 -142
1792 -142 -64 59 -159 18 351 -27 -267 -2 33 21 168 -1 -138 9 -3 -84 66 141 44 -123 -185 38 152
1815 152 42 14 -81 -173 65 118 -121 107 177 -271 -173 142 3 103 169 -287 -199 221 -3 -74 190 -45 -193
1838 -193 29 -59 22 268 -2 -257 -72 44 77 130 -39 -89 -20 -102 -1 126 43 87 -76 -331 81 321 -77
1861 -77 -14 78 -275 -15 266 -137 -1 294 -278 -294 265 80 -23 197 -206 -273 214 84 -71 142 -12 -133
1883 -133 -40 -78 151 260 -141 -149 -4 -136 175 268 -259 -56 183 -330 -49 401 -97 -53 160 -387 -63 491
1905 491 -80 -176 199 -252 -133 340 -93 -31 308 -293 -296 299 66 46 214 -302 -174 266 -79 34 252 -208
1927 -208 -106 103 -273 199 451 -360 -165 204 -316 137 492 -379 -146 376 -409 -141 583 -116 -201 214
1947 214 -373 -145 525 -52 -202 157 -237 -113 274 -92 71 234 -413 -162 288 -82 159 235 -486 -100
1967 -100 373 -241 66 398 -332 -171 226 -286 131 528 -323 -268 218 -202 70 436 -247 -143 229 -311
1987 -311 -67 439 -54 -76 50 -406 25 427 -130 -37 137 -376 -10 331 -220 160 322 -543 -183 446 -158
2008 -158 68 394 -512 -268 500 -179 -142 529 -221 -420 269 -80 -45 513 -134 -459 148 16 -30 320 -47
2029 -47 -211 60 -191 -19 330 7 -59 -32 -376 126 429 -160 -10 143 -419 23 396 -227 119 350 -589
2050 -589 -211 509 -149 40 380 -515 -235 485 -187 -54 469 -306 -303 245 -191 93 499 -349 -324 220 -196
2071 -196 82 422 -298 -141 219 -385 -20 531 -147 -145 107 -399 25 505 -144 -129 156 -302 -63 299 -73
2092 -73 105 140 -426 -87 242 -12 226 35 -432 94 145 -221 319 178 -421 102 23 -363 482 321 -571
2113 -571 52 151 -409 360 366 -502 111 214 -533 162 497 -259 -31 78 -436 135 406 -180 -31 45 -266
2134 -266 50 119 -27 243 -62 -352 79 39 26 359 -159 -378 241 -34 -198 413 8 -356 175 -126 -221
2155 -221 510 112 -408 114 -61 -205 392 69 -280 200 -109 -322 314 146 -135 184 -231 -340 373 131
2175 131 -200 216 -110 -319 264 46 -149 348 -51 -457 162 120 -96 280 -60 -399 154 89 -188 233 112
2196 112 -261 3 -41 -101 289 108 -245 -40 -46 -27 219 -12 -100 129 -182 -184 266 52 -49 173 -258 -234 398
2219 398 64 -199 244 -88 -314 264 47 -173 347 -16 -455 149 168 -121 236 -16 -352 148 91 -183 222
2240 222 97 -256 46 -26 -136 322 93 -332 33 9 -130 262 53 -218 147 -64 -297 248 178 -156 116
2261 116 -115 -292 283 161 -230 119 15 -282 112 116 -106 199 14 -319 45 143 -10 152 -65 -209 97
2282 97 -6 -87 207 10 -158 68 -128 -48 350 -14 -254 101 -66 -116 283 4 -185 180 -82 -241 236
2303 236 161 -118 85 -104 -194 236 112 -155 70 -4 -172 58 53 -2 147 -47 -209 19 70 62 95 -82 -110 77
2327 77 -51 -43 139 4 -92 -11 -106 -14 225 12 -170 6 19 -34 97 49 -42 21 -34 -92 47 112 43 -65 -120 6
2353 6 69 35 15 -3 -68 19 -12 -77 98 107 -136 -107 42 8 57 75 -109 -69 79 -31 -45 102 42 -72 -48 -30 8
2380 8 111 42 -107 -62 37 25 -31 28 42 -34 -62 -28 8 52 84 -83 -125 59 59 -54 15 33 -73 4 11 -70 54 120
2408 120 -77 -116 49 77 17 14 -20 -38 26 13 -25 11 74 9 -111 -21 101 34 -44 -8 -51 -43 95 -6 -103 71 50
2435 50 -129 -22 91 -4 27 25 -120 1 124 -43 -73 43 10 -49 -12 3 39 47 -37 -72 -8 59 68 -75 -43 60 -2
2462 -2 -60 35 15 -35 70 -56 -118 136 83 -119 7 65 -52 54 69 -99 27 110 -96 -69 99 20 -31 1 -37
2487 -37 -1 59 -9 -50 -27 39 32 -83 -26 120 -27 -98 59 -15 -46 118 -48 -147 118 62 -167 47 89 -94 39
2512 39 34 -115 52 122 -95 -53 62 6 4 -13 -21 37 11 -42 13 -15 34 90 -105 -48 157 -10 -93 87 -30 -51 147
2539 147 -59 -118 173 43 -167 59 66 -61 79 -6 -114 80 69 -95 5 42 10 15 -61 -10 83 -32 -35 14 -66
2564 -66 48 98 -157 -43 173 -92 -92 132 -50 -53 154 -99 -133 195 17 -170 94 50 -87 77 15 -115 82
2587 82 48 -105 -13 34 17 10 -53 5 86 -32 -34 47 -50 22 85 -125 -51 190 -50 -129 113 -17 -67 115 -52 -126 142
2614 142 22 -142 59 68 -44 51 -16 -58 90 14 -70 19 -3 11 57 -108 -18 144 -55 -96 99 -43 -41 148 -103
2639 -103 -110 210 -6 -167 156 11 -123 156 -12 -184 199 65 -234 84 116 -143 59 60 -139 88 93 -141
2661 -141 12 87 -37 27 -41 -31 87 -33 -63 88 -52 -37 132 -131 -86 248 -65 -192 195 -3 -166 178
2683 178 -29 -201 205 38 -231 109 86 -127 70 1 -118 135 28 -135 58 7 -58 97 -67 -57 158 -56
2705 -56 -119 120 -9 -55 120 -87 -98 164 -32 -117 133 -9 -68 104 -62 -61 181 -19 -134 93 -4 -37 87
2728 87 -54 -66 109 -44 -81 87 17 13 20 -111 17 144 -73 -47 82 -86 0 101 -108 -24 161 -88 -129 104
2752 104 28 -29 36 -69 -64 57 9 -33 1 30 21 -70 -67 80 32 -72 28 -36 -56 128 12 -110 80 58 -133 24
2778 24 66 -47 71 19 -136 31 112 -42 -26 25 -42 -10 9 -20 27 39 -48 -63 -10 80 68 -58 -35 16 -40 24 59
2805 59 -55 17 66 -124 -54 144 -5 -61 34 -56 -51 121 -25 -90 84 -2 -102 26 6 3 59 -74 -99 69 32 -36
2831 -36 49 -37 -40 77 -37 -39 131 16 -114 26 -11 -39 126 6 -111 59 35 -74 41 56 -33 25 -27 -81 94
2856 94 82 -55 -14 -16 -29 62 -3 -41 70 -12 -90 16 -4 24 65 -80 -101 94 5 -44 95 -39 -78 85 -58 -91
2882 -91 177 17 -148 43 -18 -64 145 -16 -162 91 15 -117 88 54 -81 74 -51 -121 139 61 -102 36
2904 36 -18 -79 126 7 -105 109 -1 -161 55 51 -30 89 -36 -143 97 54 -89 69 20 -84 64 -23 -73
2927 -73 120 21 -112 10 -8 -13 107 -31 -83 80 -37 -65 82 -1 -16 70 -115 -71 148 -13 -68 72 -56 -49 115
2952 115 -48 -60 140 -29 -122 88 5 -26 122 -68 -121 118 19 -85 73 17 -67 49 -43 -53 123 34 -93 8
2976 8 12 4 71 -30 -50 46 -16 -41 39 -3 3 24 -101 -34 100 4 -24 16 -45 -10 52 -50 -10 86 -36 -63 9 -4 31 39
3006 39 -84 -32 65 -20 0 37 -32 10 28 -95 13 109 -18 -47 7 -40 47 90 -88 -15 80 -68 -42 79 -27 -14
3032 -14 52 -84 -53 89 9 -58 24 -7 -20 33 -22 -12 56 -2 -63 -16 17 62 1 -70 -10 24 -26 26 12 -46 37 2 -97
3061 -97 38 78 -47 -21 2 -55 32 48 -77 -13 62 -55 -35 33 5 38 11 -87 13 68 -27 14 13 -38 44 26 -81 42
3089 42 81 -86 -20 42 -38 56 61 -101 1 89 -61 -21 57 -14 4 16 -72 -6 86 -7 -33 6 -7 34 6 -53 32 32 -41
3118 -41 4 -15 -18 75 -11 -89 41 42 -78 21 34 -59 41 24 -84 26 95 -61 -27 33 -34 32 29 -49 9 45 -21 -6 11
3147 11 15 55 -37 -56 45 26 -30 44 -9 -32 74 -12 -80 77 45 -91 19 23 -64 56 41 -108 15 80 -63 -30 49
3174 49 -18 12 18 -56 9 58 -3 -35 -26 21 57 -51 -32 62 -25 -44 50 -29 -34 108 -35 -127 91 53 -95 45 37 -78 44
3203 44 24 -95 59 84 -67 -30 33 -20 33 19 -32 8 41 -29 -1 12 7 38 -39 -55 66 13 -34 48 -37 -39 83 -40
3231 -40 -76 103 15 -99 43 21 -66 85 13 -113 53 74 -95 13 61 -42 8 1 -50 41 22 -26 6 -31 -8 69
3257 69 -50 -58 103 -16 -83 88 -12 -69 129 -7 -142 100 54 -112 53 48 -89 55 31 -87 55 65 -71
3280 -71 4 31 -19 41 5 -60 53 21 -57 29 -2 -9 56 -44 -68 83 9 -48 61 -34 -50 106 -44 -102 125 19 -124
3307 -124 72 24 -79 89 17 -133 57 78 -76 19 58 -36 12 -1 -39 55 15 -36 8 -24 -16 86 -43 -66 118 -9
3333 -9 -99 60 21 -45 73 -6 -83 64 46 -60 8 26 -29 23 -5 -47 49 17 -54 -2 -3 9 43 -33 -53 44 -1 -58 20
3362 20 -2 -14 26 -44 -60 55 -8 -63 15 -14 -37 55 -3 -59 58 41 -73 -12 62 -40 -10 32 -41 -22 65 -17 -70 22
3390 22 36 -42 -40 40 13 -38 -1 12 -33 27 56 -54 -36 77 -17 -65 38 25 -26 22 -2 -65 39 44 -35 -25 37 -5 -15
3419 -15 15 -6 6 20 -21 -30 33 7 -26 -24 -21 2 26 4 -41 -9 49 -11 -45 29 16 -15 -9 -14 -22 28 12 -49 -14 41 -7 -19 -1
3452 -1 3 26 -15 -17 13 11 2 19 -29 -19 61 -3 -68 42 48 -35 4 14 -41 31 36 -73 3 59 -22 -15 7 1 17 -6 -35 13 22 -14
3486 -14 5 -40 -23 66 -28 -67 39 16 -56 36 -10 -44 62 -12 -85 46 28 -45 32 -15 -54 68 -4 -93 64 30 -60 52
3514 52 3 -46 76 9 -87 52 38 -66 22 0 -51 61 -8 -82 64 20 -61 38 0 -65 67 2 -93 53 36 -65
3540 -65 19 28 -45 59 16 -85 23 38 -42 2 3 -31 42 -28 -54 44 3 -42 37 -48 -35 66 -44 -81 73 0 -69 42
3568 42 -2 -54 63 -11 -88 56 43 -53 22 6 -44 56 8 -68 40 32 -64 15 13 -28 41 5 -69 20 42 -46 0 28 -25
3597 -25 9 6 -56 11 31 -47 -1 5 -9 30 -5 -51 28 29 -40 2 5 -26 24 16 -49 33 27 -39 -10 10 -16 36 -7 -69 35 31 -48
3630 -48 1 18 -39 31 10 -67 30 50 -39 2 38 -29 14 23 -55 12 57 -37 -13 29 -11 18 6 -40 21 33 -33 5 23 -22 28
3661 28 3 -62 2 35 -38 -23 18 -24 -3 7 -51 -8 41 -20 -14 11 -14 13 -14 -35 19 22 -24 -3 -12 3 23 -17 -40 27 20 -36
3693 -36 4 -10 -9 47 -13 -53 48 29 -61 5 9 -27 23 24 -42 10 61 -52 -5 40 4 -4 18 -26 3 35 -19 -14 1 28 22 -22
3725 -22 -14 24 -5 -29 -4 -9 1 32 -25 -20 29 8 -17 -2 -1 -2 21 -21 -38 17 20 -27 -22 -10 4 20 -20 -7 25 -5 -16 -2 6 17
3759 17 12 -21 -15 27 7 -3 -11 3 22 24 -20 -1 33 8 -14 -1 18 12 25 -6 -20 20 19 1 -20 15 21 -27 -24 -1 1 -5 -1 -32 -12 30
3795 30 -2 -20 -3 16 -10 -2 -18 14 26 1 -29 -6 17 9 4 -36 8 25 -18 -36 22 25 -14 -1 -8 1 31 8 -33 -4 8 -2 -14
3828 -14 -1 5 7 4 3 3 17 42 -11 -28 16 24 -1 -10 28 -5 6 3 -23 6 47 -19 -52 21 1 -1 14 -25 -16 38 -14 -29 18 23 -26 -12
3864 -12 -30 -28 11 15 -47 -13 12 -18 -9 7 -6 4 5 -23 5 31 10 1 -21 -2 26 -4 -29 30 11 -19 19 0 -12 43 7 -48 30
3897 30 25 -3 10 14 -5 32 -3 -28 17 18 -1 2 0 -12 45 -8 -30 24 7 -26 29 -11 -16 47 -2 -62 26 29 -35 13 7 -46 36 20
3931 20 -54 30 32 -41 12 23 -22 38 20 -47 19 37 -12 8 9 -17 33 12 -45 29 35 -17 -5 9 -7 39 15 -40 17 24 -26 -2
3963 -2 4 -10 32 -8 -54 12 26 -23 2 -2 -15 31 7 -45 31 28 -33 4 15 -11 37 10 -49 8 10 -24 -7 0 -28 9 11 -34 21 37
3997 37 -39 -10 20 -10 1 20 -12 -17 31 3 -18 6 22 7 -19 -7 23 12 4 1 -16 -14 35 20 -31 18 35 -39 -25 29 -5 2 13
4030 13 -31 -33 55 -1 -25 31 9 -23 13 2 -16 18 5 -38 -3 15 -2 -2 -21 -23 8 -10 -28 10 23 -15 -13 -20 3 25 2 -25 -11
4063 -11 1 2 15 -3 -17 28 -18 -34 28 38 -17 7 13 -29 27 41 -25 10 38 -7 -24 20 26 -2 -11 -26 -4 0 22 9 -35 0 24
4096 24 -6 -25 36 22 -48 0 8 -31 32 36 -63 -19 49 -23 -22 45 4 -18 31 -21 -37 44 13 -45 14 21 -6 12 10 -30 6 -9 -19
4129 -19 14 16 2 -7 -22 -1 33 1 -3 20 -13 -1 36 -24 -9 59 -26 -46 46 -15 -23 62 -28 -57 51 21 -54 21 36 -42 3 4
4161 4 -17 22 6 -35 -8 3 0 15 -28 -2 27 -35 -16 45 -14 -3 49 -49 -34 86 -12 -58 55 -2 -60 56 10 -63 64
4190 64 20 -85 33 37 -38 13 23 -28 4 20 -25 -1 28 -13 -7 -11 11 36 -5 -9 19 -23 -3 43 -36 -6 56 -32 -50 43 4
4221 4 -42 45 -18 -66 47 17 -69 9 29 -41 2 16 -25 9 4 -40 0 14 9 11 -22 -13 32 -22 -17 41 -14 -27 25 -18 -28 61 11
4254 11 -69 17 16 -32 6 31 -42 3 21 -34 2 48 0 -17 14 -18 -1 31 9 -2 10 20 4 -3 21 27 -13 -17 15 0 2 26 -29
4287 -29 -24 48 -6 -52 34 20 -37 13 23 -21 18 41 -58 -19 34 -15 -35 26 4 -14 1 -3 -20 20 22 -14 -10 8 42 -5 10 23
4319 23 -9 -14 18 -9 -12 35 4 -39 16 35 -16 4 27 -21 -5 20 -6 -3 30 2 -14 21 23 3 -3 1 -17 -6 23 -7 -23 3 18
4352 18 -41 -19 20 -8 -22 13 -28 -32 23 11 -35 1 8 -35 -7 17 -2 8 24 -27 -22 34 14 -15 3 30 -12 -7 18 2 -5 23 8
4385 8 -28 24 31 -31 -4 13 -14 -10 27 11 -16 23 5 -23 21 12 -15 1 4 0 -10 7 -2 -23 11 23 -37 -13 34 8 -21 20 1 -19
4419 -19 22 3 -42 0 18 -34 -16 34 0 0 15 -13 -7 33 -1 -20 17 25 -14 -5 22 16 3 -2 -9 -17 6 16 -22 -9 34 -9 -21 29
4453 29 0 0 28 -7 -18 24 33 -25 4 6 -10 2 10 -2 -2 8 -10 -17 -2 6 14 -14 -2 14 3 -13 10 -5 -3 6 -8 -6 22 10 -40 2
4489 2 10 -17 8 1 -13 8 27 -24 -15 30 -12 -9 4 3 14 18 -5 -7 -4 9 23 -18 10 24 1 -8 26 4 -4 23 -11 -39 26 17 -34 7
4525 7 10 -35 -4 15 -45 6 29 -37 -17 16 -3 -2 13 -6 -3 2 -15 -20 6 -10 11 -14 -16 17 -4 -30 8 -6 -19 26 2 -18 15 11
4559 11 -35 -6 14 -21 -1 14 -27 -11 15 -3 -14 17 8 -8 -3 12 9 24 -2 0 -2 9 7 -3 -9 11 -8 -16 15 -4 -20 2 0 -26 20
4594 20 32 -32 -8 21 -24 -11 4 -30 -18 15 -32 -24 29 4 -18 -8 -11 2 0 -9 -2 3 6 -3 -8 -9 21 7 -30 -7 -1 -8 13 4 -23 7 25
4631 25 -20 -2 27 -16 -10 11 10 0 21 -11 -15 3 -6 -9 7 -2 14 -1 -15 -6 11 -4 11 4 -12 12 17 -10 -4 15 0 -10 1 -14 0
4666 0 16 -27 -12 23 -5 0 14 -17 -14 16 -16 -29 21 10 -20 -7 13 -16 16 9 -16 3 3 -20 -5 13 19 4 0 2 28 6 -4 -2 -15
4701 -15 1 18 -8 -4 9 6 -17 7 -1 8 15 -14 -23 4 3 -2 9 7 -2 -4 -4 -13 5 3 -23 4 -12 -9 14 -12 -15 10 5 -22 -3 7 -6 0 -4 -17
4741 -17 8 15 -15 -14 24 4 -6 8 4 8 10 -9 -14 18 6 -2 -4 -9 16 8 -4 -9 -3 6 -10 -8 4 10 8 -7 -4 1 12 11 -3 -12 6 8 -15 -7 6
4782 6 -22 -11 7 -26 -3 5 -17 -27 7 0 -21 -7 1 -7 1 0 -4 17 8 -18 -6 3 -9 -3 -4 -3 21 11 -8 -5 11 2 5 -2 -3 19 14 -6 8 12
4822 12 0 9 -3 -1 16 7 -6 -4 0 -7 9 -11 -6 5 -3 -4 23 6 -9 21 -17 -27 18 15 -19 4 2 -19 1 4 -23 7 8 -18 9 13 -14
4859 -14 2 2 -16 -12 13 -15 -6 9 -9 -8 -6 -13 12 19 -7 1 9 -4 16 6 -12 9 3 -16 -4 10 -12 -7 -7 -14 9 0 -11 -3 3 -8 -11 -8 -18
4898 -18 3 3 -22 -8 1 -6 -11 -15 -28 16 5 -5 -10 0 -18 0 2 -11 10 11 -20 -5 9 -3 -6 -2 -19 -23 21 -10 -12 30 -3 -14 -7 -8 3
4935 3 9 16 -19 20 0 -10 5 -13 -5 11 -14 0 2 -5 6 -4 -18 -5 -6 -21 -6 -15 -10 -7 -11 -11 9 9 -14 -16 -9 -13 -5 -3 -9 -2 -3 1 -3 10 6 -9
4977 -9 -12 -7 -1 -8 -8 -4 19 -11 -4 -8 -7 -4 2 -3 -6 11 12 -2 -12 -11 -2 17 14 -2 13 1 -18 -2 0 -7 9 11 4 3 20 33 -1 14 6 -7 -6 3 -1 2
5021 2 -6 -24 3 2 -14 -13 -13 1 1 -3 -15 2 -3 7 4 3 -1 9 -9 -1 -6 7 1 0 2 -4 6 -19 -2 10 7 12 -6 -7 5 16 0 5 1 -13 0
5062 0 -15 -7 2 11 -12 -2 14 5 0 6 4 3 15 6 -7 9 8 -11 2 -14 -10 10 -5 -4 -15 -6 -3 -6 -1 -9 -4 4 -3 -4 -1 -1 -8 -6 -5 -5 -14 -3 0 -13 -1
5107 -1 -2 -2 7 -2 -23 5 8 -11 6 3 -4 9 10 -11 -3 15 -5 -10 1 -2 -12 3 4 -17 10 5 1 6 8 -1 -5 7 -19 3 14 -4 -6 9 6 -2 -2 -18
5149 -18 -4 3 -11 -7 -4 -1 -1 -16 -11 -1 5 -4 -7 -16 -12 -8 -4 -7 -2 0 -8 3 14 0 8 9 -4 10 17 -10 -8 -2 -2 3 -2 -14 0 8 -5 -10 8 -6 5 2
5193 2 -4 8 2 2 13 5 9 1 0 -18 -6 9 -9 7 3 -5 6 10 -9 14 21 -7 4 7 -11 -6 0 -28 -9 13 -5 -14 -8 -15 -14 -5 -4 6 -2 -6 0 11
5235 11 14 15 7 0 1 23 -5 0 17 7 -2 0 18 16 13 4 -8 4 20 10 2 11 0 6 -7 3 4 -4 9 2 -7 -2 -2 -14 -8 -4 -3 10 5 -10 -13 2 -4
5278 -4 -9 -13 -15 -7 -3 -4 -2 -9 -15 1 -6 -4 1 -5 -16 2 8 2 -16 -7 1 -6 -19 -9 2 -1 4 -3 -2 11 7 2 -4 4 3 -3 1 9 5 12 4 -5 -9 5 1 -9 4 2 9 -2
5328 -2 -3 0 -5 -1 -11 0 -13 8 4 5 3 -13 1 -12 -3 2 -5 -9 -4 -2 11 -9 -13 6 10 -7 -17 -7 4 2 3 -14 -2 5 -8 1 7 3 9 -3 -5 14
5370 14 14 6 1 2 7 14 8 -1 -1 6 -2 14 -8 -1 -2 -12 -13 3 2 -2 -10 -10 2 -7 -12 -14 -2 0 -6 -13 -4 -18 0 -16 -21 -16 6 3 -8 -1 7 -13 -14 6 -9 -6
5416 -6 0 -12 -6 0 2 -10 -13 -2 -2 -2 -9 -1 3 -1 3 -1 4 6 1 8 -6 0 1 10 3 6 8 6 3 1 1 9 -5 6 -9 -4 10 -13 4 4 4 -4 -6 -9 -8 -1 -9 -4 -3 -10 -10
5467 -10 -10 -1 -11 -17 -13 -3 19 -8 -7 -3 2 -4 -1 0 -10 10 -7 0 -1 1 4 8 3 -3 0 13 1 5 -7 10 -6 0 7 10 3 0 3 -7 -4 -9 -12 -1 11 6 -5
5512 -5 13 -10 6 9 -17 1 8 -11 -8 -20 -3 -14 2 -3 -22 -7 -9 -8 3 1 8 6 -5 4 1 -6 -7 8 -9 -13 -6 -9 -9 6 -2 -11 -5 0 17 0 -10
5553 -10 -13 -10 1 -16 -16 2 -10 -1 -2 6 -8 3 -5 -6 -8 -7 0 3 0 12 -4 2 9 8 -6 5 -3 -9 16 -3 -3 4 -6 -20 -5 -10 -14 2 -10 -2 -7 -11 -8
5596 -8 -10 -2 -12 0 -4 -7 4 10 0 9 11 2 8 6 3 12 -5 6 1 2 5 3 -3 15 -1 7 -4 0 -6 -7 4 -4 -3 -14 -1 10 -3 -4 -2 5 -1 -19 -6 -10 -9
5641 -9 -18 -10 -3 -2 -4 -3 4 7 3 -11 -11 -6 -12 0 10 -8 3 -11 -13 -4 0 -18 -7 -12 -13 -4 -4 7 9 10 13 8 1 10 8 5 5 2 2 4 9 1 -4 3 -3 15 -7 -2 4 -7
5691 -7 -4 4 -12 -14 -8 -7 0 -4 9 -1 -12 -7 -8 0 0 -4 -6 -2 2 -10 2 -3 4 -2 3 3 -2 -8 -12 -11 -4 -16 -17 -11 1 -17 -18 -20 -7 -2 -7 -5 0 8 5 3 10 7 0 10
5741 10 -12 5 -5 -2 -2 -5 4 0 7 8 7 -1 6 0 2 -12 -10 2 -11 -11 4 0 -13 2 -8 1 -6 -12 -8 1 5 -16 -7 10 -6 2 -2 -13 -5 0 -2 -10 -5 -3 3 -21
5787 -21 -8 -9 -3 5 -4 -7 5 -8 -3 11 1 2 -2 -4 -3 -2 -5 -3 5 -2 12 8 5 4 10 12 0 1 5 3 2 -6 -8 -1 -3 -7 -2 -2 -2 -15 -10 -5 0 -1 -16 -3 -4 -1 -7 -7
5837 -7 11 -15 -5 -12 2 3 -4 -12 -13 -8 3 5 7 5 -5 -1 -2 4 11 -4 4 -4 -5 5 -4 -3 -8 9 -6 3 7 -8 -1 6 0 7 3 1 0 -4 7 3 -1 7 -11 -1 -2
5884 -2 6 -3 0 4 7 -4 3 -6 -3 -10 -10 -8 -3 -2 -6 3 -7 -14 -10 -2 0 7 12 5 -7 -3 5 14 -11 0 6 7 -15 -1 13 3 -2 9 7 0 3 1 -1 -1 10 -4 2 -1 1
5933 1 6 2 12 11 3 -2 6 -2 -3 10 3 7 -5 6 7 -7 -6 -7 0 -5 4 -10 3 3 -4 -1 -2 -4 -1 4 -8 -12 0 3 5 -8 -3 -9 2 -2 7 10 2 4 -3 2 7 4 7 6
5983 6 -4 1 -10 -5 7 3 12 6 2 4 2 0 1 0 -2 7 8 -11 -3 -8 -18 -6 -3 3 -2 3 12 -13 -3 0 14 5 2 6 6 -1 -4 0 -14 -16 -6 5 -9 -3 7 1 1
6030 1 -7 0 12 5 7 11 1 -4 3 2 -12 9 -5 0 6 -10 11 8 -14 -4 9 7 -9 10 -14 -2 3 -4 -2 -1 3 -4 1 -7 -12 -3 -3 -2 1 -7 -10 1 -2 -10 -2 -8
6076 -8 -9 -5 3 -6 -17 -3 8 -13 -11 -7 -2 -5 -8 -1 3 3 -7 -1 5 7 3 3 1 -2 1 4 1 -6 -2 -1 3 4 3 2 17 3 14 9 2 -4 0 1 -4 -3 2 -4 -2 -5 -4 -4 -5 -19
6128 -19 -7 -2 11 -3 -17 3 -1 -10 -11 0 -2 -18 6 -10 -17 -5 -7 -3 1 -6 6 -12 -11 -1 -16 -6 3 4 -17 8 -7 -8 -4 -13 10 -4 0 -5 -10 6
6168 6 1 -1 7 -1 -7 11 7 -3 14 6 -2 5 11 -2 -13 5 -10 -7 -4 -7 -3 -1 -7 -6 -1 2 -12 -17 -12 -5 6 -11 5 -10 2 -10 9 3 9 1 1 -11 -3 6 3
6213 3 4 9 -8 2 5 -19 5 4 -8 -9 7 8 -5 -15 0 -5 17 1 0 -2 8 20 6 7 13 4 -5 -9 -3 -4 8 -11 -12 4 0 -5 -5 -4 -6 5 -7 -11
6255 -11 -9 8 -5 -1 2 4 -13 -7 -19 -13 -2 0 -2 -2 -10 9 1 -4 -7 -1 -5 -15 5 -2 3 -12 -5 5 -3 -8 -3 -10 -3 12 -1 -6 1 20 4 7 6 11 4 3 -4 -3
6301 -3 12 -2 -8 6 12 4 -1 -6 8 -1 -4 -8 12 14 2 8 0 7 0 -17 -16 3 -8 -2 -10 -8 2 -7 -11 -11 -6 -10 -1 -1 -13 6 -5 6 -13 4 -10 -4 9
6344 9 -2 0 0 -3 -8 5 3 -4 -4 -15 0 8 4 3 7 -9 4 -2 5 -13 -3 6 -13 4 0 19 -2 4 0 3 -1 0 -20 2 4 -12 -11 -5 -10 -5 -9 -15 -16 2 0
6389 0 -15 3 1 -11 -11 -2 -5 -7 5 -17 -6 -3 -7 -14 -2 15 7 2 18 6 5 -3 1 -1 13 11 2 6 3 8 -4 -8 -10 12 -2 -13 -9 4 1 4 5 -6 2 10
6433 10 -4 2 6 -9 5 -1 0 -1 2 -14 -16 11 9 -9 -22 -13 -3 -7 -16 -13 -18 2 -11 -20 -16 2 -7 -12 -16 -19 1 2 -13 -6 4 -2 -21 -3 -9 -5 -7 5 -18
6476 -18 0 21 -6 -7 15 0 -7 1 -6 -1 9 -6 -3 4 0 -9 5 7 0 -10 -8 4 -7 -1 -8 -10 -3 9 0 -7 -7 3 -3 -9 -1 -9 9 -6 -19 -2 13 -12
6518 -12 -11 -13 -18 -8 1 -6 -19 -2 -14 4 -2 -11 5 2 -3 0 15 0 -2 8 7 -2 10 -25 3 4 -4 3 1 -3 3 -4 6 -4 7 2 -4 -3 -15 3 -1 -21
6560 -21 -7 13 -20 -8 5 -5 0 3 -14 3 2 -6 -1 -10 -10 1 -9 1 -7 -1 -11 -8 -6 -10 0 -8 -15 -1 14 -12 3 4 1 2 -6 -2 -5 1 10 5 -7 -4
6602 -4 3 0 -1 10 -11 -2 9 9 -2 6 7 -1 2 -3 -11 -9 -10 -10 0 5 -7 -7 -2 6 1 1 -11 -12 -14 2 -4 0 -6 -5 -1 -3 -8 -5 -12 -9 -12 -2 -7 -9 2 -6 -7 -14 -12 -12 6
6653 6 -8 -6 10 9 -11 -11 -8 5 -5 5 -2 -6 17 -4 -6 -1 8 2 17 9 14 11 -1 -10 -9 8 -6 -3 -9 -9 11 1 -10 3 17 7 6 -14 1 -1 -5
6694 -5 -1 -3 -5 -3 -7 -13 6 7 -13 -4 -7 -1 -1 -3 -1 12 -2 -13 -1 10 6 7 2 -13 -9 10 9 -8 8 0 7 -3 -3 -6 12 12 9 12 15 10 6 15 29 13 -1
6739 -1 7 14 3 16 4 -16 24 13 -9 -2 3 -4 -3 2 0 20 7 -3 5 1 -2 -11 -1 -16 1 -11 -12 -16 -4 6 -2 -7 3 9 -5 9 0 11 9 3 -2
6780 -2 -9 10 4 -5 0 -7 -1 13 -1 -8 12 -5 -3 13 4 -2 12 8 -5 11 -11 -1 -6 -7 -16 5 11 -3 10 -3 -19 2 17 4 -3 -2 -13 17 -3
6819 -3 -20 -13 -6 -12 -12 -4 -3 3 -6 4 4 -4 0 4 -16 1 10 2 12 0 4 0 6 6 3 13 4 -12 16 9 -3 13 8 -8 9 13 -1 7 13 10 1 -7 1 1 -3 3 -1
6866 -1 7 9 8 -8 15 3 3 2 4 -6 -8 4 -6 -3 -1 2 -4 6 -8 -5 -2 -10 -13 5 -8 -15 -2 2 -10 2 -9 -12 6 1 2 2 6 11 1 12 9 1 18
6909 18 10 9 8 13 -4 -6 1 6 -3 -6 15 9 13 2 -14 -2 0 13 9 -9 -11 0 -7 0 5 3 -3 -8 -5 1 7 -20 -14 -6 4 1 -5 -12 -2 -8 -13 -10 5 -4 -4 -16 -16
6956 -16 -2 10 -7 2 6 -1 -1 -2 -6 7 6 -4 9 9 13 22 8 1 18 9 4 10 -11 1 -6 8 -10 4 4 8 -15 7 6 -6 -3 2 2 -2 -13 -10 -8 5
6998 5 -9 -16 -6 0 -4 -2 -2 -2 -7 9 6 -9 7 1 -16 -1 0 -5 -6 -8 -11 -11 -4 -2 -5 17 -15 2 2 -12 8 12 2 -4 15 8 -12 -3 0 5 3 4 -4 -3 10
7043 10 7 -7 5 1 10 6 -7 4 -2 0 -15 2 2 -9 -15 -29 8 6 -3 -1 -7 -6 -3 3 -10 2 3 -12 -5 -3 0 -7 3 -3 -2 2 -3 -3 -4 5 -4 -3 -7 9 2 -3
7089 -3 6 1 -3 6 12 -7 7 8 -8 -7 6 -5 15 0 8 11 16 14 3 12 5 3 15 1 -1 -5 -5 -13 3 5 1 -4 -7 -8 -2 -16 -4 0 0 -8 -5 -9 11 2 -11 -5
7135 -5 -15 -11 -17 4 -10 -6 2 -12 -16 6 12 -4 2 -5 3 9 -2 -16 4 6 3 -12 6 13 7 -4 14 6 4 26 9 -9 8 1 -4 12 4 -5 11 7 -2 2
7177 2 23 -16 3 13 1 9 -2 -3 0 5 -8 -1 -7 -2 -4 -3 -10 -2 1 -7 3 -5 -3 4 -8 -4 9 -11 8 -8 15 26 6 -7 0 4 6 3 4 4 2 -1 -6 11
7221 11 11 12 0 3 12 11 5 16 3 20 4 0 10 14 12 -1 -2 -7 -8 11 -6 -2 8 -4 -1 4 -1 3 6 -1 -8 -3 1 -6 -17 8 -2 -11 -7 1 0 9 11 -11 4
7266 4 3 -1 0 6 10 -1 0 -1 -4 14 22 5 2 3 14 0 -1 4 4 3 -5 -13 5 21 17 14 2 22 4 4 7 -3 16 0 -10 3 5 -1 -3 3 -2 5 0 -5 -1 11
7312 11 16 -6 -11 -2 -2 -6 0 2 -7 -1 -7 -3 -5 6 -6 -24 -6 -1 5 9 2 10 17 7 -3 6 19 5 0 4 13 13 10 0 6 3 9 5 -1 14 20 -4 15 14 8 0 2
7359 2 -2 -1 13 -1 -12 14 2 -14 1 -3 7 7 8 -16 -4 -4 -12 -10 -10 -14 1 -12 -9 6 -5 -14 -15 -12 -3 5 -7 -11 11 -5 -5 14 2 9 13 -3 -14
7400 -14 11 17 -8 -6 10 3 13 10 -5 24 15 1 -1 -2 4 3 10 4 7 5 17 6 -9 4 11 -10 -6 2 8 -9 0 -1 3 16 3 -17 3 1 -20 -20 -7
7441 -7 -16 -8 4 -4 -10 7 5 4 -5 -3 2 -5 -15 4 1 -10 16 -3 -1 4 -6 -4 0 -2 -10 12 5 6 21 5 5 -2 13 -3 -6 10 14 3 4 -8 -11 1 3 -12
7485 -12 -7 3 6 -7 -7 -6 -3 2 -14 -9 3 7 -18 -23 17 8 -21 0 12 -4 3 -3 -17 3 15 2 -5 10 2 0 9 -6 -1 -5 3 -11 5 14 6 -18 5
7526 5 23 9 5 -2 19 11 21 -1 3 16 12 -9 4 7 -4 8 -6 0 7 13 0 0 9 3 3 -9 -4 -17 2 -16 -15 1 5 1 -7 -13 -2 -9 -6 -6 -5 24
7568 24 10 -5 -16 5 -1 -11 -2 13 -10 9 10 -9 -1 5 1 -17 7 17 0 -9 7 -2 -9 12 -14 -3 8 4 -3 0 15 2 -1 3 -1 -3 18 4
7606 4 4 -9 1 -8 -10 2 2 -13 -3 -18 -15 -3 -14 -36 -1 13 -15 -12 2 -5 -9 1 -10 5 13 7 -11 -6 -2 -13 -1 3 -1 -9 13 -16 -3 13
7644 13 4 -2 5 -4 3 16 0 2 -6 -9 0 -8 3 17 1 -7 2 0 -9 16 17 6 6 1 -14 -4 6 -7 -14 13 -3 4 -4 -16 5 4 -2 -19 -4 -11 5 -8
7686 -8 -19 -1 6 -2 -3 -14 -12 7 5 -16 7 6 -8 2 -3 4 25 7 -6 4 7 11 15 18 3 10 9 -6 2 2 7 4 -6 5 10 9 -12 4 10 6 -6 -3
7728 -3 -12 9 -6 -16 13 6 -4 0 -6 -19 10 10 -29 4 -6 -8 -10 -3 4 -9 -9 -24 -9 11 1 -10 -9 -7 0 -9 -11 1 14 -1 7 8 -7 6 0 -9
7768 -9 7 20 2 -7 23 -9 15 10 -18 3 34 -14 -4 2 6 -3 6 -17 5 25 6 4 -1 2 2 9 -4 9 6 0 0 0 -8 6 5 -27 2 11 -7 -7
7808 -7 -7 -6 -2 9 -18 -3 9 -17 -3 3 -15 -12 -6 -21 -3 6 -12 -3 9 -4 25 13 -7 21 20 5 5 15 5 13 9 -9 12 8 -4 -1 17 0
7846 0 5 18 -11 13 10 -15 3 4 -2 5 13 -15 -12 6 -11 -9 5 -13 10 3 -18 -7 0 -10 1 0 0 2 -3 -22 -15 9 -14 5 -1 -12 1 10 -20
7885 -20 9 15 -5 8 14 -2 17 5 -8 8 11 -7 3 8 18 15 4 2 13 23 -8 9 -1 0 16 11 -8 13 21 0 -1 1 -2 2 -5 -19 13
7922 13 9 -23 -4 -8 -8 -1 -3 -16 15 10 -12 -12 -2 -14 -15 -3 -8 5 -1 0 -3 -2 -6 5 8 -10 2 14 -4 -6 13 1 2 2 -22 10 11 -14 -5 -2 -3
7963 -3 14 6 2 13 7 3 3 5 8 2 -2 -8 9 9 12 -3 4 -7 -5 -14 -5 7 -5 -3 -11 -4 3 10 -4 -13 8 1 -5 7 -6 2 2 -13 -2 6 8 5 -6 -7 -2 16
8009 16 4 11 8 25 -2 9 2 6 2 -6 3 18 -2 8 9 -6 15 22 15 -7 20 20 3 4 7 22 6 0 -6 13 7 13 -1 1 -5 -5 -12 -4 -13 -11 6 -5
8051 -5 -17 4 -10 -25 -14 1 -15 -18 -8 -13 12 6 -12 -16 8 -2 6 -13 -4 21 5 -1 2 8 3 1 0 -9 21 4 6 8 6 6 18 11 -3 9 11 -7
8091 -7 -3 19 1 -7 1 -7 25 -1 3 3 17 5 2 7 -2 -2 -3 -5 11 7 0 -5 9 7 -9 -7 -14 -2 -1 -9 -11 -11 0 -7 -1 -6 -4 17 13 2 17 10 5 2 -6 -10 11
8138 11 11 4 -4 3 9 5 4 4 5 7 3 -7 11 15 12 -21 12 -8 2 -2 3 -5 -1 4 0 -10 8 9 -5 -1 -2 -1 4 -4 -6 8 -12 -7 -10 5 -2 -14 4 1 -11
8183 -11 -8 -8 -6 -4 15 -6 -13 8
8191H
$$ Imaginary data points
##PAGE= N=2
##DATA TABLE= (X++(I..I)), XYDATA
0 0 0 0 0 0 0 0 0 0 0 0 -8 8 -8 8 -8 9 -16 16 -18 24 -25 32 -40 41 -48 56 -64 72 -81 96 -105 120 -134 150
34 150 -168 185 -209 231 -255 281 -313 347 -383 424 -471 521 -579 647 -721 808 -910 1032 -1183
53 -1183 1370 -1609 1935 -2401 3120 -4389 7267 -25765 18491 42407 -54433 16649 37937 -46842
67 -46842 -5140 41589 -28487 -3626 30764 -22648 -11994 22230 -11718 557 15711 -15404
79 -15404 -3279 11400 -12316 5511 13050 -14229 -1308 9022 -10923 2513 11027 -6057 -2673
92 -2673 652 -2967 4696 -1150 -398 7713 -10167 -5464 15458 -7840 -7327 19821 -8771 -16723 19280
107 19280 -1208 -14883 17937 -217 -17554 12531 1065 -11545 14120 -683 -11964 11701
119 11701 -5467 -9924 20044 -4477 -15866 19099 -4613 -19976 23205 4280 -23638 16370
131 16370 6607 -25549 12686 16342 -19500 2653 11975 -15498 18 13547 -6121 -2293 4394
144 4394 -5491 -436 3119 -5 4340 -3143 -6483 5722 -136 -4037 8787 -1156 -9800 5826
158 5826 1676 -6248 7516 2315 -8614 2529 1141 -4048 6663 1020 -6677 3637 -712 -5150
172 -5150 7598 1473 -7041 4602 72 -7464 6169 4351 -6194 1843 1146 -5067 3058 2508 -2341
187 -2341 2333 -1784 -3312 4242 -1479 -1810 7154 -3870 -6949 7911 -488 -6730 8928 843 -10525
202 -10525 5760 3796 -8617 5087 6179 -8650 -573 5170 -3976 500 4783 -2786 -2445 1095
216 1095 -91 740 548 554 642 -3534 -878 4267 -1015 -960 3355 -3535 -3021 5056 -481 -2281 4221 -1874
234 -1874 -4312 3563 421 -1620 3854 -1466 -4187 2704 525 -1373 3233 -770 -3126 1675 -384
249 -384 -898 3223 -331 -2218 664 -1278 197 3196 -1335 -1202 1591 -2503 -443 3813 -1480 -1129
265 -1129 2767 -2925 -2221 4437 16 -2305 2319 -1084 -2898 2625 1300 -1761 1038 358 -2118 -172
281 -172 1459 859 -238 -749 -73 -716 -389 2274 322 -2159 1116 282 -2709 1840 2521 -2421 -48
298 -48 1300 -2748 488 3347 -1659 -1233 1826 -1535 -1215 2466 248 -1074 763 -836 -1413 1308
314 1308 1294 -410 -506 -391 -345 11 604 864 -300 -797 41 -511 -147 1804 296 -1744 29 313 -750
333 -750 1108 1025 -1301 -233 460 -1072 351 1676 -402 -909 3 -479 241 1207 -85 -676 -27 -308
351 -308 -135 634 362 82 -200 -871 -185 890 386 -90 -85 -625 -298 623 195 -121 427 -172 -914 19 690
372 690 211 69 -96 -733 -247 751 274 -358 220 112 -794 -131 803 103 -149 239 -683 -642 1076 509
392 509 -898 271 426 -1037 105 1074 -562 -149 888 -1046 -834 1585 258 -1159 650 193 -1184
409 -1184 649 849 -1017 196 924 -1164 -547 1376 17 -789 552 -94 -848 719 668 -935 33
426 33 887 -789 -624 1091 100 -737 599 -87 -984 860 707 -1183 176 931 -970 -234 1021 -524
444 -524 -231 891 -763 -685 1168 42 -781 518 18 -594 494 134 -495 455 251 -673 -51 489 29
463 29 -93 -32 -162 -37 267 71 -306 115 371 -405 -276 518 -40 -207 426 -412 -423 935 -72 -884 750
484 750 256 -927 515 341 -870 654 553 -1288 178 1056 -756 -200 790 -586 -275 760 -392
501 -392 -428 774 -16 -737 178 418 -141 -77 91 -193 -151 385 84 -544 246 516 -695 -245 828 -261
521 -261 -372 643 -460 -546 1101 -31 -1053 715 410 -970 429 588 -817 258 656 -963 -109
538 -109 1135 -371 -711 598 54 -510 473 180 -646 236 528 -606 -205 787 -87 -633 326 164 -398
557 -398 423 213 -757 180 670 -560 -253 657 -212 -344 404 -190 -214 606 -177 -628 429 250 -341 137
577 137 20 -270 299 67 -385 212 282 -255 -77 65 22 214 -68 -315 115 250 -46 -106 -42 95 86 -90
599 -90 -22 -12 38 222 -242 -277 563 3 -612 414 139 -537 668 65 -1109 784 681 -1305 417 876
619 876 -1241 294 1006 -1320 223 1324 -1415 -343 1478 -772 -378 1081 -900 -361 1232 -602
635 -602 -496 877 -388 -290 476 -407 265 452 -806 177 379 -547 710 89 -1213 959 444 -1443
653 -1443 1025 642 -1655 956 638 -1854 1271 1118 -2218 705 1275 -1869 839 1202 -2151 754
669 754 1440 -2129 564 1548 -1884 438 1251 -1919 717 1494 -2073 354 1489 -1719 484 1248 -1897
686 -1897 552 1435 -1872 329 1391 -1581 306 1067 -1503 596 1083 -1630 348 986 -1148 603
702 603 414 -1387 1002 484 -1476 1160 337 -1647 1400 236 -1903 1889 553 -2589 1547 1016
718 1016 -2333 1568 1024 -2811 1354 1608 -2683 955 1830 -2489 417 1735 -2044 523 1775 -2137
734 -2137 -96 1734 -1356 64 1276 -1470 46 1257 -1212 89 1146 -1047 -37 661 -857
749 -857 551 642 -1209 365 540 -937 788 284 -1371 1039 512 -1682 1023 865 -1751 816 853
766 853 -1821 935 1228 -2046 403 1474 -1535 256 1152 -1535 316 1263 -1430 181 1180 -1260
782 -1260 166 952 -1207 477 988 -1596 202 1322 -1169 91 997 -1320 112 1244 -1062 -84
798 -84 1054 -891 -207 744 -565 259 534 -1009 116 668 -569 371 269 -999 506 498 -1022 570
816 570 658 -1089 259 496 -857 649 613 -1208 198 677 -744 389 454 -904 388 472 -973 401
834 401 765 -785 28 401 -596 358 497 -671 23 375 -288 111 47 -208 370 -131 -411 403 -15 -228
854 -228 431 -317 -349 747 -180 -607 608 80 -428 358 -144 -330 519 -18 -405 256 -30 -113 206 -256
874 -256 53 401 -395 -216 325 -129 140 200 -537 84 416 -405 78 312 -399 171 151 -594 414 512 -730
895 -730 46 376 -556 373 491 -841 123 650 -709 -25 691 -421 -74 327 -544 94 620 -385 -195
914 -195 221 -217 142 189 -341 200 157 -420 103 130 -139 361 -159 -553 482 143 -460 395 -12 -481 552
935 552 -54 -719 738 267 -896 397 321 -718 524 360 -946 365 639 -824 56 661 -515 10
953 10 427 -554 30 591 -355 -214 340 -83 -16 89 -183 166 164 -279 31 89 -74 263 -97 -395 362 144
975 144 -400 237 114 -338 300 8 -499 433 326 -587 84 286 -337 224 194 -513 190 361 -500 0 386
996 386 -237 17 125 -375 150 370 -345 -88 257 -178 41 149 -297 129 298 -391 -134 348 -73 -55 111
1017 111 -233 12 319 -152 -178 200 51 -107 -49 -33 117 91 -113 -44 -6 59 164 -153 -189 309 49 -337 137
1040 137 178 -182 134 44 -384 210 374 -392 -100 364 -173 -158 247 -146 -72 336 -169 -379 294 211 -247 -15
1062 -15 95 -128 32 98 -144 -15 234 -51 -317 63 292 -76 -161 95 -74 -68 262 -51 -264 281 126 -446
1084 -446 70 363 -149 -49 131 -259 19 394 -159 -254 246 52 -246 65 144 -19 33 -54 -189 52 247
1105 247 26 -212 -27 134 -44 -101 114 68 -50 -9 -128 -96 261 153 -260 -128 129 3 -15 56 -27 -14 28
1128 28 -112 -83 174 195 -128 -240 55 135 -15 53 35 -144 52 118 -227 40 392 -136 -354 169 108 -92 207
1151 207 -2 -339 176 229 -289 17 390 -136 -273 138 39 -47 251 -22 -371 95 310 -185 -131 281 -13
1172 -13 -270 64 74 -85 201 90 -401 -62 384 -85 -197 215 -25 -231 149 16 -174 281 118 -425 -25
1193 -25 329 -51 -77 107 -121 -70 181 -57 -121 215 111 -269 -124 198 102 -84 32 -38 -147 168 142 -246
1215 -246 57 310 -254 -218 270 32 -56 162 -190 -172 309 42 -219 111 69 -96 -11 -83 73 218 -130 -116
1237 -116 67 -96 152 174 -342 -2 314 -299 -111 338 -121 -59 193 -345 -65 458 -140 -221 218 -93 -72
1258 -72 180 -127 32 204 -188 -87 73 -13 262 -41 -387 281 110 -335 326 81 -448 438 70 -709 548
1279 548 466 -785 210 415 -685 311 542 -760 100 607 -654 -83 580 -315 -20 268 -473 56 436
1298 436 -259 -8 115 -254 204 44 -342 373 130 -497 189 74 -285 453 1 -599 412 146 -510 391
1318 391 127 -475 403 3 -609 556 279 -605 260 121 -460 442 164 -538 379 188 -558 256 190 -298
1338 -298 385 -49 -580 462 212 -476 377 111 -537 387 154 -611 444 389 -697 53 406 -360 148
1357 148 348 -479 -27 387 -286 -79 320 -76 -115 8 -151 132 231 -166 -79 8 -94 180 56 -236 190
1378 190 96 -367 88 244 -145 146 24 -452 194 352 -372 74 289 -393 52 303 -408 155 497 -533
1398 -533 -175 497 -252 -44 437 -426 -133 514 -332 -201 544 -204 -214 301 -344 -1 570 -362 -247 450
1418 450 -299 -122 494 -302 -140 517 -396 -314 584 -63 -250 267 -269 -161 425 -113 -190 244 -110 -96 85
1439 85 -142 191 198 -386 0 210 -215 242 147 -488 205 318 -513 147 455 -437 63 307 -526 165 595
1460 595 -530 -155 512 -314 -138 440 -248 -151 437 -236 -320 398 95 -257 49 36 -100 81 96 -98 -58
1481 -58 157 6 -248 50 266 -92 -143 80 -82 4 190 -129 -114 169 -54 -159 66 67 47 -6 -176 -17 121
1504 121 43 22 -72 -93 130 -26 -154 193 104 -131 29 -70 -66 324 2 -279 145 59 -151 171 20 -151 189
1527 189 -25 -269 185 153 -91 20 -132 -39 264 -79 -130 196 -117 -108 224 -185 -61 433 -228 -376 387 19
1549 19 -280 315 -85 -339 327 33 -375 251 179 -267 24 24 -82 197 21 -209 55 25 -40 74 -79 1
1571 1 193 -189 -178 242 7 -73 130 -158 -104 289 -80 -196 251 9 -199 144 -26 -94 308 -36 -349 187
1593 187 157 -210 101 96 -198 86 102 -242 49 274 -132 -176 65 43 28 42 -67 -30 14 5 2 -46 34 163 -145
1618 -145 -249 217 132 -180 92 30 -243 173 167 -287 87 275 -279 -120 253 -40 7 163 -228 -95 258 -13
1640 -13 -100 108 2 -29 7 -103 110 174 -116 -75 13 -27 143 83 -205 58 146 -196 8 178 -84 66 53 -290
1664 -290 57 325 -156 -114 175 -130 -54 201 -125 -69 264 -106 -270 145 156 -70 9 -37 -114 56 115 -42 -65
1687 -65 71 50 -165 -63 224 62 -132 22 -49 -96 219 86 -259 62 177 -241 -63 277 -11 -95 79 -141
1709 -141 -96 293 73 -217 32 83 -117 8 135 -1 2 8 -140 -45 223 108 -159 -100 37 16 16 66 3 -25 10
1734 10 -99 -71 157 147 -131 -154 5 29 62 95 -65 -89 59 -17 -127 144 202 -133 -142 29 -23 112 165 -133 -152
1759 -152 125 -3 -126 162 127 -99 -66 -28 -50 177 164 -155 -169 51 61 -3 49 72 -35 -124 -37 33 69 154 -16
1784 -16 -278 -28 220 -25 -31 123 -128 -136 120 -38 -43 254 -37 -338 11 139 13 89 -9 -192 -4 60 -55
1807 -55 54 117 -34 -160 -129 105 198 -8 -72 -52 -126 75 178 -80 -6 157 -207 -189 245 113 -14 102 -220
1830 -220 -209 292 125 -146 124 5 -222 53 88 7 188 -8 -300 -31 159 88 75 -69 -123 11 -26 26 150
1853 150 5 -30 -61 -215 82 349 -75 -195 77 -157 -60 320 -45 -156 217 -173 -334 315 212 -164 72
1874 72 -108 -258 239 194 -147 37 5 -181 12 43 102 193 -161 -232 91 22 109 253 -229 -196 241 -147 -125 423
1898 423 -34 -274 139 -178 -115 500 -6 -387 150 -63 -200 341 29 -212 214 -164 -343 335 185 -154
1918 -154 94 -216 -234 322 60 -125 200 -161 -228 190 -93 46 403 -311 -364 312 -88 -38 465 -270 -366 409
1940 409 -154 -269 556 25 -446 187 -100 -203 521 54 -408 128 -27 -153 321 24 -130 180 -273 -224
1960 -224 416 55 -69 187 -362 -210 487 -70 -171 367 -233 -350 322 -48 -36 463 -259 -463 304 29
1980 29 -75 365 -186 -331 264 -116 -134 440 -9 -307 59 -170 -9 484 -105 -283 148 -209 -83 432 -111
2001 -111 -134 288 -399 -300 568 27 -221 312 -322 -385 580 69 -339 389 -68 -537 292 190 -178 348 -48
2022 -48 -547 162 257 -93 190 -22 -314 71 15 -54 322 14 -244 -31 -163 90 462 -142 -253 158 -252
2043 -252 -61 479 -129 -170 318 -411 -312 635 44 -267 296 -314 -356 574 38 -293 399 -162 -453 331 72
2064 72 -78 406 -243 -481 317 58 -66 356 -209 -333 277 -137 -112 533 -81 -374 150 -147 -52 522 -89
2085 -89 -366 174 -113 -115 381 -7 -114 116 -314 -140 386 38 -15 29 -394 7 340 -164 88 223 -438 -60
2107 -60 271 -242 238 385 -598 -178 403 -260 132 446 -499 -172 393 -358 -16 600 -259 -296 194 -240 39
2128 39 483 -170 -239 108 -166 19 263 -60 57 -1 -345 81 243 -32 182 -86 -412 217 210 -236 258 123
2150 123 -438 91 118 -219 368 197 -526 9 187 -188 275 166 -395 73 96 -294 265 261 -263 18 -52 -297
2172 -297 333 275 -341 49 51 -332 227 216 -226 171 43 -466 129 331 -145 105 25 -389 122 280 -182 88
2194 88 172 -287 -57 148 -47 191 114 -296 -86 119 5 168 29 -190 65 -43 -162 247 125 -190 67
2215 67 -112 -243 360 185 -322 94 40 -313 203 207 -245 148 77 -454 86 334 -161 42 52 -355 92 253
2237 253 -170 84 167 -314 -35 150 -102 202 143 -381 -35 186 -99 171 123 -279 49 106 -253 196 266 -248
2259 -248 -34 37 -225 213 266 -280 -19 143 -235 73 227 -142 41 58 -295 42 262 -31 12 -38 -219 99
2281 99 125 -120 136 57 -226 24 29 -74 266 38 -356 54 105 -123 187 74 -266 85 54 -239 170 224 -209
2304 -209 -47 7 -172 190 188 -198 -35 76 -137 40 126 -32 57 -21 -205 45 159 29 13 -82 -132 101 58
2327 58 -54 120 37 -150 -5 5 -18 187 21 -231 -20 101 -20 62 50 -87 -13 6 -62 66 125 -25 -111 -79
2351 -79 28 110 18 -42 -11 -45 11 42 -21 65 92 -118 -124 103 67 11 50 -95 -83 102 20 -56 88 47 -102 -39 20
2378 20 35 89 7 -111 -66 87 56 -16 3 46 -14 -46 14 37 46 49 -71 -117 76 116 -57 -12 50 -64 -15 58 -28 24
2406 24 96 -85 -132 77 112 -26 -11 -27 -41 42 42 -41 8 41 -14 -94 -13 109 45 -69 -23 -1 -7 68 27 -94 42 82
2434 82 -104 -37 137 22 -41 23 -69 -4 133 -7 -87 54 34 -44 13 43 25 40 -28 -60 28 73 51 -49 -54 67 46
2461 46 -61 35 44 -28 26 -10 -105 100 129 -145 -52 112 -41 -4 85 -88 -11 122 -66 -107 127 40 -77 -10 -14 2
2487 2 59 -1 -44 -13 33 21 -59 -32 114 16 -127 44 43 -53 70 12 -148 85 129 -155 0 133 -82 -32 65 -67
2513 -67 12 126 -78 -91 91 32 -36 -11 -16 33 18 -54 8 26 0 48 -79 -82 126 14 -138 67 43 -109 85 5
2539 5 -145 122 100 -189 25 117 -68 20 59 -106 49 112 -98 -13 78 5 -1 -29 -21 78 -1 -64 47 -8 7 102 -78
2566 -78 -78 190 -3 -135 128 42 -97 133 -19 -159 163 82 -193 42 111 -99 23 54 -107 44 93 -98 -31
2589 -31 78 13 -4 -51 -35 73 -10 -64 43 -9 -29 78 -78 -86 172 6 -182 89 61 -96 78 18 -130 119
2613 119 86 -164 18 122 -58 -5 12 -74 69 49 -70 10 45 -9 39 -38 -51 148 -15 -124 100 43 -80 109
2637 109 -11 -137 187 74 -212 110 106 -148 90 75 -187 132 142 -227 9 184 -145 -21 105 -130 8
2658 8 122 -127 -34 133 -30 -34 6 -41 77 -6 -106 61 13 -75 108 -47 -134 209 24 -246 156 118 -195 123
2682 123 78 -222 139 139 -239 61 173 -134 5 82 -102 98 84 -161 34 81 -88 62 -1 -98 128 21 -184
2705 -184 110 73 -99 81 -24 -120 129 33 -167 93 46 -122 59 13 -107 148 22 -190 57 69 -72 60
2727 60 -16 -108 88 -5 -116 64 41 -45 14 -85 -29 148 -39 -99 92 -26 -45 118 -42 -66 143 -42 -132 121
2751 121 86 -43 27 -12 -59 66 40 -33 2 37 -3 -42 -44 96 56 -95 -3 24 -43 103 51 -128 34 88 -117 -6
2777 -6 120 -43 -12 23 -106 21 145 -50 -69 49 -20 -19 34 -23 15 34 -47 -46 8 81 47 -72 -56 52 8 -5 56
2804 56 -29 -22 81 -69 -72 156 47 -125 27 4 -51 114 36 -99 61 47 -86 34 81 -14 34 -24 -94 63 69 -45
2830 -45 17 -18 -62 68 6 -67 101 42 -129 -5 76 -20 64 16 -137 30 83 -76 0 78 -46 -8 4 -68 56 93
2856 93 -79 -48 19 -12 43 16 -58 41 12 -75 23 58 5 37 -52 -109 89 68 -66 58 -2 -100 81 28 -107 133 69
2883 69 -184 23 92 -49 95 49 -172 56 102 -126 46 112 -103 -3 19 -102 100 112 -142 -19 47 -81 83
2906 83 54 -123 65 53 -159 39 94 -69 37 -1 -150 68 113 -106 16 49 -92 24 44 -59 84 59 -129
2929 -129 9 63 -15 81 -2 -102 65 37 -67 76 39 -55 54 -51 -82 160 49 -117 54 -1 -80 112 13 -97
2953 -97 106 19 -148 76 68 -62 68 -24 -141 96 84 -105 35 50 -95 27 19 -61 79 39 -123 -14 48 -7
2977 -7 27 -10 -65 31 6 -54 40 29 -21 1 -53 -30 100 34 -68 8 -18 -20 60 -25 -35 78 -24 -78 39 32 10 28 -65
3006 -65 -49 75 6 -30 44 -23 -18 32 -53 7 105 -32 -80 36 -17 6 71 -75 -56 98 -23 -68 82 16 -50 37 -61
3033 -61 -59 104 31 -87 13 25 -41 27 1 -29 38 2 -64 -7 30 30 14 -75 -8 42 -11 1 29 -40 -3 20 -65 28 97 -40
3063 -40 -54 42 -16 13 69 -53 -19 80 -29 -45 64 3 -5 -1 -69 6 89 -10 -34 7 -27 8 48 -63 7 76 -65 -60 56
3092 56 -19 5 36 -87 -40 103 -39 -70 54 -15 -41 20 -38 -32 84 -24 -63 1 14 24 10 -44 10 38 -33 4 19 -13
3120 -13 57 5 -98 19 93 -62 -10 66 -50 11 54 -82 7 104 -58 -59 49 3 0 28 -65 -20 49 -13 -38 24 11 18
3148 18 -18 -64 46 48 -58 -6 9 -51 52 19 -103 44 68 -99 -18 69 -49 18 47 -94 -6 111 -50 -52 70 5
3174 5 -29 13 -12 -7 64 -8 -35 -6 25 47 -13 -44 60 1 -66 39 18 -66 78 -4 -134 60 88 -101 10 72 -77
3201 -77 5 48 -93 -4 101 -70 -61 44 -14 4 36 -63 -4 41 -36 -32 25 -4 12 -37 -60 47 39 -57 -6 3 -36 65 11
3230 11 -91 88 44 -133 21 67 -61 46 48 -121 21 113 -79 -37 72 -25 -12 34 -35 33 58 -28 -5 -2 -6 61 -36
3257 -36 -66 88 8 -110 63 53 -93 66 35 -132 63 111 -116 -1 72 -75 -2 58 -86 22 93 -85 -47 55
3281 55 -21 17 15 -79 28 43 -72 7 35 -43 17 -20 -90 68 30 -89 38 8 -67 83 10 -113 92 69 -140 35
3307 35 80 -96 50 61 -119 28 106 -82 -17 86 -32 -13 31 -31 20 28 -58 13 10 -28 58 -27 -84 68 47 -98 46
3334 46 65 -71 32 24 -88 38 83 -75 -42 44 -30 -5 29 -24 35 25 -63 -14 17 7 27 -5 -43 35 42 -46 15 33 -14
3363 -14 27 -11 -39 70 33 -60 19 39 -25 28 35 -64 33 54 -68 -13 91 -9 -44 27 -11 -30 75 14 -65 4 59 -26
3391 -26 -44 38 29 -47 -24 15 -35 16 40 -61 -59 57 4 -77 29 44 -51 -4 8 -30 19 62 -48 -44 38 14 -16 0 -2 -7 16
3422 16 -9 -14 32 29 -23 -11 3 7 30 1 -22 7 42 5 -40 38 25 -12 -10 18 -17 18 22 -43 -1 43 12 -32 18 22 8 -20 -30
3455 -30 14 16 -1 -3 -20 -25 48 4 -75 19 55 -47 -18 29 -32 11 46 -55 -31 60 -4 -42 20 16 13 1 -29 22 39 -10 13 2
3487 2 -20 53 5 -59 44 47 -52 14 38 -26 48 18 -76 32 66 -63 11 29 -53 39 17 -84 45 55 -81 12 46 -54
3515 -54 47 36 -92 28 60 -82 -6 41 -47 37 17 -82 33 61 -65 7 32 -63 36 37 -92 20 66 -86 -7 54
3541 54 -37 28 49 -72 11 64 -28 0 23 -5 26 10 -43 59 46 -43 31 3 -29 78 13 -90 53 37 -63 28 42
3568 42 -67 44 31 -92 37 78 -67 1 33 -43 27 36 -63 15 53 -67 -6 48 -30 14 14 -64 5 62 -48 -16 30 -21
3596 -21 -9 12 -34 10 46 -30 -17 21 -1 14 -2 -41 15 42 -32 2 34 -7 27 27 -32 24 64 -32 -8 33 5 22 8 -42 21
3627 21 45 -31 -14 37 -24 14 18 -59 3 61 -49 -34 50 -18 -9 22 -32 -16 55 -29 -36 43 -7 -14 25 -41 4 37 -35 -12 34 -15
3659 -15 3 27 -51 7 59 -32 -30 38 3 -1 27 -24 0 48 -18 -22 30 -2 1 6 -15 23 25 -15 -15 12 2 25 -1 -32 36 24 -39 -2
3693 -2 23 -27 19 -7 -56 22 41 -64 -20 31 -33 -7 16 -52 5 60 -45 -38 41 11 -27 7 -12 3 35 -11 -30 1 17 12 -19
3724 -19 -4 23 9 -27 13 10 6 27 -8 -35 38 32 -17 15 11 8 22 0 -11 29 27 -8 3 10 5 11 -4 -21 19 8 -14 2 17 16 13 -8
3760 -8 -7 31 0 -15 -15 -7 2 -2 -16 -3 30 -8 -28 1 9 18 14 -21 -8 15 9 -1 -27 9 31 -14 -25 16 30 3 2 -3 -10 30 11 -30 -8
3797 -8 27 -7 -13 -3 10 24 -5 -18 5 20 19 8 -24 7 32 9 -23 35 28 -11 3 -3 -10 34 28 -37 -7 28 -2 -4 1 13 10 -10 -22
3832 -22 0 -1 11 -6 -46 5 32 -19 -5 21 -3 -3 0 -11 -2 42 -20 -37 24 42 8 15 4 -16 32 23 -36 15 27 -17 -1 9 -8
3865 -8 31 26 -34 -2 35 -5 -12 15 0 5 14 -12 12 43 -11 -18 -11 0 28 -3 -35 -6 27 -37 -1 12 -8 31 9 -49 -4 34 -22 -13
3899 -13 7 -25 12 9 -31 15 23 -21 -21 -14 -4 19 9 -33 26 30 -25 14 14 -19 29 2 -56 32 42 -25 10 16 -18 9 41 -39 19 56
3933 56 -31 1 31 3 16 27 -37 5 34 -30 -6 8 -16 12 18 -40 17 43 -57 -21 28 -9 10 20 -48 -2 29 -15 -14 17 -20
3964 -20 5 3 -45 15 37 -30 -14 6 -19 22 21 -39 10 25 -30 -14 33 -17 16 9 -38 12 49 -16 -1 21 -27 12 16 -21 3 48
3996 48 -22 -35 34 7 4 8 -10 -18 24 6 -20 5 24 -1 -19 -10 36 14 -21 -10 -17 -29 18 17 -43 -1 25 -42 -38 37 -6 -12 11 -31
4030 -31 -20 38 16 -34 0 24 -16 -5 34 -9 21 12 -29 5 43 9 11 -2 -17 23 25 -7 19 33 -20 -1 6 -2 29 6 -35 22 9
4063 9 -7 12 -3 -10 18 -11 -42 25 30 -33 -21 6 -2 18 44 -16 -24 40 -13 -22 23 19 -8 -22 -17 -3 -4 -4 8 -22 -7 29 -12 -27 21
4098 21 15 -52 4 29 -22 19 38 -49 -25 66 5 -33 48 13 -29 40 5 -21 41 27 -28 10 32 -2 24 15 -23 7 12 -28 17 32
4130 32 3 0 -12 -1 32 8 -19 10 -12 -14 12 -4 -15 45 -13 -58 42 20 -32 29 6 -45 47 42 -59 11 56 -29 -3 36 -6
4161 -6 20 32 -24 -14 31 20 25 -13 8 32 -4 -18 49 0 -22 41 -7 -40 81 31 -64 43 39 -53 45 42 -58 42 41 -80
4191 -80 11 60 -33 -8 25 -38 -6 49 -29 -10 25 -18 -16 1 5 19 -15 -36 11 -7 -17 32 -13 -34 47 -2 -48 48 34 -57 17
4222 17 22 -47 33 58 -51 11 46 -25 -2 37 -7 15 23 -29 -9 47 24 10 3 -8 30 13 -12 39 15 -25 32 5 -34 50 34
4253 34 -62 5 42 -42 4 37 -39 -5 36 -26 -18 55 -4 -36 10 9 -17 25 3 -21 7 7 -17 -1 21 24 -18 -24 29 8 -5 14 -12
4286 -12 -31 44 25 -42 31 43 -41 6 42 -13 19 38 -23 -11 43 12 -16 23 13 -25 11 4 -5 20 23 -17 -23 0 31 -13 -9 10 3
4319 3 -18 1 15 -16 17 10 -58 -1 30 -20 -26 7 -22 -19 15 -11 -22 18 6 -36 0 16 -5 -9 -8 3 1 9 16 -3 10 21 -11 -11 43
4354 43 23 -9 14 -4 -13 21 27 -25 20 39 -25 1 39 7 1 13 -3 -11 31 9 -36 -4 16 -7 -16 10 5 -3 11 -1 -33 11 42 -20
4388 -20 -10 20 -3 -23 6 1 -21 7 -1 -28 14 32 -15 -13 -3 16 -11 9 9 -11 5 23 -15 -3 39 23 -14 20 22 -16 13 27 -14
4421 -14 11 42 -10 -10 34 8 -10 25 7 -1 34 15 -16 11 29 6 -1 20 11 -12 -6 2 -11 10 12 -20 -15 26 -3 -8 28 7 -14 2 -8
4456 -8 -22 18 24 -47 -19 26 1 8 14 -2 7 7 -4 -2 19 21 6 -1 0 28 11 7 5 8 7 9 -4 -7 24 12 -28 -6 29 0 17 17 -15 5 18
4495 18 3 -5 29 -5 -6 -1 -1 12 11 1 -9 -4 8 3 2 3 8 -9 -27 16 2 -9 27 -11 -33 19 18 -21 -2 28 -15 5 20 -13 13 38
4531 38 -11 -9 36 11 -5 23 11 4 26 1 11 15 1 12 9 10 29 18 -12 17 16 3 20 24 -6 22 20 -28 4 33 -8 -22 13 -6
4565 -6 -8 15 -20 -22 22 -2 -19 -8 4 -1 6 -13 -4 10 0 6 9 -10 13 4 -22 9 18 -18 -1 6 -19 5 27 -19 -6 23 -13 -4 34 -5
4601 -5 -8 21 -15 -14 30 17 -14 17 22 8 14 0 1 22 14 5 -5 -2 9 13 -16 8 19 -8 7 21 -14 -4 26 -33 -11 37 5 -28 16
4636 16 2 -1 18 -13 -20 16 6 -25 2 14 8 11 -18 7 12 2 8 6 -7 1 8 -12 3 20 -2 -7 23 -4 2 19 -11 -10 26 6 -1 28 -8
4673 -8 -5 14 -7 0 25 18 -16 1 8 2 1 5 -14 -5 11 -9 -2 2 5 -9 -17 -2 10 -3 -9 -5 -5 -12 -9 -12 -7 13 -3 -17 0 11 -1 13 -8 -7 12
4714 12 5 -5 -4 6 -13 11 -11 -2 26 19 -11 -1 14 11 17 4 8 21 22 -5 -3 19 17 4 3 -4 18 21 -17 1 2 11 -9 10 9 -6 -10 3 -16
4753 -16 17 10 -19 -15 -3 0 5 1 -10 -12 -4 0 -13 -1 7 -1 -14 4 19 -3 -4 -7 -8 8 11 -6 -13 12 -5 -12 5 5 0 10 7 -21 19 17 -2 7 13
4794 13 0 7 4 -5 17 10 2 -4 -5 -4 6 8 -14 7 8 -7 -4 6 7 7 3 -8 1 22 -6 -15 10 -1 -13 2 -21 -1 7 -20 2 9 6 -9 6 -11
4834 -11 24 9 -18 8 2 -20 9 4 -14 19 20 -21 7 24 4 12 21 -13 13 33 -24 -15 21 3 -1 9 0 2 17 4 -3 9 1 -11 -1 -6
4870 -6 -1 10 -21 -3 9 0 0 -20 -5 7 2 -7 -2 15 -17 -10 3 -7 0 5 -14 -13 5 -9 -11 1 3 -11 5 6 -15 30 -5 -15 -1 -13 2
4907 2 10 -7 9 17 1 -5 6 -4 5 21 -11 -2 19 10 -10 25 -1 -3 3 -7 -6 22 3 -9 5 4 -2 15 4 -13 5 8 -3 -11 -1 1 1 -6 -5
4946 -5 -1 5 4 -10 -2 4 9 -19 -8 1 0 2 -6 -10 2 21 -5 -13 8 4 8 11 0 -7 16 7 -13 10 15 -14 13 4 12 15 -7 0 21 12 1 11 3 -5 10
4989 10 4 -5 7 -1 -12 -1 -7 -3 12 -7 -25 -10 -3 -15 -5 10 10 -4 -3 -10 -14 -3 6 -12 6 3 -11 1 -4 -1 -7 8 -5 -1 26 -4 5 7 12 5
5029 5 7 7 9 3 -5 1 9 21 7 9 1 21 1 6 11 12 11 17 -2 4 3 7 -2 -3 -7 5 9 -4 -3 -2 -9 -6 -11 -18 -11 -6 -5 -19 -2 -3 -10 -10 -12 -17 10 -6 -2 10 -1
5078 -1 -15 -4 11 -11 9 0 7 -4 13 0 2 3 7 1 7 -4 6 -1 16 0 -2 7 7 13 -1 0 4 5 10 -2 3 4 5 -6 24 17 -6 -2 5 16 14 15 -10
5121 -10 8 -9 -10 -10 9 -13 3 0 -10 -3 15 -10 -6 5 -3 -2 -7 -15 1 18 -4 1 13 3 2 1 -4 1 16 5 8 5 4 16 8 20 0 5 2 -5 1
5162 1 8 22 11 -3 5 11 9 1 3 7 -8 3 2 -2 16 -7 4 -7 1 8 11 -7 5 9 -6 -2 0 2 -2 2 -11 -6 -7 -3 -6 3 -19 10 3 -12 4 10 3 -13
5206 -13 8 10 -7 8 -2 -5 4 -3 -3 -1 16 4 -8 7 8 9 3 19 6 7 -1 6 7 2 0 -4 6 17 -1 2 15 9 5 10 -10 -7 0 3 3 2 -5 -3 12 4
5250 4 -3 -4 18 1 2 -3 -12 -1 5 -13 2 -1 7 8 5 2 5 1 -4 3 1 2 6 6 2 18 4 10 4 11 2 10 10 -5 11 1 -1 -1 22 9 3 3 13 2 4 0 6
5297 6 8 -7 -1 -8 6 -6 -6 -6 1 1 13 -10 -9 13 4 -7 -13 18 -3 -2 -17 -12 -8 9 1 -13 2 1 -8 1 1 -13 11 -5 -14 -3 14 -7 -9 2 10
5338 10 4 18 6 5 6 0 10 10 -1 6 18 4 13 15 5 1 6 10 24 5 7 17 7 -3 3 -1 7 -8 -4 -12 4 7 -2 -7 -1 1 1 -5 5 4 6 13 0 4
5382 4 10 0 -4 -13 1 0 7 4 12 2 5 -1 4 2 5 14 0 8 1 3 4 14 4 12 4 10 13 17 19 11 10 10 4 11 8 4 6 17 9 14 9 9 -5 -7 2 -9 6 9 0 -3 4
5433 4 4 -6 -3 -7 -3 -1 -9 -8 -5 -2 0 -2 15 -5 1 4 8 9 7 8 7 14 7 2 11 7 9 9 -8 13 10 9 11 9 11 2 23 3 11 20 14 8 12 -2 13 15 7 -2 26 2
5483 2 -7 6 8 9 8 -1 1 4 2 5 -10 0 -15 -9 -8 -2 4 -12 -10 -8 -5 -7 0 9 -3 13 5 1 -4 5 -4 12 11 2 16 7 2 -1 -4 14 6 9 5 19 8 5 14 6 15
5532 15 5 9 9 12 17 7 13 12 9 2 3 4 12 12 2 9 3 9 15 18 -3 3 4 -10 9 7 1 4 4 -6 9 -7 -14 1 -19 -15 5 2 -13 5 -5 1 -4 -14
5576 -14 11 13 14 7 -1 11 5 9 12 12 4 11 7 13 0 3 14 9 20 6 18 -3 16 10 -3 7 -3 -11 -6 8 6 -4 5 15 8 5 0 1 0 2 -5 -3 -8 -2 -2
5621 -2 2 3 1 -7 3 1 -6 -3 -9 -13 -7 -2 -8 -1 10 1 -2 1 10 9 14 2 16 1 3 11 12 3 17 13 12 14 3 14 14 10 -8 11 9 7 6 13 -6 9 14 17 -4 -3
5669 -3 21 8 3 -2 -12 12 -4 4 -13 -9 -2 -9 -3 1 -6 -4 1 1 -12 10 0 -5 -4 -1 6 5 0 3 3 1 0 -5 5 8 4 11 3 14 17 12 16 -5 14 11 11 19 12 5
5717 5 9 11 10 16 11 8 7 13 5 7 -1 -1 -12 8 3 12 5 -7 10 -2 -1 -3 4 -2 -2 6 -1 8 4 -2 0 -5 6 5 -12 1 7 4 -8 -2 2 -3 6 -3 -4 -2 2 3 10 2 11 10
5769 10 4 8 -2 -5 6 14 6 6 1 -6 0 6 -3 0 -8 22 -7 -2 4 6 4 -2 -7 -8 5 -7 -3 1 3 -5 -10 -1 0 9 -5 -2 -6 2 -17 8 1 -13 -3 -1 -10 -1 -8 -2 2
5818 2 -2 -5 2 1 3 11 8 5 3 13 -3 11 20 8 10 6 12 24 17 -7 8 15 1 4 15 5 21 11 10 9 10 4 -1 19 -1 2 7 -2 9 11 8 9 -7 -7 7
5863 7 -2 -6 -4 -2 -3 2 7 -3 -5 -1 -10 -13 -4 -3 2 -5 -9 0 1 11 3 1 -1 9 8 7 3 10 2 9 -5 7 17 11 2 5 21 0 14 2 8 5 17 7 10 7 9 3 11
5912 11 2 11 12 5 1 7 4 9 13 1 -2 9 -1 -6 5 -9 -18 -9 -8 -8 5 -7 -8 -5 0 1 -8 -1 13 12 -10 -2 1 9 13 15 10 7 16 14 4 9 13 17 16 4 23 16
5960 16 16 15 15 8 15 13 23 28 12 -1 2 7 5 10 7 -1 12 2 -1 -11 4 14 -4 5 -8 2 6 -7 -7 -6 -12 -10 -9 0 1 -15 -14 -1 2 2 -11 5 12 -1
6004 -1 17 -5 -9 8 -19 -5 14 5 14 6 7 3 12 9 9 15 7 19 24 9 11 18 11 5 8 11 9 4 12 4 12 8 7 0 0 12 9 7 4 2 4 5 0 21 9 13 2 1 -2
6053 -2 -6 -1 4 9 -6 10 -2 -12 -6 9 -1 2 -5 -1 7 6 5 15 10 6 8 11 5 13 20 2 -1 -1 -2 21 11 -1 -1 9 7 4 3 11 7 -9 10 4 7 0 -2 13
6099 13 4 5 13 11 12 -5 2 -15 3 -8 -1 7 8 -1 1 -2 1 2 -11 -1 -16 2 8 -3 -4 5 4 -1 -6 13 5 6 11 12 11 15 15 8 18 9 1 15 5 11 22 2
6145 2 6 23 18 9 15 20 10 11 7 5 5 9 -7 -6 6 24 6 -3 -9 -3 13 3 13 -15 -4 5 -5 -3 0 -3 -10 2 11 1 10 -9 1 -2 4 -6 -7 -6 4
6188 4 7 7 -13 -11 1 0 0 1 10 -6 7 11 8 9 8 12 16 10 16 12 20 12 7 13 8 8 5 9 9 -3 8 14 13 9 -3 1 8 9 0 -3 10 -1 4 -4 4 2 8 11 4 8 -6
6239 -6 18 2 9 5 7 0 6 19 2 9 8 1 16 15 -6 5 10 3 -6 12 2 10 10 0 14 11 17 0 13 12 12 22 -2 8 17 8 9 12 14 22 16 17 9 9 6
6284 6 -2 15 0 5 1 1 3 5 3 -2 0 -5 -2 0 1 -3 10 0 -4 -7 -4 5 -19 -1 -14 -2 -4 -15 -1 2 7 0 4 -6 -2 -5 15 23 12 14 9 11 2 15 3 21
6330 21 5 7 8 16 10 17 14 13 13 23 2 -3 22 2 16 16 21 6 10 8 4 8 -1 9 26 -2 2 11 0 12 10 -10 7 -2 -10 -1 -9 -8 4 -3 0 18 -2
6373 -2 8 -13 -10 4 5 2 -5 -3 15 -2 -2 -6 4 13 7 7 8 16 1 4 19 17 8 11 3 -3 13 12 -2 12 10 5 9 1 8 18 12 1 2 19 9 6 3 -8 -1
6418 -1 2 -2 6 10 4 -4 6 -2 3 2 -4 3 3 6 -1 6 -6 -8 15 5 -3 6 16 -1 -7 2 6 9 3 12 12 17 2 1 10 17 10 4 -2 16 11 -4 2 9 3 6 16 -1 10
6467 10 9 -1 3 11 7 -2 16 3 -11 6 -8 4 7 2 -10 4 15 2 -6 -1 -3 9 2 -21 2 -11 -7 -5 6 4 -5 11 -1 8 -6 15 -3 -6 5
6506 5 9 1 15 21 12 9 12 -2 -7 16 5 11 9 4 8 19 -14 8 10 13 3 7 8 16 -10 16 6 12 13 -4 2 3 12 -2 3 4 4 -12 -4 -1 7 0 -1 -9 6 9
6552 9 0 -9 3 -1 -8 4 -3 3 19 1 -9 0 -8 -1 19 -7 8 13 -4 2 3 12 2 7 9 12 14 7 -4 13 21 12 10 11 20 24 2 -4 3 14 -8 3 0 -3 7
6597 7 10 7 -1 9 13 7 1 14 4 2 1 9 5 5 -9 -9 5 2 -3 2 -8 2 19 -5 -8 -2 11 4 -9 10 -3 10 14 7 2 12 17 -3 6 11 22 12 -1
6640 -1 17 12 10 24 12 16 7 9 15 6 -2 -3 13 8 8 9 6 -3 7 9 4 2 5 6 9 3 -4 17 11 -1 3 -9 8 2 6 2 -2 10 -16 0 1 6 10 1 -6 5 22
6687 22 0 -1 0 6 0 2 -4 6 -1 -9 7 7 24 17 -13 2 16 12 16 11 2 15 24 11 4 18 5 8 12 11 11 17 4 6 8 0 6 8 -1 12 7 6 4 12 -2 4
6733 4 -4 -18 22 7 -10 6 4 0 12 -7 -7 17 7 -3 11 15 4 -1 14 1 13 15 11 10 6 24 12 15 13 17 1 6 3 25 13 19 14 8 11 17 16
6774 16 9 13 10 14 11 0 8 7 -13 13 7 -2 11 0 -6 7 3 -11 -4 3 -9 1 -6 -6 2 19 0 -7 4 -5 -1 -6 1 2 10 -9 18 3 12 -7 11 9 10
6817 10 13 5 -9 16 17 5 11 9 16 6 -2 15 23 -11 12 -4 1 28 7 0 17 12 -5 1 21 -3 21 3 0 -2 13 0 -4 -3 -6 5 5 -16 -9 6
6857 6 1 1 6 -4 1 1 -6 0 1 8 2 7 7 5 -9 -5 7 2 0 11 11 13 18 3 7 7 -6 -3 10 -1 2 -1 26 -4 7 21 2 17 8 5 7 14 -1 8 17 18
6903 18 0 5 4 3 6 5 -10 -6 19 -4 4 7 1 -4 6 -19 9 -6 1 4 2 7 10 -10 4 11 9 1 -7 0 7 6 2 4 18 13 -1 18 16 25 7 10 9 8 9 10
6949 10 12 11 11 14 -6 19 24 3 -2 4 -2 15 2 -4 8 15 6 1 -9 -3 16 9 4 -1 -11 5 -1 -17 -1 8 3 -16 -6 -3 1 -8 -1 -4 -2 -13 4 2 -2 2
6993 2 -6 5 -6 14 3 -16 2 12 13 -3 3 0 7 7 5 0 4 17 -3 0 17 8 10 12 14 15 15 3 -1 2 14 12 -2 2 4 11 -16 3 4 -6 5 -5
7035 -5 -1 1 -5 -1 -11 0 3 -5 -11 -1 -2 -8 0 -12 5 4 7 -1 0 10 -5 1 -11 -2 11 1 3 9 11 14 6 9 9 6 -17 10 16 11 3 11 12 10 15 4 1 3 13
7082 13 17 2 5 12 6 -4 3 4 3 4 1 -12 0 5 -9 -10 8 -5 7 3 -3 -1 10 2 -8 -13 7 -21 10 -5 6 -12 -10 -11 -6 -6 14 5 -4 18 2
7123 2 1 -1 9 4 10 -3 8 22 10 -5 0 28 19 4 13 -5 7 16 8 -13 -5 10 17 5 6 17 14 6 0 -1 12 18 -9 -9 -2 -1 -1 -12 -1 2 0 7 -3
7166 -3 -1 14 -15 -12 10 -3 -7 -2 -15 -14 19 0 -13 -3 9 3 -6 -9 -4 3 3 12 2 2 -4 -6 -1 17 18 2 2 3 3 14 5 2 11 7 2 0 8 -2 2 8 3 18
7212 18 13 9 6 11 2 -2 -3 5 17 1 -5 4 -3 -5 2 -1 -9 -6 14 -9 -8 -2 3 -7 -13 1 5 12 -2 3 -7 5 4 0 9 5 1 9 9 7 14 -1 6 15 13 4 4 11 13 23
7262 23 14 7 0 16 4 -17 11 11 7 16 -1 -9 5 9 -1 -3 10 -6 -4 8 -8 1 -3 2 -13 3 6 -10 -9 8 -5 -10 -7 -6 -5 -8 2 -13 -7 16 1
7303 1 -9 10 20 2 0 2 2 10 9 0 18 8 12 4 2 10 9 4 12 5 4 14 -5 -12 7 16 -1 15 5 10 14 10 -3 -5 21 4 -3 13 8 18 3 3 -9
7346 -9 -3 13 -1 0 -1 3 -10 1 12 7 7 -4 -6 2 5 17 -11 -1 9 -8 -4 8 5 -4 8 -14 1 9 -1 0 14 23 10 5 5 17 11 3 6 6 13 7
7388 7 2 -4 12 1 -4 8 9 -2 9 0 -13 13 1 -6 -9 4 -3 0 -1 -16 -11 30 -3 -5 -6 10 -7 6 -5 -9 -5 -4 -10 -10 6 6 -4 -8 3 2 7 7
7430 7 1 -11 19 11 -8 17 23 5 -4 15 4 11 17 -1 12 15 10 13 8 13 16 7 -4 18 5 4 3 -3 0 9 -1 -5 12 11 -10 -9 6 8 8 14 -8 0 7 -5
7474 -5 -7 -2 7 0 0 -10 -8 5 2 -13 -12 12 -5 -10 -7 0 -7 4 9 -5 -2 30 7 -1 22 17 10 11 8 1 17 16 0 13 27 11 3 23 29 4 3 7 -4
7517 -4 12 16 1 6 0 0 -3 3 3 0 -2 0 6 12 8 -2 -1 2 -11 -1 -2 -4 3 6 -7 1 4 11 5 -3 6 2 3 0 4 -4 5 6 -13 0 1 3 -3 14 10 4 3 15 7 16 15
7568 15 5 -2 7 15 -12 -6 5 23 13 10 14 7 14 11 0 0 17 -5 -11 10 4 -10 -7 -11 -19 13 3 -14 2 5 -1 4 5 -2 1 -1 -7 -8 1 10 6 1 11 -8
7612 -8 -4 10 -7 -2 10 -8 -2 11 20 -5 -8 14 18 3 11 4 4 20 6 9 9 23 28 7 -3 6 9 25 -12 8 12 16 -2 6 21 -2 -3 -3 0 3 13
7653 13 9 -6 5 16 -7 -11 10 5 -6 6 3 -12 -4 6 -6 11 2 1 -13 1 -4 8 2 -9 -12 19 2 0 -12 -2 7 6 -11 10 7 2 1 -4 10
7692 10 9 8 -3 6 15 0 1 2 -1 11 14 -18 6 14 6 5 3 2 -8 4 -13 -5 2 -10 -18 3 0 3 -6 -21 -10 4 0 -3 -5 -4 2 -11 -16 -3 13 -2 -9
7735 -9 3 5 11 9 2 -3 15 4 0 12 13 6 12 -8 6 20 9 -9 9 5 17 12 0 -5 4 -3 2 6 8 13 13 -12 4 13 -2 0 8 -6 -7 11 -12 -13 20
7778 20 -12 -17 13 -3 -12 4 -5 -12 1 -8 -14 19 2 -5 7 -12 -7 16 3 0 -5 -3 7 3 -6 6 6 -16 -11 -4 4 16 21 1 1 19 7 11 13 -11 15
7819 15 10 -3 2 30 4 -7 11 6 -10 3 -6 -1 28 -14 2 7 -6 -7 20 -1 6 14 -12 -9 3 -12 9 3 -11 -5 11 -8 -11 3 -7 -5 -8 -16
7857 -16 11 14 -13 9 7 -8 13 7 -9 15 19 -5 -9 15 2 2 4 -3 -4 37 -9 -8 21 -1 7 13 0 -3 23 7 -1 10 0 3 2 3 -6 -6 -8 -5 10
7898 10 -3 -5 10 0 -2 16 -11 -4 8 1 3 9 3 11 7 2 -6 2 1 6 7 -12 -3 18 -11 -6 16 8 10 12 1 6 17 -5 1 12 8 6 17 8 5 25 -5
7941 -5 1 27 19 15 19 -7 9 5 3 5 14 9 14 0 -7 17 -5 -9 4 2 -1 -3 7 -15 9 7 -11 -4 2 -3 0 0 -13 0 -7 -5 -9 6 1 -3 -3 -2 5 4 -11 -4
7987 -4 4 -6 4 -5 7 2 18 -3 -3 17 7 9 4 2 13 6 2 -8 -5 3 8 18 13 8 1 8 11 -5 5 2 -1 3 6 1 -8 3 -3 -13 0 -11 -8 -5 -10 -5 -19
8032 -19 6 -10 1 5 0 7 1 8 -5 -3 -2 -10 -19 12 12 1 8 9 -11 13 4 -9 1 13 -6 0 11 4 1 2 -20 2 24 8 -13 -5 -2 -3 -8 -8 -4 10
8074 10 -3 0 2 18 4 4 -14 1 11 -5 -2 -3 -8 4 0 -29 4 6 -3 -8 2 -12 -7 -3 -34 -6 -1 -4 7 12 -9 7 -4 -3 4 10 -4 -2 0 -15
8114 -15 0 11 -2 -1 9 -3 -7 15 -6 0 10 -2 -11 -1 11 -16 3 10 -3 1 4 2 5 14 -2 -16 0 6 6 -11 5 0 -5 -7 -14 0 12 -13
8152 -13 -13 -11 -4 -18 -9 -5 -8 -9 -1 -25 -15 8 -6 -12 -3 0 3 0 -5 -11 -1 14 -13 -6 4 4 2 -4 7 10 6 10 -4 2 15 5 -7 8 7
8191G
##END NTUPLES=NMR FID
##END=
