##TITLE=1H_LY-811.24
 CCl4, 8 sc, 
 9.4.2019
##JCAMPDX= 6.0         $$ Bruker NMR JCAMP-DX V2.0
##DATA TYPE= NMR FID
##DATA CLASS= NTUPLES
##ORIGIN= UXNMR, Bruker Analytische Messtechnik GmbH
##OWNER= root
$$ XWIN-NMR		Version 3.5
$$ Tue Apr  9 14:40:13 2019 Russian Standard Time (UT+4h)  she@DPX200
##.OBSERVE FREQUENCY= 200.1315
##.OBSERVE NUCLEUS= ^1H
##.DELAY= (6, 6)
##.ACQUISITION MODE= SIMULTANEOUS
##.ACQUISITION SCHEME= undefined
##.AVERAGES= 8
##.DIGITISER RES= 18
##SPECTROMETER/DATA SYSTEM= spect
##.PULSE SEQUENCE= zg30
##.SOLVENT NAME= DMSO
##.SHIFT REFERENCE= (INTERNAL, DMSO, 0, 15.7039)
##AUDIT TRAIL= $$ (NUMBER, WHEN, WHO, WHERE, WHAT)
$$ ##TITLE= Audit trail, XWIN-NMR		Version 3.5
$$ ##JCAMPDX= 5.01
$$ ##ORIGIN= Bruker BioSpin GmbH
$$ ##OWNER= she
$$ F:/spectra/data/she/nmr/H-F/1/audita.txt
$$ ##AUDIT TRAIL=  $$ (NUMBER, WHEN, WHO, WHERE, WHAT)
(   1,<2019-04-09 14:39:10.18 +0400>,<she>,<DPX200>,
      <created by zg, POWCHK disabled, PULCHK disabled
       configuration hash MD5:
       00 E9 B6 7A A2 85 ED C7 34 08 36 98 17 FE 4E 26
       data hash MD5: 16K
       14 BC F6 28 70 68 BF 73 E1 DF 69 69 4E E7 A2 55>)
$$ ##END=
$$ 
$$ hash MD5
$$ 57 63 50 83 25 EB D6 FE A1 6B 05 44 F2 68 F8 B6
##$RELAX= 
##$RELAX= 
##$RELAX= 
##$RELAX= 
##$RELAX= 
##$RELAX= 
$$ Bruker specific parameters
$$ --------------------------
##$DU= <F:/spectra>
##$EXPNO= 1
##$NAME= <H-F>
##$PROCNO= 1
##$TYPE= <nmr>
##$USER= <she>
##$AMP= (0..31)
100 100 100 100 100 100 100 100 100 100 100 100 100 100 100 100 100 100 
100 100 100 100 100 100 100 100 100 100 100 100 100 100 
##$AQSEQ= 0
##$AQ_mod= 1
##$AUNM= <au_zg>
##$AUTOPOS= <>
##$BF1= 200.13
##$BF2= 200.13
##$BF3= 200.13
##$BF4= 200.13
##$BF5= 200.13
##$BF6= 200.13
##$BF7= 200.13
##$BF8= 200.13
##$BYTORDA= 1
##$CFDGTYP= 0
##$CFRGTYP= 5
##$CHEMSTR= <none>
##$CNST= (0..31)
1 1 145 1 1 1 1 1 1 1 1 1 1 1 1 1 1 1 1 1 1 1 1 1 1 1 1 1 1 1 1 1 
##$CPDPRG= <>
##$CPDPRG1= <>
##$CPDPRG2= <>
##$CPDPRG3= <>
##$CPDPRG4= <mlev>
##$CPDPRG5= <mlev>
##$CPDPRG6= <mlev>
##$CPDPRG7= <mlev>
##$CPDPRG8= <mlev>
##$CPDPRGB= <>
##$CPDPRGT= <>
##$D= (0..31)
0 1.2 0 0 0 0 0 0 0 0 0 0.03 0 0 0 0 0 0 0 0 0 0 0 0 0 0 0 0 0 0 0 0 
##$DATE= 1554806349
##$DBL= (0..7)
120 120 120 120 120 120 120 120 
##$DBP= (0..7)
150 150 150 150 150 150 150 150 
##$DBP07= 0
##$DBPNAM0= <>
##$DBPNAM1= <>
##$DBPNAM2= <>
##$DBPNAM3= <>
##$DBPNAM4= <>
##$DBPNAM5= <>
##$DBPNAM6= <>
##$DBPNAM7= <>
##$DBPOAL= (0..7)
0.5 0.5 0.5 0.5 0.5 0.5 0.5 0.5 
##$DBPOFFS= (0..7)
0 0 0 0 0 0 0 0 
##$DE= 6
##$DECBNUC= <off>
##$DECIM= 24
##$DECNUC= <off>
##$DECSTAT= 4
##$DIGMOD= 1
##$DIGTYP= 9
##$DL= (0..7)
0 120 120 120 120 120 120 120 
##$DP= (0..7)
150 150 150 150 150 150 150 150 
##$DP07= 0
##$DPNAME0= <>
##$DPNAME1= <>
##$DPNAME2= <>
##$DPNAME3= <>
##$DPNAME4= <>
##$DPNAME5= <>
##$DPNAME6= <>
##$DPNAME7= <>
##$DPOAL= (0..7)
0.5 0.5 0.5 0.5 0.5 0.5 0.5 0.5 
##$DPOFFS= (0..7)
0 0 0 0 0 0 0 0 
##$DQDMODE= 0
##$DR= 18
##$DS= 0
##$DSLIST= <SSSSSSSSSSSSSSS>
##$DSPFIRM= 0
$$ [...]
##$SUBNAM2= <"">
##$SUBNAM3= <"">
##$SUBNAM4= <"">
##$SUBNAM5= <"">
##$SUBNAM6= <"">
##$SUBNAM7= <"">
##$SUBNAM8= <"">
##$SUBNAM9= <"">
##$SW= 24.9337058887773
##$SWIBOX= (0..15)
0 0 2 0 0 0 0 0 0 0 0 0 0 0 0 0 
##$SW_h= 4990.01996007984
##$TD= 16384
##$TD0= 1
##$TE= 0
##$TE2= 300
##$TE3= 300
##$TEG= 300
##$TL= (0..7)
0 120 120 120 120 120 120 120 
##$TP= (0..7)
150 150 150 150 150 150 150 150 
##$TP07= 0
##$TPNAME0= <>
##$TPNAME1= <>
##$TPNAME2= <>
##$TPNAME3= <>
##$TPNAME4= <>
##$TPNAME5= <>
##$TPNAME6= <>
##$TPNAME7= <>
##$TPOAL= (0..7)
0.5 0.5 0.5 0.5 0.5 0.5 0.5 0.5 
##$TPOFFS= (0..7)
0 0 0 0 0 0 0 0 
##$TUNHIN= 0
##$TUNHOUT= 0
##$TUNXOUT= 0
##$USERA1= <user>
##$USERA2= <user>
##$USERA3= <user>
##$USERA4= <user>
##$USERA5= <user>
##$V9= 5
##$VALIST= <valist>
##$VCLIST= <CCCCCCCCCCCCCCC>
##$VD= 0
##$VDLIST= <DDDDDDDDDDDDDDD>
##$VPLIST= <PPPPPPPPPPPPPPP>
##$VTLIST= <TTTTTTTTTTTTTTT>
##$WBST= 1024
##$WBSW= 4
##$XGAIN= (0..3)
0 0 0 0 
##$XL= 0
##$YL= 0
##$YMAX_a= 58895
##$YMIN_a= -75002
##$ZGOPTNS= <>
##$ZL1= 120
##$ZL2= 120
##$ZL3= 120
##$ZL4= 120
##$ABSF1= 10
##$ABSF2= 0
##$ABSG= 5
##$ABSL= 3
##$ALPHA= 0
##$AQORDER= 0
##$ASSFAC= 0
##$ASSFACI= 0
##$ASSFACX= 0
##$ASSWID= 0
##$AUNMP= <proc_1d>
##$AZFE= 0.1
##$AZFW= 0.1
##$BCFW= 1
##$BC_mod= 2
##$BYTORDP= 1
##$COROFFS= 0
##$CY= 11.3945322036743
##$DATMOD= 1
##$DC= 2
##$DFILT= <>
##$DTYPP= 0
##$F1P= 18.9103706918063
##$F2P= -1.10871071338519
##$FCOR= 0.5
##$FTSIZE= 0
##$FT_mod= 4
##$GAMMA= 1
##$GB= 0.15
##$INTBC= 1
##$INTSCL= 1
##$ISEN= 128
##$LB= 0.24
##$LEV0= 0
##$LPBIN= 0
##$MAXI= 10000
##$MC2= 0
##$MEAN= 0
##$ME_mod= 0
##$MI= 1.114404
##$NCOEF= 0
##$NC_proc= 0
##$NLEV= 6
##$NOISF1= 3.799351
##$NOISF2= 2.8
##$NSP= 1
##$NTH_PI= 0
##$NZP= 0
##$OFFSET= 15.70392
##$PC= 1
##$PHC0= -8930.784
##$PHC1= 14.20026
##$PH_mod= 1
##$PKNL= yes
##$PPARMOD= 0
##$PSCAL= 0
##$PSIGN= 0
##$REVERSE= no
##$SF= 200.130013532006
##$SI= 16384
##$SIGF1= 3
##$SIGF2= 2
##$SINO= 400
##$SIOLD= 16384
##$SREGLST= <1H.CDCl3>
##$SSB= 0
##$STSI= 0
##$STSR= 0
##$SW_p= 3612.71676300578
##$SYMM= 0
##$S_DEV= 0
##$TDeff= 0
##$TDoff= 0
##$TI= <>
##$TILT= no
##$TM1= 0
##$TM2= 0
##$TOPLEV= 0
##$USERP1= <user>
##$USERP2= <user>
##$USERP3= <user>
##$USERP4= <user>
##$USERP5= <user>
##$WDW= 1
##$XDIM= 8192
##$YMAX_p= 0
##$YMIN_p= 0
$$ End of Bruker specific parameters
$$ ---------------------------------
##NTUPLES= NMR FID
##VAR_NAME=  TIME,          FID/REAL,        FID/IMAG
##SYMBOL=    X,             R,               I
##VAR_TYPE=  INDEPENDENT,   DEPENDENT,       DEPENDENT
##VAR_FORM=  AFFN,          ASDF,            ASDF
##VAR_DIM=   8192,          8192,            8192
##UNITS=     SECONDS,       ARBITRARY UNITS, ARBITRARY UNITS
##FACTOR=    0.0002004,     1,               1
##FIRST=     0,             0,               0
##LAST=      1.6414764,     0,               0
##MIN=       0,             -75002,          0
##MAX=       1.6414764,     58895,           0
$$ Real data points
##PAGE= N=1
##DATA TABLE= (X++(R..R)), XYDATA
0@%%%%%%%%%%%%%%%%%Mj2J6j6J6j6J6j6K0k8L2l2L3l7M4m8N2o0O8p3Q1q9R7j08
41e6J17j29J44j61J81k02K26k55K92l39L94m65N65p03R04j225J788k935O001k6091
61b1949n3053J30680l6718q7619J16066j2685j02000Q2459J9149p8191N7591K0342
73C4072o7536L1595J7934l7250L2901M839l6391K5766j559k5205L5267r82l0703
86a7252K3978j601k3276K4116N287j6068P174n850j322J0376j1803J0621J0472
99A4852l2501J2248K5329l7255J1345L6965m5517m836M4615l3998q687M4679k9423
112b184j6963L5833k2270q017L4188k4390o491K8446l2865J166M2304l7827p964
125a7034M7320m1353j8345O1197k7842l3364N5661j8036m4790N0739N951m3008
$$ y = [0, 0, 0, 0, 0, 0, 0, 0, 0, 0, 0, 0, 0, 0, 0, 0, 0, 0, 4, -8, 8, -8, 8, -8, 8, -8, 12, -16, 16, -16, 17, -20, 24, -24, 28, -32, 36, -37, 44, -45, 52, -56, 61, -68, 76, -85, 96, -106, 120, -135, 157, -182, 212, -253, 312, -391, 513, -712, 1076, -1859, 4142, -21949, -75002, 55678, 18960, -68659, 47407, 34722, -67278, 15181, 34330, -43861, 13730, 34072, -33464, -1869, 16065, -21185, 11716, 16555, -19836, 5930, 4371, -20834, 14433, 13451, -17252, 6726, 5125, -18151, 5965, 11252, -4816, 2358, -3492, -4814, 5562, -6241, 4380, 14852, -17649, -5401, 19928, -17327, -5982, 30983, -14534, -19370, 25245, -8753, -17440, 27239, -2184, -19147, 16686, -5584, -13601, 20587, -3803, -10294, 18152, -14713, -13547, 28757, -9070, -17034, 30286, -11067, -29412, 31785, 3943, -29421, 26240, 8204, -36586, 14153, 20104, -22904]
137b2904K9575R685l7060J7093J7751j9146N557N213j1819L933O59J556J0244
150A0337j2936n391J4938j1607k878K2317j3231j3426J9167q126j0297K1800m859
163E808j4601J2958n482p736J7877n110j0459J3340q446r197J9575m276j2139
176g888J5341n725j4390J6769K526j2090R039r95r912Q164P76l109P147p070l627
191e044R890q875o37J7054j3498r761J9901r129j2368K3622m177k0407J7830K203
205F604j9523J5336R526j8809L744Q911j0923K382R150n328l109J344m31R66p37
220h97L084K592q870j99Q484o033j06R712r307n437J1284m645m248J1598n058
235A954q628Q639j794m440R780k589q025O038q73l846P402q47n258L380k135k087
$$ y = [-22904, 6671, 16356, -20704, -3611, 14140, -5006, 551, 5764, -6055, -2122, -1463, 93, 10337, -2599, -7990, 6948, -4659, -7537, 14780, 1549, -11877, 7290, -836, -11133, 10667, 5808, -8793, 4165, -1317, -9053, 8824, 3714, -6745, 6595, -1851, -11048, 8527, 4251, -7888, 7453, 1728, -12662, 4107, 6633, -5457, 3582, 2587, -7325, 839, 1615, -1494, 5653, -1417, -5044, 4846, -4029, -4666, 12388, -1110, -10871, 9030, -99, -12467, 11155, 6978, -13429, 4401, 6604, -12919, 2417, 11943, -6866, -3122, 5789, -5134, -2752, 6398, 1070, -2039, -695, -1126, -160, -897, 2187, 4779, -4091, -4290, 4194, -1839, -1945, 7767, -1540, -6977, 4307, -338, -4586, 7012, 1954, -6674, 1965, 171, -4269, 5511, 2922, -5103, 935, 62, -3784, 3618, 2771, -2487, 893, -1242, -3329]
251c329O103r40k283K035m492K28O161l840k69M944p213j417Q345m585j712Q120
267E856o514n782R211r89n067O834j245p140M438K496l747K535J960l823j610
282b587J899K052n25j004J699k060l223M957J527n081L652J741p765K846O300
297D428n692L25N096o746j428P584k954k911N489k641m666M489J265k514K294
312A418n7l639O27K538Q0o73Q9j02j662k20K894O6j891J417j002k913L431K411
330B812l615N41J681l577O73L854k066r44K239k540j598L618M74j796P51o91j435
347a619J501J102o24O6l38r32J4O94J057K24j433o59O37k5N42R92j022r65P44
366d4l17l93J657L81j803l01O95k87N81J048j059j160Q93K35p98J029J043j636
$$ y = [-3329, 2774, 1834, -449, 1586, -2906, -2678, 3483, -357, -626, 4318, -2895, -4312, 4033, -552, -2264, 5856, -658, -6440, 2771, 1782, -3285, 3549, 2304, -4836, -398, 2098, -1649, 886, 2846, -977, -2587, -688, 1364, 839, -165, 1534, -526, -3749, 1208, 2735, -2346, 1306, 3047, -4718, -1872, 4428, -1264, -939, 4157, -2589, -4017, 3567, 613, -2298, 3191, 550, -4116, 373, 1638, -876, 1418, 1361, -2278, -1651, 887, 967, 294, 383, 281, -1381, -1601, 1293, 1359, -532, 885, -117, -3030, 401, 2812, -803, -262, 1419, -2158, -1485, 2369, 303, -641, 1598, -942, -2540, 1078, 1552, -244, 507, -184, -1619, -118, 984, 360, 426, 88, -844, -830, -136, 921, 1145, -288, -947, -310, -335, 207, 1199, 177, -788, -44, -361, -754, 903, 1284, -519, -820, -125, -412, 169, 1217, 158, -1002, -109, 126, -672, 357, 1400, -236]
384b36r43J255r0l46J576m75k295J172J418j825N10K122k188j286K470p07j346
401a214K818n00l395K108J804k844R17K390k888o93K874j545j238L145p90l097
417b148K078J415k362Q51J776k370n17K496j149j486K634m2k999J441J792k297
433h87N19K087k541o14L040j595j689L105n24k766K173O53k277J781R81k823P64
450f13J931j864j09J776j143p30J147m58m45J134j17j138K27Q04k63m00M96k9
468B06o70N39K32q60P89N90j535K60J176j102K26J014j531J91J624j708l05K129
486A265j309r17J854j107q05K260r45j663K043j00j705J472L33j425R46K91j314
503h26P37Q85q87k97M12N3q8l7K29j63l32N90j81p97J214K80j757P61J071j548
$$ y = [-236, -1179, 76, -14, -360, 1216, 741, -1554, -382, 1036, -789, -279, 1843, -345, -1631, 839, 132, -1214, 1604, 1104, -2291, -183, 1621, -1223, -306, 2084, -804, -1497, 1377, -168, -1406, 1739, 949, -2148, -70, 1345, -1017, -166, 1610, -760, -1277, 1219, 70, -1416, 1218, 1176, -1823, -382, 1410, -887, -368, 1719, -822, -1436, 1604, 9, -1680, 1425, 901, -1865, 308, 961, -1316, 465, 1446, -1377, -613, 1318, -546, -655, 1121, -22, -752, 395, -63, -508, 626, 509, -629, -402, 402, 139, -261, 235, 206, -464, 75, 307, -553, 236, 826, -709, -449, 727, -375, -149, 865, -666, -475, 1149, -559, -864, 1265, -44, -961, 893, -214, -1019, 1241, 296, -1367, 676, 576, -1129, 343, 676, -749, 197, 488, -826, -89, 796, -91, -388, 24, 77, -11, -48, 181, 18, -314, 276, 95, -702, 512, 792, -965, -204, 867, -681]
523f81O27J179k010K83J987j903n05K409j271j373K033m84j360J900q3k083J256
540g9J183j669P7J341r50o36J184j94r78J043M32j618L21J576j065p21J401n77
558G1r90J544j55j525J422M96j915Q02J222j393J73R38j295K05J346j104n13J237
576E66m84o12Q49j80m37O20k55o00O14L69m99j83K19R2n1J9j8k05K24K33o06J20
598b05P54o84k60Q09o18j09J116j145n36J940r23j247J991p27j451K430o69k247
616a781K818k0l030K575Q63l158K060J080l324K005J879l469R73K133k683O54
632d25J845k284M94J519j961M13J282j257N23J21j257J590n0j574J814n37j721
649a465K704q12k319L505p87l401L824n1l622L932j58m459M301Q09m931L853J160
$$ y = [-681, -54, 1125, -885, -602, 1385, -518, -1023, 1386, 115, -1258, 775, 291, -1069, 831, 748, -1335, -79, 1104, -565, -488, 853, -97, -733, 451, 257, -721, 322, 754, -864, -543, 1033, -32, -753, 648, 71, -919, 625, 470, -1055, 367, 863, -1052, -250, 972, -421, -248, 690, -605, -400, 946, -158, -671, 566, 82, -530, 319, 139, -298, 322, 67, -533, 81, 450, -49, -232, -13, 79, 28, 47, 29, -176, 48, 281, -325, -205, 549, -135, -395, 414, -204, -313, 803, -342, -878, 1062, 139, -1108, 883, 156, -1295, 1135, 466, -1781, 1037, 1017, -2013, 562, 1425, -1733, 327, 1407, -1917, 88, 1967, -1502, -529, 1604, -1079, -425, 1420, -864, -370, 1149, -812, -399, 883, -374, 149, 270, -987, 603, 553, -1021, 793, 256, -1465, 1239, 427, -1892, 1613, 826, -2575, 1249, 1198, -2424, 1508, 1350, -3109, 1192, 2001, -2930, 923, 2083]
666B083n023L606J457n024L646J741n453L105K262m892K882J901n060K976K272
681B479n034K599K337m738K400K134m522K506K167m602K102K252l903J955J546
696A678l715K329J448l594K212R29l175K741K01l247L578k21l969M208L9m294
712b852M613k07n317N354R37o248M812J651o588M455K597o698L743L246o916K685
728g33M243n815J622L679n357J292M022m516O01L373l877M60K968l128P27K359
744A920l301O00K287k400R11J220k745J587J243k901J953J114l354K184J219l723
760b186K694J713m600K159K537m314J768K662m484J400L223m191O50L309l529
775a189K66K858l109N40K598l262M99K690k948N01K337l258P67K968l433J08L128
$$ y = [2083, -2940, 666, 2123, -2901, 745, 2486, -2967, 138, 2400, -2492, 390, 2291, -2769, 207, 2479, -2555, 44, 2381, -2357, 43, 2177, -2345, 161, 2328, -2274, -172, 2080, -1823, 132, 1678, -2037, 292, 1740, -1854, 358, 1287, -1888, 853, 1054, -2193, 1385, 1164, -2805, 1403, 1442, -2852, 1761, 1554, -3763, 1591, 2528, -3720, 1092, 2743, -3845, 610, 3207, -3491, 252, 3498, -3418, -733, 3510, -2305, -683, 2996, -2361, -1069, 2953, -1563, -962, 2411, -1466, -1006, 1962, -1166, -439, 1920, -1381, -781, 1506, -894, 17, 1237, -1508, 79, 1322, -1579, 374, 1488, -1866, 318, 1537, -2186, 508, 2221, -2379, -220, 2317, -1997, -229, 2433, -2051, -651, 2572, -1619, -969, 2340, -1189, -923, 1935, -1174, -634, 1964, -1298, -799, 1891, -1057, -556, 1781, -1477, -710, 2258, -1175, -1067, 2061]
792B061l025k37L126k533m47K784k376o89K793j494p09J705j598JJ807j626Q1
809c76J435j869L42J527j852O94J523k540L36K107j913K86J602k280L31J961k013
826f99K15J904k048r4J737j671L16J786k038l25J888j220k21J369j194j91J129
843F43r95K5R44p32O5K14p99R18L12j320Q86L39j304J041L73j515J138O56j815
862i26O95R91j240M07O00j026M51M81q49L83K99m09L75l83l57R97l25n94Q56n21
882i5l87J084p38l90J392q73q15J363n67m44J396j085p81J751p28r25J706o72
900A92j067J509n99r26J763m06j377J162p7o82J078m01p62R77l86n33R57l30k86
919a94O34q67l8J179p66k65Q32r64J04J129j218O8J340j394k45J467j160k4J508
$$ y = [2061, -964, -1201, 1925, -608, -1055, 1729, -647, -1336, 1457, -37, -746, 959, -639, -638, 1169, -457, -376, 1059, -810, -468, 1059, -793, -99, 1424, -1116, -780, 1327, -586, -300, 1302, -978, -647, 1314, -699, -484, 1420, -628, -722, 1015, -656, -340, 1446, -592, -917, 971, -249, -470, 899, -295, -486, 643, -352, -327, 617, -115, -50, 164, -635, 283, 595, -725, 161, 500, -804, 237, 610, -905, 233, 889, -926, -231, 760, -480, -73, 527, -499, -48, 433, -416, -33, 266, -143, 232, -151, -508, 489, 164, -430, 426, -95, -482, 602, -136, -526, 866, -7, -822, 541, -26, -470, 926, -159, -940, 811, 83, -842, 864, 192, -875, 634, 35, -891, 872, 466, -911, 251, 174, -508, 570, 169, -593, 384, -2, -535, 422, 92, -194, 440, -427, -465, 714, -52, -317, 515, -449, -345, 784, -434, -366, 974, -420, -665, 802, -358, -382, 1126]
938A126j654l80K052j295p45J959j085r42J880r07j088K043n00j550J451L5j102
955g02J135p5j038R55Q5r02O07J77l67L15l56j33O76l75j99N19n59K4P29q75k
976c61J153r41m93J183o64l32J242q87p46J491m51r92J259j24r64R40j48q52J100
995D13Q9j116O26K68o49N43N7o06N66M0o82M95K40m15L20j64m83O98R0o61L82
1016E1J79m76K87Q3l46M13P1n72J75L05j53Q7j00k01K97k8k27K21Lj09J76l02
1038a66j22O57j99n20M31J5l89M88l1n65N97J47q60L58O41o21J0M11n71M9O98
1059D58m70l86O76p7n92L36L04k88O6J19l80KN39j00m92K86L13n14o1N60k19k46
1081a66M36l39m56Q31J85q80K99M36o49J51N45n07l3N35n87l01P99N2n66J78R2
$$ y = [1126, -528, -908, 1144, -151, -896, 1063, -22, -964, 916, 9, -1079, 964, 464, -1086, 365, 400, -702, 433, 358, -680, 275, 360, -542, 65, 242, -125, 190, -166, -299, 377, 2, -197, 322, -237, -213, 516, -359, -361, 792, -149, -642, 541, -123, -455, 787, -100, -846, 645, 194, -798, 461, 337, -627, 313, 165, -687, 413, 502, -614, 12, 280, -369, 174, 231, -375, 191, 231, -451, 44, 284, -131, 189, 25, -458, 240, 330, -331, 51, 230, -246, 41, 124, -222, 191, 262, -310, -135, 170, 17, 104, 4, -197, 100, 72, -155, 66, 69, -40, 136, -166, -288, 369, 170, -350, 81, 96, -293, 195, 164, -401, 196, 343, -517, -159, 482, -139, -129, 282, -289, -240, 458, -12, -398, 278, 201, -391, -55, 249, -39, 27, 146, -234, -232, 307, 207, -285, 1, 314, -200, -261, 299, 80, -166, 270, -69, -525, 306, 491, -389, -90, 346, -303, -152, 393, -114, -147, 388, -199, -500, 299, 351, -215, -37, 55]
1102E5k66K08K14k68k2K62k49k98M09L11l51j55J38j62J09L62k96k41M23j38m35
1123c90M38K76l19m1rk03K83K70k49k09J25Q2j29j9K75Q0l93k9J72j53K96K76
1145D30o61j36O72k74l85O62k0o27L41Q4m21M77L93p81j71O26j41k68L92J2m38
1166b34J38J96l01J46N21m36n64N38K67m51K41K15n65J19M60n04L2P17m74n81
1186e20N91Q4l23M27p2o05L99L36n62J26N34l91l57L38K9q1K95r5m85J86M32k76
1208A0k25M58m3n34K56K52l55K94K72p42j7P77l59l46N89j96m15M26p5k65N14
1229B76o7n28J65K12k9J22j99p3K39k45l6L48j95QK21n51O2P04l98k58M40l55
1251a37q8N17l86o6N80m72l05M73j16N1K53n52R2L92m46K64K52o12M43J76j032
$$ y = [55, -211, -3, 211, -57, -79, 183, -66, -364, 45, 356, 5, -150, -12, -174, -65, 297, 1, -240, 183, 45, -390, 48, 324, 5, -36, -45, -248, 35, 305, 56, -153, -28, 54, -75, -94, 181, 261, -132, -161, 11, -142, 154, 430, -231, -367, 305, 31, -354, 308, 288, -339, 2, 86, -335, 142, 535, -246, -417, 209, 68, -200, 192, 204, -234, -96, 100, -201, -55, 466, 30, -534, 4, 271, -180, 61, 276, -289, -170, 290, -214, -182, 535, 61, -520, 71, 155, -168, 259, 187, -418, -19, 317, -245, -119, 415, 24, -333, 5, 34, -47, 248, 153, -332, -146, 286, 10, -215, 243, 200, -334, -78, 174, -181, 113, 385, -357, -374, 403, 44, -302, 287, 91, -324, 102, 27, -238, 276, 209, -319, -154, 58, 29, 151, -48, -121, 118, -127, -163, 185, -10, -2, 219, -332, -270, 434, 36, -222, 218, -137, -225, 292, -94, -160, 420, -52, -357, 116, 0, 51, 304, -248, -156, 236, -210, 54, 306, -306, 137, 313, -719]
1272g19Q22O71j322M76O76j408P40J098j745L54J429j707k6J648j244k25J377
1289H95j330l23J589q48m82J044p32k05Q31p18J28P66r17K8N90p51N89M72j279
1308f53N82O70j275P08O84j383P79N48j679J042J028j785O63Q92j790R04J157
1325A092j944P14J248j942M42J336j550N56J017j855N63J292j595M96J060j711
1341g81N87J084j780P24J410j925J76J407j564L24J482j636j16J491j225k69J327
1358G16p51k77P34p81K3Q57n44q6L20o00L90L44p47N64L50j057M25N00q16O89
1378B53L75j336N46Q07j140M49P86j259L23Q63j298L87J296j370k60J248r76j64
1396d70J367j011n68J361p06p43J331k74q04R17m02o81J175j40q90P81r0p01Q05
$$ y = [-719, 103, 774, -548, -72, 604, -804, -64, 1034, -711, -357, 1072, -635, -661, 987, -257, -482, 895, -435, -758, 831, -17, -499, 545, -187, -392, 439, -279, -151, 615, -302, -274, 316, -435, 154, 626, -653, -71, 599, -676, 32, 716, -667, 112, 660, -1019, 23, 1051, -734, -71, 821, -969, -65, 1092, -852, -138, 1110, -832, -390, 946, -604, -48, 969, -886, -323, 969, -626, -130, 930, -781, -194, 890, -890, -166, 1244, -681, -505, 902, -662, -338, 1144, -492, -608, 883, -342, -611, 716, -35, -312, 422, -359, -336, 521, -23, -109, 211, -389, 1, 345, -402, 162, 512, -545, -120, 380, -436, 253, 628, -708, -162, 645, -495, -46, 740, -519, -196, 667, -631, -244, 1052, -318, -578, 670, -306, -470, 897, -114, -682, 679, -27, -770, 561, 287, -517, 400, -2, -683, 492, 352, -538, 243, 153, -548, 257]
1415B57m7o65Q49j55r46P81L05o74N29k7p39N71K50n65L67J51m09J54j12LN09
1436C87l45k96M23m04Q3P24p58j54R62q52l96J300o03n54J153q17p18J612m31
1455C16j105J306k18j153J232N0j151J098J63j345P26O70r33L07M24p32J86M71
1473C12m25k5L15p2k52r9L37J27l57J55R0m32L81K90o79K80N13p63M3N70m42J30
1495cL65o85J03N76m65kL91l90M1K17m12K86L51m72RJ08k21L88M8m80L50L7m43
1518c03L68R6l18M06j43n91N47K25m51K54l0l25L74l8k44L72j48k17K61l13J08
1539a10O39o68k95Q22m86k85Q86n35m65J010m93o94J114q2q57O77m8n95P34J6
1559B85o71M99P2m70L44Mj49L80l40k94N25j18j89L99l76j56N68l94k37O93k65
$$ y = [257, 210, -455, 394, 239, -707, 74, 379, -295, 234, 207, -532, 39, 289, -276, 91, 242, -167, -13, -125, -122, 387, 42, -254, 169, -235, -152, 572, -186, -340, 622, -230, -626, 674, 71, -483, 670, -147, -865, 747, 316, -789, 517, 299, -854, 378, 428, -723, 375, 538, -807, -81, 589, -344, -37, 387, -345, -159, 312, -113, -138, 177, 105, -147, -246, 91, 218, -139, 16, 106, -326, 55, 345, -334, -54, 459, -304, -261, 309, -133, -3, 362, -323, -220, 356, -109, -111, 280, -110, -69, 148, -264, 22, 373, -99, -90, 18, -203, 185, 233, -247, 103, 140, -303, 65, 161, -157, 249, 106, -485, 62, 287, -164, 90, 60, -265, 109, 71, -173, 199, 51, -166, 95, -218, -110, 529, -139, -434, 388, -98, -383, 503, -32, -497, 513, 20, -674, 440, 358, -499, 178, 130, -465, 269, 285, -386, 113, 185, -285, 59, 63, -86, 294, -46, -340, 185, 67, -122, 277, -99, -255, 313, -81, -318, 375, 110]
1580A10l93M78k97j83P20l56m96O58j35m83N94n9m61N36r7o25N44L31n71R6K23
1601A34l15J40K00k24L1J32j40o0qJ68K13l57j60L86j36j65M11k02l49N07r7n38
1623d29N81L00p10J00L73m08J77L89n06p7M42k83j48L77n7j57N4j74O1K99j16
1644H8j26K9j05J09J01k15J62J90m12lK78j31J32J10m62O7M23l26j9L63l15j18
1666a80L35l01l2N68k81m79L70R8k40K68K8l29J37J37k40O3L15r9l21J0K40om7
1689A4J43j86k12L08P9l66L06K76n61q8M54j66m8L50l52l06N06Jl69L28J55m55
1711a89LK58j24J08J95l48k16L46R9j91J05O2k13l8J19pJ08J32k71k31K24K10
1733A41q3l7Nj27l0J36L2NJ26j21l47J45L56p6j38R1k31n5L60n5k05L14q6m77
$$ y = [110, -283, 195, -102, -285, 435, 79, -417, 241, 106, -377, 217, 158, -303, 233, 136, -489, 55, 386, -185, -89, 134, -181, -41, 159, -65, -34, 98, -42, -102, -110, 58, 271, -86, -246, 140, 4, -161, 250, 48, -301, 206, 109, -429, 152, 452, -258, -158, 215, -193, -16, 373, -133, -210, 232, -51, -199, 178, 121, -36, 18, -156, -95, 204, 88, -38, -9, -114, -5, 96, -119, 43, 233, -179, -182, 96, -35, 97, 207, -255, -188, 235, -91, -110, 253, -62, -180, 155, -146, -178, 390, 109, -370, 0, 98, -142, 126, 154, -175, -38, 99, -141, -78, 237, 138, -183, -173, 67, 61, 14, 157, -29, -241, 67, 146, -220, 86, 362, -199, -287, 167, 1, -47, 303, -49, -355, 151, 152, -217, 111, 266, -189, -186, 72, -52, 56, 251, -97, -313, 33, 132, -59, 46, 108, -105, -143, -24, -31, 77, 209, -62, -293, -69, 141, 58, 21, 26, -101, -131, 5, 37, 42, 168, 47, -300, -155, 201, 125, -13, 78, -153, -208, 152, 97, -108, 206, 120, -357]
1757c57K36L47j67L0J7l69R4L97j45j39K05j38k43J38J88L8nj27k03LK75J71k36
1780A0j16J77j78j60M10P0k77J17j29l16M76L29n07j2J94l18Q7L93k04q3J85l26
1802a78j52M53J35j68j36j12M0J44L7R7o8k22P4o0l5M54J8n63Q5J78j82L43J62
1825C44n55R6K52m21J97N17l56k19J44k73J76N03l01k64J91j73k1L00j4l3m2k94
1847b46J8K70R1J00k03l75K75J49k08L27Q8n64J59J79l72N23L56q56m4N29m05
1868b09J79N34n85j96M44l87pO54k19l39P0k01K10L90k72m0K3l75K80K75l48L59
1890B40J11q91K79O34m94K45L35r55J80P30o24J37O79q29j71O03m69K37O99q54
1910a78k70O51m30J27O49o53j22M55o34J82P96n52j22K81p32M01P57p65J16M61
$$ y = [-357, -121, 226, 59, 89, 106, -263, -169, 228, 83, -56, 149, 11, -232, -94, 94, 132, 127, 0, -203, -200, 75, 246, 10, -106, 71, -107, -267, 143, 213, -64, 53, -76, -392, 84, 413, -94, -106, 88, -230, -143, 250, 46, -37, 148, -178, -330, 123, 258, 90, -46, -158, -118, 26, 63, 160, 92, -130, -56, -116, -151, 303, 321, -242, -157, 21, -161, 182, 344, -211, -115, 137, -284, -87, 430, 74, -145, -1, -274, -98, 405, 104, -160, 31, -142, -163, 137, 123, 90, 48, -246, -228, 42, 133, 233, 30, -345, -70, 79, -129, 198, 286, -278, -119, 60, -312, 211, 567, -289, -333, 196, -209, -30, 504, -81, -277, 167, -220, -227, 427, 208, -131, -61, -262, -52, 338, 66, 26, 49, -326, -46, 229, -119, 240, 351, -540, -261, 373, -121, 124, 459, -496, -316, 414, -210, -73, 606, -223, -394, 209, -260, -23, 676, -178, -448, 203, -227, -100, 549, -104, -226, 229, -405, -223, 573, 21, -101, 180, -552, -151, 606, -159, -43, 418]
1930D18r71K57Q64q38L03P05j323RJ212p47j3Q56j108k01J091o47j00R67q26m05
1950d97P16m97K44P59r11j86O30o82L34Q19r85P5O60j131L07J210r74j06P16j147
1970f46J96J290r62j33Q93j105j07J154p05K0Q47j194k01J154n77oP77j066j31
1989e02R33p27J55R54j018k36P52p73L52J079j189k72R74r44R2J304j003l75J065
2008F21j062k57J575o39o91R15p45m38J356l52o59P94n10n82R07m9k24N33o85
2027a92m19P98j46j5N20p91k24P23n52J69R30r02l95P80p20J69J251j011n89J061
2047D45p38k80J416o66o94J013p49n56J525l03q48Q09n65n51J278k11o64Q31n40
2066d8p04J061j30l74Q60p40p57J100q9m31Q72n48p52Q87k05l63J003l61q32N70
$$ y = [418, -553, -296, 568, -270, 33, 738, -585, -576, 636, -111, -124, 732, -376, -577, 514, -133, -233, 734, -92, -497, 219, -278, -34, 725, -186, -372, 258, -424, -90, 729, -256, -181, 479, -652, -345, 865, -109, -215, 501, -646, -450, 840, -122, -255, 638, -467, -574, 580, -125, -105, 742, -452, -653, 501, -76, -82, 695, -371, -502, 431, -296, -141, 813, -205, -441, 311, -462, -110, 969, -220, -492, 482, -462, -370, 934, -69, -444, 621, -441, -698, 877, 238, -453, 462, -283, -721, 635, 283, -376, 418, -92, -674, 233, 184, -40, 493, -192, -611, 187, 41, 26, 546, -245, -469, 254, -298, -129, 801, -101, -496, 284, -436, -267, 984, -27, -616, 445, -293, -573, 843, 177, -517, 496, -253, -809, 716, 413, -435, 374, -191, -742, 536, 325, -339, 492, -48, -752, 309, 179, -195, 665, -75, -832, 268, 179, -252, 620, 72, -680, 207, 2, -361, 642, 281, -551, 19]
2086A9j55j53R04l87o33M91l14j08Q09l55k41M24p65pJ037m83j66N28r66KJ161
2107F42p39j13R57j103l59J235o18j57J157j068o98J299l67m26J072o37p20Q79
2125B36k67l38R63l21o54L67j92O3O56m35k24K48m75K61N12m94K18K21r55L29
2145b81P85o33K35L49j056L07P86p56K72O15j051M4O81o06M05N96j083K2O25n91
2165c35L87N61r22J47M60q38M76P68q71K8L87q21M63Q14q53PN05q04J75P57n58
2186f7Q6L89q40Q4P15l29M9J98o42J29M42l38K84J80o07J49J39l32O27J43q33
2207c74K83K11n48O50K79r07M09K78r17N85P05q68J11L94q57L91Q08p75j6N08
2227C50p15O7O79m49R6L53p48J8O55l33Q5K96p04R1N50m75J67N18o85j21M82m12
$$ y = [19, -136, -289, 615, 228, -405, 86, -228, -336, 473, 118, -123, 301, -464, -471, 566, 83, -83, 445, -521, -519, 642, -97, -210, 747, -356, -715, 520, -98, -255, 902, -166, -864, 435, 68, -358, 714, 77, -643, 236, -31, -369, 594, 273, -381, -14, -206, -143, 513, 78, -146, 102, -373, -112, 400, -94, 124, 345, -610, -281, 504, -129, 106, 455, -601, -294, 492, -264, 8, 623, -428, -384, 297, -309, 96, 692, -391, -369, 256, -335, 52, 613, -309, -162, 298, -540, -64, 704, -167, -139, 248, -573, -110, 704, -149, -142, 363, -441, -266, 491, -67, 19, 408, -432, -348, 367, 38, 87, 285, -357, -228, 214, -124, 160, 340, -267, -118, 21, -311, 316, 459, -374, -91, 120, -428, 222, 501, -406, 3, 281, -636, -51, 654, -214, -103, 291, -566, -175, 633, -142, -158, 350, -365, -298, 381, -68, 28, 381, -367, -349, 306, -27, 58, 354, -350, -259, 291, -184, -17, 501, -184, -305, 177, -235]
2249b35K32N96p34k09N61l87O8N62m84j62L94m80M0O76l43k25K32l90J09N53l73
2270An6K54m67M7M45l09J69K56p17O4N79l78J44L59p24O3O00n55J04O61o62k35
2292c57N54m03R0O60o13k76N42l32m5N64l71j74L73m47k2O39k84j97K71m12L5
2313b05N60l44j13L80m22j14M40j87J5L24n09j38M70j43l0K65l67q3L28k36L6
2334g3L74k92j69J54j68J93K79l47p4J88k15J10K44k71P7J45m29J34M00k48pJ12
2356A17l53J12L82l12J1K38k93p8K64j23R6J67l42p9K98q5QJ23k07k4J61j69O3
2379b5K40j68j36P7r1J07J92j98q8J14p5NJ24o2K3Kk03N8K07n0j6k7j55J02J45
2404A02j41K7J19j50n2Q2l8J07P7k11n8J66j0nM4j16N2M6j18N2J49r0p7K9p9J16
$$ y = [-235, -3, 593, -141, -350, 211, -176, -108, 454, -30, -192, 202, -278, -238, 438, 95, -130, 102, -288, -179, 374, 1, -55, 199, -268, -221, 224, -85, 84, 340, -377, -313, 266, -112, 32, 391, -333, -270, 330, -225, -121, 540, -122, -357, 197, -206, -116, 544, -69, -345, 197, -135, -180, 384, 13, -161, 212, -235, -257, 382, 98, -99, 172, -240, -205, 355, 11, -102, 278, -144, -258, 182, -5, 10, 334, -175, -313, 157, 14, -16, 249, -118, -201, 127, -109, -73, 301, 9, -160, -6, -174, 19, 298, -49, -123, 65, -150, -40, 204, -67, 10, 155, -274, -140, 260, 12, 5, 117, -236, -124, 258, -54, -43, 195, -98, -176, 88, -35, 61, 228, -114, -193, 105, 20, 28, 151, -56, -80, 81, -88, -25, 215, 47, -89, -12, -103, 4, 196, -2, -90, 24, -51, -46, 78, 16, 39, 41, -162, -104, 103, 53, 37, 10, -145, -43, 102, -39, -12, 107, -43, -95, -13, -51, 56, 133, -78, -136, 30, 20, 15, 59, -57, -5, 41, -77, -25, 124, 34, -43, -14, -93, 23]
2430B3J35j76o0J42q0l2J14p6M3N2j58m3K07qq4Oo0K3J27j02l9J32q2r7P8oM5
2457B4P3j44n9J25J5l7J5o6O6J9j15L7J28q0k9M0j12J06J36j99l4J82j04n5J24
2482E6o6k1J05j18m3J56K3q2l9lM6M9q9N4K5q3N8k1r7J90M3k86R1J68j75N5J07
2509A03j88O2J50k13QK01j04q4O9n4O6O3j28JP1m5L0k7n0J56m4j76J46L0j05J53
2535I1r4j79K83J3k96K27P4k68J81M4k40K37R7l53J35J91k24J00M9j73J42M9j82
2558i6J22N5j28J28j03j17L06r7k62L00n4k07L06j08k93M19j8m34L48J11l76K59
2580F1N6l53K96J29l86J76J56k48J28K6j75K02J9k43J90Mj38K37j74j78L93r1
2602H7l45L72ol21L53n5l59M30M5m82L36J41l79K51P6l60K91J13l89K23J46l01
$$ y = [23, 158, -18, -78, 64, -16, -48, 66, -10, 33, 85, -73, -116, 91, 83, -1, 5, -55, -32, 95, -7, -46, 86, 4, -93, -15, -21, 24, 97, -47, -106, 19, 34, -3, 12, -54, 12, 31, -84, -47, 81, 1, -28, 12, -100, 6, 142, -57, -91, 91, -13, -68, 56, -10, -31, 74, -44, -87, 69, 92, 10, -29, -32, 14, 63, -26, 28, 53, -30, 28, 7, -90, 100, 143, -143, -52, 116, -59, -4, 103, -85, -23, 127, -86, -78, 123, 19, -65, 4, -50, 16, 79, -49, -48, 23, -22, 8, -19, -69, 87, 43, -133, 13, 43, -62, 91, -3, -182, 101, 114, -182, 45, 119, -149, 32, 76, -164, 73, 170, -183, -48, 143, -81, 19, 68, -105, 37, 86, -96, 26, 81, -47, 81, -22, -139, 167, 70, -192, 108, 54, -153, 153, 45, -248, 171, 153, -281, 67, 178, -198, 61, 117, -236, 60, 189, -197, -21, 135, -113, 15, 41, -134, 68, 87, -156, 34, 38, -100, 137, -37, -215, 178, 87, -258, 114, 108, -213, 140, 85, -274, 156, 201, -281, 55, 196, -183, 68, 144, -216, 75, 188, -201, 22, 168, -133]
2624a33J86K1k67L12L5l71K63J07l45K56N7l67L34J24n00L04K03m38K19J92m50
2645b58K50K88n22J19L90m01NL24l29L1L31l33o4L37j82q6J62j24O5J03k20J01
2667a3J10k09J71L8l24L32J27n40K98L29n67K01L57n76J87M92o24NN81m73j18
2688b16M93l39j09M57l59j46M68k40j44L01k59j1L11l07l7L57l05l7K59k65Q2
2709d6K88m17M2L42l15J2K99l50N9L19m17M7M13l46p9L18l03K2L89l58q6L78k51
2732d0q8K75j87K2J89l13L6K94k46K9J96l39J16K91l80N8L72l51j03L41k19n2
2754i9L31k52j74K88k9j59J26J1m4j8l6M8K0LO5j53p8K48l7j89K03j3k08J57K1
2779C2j41J98K7k82J04J30j13P3K8j26N0N4p1J4R8k3j05n5J11O2n5L1l8j41J82
$$ y = [-133, 53, 74, -193, 119, 154, -217, 46, 153, -192, 64, 121, -246, 88, 212, -288, 16, 219, -219, 0, 192, -258, -8, 280, -242, -123, 267, -134, -129, 195, -134, -103, 228, -105, -169, 168, -14, -100, 62, -62, 3, 106, -114, -13, 97, -112, 59, 97, -227, 105, 232, -308, -10, 319, -248, -47, 310, -266, -79, 413, -211, -206, 375, -98, -216, 277, -62, -171, 286, -73, -219, 249, 9, -135, 166, -93, -104, 207, -100, -137, 220, -85, -122, 137, -128, -46, 242, -175, -133, 209, -106, -94, 205, -145, -86, 233, -184, -137, 276, -70, -149, 169, -134, -112, 277, -81, -167, 211, -40, -128, 147, -40, -18, 171, -142, -106, 188, -58, -29, 167, -172, -56, 235, -145, -87, 285, -66, -169, 172, -47, -99, 232, -20, -194, 94, 65, -94, 32, 43, -1, -19, -55, -7, 13, 16, 81, -72, -150, 98, 61, -128, 75, 62, -146, 11, 32, -109, 89, 116, -166, -62, 68, -45, 28, 56, -70, -20, 34, -37, -23, 75, 52, -53, -108, 3, 65, 10, 41, 3, -138, 44]
2804D4O8k15J37J63l22K0K33j83O3J86l14l7L02j36q7K02j20q6J11r5N4J56j73
2827b9j9O5j30J55J04k72R1J64k75O7K46k21K7J64l03L6L27j92j02K01j77j8J86
2850I5j12j8J85j81q8J72o3N5R7k41OK15j79M5J71k04L1J25k64J15K88l00l0K11
2874A31k53K8L30l09n6L35k81j37L85j29j56K63k06j74L82o3k42K42p7j73K18
2895E8n7p6K39j65j83K37n8n2K24k10j40L14j37j65L41j09k33K71j30j76M20j01
2917A12l03K48k9j68K61n7j89K45j07k07K93j0j32J66j77j21L36r3j80K50j33
2938Ej73K97j42j41L88k04k78L55o7k11L55j45k79L80p2l07L48J1l08K49k8k34
2960b01L26J4l30K22K9k06K12j2j75K25o4k34K40M1j55J66j20j35K67o1j60K26
$$ y = [44, 112, -103, 34, 197, -125, -105, 128, -55, 8, 194, -120, -157, 145, 9, -78, 124, 4, -82, 29, -66, -12, 144, -29, -48, 17, -113, 42, 146, -126, -35, 129, -146, -79, 167, -54, -27, 137, -166, -130, 197, 5, -97, 104, -73, -91, 95, -17, -35, 150, -31, -119, 53, -10, 45, 142, -99, -93, 122, -57, -12, 159, -45, -14, 111, -153, -38, 250, -50, -80, 131, -122, -94, 236, -73, -129, 206, -75, -212, 173, 44, -112, 151, -55, -229, 153, 90, -152, 90, 13, -160, 58, 1, -75, 164, -1, -184, 53, -5, -57, 167, -43, -183, 131, -6, -171, 170, 61, -172, 99, -31, -207, 213, 112, -191, 57, 28, -140, 121, 64, -125, 120, 13, -194, 99, 89, -43, 123, -54, -175, 161, 68, -112, 138, 5, -168, 129, -13, -154, 234, 30, -248, 107, 40, -171, 184, 39, -240, 140, 68, -239, 109, 120, -188, 61, 33, -201, 125, 139, -191, 31, 60, -146, 66, 54, -121, 104, 40, -194, 46, 87, -68, 98, -22, -157, 110, 49, -111, 115]
2982A15m9j81J82m3j30K73q2k57K14J3j34J94p8j66K20n7j76K43k7j47J47j14
3004d0r9K92r7j92K14o6j35K05n5j50K51r7k33K41M5j72J65n8j81K14J4k07J89
3027D8K8j79J22Kj32J96oj97J00P0j23J06J1j12J07nj19Q5P1p8L1o4k2J30l8p7
3053d5R2m1m6J03q8j3J56j09j13J53j6q3J29q9j11J90l6j40J52Qj25R7l9r3J85
3078G8j4j66R3N1j17R1Lq3R6kj33J01N4p3M2m7n6J35nj27R8J4p5O3j4n9J19j4
3106E3j36P7N5o1M9k4n2P5j2n8M8L0l6Qo0jJ28p7o0Q7l1l0P7o6l0J41p4j17J14
3135A7J3o1N9n1n6J20j8r7Q8J5n9K5k6j0R2m1o6M8mJ6L9r9K7J11j17k4R3l5k3
3164b4J00j30j5J48o7r4J35j1p1N8k7l2J00l5n7JJ8M4j1q0Q2L5j31O1P1j22P7
$$ y = [115, 66, -115, 67, 24, -106, 167, 85, -172, 42, 55, -79, 115, 37, -129, 91, 34, -142, 101, 74, -73, 74, -40, -139, 153, 56, -136, 78, 12, -123, 82, 27, -123, 128, 31, -202, 39, 84, -88, 77, 19, -162, 52, 66, -141, 48, 76, -103, 19, 21, -111, 85, 79, -118, -18, 52, -71, 35, 46, -66, 41, 36, -83, 2, 73, -5, 26, -38, -60, 70, 32, -45, 47, 6, -40, 63, -25, -38, 118, 9, -104, 49, 33, -50, 79, -10, -121, 69, 33, -107, 45, 53, -72, 25, -14, -107, 78, 64, -102, -9, 42, -75, 16, 19, -64, 32, 30, -103, -2, 52, -21, 21, -26, -82, 53, 48, -79, 19, 33, -42, 21, 7, -52, 67, 53, -83, -6, 49, -12, 37, 13, -39, 36, 24, -34, 14, 44, 8, 16, -44, -45, 83, 6, -54, 33, 2, -28, 49, -17, -47, 94, 20, -97, 17, 30, -31, 28, -23, -79, 41, 23, -74, 14, 29, -30, -5, -31, -41, 51, 10, -56, -8, -12, 4, 43, -56, -29, 82, -35, -59, 34, -1, -24, 76, -54, -69, 79, 12, -82, 53, 42, -29, 29, 2, -30, 70, 35, -22, -21, -3, 41, 30, -50, 32, 67, -64, -3, 68, -54, 23]
3191B3O5k08O6J86j71l8J66j31l0J58j20n3J97j07j03J22j3l6P7q1k3R5n7k8O5
3216B1k2OQr6Q6O8j00L3M5j36J09Q1k18J07J64k62K8K06j83J4J96k23l7K62j44
3241A3j12K08m6j44J32l3o9J20n3o5N5l7M7N0j64R3J31k33K8J95j77MJ90k35l9
3266a41L00j76j41K90j35j25K16r2j15K31p5j83J96k2q8J43q0r5J64n9j09J66
3288G0m0p8R6j10J1J77j51k1J53j50k6K20k13m9L28k45j82L80j36j92L10j11k64
3311b23L45nl08K39Q1k55J08O0j14J18Oj33Q3qk8R9j13k6J84j51r6K49r7j28K15
3336A02j27j39K92p4k17K20Lj89J89k8j29J92m0j98J79M8j68J44l1j36J70rj29
3359g5J23K4j17Q2m4m2J55p5j15J35k4j10J79o6j47K09k8k28J84R8k13P0R3j61
$$ y = [23, 88, -120, -54, 132, -39, -77, 89, -42, -72, 86, -34, -87, 110, 3, -100, 22, 9, -27, 50, -31, -54, 41, -16, -44, 21, -1, 5, 13, -83, 3, 71, -29, 4, 49, -87, 22, 103, -115, -8, 156, -106, -78, 128, -55, -41, 155, -68, -105, 157, 13, -99, 109, 63, -81, 51, 18, -51, 69, 16, -49, 6, -31, 16, 66, -98, -5, 126, -107, -79, 116, -61, -57, 133, -102, -141, 159, -17, -158, 132, -3, -128, 88, -4, -119, 112, 37, -146, 50, 28, -60, 83, 3, -92, 72, 13, -96, 70, 30, -48, 48, -62, -51, 126, -25, -46, 107, -43, -69, 151, -62, -111, 217, -28, -210, 170, 34, -158, 152, 41, -223, 122, 117, -191, 48, 129, -126, -18, 42, -72, 46, 52, -81, 2, -6, -34, 65, -48, -74, 110, -41, -137, 112, 15, -113, 102, -25, -164, 128, 54, -163, 57, 60, -129, 60, 32, -97, 95, 55, -143, 36, 84, -84, 60, 29, -107, 63, 54, -75, 48, 72, -45, 37, -7, -49, 106, 31, -84, 51, 27, -83, 96, 30, -117, 92, 64, -164, 20, 118, -95, -25, 68, -93]
3383i3N6J47j38m4J22k9p8J5Q9l0o6K7L1n0L1P5j29j7J62p1j18J88j3j35Q1K4
3409C7j16J15P7j77J7J20q0l4R9m3m8Q6l9q5J34J4j42N0P5q3K6O7j06OJ15j07
3435b2n5J33oj14M0N4p1L9M3p7j5Q3qq3K5Q7m7r0P7L9q5N7M2j35M9J34j39n2J74
3464G7n0j02R0J9r4J00Jj02N0P5o3l2M4Nkk6kL4j1j3K5n1J2R1r0l7J15m0q4J08
3494D7m1p1J36m2j60J78J2j51J22M3j78J40L2k02J35J22k14L3J33j35K7J19j65
3517h0K4J37j12l4R3l0Q%p5Q1M0j12O7K5j18J31L7k02J46J20k50O9J57j83M7J34
3543A20j95K9J71j51j8J20j02L5M1j16Q7P1j63P4L9j31J39M7k23J36J12k60J09
3566b9J51k19Q2J36k61P9K16k51J1K08j92QJ80k06RK30j82q3K11j03n3J24r9l2
$$ y = [-93, -37, 110, -28, -72, 50, 21, -57, -42, 47, 17, -49, -22, 9, -41, -10, 65, -64, -81, 81, 10, -108, 80, 67, -68, 13, 37, -79, 36, 113, -64, -47, 73, -7, -41, 58, 15, -33, 53, 14, -71, 63, 77, -65, -15, 60, -23, 3, 70, -36, -30, 85, -22, -77, 56, 50, -64, -24, 30, -41, -2, 41, -36, -51, 32, 24, -59, -34, 53, 6, -84, -7, 32, -53, 4, 46, -89, -40, 94, -45, -97, 77, 27, -75, 15, 34, -60, 40, 41, -61, -11, 64, 1, -31, 13, 18, 16, -10, -12, 22, 11, -2, 23, -28, -16, 75, -15, -52, 63, 23, -61, 47, 6, -65, 71, 29, -131, 47, 59, -92, 30, 73, -105, 35, 67, -135, 0, 122, -92, -59, 74, -61, -34, 85, -80, -56, 81, -31, -65, 28, -2, 6, 6, -69, 12, 52, -60, 7, 32, -86, 45, 82, -120, 26, 146, -104, -35, 122, -61, -14, 120, -75, -46, 125, -26, -44, 76, -26, 9, 50, -66, 21, 92, -71, 3, 42, -89, 50, 97, -126, 10, 122, -138, -29, 122, -97, -15, 121, -140, -61, 155, -96, -85, 123, -69, -61, 119, -87, -78, 152, -30, -113, 98, -5, -58, 66, -33, -65]
3590f5J42p7n2Q0l3OK5p9P4O9j28K8O5j13Q2P0j91R0J51k00%J72j35k5J49j55
3616e0j3J71j02p8J37o0m5Q6n6k0P3o1j4N7m9K1L8r8QJ28j12j8J33j04l6J27q1
3643a8m7J39o9r2J31k6p8J06l4j04J31Jj11Q3L8r3L2L8m3L6L6q5J6N5j9k5J2j0
3671@J2j7oL4k3LK7n5kJ12p0q0J04k6n9P0j3p6J11k2j03P8L1p1K9J6n4N3K5j01
3701g3N6N9q6K8K6n9P3Lq2K6P4n3QRl5L1K5o8L7L2l5kJ8j0J9J8o3K3L8l7LK7l0
3734@RJ2m8J8N9m5j9J0J5J1jl7PJ1lpmmK4j1k4J2L1j6j1qoK9Ol3mL3j2pj4L3l
3771CNj8NK4jl9J9QmJ1j2j3K6J4n8J3M1j3LNl2J7K3l2j6M8Nn1K9j0J3L6n9k0N5
3806B5j8j1L5m9LN7o2l9R2k5m4M1k3j8N8j2n6N6Jm2J1K0kL0n8QM1k9J3K0o0L7
$$ y = [-65, 77, 0, -52, 28, -5, 1, 26, -53, 21, 90, -38, -10, 55, -58, 24, 94, -97, -7, 144, -56, -56, 116, -19, -44, 105, -50, -63, 108, 6, -72, 65, 5, -40, 46, -10, -30, 43, -18, -32, 25, -24, -3, 35, -63, -55, 73, -39, -57, 76, -28, -64, 63, -18, -65, 74, 5, -87, 44, 18, -60, 46, 12, -92, 39, 40, -71, 12, 50, -43, -11, 27, -16, 20, 56, -29, -13, 42, 23, -2, 10, 0, 12, -5, -11, 23, 0, 3, 30, -25, -27, 85, 15, -65, 39, 13, -46, 24, 11, -65, 46, 24, -79, -1, 30, -41, -12, 4, -50, 3, 28, -73, -17, 42, -44, -16, 10, -49, 24, 27, -55, -29, 45, -8, 0, 9, -26, 5, 30, -38, -1, 31, -4, -6, 12, 2, 21, 39, -24, -1, 37, 0, 3, 30, 0, 9, 21, -27, -9, 50, 5, -14, -4, 11, 22, 21, -16, -9, 2, -1, -8, -12, -16, 8, -3, -27, -15, 16, 0, -11, -19, -25, 4, 10, -23, -27, 6, -6, -13, -27, 6, 3, 8, -10, -5, 19, 18, -21, -2, 6, 2, 13, 1, -12, 14, 28, -30, -17, 24, 11, 14, 19, -13, 4, 27, -5, -21, 27, 32, -19, 10, 0, 13, 49, -10, -30, 25, 7, -4, 31, -18, -15, 42, -20, -59, 33, 8, -36, 5, -18, -36, 22, 10, -46, 10, 11, -31, -20, 0, -2, 28, -30, -22, 19, -10, 3, 23, -37, 0]
3838@N8r6QR3o7l3Q9q8QR8p2m8J16m3o2J02n4m2R0m7q7R9L0r0N6j0l5N5j4n2M1
3869CJ2l2P%J0M1p5nO8m1j7P2o9l6J26p7o2J28l8r6R0Qq0R3Lj05P2L6q0L4M3n6
3901b3K5J5n5L9K8l5J8pk6N7l6l2R3l4p7P7mn9J05j9j19J00M6j31O8P0j33M4O9
3930F4j22M8Q9j19k3J10p6ON0n3rO9n9nM2k4Qlm4N9K6p6L5J6o0N8L1j03Q7M5j40
3961g3M1R8j12M8P7j46M1J15j19kJ09p9n0J08o6k2J01o1l9N8k4OJ9m7K9L9p9L0
3989@N6q6L4M9j29M9J27j22m2J31j04k0J20p4m9J12n8q0R6J5m8L2k6k1M3k2jL2
4017A4l0kK4m4K6P9q2l0P8m9oO5m5l2P0l7n1R1j2n5M8j3m0P0J7r5M8L6o8J5N0
4048D0n4ML2m6j6P9j6m8kL1j1j9L3J2l2j2L4m4kQ5l9r1P5M2r1L8O6j01J1Q8q9
$$ y = [0, 58, -38, -30, 63, -4, -37, 52, -36, -28, 70, -2, -50, 66, 23, -39, 63, 9, -33, 57, 10, -77, 22, 52, -38, 18, 8, -27, 28, 14, -38, 3, 15, -17, -10, -10, 0, 41, -34, -39, 29, -12, -29, 43, -26, -62, 64, -13, -75, 53, 15, -81, 9, 17, -63, 30, 33, -72, 0, 36, -44, -10, 33, -23, 2, 17, -38, 1, 29, -6, 12, 5, -21, 36, 0, -32, 61, 27, -50, 27, 23, -36, 69, 50, -69, 31, 77, -54, 14, 84, -49, -5, 64, -58, -10, 79, -40, -63, 47, -29, -23, 27, -26, -35, 34, -25, -30, 12, -12, -4, -7, -51, 8, 34, -42, -7, 9, -51, 7, 38, -65, 22, 67, -73, -32, 66, -46, 2, 79, -67, -26, 89, -30, -32, 77, -2, -52, 56, -10, -32, 69, 8, -31, 27, 3, 9, 28, -19, 10, 49, -30, 0, 56, -30, 4, 53, -76, -27, 100, -22, -64, 67, -37, -57, 63, -11, -60, 52, -6, -86, 10, 25, -23, 9, -17, -38, 5, -17, -18, 14, -16, -18, 6, -38, -12, 67, -15, -45, 33, -16, -22, 43, -2, -34, 36, -1, -52, 39, 27, -28, 20, 7, -33, 37, 54, -41, 7, 43, -25, -10, 40, -14, -10, 22, -24, -40, 39, 23, -25, -27, 4, -7, -26, 7, 19, -13, -25, 9, -35, -37, 48, 9, -82, -7, 35, -56, -18, 48, -53, -42, 46, -43]
4079d3qJ20n1r7R5On9N5J4o4L3J2j7%K3knl5jO0k0j9K6l1oL9k4k5O6m0o4P7qj7
4113a0N2l7p9J05J4r3N7M5j07M0N1q2K1Q6j15j4Q1j1l3L3mk8MJ9kKJ9%n1oR6k6
4145B7q7Q0op4R1J2r3N5O9j40K5J11p2j0Q1q8k4J07m5n1Q1l4m8L9KjK3m4rL8j5
4176@PL2o5J5N5r2J7Q3o8k7Q3q4j0J26p5p7J33n9p8J27k5p4Q8j2j10R4N5r5K9
4205gK4l5J8lNJ6j2nK0n0M1O8j08qJ12j01j5J29q7n8J50q8j03J81k1j53J27kj02
4234f7J01K1j19O6M7r4K7O0m4lJ3n7N1Nj3Ok4j6N8l5k1P8m3n4P8k6l9R3l4q9R3
4265A9J5r1P2Ro7M2K6o8L6N1m5k1L2j8K4l%jj6%L3l2ON9q7l1J07l2m6P2l2o2P3
4298B4K4r9O7N8j17lP4m3RM6o2j8N0rm1N2Kl0j0JK9mkjk2KN1l3j9M8l4l6M8J4
$$ y = [-43, -51, 69, 18, -79, 16, 22, -37, 18, 32, -32, 1, 13, -4, -4, 19, 17, 12, -23, -24, 36, 16, -3, 23, -8, -14, 25, 1, -24, 42, 2, -62, 15, 7, -10, 42, 5, -74, 31, 45, -48, 9, 54, -53, -13, 38, -44, -23, 63, -52, -66, 15, 4, -29, 4, 0, -28, -24, -5, -7, -5, 14, 14, -37, -43, 53, 27, -60, 20, 14, -60, 31, 43, -50, 5, 74, -66, -41, 70, -2, -12, 69, -19, -43, 64, 19, -32, 49, 15, -33, 6, 8, 7, 30, -14, -23, 15, 0, 7, 39, -26, -11, 44, -48, -31, 52, -16, -43, 40, -44, -54, 72, -3, -80, 53, -6, -84, 43, 18, -56, 32, 20, -90, 4, 59, -36, -7, 17, -18, 0, -3, 2, 18, 6, 1, 21, -29, 12, 80, -28, -36, 76, -25, -40, 89, 2, -56, 94, 6, -97, 84, 63, -90, 37, 35, -67, 34, 55, -64, 2, 49, -45, -18, 42, -2, -5, 8, -49, 2, 7, -6, 0, -24, -40, 18, -17, -38, 40, -3, -57, 21, -5, -44, 49, 15, -74, 19, 34, -57, 15, 24, -43, -1, 25, -43, -7, 44, -1, -22, 10, -8, 16, 13, 13, 12, -4, -4, 29, -3, 3, 62, -25, -56, 51, 19, -27, 45, 13, -49, 24, 48, -51, 16, 74, -43, -46, 28, -15, -6, 40, -22, -40, 10, 1, -40, 12, 14, -16, -26, -25, 4, 0, -2, -3, -25, -23, 28, -5, -24, 24, -10, -46, 2, 16]
4332A6l2M5j3n0K9N0n5JL1kk8L2mk0L1ll7OL2j9j7J3J1l2J1L2l1RJ9l7k9N5Ml0
4366a2mK6l1J4K7m0j0M7k6k9M8Nl6MJ0j9J7J6nl0L9nn0J8M3k0oK2l7NM6k0k2L7
4400B2j0k9J6J7lLnj7OJ2J5l9QK3rk5K0Ok1J8Lm6L2M2n1k4N7k6k5M1rk6M6l4k2
4435c4K3L6n0LK0j5%QJ6j4LPk1k8O9j4m7L7K3n7M3K2n7K5M4p7J2P8m2m4O3k5l0
4468b3M2j0l3M1jk1kJ8Nj5j0J1J7j2kkk9K7J4m2K9J5l5KL7n0MO3n8l2Q5m3k9L0
4502iJ1k1J9j3j4K7OrjpMJ1l2L0Rl0K1K0n0L1L9n5j2P2m2k1M5k1k8N1k6l0M8K
4536B5m9K4K0k7L2ql2MJ0KqnJ6kl2L3J3l1jK4m2K0L2m1k1O4k5l7N2j8k4M9po7
4570e7N3K5m4J6K3n2L4Pk7K8K2k5jpK0J2k2%J8j4j4L6l4LM1k9n3P5j7n9N5On9
$$ y = [16, -16, 29, 16, -34, -5, 45, -10, -9, 22, 20, -8, 24, 20, 0, 31, 28, -9, -3, 29, 10, -7, 6, 17, -15, -4, 28, -3, 6, 25, -12, -41, 14, 18, -12, -16, 10, -21, -7, 20, -20, -30, 17, -9, -38, 10, 15, -21, -17, -7, -26, -9, 7, 2, -28, 11, 6, -44, -26, 17, -3, -9, 13, -24, -19, 27, 7, -15, 22, 12, -17, -1, 16, 13, 16, 11, -6, 0, 12, 27, -12, -4, 19, 10, -15, 5, 11, -10, 8, 11, -35, -3, 39, -12, -36, 21, -5, -30, 11, 2, -24, 22, -12, -34, -11, 25, -25, -22, -2, -17, -17, -9, 7, -7, -4, 3, -18, -46, 23, 9, -38, -1, 22, -35, 8, 30, -27, -2, 42, -35, -23, 55, 13, -31, 32, 7, -23, 19, 9, -24, 17, 16, -5, -7, 11, 16, 1, -9, 2, 19, 7, 5, 3, -26, 1, 15, -27, 2, 17, -18, -16, 21, -29, -25, 38, -20, -52, 33, -10, -39, -9, 2, -19, 0, -13, -27, 0, 6, -3, -4, -11, -7, 4, -28, 2, 11, -19, 2, 22, -28, 3, 42, -13, -25, 47, 5, -16, 29, 8, -20, 31, 5, -25, 23, 25, -24, 0, 20, -7, 25, 17, -15, -11, -1, 1, -7, -12, 4, 2, -30, 3, 16, -15, -16, 8, -34, -14, 18, -23, -44, 20, -5, -42, 10, -8, -32, 17, 10, -57, -4, 21, -23, -7, 16, -36, -2, 5, -22, 6, 28, 3, 2, -5, 15, 27, 5, 5, 23, 9, -5, 31, -3, 0, 41, 12, -41, 34, 17, -42, 13, 19, -40]
4603d0N6J7o2K2L5m6RK9j6LonrJ9k4pK3j5K4k4pL6qm5L4Nl1N2km5J5K8n3L4L5
4638C1m9K6On3L6M1n8NL1k1J8J8l9J4K1k7j9K0J0Kok5K8Pl3J2K4m3L0Lm9M3L6
4671D0n5rM5l3j0M0l7j8N0j5l1K7J7k1qLRPj1Kkj4K3j3j3L9Jl3LK5j8RK4n0K3
4706dK4k3j4M1k6k0N4l2k2M9nn8M3J4l2L6j4j7L0qk9J8J4k5j2J6pJ2j6O%Rj3%
4740a1rJ6Nl0OJ3%kJmlJ4Jj8K2j8QLQj6K0qj8J2MKJ9qj2QJ1m1L2J3l1J0L3l3J0
4779IJ8l0QJ6j4pJ1J5k6J2j6j9L1Pl3J1Pj2RQrkJqmJ9Mj8NJj4QJ1Llj3J3j5lL0
4819A1k0%JJ1j5K1Ql4K7Mk5PK3j6%OqJ3J4l5JK4j2JQj5QJ3l0RJ7j5kPk4J5L0l3
4857eOJ2k3qJ1J1JOk8j3K6kNMj0j4PNlJ1Qj2mqOJ3qmJ8pj7L2j5OJ3k8lM0j1k3
$$ y = [-40, 16, 33, -29, -7, 28, -18, -9, 20, 4, 7, 1, -4, -13, 6, -18, -25, -2, -17, 7, -17, -24, 12, 4, -41, -7, -2, -33, 19, 17, -28, -13, 15, -38, -4, 31, -18, 8, 14, -39, -3, 38, -20, -15, 16, -5, 13, 31, -8, 6, 27, 0, -19, 1, 11, 13, 7, -18, 10, 17, -16, -4, 20, -23, 7, 10, -39, 4, 40, -15, -24, 21, -12, -22, 18, -19, -37, 13, -2, -33, -6, 11, -10, -18, -15, -6, 1, -10, -8, -10, -24, -1, -14, -27, 12, 13, -20, -17, 8, -10, -1, 23, -27, -4, 20, -3, -17, 24, -2, -22, 32, 0, -22, 27, 22, -36, 7, 21, -11, 25, 11, -6, 24, 16, -13, 5, 19, -6, -18, -2, -9, 3, -13, -7, -7, 2, -11, -11, -20, -4, 1, -29, -23, -10, -10, -12, -11, -15, -18, -4, -3, -21, 1, -17, -9, -6, 2, -14, 6, -2, -20, -8, -4, -2, 17, 9, -3, 5, 16, -25, 7, 20, -11, -1, 32, -1, 9, 27, -3, 5, 21, 7, 0, 11, 26, 0, 12, -4, -23, 8, 15, -18, -7, 0, -12, -3, 5, -4, -6, -5, -13, -17, 2, 6, -12, -7, -6, -20, -12, -1, 2, -1, -14, -1, -16, -19, 11, -9, -9, -8, 3, -12, 9, 17, -17, 10, 14, -11, -4, 19, 3, 3, 9, 1, 14, 28, -7, -6, 18, 6, 7, 15, 0, 8, 21, -9, 0, 17, 2, 0, 7, -17, -2, 28, -5, 1, 13, -10, -18, -7, 4, 5, 11, -17, -30, -4, -6, -1, 3, -7, -21, -14, -9, -12, -1, 7, -5, -9, -17, -11, 2, -6, -10, 8, 1, -16, 16, 1, 7, 20, -8, -11, 29, 18, -5]
4897eJ0j4J6J1qjJ9k9j2L3k2kK8k4nJ1Kj1K5k2j1Pj2j2M4k0mNj1j0K7nk9J6Jj3
4933b7J2J9j8J4j8JMJkpJ3mJ1kOjlpJ4j1MK8k5rJ4MmJ3nj9J6Kj5K4Kj7MqmlJ3
4974A0k0J4J8k7oJ4oKj0PqK0jqrkJ5j4KLMk0J8%JMKj9J1QoQpOj0J0j3J0j1K0p
5015CoJ3Qnj5J5j1MQk1K6Jj0k0L1j9PlmNj7K7j5J4k%k1RjqJMj3J2%k2J8kOpJ1
5056Aj6MJ4j3j2L0qk1J9J4l3NOjOJ0qmRpRRj5OPKpRKj6J5j8J7Oj5Kj3K0mpJ3o
5098A1r%J0oJJppLoPLj2J4%Kj9PRk5J1Nj4J0K4l4J0QnqK1ooPj5MRPLpOpJ7pj8
5143hPJ2koJ6j5J1j1RoPljpMj1QOkmj1MmnOj0J0J0%rnKj0OojJ2pj1K0njRk%Qk
5190Bj5QpOJ0lj2K3pj5J3LoJ1m%NrnJ5qj0J1j2PPj0j0K6kj5NnMMnj1QmnjNRpj3
$$ y = [-5, 5, -9, 7, 18, 10, 9, 28, -1, -13, 20, -2, -4, 24, 0, -5, 6, 8, -3, 22, 0, -11, -4, -16, -28, 16, -4, -8, -3, -14, -24, 3, -2, -31, -15, -14, -27, -15, 4, -14, 0, -18, -17, -13, -12, -14, -21, -8, -12, -1, -3, 3, 2, -1, -8, 6, -5, -1, 27, 2, -7, 7, 11, 7, 20, 15, -4, 12, 14, -1, 23, 25, 8, 12, 4, 0, -3, 10, -10, 4, 22, -5, -11, 3, -3, -1, -11, -4, -12, 8, 7, -1, -10, -12, 3, -11, -9, -6, -2, -22, -4, -4, -3, 1, 3, -16, -5, 3, -3, 5, -2, 4, -6, 4, -9, 1, -10, 10, 3, -3, 10, 18, 13, -2, 13, 2, 6, 14, -7, 19, 20, 10, -10, 21, 2, 9, 6, 2, 7, -10, 17, 2, 16, 14, 14, -7, 2, 1, -7, -6, -2, -15, -3, -3, -25, -7, -9, -3, -10, 1, -15, -11, 3, -10, -22, 8, 0, -21, -2, 12, -21, -16, -10, -11, -5, 5, -3, -7, 2, -5, 4, 13, -2, 4, 11, 13, 6, 15, 17, 1, 16, -2, 15, 21, 6, 8, -5, 15, 11, 4, 17, 11, 2, 2, 12, 6, 7, 8, 1, -6, -3, -9, -2, 1, -11, 3, 3, 5, -14, -7, 2, -23, -12, -7, -21, -11, 13, -21, -11, -3, -8, -16, 5, -1, -7, 0, -15, -11, -2, 5, 8, 1, 7, 0, 17, 10, -8, -1, 11, 9, 3, 19, 4, 15, 4, 13, 7, 14, 11, 10, 3, 7, -4, 4, 10, 8, 4, -7, -3, -7, -12, -6, -16, -6, 4, 4, -5, -10, -8, -18, -12, -18, -19, -7, -14, -25, -5, -10, -11, -2, -4, -4, 4, 2, -13, -5, -12, -6, 4, 1, -11, 12, 5, -10, 3, 6, 0, 11, 7, 7, 12, 3, -2, 13, 5, -5, 6, -6, 1, 8, -2, -12, 14, 12, -3, 2, -3, 1, 5, 0, -11, -3, -7, -12, -13, -8, 1, -6, -19]
5235a9mjkK3kpNnjj1J8J2j6M%j1J6moMPj2J7Kj2J3kj4J6Oj2RK3k8j1K5k4J3rO
5275FjnPPrj3OnM%lrJ6Mj4RKj9J0LkJopPknkLJ9j9K%kJ1pMJj0J0Qj2J3Oj6KQm
5323cJ9kj8QNqJJ4j9QJ2j0j8K1J0plLj8J3LolkkpJ2Jj5QjOqJokMnj1K2Mj9J3Q
5367Ck6MJ9nj5J7lj1J9lj8L2qqRNnqOrJ0QmmkPqMmJ3j8JK0k0Q%OpNkmrJ4j6j0
5412a7K6j8kNmRkj2QMj0KJ1j4MljjJLJ3j3J0J2nojjOj3RnkK4k2%PJj0J4Mj1J3
5455A3Qk0mK8rj0J2rnRpj3J6Rj0pJ1qMj0knRm%JJj%J%rnMj1J5pjJ3Lj1NMK%ml
5502gK0%j3LJj2J7llPJ5k3%J3qPKkj1J2kj2J3Nl0K5k1jK5mk5K6j7mMnpK5j1j4
5542a5%J2ljqJ0M%j2J1j2NRj8J2Pp%J0j2qL2j6j3K3oj1J1KmNojQKj9J8LJOpj2
$$ y = [-19, -23, -24, -26, -3, -5, -12, -7, -12, -13, -24, -6, 6, -10, -6, -6, -17, -1, -5, -11, -7, 0, -12, 5, 7, -5, 8, 6, -8, 8, 14, 2, 11, 34, 6, -5, 20, -4, 9, 0, 6, 5, 0, 7, 14, 5, -8, -2, -7, -3, -3, -6, -15, 1, 5, -9, 0, 2, -17, -7, -4, -6, -5, -11, -18, -11, -13, -18, -20, -17, 2, -17, -15, -15, -17, -6, -13, -9, -8, -18, -8, 0, -12, 1, 7, -9, -7, 1, -3, 16, 14, -4, 4, 9, 1, 2, 16, -3, 5, 17, 7, -11, 10, 20, 13, 10, 13, -5, 8, 11, 5, 2, 0, -2, -9, 3, 4, -11, -3, -4, 2, -6, -5, -11, -13, -9, -14, -25, -3, 1, -18, -5, 3, -23, -19, 0, -5, -20, -3, -6, -17, 2, -1, -19, 13, 5, -3, 6, 11, 6, -2, 4, -5, 5, 13, 9, 5, 3, 10, 2, 6, 2, 15, -3, -2, 18, -2, 6, 6, 12, 5, 10, 8, 4, -5, 9, -7, -17, 9, -9, -11, -6, -10, -1, -3, -15, -7, -3, -13, -11, 0, -14, -10, -13, -14, -15, -14, -11, 2, -11, -1, 11, 6, 0, -1, -2, 4, -9, 0, -5, -7, 17, -5, -5, 2, 3, -7, 7, 11, 0, 13, 21, 1, -3, 25, 16, 6, 18, 9, 4, 13, 6, -7, 9, 18, 8, 1, 12, 4, 8, -2, -4, -9, 0, -4, -4, -3, -2, -3, -3, -2, -2, -11, -16, -12, -23, -8, -15, -16, -3, 0, -11, -6, -2, 0, 0, -4, -7, 13, 13, 0, 3, 4, -8, 9, 6, 3, 10, 25, 2, 2, 15, 7, 14, 16, 14, 3, 15, 13, 1, 14, 19, -11, 14, -7, -8, 17, 13, -12, 14, -3, -7, -3, -8, -15, 10, -1, -15, -15, -3, -6, -7, -15, -5, -1, -1, -13, -2, -14, -9, 0, -18, -6, 1, -6, -6, 4, -8, -16, 16, 0, -13, 10, 4, -7, 4, 6, 2, 7, 1, 0, 8, 10, -9, 9, 12, 13, 19, 12, 0]
5584@J2mrJ0jpPj4jRmj0J1kj4%Pj1K1kj4NJkRj0jQj5LLklOjOQjonKNKOj4J7%K
5632Gjj2OklRKRrLOj7J4j3kRMojpQKj2PmN%j7K0jr%oJJqRj0%P%oPOj1KRPnj9J2
5683iJ3rqPJ3j2OmK0j8JqNJ9mJKj3J1j5O%J3j4%jj0J8mLkmPj4RPj2lJ7k3J0jp
5726gjJJ7j8oQqQj6JNJ2%nJ6j4j7J5J2j8J8k0J2QjJj0mJ3rRM%J2lomNOqLj8J0
5769CJ4j5%N%lJ3k2J1JoqPMNk0lK1k3J1j4J7KpqJ0j5K2j9PLqOlLj0NONljJ8l2
5812b1J8nJ4rOj5J3K2l3J4NLj0MlJ2j5JNqMPKJJRl3RJ2j8R%j3RkqPKj0J1nj6J8
5855fKj2LjKj1QNjMj1J5Rj6%kPJ8k2JJ4Kj2J6j3j2L0kmj2RjMLj6K0Nk2K%Km%j
5899@kKpoJ5nLlk0J8qnRQj0LKj7J9qpOPpJoQkJ7k0nNJLmJ8kJqnL0j2KrkJ5rj0
$$ y = [0, 12, 8, -1, 9, 8, 1, 8, -6, -7, 2, -2, -12, -1, -3, -17, -17, -10, -21, 0, -2, -16, -11, -10, -12, -3, -13, -14, -6, -21, -18, -15, -17, -20, -14, -15, -9, -1, -2, -8, -13, -11, -6, -4, 2, -12, 5, 5, 7, 6, -6, 0, -2, -5, 4, 6, 15, 6, 9, 15, -2, 12, -1, -3, 6, 10, 4, 3, -4, 4, 6, -6, 1, -3, 2, 2, -15, 5, 4, -5, -5, -11, -10, -9, -17, -8, -18, -18, -11, -11, -17, -10, -4, -15, -13, -4, 3, -2, -21, -9, 4, -5, -13, -6, 7, -5, 1, -3, 17, -1, 0, -8, -3, 16, 12, 13, 15, 2, 13, -2, 4, 4, 17, 3, 3, 2, -8, 10, 6, 9, 7, 3, 10, -4, 5, 12, 0, -3, 14, -9, 1, 0, -7, -8, -7, 10, -8, -14, -6, -14, -6, -22, -21, -16, -4, -4, -9, 7, -7, -24, -9, 3, -15, 3, -17, -5, 3, 2, 3, -7, -11, 2, -7, 2, 6, 6, 18, 15, 9, 5, 10, 16, 8, 11, -7, 3, 17, 2, 2, 7, 7, 4, 17, -5, 6, 7, 1, -7, 0, 4, 9, -11, -14, 7, -16, -5, -19, -2, 0, -7, -15, -5, -20, 2, -17, -10, -7, -15, -9, -12, -9, -19, -14, -8, -3, -6, -7, 11, -21, -3, -8, 6, -3, 3, -12, 1, 23, -10, 4, 9, 12, 2, 6, 3, 15, 0, 1, 6, -2, 2, 9, 11, 12, 13, 22, -11, -2, 10, -8, 1, 1, -12, -3, -5, -13, -6, -4, -14, -3, -8, -24, -6, -4, -16, -13, -14, -12, -23, -15, -10, -11, -7, -18, -3, 6, -10, -10, -12, -5, 13, -9, -8, 6, 8, -4, 12, -1, -13, 17, 15, 11, -1, 8, 7, 11, 14, -2, 18, 23, 1, 3, 3, 5, 1, 1, 0, -2, 0, -7, -13, 2, -3, 0, -3, -23, -5, -13, -18, -9, -1, -11, -8, -6, -23, -4, -12, -19, -13, -6, -13, -12, -18, -10, -12, 5, -15, -20, -15, -14, -11, -15, 3, 1, 2, -6, -11, 19, 7, 9, 0, -2, 13, 4, -6]
5947fK1rMJ%KMlj7lJ7jj1NMnMrmK4pj7jLmNnLpNLlrK9j4k7J4%j0PK1k8PL7k6j6
5993b2L0k5J8Qj4JJ9rj3J1Pj4J3rP%mJ4j4NJ0k0KJ6qlLj1KrJ2JJJ3k6MJ0jj9M
6033a0KJj%kO%j4OONqprK2OmJj2pK1j3j2K6%r%PMJNk0QJ7j7pL1ok1J5LoQk0KO
6079DNj0J1Ok1pK1j6KJ2j0rJ1mJ1j3jnkK3rk0RK6k5j1K2j1MMj6lK2Ml5L5JlpK
6119cpOJ9l4K1J0k8J6J1jM%k4J6J7l0K4jmrJ3j4KNj1JJ1rJQk7K2Pj9J5lj8J2Q
6158Gk9J5%rKMj6J7Mj5LJ5k7J4N%JqqJ2J8Oqj3LOKj8jL4rj3PJ1N%k1J0J0qmjN
6201HMOj3LQj4mJ0j7K9rk1J7rj1J3Lj9J4nqPjj2MJ7j4KJ0j8%J5Pk1J4LNoJ0k5
6241a8J3PqJ2jrJ5k0rL2Moj5J1%Qj0LNJj6kK4j1Kj5QRj5pNj0J7%Kk5L2j2j4mJ7
$$ y = [-6, 15, 6, 10, 11, 11, 13, 17, 14, -3, -6, 11, 10, -1, 4, 8, 3, 7, -2, -6, 18, 11, -6, -7, -4, -8, -3, -8, -5, -12, -7, -4, -7, -16, 13, -1, -28, -14, -14, -24, -17, 4, -24, -17, 20, -6, -22, 8, -17, 1, 9, -5, -4, 15, 6, -7, 4, 11, -3, 10, 1, 8, 8, 4, 18, 4, 9, 19, -1, 1, 17, 9, 6, 9, -2, 0, -9, 3, 4, 5, 18, -8, -4, 6, 5, -14, -10, -8, -7, -8, -8, -10, -4, -4, -18, -12, -6, -1, -9, -16, -25, -3, 3, -1, 0, -12, -19, 2, -11, -23, 3, 3, -6, -6, 1, 5, 6, 11, -9, -1, 16, -1, -8, 23, 17, -4, 11, 14, 8, 16, -4, -2, 4, 9, -1, 10, 16, -5, -12, 9, -7, -5, 7, -3, -12, -1, -5, 6, -7, -8, -13, -15, 8, -1, -21, -12, 14, -11, -22, 0, -11, -7, -3, -19, -22, 0, 4, -31, 4, 5, 2, -5, -3, -10, -4, 15, -19, 2, 12, -16, 0, 11, 10, 14, 14, -10, 6, 23, -7, 17, 16, 12, 3, 16, 2, 4, 9, -2, -1, 10, 1, 2, 10, -17, 5, 12, -7, 8, 5, -13, -1, 7, -22, -7, -7, -16, -14, -10, -26, -9, -5, -20, -17, -2, -29, -15, -10, -10, -9, -17, -25, -13, 5, 11, 3, -10, -7, -1, 1, -17, -18, 16, 7, -6, 1, 12, 17, 17, -4, 6, 16, 8, 4, 3, 8, 12, 18, 5, 8, 16, 2, -2, 8, -9, 20, 11, -10, 7, -2, -13, 0, 3, -16, -2, -7, -15, -8, -9, -21, -17, 0, -14, -12, -2, -20, -20, -5, 2, -19, -5, -2, 3, -3, 7, -18, -5, 2, -6, 6, 5, -4, 11, -9, -18, 14, 18, 12, -3, 8, 8, 16, 6, 9, 14, 15, -1, -3, 21, 10, 12, -3, 5, 14, -1, -8, -3, -13, 4, 4, 6, -19, 13, 1, -13, -17, 0]
6282@j1qJ2nkJ4j6J4lk1J5%kKJ4qj6J1J7j0rlK5roPPP%j1j9J4J6j3ONj3K7ool
6323A3J6k8JJ0Jj9QoRJ3j3j4K4Qm3NJ8j4J0Pk3OKLj3K0k0RNnjJ1mqNQNj6QlRr
6365erQLJ0qK%J3Kj3mJ0J1k0OK1Qj9jjrK4j4j6K0Rm0K2J3k3MQk3oK9Lm0L1j1q
6405a3JJ2k3J4Kj1MJ5j3nJ9j6%K1j7j2K4pj2NJ5rj4J2lMK0Jj3J2K7m5NJ9mjmo
6443DkK2Rm0J9J5j9pJ6j0rOnoL6k5j5J0j0NJ1j5JJ1j2JoKJ0jj8J5%jmPj5K3Lk1
6483a5J8Qk5qK8nkLkmOMrJ1j6J0kjPJ3k5NJ0k1K3Nj6KJ9j6qJ6j5J0K1m3J2K7k8
6522cqJ5rk%j1OK3k3M%j4J0NJPpq%JOJ0lk4J3K4l1OK8k8RJ7k6NM4l8j7L5njQj3
6564Fj9L6j2j6J3J1j7RqQQpq%jM%j1ORk7J0Mj2jK2j8nJ7j6k0L4mj2K7l4PJ7kj6
$$ y = [0, -11, -19, -7, -12, -14, 0, -16, -2, -5, -26, -11, -11, -13, -11, 3, -5, -21, -10, 7, -3, -12, -15, 10, 1, -5, 2, 9, 16, 16, 5, -14, 0, 16, 3, 9, 14, 1, 28, 22, 16, 13, 29, 1, 2, 12, 13, -6, 2, -4, 5, 18, 5, -9, 15, 23, -20, -15, 3, -11, -1, 6, -17, -11, -9, -6, -19, 1, -19, -10, -5, -10, -11, 0, -4, -12, -7, 1, 6, -10, -2, -5, 4, -5, -14, -6, -3, 7, -1, 1, 1, 14, 16, 3, -1, 9, 20, 0, 6, 27, 35, 16, 15, 14, 5, 29, 15, -1, 19, 28, -12, 10, 23, 0, 4, 12, -11, -17, 12, 15, -25, 6, -5, -13, -12, 0, -23, -9, -7, -18, -14, 1, -12, -17, 2, -14, -14, 7, -10, -22, 2, -5, -17, -12, 3, -6, -20, -8, -11, -7, 13, 14, 1, 13, 40, -5, 0, 19, 15, 14, 10, 4, 2, 24, 33, -7, 12, 27, 8, 1, 17, 7, -2, 4, -1, -7, 29, 4, -11, -1, -11, -6, 5, -10, -9, 2, -10, -9, -15, -13, -3, -4, -22, -7, -7, -8, -12, -5, -20, 3, 6, -15, 3, 11, -14, -22, 6, 1, -1, 2, 0, -4, 2, 6, -3, 8, -8, 2, 0, -1, 6, 19, -6, -1, 9, -12, 11, 16, 0, 2, 21, 5, -3, 13, -2, 8, 29, -14, -2, 25, -3, -11, 4, -5, -7, -7, -18, -12, 11, -12, -8, -8, -22, -12, -7, -6, 1, -6, -14, -14, -13, -7, 3, 0, -24, -11, 13, -18, -12, 16, -12, -3, 14, -12, -7, 37, -1, -18, 17, 12, 11, 19, 6, -13, 23, 11, -5, 8, 19, 2, 11, 3, 11, 19, 12, 4, 4, 3, 7, 7, -4, 2, 11, -16, -6, -2, -14, -15, 7, -11, -16, 1, -15, -35, -1, -5, -17, 10, -24, -17, 0, -2, -18]
6604a8J6j4J0J7l2QK0j0j1K8j4LQj9JJ5knJ1j1KrJkK5j2j1L0j2kjqKJ8j4oJj1
6642hmQj1MJ5j4kJ7k1RJ5j5j5K9nl7K6qnK1pj7K9j2j0R%J5lj0j0PJ4njJ7%jj2
6681BJ3j1MNj1j0J8Jj5NJ2j7LJ6j3KJ7k1LK6j3j2kMrRj3KQj5lQnJ9jk6K6j6kJ3
6721Aj4MRj2j1J2Pj3RMqK5j5qJ5J2k4PkmK0oj9K7j0rPPj2J5%k2K3LjlnOMj4jQ
6763A2j9kJ7j0NJ8l4JJ6k8J3K1j6j2L4k3j8K6lj2Qkk5L4Nl9K8J3k2PRj4J4Lj3
6798hJJ9jj2mOJ4j1nQmNJ5k3oK5j4j7J8K3k7K3j5k5K9jl3L0J0k2nJ0j6J1Ql0O
6835a8K9k2ORk3J2Ol0K1NKrKoK1qk3K7nj4QjMJ8j1j7J9Rj8K1Mk3J2Jj4J4J6l4
6873a0J4RpMJ3k5nJ8j4RJ1k5J5Pk0lL1j5k4J9j4JRNk1J6kj0QPlj3j4J5KLMj3O
$$ y = [-18, -2, -16, -6, 11, -21, -13, 7, -3, -14, 14, 0, 3, 11, -8, -7, 8, 6, 1, 12, 1, 3, -6, -5, -7, 18, 6, -5, 25, 13, 11, 10, 2, 4, 22, 8, 2, 3, -8, -12, -4, -15, -11, 4, -10, -12, 5, -16, -7, 8, -7, -22, 7, 2, -35, -9, -17, -22, -1, -8, -25, 4, -8, -18, -9, -9, 6, 3, -7, -17, -10, 4, -1, -2, 15, 15, 14, 2, 15, 4, 8, 13, 2, -8, 10, 11, -4, 1, 13, -4, -1, 15, 2, 4, 21, 0, 3, 29, 16, 4, 2, 6, -3, 6, -7, -5, 3, -12, -15, -7, -12, 7, 6, -20, 6, -10, -12, 1, -13, -9, 0, -12, -23, -11, -4, -17, -8, -4, -12, 13, -2, -10, 5, 17, -7, 0, -2, -6, 14, 8, -11, 16, 6, -3, 4, 11, -1, 14, 14, -8, 15, 18, 17, 14, 9, 15, 19, 5, 4, 12, -7, -9, 8, -2, 3, 21, -13, -12, 4, -24, -11, 10, -6, -18, 16, -7, -25, 1, -2, -14, -6, -8, -33, 1, 6, -33, -5, 8, -14, -7, 2, -12, 2, 5, -8, -7, 12, 11, -1, -5, 1, 15, 4, -1, 7, 3, 8, 23, 0, -6, 19, 5, -12, 6, 29, 2, 25, 10, -15, 14, 13, -20, 10, 20, -2, -7, 3, -13, -2, 6, -24, -18, 11, -11, -5, 4, -19, -7, -1, -31, -10, -5, -3, -12, -10, -16, 5, -3, -26, 1, -4, -18, -10, -11, -7, 11, 0, -17, 2, 11, -7, 14, 18, -5, 7, 8, -6, 8, 24, -10, 4, 13, 6, 10, 23, -2, -7, 11, -3, 6, 17, -8, 7, 14, -6, -9, 22, 7, -17, 2, -12, -11, -2, 3, -18, -2, -4, -14, -6, 1, -2, -15, -29, -14, -12, -9, -5, -18, -12]
6912a2JKoJ0J6k3lPpJ9Ok2nK8rKKjjJ4j8nK7Kk2QjrOOJpJ2k4J2K3j2j7Jj5RJ8
6954A3k6OKj2J9j8QQnj3%LlQMj2J2%j3RRj5j2J2J5KJ5k6ROj0KMk%Oj3JJ9Ljk3
6996iJ7NlRj9NMj4J2kKOk8PJ0RkmNj8J0j3nJ8lk7J5jrK1%k1LJ5j4jJ2rmJ5k1J4
7038a3POj4LRpkOJ8j6rqJ5RJ2rj6J8Rj2Rkj1Jmj4L4kj4k1K6%pQj0j0RMj6J8nj8
7080a9J6mLJ3jk2%%jQJrJj1QJ6j2LJ7l0jK9j3oK1%l5K8Rk2K2Rm7L0K6k9KJ8j3
7119ElKmLOknj3QPnj7K1rQJ3j6qJ9rj8L0ml8K8j3j4L2pk5K6Pm0L1%k%%j9J3J8
7160Fk2J3loJ4Ok2PK3m1K9nj3L3ml8K7J0j8J4J3j7oK2l5J0K4j6JoJ0nLj0PjqL
7198aplK7k2l5M7pl6L7J6n3L3Nm8L5L4n2MM0l9J2L3l4j4L4j6j3M6j6j6kLJ6km
$$ y = [-12, -11, -9, -15, -5, 11, -12, -15, -8, -15, 4, 10, -12, -17, 11, 2, 4, 6, 5, 4, 18, 0, -5, 22, 24, 2, 10, 9, 0, 6, 12, 13, 6, 18, -6, 6, 29, 17, 0, 1, -14, -5, 13, -13, -7, -5, -17, 2, -16, -8, 0, -5, -18, -18, -15, -18, -10, -6, -18, -6, -6, -19, -10, -1, -16, -28, -16, -1, 1, 16, -10, -1, 5, -5, -3, 1, -1, -1, 5, -8, -7, 12, 15, 14, -9, 8, 13, 10, 19, 0, 5, 9, -5, 7, 5, 7, 13, -15, -8, 2, 11, 9, 5, 10, -8, 2, -11, -16, 2, -1, -28, -13, -14, -23, -2, -2, -23, -20, -5, -19, -20, -8, -17, -21, -6, -27, -13, -6, 0, -14, -11, -2, -9, -11, -5, 13, -3, -12, -20, -5, 4, 16, 7, -9, 9, 18, 6, 15, 13, 2, 3, -1, -15, 19, 17, 3, -18, 8, 8, 1, 9, -1, -11, -2, 2, -14, 4, -1, -19, -3, -7, -4, 9, 8, -14, -14, -14, -15, -7, -6, -15, -14, -25, -17, -1, -13, -10, 7, -23, -24, 5, -8, -14, 7, 7, -28, 0, 9, -13, 9, 18, -29, 1, 27, -2, 0, 18, 5, 2, 4, 0, 3, 9, 7, 2, -11, -3, 4, -1, -18, 3, -6, 2, 15, -1, -9, 10, 1, -17, 13, 9, -29, -1, -14, -28, 4, -3, -28, -2, 5, -35, -4, -4, -6, -6, -6, -25, -12, 6, -16, -3, -6, -12, 2, 8, -14, -7, 16, -25, 4, -1, -14, 19, 15, -23, 4, 14, -4, 10, 23, 6, 0, 22, -13, -3, 21, 5, 6, 0, 10, 5, 8, -2, 5, 4, -4, -1, -8, -11, 16, -6, -41, 6, -1, -37, 0, 16, -37, -4, 1, -47, -12, 22, -30, -26, 14, -25, -13, 20, -14, -28, 6, -10, -23, 23, 7, -9, -11, -8, 8, 6, 2]
7233BNmrJ7Lk5K6Ql5K0Lj9K7J1n1PM6l6PK5j6j2L0l8NK5k2j9J3JMj1llJ4j3QP
7271bj3J7Jl0J7K0l1J0J5l2K8J0l1J3L0k7k0K4nJ4Jpj6L9k7mOJ2jnJK1j2rLj3
7307cRJ4rj9K1J2k4jK2j2Mkpj5K4rprK1k1qK1j0kJ7ml4J2K7k3%J2j4%J4ooK5j5
7346ek7K2J7k0pK3j0JPqj1J7J3k0nL9j3j4J9j3j0K5nl0L6kl2J9J2k2J6Rl2J2K4
7381B5k1j7POn%Mm%rOj0J0Mj2j1L4lk0K4j0j4J6ok3K5K1m0OL2k9J0KJ0j0J9k7
7418a0J0K5k0%kj3L2j4mLQj5K3j5k8M9Nm3J9J2k2jK5l3J4K0l3nL0j4k3K2j3nJ5
7453aj0j6K8nppQJ4rj4J2MrJ2j9j6K6K5m2NL6l6K2J0j1j5O6n5k4N2mk2K9j2pQ
7489A6j5%J8oqJ3kJPj1klj1MJ5k6J2Pk3LK2k1j6K5j9ML2l0j9L7lk4J4%j5J1Lj1
$$ y = [2, 7, 3, -6, 11, 14, -11, 15, 23, -12, 8, 11, -8, 19, 30, -21, -14, 32, -4, 3, 28, 12, 0, 30, -8, -3, 22, 0, -19, -6, -5, -1, -12, -15, -18, -4, -17, -9, -2, -15, 2, 3, -27, -10, 10, -21, -11, 4, -28, 0, 10, -21, -8, 22, -5, -25, -1, -6, 8, 9, 2, -14, 25, -2, -6, 0, 12, 11, 6, 7, 28, 16, 7, 10, -3, 6, 20, 11, -8, 13, 25, 1, 0, 22, 10, 14, 12, 5, -10, 14, 5, -2, -11, 10, -11, -19, 2, -8, -10, 7, 3, -31, -19, 8, -15, -15, -3, -17, -17, -3, -9, -15, 10, -5, -32, -10, 7, -13, -20, 3, -7, -6, 1, -7, -18, -1, 12, -8, -13, 26, 13, -1, 18, 5, -5, 20, 15, -15, 21, 19, -13, 6, 18, -4, 12, 21, -11, 1, 25, 4, -13, -6, 0, -5, -5, -1, -5, -5, -14, -8, -18, -8, -4, -16, -27, 7, 4, -16, 8, -2, -16, 0, -6, -29, -4, 17, -23, -17, 15, -14, -4, -2, 8, -2, 17, -10, 0, 25, 5, 5, 3, -10, 22, 8, 4, 7, 15, 0, 23, 8, -20, 29, 34, -9, 10, 22, 0, -1, 24, -9, 5, 25, -8, -13, 17, 3, -20, 2, -11, -16, -1, -11, -27, 1, -4, -11, -18, -10, 4, -5, -19, -7, -3, -12, 0, -19, -35, -9, 16, -26, -21, 15, -21, 1, 11, 0, -15, 51, -4, -28, 24, 20, -2, 27, 15, 8, 16, 1, 1, 19, 13, 5, 18, 16, 17, 24, 13, 11, 8, -3, 1, 16, -10, 2, 9, -14, -11, 11, -10, -26, -1, -20, -16, 16, -14, -33, 4, 1, -23, -9, -9, -24, -13, -10, -21]
7527b1J4J1j2j5MK0J0k2OOoJ2rpJ2K7l9rL7jk6J9Nk1J6Lk4K6Pj3j8K9j4nRpoJ3
7565A1mj7MKPj7K1pj0LPj9J4Mpk1K1Rk9K4nmMJ5k3MJ8j6jJ4kj9J6Oj3K2Ok2pK1
7605A0jk6K2jKJ4nj7J3Rj0qLMj2MQj1Olmj1L1j0j5K4Mj9j1%nJ0Qk1kLJ3jlkJ6
7646Fj8QlnQkrPK1k5%Rjm%kK1Kkk4MJ6pKOo%J8oJ1pJj4pJ9%Mj5oQJ1j5oKK3l1
7692hKJJ0Nk7J2pQRj1j4J7kqLJ0k1J6J4k3kL4k7mK8j5k4K9%rJ7j8mK1j0%j1J2
7730CkJ1rKRL%nk2K3Jk4J5J3j7NK1l1J9Ql6QK7j9J%oj4K9j1j8J9j5lK4k2nK5j3
7769fk2K6j3JJ%lJ5j8QL4j9k2K6j5JK3j8j5L4k4RJ4k3MJ5k6J8K9j2k0J9k2J5K7
7804D1l7%K3k3j2L4l6PL5m7j9N5j8k0M2k0k5L1k0j3K4nk8K9j0j1K8j1k5K4LrJ0
$$ y = [-21, -7, 4, -8, -23, -19, 1, 11, -11, -5, 1, -5, 7, -2, -9, 3, 30, -9, -18, 19, 18, -8, 11, 16, -5, 11, 14, -10, 16, 23, 10, -8, 21, 7, 2, 11, 4, -2, 11, 7, -10, -6, -4, 3, -14, 7, 0, -10, -7, 0, -19, -5, -1, -8, -29, -8, 1, -28, -4, -9, -13, -9, 6, -17, -13, 5, -11, -12, 2, 0, -19, -3, 3, -10, 12, 18, -4, -11, 10, 9, -17, 5, 4, 6, 20, 15, -2, 11, 20, 10, 2, 5, 9, -3, 1, 9, -2, 4, 1, -3, -14, 17, 7, -8, 16, 20, 1, -10, -10, -15, -5, 3, -18, -20, -17, -4, -5, -8, -10, 6, -12, -4, -7, -12, -4, -6, -15, -8, 13, -12, -12, -3, -4, -8, -8, -10, 11, 13, 11, -13, -9, 7, 0, 2, 8, 2, 2, 20, 14, 25, 18, 19, 5, -2, 17, 17, 21, 6, 0, 8, 19, 4, -2, 0, 23, -8, -6, -5, 5, 10, -17, -5, -12, -4, 5, -6, -20, -3, -5, -13, -10, 0, -21, -5, 9, -14, -16, 18, -9, -13, 15, 0, -24, 5, 5, -4, 13, -5, -9, 12, 2, 2, -9, 3, 1, 12, 3, 5, 14, 17, 17, 12, -10, 13, 14, -10, 5, 18, 1, 6, 27, -4, 15, 23, -13, -5, 22, 3, 4, 4, -2, -16, 13, 2, -16, 3, -12, -15, 9, -13, -18, 7, -6, -28, -2, -15, -14, -13, -13, -16, -1, -19, -11, 23, 4, -18, 8, -7, -6, 17, -1, -16, 18, -6, 3, 17, -6, -2, 13, -13, 5, 34, 22, 2, 21, -1, 14, 41, 4, 4, 27, 4, -8, 26, -10, -3, 32, -15, -34, 21, 3, -17, 25, 5, -20, 11, -9, -22, 2, -3, -31, -2, -12, -23, 5, -6, -31, -7, -4, -13, -3]
7837cnrK9k4j4L6kj7K4l4J3L1l4oL4j8k1M2k6ML2k4k2M2kk5J0mk4M5k6j3L6rj8
7872bJ4j3kK5j8k4K6J1m3L6ok6L1j5k1L7Jk7RLk0L1k3j9M4j4j4K4koK0k7j4K6
7906BKk0K7nj8K1kk3L7nk6K6%j1J9Pk5K0pk4RQj4L4l0j3K0Jk0RKkJ0Jj5OmqJ2
7945Akj3K0k1j5L3rj2J0Pk1K6j3j7K0J5l0J0Rj5J2kpK1qj4QJ3kMJj6RJ2r%Pj6
7983dK6k2rK2j1Oj2J0J3nj4kK0j1Klj7J1Kkj0J2Jj5NrkK2j4nj2K6k6RJ2kRk1N
8022a5pJ6Ok8J7K1rnJ5nkpkoL2lk7J1J1j0PmKPnrRRrKqj0J2Rj7QrJ1j0%J1kjk4
8066a8J1jkJ3j1Nj3LJJ6j3j4K5j6kK9j8qJ5j4PJ9k0mK1pj8J9Jj8K5%l5L8J6l9
8102gL1ok2J2K1k7J2Mq%Qmknj1K4j0rLoLJ0k9lL4oj7%J0j5J4kk2K1J2k3PPj0m
$$ y = [-3, -8, -17, 12, -12, -26, 10, 8, -9, 15, -19, -6, 25, -9, -15, 19, 1, -20, 22, -4, 0, 32, 8, -14, 28, 26, 1, 11, 7, -17, 28, 2, -11, 25, 16, -2, 12, -1, -3, 22, 4, -20, 6, 17, -26, 10, 4, -22, 9, -6, -27, 10, 11, -16, -7, -4, -24, 7, -16, -35, 9, -5, -19, 5, 3, -3, 17, -10, -24, 2, 4, -16, 11, 6, -12, 9, 7, -16, 21, 16, -10, 16, 16, 5, 24, 31, 6, 26, 19, -5, 4, 12, -2, 32, 2, -11, 9, 10, -10, -1, 1, -1, 9, 10, -5, 1, -3, -11, 1, -1, -14, 6, -15, -30, 3, -6, -18, -8, -1, -22, 4, -9, -26, -6, 9, -21, -11, -2, -17, -5, -7, -14, 7, -1, -15, -7, 6, 4, 8, 9, -7, 2, 14, 5, 5, 12, -4, 22, 0, -9, 13, 2, 8, -4, 6, 19, 14, 0, -2, 18, 7, 9, 6, -11, 0, 2, 0, -10, 2, 3, -12, -7, -16, -18, 4, -10, -15, -27, -1, -27, -18, -6, -8, 1, -20, -15, -22, -6, 0, -28, -11, 10, 1, -4, 11, 6, 4, -3, -5, -11, 21, 18, -9, 2, 13, 3, 10, 6, 8, 15, 10, 1, 10, 19, 10, 12, 4, -6, 6, 15, -2, 6, -3, 8, -2, -2, 9, 7, 6, -18, -7, -8, -10, 3, -8, -3, -16, -13, -12, 4, -9, -23, 2, -14, -16, 13, -5, -13, 2, -12, -5, 14, -6, -10, 11, 4, -14, 5, 6, -12, 13, 13, -22, 16, 32, -7, 24, 18, -4, 8, 29, 2, 14, 18, 10, 10, 18, 14, 12, 7, -4, 20, 10, 1, 4, -2, 1, 11, -18, -21, 13, 7, -10, -10, 0, -15, -1, -3, -25, -4, 8, -15, -8, -1, -11, -15]
8142a5J8j5LK1k4lJ3%jnRMo%mJ4Q%rk0L6qk2K6%r%J4k3K0lk7J1K6j8nJ8j1Jj7
8182cJ2l2L2lnJ1nkm
$$ y = [-15, 3, -12, -9, 12, -12, -15, -2, -2, -3, -8, 1, 5, -1, -1, -5, 9, 17, 17, 8, -12, 24, 16, -6, 20, 20, 11, 11, 25, 2, 22, 19, -8, 3, 29, 11, 6, 24, 13, 14, -3, 9, -23, 9, 6, 1, 12, 7, 5, 1]
8191A
$$ Imaginary data points
##PAGE= N=2
##DATA TABLE= (X++(I..I)), XYDATA
0@%%%%%%%%%Qj6J6j6J6k4L2l2M0m8N6p2Q1r0J06j22J43j66J88k13K41k73L06l43
33a82L84m27M80n36N93o59P31q08Q96r93J098j217J349j497J666j859K079k334
51a236K641l013L470m053M825n902P518j0236J5909m5259N9362L4869j32017R3936
65B0814L2572j15956N1387O8605r2880K7727N0062p0085Q061M8777m2369J2727
77e58K2334m0496J2237K1019l0705K2710J3034l7606J4168J6285k7260J6611J4754
90A6527k3366K690M982o566J1841n925j992J3887k3585j199L3582k6426r124M1402
104B6728l1187k4006N0453j6141k9450M4391j2650l4676L7680l857k4850L3403
116A5838j0034k4361L1166j4514j6767M3224k0972k9678M7475j7744l6978N7103
$$ y = [0, 0, 0, 0, 0, 0, 0, 0, 0, 0, 8, -8, 8, -8, 8, -16, 16, -16, 24, -24, 32, -40, 41, -49, 57, -65, 78, -88, 100, -113, 128, -145, 161, -182, 202, -225, 255, -281, 312, -347, 384, -424, 472, -521, 577, -640, 709, -788, 878, -981, 1098, -1236, 1405, -1608, 1862, -2191, 2634, -3268, 4250, -5986, 9923, -35336, 24026, 58895, -73122, 20814, 53386, -62570, -11183, 57422, -35458, -7731, 42331, -27754, -19693, 29084, -13285, -558, 21776, -18720, -6483, 14536, -16169, 6541, 19575, -18031, -3863, 12422, -14838, 1773, 16527, -6839, -4149, 833, -5733, 6108, 183, -1809, 12078, -11507, -12706, 20876, -5550, -14674, 26728, -4459, -28465, 21988, 5847, -23603, 20788, 8138, -26538, 11142, 7285, -17565, 15838, 5804, -18557, 12609, -1905, -18672, 24552, 3580, -26098, 21377, 3633, -33345, 23758]
128B3758m834n2628M5989P892n5099L8928K7092n1772J4246K7548l7436O290K9621
141A9595k1253m928J2874j1427J021P586k857O091p530j0084J5791k591j0325
154h037J8966n636k0411J8103L033j6309J7184K636k0806J0457M946j1912J3811
167F025J545j6595J0512J270j2902J6062K976j8057J0873L444j6600J3027R275
180A0855j6287M125N678j1098O016O060o997M204k188p029J0000k202o567J4450
194I020o626j5510J8324Q93j7827J8039M536k4488J2092J2361k0408P744J5585
207A3735j9175k625J4892q456k613J0997n094o194L716P16N15K99L46J977o299
222c263k089R784k738n027Q653n082q650J1543O40q594R115p04j1466P869L823
$$ y = [23758, 18924, -33704, 12285, 20177, -34922, 4006, 31098, -20674, -6428, 21120, -16316, -10026, 19595, -1658, -6586, 6288, -5139, -4118, 3468, 611, 6702, -828, -10912, 4879, 2288, -8037, 10929, 5293, -15118, 2985, 6018, -10291, 6893, 9529, -11277, -820, 4126, -7786, 6025, 7570, -9025, 1487, 2757, -10145, 5917, 8893, -9164, 1709, 5153, -11447, 1580, 10855, -5432, -1307, 4371, -6727, -711, 5349, -1648, 2556, 368, -6661, 3339, 1137, -5430, 9020, 2394, -13116, 5208, 6101, -11726, 6313, 10849, -13639, -1547, 10814, -9594, -1850, 13735, -5440, -8065, 6827, -1629, -4242, 6755, 1661, -4533, -817, -101, 414, 713, 1059, 3036, -3263, -5352, 4432, 1694, -3333, 5320, 238, -8412, 3131, 3771, -4823, 4292, 3588, -7878, -9, 3814]
237C814p310O730Q29j0219N020L964n547M992J504p407K580J685l163N035N46
252C053n041J895j289j287O362k112l955M942l833l721Q847j539n767O966k724
267G97p723Q820K665p807M425J770p789L408N220m459L17K753l726j560L053J863
283B027r22j809Q29l57k674L727K907n472Q47L749o204N86P848m633l362N858
299B945l993l496P971q34n709M607j16n504M140L166l816O84J082l323O18L312
315A734k95j550k13R9p63k4K489L06k721N24N86k324K438L001l850j134K811k252
333a138m52M164j512k693K275r62j988L490J086k970J45M85j207J362J402j188
349B99n58N2o12L25R66N25k75j397n64J167M25nN52q95j171R44M36n35J079L57
$$ y = [3814, -3496, 3234, 4063, -6156, -1136, 2828, -2719, 2273, 3777, -3630, -1050, 635, -2528, 2507, 3053, -1988, -93, -1382, -2669, 3693, 1581, -2374, 2568, -1265, -4986, 3861, 2322, -3445, 3521, 797, -6926, 1894, 4559, -3248, 1177, 2947, -4842, -1434, 3786, -673, -356, 2397, -1329, -2889, 164, 2027, 1105, -704, 125, -232, -2906, 821, 3728, -1744, -897, 2852, -3352, -2766, 5082, 449, -2913, 2945, -1048, -4544, 3427, 2593, -3116, 1491, 1375, -4129, 11, 3177, -639, 45, 1127, -2196, -1578, 1734, 1439, -111, -324, -225, -988, -1012, 1477, 1783, -938, -414, 172, -2152, 286, 3287, -563, -1697, 1114, -1138, -1590, 2574, 1062, -1631, 644, -318, -2306, 1184, 2270, -700, -555, -70, -1277, 85, 1487, 299, -259, -207, -819, -494, 472, 997, 722, -675, -1239, -72, 353, 348, 900, 5, -1166, -222, 214, -321, 758, 1115]
369A115j900m21J379O9oO86r27j228J010Q02p91M17Q99j451j076J553N44q36Q44
388F82q7k089Q08K058j493n36K080j462j883K510L93k044J865M48l384J372K862
405B100k616m69K781k107j680L155m31k182K504J79l344J559K410k345k78K164
421A400j751j226K622k94k093J960P51l009P89K586j979p09K361j656j489L021
437A284m69k562K518O08l189J482J868k429O46J772k557q3K582j464j038J976
453I45o65j311J275J05q29Q86J09j200J95J009k30o21L73J94o31K81N49p62K57
472g1Q19j253k36J525p19n73J213r75n24J778r91j100K115n67j691J784j07j494
490a067J884p6k191J662Q28k034R31J059j632L88R24j260L17J167r41n73O81J26
$$ y = [1115, -785, -1206, 173, 242, 236, 922, -5, -1233, -223, 579, -212, 205, 1104, -347, -1423, 130, 674, -162, 682, 595, -1494, -686, 1372, -121, -657, 1423, -39, -1922, 588, 981, -1063, 802, 1250, -2134, -762, 2100, -516, -985, 1796, -311, -1991, 1164, 733, -1449, 1055, 1234, -2110, -551, 1859, -486, -764, 1400, -351, -1577, 1045, 751, -1342, 618, 1369, -1640, -851, 1735, -244, -953, 1408, -248, -1737, 1284, 815, -1747, 771, 1379, -1810, -328, 1540, -889, -243, 1529, -1028, -1111, 1471, 7, -1031, 945, 280, -1031, 244, 349, -480, 406, 515, -685, -490, 519, 289, -332, 41, 235, -396, -115, 434, -328, -71, 748, -505, -741, 784, 65, -508, 705, -270, -794, 984, -7, -1107, 1008, 441, -1250, 534, 427, -1067, 817, 741, -1450, 212, 1040, -994, -63, 996, -636, -248, 676, -584, -267, 900, -41, -614, 67, 193]
508A93j78m8J18k3l47L73J81p56O86O21j608K16J570j250k68J531j457n44K205
527A215j156j358K333m29k068J819M79j840J298O80k174P67J732j577n35J595
543G81o24j010J148K22j124O35P44j396p4J711p14j251J310Q7j299J155M74j683
561i08Q43J087j810K00J688j219n52J275p93m10J457p23j020J293k3r95P67K03
579C60p08M58P1o64N13M89o04k66L63J29j06n1K1j10R2K42m16r0P42l98o08Q34
601B93j57n84R80m98r71J661j43j785J592L47j953J742N05k634J869J307l233
618a662J408K180l204O48K401l016N13K902l067m74L111k103p56K572j736p33
634a016K167j463n49J890j097l72Q90j139Q28Q03j877J018P12k118J830O54k926
$$ y = [193, 15, -33, 85, 62, -285, 88, 269, -487, 199, 820, -788, -572, 998, -252, -520, 1011, -446, -990, 1215, 59, -1299, 1034, 605, -1463, 356, 835, -1005, 293, 973, -1201, -434, 1298, -279, -814, 781, 157, -853, 295, 517, -607, 28, 772, -624, -698, 1013, 299, -952, 358, 445, -854, 301, 775, -908, -65, 1022, -788, -588, 1100, -119, -671, 604, -189, -599, 858, 135, -885, 408, 385, -610, 157, 360, -348, 110, 181, -483, 30, 519, -85, -351, 12, 141, 35, -16, 5, -105, -13, 229, -187, -277, 465, 67, -541, 293, 136, -448, 532, 34, -937, 724, 581, -1204, 388, 735, -1218, 524, 1029, -1605, 264, 1571, -1662, -254, 1926, -1278, -630, 1771, -1245, -732, 2170, -897, -1371, 1740, -363, -1119, 1453, -283, -1016, 1151, -312, -861, 1029, -68, -440, 450, -689, 139, 942, -935, 83, 795, -1323, 507, 1161, -1765]
651a765K354R68l911K538J984m248K192K039m761K463L036n196J689L454n064
666b228J422L712m942J239L860n183P85M410m617M06L894m586O29M190m577K17
682a369M199m233P9L955m010K23L832m089J9L912l529r3L170l360M94L011l483
699a272M80K655l218J078K054l548J876J870m348K455K389m899K529K465n678
714c112L052L639o543K126M479o441J577N218o317O55N579o012k22O247m881j382
730b338N367m039j257N313l390j846M486k675j544L952k165j253L191k394r37
745a529L227j814p41K170k215J88K398k611L55K363l059N49K702l369P56L114
761B484m090K13M047l664m36L962l556p08M346l163j410M219k432j656L659j989
$$ y = [-1765, 589, 1557, -2354, 184, 2168, -2080, 112, 2151, -2610, -147, 2889, -2307, -618, 2836, -2228, -806, 2906, -2036, -797, 3063, -2120, -1335, 3075, -1542, -1136, 2758, -1828, -1199, 2991, -1586, -1369, 2830, -1403, -1324, 2631, -1379, -1156, 2676, -1413, -1394, 2518, -1011, -1104, 2066, -1294, -800, 2211, -1272, -792, 1863, -1355, -277, 1777, -1771, 105, 1975, -2373, 82, 2471, -2428, 101, 2566, -3112, -60, 3579, -2964, -838, 3641, -2800, -1223, 3995, -2322, -1667, 3912, -2100, -2322, 3925, -956, -2338, 3029, -1010, -2267, 3046, -344, -2190, 2296, -379, -1923, 2029, -136, -1389, 1802, -592, -1529, 1698, -116, -857, 1313, -902, -714, 1684, -927, -572, 1791, -1268, -719, 1983, -1386, -630, 2484, -1606, -1393, 2654, -1010, -1446, 2516, -1040, -1748, 2598, -565, -1975, 2244, -188, -1844, 1815, -174]
777a74j307L283k195j195L432k013j266L096k169r34L559k379j636L729j790j869
793a828L506j364k005L038j151j921K965n51j975J909n88r80K019r64j028J821
809I03j151o52K015j255n42J932j822o90K663j283j043K029j487p60K444j325
825b4r88K232j338j117K187r19q18J984j350j194K235n57j151J538o58q89J373
842E46m93o01J140n18m80O17n59L82O90j273K81R74j261L89R98j458M22J222j670
861f52M0J561j122k67J036q76m1Q62p82JO70n31P0P7m80P92M1r25O95L2p48R55
883D08j63q83J189k45j262J292J38j071J143l44j283J608N9j505J372J18j577
900a006J269K61j376J335K64j758R22O82j052P08J58j082Q13J97q69Q21Q1p58
$$ y = [-174, -1481, 1802, -393, -1588, 1844, -169, -1435, 1661, -508, -1442, 2117, -262, -1898, 1831, 41, -1828, 1678, 314, -1691, 1347, 196, -1725, 1240, 689, -1286, 623, 35, -945, 1074, 110, -918, 903, -248, -900, 1115, -140, -682, 1250, -572, -1262, 1401, 118, -925, 1104, -383, -1143, 1301, -24, -1012, 1220, -118, -1235, 952, 33, -785, 1199, -151, -1345, 890, 333, -818, 720, 62, -827, 546, 53, -548, 592, 74, -406, 211, -348, 34, 724, -549, -268, 706, -555, -166, 832, -626, -204, 1018, -652, -612, 949, -173, -440, 596, -280, -321, 541, -241, -240, 430, -101, -31, 46, -434, 358, 399, -526, 169, 201, -547, 408, 245, -638, 551, 306, -956, 336, 474, -597, 546, 202, -1081, 527, 586, -919, 453, 571, -1006, 263, 524, -852, 483, 747, -1011, -89, 593, -459, 249, 407, -675, 138, 335, -534, 287, 368, -390]
918c90N96l07m15J178m05q41R39m24m49J232p27o31J431q07r33J653m93q78J517
937H46r06j093K070m90j564J843k28j631J684M4j672J636L04j979J108Q34j439
954f33O98N35j255O26N94j054L59N69o03J39Qk89O13j18n54N54j98l23P58m74
974d8m55J125n18r13J204r9q62J081l02j108J314J62j368R60M57j262O33M61j027
993e65P14N11j241L30P39p15K10L77o88L17L52p11K79N34n57N5J61m61M83L32
1013D56p59J54M58m94R4L22l77J77K33n55P0N01k08j01K3j75K25J21l17J45J42
1034A35k20J18q4j85N22k0o49L27K95m46K68K26n99L20L80p62J29Q02n45l36N56
1055B32l19k02O96k74n73N99J37o55K28M80l46j24K06k47m2M81l7n48J69M34m01
$$ y = [-390, 206, -101, -516, 662, 257, -584, 355, -69, -518, 714, -13, -644, 787, -20, -953, 700, 207, -671, 846, -60, -1153, 917, 427, -1137, 706, 478, -1153, 531, 575, -1097, 539, 843, -1136, -28, 806, -633, 65, 600, -655, -29, 565, -489, -130, 439, -164, -25, -17, -306, 307, 189, -365, 189, -9, -332, 426, -48, -503, 622, 104, -809, 395, 296, -566, 515, 213, -895, 419, 581, -787, 173, 630, -632, 1, 462, -565, 149, 660, -581, -251, 488, -227, -17, 360, -328, -11, 341, -370, -91, 443, -114, -59, 102, -359, 124, 456, -303, -149, 309, -185, -91, 231, -146, 31, 264, -291, -221, 280, 72, -29, -6, -181, 44, 165, -152, -7, 135, -85, 33, -51, -236, 286, 266, -383, -56, 239, -207, 61, 287, -312, 8, 388, -374, -245, 557, 12, -324, 232, -87, -289, 407, 133, -440, 159, 296, -359, -131, 349, 3, -121, 85, -162, -204, 277, 240, -308, -139, 295, -106]
1076a06j90N81r3m54L50k7m86O12L62r13N1O89n06j41O71l55l45N49k89m39P66
1097B87J54p09P3L32k47P6K78k74j19K68j27k66L53L16m12k67K73J7l3L15k24
1118F4l57L65P2m44L24L87m30j81J73r7J71K74l07k68J91J41q4p0K18N7l83n7
1140b41L04l0L6K49n17k50P10n2n54N03J80p19K11M08m19K20M26o97k89P50K6
1161B55m58K80J31m48Q0L29k12k6M31l12n86N16M59n22j5L50m58m8N72l06k47
1182b35O31k70p03N79L85m94J82J22n64K40N14m95r8N52k92m71M06J90k19J49
1202A09j7m14J35M95k19l37L63R3n34J68M48l26j2L59n62j82Q34j64o08N20M1
1223A90n39L53J91l86L49R9n95J51L88j10j5r8j41K48q8j49L42q8k16K36k89j20
$$ y = [-106, -296, 285, 192, -262, 88, 61, -425, 187, 549, -364, -313, 376, -130, -271, 400, 45, -300, 249, -40, -479, 287, 441, -268, -195, 137, -110, -34, 244, -30, -149, 119, -8, -274, 79, 395, -17, -284, -11, 6, -27, 288, 64, -293, 72, 144, -300, 24, 411, -19, -200, -27, -124, 47, 321, 14, -254, -63, 78, -6, -76, 142, 199, -184, -241, 63, 33, 69, 318, -199, -449, 261, 209, -345, 158, 338, -381, -170, 238, -181, 39, 465, -232, -521, 229, 255, -203, 77, 208, -240, -160, 169, -43, -69, 362, 50, -536, -20, 439, -83, -98, 252, -206, -254, 318, 12, -235, 396, 126, -577, 2, 387, -107, 75, 197, -367, -127, 387, -108, -206, 346, 54, -417, -11, 179, -40, 109, 92, -322, -187, 308, 89, -248, 115, 208, -326, -158, 290, -36, -48, 311, -251, -433, 401, 237, -371, 149, 190, -349, 4, 195, -191, 158, 257, -338, -187, 201, 91, 76, -22, -163, 85, -3, -152, 190, 102, -114, 122, -167, -287]
1245b87P12k44n39M70p3l10N21j62l51N61k54n02N78P4k48K41l67j13N63k93r9
1266a22M23n16P0N05q12L17R67j181j65J161j052lJ445j368m47J764j159p92J876
1285I11o86j056J496o54r50J656l11j150J098k11p06R54l01m35Q75o44m25R21
1303C82m62k0P25j071K4J121j027J3J136j216J3J158j403K54J557j610k25J546
1321H95j405j5J712j623k60J792j512m25J868j172m40J500j397k88J820j247m35
1338f32J522j268k86J618j332k25J800j503o88J894j009n95J732j116q88J743
1354G67o47r31J449l42q95Q71l08l87R53l75n27N43l43K2O07o71R1O44r20M0Q96
1375E37p06R0O81j142P0J225r39k00J091r73k91J204q71k83J441r69q73J448l93
$$ y = [-287, 425, 181, -358, 112, 39, -271, 250, 88, -263, 298, 44, -458, 120, 194, -54, 187, -180, -293, 270, -23, -122, 301, -215, -145, 360, -452, -135, 832, -349, -514, 647, -405, -408, 1037, -331, -778, 986, -173, -965, 911, 225, -831, 665, 11, -939, 717, 406, -744, 354, 143, -563, 391, 90, -345, 530, -114, -539, 382, -80, -100, 625, -446, -422, 699, -328, -315, 821, -395, -382, 776, -627, -373, 1184, -426, -651, 895, -510, -525, 1187, -436, -696, 1096, -416, -841, 1027, -145, -585, 915, -482, -770, 1050, -197, -632, 890, -378, -664, 954, -378, -603, 1197, -306, -994, 900, -109, -704, 1028, -88, -976, 767, 120, -811, 638, 296, -599, 272, -36, -423, 530, 155, -372, 171, -172, -150, 457, -214, -123, 521, -399, -359, 537, -169, -79, 602, -540, -470, 755, -184, -384, 707, -266, -557, 647, -224, -507, 934, -35, -908, 540, 147]
1394A47p81J319m80j102J323o1j178J158K45j210O82K15r00R18K86j163N31M33
1412C82q45N38L80q48M95K73j001N28O86q00J49L53p14L46N37o51J25L66m87L2
1432a56K07j20L57j66n06M49m9k26O58m28n50R54l55p76J211j01j068R91j24j076
1452h74J361J74j528R65N11j399Q20O85j345O01P14j373L56J105r45j61P37o10
1470b06r7O75l68k38M07p1k70OK82J38l67j2K57l23J56M26n92j6O43n71k48P53
1492C64k90k50M75m73j66P20l19l07M77k63j82L77k62L3M21m41j68L46j58J57
1512I1J70m93J51K98m41J63L38m10J79J07n71M02M63n78K1K40l62K51J83l64K34
1533G2O3l96K91l0j39N48m15n30Q12p0o40P93j40p94Q66Kr40Q93L35j105M51M20
$$ y = [147, -634, 685, 205, -897, 426, 365, -813, 345, 590, -620, 62, 277, -623, 295, 581, -582, -51, 382, -463, 75, 455, -393, 102, 375, -626, -98, 588, -212, -63, 290, -424, -78, 459, -192, -67, 299, -188, -156, 51, -69, 288, 122, -384, 65, 16, -210, 448, 20, -530, 424, 69, -707, 504, 403, -665, 326, 202, -874, 487, 661, -867, 98, 609, -790, 30, 715, -630, -29, 685, -688, -332, 773, -172, -333, 404, -206, -303, 372, 4, -234, 173, 102, -168, -162, 120, 258, -109, -121, 136, -187, -31, 395, -197, -213, 430, -141, -389, 364, 74, -176, 299, -174, -340, 380, 61, -246, 231, -32, -214, 163, -99, -66, 355, -86, -254, 92, -66, 91, 261, -232, -81, 217, -224, -61, 277, -133, 46, 153, -418, -16, 447, -131, -110, 130, -232, 19, 202, -162, 72, 135, -261, 30, 0, -139, 409, -6, -536, 276, 206, -434, 359, 219, -575, 291, 293, -647, 246, 581, -524, -73, 347]
1555C47p14M64L26p82K84L96n57J82K56l01K37r3m18M99R8m15L17j08l43N40j05
1576A10m71O16k2o22M31N8l87N84p9p09N67K05o43M39K28n99L34K13o58L69N14
1597D78o23j03M10k37j6K78k16o0J94j28p0O9J12J11k60k27M08L5l09K95pm47
1619c13L69J84n79L57M68p21r9N99k91r1M48l97k52N16j33l08M02K0l17P6k4Q
1641g8K88j05k54J05rL9J64j88mK36l27j10M07p4r2J59l40n0N00k02k55L89j80
1664A9k77L72o6k23M86j50n76L77K85l22J12J31l43O5K59k05rK79r2l33M1K87
1686A17J3j43P2o1k19K51J71l31J22L13m74j90N59m7k61K68j71l56M68J54m36
1707a81J72K61m18p9L92o7q8J75k68k15L84J70k61LR6j93k1J97P%O9k22k00K92
$$ y = [347, -367, 97, 423, -359, -75, 321, -236, -54, 202, -99, 138, 45, -373, 126, 224, -191, 126, 18, -325, 215, 110, -361, 255, 233, -389, 42, 100, -287, 297, 218, -491, 76, 281, -362, 77, 305, -294, 40, 253, -405, -36, 478, -145, -248, 162, -75, -91, 187, -29, -89, 105, -23, -93, -24, 88, 199, -61, -288, 120, 155, -154, 141, 134, -313, 56, 240, -339, 18, 486, -235, -334, 265, -26, -117, 331, -66, -318, 198, 65, -243, 159, 179, -138, -62, -86, -78, 210, 105, -149, -44, -53, -14, 150, -38, -42, 194, -133, -243, 164, 90, -2, 157, -183, -233, 267, 65, -190, 199, 19, -258, 114, 48, -175, 311, 161, -415, -38, 247, -75, 37, 168, -175, -110, 149, -56, -65, 214, 122, -211, -170, 117, 130, -13, 59, -2, -221, 30, 201, -130, -8, 305, -169, -359, 200, 153, -108, 160, -11, -367, 101, 255, -181, -9, 252, -166, -245, 147, 80, -8, 167, -101, -316, 68, 238, -23, -20, 76, -117, -138, 59, 66, 66, 135, -87, -287, 5]
1731EK25j56j26K8m9j8J53M2q2M2p1k44J35L98j14k64P6o4p0L05L0k97J69O2m24
1756c09J84M52k26j91J05k43N5M33j11k90J75k7k27J65K38n2j10j19r0Q1K47R6
1778B36k49j80K04k0j57L23J15l90J5J01k43L53L57n39k14L74j58o1M22j79k62
1799a52J91j35j42M36J22l42j27mR8J94j3m3o9j94R1J11n6K77J6n64K1M23j41
1822bR4K17m96p9M35k55k1N08l16m21K76k0K2M39k71m36K68M6r2K80J2k08kj79
1846b01L9L56Kj06j42k75K58L27k63Q0J45n01M2M33k62J55M08p64k43P66j87j68
1868a01N18m46m16N78j06k18N72j55n52J86N8O9L81k84l00J95j94J37M01l37%
1889a4K55o73P3Q65m18k32M58o73j16R69m12l37P15n75m69Q27j70j77O47o38n53
$$ y = [5, 230, 74, -52, -24, -73, -91, 62, 104, 22, 64, -7, -251, -116, 282, 168, -96, -20, -84, -154, 151, 181, -116, 53, 115, -309, -125, 327, 101, -90, 15, -228, -173, 260, 149, -141, 34, 7, -220, -55, 183, 131, 21, -98, -188, -107, 140, 236, -13, -193, 11, -9, -166, 157, 272, -118, -103, -2, -245, 108, 465, -74, -288, 86, -72, -133, 289, 110, -152, 39, -96, -238, 198, 320, -22, -149, -153, -55, 139, 126, 83, 14, -180, -89, 22, -34, 243, 259, -305, -284, 139, -2, 92, 309, -187, -266, 169, -86, -107, 401, 85, -336, -60, -80, -58, 381, 110, -326, -58, -12, -104, 176, 188, -20, -22, -201, -162, 194, 196, 90, -52, -327, -69, 258, -5, 75, 220, -281, -239, 194, -68, 87, 495, -269, -512, 254, 67, -101, 417, -29, -445, 133, 27, -191, 381, 226, -326, -140, -82, -13, 368, 84, -216, -21, -215, -78, 323, -14, -14, 241, -432, -359, 506, 88, -144, 314, -359, -475, 494, 82, -255, 460, -115, -584, 243, 73, -104, 543, -95, -648]
1910f48Q70j00k65O25m77m62O55k98j37Q26m40n29M94l67O0Q67o56l84O89o17
1930b94j21J066o17l51Q56q83m16J460m36o96R08o37n96J262k56o64R27m68p74
1949g30R24n4k97P53o69n76R02k82j79Q90p73m66R50o52k01J331p35p59R64n99
1969b58k74J387o61q15J045n51n66J327l55o76Q96o91o08J351k12o48P78o34n25
1988f90J163l20m62R71o95p07J044l09k40J063q76p89J238l85m88J286o31r61
2006g88J171l95p20J502k46j264Q71n6p56J209M2j124O33N8p89Q74K77o73L54
2025A80k68n70Q89J55m91M00m39m43Q74j57l46Q43o01p89R81j56l68J118o51j064
2045i03J170q1p50J234k28j218R38l3q68J309J22j335O12J62p92J094J77j113
$$ y = [-648, 222, 122, -143, 482, 5, -457, 198, -100, -237, 589, 149, -380, 114, -253, -193, 674, 18, -366, 323, -294, -415, 651, 34, -317, 539, -344, -760, 700, 264, -432, 476, -161, -757, 505, 249, -415, 512, 44, -730, 194, 140, -157, 596, -73, -649, 253, -29, -208, 682, -91, -557, 393, -259, -460, 871, 136, -623, 341, -258, -532, 855, 194, -621, 424, -127, -693, 634, 279, -397, 499, -192, -800, 551, 339, -309, 469, -165, -690, 473, 153, -309, 662, -33, -740, 304, -5, -245, 818, -58, -847, 391, 6, -482, 804, 173, -788, 383, -12, -732, 770, 524, -740, 131, 75, -681, 528, 570, -554, 79, 137, -652, 222, 499, -174, 180, -88, -658, 231, 386, -105, 295, -144, -587, 287, 130, -216, 627, 26, -763, 218, 62, -306, 812, 161, -903, 267, 186, -564, 670, 442, -776, 162, 129, -739, 570, 692, -643, -31, 131, -661, 433, 610, -503]
2063e03N95N3q88R52L46q38N47k03r31J058L85q61N38p1r49Q37L35p15P05k3j073
2084g04N57L87m18O17j44r03N26J93l72O94j68o31M51k77k54J030k61o94N81m57
2104b47l16J232l97p37R46n65p51J342j15q19R90n21j056J348J95r62Q39j65j028
2123g87Q78K50o79P28m2r39M46K29j82N31k96n33M03j61nO19m26k29M37o73O8
2144c63R98n41l11N56p60j5J080o12l00P84p60l38J001l73j56O80q37l53R78l36
2164B2j36O99q04k51Q06n41J9R00p69m35P18n04O9R46p52m77P63m69j56R08m37
2185A19l92N32n28j70Q97k36l88L15m32k8O34k79q5L17n44k1M55k76K65K77q35
2206d03P6O03m95K83M91r02N9O54p21J79R06q31l15O97n48K2R40o65m71P12m06
$$ y = [-503, 92, 145, -743, 209, 555, -283, 264, 61, -870, 188, 573, -288, 250, 179, -770, 67, 402, -313, 392, 369, -704, -147, 240, -178, 439, 295, -608, -82, 111, -261, 433, 265, -366, 85, -192, -446, 584, 323, -371, 210, -247, -563, 669, 272, -465, 481, -84, -835, 507, 392, -427, 563, 42, -1014, 334, 529, -433, 406, 241, -787, 91, 341, -338, 390, 348, -591, -145, 84, -98, 433, 137, -396, 7, -154, -159, 460, 34, -195, 242, -431, -363, 635, 94, -217, 339, -421, -436, 644, 32, -268, 516, -244, -582, 419, 46, -110, 570, -267, -620, 358, 22, -114, 585, -219, -470, 336, -205, -186, 714, -55, -490, 228, -276, -207, 739, -13, -490, 273, -196, -352, 556, 119, -273, 259, -269, -439, 458, 222, -166, 149, -283, -311, 323, 44, -41, 276, -268, -289, 166, -110, 155, 432, -403, -327, 276, -219, 64, 555, -347, -288, 366, -355, -176, 730, -101, -416, 281, -267, -245, 695, 30, -441, 271, -135]
2227a35k27Q04k89l62M54m82j91Q22k20l23L73m76r7O99l17j83N44n06l50O62
2247B00j59j45N65n41m44P05q7k79N45l11m32M98j73j93O68k27n37L42q3q5N63
2268C90k77l73L69k28j25N36k04j68L24n08j03P47k41k70M23m88j91P53l22k81
2288b37O73m57m94P00j03k57O17m06n51O53k8l21N18j95m39M28j52k25O47j74
2308A97m78L19j31j18N66k27l83M12k08k62N10m4k64L01l06k51N59kk82K27j91
2329e6k14M05r1j44L33k06l08K75RPK69l15k01K91q0k3K87k37j08K15k66PM67
2352C16k31k30K22k10mM25k45j98K92j65k07L53k9j18J87k67j44L72%j53J24j44
2374e4r6K21p3p0K29j23k11J30L5K3J70j87j60J67Lm7J32n3o6M5j23J3K40p0j20
$$ y = [-135, -362, 442, 153, -209, 245, -237, -428, 394, 174, -149, 224, -252, -349, 350, 33, -150, 394, -112, -462, 200, 41, -104, 461, -80, -524, 181, 94, -185, 360, 49, -383, 115, -58, -251, 417, 190, -347, -5, -88, -173, 390, 113, -260, 109, -119, -244, 292, 88, -80, 244, -264, -367, 380, 139, -131, 292, -196, -387, 366, 44, -237, 436, -21, -515, 185, 82, -175, 442, 36, -515, 138, 110, -211, 307, 112, -327, 101, -51, -276, 371, 197, -281, 38, -93, -211, 355, 128, -255, 157, -51, -313, 197, 153, -111, 190, -116, -367, 192, 190, -92, 135, -56, -270, 135, 44, -100, 233, 27, -281, -6, 3, 10, 279, -36, -237, 54, -26, -49, 238, 1, -107, 108, -158, -151, 316, 85, -145, 77, -133, -137, 288, 43, -155, 137, -28, -235, 118, 89, -29, 158, -109, -253, 119, 119, -34, 90, -54, -150, 71, -2, -72, 157, 34, -177, -47, -12, 11, 181, -6, -166, 1, 4, -43, 89, 36, -30, 15, -108, -95, 145, 75, -45]
2399d5K6q2N6J84j36o8J36j06p1J34J2QO7j79q3K07K6p7K6o0j6P5n9pJ50q0j33
2426i5O6qN5J07j49r7J52nq5J14l9o5R5j05n9K07J1j55L4j2J0R4n6q3J21l5j13
2453i5Q9N0k6L9r8p4J34M5q0J3k4RN5p5LJ51r2r5Q2n7M4J47j77j02K18n2j14J18
2481C6J1r5Q7l6r2J47M7j36k2L3M3K2q3J3P1q0LN9j03J22P4k55K0K44j36m9J48
2508I3j48j4J83j50q1K36o4j54R9j0J1R4j36l1J21m8%K2p2J06lj83J24J30j62
2533c7O2J8j89J89J16l13J22J99k76O6J86k55J15K02l57L2L12k11m7J55j71N9
2555b3J32j99M4J40j65P3J7j49K23J2l11K19J25k97K07P8l56K67J74m84K30K99
2577B56m19R0K51l44J34K73m02M8L13k58KJ71k10J14J13k82J35J44k21J31K9k56
$$ y = [-45, -19, -101, -45, 139, 3, -65, 71, -35, -106, 28, 40, 48, 115, -64, -147, 60, 86, 9, 35, -25, -41, 34, -25, -32, 118, 38, -95, -29, -37, 18, 125, -24, -121, 31, 26, -59, 55, 16, -49, 46, -59, -118, 89, 100, -55, -21, -33, -23, 71, 15, -68, 53, 18, -95, -6, 44, 18, 57, -41, -115, 19, 64, -16, -3, -27, -18, 37, -38, -35, 116, 24, -71, 11, -46, -2, 145, -32, -134, 84, 32, -82, 36, 47, -48, 39, 3, -89, 58, 105, -31, -53, -20, 23, 45, -38, -25, 46, -34, -31, 28, -75, 47, 121, -134, -114, 130, -6, -55, 93, -55, -69, 114, -36, -117, 119, 55, -99, 0, -10, 1, 95, -41, -72, 49, 1, 1, 23, -49, 57, 54, -129, -5, 125, -37, 25, 43, -146, 43, 159, -154, -32, 167, -109, -43, 143, -112, 3, 205, -152, -120, 192, -19, -66, 89, -82, -23, 109, -90, -46, 94, -71, 2, 19, -130, 93, 105, -206, 13, 138, -159, 48, 126, -230, 37, 211, -273, -43, 256, -163, -73, 178, -166, -32, 241, -161, -113, 200, -58, -56, 115, -95, 19, 132, -150, -15, 129, -92, 39, 68, -188]
2599a88K97N4m12K84J75m06K22J61m08K66K33n27J79L33m04P0K66l59J36K49l85
2620a64Q0K93l05L4J92k86J52K04l92J22K73l36Q4K31l66J56K87m69Q6L95m04
2641a33NL59l71L5M12m39q3N06l10j84L98k02j67L83k08k13L72p9k51K28m1p0
2663e3J58j75j2K15j91M4J52k98J37K81m71Q1M64m67p6N18m30r7N97m49k78O79
2685C29k75l79N33j32l31M54j54l28M60o8l28L00p0j73L36j78j95L91j70k12L21
2706A31j29j25L36k65j52M12j95j71L44k01j53M08k92j60M94k46k64L86j44j87
2726a73M17k23k57M00j15k45L25r4j39K36k05r0L46j70j19K34k12n1L60k72j41
2747a88M33k35k71L95p6k03K98j19k68K88O2k23J01O2r1mRL4M3n2K6p0o8K08K6
$$ y = [-188, 109, 163, -249, 35, 210, -196, 26, 187, -221, 45, 278, -249, -70, 263, -141, -71, 195, -164, -28, 221, -164, -84, 209, -96, -62, 130, -156, -4, 200, -192, -70, 203, -133, -49, 182, -184, -28, 259, -210, -124, 271, -133, -128, 231, -140, -105, 307, -132, -215, 291, -19, -203, 195, -7, -174, 209, 1, -212, 160, 81, -170, 58, 17, -53, 105, -70, -82, 133, -58, -14, 138, -160, -23, 258, -213, -132, 332, -135, -211, 307, -123, -220, 377, -72, -350, 329, 54, -325, 208, 76, -255, 199, 45, -283, 177, 109, -219, 81, 11, -162, 174, -4, -199, 192, 22, -190, 131, 2, -123, 213, -52, -204, 208, 13, -158, 186, -15, -168, 240, -52, -212, 282, 36, -228, 158, 14, -173, 244, 21, -236, 164, 49, -196, 129, 35, -104, 132, -73, -163, 183, 13, -106, 128, -84, -135, 225, -47, -188, 245, 10, -261, 134, 58, -145, 153, 34, -234, 54, 116, -107, -6, 56, -35, -39, -30, 4, 47, -5, 21, -49, -117, 91, 117]
2772A17k37J40Q3k22J01J28j75J16Q0k80N8K31j19l3P6j17K0R6q2QQ4n8p5j8Q7
2797IQ6j04nL5j19R6J40k16K9K01k46p3L20j29j00K13k10j13L32o1k13K06l9j62
2821a23J52j4m0J56j39j19J52o1N7J19k16k5K38j86n8K87j62j37K27j81n8L46
2843B15j37k34K25n8j20K14o1j32J91j12j49K13Ko9J10j56o2K38j06r5K02j41
2865b2p8J84j68nL02k14k00K97j04j11L21j72k41L51j20k55L85j1k98K23l3k37
2887b06L46L8l50J89O4k35J82O0j69J66n0k33K15Q4j73J84r2k27L05J7k66K55
2909A04L9l40K35N2k29K65M3m01K00J67k45J79P7k84J51O8k44K00J29k61J12j4
2931Cj62K60L1k83K02Rk49K44M2k48K86l2l81L10J37l21K34L0l40K71J31l72K42
$$ y = [117, -120, 20, 103, -119, -18, 110, -65, 51, 131, -149, -91, 140, 21, -12, 64, -53, -33, 63, -19, -11, 73, 15, -60, -78, 9, 95, -9, -14, 21, -98, -2, 138, -78, -49, 152, -94, -167, 153, 24, -76, 137, -73, -186, 146, 85, -128, 78, 39, -123, 29, 15, -25, 131, -8, -127, 25, -36, 21, 140, -76, -101, 137, -49, -107, 180, 18, -119, 108, -73, -131, 215, 78, -156, 69, 11, -109, 105, 44, -88, 103, -9, -158, 55, 57, -12, 98, -58, -120, 118, 12, -83, 119, -22, -100, 84, -84, -89, 213, -1, -201, 96, -8, -119, 202, 30, -211, 140, 20, -235, 150, 139, -159, 64, 31, -206, 140, 178, -172, 17, 81, -154, 28, 88, -81, 85, 35, -198, 17, 101, -72, 112, 20, -207, 98, 115, -151, 104, 143, -197, 38, 90, -139, 126, 169, -232, -32, 135, -110, 69, 146, -138, 13, 81, -163, 37, 166, -95, 17, 3, -159, 101, 132, -151, 51, 60, -189, 55, 97, -151, 135, 103, -278, 32, 169, -152, 82, 112, -228, 43, 174, -198, 44]
2954D4J75l86J36J49k72K15J37l72J23J94k34J12J14k38J28O5k57J74J53k24Q3
2975A9K7k05K24P6k73J56Q8k62J73Q0k12J97L2l03J58J47j92J06M1k27J80O0k17
2998a27J66Q0k33J07L4j44K14K5k72J59Q8k15J76M7k27J79N4k93J99J44k31Q5
3020A5M9j80J51R7k38R8J30k03N8J08j33Q7O8k21O7J45j32L5O0j20N7P0j35N0
3044a7J13j05k2L0n3R8Pj13O2J8o7O9op6J37m7j68J41O8j21Q1oj36J58M5j89J07
3071HO9j59N2O8j06J13N6j91N2J23j05K6N3r8N6M3j33O8J01j01MJ5p7R9N3j48
3097e9O3P4j14L3L6p3P5K2j35M5J09o5k5M8o0M6K4q1K6M9n5J4j5lQ3l4r4P1J7
3126B2n5O6l9n1J13j9j41J13P0j16L1J2o9R1K8j09N8N4o8%J9k6P6k1r5O1J6k5
$$ y = [44, 219, -167, -31, 118, -154, 61, 198, -174, -51, 143, -91, 21, 135, -103, 25, 90, -167, 7, 160, -64, 19, 46, -159, 65, 141, -132, 24, 112, -150, 23, 103, -109, 88, 120, -183, -25, 122, -70, 36, 77, -150, 30, 90, -127, 39, 119, -114, -7, 27, -117, 97, 122, -150, 9, 97, -118, 58, 105, -122, 57, 111, -182, 17, 161, -70, 15, 64, -116, 35, 132, -106, -8, 122, -81, -23, 85, -48, 39, 107, -114, -47, 98, -34, 1, 61, -59, -2, 68, -67, -17, 96, -9, -31, -1, -54, 44, 51, -62, 0, 18, -49, 20, 14, -62, 75, 28, -140, 1, 69, -52, 29, 23, -113, 45, 90, -99, 8, 77, -82, -30, 38, -68, 45, 101, -90, -38, 85, -20, 6, 59, -39, 17, 60, -73, -5, 96, -5, -1, 14, -63, 36, 89, -59, 4, 78, -36, -3, 33, -40, 35, 57, -78, -33, 76, 11, -14, 34, -26, 20, 44, -37, -11, 38, -17, -3, -18, -21, 62, 28, -66, 5, 22, -33, 33, -6, -57, 56, 37, -104, 9, 79, -37, -6, 6, -63, 28, 56, -53, 5, 59, -9, -9, 10, -16, 60, 39, -56, 5, 21, -4]
3154dK7l8k0R3n8p6J23j7o3O6l8p1J40oj46J03L6j06M5K3m3O5mq6K8M0Qj3n5M9
3184BO7j22K3J03j03PJ02j51jK15j39j11J81n8j11J74n9r4J78m3j82J54O0j18
3208b6O3k4n4Q1j0p8P4J1n2K9n5L0J05r3l5R3j02K8J09j50nK09j95q2K56j14j09
3235i6K08j28j54K87n1k24K10M4j90J01M6j06R3J0j26O8J4oM3j08K0J58j57n4
3259i8K30j41q0J96j36j11K97j01k18K46Lk23J97J9j81J78Kk13J51Q6j59R7%j33
3283i2J50Jj40J26K9j16P0l2o0J61p9j21J80q1r5K15j09j62L01j11k63L41K4l18
3307a81K53M5l29K63J41l55J37J89k74K7J82j44M5P1j49N6O5n0O1m9q8J72o5j57
3331a34K19jk13J75Pj92K27M5k86J55J22k25J15Q1j84J14O3k13J19J41j91M0P4
$$ y = [-4, 23, -15, -35, 58, 0, -76, 47, 30, -33, 33, -5, -76, 64, 58, -88, 15, 51, -55, -10, 13, -30, 35, 31, -55, -27, 13, 21, 8, -47, 2, 69, -53, -30, 73, -30, -23, 79, -72, -73, 142, 3, -108, 73, 15, -96, 78, 19, -75, 103, 60, -122, 32, 92, -26, 37, 13, -41, 40, 30, -48, 26, 37, -15, 14, -41, -11, 94, 1, -34, 59, -43, -15, 94, -56, -61, 148, -47, -129, 127, 13, -96, 112, -16, -170, 117, 66, -158, 52, 96, -94, 7, 53, -53, 40, 50, -76, -8, 6, 0, 43, -65, -45, 113, -44, -98, 132, -9, -89, 107, -29, -140, 157, 56, -162, 84, 87, -136, 61, 80, -101, 77, 79, -134, 17, 103, -56, 41, 41, -92, 58, 59, -81, 45, 74, -42, 28, -4, -64, 97, 18, -103, 77, -4, -99, 116, 7, -155, 146, 35, -228, 113, 137, -181, 72, 117, -212, 51, 192, -163, -26, 163, -111, -84, 98, -46, -1, 70, -79, -23, 42, -8, 53, 4, -84, 88, 23, -134, 85, 84, -129, 46, 53, -139, 88, 133, -153, 2, 124, -101, 14, 95, -89, 25, 88, -125, -6, 135, -56, -16, 58]
3354E8j55J01P8j70P0R3j33L8M9p8R7jj54J16M3j45J38K2j83J46O6k44J32J70
3378A54k20KJ51j24mJ59j13j11J59qj03M0P1k0q2K0O3l2pP9r0n2J45l4j44J29
3404B8O6j66M3R6q7J6J13j49l4J43m9p7R8Lj05Q5Mr1J03M9j66L7J10q8k3Q8o1
3431a4m6J17o1r3J39K8j37L5P0n6J8M6p2j6P5J4r0J5Q8k9j02P2O4r3K6O1j11K4
3459b8J22r1r2J57j0j42Q5N2q8M0O2j09K0Q5n6n2N9J4k1j2j2N1k2k2L3l8j9Q6
3487E2m8r0J24jj08P0L8j06J00K4j74J38Q0j93P4R3j51N8J28j93N4J79j86m5J85
3512A02j01n9J49j00o4J62p4o8J03l4l1M2o6M8P6j12J0Q6j35O4J03j88N2J74k05
3537f6k7K18j44m9J82j49m7J92j17q5J52l7p1R1q0J1J19j32j2J07j15L9J24j94
$$ y = [58, -97, 4, 82, -88, -18, 75, -58, -20, 29, -49, 48, 47, -107, 9, 52, -93, 45, 67, -116, 30, 96, -148, -16, 154, -66, -64, 87, -37, -41, 118, 5, -106, 53, 45, -58, -18, 53, 33, -49, -29, 34, 2, -5, 74, -16, -68, 77, 43, -101, 28, 94, -72, -29, 67, -20, -4, 109, -40, -74, 69, 20, -57, 41, 44, -61, 24, 28, -63, 40, 89, -77, -40, 70, -18, -41, 47, -14, -60, 57, -4, -97, 42, 70, -67, -32, 38, -18, 0, 46, -26, -42, 33, 47, -43, -28, 60, 31, -71, 1, 65, -28, -2, 59, -52, -28, 94, 3, -89, 68, 58, -84, 1, 53, -35, 5, 67, -42, -22, 63, 7, -45, 14, 28, 7, -5, -17, 34, 12, -10, 23, -15, -34, 52, 4, -86, 38, 37, -71, -1, 37, -69, 31, 55, -119, 19, 99, -94, -20, 73, -78, -20, 108, -85, -31, 148, -38, -83, 102, 1, -58, 91, -9, -73, 89, 15, -53, 50, 16, -15, 27, -39, 9, 85, -27, -17, 69, -66, -2, 101, -87, -35, 139, -66, -93, 125, -19, -68, 114, -35, -82, 110, -7, -92, 60, 23, -48, 43, -37, -26, 93, -39, -51, 56, -59, -20, 104, -90]
3561i0M1J95k24lK24j90k7J94k04j2K63j77j23K65j29j18K39j11j07K32j15j58
3583a35K12j4j30J19m2q3J36j7j06J00qp9O5n4K7Q9j16pJ03p5qJ18j61J3J76j48
3609b5n8J86r2j06J63p2r0J73k3j42J11J7q3O0j8n1R8m7o4R8l3k7O4p2k7J36o9
3636Gr1J36k6q6J08j1r9J40l5j32J26L9j37P6K2r9Q3M8j30N0P7r7oP1n6J0N9o9
3664b2k1R5l3m6K8kn%j1J9J6j7J4l8j2P7nr9P0K7q3O3J4p6P1K7j18N3R1j14QN9
3696C0n0J5O3r6J4Q1o2j3O5m1LM2q7K1P9l7m2L7j8j1M5m8J3M1n1rL1k0K1Ro3J4
3728b4O0m5j1K3j6QK4m8J2M0j5l2J5K4%ok0lJ6lKrkL3k3k0PM4k1j5mL%K0l2RL5
3765B6j4k9PJ6J1ql5J5J7K0l0kK4j5qJ2j8K2J4m2j6M9jl6J5j0rM9k0m1N5Op2K9
$$ y = [-90, -49, 146, -78, -81, 143, -47, -74, 120, -84, -96, 167, -10, -133, 132, 3, -115, 124, 13, -94, 138, 23, -135, 77, 63, -67, 52, 10, -73, 63, 46, -60, 40, 32, -47, 18, -36, -9, 80, -36, -43, 60, -15, -23, 95, -66, -53, 123, -25, -83, 103, 11, -95, 68, -4, -94, 79, 56, -86, 25, 42, -41, 19, 1, -50, 48, 1, -63, 35, 2, -25, 39, -33, -60, 76, 7, -84, 52, 26, -60, 48, 37, -62, 78, 43, -89, 37, 76, -61, 15, 37, -62, 21, 69, -61, -11, 66, -31, -37, 34, -22, -12, 47, -22, -43, 52, 19, -27, 1, -1, -6, -6, -17, 2, 18, 1, 15, -23, -35, 42, 37, -62, 8, 35, -48, 15, 29, -47, 24, 51, -67, -14, 77, -37, -29, 30, -20, -5, 58, -38, -24, 57, -5, -18, 47, 6, 9, 51, -36, -15, 64, 27, -15, 22, 4, -7, 38, -10, 3, 44, -7, -16, 15, -5, 16, 25, -38, -24, 36, -9, -20, 3, -13, -5, 19, -29, -17, 23, 8, -24, -9, 15, 15, 9, -11, -14, 2, -1, 1, -8, -10, 23, 0, -20, -13, 31, 10, -5, -9, -6, -6, 14, -18, -9, 26, 12, -17, -10, 6, 17, 9, -26, -11, 6, 26, -4, -6, 18, 3, -5, 7, -11, 11, 25, -17, -33, 16, 15, -21, -6, -16, -25, 24, 4, -37, 18, 24, -48, -19]
3799a9K4k1M7m9j6N2pl2L9k3k0N4m2m1Q5Rq5N2Pk9N0np3N7J8o0J5K7nOl2j8O0
3832B5j3k2K9m0KO8n6k4Q5k9p8J01l4n7J06n0r2J07J7r8O9L5j16Q6J5j09R8K6
3860E1j04K9M8n1K8K6n7K5L1n0MK5kJ7k8k6O0j4m4N3rn1R3l1q2J08J0j20O6M6
3890E1j03P8K6j05L0R1r3qQ7n4j7K8l8L1L8o4%K2k0M3rn3O7J7r7N6K4o0M9K9j28
3921h2P1J07j59K2J13j04j6J16r6k5J31j08n6J33l3o8J10n1n6R3k8l9N9pl5K1
3947A3k2MO4o5j3O8p7L3N5r3K7Q1j15jJ26q3m2J18j07l4J47q5p8J31l8q5J08j7
3975B0p4J13l2j03R5Ol8K3k5k4P1m2j7Q1o9j7Q5q6j7J44q9r2J43m2q4J08Jr9R3
4004C3Kj11R0N0q0J8J9k6L4ql2L7%m6M7j6j1P0n4p2P8Mm8O1k8o6O6J3q4R4Nr3
$$ y = [-19, 5, -16, 31, -18, -34, 18, 11, -21, 18, -5, -25, 29, -13, -54, 31, 40, -45, 7, 14, -15, 35, 30, -43, 14, 32, -28, -13, 14, 9, 15, -17, -35, 25, 12, -10, 19, -21, -19, 49, -7, -31, 54, 25, -53, 48, 14, -43, 63, 13, -79, 28, 45, -53, 16, 51, -65, 21, 36, -73, 25, 51, -53, -24, 24, -27, 1, 27, -30, -5, 26, -24, -20, 5, 3, 20, -8, -34, 26, 12, -32, 21, 12, -39, 54, 23, -59, 49, 59, -61, 5, 51, -52, 26, 52, -53, -23, 68, -25, -33, 54, 0, -17, 11, -27, 4, 42, -22, -22, 0, -20, 23, 14, -39, 28, 45, -52, 4, 28, -32, 17, 46, -82, -11, 96, -63, -41, 72, -32, -48, 68, -28, -53, 78, -30, -86, 47, 14, -54, 56, 5, -51, 42, 14, -25, 34, 27, -8, 13, -9, -5, 59, -6, -19, 49, -28, 5, 60, -33, -6, 75, -40, -41, 85, 2, -40, 78, -29, -63, 84, -1, -79, 52, 14, -71, 37, 20, -54, 59, 27, -76, 19, 25, -13, 10, -15, -39, 32, -10, -27, 54, -15, -32, 53, -33, -50, 94, 5, -87, 56, 14, -70, 38, 39, -60, 33, 35, -76, 14, 64, -16, 2, 21, -5, 29, 21, -11, 26, 26, -20, 27, 11, 0, 70, 16, -56, 22, 26, -22, 39, 11, -55, 11, 24, -60, 34, 39, -54]
4036e4N1L1o3N9L0r7RP4p3jP9m7m0N2j6l2O5Rq0MN2rj7K0J6k9j0K8j8j7O9k1q9
4069f5M7Q4q9PQ1o5n1J01m0n6J01j2j08O9M0m7K2K0o7J0M3k5oL2j7k4kPL7om3
4100b2J2Nj7M9k1l4N1j2n8O2J7n6M6Mq9P1N4j03K9O4q5rQ4m9j0O8p6m0J06Jp4
4131c2L1K1l9J9QPLj1Kl1j3Q6kq4M2L9r3M5P7j07K3O2q0m3J50o0q6R1l0n3R7j1
4163B8q1O7Oo7K7L9l6K5j6l3N9j1l1M1k9k7P1l8k4R8n4n5O6k1n6J25m9r8J12Q
4193D6j15R1M7j17O1L6j19O7Q4r5oN1m4OM1k5j1Oj2J4k4K1N1q1m1J15l5o3J11
4222F0k7j23J32j8j17J38K1j70Q0Q2j34Q1O3j27L9P9j02RQ6m8l0L1l1J7M1l8M
4249bj2k2N7k0m0P0j5p7O8J6o3Q5j0j04O8O3j01K1P1q5NO4o3K3O1n6m3N8j2j1
$$ y = [-54, -3, 28, -35, 24, 54, -43, -34, 40, -33, -34, 45, -2, -42, 10, -6, -38, 27, 36, -44, -40, 12, 3, -14, 6, 22, -7, -17, 11, -7, -24, 45, 24, -65, -18, 66, -23, -16, 65, 0, -51, 50, 10, -46, 55, 43, -65, 4, 44, -3, 19, 39, -28, -18, 25, 0, -6, 26, 9, -15, -17, -10, 27, 21, -22, -10, -5, -22, 27, 6, -28, 23, 11, -47, 15, 32, -24, 22, 26, -63, 8, 62, -41, -12, 52, -33, -42, 42, -7, -17, 51, -25, -65, 41, 42, -32, -1, 20, -19, 0, 8, 15, 18, 7, 9, -22, -35, 51, 49, -35, 7, 46, -47, -2, 75, -32, -9, 53, -27, -70, 80, 20, -66, 25, -5, -58, 39, 28, -53, 14, 20, -47, -20, 19, -17, 8, -8, -41, 18, 7, -24, 17, -12, -39, 32, -6, -30, 68, 14, -41, 25, 4, -52, 73, 24, -74, 38, 46, -69, 22, 69, -48, 13, 49, -70, -3, 81, -14, -20, 31, -13, -7, 34, 9, -2, 4, -8, 6, -18, 3, 54, -27, -68, 47, 12, -51, 60, 33, -90, 42, 24, -93, 45, 66, -104, -24, 58, -76, 5, 68, -59, -20, 59, -43, -34, 52, 4, -26, 5, -26, -9, 32, -6, -2, -14, -36, 21, 1, -39, 31, 16, -61, 7, 23, -40, 45, 35, -69, -1, 62, -39, -18, 53, -32, -27, 37, -26, -3, 58, 2, -41, 17, 5, -6]
4279fJ8j7Nj3j3M7k4pL5l3o3R0J1p9N8J1q5N2N9q8K5P6r0j4R6m7j7N3m6m4P4j
4311B3n8M5K7m6j8L2J4j2Mqj4K0K8k5k9L5Mo6L3L3l6K1ll8K5M2k1l7L6Mm4M5p
4344Ij7J1J2l7NL6km2J5K5l5J3K1k2j5L3k5l7O3J4n6K4L4m5KM2l6j2L6j4l4N3
4376A9J0k8j2L7j9j3M2k6l0L2J5l2LK8j2k3K2j2nJ3pj5K6Ml5RL0k1KpmJ4Qj8k
4411gJJ7Ml2K3Nj1j5K5l2J7K3k4k4N0j3l4K9Kk9K5Ll0L0L8m9pK5Mlj9L1j1j0J8
4446B0j4k4N7j2o2M0L6n4PN0n2j6N8m6k8Q5j0o9L5J3m0M4rm2L1J4k9j1M4lj8k
4478gjJ1rJ7j5k6K6Rk9kM7l9j0L6j3j9O5n1l4O0Jm9L8K4m5K3J4l7J8L2l5MJ7j0
4512A1Lk2OJ3j6j1M0k3j0M0m2k3P0k6m7N8j9m5M7Mm5M3J5p2L3K6j8NK0k4kJ9l
$$ y = [-6, 12, -5, 0, -13, -26, 21, -3, -10, 25, -8, -71, 19, 30, -49, 9, 20, -65, -13, 46, -42, -17, 59, -31, -45, 51, 4, -13, 40, -6, -50, 24, 23, -35, 10, 37, -9, -27, 5, 19, 7, 11, 3, -11, 9, 37, 12, -17, 18, 22, -44, -11, 22, -14, 7, 4, -34, -9, 33, 12, -25, 11, 15, -29, 16, 9, -8, 3, 15, -22, -17, 19, 17, -25, -10, 15, -20, -7, 14, -8, -23, 10, -15, -52, 11, 25, -31, -7, 27, -18, -16, 26, -10, -22, 14, 0, -34, 19, 29, 1, -11, 26, 7, -6, 36, 10, -20, 12, 27, -5, -2, 26, 14, -9, 13, 1, -4, 9, 2, -13, 13, 17, -18, -9, 21, 0, 2, -5, -9, 5, 13, -5, -7, -6, 11, 15, -17, 6, 11, 0, -15, 10, -22, -5, 18, -6, -30, 20, 7, -27, 2, 4, -25, 0, 3, -27, 3, 41, -8, -15, 10, 14, 11, -8, 23, 12, 2, 20, 6, -18, 39, 27, -35, 5, 41, -13, -6, 44, -8, -24, 34, -12, -40, 45, 35, -34, 1, 14, -26, 18, 9, -33, -2, 12, -17, -28, 16, 13, -5, -7, -8, 3, -6, 11, -4, -30, -4, 5, -24, -26, 21, -18, -28, 8, -5, -24, 41, -10, -44, 16, 17, -32, 6, 30, -15, 8, 22, -15, 3, 35, 0, 4, 21, 11, 14, -8, -2, 11, -5, -16, 24, 1, -9, 31, -11, -34, 36, 10, -37, 21, 2, -43, 4, 8, -37, 6, 21, -51, -18, 8, -10, -5, 15, -9, -11, 8, 5]
4545Ej1RjJj8NL6j8k4K3j9qM9k0m6N8kn6M3K2n1L4Rm8K8M4n3NL7l6lL2k2PK2m6
4581a3QK0%oKj6K3ol7L0ml3M6j2m9M8K4o1K2L8m8J6N1o7J3M8n0j7N6k5k0L6k4
4614gjK4llMj8Q%j2K3Nn3K0L6l3J1J7n2K4M1m0RK6k5lL7l6pN0m1j3K7j3j7L6j9
4650Bj0J9j3l0L7Nk9K8k2MK1l7QL5k9j1L6l1QM0m1j5N1k0k9L5pm3N0Ql3L3Mj7
4684Gj3QlJ3Jj2qKJ1Ol2K2K1l0j2N6m3oL0j9j9N8k8l1N0j5l8K8J1k6K3On9L4K2
4719A5k8NK4m0J4J2j9RK0k8j3L1JpJ%MqPQk0K6Nk9kJ9Oj3NJ0k5J8Mj8OJ6j1rJ2
4758HjMrk0QJ9rOKj0Lpl%K8k5Mj7RkL2j6k8L7Ll8K5Jj3qJ6k2J7K2k3kK5k1LQm
4799BOj%j5K6Rk0r%J4lmQq%kjmJ2J7l0PJ4j7J5opOJ1j3k0L0j9mJ2j7rM5k3j3J2
$$ y = [5, -6, 3, 2, 3, -15, -10, 26, 8, -16, 7, -12, -20, 29, 9, -37, 21, 19, -37, 6, 28, -23, 11, 20, -28, 0, 44, -9, -4, 33, -3, -6, 26, 4, 11, 33, -13, -5, 15, 15, 9, 11, -5, 18, 12, -25, 5, 1, -32, 14, 2, -47, 1, 25, -36, -14, 24, -24, -8, 43, -24, -11, 37, -13, -30, 26, 1, -19, 17, -7, -8, 16, 13, 10, 14, -4, 4, 4, -8, 15, 20, -33, -13, 23, -10, 1, 18, -34, -10, 31, -9, 0, 26, 1, -2, 35, -1, -8, 42, 1, -12, 15, 2, -15, 21, 2, -8, 11, -2, -32, 5, 10, -19, 9, -13, -9, 12, -25, -17, 18, -11, -22, 14, -17, -9, 31, -10, -25, 26, 6, -23, 12, 5, -38, 12, 20, -13, 20, 24, 7, -6, 2, -1, 12, 13, 1, -7, -5, 6, 12, -20, 2, 23, -7, -19, 37, -6, -12, 18, -1, -20, 38, 10, -21, 29, 14, -24, 4, 15, -11, 12, 18, -41, -7, 15, -13, -8, 16, -24, -10, 2, -17, -8, 12, -16, -29, 2, 3, -4, -3, -3, 1, -7, 0, 8, -12, 14, 19, -10, -12, 7, 13, 0, 5, 15, -10, 8, 12, -6, 0, 16, 5, -4, 8, 7, 11, 2, -18, -10, 9, 0, 6, 8, -2, 1, -6, -9, -9, 19, -6, -2, -19, -10, -12, 20, 4, -24, 13, 16, -22, 3, 4, -9, -17, -1, -23, -6, 16, -7, -9, 16, -5, -2, 6, 2, 8, 7, 7, -8, 18, 27, 7, -2, -2, 12, 9, 5, 13, 5, 5, 3, 2, -2, 10, 27, -3, 4, 18, 1, 16, 10, 3, 9, 20, 7, -13, 17, -2, -6, 6, -11, -20, 25, 2, -11, 1]
4840AmKJ2j1KJ7l4PJ0lj2J6j1pL2l0nK8mj6J8ppJ4j2j2K1Pj5J7j4JjkJ1LmJNj4
4880@J0Qok1K3lj8J8jmJ6k3j1L3Nl2J3oLQjk5L7j5l2L0Rj7K7k5j3J5PmLKj1J5
4918A4lj3RLk4J4Nj0J6Ml0PK0k5K3JmQ%Jj0Rj6RNqQJj0MjpmOQmpmJ9mj1Q%j8K3
4963A2qj9K2Qk5nMPkNj0J2Kj8RPlN%Nj2K1k5Rj6J9jj3J4mkJJKjJ5j2oRJ7mj4n
5006AJ0Nj4J6rrJ5j9PNJJ2j6j0K0qlnNMj2JQmpnJjKPmOKJj9L1oj3J3j7J1J1lj9
5050hMJ5j1j5J8lmJ3j0rKL4k6J3qj4NRj2K4oj1j3K2Mj7J1j3LJ8o%Pj7K%j1mJ1
5089cKj6J4nj7J7%Oj4Qj2OK1j0Mj3K3koKklRkj7J7J0j9LRj1L%lj0K4j5jK8k4m
5130cJ1%nMpLLnjPj1kJ7j1lQjoLo%J0qMj2MJ2j2j0L1j3rj2K6j1%Jj4J7J3k7J3
$$ y = [1, -3, -1, 11, 0, 2, 19, -15, -8, 2, -1, -13, 3, -8, -15, 17, -13, -18, 10, 6, -10, 8, 1, -6, 8, -4, -16, 5, 12, -3, 14, 0, 1, 0, -2, 9, 12, 8, 9, 14, 0, 10, 18, 12, -9, 14, 11, -7, 11, 10, 6, 22, -1, -12, 21, 26, -6, 7, 1, 4, 12, 11, -14, 23, 8, -24, 6, 15, -2, 25, 0, -13, 2, 9, 5, 8, 10, -1, 14, 11, -2, 7, 10, -14, 0, 5, -5, 11, 15, -15, -8, 12, -13, 10, 11, 7, 15, 15, 16, 6, 15, -1, 8, 13, 5, 13, 14, 4, 8, 7, 0, -4, 2, 10, 6, -1, -5, 14, 10, -1, 7, 7, -11, 12, 4, -15, 7, 15, -10, -15, -11, -4, -6, -1, -11, 1, 3, -15, -6, 1, -2, 3, 3, 8, -4, 17, -8, 1, -15, 4, 3, -10, 4, 0, -2, -1, 0, 2, 1, 16, 4, -2, 7, 24, 20, 6, 1, 11, 16, 2, 18, 9, 0, 15, -4, 3, 8, 9, 21, 5, -5, 15, 7, 4, -1, 4, 8, -4, -3, 5, 1, -6, -11, -10, -11, -9, -2, -6, 0, 2, 3, -16, 15, 9, -4, 9, -8, 3, 14, 11, -8, -4, 11, 0, -15, 3, 0, -4, 9, -1, -10, -8, 26, 0, 13, 5, -9, -4, 5, -7, 17, 11, 0, -13, 9, 13, -4, 7, -6, -3, 15, 9, 9, 16, -1, 1, 1, -10, -14, -3, -1, -17, -3, -8, -25, -8, -8, -2, -16, -8, -20, -14, 7, -3, 1, -12, 11, 9, 3, 5, 3, 0, 9, 7, -10, 7, 17, -2, 1, 10, -1, 2, 2, -1, -11, 13, -2, -3, 25, 1, -3, 8, 8, 3, 7, 0, 3, 6, 1, 0, 7, -4, -6, 11, 0, -3, 5, 4, -2, 1, -5, -5, 5, -3, 1, -11, -7, 5, -7, -17, 14, 1, -8, -20, 6, -5, -5, -4, -18, -1, 12, -15, -2]
5172brJ2PnkKJ8jk4MOj1QjJ2pLj2qK5qpJ3omLnPlJKkpNnmJ2rrK0j1qPOk3K8rj2
5220a3lK8j9PJj2j0J6Kmj0J9Mrj4K0%qJ7qj0K5j1j2K4oqmljKRpj1RpOJ5k3NJ5
5261A1k2J2LrrJ0klK0k1MJ1kj2NJ3j6lpJ4qJ4moJJ2j1j8RK4j4JJ0Mj8MKlJ7nn
5302COMj0J2j2Qj3J5j2l%J8%j9J7kr%J1rjRk3kK5qqNoMjmmMKkPRj0kQjj3mJ0q
5348i%J7j5PlNrJ0j7RNMkqJ7%j3lJ4j8K4nnKjKj3%J6Pk0J6j3K0j3Poj3NLpJ7k3
5391iJ0j2OJ4j4j0MRqJ6j2KoRNmMNqj6OJ7j8Qj%lJ0klOmljJ2pqLJ6qkJ3k2K5k0
5436aMnJ5rlJKjqJ0pOLj2KNJljj3lK1pj1RK%J4j7j2QJ8l2KJ1J9j8RJ9j7oJNJk
5481@NLmJj6RKM%Oj0%OqJ3mJklmJ5Qk0J0pmmlNqJ3LpkOKqNj1J1ok0J9nj0J1Ql0
$$ y = [-2, -11, 1, 8, 3, 1, 3, 21, 20, -4, 0, 6, -5, 3, 2, 14, 7, 10, -2, -10, 15, 7, 0, 13, 7, 3, 6, 1, 8, 5, 6, 8, 6, -1, 4, -1, -5, 7, -2, -11, 9, -2, -10, -3, 3, -20, 8, -1, -13, -16, 12, -7, 0, 1, -11, -21, -5, -3, -7, -17, 2, 6, -3, -17, 3, 3, -5, 12, 4, -6, 19, 8, -4, 20, 14, 6, 2, -1, -2, 0, 9, 2, -9, 0, -7, -1, 14, -9, -4, 11, -11, 1, 4, -5, -14, -4, -6, -9, 11, -10, -6, 5, 3, -9, -4, 9, -7, -10, -17, -3, -11, 3, -1, -7, -6, 6, -5, -23, -14, 10, -4, -3, 7, 11, -7, -3, -1, -4, 13, 8, 3, 9, 13, 3, 15, 3, 11, -2, 13, 1, -2, -2, 16, 16, -3, 14, 12, 3, 3, 14, 5, 4, 13, -10, -12, 13, 5, -3, 2, -4, 0, -1, -5, -9, -5, -3, -5, 2, 11, 1, -1, 7, 6, -7, -11, -1, -9, -9, 8, -7, 0, -3, 2, -7, 3, -14, -5, 0, 4, 2, -6, 11, 11, -2, -5, 9, -9, 15, 10, 5, 7, 6, 8, -5, -5, 11, 18, -2, 14, 1, 21, 8, 15, 9, -4, 1, 4, -3, 14, -9, 1, -11, -5, 9, -5, -15, -11, -2, -10, 6, -6, -4, -10, -1, 4, 0, 4, 9, 1, -15, -9, 8, -10, -2, -3, -3, -6, 4, 2, -1, 5, 1, -2, -3, 9, 2, -6, -3, 13, 5, 3, 16, -6, 19, -1, 3, -2, 13, 4, 1, 2, 4, 3, -5, 5, -2, 4, 7, -5, -3, 2, 3, 0, -1, -14, -17, 4, -3, -14, -5, -3, -3, 11, -6, -18, -10, 8, -24, -22, -11, 8, -10, -1, 18, 1, -5, -4, 1, 2, 0, 5, 8, 4, 5, -11, -2, 0, 4, 4, 10, 0, 0, 6, -2, 11, 7, 8, 6, 3, -1, 14, 22, 2, 12, 5, 1, -3, -6, -1, -9, 4, 7, 0, -2, 4, 6, -2, 3, -8, 3, -3, -23, -4, -9, -19, -8, 0, -30]
5529c0J9jj6K0PpOQj9J0oKJ1qJ9l0J1NRoLKj2NLolJ0Lk1K7j4kOJ1k0OJ1k2ROj0
5571dj1J8J0j3jljK7k9%J3k4RJ6k5lK8j2klj1J3J5j4oOMoRj0kJ9j3%O%oQmMMM
5613A0j4K2oj0RqNj1%qJ3Mr%qJ3kjmKJ2rNNo%j2Qj2jRJj5NQqj1K4j4j2J0J2qO
5657fqOlJ8k1J4nlJ0rRLpLNoKJ4j5nJ2LknJ4k0J4j1JkRjj2kMLrJPNj7K0j5LOJ
5703Cj1J0Nj2OpjOnKMJj8J5%Kkj6RjRmLoRj3Rl%J3j1JLlNMRjk2J1PrnJ8kj6JQ
5751EKj8kJ8j2NnJ7j2pLQkj5J3j3J4jQmlqJ0omJ0Nr%%%Jlj1%J8lJ%Rj4kOj2K4
5796A1j2%J2mNj1MQjjqKJ0k3K2j7J0pqJPj2RlnL0pqrqQLj2oPJ4pNk1K5%k2K3K
5840FlrKqJ1%j2RJ7noJj0J1njoRJ5j7jR%j2kKNMRj2jJ5%j7nRnqJ3%Qjj7%jJ2j9
$$ y = [-30, -11, -12, -28, -8, -1, -8, -2, 6, -13, -3, -9, -7, 4, -4, 15, -15, -4, 1, 10, 4, 7, 9, -3, 2, 5, -1, -4, 6, 9, -12, 15, 1, -1, 5, 16, -4, 2, 13, -9, 0, 6, -4, -15, 3, 13, 0, -1, -4, -5, 22, -7, -7, 6, -18, -9, 7, -18, -21, 7, -5, -7, -10, -21, -8, 7, -7, -13, -7, -3, -9, 0, -10, -12, 7, -6, -6, 0, 0, -6, 2, -2, 2, 6, 10, -4, 18, 12, 2, 11, 3, 8, -3, -3, -11, 2, 6, -3, -3, -11, 2, 0, -1, -5, -3, 9, 0, 5, 10, 4, 4, -8, 0, -12, -13, -4, -3, -18, -13, -5, -13, -24, 0, -14, -26, -16, -4, -12, -6, -14, -8, -11, 7, -14, 0, -5, -8, 2, -7, 2, 5, -2, 1, 6, 0, 2, 16, 1, -4, 8, 11, 9, 4, 18, -2, 12, 1, 2, 0, 9, 8, -4, -6, -2, 1, -8, -7, 0, 5, -12, 8, -7, -4, 2, 3, -8, 2, 7, -5, 1, -6, -7, -1, -6, -4, 0, 1, -17, -2, -2, 0, -2, -18, -9, -10, -1, -5, -2, -8, 1, -12, -3, -6, -6, 7, -4, -3, 0, -3, 2, 6, 15, 14, -8, 3, 10, 1, -4, 14, 12, -4, -3, 5, 7, -11, -13, 5, -7, -2, -7, 10, -2, -9, -6, 2, 0, -15, -2, -15, -1, -2, 6, 2, -1, -9, 1, -5, -9, 1, 6, -3, -3, -3, -3, -2, -5, -16, -16, 2, -1, 0, 0, 9, -5, -7, -1, -13, 11, -1, -1, 11, 7, 12, 1, 5, 13, 12, 11, 3, 5, 15, -8, 14, -3, 7, 0, -8, -7, 0, -12, -3, -6, -11, 19, 12, 4, -5, -13, -5, -2, -14, -20, -13, 1, -6, -1, -22, 3, 3, -19, 4, 6, 3, -6, -4, -12, -1, -1, -13, -4, 13, 8, 2, 3, -7, 4, -1, -2, -8, 1, 16, -1, -2, 7, 7, -5, -7, -5, 0, 4, 13, 1, 0, 15, 15, -2, -7, 2, -3, -11, 2, 2, 10, 9, -8, -8, -9, 3, -16]
5887a6RoQJ7j2oLKkLnlJ4njNpLKj0QJo%J8j3LOk1J8kqNj2J4k0OJ9nN%jj2J1Jq
5933@RK%j6LJ0j0O%oJK0j9kJ7j9jLJLJj7qJ7jqMkJRjnJ5j1jj2J7OomL%jLknK0
5980A4kj4ROq%Nk5RK1k1J3J5j8j1J6Oj1J4j3j2J4%mqRn%j1K2j1Omk1K3j5L2l2
6018a2jN%j3J0jJQkj9K2J0j0j5J2PnRj0KJ4j2QJLoj0JK4j2pJ7j8KJ1rpJ9rRj6
6059AJ3pNmj6qK0j2oK0%qkRj3K5mk2NJ5k1%K2j9mJ6j0j0K2oqqMJ5j4J0Rk6J8j0
6099iKJ2K5k2j4K2jj1J2j1rQJ0j7OK0l6J2K2j0oJ8k3rJ6nj4K1j2qOqJ1OpqJ6j
6137Dj0J9k6J9qjk1J6k%JrPK0j1pJ4j3JPj2J4Qk3J9qj0K3kjPmllNjoJ7k8J8K1
6178C1k3nJoJJ9k7oK8j1j4J8NrPj4mJ5Jj2J4Kj9Qj2J5OMk5%QJJ0oj2J5pmjJ2l
$$ y = [-16, -7, -13, -5, 12, 0, -6, -3, -1, -3, 0, -5, -8, 6, 1, 0, 5, -2, 1, 3, -7, 1, 2, -4, -4, 14, 1, 4, 10, -11, 7, 5, -3, 2, -10, 4, -16, -10, 9, 4, 9, 9, 8, -4, 7, 8, 0, 9, 11, 11, -5, -2, 8, -2, 4, 4, -2, -1, 19, 0, -2, 15, -4, -5, -2, -1, 2, 3, -14, -22, -5, -6, -14, -10, -12, -11, -2, -3, -8, 7, -4, -5, -17, 0, 6, 0, -4, -1, -1, -2, 1, -1, -6, 14, 12, -2, 7, 13, 5, 5, 10, -15, -6, 15, -6, 7, 22, 4, -7, 9, 15, 4, 18, 5, -7, 7, 7, 3, -5, 4, -1, -1, -12, 10, -1, 5, 1, -20, 3, -12, 20, -12, -13, -8, -8, -21, -11, -12, -11, -3, -5, -24, -2, 8, -2, -17, -5, 2, -3, 6, -4, -2, 12, 0, 8, 9, 12, 6, -4, -3, 21, 9, 2, 19, 1, 3, 14, 5, -2, 17, 8, 17, 1, 14, 7, 12, 8, -8, -16, 4, -8, -14, 6, 6, -2, -4, 5, -8, 17, 13, -9, -4, 11, -10, -10, 12, -7, -11, 5, -5, -15, 7, 1, -7, -15, -11, 4, -10, 0, 9, -17, 1, -9, -7, 5, 30, 8, -6, 16, 15, 4, 16, 5, -4, 4, 14, -3, 3, 23, -13, -1, 21, 11, 5, 23, 0, -9, 7, 2, -12, 9, -3, -11, -5, -13, -2, 4, -3, -11, 5, 4, -6, 13, -13, 6, -2, -3, -24, -8, -10, -10, -9, -18, -11, 9, -2, -9, 5, -8, -7, 0, -12, 2, 10, -13, 6, -2, -12, 11, 9, 8, 15, 11, 8, 5, 10, 9, 3, 20, -8, 10, 31, 8, 3, 4, -2, -1, 18, -9, -15, 13, 2, -12, 6, 11, 2, 9, -5, -9, 6, 7, -5, 9, 11, -8, 0, -12, 3, 9, 13, -12, -12, -4, -3, 7, 1, -11, 4, -3, -7, -8, 4, 1]
$$ [...]
8191a1
##END NTUPLES=NMR FID
##END=
