##TITLE=1H_LY-811.1
 CCl4, 8 sc, 
 9.4.2019
##JCAMPDX= 6.0         $$ Bruker NMR JCAMP-DX V2.0
##DATA TYPE= NMR FID
##DATA CLASS= NTUPLES
##ORIGIN= UXNMR, Bruker Analytische Messtechnik GmbH
##OWNER= root
$$ XWIN-NMR		Version 3.5
$$ Tue Apr  9 14:55:29 2019 Russian Standard Time (UT+4h)  she@DPX200
##.OBSERVE FREQUENCY= 200.1315
##.OBSERVE NUCLEUS= ^1H
##.DELAY= (6, 6)
##.ACQUISITION MODE= SIMULTANEOUS
##.ACQUISITION SCHEME= undefined
##.AVERAGES= 8
##.DIGITISER RES= 18
##SPECTROMETER/DATA SYSTEM= spect
##.PULSE SEQUENCE= zg30
##.SOLVENT NAME= DMSO
##.SHIFT REFERENCE= (INTERNAL, DMSO, 0, 15.7039)
##AUDIT TRAIL= $$ (NUMBER, WHEN, WHO, WHERE, WHAT)
$$ ##TITLE= Audit trail, XWIN-NMR		Version 3.5
$$ ##JCAMPDX= 5.01
$$ ##ORIGIN= Bruker BioSpin GmbH
$$ ##OWNER= she
$$ F:/spectra/data/she/nmr/H-F/1/audita.txt
$$ ##AUDIT TRAIL=  $$ (NUMBER, WHEN, WHO, WHERE, WHAT)
(   1,<2019-04-09 14:54:28.26 +0400>,<she>,<DPX200>,
      <created by zg, POWCHK disabled, PULCHK disabled
       configuration hash MD5:
       00 E9 B6 7A A2 85 ED C7 34 08 36 98 17 FE 4E 26
       data hash MD5: 16K
       4C AD 6F 70 23 C9 4C 43 50 AE 6C F3 2C 10 8F 11>)
$$ ##END=
$$ 
$$ hash MD5
$$ 87 D1 2E EA 54 5F A1 6A 5B A2 A4 74 02 53 1E 38
##$RELAX= 
##$RELAX= 
##$RELAX= 
##$RELAX= 
##$RELAX= 
##$RELAX= 
$$ Bruker specific parameters
$$ --------------------------
##$DU= <F:/spectra>
##$EXPNO= 1
##$NAME= <H-F>
##$PROCNO= 1
##$TYPE= <nmr>
##$USER= <she>
##$AMP= (0..31)
100 100 100 100 100 100 100 100 100 100 100 100 100 100 100 100 100 100 
100 100 100 100 100 100 100 100 100 100 100 100 100 100 
##$AQSEQ= 0
##$AQ_mod= 1
##$AUNM= <au_zg>
##$AUTOPOS= <>
##$BF1= 200.13
##$BF2= 200.13
##$BF3= 200.13
##$BF4= 200.13
##$BF5= 200.13
##$BF6= 200.13
##$BF7= 200.13
##$BF8= 200.13
##$BYTORDA= 1
##$CFDGTYP= 0
##$CFRGTYP= 5
##$CHEMSTR= <none>
##$CNST= (0..31)
1 1 145 1 1 1 1 1 1 1 1 1 1 1 1 1 1 1 1 1 1 1 1 1 1 1 1 1 1 1 1 1 
##$CPDPRG= <>
##$CPDPRG1= <>
##$CPDPRG2= <>
##$CPDPRG3= <>
##$CPDPRG4= <mlev>
##$CPDPRG5= <mlev>
##$CPDPRG6= <mlev>
##$CPDPRG7= <mlev>
##$CPDPRG8= <mlev>
##$CPDPRGB= <>
##$CPDPRGT= <>
##$D= (0..31)
0 1.2 0 0 0 0 0 0 0 0 0 0.03 0 0 0 0 0 0 0 0 0 0 0 0 0 0 0 0 0 0 0 0 
##$DATE= 1554807267
##$DBL= (0..7)
120 120 120 120 120 120 120 120 
##$DBP= (0..7)
150 150 150 150 150 150 150 150 
##$DBP07= 0
##$DBPNAM0= <>
##$DBPNAM1= <>
##$DBPNAM2= <>
##$DBPNAM3= <>
##$DBPNAM4= <>
##$DBPNAM5= <>
##$DBPNAM6= <>
##$DBPNAM7= <>
##$DBPOAL= (0..7)
0.5 0.5 0.5 0.5 0.5 0.5 0.5 0.5 
##$DBPOFFS= (0..7)
0 0 0 0 0 0 0 0 
##$DE= 6
##$DECBNUC= <off>
##$DECIM= 24
##$DECNUC= <off>
##$DECSTAT= 4
##$DIGMOD= 1
##$DIGTYP= 9
##$DL= (0..7)
0 120 120 120 120 120 120 120 
##$DP= (0..7)
150 150 150 150 150 150 150 150 
##$DP07= 0
##$DPNAME0= <>
##$DPNAME1= <>
##$DPNAME2= <>
##$DPNAME3= <>
##$DPNAME4= <>
##$DPNAME5= <>
##$DPNAME6= <>
##$DPNAME7= <>
##$DPOAL= (0..7)
0.5 0.5 0.5 0.5 0.5 0.5 0.5 0.5 
##$DPOFFS= (0..7)
0 0 0 0 0 0 0 0 
##$DQDMODE= 0
##$DR= 18
##$DS= 0
##$DSLIST= <SSSSSSSSSSSSSSS>
##$DSPFIRM= 0
$$ [...]
##$SUBNAM2= <"">
##$SUBNAM3= <"">
##$SUBNAM4= <"">
##$SUBNAM5= <"">
##$SUBNAM6= <"">
##$SUBNAM7= <"">
##$SUBNAM8= <"">
##$SUBNAM9= <"">
##$SW= 24.9337058887773
##$SWIBOX= (0..15)
0 0 2 0 0 0 0 0 0 0 0 0 0 0 0 0 
##$SW_h= 4990.01996007984
##$TD= 16384
##$TD0= 1
##$TE= 0
##$TE2= 300
##$TE3= 300
##$TEG= 300
##$TL= (0..7)
0 120 120 120 120 120 120 120 
##$TP= (0..7)
150 150 150 150 150 150 150 150 
##$TP07= 0
##$TPNAME0= <>
##$TPNAME1= <>
##$TPNAME2= <>
##$TPNAME3= <>
##$TPNAME4= <>
##$TPNAME5= <>
##$TPNAME6= <>
##$TPNAME7= <>
##$TPOAL= (0..7)
0.5 0.5 0.5 0.5 0.5 0.5 0.5 0.5 
##$TPOFFS= (0..7)
0 0 0 0 0 0 0 0 
##$TUNHIN= 0
##$TUNHOUT= 0
##$TUNXOUT= 0
##$USERA1= <user>
##$USERA2= <user>
##$USERA3= <user>
##$USERA4= <user>
##$USERA5= <user>
##$V9= 5
##$VALIST= <valist>
##$VCLIST= <CCCCCCCCCCCCCCC>
##$VD= 0
##$VDLIST= <DDDDDDDDDDDDDDD>
##$VPLIST= <PPPPPPPPPPPPPPP>
##$VTLIST= <TTTTTTTTTTTTTTT>
##$WBST= 1024
##$WBSW= 4
##$XGAIN= (0..3)
0 0 0 0 
##$XL= 0
##$YL= 0
##$YMAX_a= 49350
##$YMIN_a= -62349
##$ZGOPTNS= <>
##$ZL1= 120
##$ZL2= 120
##$ZL3= 120
##$ZL4= 120
##$ABSF1= 10
##$ABSF2= 0
##$ABSG= 5
##$ABSL= 3
##$ALPHA= 0
##$AQORDER= 0
##$ASSFAC= 0
##$ASSFACI= 0
##$ASSFACX= 0
##$ASSWID= 0
##$AUNMP= <proc_1d>
##$AZFE= 0.1
##$AZFW= 0.1
##$BCFW= 1
##$BC_mod= 2
##$BYTORDP= 1
##$COROFFS= 0
##$CY= 11.3945322036743
##$DATMOD= 1
##$DC= 2
##$DFILT= <>
##$DTYPP= 0
##$F1P= 18.9103706918063
##$F2P= -1.10871071338519
##$FCOR= 0.5
##$FTSIZE= 0
##$FT_mod= 4
##$GAMMA= 1
##$GB= 0.15
##$INTBC= 1
##$INTSCL= 1
##$ISEN= 128
##$LB= 0.24
##$LEV0= 0
##$LPBIN= 0
##$MAXI= 10000
##$MC2= 0
##$MEAN= 0
##$ME_mod= 0
##$MI= 1.114404
##$NCOEF= 0
##$NC_proc= 0
##$NLEV= 6
##$NOISF1= 3.799351
##$NOISF2= 2.8
##$NSP= 1
##$NTH_PI= 0
##$NZP= 0
##$OFFSET= 15.70392
##$PC= 1
##$PHC0= -8929.564
##$PHC1= 13.20026
##$PH_mod= 1
##$PKNL= yes
##$PPARMOD= 0
##$PSCAL= 0
##$PSIGN= 0
##$REVERSE= no
##$SF= 200.130013532006
##$SI= 16384
##$SIGF1= 3
##$SIGF2= 2
##$SINO= 400
##$SIOLD= 16384
##$SREGLST= <1H.CDCl3>
##$SSB= 0
##$STSI= 0
##$STSR= 0
##$SW_p= 3612.71676300578
##$SYMM= 0
##$S_DEV= 0
##$TDeff= 0
##$TDoff= 0
##$TI= <>
##$TILT= no
##$TM1= 0
##$TM2= 0
##$TOPLEV= 0
##$USERP1= <user>
##$USERP2= <user>
##$USERP3= <user>
##$USERP4= <user>
##$USERP5= <user>
##$WDW= 1
##$XDIM= 8192
##$YMAX_p= 0
##$YMIN_p= 0
$$ End of Bruker specific parameters
$$ ---------------------------------
##NTUPLES= NMR FID
##VAR_NAME=  TIME,          FID/REAL,        FID/IMAG
##SYMBOL=    X,             R,               I
##VAR_TYPE=  INDEPENDENT,   DEPENDENT,       DEPENDENT
##VAR_FORM=  AFFN,          ASDF,            ASDF
##VAR_DIM=   8192,          8192,            8192
##UNITS=     SECONDS,       ARBITRARY UNITS, ARBITRARY UNITS
##FACTOR=    0.0002004,     1,               1
##FIRST=     0,             0,               0
##LAST=      1.6414764,     0,               0
##MIN=       0,             -62349,          0
##MAX=       1.6414764,     49350,           0
$$ Real data points
##PAGE= N=1
##DATA TABLE= (X++(R..R)), XYDATA
$$ [...]
1090F33j003oO38m17N4P29n13p91O12M53n94J49N96o27m55P45j32m14R31q4j377
1111h73N64R30q39J63P79j072k99J116m69m09J122l84j199O68O31n15K04K75p40
1130c47j37P59k1n14M25K60q95n9J017k80m91P03m30q48J197L14j272O17P05j293
1150e90J52J078p59j01Q53q56m80J073j6o20L30J20l81j5K72J59j80mJ41n79m1
1171d44J107l50r28Q81Oj045R93M41j226O79N09j488N29J317j100k61Q58q35j18
1190d75J093n26m63O90k49n18L85L02Kk73j91K54j72M2O72o56m98J159n09j006
1210i37J545L8j545J198K41j685J415R03k142O96J343j827K44J559j352r6J213
1227H11j246k27J387n61m36N09m82J02M24n23M31J79q49N11J49p81J112J90j607
$$ plain form
1090 633 -370 -376 262 -155 -101 628 115 -676 -64 389 -205 -56 540 -87 -542 203 71 -343 588 504 -873
1111 -873 -309 621 -218 -55 724 -348 -647 469 0 -409 713 329 -870 -202 429 -86 118 393 -347
1130 -347 -484 275 254 -260 165 425 -470 -529 488 208 -283 420 -10 -858 339 653 -619 -2 703 -590
1150 -590 -438 640 -119 -220 633 -223 -703 370 354 -266 64 184 -197 -212 60 219 39 35 176 -403 -444
1171 -444 663 313 -615 266 272 -773 220 661 -565 114 623 -865 -336 981 -119 -380 478 -357 -475
1190 -475 618 92 -371 319 70 -448 -63 239 241 -32 -223 31 -141 -99 573 -83 -581 578 69 -937
1210 -937 608 646 -899 299 540 -1145 270 1173 -969 -273 1070 -757 -513 1046 -306 -402 811
1227 811 -435 -662 725 164 -272 237 -245 -143 281 -242 189 368 -481 30 179 -602 510 700 -907
1246i07Q48P05j374Q85O82j618P29P87j629P67J156j487K20P25j190P26P94j377
1264e58N32N69j258P87M57j223J170J48j853J414O70j844J443M47k371J675J042
1281A247k691J504J580k948Q47J859k536Q12K090k712K8K273j877j73J908j510
1297b99l26J409j245k6J354r65j01M44r02Q45M22j294R98K20j604J388L80j811
1315a113J749L48k643J781J143k568J607J015k959J592J559k993J387J863l068
1330a300Q16J894k664J080J967l007N66K164k555N70K088k553M35J937k608M95
1346f75K401k368nJ944k268K90K269k214j13K158k007l41K045j426j70J608j681
1363e53k49J673j075n2R77j276L53Q17j388R24Q09j844R35O70k059J686J119k977
$$ plain form
1246 -907 -59 646 -728 157 839 -779 -50 737 -892 -125 1031 -456 -236 489 -701 25 819 -558
1264 -558 -26 543 -715 72 529 -694 476 624 -1229 185 855 -989 454 901 -1470 205 1247
1281 1247 -1444 60 1640 -1308 -461 1398 -1138 -326 1764 -948 -920 1353 -524 -697 1211 -299
1297 -299 -625 784 -461 -487 867 -98 -199 245 -657 188 610 -684 314 534 -1070 318 698 -1113
1315 -1113 636 984 -1659 122 1265 -1303 304 1319 -1640 -48 1511 -1482 -95 1768 -1300
1330 -1300 -484 1410 -1254 -174 1793 -1214 -648 1516 -1039 -469 1619 -934 -499 1438 -1170 -675
1346 -675 1726 -642 -647 1297 -971 -681 1588 -626 -739 1419 -588 -929 1116 -310 -480 1128 -553
1363 -553 -802 871 -204 -256 721 -555 -202 615 -773 151 960 -884 51 721 -1338 348 1467 -1510
1381a510J347J715l103J245K251l335Q15K638l531L48L450l081n43L250k691p18
1397a453L457k298j281L306j752j586K917j125j434K457j121j477K348n57j348
1412i47J614n75q64J373o50m43J276r46l85J060r92L58J274j798N4J579j712K37
1430d87J875j934o2J852k164k0K553j857n53K041j960l32K522j858n32K551k043
1447d08r64K687j621q05K882j869j548L030j247j777K910p35j962K436n42k096
1463a629K324J53j985J536K94j562J096J44j119J039K13q80N48j65l83O47m31
1480a60l7R26q43k68P26r75L93J375j449j82J454j651k79K136j258n30K023j763
1498c62j244K648p04j442K275o51j982J879Jj643J898M37k005P69N31j225R00
$$ plain form
1381 -1510 -163 1552 -1551 -306 1945 -1390 -575 2063 -1468 -1120 2330 -751 -1294 1956 -735 -1453
1397 -1453 2004 -294 -1575 1731 -21 -1607 1310 185 -1249 1208 87 -1390 958 401 -947
1412 -947 667 92 -772 601 -49 -492 784 -162 -547 513 -479 -121 1153 -645 -591 988 -724 -487
1430 -487 1388 -546 -608 1244 -920 -940 1613 -244 -797 1244 -716 -1048 1474 -384 -916 1635 -408
1447 -408 -1372 1315 -306 -1111 1771 -98 -1646 1384 137 -1640 1270 535 -1427 1009 467 -1629
1463 -1629 695 848 -1137 399 693 -869 227 371 -748 291 504 -376 172 7 -376 271 -160
1480 -160 -197 729 -114 -382 344 -631 -238 1137 -312 -494 960 -691 -970 1166 -92 -622 1401 -362
1498 -362 -1606 1042 338 -1104 1171 520 -1462 417 418 -1225 673 1110 -895 -126 405 -820 80
1515H0O50j024M13K33r81L95M81k59M19k34o48N26j5l78O43m5m12M55l75n24Q36
1536B36j3m84O11j65n61N25k75m12J004J0p39L97k24n20Q42M5n05P29k68r76O50
1557i3K40l90Q08j43j084O30K38q12P84M86r07K65J87r70O02Q97q23k7N52p82
1577c42j22P14k61pN32n21n16M38J98p2J00m4j09q6k4J22p6J47L01m80k69O51
1599B74j95m94O58jn78O02l5q94O81N40q94K61N86q13J7O21n60L5P52n56m34N48
1621A21p1k35L34n1j43J58j92j40K05J21R5j33l02J75J47k62K29K08l54M4Q7l68
1643c27L38M45n15j58L25k21K7L27k82m6L10l18j72M28J0j77K2j40M7K15q7p0
1665a9M6q7R3k4k18L61J45n25R4L11l53K07L15n87M5N85n42k16P52k41m41M52
$$ plain form
1515 80 730 -294 119 352 -629 -234 247 -12 407 173 -475 51 36 -342 301 256 -156 299 -76 -600 236
1536 236 223 -261 350 185 -376 149 -126 -538 466 476 -263 134 -90 -610 232 277 -228 501 233 -743 -93
1557 -93 147 -243 565 422 -662 -32 206 -606 178 664 -243 22 209 -761 -159 738 -85 -112 440 -342
1577 -342 -464 250 -11 -18 514 -7 -523 -85 113 41 141 97 -12 -98 -122 0 -76 71 372 -108 -377 274
1599 274 79 -415 243 242 -336 266 231 -663 18 558 -336 -75 511 -302 -285 336 -224 -189 563 7 -427 121
1621 121 50 -185 149 98 -45 113 -79 -219 -14 107 202 69 -233 -58 89 -173 56 264 -90 -46 41 -327
1643 -327 11 456 -59 -217 108 -113 -86 241 -41 -87 223 -95 -267 161 171 -6 16 -124 -77 138 51 -19
1665 -19 27 -60 33 9 -209 152 297 -228 -134 177 -176 31 346 -241 -196 389 -153 -369 383 142 -299 153
1687A53j64l22N86K8o03K72K89l63L1K31j33l7M9r2mJ69Q0k52j77K95J82l23Q7
1710a8K02l65P0L14l34O0N11n31l68O33l9k87M30k16m40N06L4m60M58J94n44P
1732a83J59r1K77P7l49j3J13m2R7j7M9J10l45j47M27Rj35J96l31k10N78r4l91
1755b56M58Kn59K95K21l12L61O2o46J86M45k80J1J94k73l4J76j05Q7J96j57k14
1777a42j02K18L28k19j95K03k26q9M82j76k28M91l63n85P57K45n97L26K1o58N23
1798A4M16o38J96L97o52n6M89j00L2J19m39n3L37J8M3n6j71J07j27j24N02L8m22
1821a30J15j29k14O68O7o27K81O4n04M30L02l92K59n8o85M34N23l90P8M9n19K60
1843a18L40l10K22J44n08L7J66k5M02j13n67K52Q9k18N20o8n66M57q3o28P84L57
$$ plain form
1687 153 -11 -333 253 281 -322 -50 239 -124 -93 138 5 -32 17 -75 -79 90 170 -82 -259 36 218 -105 -18
1710 -18 184 -181 -111 203 -131 -71 440 -91 -459 174 135 -152 278 62 -378 128 162 -298 160 354 -190 -183
1732 -183 -24 -115 162 239 -110 -123 -10 -52 45 28 77 187 -158 -305 122 131 -4 192 -139 -349 229 135 -256
1755 -256 202 204 -355 -60 161 -151 210 272 -374 -188 257 -23 -12 182 -91 -125 51 -54 33 229 72 -142
1777 -142 -244 -26 302 83 -112 91 -135 -224 258 82 -146 345 -18 -603 154 399 -198 128 149 -509 14
1798 14 430 -208 -12 385 -267 -323 166 66 98 217 -222 -275 62 80 123 67 -104 3 -124 -248 254 292 -130
1821 -130 -15 -144 -358 310 377 -250 31 95 -409 21 323 -69 190 132 -553 -119 404 14 92 141 -378 -118
1843 -118 222 -88 134 278 -230 -193 -27 -52 350 237 -330 -78 11 -207 313 245 -321 136 53 -575 209 566
1865E66q53K33J84o63N98N13q06J28L52o08J47N24k74J13m7n70L34L49k21K80
1885B79k02n68N68P5n47P83Q5j004M40K61o40Q41K52j171L85M79p72N57N05r35
1905c29K79L09q95N94P61q65M3K82p40N18O11p50J85L15p94K79M90m10M32j8r54
1926f57N76L96o33P01K7j154P85L65j118R78O16j550M05P20j137P67Q87j510J56
1945c80R17j070L45R57r92R0N15j040M85R24r29J65L66j082O35Q08j117M70O08
1964F75j384L85R00r46N43O04j509L43R99j015M85P10j368L08P92j155O36R83
1982I86j411Q8P30j059O69R78j422J85P68j215N58R93j216L98N66j589P45J237
2000I89j396L79Q00j748O00J410j582L60J316j848rJ576j201J15J339j620k87
$$ plain form
1865 566 -287 -54 130 -533 65 578 -228 -100 252 -356 -209 315 41 154 107 -463 -129 220 -1 279
1885 279 77 -491 77 152 -395 388 473 -531 -91 170 -470 371 623 -548 -163 316 -456 101 606 -329
1905 -329 -50 259 -636 -42 719 -146 -103 179 -561 -43 568 -182 3 318 -476 -197 293 -117 315 297 -657
1926 -657 -81 315 -318 383 410 -744 41 406 -712 266 882 -668 -263 457 -680 87 974 -536 -380
1945 -380 537 -533 -188 769 -223 -133 382 -658 -173 751 -178 -13 353 -729 -94 714 -403 67 675
1964 675 -709 -324 576 -370 173 777 -732 -389 610 -405 80 790 -578 -270 522 -633 3 986
1982 986 -425 -337 393 -666 3 981 -441 -256 512 -703 -145 848 -368 30 596 -993 -248 989
2000 989 -407 -28 772 -976 -376 1034 -548 -188 1128 -720 -729 847 -354 -239 1100 -520 -807
2017h07J537r30j25J203j115k81R98r13J87J156j078k17P58r43M69J010j258J22
2035b27Q07j294M51J154j261L40P87j727N17J533j424K10J030j787L04J621j481
2052d47K25J440j886j86J655j178J91J449j810l32J635j138L6J535j506l50J358
2069F91j302Q6J784j368n37J277j188oJ661j212m29J327j166l12J477q38k51J035
2087G29j193j58J337q29r7Q71j163J30J075j131L01J071j514R3J154j254N58J216
2105A196j922P4J562j533L08J683j891j95J656j703J17K191j662p36J645j409
2121f19j97K162j283q37J591j192o41J877o48n98J140j141n17J556n68l28R58
2138G15j056k20J097q96J32J134j203j88J023j065L30J214j477jJ262j335J26
$$ plain form
2017 -807 730 -200 -325 878 -237 -518 480 -433 -246 910 -168 -385 373 -570 -101 909 -349 -227
2035 -227 580 -714 -263 891 -370 -30 757 -970 -453 1080 -344 -134 896 -891 -587 1034 -447
2052 -447 -222 1218 -668 -854 801 -377 -186 1263 -547 -879 756 -382 -346 1189 -317 -667 691
2069 691 -611 -525 1259 -109 -646 631 -557 -563 1098 -114 -543 784 -382 -694 783 -55 -306 729
2087 729 -464 -622 715 -114 -211 660 -503 -373 702 -429 -128 943 -571 -478 676 -578 -20 1196
2105 1196 -726 -652 910 -623 -315 1368 -523 -718 938 -765 -648 1543 -119 -855 790 -619
2121 -619 -816 1346 63 -774 817 -375 -1016 861 213 -385 755 -386 -903 653 85 -243 715
2138 715 -341 -561 536 -360 -228 906 -297 -485 538 -527 -197 1017 -460 -461 801 -534 -408
2155d08J380j360J0J257j541J16J693j441k21J355j453J4J771j446l15J576j492
2172e05l53J872j081m13J492j485n84J963p80o65J425j101p31J571o35n05J444
2189I29q98r00J205m18k58J201q57o57J043n92j96J094p06l04Q18r73j0J308q86
2208e7k78R52j119PJ370j119j88J344j279l81J541r41l14J454j268o52J715p48
2226C9o40J444q80p81J438o75n85J529p23r85J239m48n15J357o85q77J193m57
2244a2o59J296m01p52R76n64o11J327k79q07Q36m24n34J101l37n76R52n46o77
2263f91J038k36l89Q92p06o17J130l12m88R78n94o28J049m91m51J240n40q75J019
2282C28l40n09J215m90r05J094k80p75J122j26q35Q41k67p57J083Nq56O77j27
$$ plain form
2155 -408 972 -388 -378 879 -662 -546 1147 -294 -515 840 -613 -599 1172 -274 -589 987 -505
2172 -505 -858 1014 -67 -480 1012 -473 -1057 906 126 -539 886 -215 -946 625 -10 -515 929
2189 929 31 -869 336 -82 -340 861 4 -653 390 -202 -398 696 -10 -314 504 -469 -479 829 -57
2208 -57 -335 617 -502 -495 875 -244 -432 912 -367 -748 793 -148 -462 992 -276 -928 787 39
2226 39 -601 843 -37 -818 620 -55 -640 889 166 -819 420 -28 -543 814 129 -748 445 -12
2244 -12 -671 625 224 -528 448 -116 -727 600 321 -486 350 -74 -608 493 156 -420 532 -14 -691
2263 -691 347 111 -278 614 -92 -709 421 109 -379 599 5 -623 426 -65 -516 724 184 -691 328
2282 328 -12 -521 694 204 -701 393 113 -662 460 334 -501 340 73 -684 399 404 -452 225 98
2301I8o44Q36p6o10P63j97p54P16L1m51P42l04p49P65J5n56P53j00o92N37j16
2322Gm75Q92j4p91M06k8l99P60k4o53M90q8n79O44J83n33L91j46n48P00J24o08
2344b89M03j1m52N53Nn65N08N3n91M88J66n27L73J2n28N06K31n75K12J84l95K76
2366C7J09l76L40J53m81J62J19k72L74N8m14K74j5m88M23K85l06J99j58n47M61
2387f3M08l75J61M4n35K21K88k60L11J16n94Q0L14j95K05P6m39J99K43l53P3K33
2409A58k62J36J67l43J13J52l16J19K97j83J4n9k79K63K67k76L8O7k36J54R2k50
2431a67K34J38l30P0J33k30J49J10k25K21J37m46j4K76p4J94N3m45N9K15j87J72
2453D3K39k91r3O5j53K26K72k92j43J26m0P0O7j79R4J06j75K9P8j24J04K6j55
$$ plain form
2301 98 -546 290 214 -396 367 170 -584 132 163 -288 454 150 -599 166 181 -375 378 278 -414 123 7
2322 7 -468 424 410 -381 25 -3 -402 358 334 -319 171 83 -496 148 331 -202 189 43 -505 195 319 -289
2344 -289 114 103 -349 204 209 -356 152 205 -386 102 268 -259 114 126 -402 104 335 -240 -28 156 -239 37
2366 37 146 -230 110 263 -218 -56 63 -209 165 223 -191 83 68 -420 3 288 -18 181 23 -524 -63
2387 -63 345 -30 131 175 -360 -139 149 -111 200 316 -278 -198 116 -79 126 202 -237 -38 205 -148 -75 158
2409 158 -104 32 199 -144 -31 121 -195 -76 221 38 52 -7 -286 -23 244 -32 6 73 -163 -9 83 -167
2431 -167 67 205 -125 -55 78 -152 -3 107 -118 103 240 -206 -220 56 -18 176 229 -216 -157 58 -129 43
2453 43 282 -9 -102 -37 -190 36 308 16 -127 -1 -41 29 96 -83 11 117 -58 -29 49 -75 29 55 -100
2476a00K01M6l09N5J64q5J50ll12J32J73j92N6J40j38L0J1j69J43J43j90K3Q4
2499E3j00P7l8j33K16J01k57M1M0j11J98K2k35J26R9k31N8J99j12J4j0j53J19
2522a7J38r1q2J1O2K9j09J6J46j09m8R8j29O3K28k54j50L50j01k28K77m5k09K78
2546A24r2k85L43J20l54Q2J23j50J36R3k60O3J45j34jJ18k4n9n9K6J10ml7m8j45
2571a69J99J76k91k4K41k23l2L32k23j12L17k42k21M77l8l69K19N0j97K73n2k91
2593b00K13J10j63O7l0p3J53r3o3K57j56k34K34J1o4K74k43l46L95J31k65J58
2615G3j9k66K18J13j90J37L2k72P7J58L1M2k04j55K90J6n1P3k29k7L16j54j31
2638a22L47k41k69M19n6k09L98k69m22O17R9n42L14O6m60M53K16o35K20L43m91
$$ plain form
2476 -100 101 147 -162 -107 57 -28 122 119 -193 -61 112 -80 -24 116 -22 8 19 -150 -7 136 -54 -31 53
2499 53 -47 30 -8 -141 75 176 -81 -40 0 -111 87 109 -126 0 99 -132 -74 125 13 27 17 -136 -17
2522 -17 121 30 -52 -41 21 50 -59 -43 103 -6 -54 44 -85 -22 206 -48 -198 152 51 -177 100 55 -154 124
2546 124 32 -253 90 210 -144 -62 61 -89 47 140 -120 -57 88 -46 -47 71 47 -12 -71 -45 65 61 24 -24 -169
2571 -169 30 206 -85 -109 132 -91 -123 209 -14 -126 191 -51 -272 205 167 -202 17 67 -130 143 91 -200
2593 -200 13 123 -40 27 -3 -76 77 -16 -79 178 22 -212 22 33 -31 243 0 -346 49 180 -85 73
2615 73 54 -212 6 119 -71 66 98 -174 -97 61 92 134 -70 -225 65 81 30 103 -126 -153 163 9 -122
2638 -122 225 -16 -285 134 78 -131 267 -2 -424 193 292 -250 64 130 -330 123 339 -296 -76 267 -224
2659b24J25M31l82j11K30j73O7K71k07k03N9J25J66j18j74J36j02q9L78r5l13
2680b03L15j11l58N66J41o20J84K01l44L36K12n76J48L22l50J01K66l46K9J98
2700A11k39J56K12l61l2K51j20J14L1l54J55K75k42M3J17k71R2K25k41J07J74
2721B03m05J4L60j29j8J15l83M4M50j63j85J70j36j03K54j6o9R1j67j32K17R1
2743A03k3n9k01R1K24j54nJ37k32L7K44k64KL63k94k28M35p8k88L22p7k74L72
2766A53J0m68K77K45k82Q7Q2k81J39J78j95J03O8k59N5R2k5K08p2l63J55J86j35
2789d2J84j3l66J88J52k72K55J56m13N9J66j99K73J47n09R5K95k89J22K53l46
2810a04K4K38l55R9L95k83j17J69j99J04K19k61N8J68l08R8J80k46K30J82n86
$$ plain form
2659 -224 -99 332 -50 -161 69 -104 -37 234 27 -176 -117 8 174 56 -118 18 -84 -173 205 110 -203
2680 -203 112 1 -357 209 350 -270 -86 115 -229 107 319 -257 -109 213 -137 -36 230 -116 -87 111
2700 111 -128 28 240 -121 -153 98 -22 92 123 -231 -76 199 -43 0 117 -154 -62 163 -78 29 203
2721 203 -202 -188 172 43 25 140 -243 -199 251 88 -97 73 -63 -166 88 72 3 94 -73 -205 12 103
2743 103 80 21 -180 -89 135 -19 -24 113 -119 -82 162 -102 -100 263 -31 -259 176 98 -190 132 55 -219 153
2766 153 163 -305 -28 217 -65 22 104 -177 -38 140 -55 48 116 -143 -88 4 -21 187 115 -248 -93 93 -42
2789 -42 142 129 -237 -49 103 -169 86 242 -171 -112 54 -145 128 275 -234 -139 156 -133 -11 242 -104
2810 -104 -80 158 -197 -98 297 14 -103 66 -133 -29 190 -71 -13 155 -153 -55 125 -121 109 291 -295
2831b95J31M58l97N6L81n11k6M79m16k8N45l47l25L86j14o0L63k87k12L40j78
2852e7o1L17k01p6K27l47%M74k05j75K41k78k9L80k31n6L28l34j77L75j40L9L29
2875C43m92j78N12j97r1M41l54k74M41k03j38N65k56m19L36p4p1M11k79k96M39
2896A66j63k04M72k24l05M62k20k91O23j53n26M47K8l31M11n1m36L67Q3l47K36
2917D4O0j94K28j45k23L30o1j55L28j49k59K74k18q8O11j89m24K55j96p2O44k10
2939A91m15L87k79l21O98K2m08L26k71m22P17J14n36K85%l95M35N0m20L35L7l39
2961b09L30K0l39K35n7k16N28n4n19K43M9j72M00o2m30K87L1k80K98M2k52K33
2983A06r5k14L47r9l08L83J3j90K56l09l24N68J19k93K42k47l87M73P7j63M14
$$ plain form
2831 -295 -164 294 -103 -47 334 -177 -203 276 -140 -168 377 30 -295 91 -23 -83 280 -7 -219 121 -57
2852 -57 -118 199 -2 -78 149 -198 -198 276 71 -104 137 -141 -170 210 -21 -77 251 -83 -260 115 -25 14 343
2875 343 -149 -327 185 -12 -103 338 -16 -290 151 -52 -190 375 119 -300 36 -38 -109 302 23 -273 166
2896 166 3 -201 271 47 -258 204 -16 -307 316 163 -363 84 112 -219 192 141 -295 72 155 -192 44
2917 44 104 -90 138 -7 -230 100 39 -116 212 63 -196 78 -140 -228 383 194 -230 25 -171 -243 401 191
2939 191 -224 163 -116 -437 261 283 -125 201 -70 -492 225 339 -197 88 88 -307 128 178 -242 93 130 -209
2961 -209 121 141 -198 37 -20 -236 292 238 -281 -38 11 -161 239 177 -253 34 65 -215 83 125 -127 106
2983 106 11 -203 144 45 -263 120 133 -57 199 -110 -434 134 253 -40 202 -45 -432 41 118 -45 369
3004C69k67n81M25J48j74M49k34n78M85J35m02L72P4m65L21P8l85K81J01l71K45
3025B6J84k67R7r0k18M12J17l46J20p7j98L54L2k82K50l8l15K67Q5k02J94q6k18
3048a99L85q3l52K62K7j50M06j90m76L80R7l13M18O3n16J88O5k70M39J64n23P1
3070a07J01j67L12M2l39K09M1l04K57J00k89K31J1l27L11Q4l82K07J60k29J68
3091I0k0l11K84J37l11J53M0k47K56K6k74K75L7l59K34J26k45J54Jk62L00R4l20
3114a42J51L3j90K70k2l14L17J3l78L23J12l69K80M8m26L35K30m64J10K63k82
3135a02R8J39k68J37J58k42M2R8j39J47j9j87K16kk42K27J7j80K14j03k80M00
3157A29O2l75K32J9l10L39O3m05L29R8m51K55K18l58J75J38l61J92K27l50L9J98
$$ plain form
3004 369 102 -479 -54 94 -80 369 135 -443 42 177 -225 147 221 -244 77 155 -230 51 152 -219 26
3025 26 210 -57 40 -50 -268 144 261 -85 35 -42 -240 114 146 -136 114 76 -239 28 113 -89 105 19 -199
3048 -199 186 103 -249 13 40 -110 296 106 -370 10 107 -206 212 275 -241 -53 12 -258 181 345 -178 -107
3070 -107 -6 -173 139 181 -158 51 92 -212 45 145 -144 87 98 -229 82 166 -216 -9 151 -78 90
3091 90 70 -241 43 180 -131 22 62 -185 71 97 -177 98 135 -224 10 136 -109 45 46 -216 84 178 -142
3114 -142 9 42 -148 122 100 -214 103 116 -262 61 173 -196 84 132 -294 41 271 -193 -83 180 -102
3135 -102 -4 135 -133 4 162 -80 -38 60 -79 68 49 -138 78 76 -166 61 78 -102 112 9 -271 129
3157 129 191 -184 48 67 -243 96 159 -246 83 181 -270 -15 203 -155 20 158 -203 -11 216 -134 -95 103
3179A03j46J05Rk34J62P1j83K42l4k63K50o3k58M36L8m99K46J46l23L07J24m84
3201b48J94K60l54J12K15k69N7J23k03J62R1k84J18J02j42J70o4k63K85Q1k82
3222a39K19ok98L31Pl32L51M4n02L58J98m36K82J08n29L19M04n44M0L36l70O4
3244i5L48l19m1K36k25MJ89o1K8j02j61L17L9l02K34j2l39M08O0n10L58K21n67
3267b92K55L45m97J24K82m36J69L77m78l3L76k81N9K32l63M9K89k74L7K22k46
3288h4J2J54k14J86J39l51R0J44k28K57R4m91K82K35m87K34L48n36J17L81n36
3309b54J07N35m86j60M94k68j14L31k45n5K98k15p0J91j71J04J01k97J92J89m20
3330b13J66K86l79J17K43m65J41M42m43n9L66l24LL37k95l7L36l32p1L60j57q9
$$ plain form
3179 103 -43 62 71 -163 -1 70 -113 129 95 -168 82 19 -239 197 235 -264 -18 128 -195 112 236 -248
3201 -248 -54 206 -148 -36 179 -90 -33 90 -113 49 140 -144 -26 76 -66 104 40 -223 62 143 -139
3222 -139 80 74 -224 107 114 -218 133 177 -325 33 231 -205 77 185 -344 -25 379 -165 -125 211 -159 -95
3244 -95 253 -66 -107 129 -96 -92 97 36 64 -38 -199 118 157 -145 89 77 -262 146 206 -304 54 275 -292
3267 -292 -37 308 -189 -65 217 -219 -50 327 -151 -184 192 -89 -30 202 -161 -112 177 -97 -60 162 -84
3288 -84 -72 82 -132 54 193 -158 -68 76 -152 105 199 -292 -10 225 -262 -28 320 -216 -99 282 -254
3309 -254 -147 388 -98 -258 236 -32 -146 185 -60 -115 183 -32 -102 89 -82 22 123 -174 18 207 -213
3330 -213 -47 239 -140 -23 220 -245 -104 338 -105 -164 202 -122 -119 218 -77 -114 222 -110 -181 179 22 -67
3352f7J96k59J6L03j91q9J84j75L0J50k03J25J71l56O7K43k62J39K06m47J10L99
3374B90m03m7M24l04j41L70k36j19L83j54k48K49jj22R3m4MJ03j32oQ2r4J18N1
3398A16k94J47K05l05O9K49k65K2J84k52N7L05k65j26K35j20kJ81j95l9K12j56
3420c7o8K10p1o2L0r8O3J44r0p4O0n8R8J5j60J35P3k12O2J39j79R7J08k65Q5K42
3446A87k28p4K16r4n6J09j07QJ26o6l7J1l2J02m0j41J83N5k68J22J32k08J66Q2
3470A48l41J08K77k53k2K16j83m2J76j49M3J68j94n2J42o2M6N7k00J00J22j85
3492h0N4J16j51R6K8k27J75J36k61R1J32k09J42O6k87K01J85l39N7K10k50J17
3514BJ85l32P5K43k71M1J88j85L7J03k29J52J81l00N0J32j97J81J38l67J29K13
$$ plain form
3352 -67 129 -130 -114 189 -2 -91 93 -82 -52 98 -105 20 191 -165 -98 145 -117 22 228 -219 -109 290
3374 290 -113 -160 264 -40 -181 189 -47 -166 217 63 -185 64 63 -59 34 -10 -6 97 -35 -41 41 -53 65 116
3398 116 -178 -31 174 -131 -62 187 -78 -56 128 -124 -67 238 -27 -153 82 -38 -40 141 -54 -93 119 -37
3420 -37 -105 105 34 -28 2 -96 -33 111 21 -53 7 -51 47 62 -98 37 110 -102 -40 99 -80 17 125 -140 -55 187
3446 187 -41 -115 101 7 -49 60 -47 -39 87 21 -16 -5 -37 65 25 -116 67 122 -146 -24 108 -100 66 148
3470 148 -193 -85 192 -61 -83 133 -50 -92 84 -65 -22 146 -48 -100 42 -20 26 83 -117 -17 105 -80
3492 -80 -26 90 -61 35 63 -164 11 147 -114 -23 109 -100 42 108 -179 22 207 -132 -75 135 -115 2
3514 2 187 -145 -70 173 -98 -57 131 -54 -17 86 -143 9 190 -110 -60 72 -125 56 194 -173 -44 169
3536A69l54J18L03l07KK08l44J17L62k74j46K53j76k8K33j60k5J93k05n0J57p8
3558c2O0N8k22J20J47k72J29J71k62J18J39l75J52L36l67rK84l01L3K97l03j5
3580a14L46k91j05L27j62q6K07k41mL56k37j35K50j72m6K85j97p3K45k33r8L00
3602A22p6p2J49k45l1L05j43j15K56j70j16K40j45q8L32j61k32K47k8j20J68n9
3624A8r9J55p2j23J47pLP6k01M1K09j95n0K54k01q0K76k03j02L68j81k76L41m
3648I4k30K54q9k41L26lk71K27K0k37J87J3j80K48j9l01J86J28k13J30M5j91J38
3671B1O8k07J03J11j15J7qq2J57j4j26J19Nj38J20k1j02J95j9k32J34Q9j28R6
3695D3lj13J12j5j35J66J1j27J23p6j41K82j9k76K07P6k66J57R7k22J61J10k98
$$ plain form
3536 169 -185 -67 236 -71 -69 139 -205 -88 274 0 -146 107 -69 -97 136 -24 -49 144 -61 -111 46 -32
3558 -32 28 86 -136 -16 131 -141 -12 159 -103 15 154 -221 -69 267 -100 -109 175 -126 -93 204 -99 -114
3580 -114 232 -59 -164 163 1 -85 122 -119 -123 233 -4 -139 111 -61 -107 178 -19 -92 153 -80 -178 122
3602 122 46 -26 123 -122 -153 152 9 -106 150 -20 -136 104 -41 -129 203 42 -190 57 29 -91 77 18
3624 18 -81 74 2 -121 26 19 22 98 -103 -62 147 -48 -98 156 -45 -125 151 -52 -154 214 33 -243 98 94
3648 94 -136 118 29 -212 114 111 -160 67 87 -150 37 50 -130 118 99 -202 -16 112 -101 29 74 -117 21
3671 21 89 -118 -15 96 -19 -2 -10 -92 65 51 -75 44 49 -89 31 10 -92 103 84 -148 -14 75 -53 43
3695 43 40 -73 39 24 -111 55 66 -61 62 -14 -155 127 108 -168 39 115 -151 6 103 -119 42 152 -146
3718a46N6K30j83K2J09j69L5J25j54N3J55j65m9J00r0R0J39k15o0J69o8k3R3l3
3742B1m2K3n0K8Q2j7k9o1l5J43J4j26O3L7j23N2P4j06R2O7k06J6J69q2QM9j17
3769e6K6R7j46N4J70j61n9J01j08N5J97j88j31K21p7j12J97jj52R3l6j14J94O3
3793A27j68l6N7rP2Lo0K8m8n8J07J9j8N3j37q4J86O7r7K6j9j02P9K1k8J04k4j45
3821h4J8K3O1R0q5j03J06m6p7J52Pp3J02j14j42K17M6j47R5j3j40J27J6j23J56
3846F9M2k37P1J14j02R2J7k00J01J63j83J0J20j30j2J10m7J3N5j11n7R4Q9J4r6
3871ar5P1K7l1J08rj20M8l7p7J91P3k11K1O5r8Q4P8j30N3J00j75l7J36k9K3M6
3898G4j12JN4q8L2J24k8n9m4p6J05J40j08m8M1p5M5J13j18j4J07j13m2J84l7j25
$$ plain form
3718 -146 -90 140 -43 -21 88 -81 -46 79 -75 -22 133 -32 -81 19 -71 19 158 -57 -117 52 -16 -39 54 21
3742 21 -21 2 -48 -20 62 45 16 -45 -80 63 77 -49 14 51 -72 -20 54 -52 40 107 -99 -83 86 4 12 61 -56
3769 -56 -30 67 -79 -25 145 -16 -75 26 -82 -27 170 -18 -149 72 -5 -117 80 79 -73 20 -16 -130 64 127
3793 127 -41 -77 -20 -29 43 46 -14 14 -34 -92 15 34 16 69 -68 -152 34 101 4 30 11 -91 -12 9 -19 85 61 -84
3821 -84 -66 -43 18 108 23 -80 26 -20 -97 55 62 -11 91 -23 -165 52 98 -49 46 33 -107 20 36 -87 69
3846 69 111 -126 -55 59 -43 49 66 -134 -33 130 -53 -43 77 -53 -65 45 -2 11 66 -45 -102 -8 81 95 -1
3871 -1 -96 -25 2 -29 79 70 -50 -2 -39 -116 75 148 -63 -42 23 -75 9 87 -43 10 110 -65 -102 34 5 28 74
3898 74 -38 -37 17 -71 -39 85 57 -2 -46 -122 -17 123 15 -33 8 -67 -22 91 -27 -41 66 -47 -89 95 58 -67
3924f7N5rj7J49m8j80N2J08j9LJ0n9k1J9L1L6K1k8q0k2R9O9j24k3N5j0K0J5p6
3953d1J4J20q4n8R4n6o8J08Rl7P8j05j26J73J09j29j0j1q4J13Q0j00k3M0n3j3
3979f0R5J7l7n2l3N0P8Kp6m1K2P5K8r3j7N8j4n3Q3On1mJ4k9N7L7j03m7J45L8j38
4010d3QO4n6L5Q0j20m0J22k3q5R6M3j51kJ22k0pK2j12o5K01N5j59ON7j01M0J32
4038I9r9k8P6j23k7K24n5j46R0k8o0J57k4j65J30O9j82N3J01r0M6L7r7NO8l2j6
4065a7L4K4mj22K4J40l1q0P2r8m4K26n2j94J70K3k09J51J22j83L6N0j37R8J19
4090A18j13o1K3K9M7m7l8R0q2l9J40o8j08K22r4k06K93jk91K09J11k64J79Q7l46
4115b10J81K74l22JK28k62J7K84k05o4K03j67r7K42Kj33J8l4RR6jm0q6j6J75n7
$$ plain form
3924 -67 -12 -21 -38 111 63 -117 -65 43 24 27 37 -22 -43 -24 7 43 64 36 -44 -66 33 102 -22 -45 10 0 20 35 -41
3953 -41 -27 93 9 -49 45 -11 -79 29 38 1 79 -26 -152 21 130 1 -9 -20 -104 9 89 -11 -34 6 -47 -60
3979 -60 35 52 15 -37 -70 -20 58 60 -16 -57 -35 40 68 -25 -42 16 2 -51 32 38 -13 -17 -3 -32 25 62 -41 -88 57 95 -43
4010 -43 -35 29 -27 8 88 -32 -72 50 27 -58 38 81 -70 -72 50 30 23 45 -67 -132 69 124 -35 -29 28 -73 -33 99
4038 99 0 -28 48 -75 -102 122 67 -79 11 -17 -77 80 56 -109 21 90 -92 -39 62 -28 18 55 -42 -37 31 -1 -17
4065 -17 17 41 37 -85 -61 79 48 -32 40 -58 -102 124 72 -122 48 71 -138 13 135 -48 -12 38 -99 -1 118
4090 118 5 -56 -33 -4 43 -4 -42 48 -34 -73 67 -1 -109 113 19 -187 106 105 -186 23 134 -130 49 136 -210
4115 -210 -29 245 -77 -76 152 -110 -93 191 -14 -78 125 -42 -139 103 105 -28 -10 -44 -35 61 60 20 -66 -82 93 36
4141C6j47K19m7k67K52R5l00K11J13m04J88L37m04k9L35k66m1L25k56j22L12j17
4163B3j55K28o3j32J29m2J0J07j64k3J17q0Q8Q9l00R4K49k73N8K42l27j7L39k68
4187g1l4L77l09k38M39r6k05K95j28k52L22K8k65J63N7j64N2M1lK6p5J9M6j08
4211h3J45M9l02J75K43l85L9L35l37nM11l62j61N02k69k67M80j01l47L29j2k78
4233b01L12N5l61J66J39j81R0L4j11N5Nm0Q5l9k3O2j62O9K40k32o5K33j80p2L06
4258A84j90j56L44j53k73L46K2k60J98%k19J81R8k27Q4Q7j11J1L0RN1q3m0J16
4282D9j09L7J74k36j5K85k23j45L53j32k04K92q4k52L34J9l34K17J31k93Q3J69
4304A16j82N5J19j83k6J55J6p6j3K1lm8P3O4j20J9O8j49M5K56k03j67K31n0j17
$$ plain form
4141 36 -111 108 61 -206 46 141 -159 52 165 -239 -51 286 -118 -147 188 -78 -119 206 -50 -172 140 23
4163 23 -132 96 33 -99 30 -12 -2 105 -59 -82 35 -45 43 132 -168 -74 175 -98 -40 202 -125 -142 197 -71
4187 -71 -105 272 -37 -275 164 68 -137 158 30 -222 100 128 -137 26 83 -81 -29 12 9 35 -40 -21 25 -83
4211 -83 62 111 -191 -16 227 -158 -119 216 -121 -126 285 -77 -238 264 -5 -272 208 107 -240 89 77 -201
4233 -201 111 166 -195 -29 110 -71 19 53 -58 -3 2 -38 47 8 -15 47 -115 -46 194 -38 -103 130 -50 -122 184
4258 184 -6 -162 182 29 -244 102 124 -136 62 62 -157 24 122 -105 -21 66 -45 -34 -4 5 56 -27 -67 49
4282 49 -60 -23 151 -85 -100 185 -38 -183 170 38 -166 126 42 -210 124 143 -191 26 157 -136 -53 116
4304 116 -66 -11 108 -75 -101 54 70 -6 -19 2 -1 -49 24 88 -32 -13 55 -94 -49 207 4 -163 68 18 -99
4329i9K37q8k28K37K8k42J88J11k46M8J25j25O0P9j55JJ23k1l9l9J6O9m9j6O0
4354C5o1j9J32j04o6K00j14j47K25J1j82J15j1j25J86P6k38K5R8p6M4P3q2j8j6
4379c9kP0K0j7j4j30N5J82j05p0J05o4o2J68q4j31J97nj93J60L4j80Q4O8r1R7
4405E3J9j71J7J44l4j1k3m2K4K1QM2n5j1L9o7K3J31j29q7J70j1q2Q8q4j10K43
4432A05Rj82Q1J8j19R7O4q8K3K0j17O8P4j6pn6oR2n0q4J07k8pR9j16j04J59j6
4460B0r7J63j2j99P9N2m3J39nk03K1J10j9L4Rq6L5k4lO0l7RM0p7K0J15j41o9J85
4489G6l8o2J08j25j12K34J5j73J30J4j97J29Q0j39P6O2j59M5J29r4m1L2LO4pq3
4515c3l0K3M5R4q8o5P3o4m6K01mj77O5l5p7K27L0k39M0J04j03O7O7j15RR3r0J1
$$ plain form
4329 -99 138 50 -178 59 87 -155 33 144 -102 -54 71 -54 6 85 -70 -69 54 33 -6 -45 -29 40 -9 -25 35
4354 35 -26 -45 87 -17 -83 117 3 -144 81 92 -90 25 14 -111 75 151 -87 -62 36 -40 4 77 -5 -23 -39
4379 -39 -41 29 49 32 18 -112 -57 125 20 -50 55 -9 -71 97 13 -118 79 74 -119 41 75 -105 -21 47 -44 53
4405 53 72 -99 -82 62 28 17 -6 -48 -24 -3 5 47 -8 -19 20 -47 -24 107 -22 -109 61 50 -32 56 -28 -138 105
4432 105 114 -68 13 31 -88 9 73 -15 8 28 -89 -21 53 37 30 -26 -32 60 10 -74 33 5 -2 97 -19 -123 36 20
4460 20 -77 86 74 -125 -46 6 -37 102 97 -106 -85 25 6 40 49 -37 -2 -26 -29 31 -6 3 43 -34 -14 101 -40 -109 76
4489 76 38 -24 84 -41 -153 81 96 -77 53 67 -130 -1 79 -60 16 78 -81 -36 93 -1 -42 -10 -7 57 50 -33
4515 -33 -63 -40 5 99 11 -54 19 -45 -91 110 106 -71 -6 -41 -118 109 139 -100 -60 44 -59 8 75 -40 -31 62 -28 -17
4543a7O2n9qJ7J4P4o8j22J15J8l4J10j08j36K13Rj72J42K7k12J45J01j71Q6O9
4568I5k25P7J98j50m3P5j02N1J44j16o7P0k6nM5nJ3n9l8J04J3o8O5r6p8K24J6
4595A12k43J49M6k07J65J01k36R3J56k57M9K12j59q4J82q9l1J22j01o2J30ql4
4618Fpo5Q1M9q6M4L3j45O5Q5j00Q8M7k24N1J95j20J2O5j66L4J70j39l0J64j33
4644b6o9J55o4l1J28j41m5J49l5n9L9m2L3O1r1J4P7q8K8N5j23P8J18k06K5J85
4670A25j77m5K03j04n6J99j74j52K62J5j51J10j6j54J15N6o5O6nj07mN8M7L5r9
4695a8l6O9m7L6O9j03J2Q9j42lJ92r7q1J06r3l4J96r9j17J96p4j55J74J4j13J26
4721F7l7j90J69R2j50O1M0j21M6O0p6P3M1j18j1O2OO3n3p1N5Pm1O2Nm3K1m1n8
$$ plain form
4543 -17 45 -14 -22 -5 9 83 15 -107 8 26 -8 102 -6 -142 71 80 -92 50 77 -135 10 111 -60 26 95
4568 95 -130 -53 145 -5 -48 27 -75 -24 120 4 -63 7 -19 -24 21 16 29 -30 -68 36 49 -19 46 -50 -128 96 112
4595 112 -131 18 64 -143 22 123 -113 -20 136 -121 -72 140 -19 -103 79 -10 -41 81 -20 -82 48 40 6
4618 6 -1 -66 15 64 -22 22 55 -90 -25 60 -40 48 95 -129 -78 117 -3 9 74 -92 -58 112 -27 -57 107 -26
4644 -26 -95 60 -4 -35 93 -48 -93 56 21 -38 1 -41 -8 53 -38 -24 53 -35 -7 48 -75 3 121 -85 -60 125
4670 125 -52 -97 106 2 -54 145 -29 -181 81 96 -55 55 39 -115 0 56 -9 57 52 -55 -59 -1 46 81 -18
4695 -18 -54 15 -32 4 73 -30 -18 71 -71 -74 118 21 -60 46 -47 -81 115 16 -101 95 21 -134 40 54 -59 67
4721 67 30 -160 9 101 -49 12 52 -69 -23 37 -39 34 75 -43 -54 8 14 77 24 -47 8 15 -26 36 41 -2 19 -22 -80
4750h0J47J6j14L3l4j8J03jp7P1k9j14R0O3n7O1n7j16J05R9j04L0J1r7L9O4p1
4777c7O5N5j40j6R5j7K4K1j03K2O4o2kQ2n1j8Kl2L2R7o8m0K6k1J8L1j9kK2o5k2
4808e9O7M9j1l8n7J0N5J5j2j5j6J1j7PQ5k5j05RL7%O5pj15J7J06q2oR6p2o1R3
4839B4l6k8J02j8j41P8O9q9J6N0m6ON2r6rJ30j9p8L6Pn7O4L8o1J0J8o5OJ15nj09
4870c6kJ7jO0L3j09k1P1j5l7J01j7r5OM1nK7L2j02k1J04jo8J9L7k8k1L1j8%M8
4901C0k7m8M2K8o6J5N1Mm8Pj2oQ2J3j17pQ2j7j8Q0o4q7P4L9o0R1J6j78RJ56l6
4932B8l9P0r7o6J69j7j16J08K4j50M7J20q4j3R0j12k3J30l6j17Q7O0p5rL5m3K2
4959gO5m6p7O9J9o8N8O5r4o8R4k2RQ8q2j28J22P0q3L9Lj02N4O4l6PN4r4n4R6M9
$$ plain form
4750 -80 67 83 -31 2 -32 -50 53 52 -25 46 17 -97 -7 56 -1 60 3 -113 -8 91 -13 17 28 -69 -30 34 -37
4777 -37 28 83 -57 -73 22 5 29 50 -53 -31 33 -29 -31 51 0 -18 -16 -48 -16 81 13 -27 -1 -22 -4 27 8 6 28 -37 -59
4808 -59 8 57 46 8 -49 -39 16 31 19 4 -12 -1 -18 -11 74 49 -56 -47 -10 -10 55 48 -67 -50 56 -26 -32 64 -8 -69 24
4839 24 -12 -40 62 44 -97 -19 50 -39 -23 27 -19 -13 39 -57 -66 64 45 -33 3 10 -47 17 55 -6 4 22 -43 -37 78 73 -36
4870 -36 -38 -21 -22 38 71 -38 -59 12 -3 -40 61 44 -51 -45 -4 -9 18 50 -52 -73 31 30 -38 -19 18 -10 -31 0 -18 -18 30
4901 30 3 -45 -3 25 -41 -26 25 29 -19 -12 -24 -30 52 65 -52 -59 23 6 -12 68 4 -83 -9 30 -30 61 77 -101 -92 64 28
4932 28 -11 59 -38 -104 65 48 -68 40 64 -86 -39 81 -3 -16 74 -38 -61 69 33 -84 3 63 -12 -21 14 -29 -7
4959 -7 58 12 -65 4 23 -45 13 78 -16 -84 10 -12 -3 85 3 -125 -3 67 -16 23 26 -76 -22 42 6 13 67 -27 -81 15 64
4990F4l5k9k9oK6L9J1o3jP4o5m9Q9K3j05N4N2j07M6O8j29M9J31j40p1J50k7o3
5018d3J11o2j16J21N4j23N6N6j00k0R8km0M9o2o5J06O6r9m0P8l7l5R3j3j02R2
5045B1Mj08J05R4j79nJ48j09nJ40j27q0K10p6j33J39K6j25P5K8j10P8O5j22L2
5070a4O6o9k0K4K1L3mp8%L2L3J1m3j1L2l3pP2k9m8L3k9nJ07k7j13M7M3m1K7Nm7
5102c2M2J9l8NK4j5kk2K4O2o6m0Q2m3k7R9j12j5J37m0j19J13J5j20J14K3j46J01
5130B3M1j39P5J13j50j8R9q4L2R4r7p9J10J0p1M3L5n4oK4j0J0L1Jr5M0R0q7m2
5159f1J14n2o4J25l4j15J44Qj81J15Q3j45M4R8j26K2J08j15l1J37n6p2N9mk0N2
5185C3k0n0L5Ljj2J6L3k8n4N0K3m8L5j0p2Q1M4j30L9R2j04RQ9q7MJ04j04o6J61
$$ plain form
4990 64 29 0 -29 -35 -9 30 41 -22 -23 51 -14 -63 26 49 -56 -2 50 -57 -11 57 -72 -23 108 -32 -103 47 20 -43
5018 -43 68 6 -110 11 65 -58 -2 54 -46 -66 32 30 -10 39 -23 -88 18 84 -15 -55 23 -14 -49 44 31 -71 21
5045 21 25 -83 22 116 -63 -68 80 -29 -34 106 -21 -101 109 33 -100 39 65 -60 15 43 -67 11 76 -46 -14
5070 -14 52 -17 -37 -13 8 41 37 -41 -41 -9 24 35 -8 -19 13 -20 -27 45 16 -32 1 -28 -33 74 47 -66 -19 24 -17 10 15 -32
5102 -32 10 29 -9 -4 20 5 3 -19 5 67 1 -39 43 0 -27 72 -40 -55 82 42 -77 36 51 -69 45 68 -78 23
5130 23 64 -75 0 113 -37 -55 44 -40 -8 86 -11 -90 20 30 -41 2 37 -17 -23 1 -9 1 32 33 -62 -22 68 -19 -61
5159 -61 53 1 -63 62 28 -87 57 65 -116 -1 82 -63 -19 79 -47 -25 83 -32 -63 74 18 -54 5 1 -19 33
5185 33 13 -37 -2 1 0 -12 4 37 9 -45 5 28 -20 15 5 -67 14 58 -72 -33 59 -45 -36 53 -34 -30 74 -30 -96 65
5215F5k9r2N8J9n7O2on2L9L0k6l8K5L8j6o8N7J3p1N7K0r2P9O8j58K6J44j07l8
5244e0J13q2m7J54p5j00J58k4j19Q9J2o5O4Kj01O0M2m4%J2Mmm0K4M4l1lMo5P2
5274DO9j29PJ20r6m2J21q2k3J16n4r9J53j4j26Q4K4o2M2J2p6N5N9m9j6kJ0J3m8
5303b9L2N1p0j2P5p2K7R4j28m7J69o8r8J18m3o6J34k6j32J19K8j35O3Q1r8K1K6
5330A4o1K8P4m2n0K2L5k6l8O7Ro3L1L8j00O0J01j51jJ53j10p0J35n0p4J73n6j68
5358a20J41N4j52Q2P9j36L0O1o0J8P4p6m6N2J2j1j7J7J6k3J6Rn3L9N6q2nR1o6
5387@n7R8l9k7Q1n3p6J02Lp7N9Ro4M7J2o7N7L0o0J1RJ9Lm1NP4m2l4M7n5J4Q3o4
5420Gn2J02l5p8Q9nn7O9oq1N9N2q3jK9J7j7j6J4KoJ3kp0P8L1r8M5O8j07J0R1j11
$$ plain form
5215 65 36 -56 2 21 -36 26 20 -32 7 37 11 -27 -2 36 20 -48 9 22 -49 8 28 -64 15 83 -75 -49 95 -12 -50
5244 -50 63 -19 -66 88 13 -87 71 47 -72 17 29 -36 28 30 -71 -11 31 -13 -13 -1 3 -1 -41 -17 27 -4 -7 -3 -68 4
5274 4 73 -56 -49 71 -25 -67 54 -28 -51 65 11 -88 65 51 -75 9 33 -29 13 25 -51 4 63 14 -2 -4 6 19 -29
5303 -29 3 54 -16 -28 47 -25 2 96 -32 -79 90 22 -76 42 -1 -67 67 41 -91 28 56 -79 -16 65 -33 -12 14
5330 14 -47 -19 55 13 -37 -15 20 -6 -44 23 32 -31 0 38 -62 -2 99 -52 -53 100 -10 -80 55 5 -69 104 48 -120
5358 -120 21 75 -77 5 84 -52 -22 39 -21 -3 71 -5 -51 1 13 2 -15 2 18 -5 11 20 -33 6 62 -20 -25 66 0
5387 0 -57 41 2 -25 56 3 -73 29 32 -45 14 23 -41 6 18 -49 8 38 -22 -11 -2 17 20 -21 -16 58 16 -18 29 -26 -12 71 7
5420 7 -45 57 22 -56 33 28 -29 40 34 -47 12 64 -19 -20 9 26 9 -7 7 9 3 16 14 -56 22 53 -45 0 68 -39 -29 62 -49
5453d9K6J16j27m0J50o8q3J32o0o5J19k2j10J22K2j28M5M5m1K8J0m8J6L9k4k9
5479b4LO6l0m3L5K5n8M1M2r6L8P1j15lJ18q2l3R4p5j1J19q6p2J29k3o8P6l4k9
5508b5O6m0m6P4j2n7L1lNN9n2n4Q8j2m4M7l5j7P2n2m6R9j1p5N8j6k8P4l9o0R0
5539C9po2J6J2JL7l5j8M5k7j6M2m5J6N1q3j9J22n6n5Q1n8k4J10o2q0J18pq6P8
5569B8Jr3Q3qq3R4K0j01L2L2m1M9K3p6K6M4m9QK4j8J5l0k2O3jl8K0k4QQ0q4l1
5601d9Q1on6N8k1l9Q3l0p3Q4Lp6N0J7o1P0k0o3O5L6q1L3J2m8M5K3p1L7L2o6K1
5632a0K5j5J2j1n7N9L8m2k6L0k5L6Pn1M3J3m2jL1pJ8j2m9L9K2k5lQj3M1l4k7N4
5665B6Nm4K5Jl6M6Mp1O9J2o6J7M8l9K7K0r6M4P2p4PL2m5J4K2m7L1M7o2k7M0OJ2
$$ plain form
5453 -49 -23 93 -34 -74 76 8 -75 57 -3 -68 51 29 -81 41 63 -65 -20 25 -16 12 22 -26 -10 29 5 -24
5479 -24 -21 45 15 -28 7 32 -26 15 57 -39 -1 70 -45 -48 70 -12 -45 49 -26 -37 82 -4 -76 53 30 -38 38 4 -25
5508 -25 41 1 -45 29 17 -40 -9 -12 -7 52 0 -54 34 22 -22 25 -10 -27 45 -7 -53 46 35 -40 18 2 -26 48 9 -51 39
5539 39 32 -30 -14 -2 -1 36 1 -17 28 1 -15 27 -18 -2 49 -34 -53 69 13 -42 39 -19 -43 67 5 -75 43 36 -50 28
5569 28 29 -64 19 11 -72 22 42 -59 -27 5 -36 13 36 -40 -14 30 -19 -11 13 -5 10 -20 -42 21 20 -18 2 -22 -14 66 -18 -49
5601 -49 32 26 -30 28 7 -32 51 21 -52 32 35 -41 9 26 -35 35 15 -48 17 53 -28 5 17 -31 14 37 -34 3 35 -31 -10
5632 -10 15 0 12 1 -56 3 41 -1 -27 3 -22 14 21 -30 13 26 -16 -17 14 7 25 13 -36 3 25 0 -3 5 -8 33 -1 -28 26
5665 26 31 -13 12 13 -23 23 27 -44 25 37 -29 -12 36 -3 24 44 -52 -8 64 -10 -3 29 -16 -2 20 -27 4 51 -11 -38 2 8 20
5698B0Jm3qM3rj5K8j8Qlk4L5J7l7P%k0M0ll3M1Ln9J3L2k3K3Po3L1M5n1J1L4m8
5733a8J8K8n6K6O9p4m0N5klL2m5k5O2k5k1M3mj8Pk4lM9j6l2J0kQK0l6K5L2n1j5
5767b6K7mK8po2K1O1n6NM7l3mK2m5K6O5n0m5N2k7J6K1m3KM6l9k4M0qKJ3n3J7O2
5801D7m3l1M7l3PL0m0PO4o4j9M8j4j3K8l1l1P2j6m5M3Kk5Nj0MM0l8j9K7k3K8O
5834A0m0L8J6n6J2N0k7KL7r1K8Q4n4m2Q2n4m6Q7j6k7M6j1o3M4J4k1J4j5j2K4j2
5865Aj7K8rJMm8M3L5n4NJ9k9RM9o1qR1o3m2Q2k3l9N5l9l0Q0oo0K6J6j9%J7okq
5901bj4OOM2j2o3K8L1m0kP8o4j3O0o9j6J08m7p2R9k3n9O2km4M3K2p8J8N5l4j7
5933a3K5k0j2K4kk5K4K3l3l2M6L4n5JL8n6K5O9q8k2J01l6p5R9rp3M9J7q0Q6K7
$$ plain form
5698 20 21 -22 -30 13 4 -11 17 -1 7 4 -20 15 32 -5 2 2 -18 22 19 -14 27 30 -29 -16 16 -7 16 23 -40 -9 36 -15 -4 30 -18
5733 -18 0 28 -28 -2 67 -7 -47 8 6 3 35 -10 -35 27 2 -19 24 20 2 9 -15 -18 31 15 -17 -7 -9 -1 19 -17 8 40 -11 -26
5767 -26 1 -3 25 18 -44 -23 38 -18 -13 34 1 -3 19 -26 0 65 15 -30 22 -5 11 32 -11 -9 37 -2 -26 14 6 8 21 -32 -15 47
5801 47 4 -27 20 -13 -6 24 -16 -9 55 -9 -28 20 6 -7 21 -10 -41 31 15 -30 13 15 -10 -5 -15 -11 29 -9 -28 -1 -24 4 10
5834 10 -30 8 24 -32 -20 30 3 5 42 -49 -21 63 9 -33 49 -5 -51 36 20 -7 39 28 -35 9 23 2 16 1 -11 13 1
5865 1 -16 12 3 4 8 -40 3 38 -16 -11 8 -21 -12 37 -24 -32 59 -4 -46 36 13 -26 29 -10 -40 40 34 -26 0 16 -3 -3 14 8 6 -2
5901 -2 -16 -10 -4 38 26 -37 -9 22 -18 -20 58 -6 -19 41 -28 -44 64 17 -55 44 21 -38 24 22 -22 21 43 -35 -17 38 4 -13
5933 -13 12 -8 -20 4 2 -23 1 24 -9 -41 5 39 -16 -15 23 -33 -8 61 -27 -49 52 16 -59 40 31 -42 7 24 -56 30 57
5964E7j00K7M6l4j4N0j9k5K9k1j6L6J9k2m0J7L5k8RL0k8j8L5n5JR9k6j03O3Nm4
5995c5N0K3p4M8K3q4L4N8l5l5L2l3K4K3nk3J1J4k7j7K9L0m4l0N5pk3N1k0n9Q1
6026C5Jq3P2K3p0J3L9o6K1P9q5l7J03k4m6M0J2m1K6%j6NL4l5k7J2O5n0j4M9m4
6057ij1N8k3p1J05Mj24P0O4j01K4P4j12J9Q2q0k5J22l3q9P9qn1N1K9j01M5N5n4
6086a1j4M5%m5J4K8l3K9K7n5k5O2Kn6L7L5p2J8N9q3L2P5q8l1R5k8n8N9j0k9N2
6117C1lp3N9J8m8J1R%%j8J2J0qoQk5J5L6p1pP9l0l9N9m0l8J05l5o0Q7j6p6L8N0
6151C4l2J3Jm7J9L6rl4L4Nl0KK7j3k1L4j3m8P3J1q3K4O4n3k0O7m4l0R1n8p2J09
6183C7or2O0L7p3L8L3p6K3Q2p7l8N2Qj7K9j9l3K1K7j4j6K6j8m1M2M1l3Jll8K9
$$ plain form
5964 57 -43 -16 30 -4 -18 32 13 -12 17 -4 -20 16 35 13 -27 -10 25 -3 6 36 8 -10 25 -30 -29 70 44 -59 4 9 -35
5995 -35 15 38 -36 12 35 -49 -15 43 8 -27 5 -28 -4 19 14 -9 2 16 -11 -28 1 31 -13 -43 12 5 -18 33 13 -46 35
6026 35 36 -47 25 48 -22 -9 30 -36 -15 64 -21 -58 45 21 -25 15 27 -14 12 12 -4 1 35 0 -27 -15 50 0 -14 35 -9
6057 -9 -20 38 15 -56 49 53 -71 -1 63 -38 -14 60 -52 -33 49 -31 -56 66 33 -56 23 15 -36 15 44 -57 -12 43 -11
6086 -11 -25 20 20 -25 -11 17 -16 13 40 -15 -40 22 24 -32 5 40 -32 -14 45 -38 -6 69 -19 -50 45 17 -41 18 8 -21 31
6117 31 28 -45 14 32 -16 -5 4 4 4 -14 -2 8 0 -6 2 -23 -8 28 -43 -50 29 -1 -40 19 -21 -59 46 11 -49 38 22 -54 -16 34
6151 34 2 15 16 -31 -12 24 15 -19 15 20 -10 -8 19 6 -15 19 6 -42 31 42 -41 -17 47 -6 -26 41 -3 -33 58 0 -72 37
6183 37 31 -61 -1 36 -37 1 34 -42 -19 63 -14 -52 0 8 -9 20 1 -32 -11 16 2 -14 12 -6 -47 -5 36 3 4 1 -37 -8
6215hN9n2k5N4j7m1N8qm0M0j1n1O5K1n5j4L4njjmnJ5Ok7NJ4J5l3LM5l9k5M3j6
6250akL0m1m2P5Qn5J2K1l5K8M4m4mK8j9m3M4J4k3lk%J3K6k1l3K8K7n2K2M3m0j1
6284hK2k8K2M8p1k0P5j5m1L5ll3M9j5o1N1M1o6OL4l1kM7m8JL6k0l0NM2pk9nL1
6318A2j8oJ0rmM6o0j0P0nn3K3Jj0K1J3l6JK8qqJ8Mrl4JM7k0jJ4l0PM6m6qM8k0
6355A5m1L2omM9l9n8N5L8p5M4L3p9L9K4n8K6L6m8m3P6j4j7K9j4l5L5L2m9j9P0
6386C4j6n3L1L2n4K2M1o6MP9o5m1R2%q1M9Rn7N7L3j04M9M5o9jQ0m3k1L2m3RP3
6418E7l5o3N7qj0K9k4k4L3nj0J1Mll2j5N4J3m6J2Ll2N0K6q2K8N4p2J4N1m8j3N4
6451B8m9J4L1l6k0L0J7j4Rm0MO2m4PJ9m5K2M6o0K7N0r2oQ2m3PL4q0mJ14m4m6N2
$$ plain form
6215 -8 51 -1 -26 28 11 -30 28 20 -20 20 9 -42 23 44 -11 -25 9 4 3 2 -2 -7 8 14 -13 -8 6 21 -12 -9 36 -3 -28 15 -1
6250 -1 -3 27 -14 -56 19 27 -28 -16 5 -30 -2 42 -2 -6 22 3 -40 4 18 -5 -8 -10 -10 3 29 8 -25 3 30 -22 0 43 3 -8
6284 -8 14 -14 8 56 -15 -35 40 25 -16 19 16 -17 32 17 -44 7 48 -18 -12 22 -9 -11 36 -12 -11 25 5 -25 -20 22 15 -14 -19 12
6318 12 -6 -12 -2 -11 -15 31 -29 -39 31 26 -27 -4 -3 -13 8 21 -15 -14 14 6 -2 16 20 11 -23 -22 25 5 4 18 -12 -5 41 -5 -13 35 15
6355 15 -26 6 0 -4 45 6 -52 3 41 -34 10 43 -36 3 27 -31 -5 31 -17 -60 16 2 -15 14 0 -35 0 32 -17 -36 34
6386 34 18 -35 -4 28 -26 -4 37 -29 -25 54 -11 -52 40 40 -41 8 17 -40 17 50 -54 -5 40 -29 -30 50 7 -14 18 -25 -16 57
6418 57 22 -41 16 8 -2 27 3 -21 12 7 -3 8 12 9 -23 -38 16 29 -17 -5 -2 -34 16 42 -40 -12 42 -30 -16 35 -13 -26 28
6451 28 -21 -7 24 -12 -32 -2 15 1 10 -30 -26 36 -8 -1 18 -27 -5 41 -19 8 58 -34 -40 42 -1 6 40 -40 -44 70 26 -20 32
6484C2m3j8Q1k8m0N1m1m1M9K1qj1l7K2L7j0k4Rm2L8L2n4J1O5r1J1P6o1oN4p7o
6516d9J16o0n8P0k2m1P8l0m9O9j8l5N1j5k7OmNN6n2l1M6j4K4L3p4oN9o2J9O8o2
6548ij7N8o2mJ13o2o9O5j0m2P2m6m2P5pn6O8j9m8L8J0j7M4k7n2M3Nj8M5n6j3Q8
6580D8n5j6M3k2l4P1l7l4Q4m2o6Q5ll3L6l3k9P0pn6M0lj7M8l2k6P2m3m3N8j4j6
6612fM3n0k5P9m3k8P4l4n3P5m0k8O8j7n9N7On0N6j4m9M4jm7O2j2k4K3k0j6O5k5
6644A1l6M6k7j2M7l0l2Q4m4m6Q9l0n1L7J1m6O5k1n2N8rk2M3k2l9O7k4k6K4j4j8
6675a9M3j0m7N3l0k1M5Pk8L3m7j7O1kl0J5k2j2M4j3j9M0l1l4L9K8oj3l4nO6j4
6707B0k3K0k7j2N1l7JL6k5l2M3Qj9J4l7JM1j0k9J4MJ2Mj4k3L2j9qL6j7j8K0l3
$$ plain form
6484 32 -11 -29 52 24 -16 35 -6 -47 2 23 15 4 -33 -11 26 16 -8 1 -41 -3 29 -25 -14 51 -40 -29 47 -14 -20 34 -43 -49
6516 -49 67 7 -51 19 -3 -44 34 4 -45 24 6 -29 22 7 -20 -14 -18 -13 43 -9 -40 6 -8 16 49 -25 -31 28 -34 -15 53 -9
6548 -9 -26 32 -30 -34 79 17 -52 13 3 -39 33 -13 -55 20 13 -43 25 6 -42 -4 6 -11 33 6 -46 -3 2 -16 29 -27 -40 48
6580 48 -7 -23 20 -2 -36 35 -2 -36 48 6 -60 25 22 -11 25 -8 -37 33 26 -30 10 7 -10 38 6 -20 52 9 -34 24 10 -6
6612 -6 37 -13 -38 41 -2 -30 44 10 -43 32 -8 -36 32 15 -44 13 19 -31 25 11 -38 6 5 -42 20 8 -16 7 -13 -29 36 11
6644 11 -25 21 -6 -18 29 -1 -33 51 7 -39 50 20 -31 6 17 -29 36 15 -37 21 12 -10 33 11 -28 39 15 -11 13 -1 -19
6675 -19 24 14 -33 20 -10 -31 14 21 -7 26 -21 -38 23 21 -9 6 -16 -28 16 3 -16 24 -7 -41 -2 26 20 7 -27 -32 34 20
6707 20 -3 17 -10 -22 29 -8 -7 29 4 -28 15 23 4 18 -19 -18 23 13 -16 -2 2 14 18 4 -19 13 -6 -14 22 5 -13 7 -26
6740b6K6M3l2m0K7pJ6N0o2m3N0j0k4N8ql8MPj3N7j2m9LK1QJ7k2pokK1Pj7J2Ll6
6776b4K9L9n0j5K8l0L4L4o4k2P3l9k1M1j0l2N3j3l3N8l2l5L3L2k7oj5j0L8Jj0
6807Ej1k4K4J8l3L4K1o8ML5j2K2K2p5oP4j9k2K3l6nM9j9j6J9j0k6M9kpLk9J3L7
6841C2j9j4K2l5lL8k8jL4j5l2M4qj8K3k2k4O7l5k9K0NkJ4j9k7K3J3j2mPmjk5L0
6876eM3m2rPj6K3M4n6j5M8l6oN8j8m0L6l2j3N3J3o3K8J5l2K5J5n0K2L0m4PM3j6
6909A7k5Rj5PJ9k1J9j2MPj0qK4j2k1L4k1%K4k7j2L8nn2L0K6k4LOk8L2L6n6j5M1
6944A2j6j6K5kl%k1MK6J2Nk6k3K4J3j6%J7k2Qkj9L3J3m9JN6k5j1L7n4lM0k9j3
6979b4M4ml6K2Pk1K0lj5lJ8jpj0Pj1%J4J3j6Mrk2L2K3m3J0L5k6j5L4l4j2N4m2
$$ plain form
6740 -26 0 43 11 -29 -2 -9 7 57 -5 -48 2 -8 -32 26 18 -20 -16 -9 -22 35 23 -26 -23 -2 6 23 1 -6 -12 -14 7 14 -3 9 12 -24
6776 -24 5 44 -6 -21 7 -23 11 45 -19 -41 32 -7 -28 13 3 -29 24 11 -22 36 4 -31 2 34 7 1 -14 -24 14 15 5
6807 5 -6 -30 -6 12 -21 13 34 -34 -30 5 -7 15 37 -38 -44 30 11 -11 12 -24 -29 20 1 -15 4 -6 -32 17 15 8 11 -18 -5 32
6841 32 13 -1 21 -14 -17 21 -7 -8 26 11 -21 23 15 -3 20 -2 -26 41 6 -23 -3 2 0 14 -5 -32 -9 4 -8 -12 -5 -9 -10 -35 -5
6876 -5 38 -4 -13 -6 -22 1 45 -11 -26 22 -14 -20 38 20 -20 16 -16 -29 24 37 -26 2 17 -15 10 25 -25 -3 27 -17 -10 33 17
6909 17 -8 1 -14 -7 12 -9 10 -2 2 9 -1 -9 15 3 -18 16 -5 -5 19 -8 -20 18 13 -39 -9 17 -7 -4 2 -26 6 42 -14 -29 12
6944 12 -4 -20 5 3 0 0 -21 -17 9 21 26 0 -23 1 14 -2 -2 15 -7 1 -1 -20 13 26 -23 -22 34 9 -2 35 -19 -22 18 -11 -24
6979 -24 20 16 -20 2 9 -12 8 5 -10 -13 5 4 -3 -13 -6 -17 -17 -3 10 -6 -2 -11 -33 -1 22 -21 -11 24 -2 -17 17 -17 -29 25 -17
7014a7oM1j4k5M8j8j6J7j0l2M0L2n5%J4qJ0J1k8l%J5J4j4J9jm3K0K9j0qnk0oO9
7049D0l9k7M0k3kJ3Jj3MopNL2j8j4ONJ6k5NPrJ7kl8K6J5k5JL6j8j9J7kj1L8rn2
7087c5L4L1m1J6Nl5J3L0k2qK9k3k6K6K9k5j5J0oJ6K0j2l3K1Pl3J3M7m8j3L9k1
7119a0J1K9l7l0L9J2k4kRj6J3K3l8NJ6Pk2J6L3m3jJ5rJ5Rl9j7L5K0j4Jlj8J1K3
7154A9j6qK0j8k0L8K2l8k0J4J1oK0k2k5L9mk0KK5l3nJ9LrK7j4l1K7J3k3j7M9k3
7188dj3K3Kl1L5km4J8L2k5rK6pk6L3jk5L4J3m7%M2k4rK2k3kJ9rj5K3K3m5J1K9
7223B4k1j0J8j1j6K1%k6J7K6l4j8M3rj0K5j9k3J6L0m1KK7k4%LJ7j7K0qk7J0L0
7256A5j4k7L5j1pLL4m6J3J4l8J9K9j8k6K6J3k0J1kk4L1Rj7j0K0opJ0Oj9Qo%PJ3
$$ plain form
7014 -17 -23 18 4 -21 27 9 -7 10 0 -32 8 40 -15 -15 -1 -9 1 12 -16 -19 -19 -4 10 -4 15 14 -29 -9 20 10 2 -3 -23 -29 40
7049 40 1 -26 14 -9 -11 2 3 -10 -6 -12 -19 -14 18 0 -14 -8 -3 13 -12 -7 0 -9 8 6 -32 -6 9 -16 -15 21 3 -16 1 -1 -12 26 17 -35
7087 -35 -1 30 -11 5 10 -25 -12 18 -4 -12 17 -6 -32 -6 23 -2 -17 -7 -13 3 23 11 -22 -1 6 -27 -14 33 -15 -28 11 -10
7119 -10 1 30 -7 -37 2 14 -10 -12 -3 -19 -6 17 -21 -16 0 7 -15 1 34 -9 -10 5 -4 11 20 -19 -36 -1 19 5 6 3 -15 -4 19
7154 19 3 -5 15 -3 -23 15 37 -1 -21 -7 4 -2 18 -4 -29 10 6 -14 -12 13 -20 -25 -6 -3 -12 15 1 -30 -3 10 -13 -30 19 -4
7188 -4 -17 6 8 -23 12 10 -34 -16 16 -9 -18 8 1 -25 8 7 -18 16 29 -18 -18 24 0 -9 13 -10 -12 7 -2 -17 6 29 -16 -5 24
7223 24 3 -7 11 0 -16 5 5 -21 -4 22 -12 -30 13 4 -6 19 0 -23 -7 23 -18 -16 11 -13 -13 -10 7 -10 10 2 -25 -15 15
7256 15 1 -26 9 -2 -9 -6 28 -18 -5 9 -29 -10 19 1 -25 1 14 -6 5 3 -21 10 19 2 -8 12 6 -1 9 15 -4 4 -2 -2 5 18
7292A8j7k6K2K4k2%Qj5pL1k1kM0m4k0M8mrjk6%K4J8j8LrJ1mNrJ6k8RJ3j9K2Lm2
7330b8K0M4k8l4M6ok2L1l2j0K6Qk4NJ9j7j4J9qK0j8j7RJ2K2j6l6J7K5l0MK6l0
7363a7RK4n2K0O0n8j1M8k8j7M4l3k8N1jl3J6J1k1PNlJJ4j2J1lJ%k3J6L1l1kK5
7398B1l8J3L1m4qN5l3j3M8k9j4K6nk3L5pl8K8loJ4pj6K8j6j8K5qjJ8l2qL2k3j1
7433b7L2mj2K5k2k9O6k3l7L0Oj7J8J3m1L7qj8K0jkj0mJ2K7k3qJ1j8J4K4m7mN6
7467C6l9k1M5k2k2L7j2l3O2j8m6L3J7k0J5qk3K1Rj1j6J6k%Pj4J6j2j2L4l0J0K6
7500B3m6pM9j8k1L5ql1L5j2k0L8kl2K2M%Jj8mK2Kj4J1j0J2Rk5LNk1QL7l3mJ0o
7537fj1M8j7m7J6J3PRll3PK7j8pJ5%j5QJ6j0kLlj2K7ml1LL1k3j0K9kj4J8ok2J7
$$ plain form
7292 18 1 -25 -3 21 -1 -1 7 -8 -15 16 -5 -7 33 -11 -31 17 13 4 3 -23 -23 1 19 1 4 -5 6 2 7 -2 14 -14 -5 8 -11 11 14 -28
7330 -28 -8 36 8 -26 20 14 -8 23 -9 -19 7 15 -9 -4 15 -2 -16 3 -5 15 -3 -20 -11 1 23 7 -29 -12 13 -17 -13 13 -17
7363 -17 -8 16 -36 -16 44 -14 -25 23 -5 -22 22 -11 -39 12 11 -22 -6 5 -16 -9 -4 -7 -6 8 -4 7 4 5 5 -18 -2 29 -2 -4 21
7398 21 -17 -4 27 -17 -25 30 -3 -16 32 3 -11 15 10 -13 22 15 -23 5 2 -4 10 3 -13 15 -1 -19 6 -2 -3 15 -17 -25 7 -16 -27
7433 -27 5 1 -11 14 -8 -37 29 6 -31 -1 5 -12 6 19 -22 15 7 -11 9 8 6 -4 -8 4 31 8 0 11 -7 7 31 -16 -20 36
7467 36 -3 -24 21 -1 -23 14 2 -31 31 13 -33 0 17 -3 12 4 -19 2 11 0 -16 0 -2 -2 5 -9 7 -5 -17 17 -13 -3 23
7500 23 -23 -30 19 1 -20 15 7 -24 11 -1 -21 17 15 -17 5 9 9 10 -8 -12 10 12 -2 9 -1 11 20 -5 -2 3 -18 -10 27 -6 -10 0 -6
7537 -6 -17 31 14 -33 -17 -4 3 12 9 -24 -17 10 -8 -15 0 0 -15 -7 9 -1 -3 0 -3 -15 12 8 -23 -20 11 -12 -22 7 5 -9 9 3 -19 -2
7575bJ4l1J5J3nkPk4K3%j5%J5Knlj1RqJ1KjJ2pj4kK9j5k2J5JjJ3j2rJ8j2j7JJ4
7615dQk1J1lKJ4j3QjNj5MLJ1npJj0J3Mlk5K8nrL8j2rJ4k5LJ4Kj5jJ6j6%MlKJ0
7657A3rMoOprmK1jj2J0Jj7J7rj1K9j5j8RJ9nj0Rj9K2jl0J7K8j9j3NqNL3l5LNl
7697eJ2j0mJ9Lk5J2J8k8J3Kj6K4K0m9J1K8k6MK2l5J4M8o1nK7k0PJ1j8K4%l3LK5
7732A2k1J1j2j1K3Ol4K5Mk7L4j3j1K0J8n3K5K3k8QJ8m3K1L2k7pL1k7jJ1j6QK7
7765B6l3qM0k3mK4k8J7J9m8J1M1m3J6J1m6K9L2l6oL1k9lK2j1kK9l6k0L7j7nK2
7798Im9K7N0o1J3K1k2J6Pl2J0M6n4MM1m0KL9m1OM1l5k0M5j8rJ8l3J0L9k4k0L8
7831B4l0nL3l2L4Qm5j3N9k7j4N0o7J6L9l6j1M4m2OL8m4KM4m5k0N5k0j4L3l4ML6
$$ plain form
7575 -2 12 -19 -4 9 4 2 9 -15 8 8 -7 -7 8 10 5 2 -9 0 -8 3 5 4 16 9 -5 -7 22 7 -15 0 1 0 13 1 -8 10 -2 -19 -18 -4
7615 -4 4 -17 -6 -9 -7 7 -6 2 1 6 -9 -5 -2 9 4 -3 -2 -12 1 5 2 -23 5 0 -9 29 17 8 22 -3 0 14 16 1 0 16 0 0 4 1 3 13
7657 13 4 8 2 8 1 -8 -12 9 8 -4 6 7 -10 7 -2 -13 16 1 -17 -8 11 6 -4 5 -14 8 7 -23 -6 22 3 -10 -5 -13 -8 25 -10 -7 -2 -5
7697 -5 7 -3 -7 12 15 -10 2 20 -8 5 7 -9 15 35 -14 -3 25 -1 3 25 -10 4 52 -9 -14 13 -7 0 11 -7 17 17 -16 -13 12
7732 12 -9 2 -10 -21 2 8 -26 -1 3 -24 10 -3 -14 6 24 -29 -4 19 -9 -1 17 -26 -5 27 0 -7 24 -3 -4 7 -9 -1 26
7765 26 -7 -15 25 2 -2 22 -6 11 30 -18 -7 34 -9 7 18 -28 1 33 -3 -9 22 -7 -10 12 1 -1 28 -8 -28 9 -8 -13 9
7798 9 -40 -13 37 -24 -11 10 -12 4 11 -21 -11 35 -19 -15 26 -14 -12 27 -14 -8 33 -2 -22 23 5 -4 14 -19 -9 30 6 -14 24
7831 24 -6 -11 22 -10 24 32 -13 -26 33 6 -8 42 -25 -9 30 -6 -17 27 -15 -9 29 -15 -13 31 -14 -34 21 1 -13 20 -14 -10 26
7864B6n1kL7ok5L9l0rM2l3k0N9k1k6L9j9j1N4m5k4M5j2k0L4l4LL0k0j0M2l1j0
7896iK1j4oL5l1k2O1l7nK9j6j4L0l2j3M4j9k0M1j9k6N0j3m2N1k3l3N1k0oL1l2
7928hj3L1j2j4L2j9j7M3k8k1L9%k7L7l4qM1rl1M1qk0J8Kk5L4l4pL4jj6J5qqJ9
7963A8pj5K2j5%J6k3j1L8k5l3N6k2j4K6qj0K1j5k7M4J9k5j9NLMnlJ7k3jRj0K2
7998IOk1j0K3nMPj6qK6j0j8K2Jj6J2%nJ6%k3J4NnrOlJ5nj3nJ4npjmK0mlOOj7j0
8041a1J3KNmk0MJ0J2Oj3j4NkKQRqqmJ3J4oj5J2Oj6pPJ3Jk4KJ2J2j2lJqRPj6K5
8083A9jjk8J0J4ojJk2J9KmoQJ8k6PkJ3j9Rj2J2J2j6j4J6KmllJ0kjk1PK3Ol1NK0
8124A0Lk4%J7j3OojJ4Qoj1OOmQOj6J2mnMOpnj3K4Lj9Qj3J0Qk0KJ9pj4MJ0j5J5
$$ plain form
7864 26 -25 -27 10 4 -21 18 -12 -21 21 -12 -32 27 6 -20 19 0 -11 43 -2 -26 19 7 -13 21 -13 -10 20 0 -10 32 1 -9
7896 -9 12 -2 -8 27 -4 -26 35 -2 -7 22 6 -8 22 -10 -23 21 2 -18 23 4 -22 28 15 -27 24 1 -32 19 -1 -7 24 -8
7928 -8 -21 10 -2 -16 16 -3 -20 23 -5 -26 13 13 -14 23 -11 -19 22 13 -18 23 15 -5 13 15 -10 24 -10 -17 17 16 0 15 7 -1 18
7963 18 11 -4 18 3 3 19 -4 -15 23 -2 -35 21 -1 -15 11 3 -7 14 -1 -28 16 35 10 -9 -4 -1 3 -2 -5 12 -11 -12 -3 -13 9
7998 9 15 -6 -16 7 2 6 13 -3 -11 15 5 -13 9 10 -6 6 6 1 17 17 -6 8 13 8 -1 5 2 17 12 -1 -6 8 3 -4 -5 -9 11 7 4 10 16 -1 -11
8041 -11 2 4 9 5 -15 -11 -1 11 17 4 -10 -5 -7 -5 3 12 4 -4 -8 5 19 13 -2 10 16 0 -7 0 13 14 -10 -8 4 16 4 1 2 -6 3 10 -6 19
8083 19 18 17 -11 -1 13 7 6 7 -15 4 6 2 -4 4 22 -4 3 1 14 -5 4 -8 4 16 0 -14 2 4 0 -3 -6 4 2 1 -20 -13 10 16 -15 -10 10
8124 10 13 -11 -11 6 -7 -1 -7 -8 6 14 8 -3 3 9 5 13 19 3 15 11 6 10 16 9 4 -9 15 18 -1 7 -6 4 12 -8 -6 13 6 -8 -4 6 -9 6
8166Fqj3LJ6oj6K1Lk3K0olJ5J1l2JK8j7j0J9oJkJ4k1
$$ plain form
8166 6 -2 -15 -12 4 -2 -18 3 6 -17 3 -3 -6 9 20 -12 -11 17 0 -10 9 3 4 2 16 -5
8191e
$$ Imaginary data points
##PAGE= N=2
##DATA TABLE= (X++(I..I)), XYDATA
0@%%%%%%%%%%qJ6j6J6j6K4l2L2m0M8n6O5p3Q8j04J20j36J52j69J93k18K43k74
33a45L06l43L83m26M75n28N85o46P15p94Q81r75J080j198J333j487J665j869K111
52A123k408K775l244L861m724O026q224J2854l7217M3901L4627j00048O5717K6447
66D1466r0288L1962O2515o4373J0031L9775m8014m113L9811k1757K395J3673k4063
79a0980N373J4074j8373J4396Q373k4653R160J1830j8773Q907J0395j2522J625
92a168K95l003R823r270J99J8047k2630p897L3431j9278j5431M0427j9555l3872
106b9882M1950K11l2111L3596N28l8265K3790J0104k0957K2713k028k6658K0401
119C392l080j5225L5993j0529l6064L5383j325l7099M3677J0867n3404K6024K3249
$$ plain form
0 0 0 0 0 0 0 0 0 0 0 0 -8 8 -8 8 -8 16 -16 16 -24 24 -32 33 -40 48 -56 64 -72 80 -89 104 -114 129 -145
33 -145 161 -182 201 -225 250 -278 307 -339 376 -418 463 -512 568 -630 703 -784 881 -988 1123
52 1123 -1285 1490 -1754 2107 -2617 3409 -4815 8039 -29178 14723 49350 -50698 15019 41466
66 41466 -48822 -16860 45655 -18718 -8687 31088 -16926 -21039 18772 -2985 -590 13083 -10980
79 -10980 -5607 8467 -9906 4490 12863 -11790 -2630 9200 -9573 -666 9729 -2793 -1168
92 -1168 -873 -3876 5947 -3323 -3124 14923 -7707 -15604 17827 -1451 -16882 23545 3990 -29882
106 -29882 12068 12279 -19832 13764 14292 -23973 -183 9921 -11036 11677 9649 -17009 3392
119 3392 312 -14913 21080 10551 -25513 9870 8545 -28554 15123 25990 -27414 -1390 21859
132B1859m6519J9354L5783m0788l862L0809k3040o249K6357r970j0689R701l695
145i49k309L234N89O074p012p990J2676l809q306J7759n081j6883J6185j496j4096
160a1414K0867p77k1435J6123N68j8073K3178L586k7433J6289P639k5258J8636
173B496J5287k8776O266J6085k2410N780K1019j7765n270J3032r564q22J1143
186F501n509j489J655o185N550K088o491R232j250j4101J1106M986j4076J0764
200B781O767j8148N717R985j3812N595J1554j4017j428Q878p690K578Q448q142
214i34j604L563n141M222M705n601J958j015o806Q109L456p611N458p72j0329
229h342R524M726j0807P141L490j3985O317Q859j1063L782P675j2562O32J0383
$$ plain form
132 21859 -24660 -5306 30477 -10311 -14173 16636 -6404 -12653 13704 3734 -6955 2746 -949
145 -949 -3258 -24 565 6639 -373 -8363 4313 504 -7802 9957 4876 -12007 4178 2682 -11414
160 -11414 9453 8676 -12759 3364 3932 -14141 9037 12623 -14810 1479 9118 -16140 2496
173 2496 17783 -10993 -4727 11358 -11052 -5272 15747 -2018 -7288 5744 -3820 -4642 6501
186 6501 992 -497 1158 -5027 523 2611 -3880 5352 4102 -9999 1107 6093 -7983 2781
200 2781 9548 -8600 -2883 7102 -6710 -1115 10439 -3578 -5006 3872 -3818 -1240 7208 -934
214 -934 -2538 1025 -4116 106 4811 -790 1168 153 -6653 1456 4912 -2699 2759 1987 -8342
229 -8342 1182 5908 -4899 2242 5732 -8253 -1936 6923 -4140 -358 7317 -5245 -4613 5770
243E770p312j014P954o065l161N494k340m66M099k186j713j42j091L522N67k810
259h94K865k192m718O323J592m984M865j193q469O620M926o794L506J944r285
274e888L641P015o000J277M298p899o58P244k278r34L100m414k001M281L01m67
290F18O20j916k41L31m77K705J39l194J518J56k740L419J650m281J535K033m107
307b232Q93L479k167k8J646l034n69K857k7j66K14j663l92N40M42K044k72k631
325a066M6j1l8L381K7l885N03Q04j490K916J770l714m03J136j990K104L269l089
343B70j974J457r28P93K854j729k110J138l25k59K038l5j504j65l64L10J487j97
361G57r33k1l15K21Q17n32k49Q84n18q07N85J84j91N84k4p27n6J37j05L77P94
$$ plain form
243 5770 -1542 -2556 5398 -667 -3828 1666 -674 -1140 2959 773 -940 -1082 -2173 1349 1916 -894
259 -894 1971 -221 -4939 1384 2976 -2008 2857 1664 -6805 -185 4741 -2053 1453 3397 -5888
274 -5888 -2247 4768 -1232 45 4343 -3556 -4214 3030 752 -182 2918 -1496 -3497 784 1085 618
290 618 1238 -678 -919 -588 -1065 1640 1779 -1415 103 259 -2481 938 2588 -1693 -158 1875 -2232
307 -2232 -1339 2140 -27 -55 1591 -1443 -2012 845 818 652 866 -797 -1189 -649 -207 1837 1565 -1066
325 -1066 -1020 -1031 -1069 2312 2339 -1546 -1043 -239 -1729 1187 2957 -757 -1160 -24 -2014 90 3359 270
343 270 -1704 -247 -1175 -382 2472 743 -1367 -229 -554 -813 1225 1190 -314 -479 -843 -533 954 757
361 757 -176 -197 -512 -291 526 -6 -255 629 111 -696 -111 73 -118 466 442 -285 -341 -204 -309 68 862
382H62n9j465o88J191P74J8L50j274j535J558J259r14P07Q7k672L63K610n38k30
401D04O99k529p74L427K62j899Q71n77j769J983J531j696p5N58j636K97K408m79
419A006j803M12L90n22R78O34j757l12J775m97j112J374j16j601J328Q86j659
436e96M23P33j626Q05J976j708j191J182k04K25J309j203j357R49L81O8O63n42
454B87q67q5J32J077P24j228q05J76K1J292O48j826m72R98l88L73J026j072p69
473g58O74j83K78Q84p32q38K41M21O75k56j064M71L95n06Q05j49j373J152O46
492G83j588R45Q97k093M64J754j420P4J109j973O8K469j070j203J066o94k51J683
510A020o10j055P89l33l78J077J4n28j77n66O50R75p24k82O2q17J050R98j673
$$ plain form
382 862 803 -662 -1350 -159 615 633 983 -291 -1826 -268 991 77 784 871 -1801 -1438 1172 634 404
401 404 1103 -1426 -2200 1227 1489 -410 461 -116 -1885 98 1629 -67 -142 416 -1220 -923 1485 1006
419 1006 -797 -385 5 -517 461 1095 -662 -974 801 304 -808 566 450 -1151 177 1063 -596
436 -596 -173 560 -1066 -261 1715 7 -1184 -2 -206 19 1328 125 -1232 -283 98 166 829 287
454 287 -580 -665 -533 544 1268 40 -765 -589 -568 724 1372 -454 -926 72 -316 57 1083 11 -758
473 -758 -84 -267 11 895 163 -675 -434 -13 662 406 -658 -187 208 -298 507 358 -1015 137 783
492 783 -805 140 1037 -1056 -592 1162 -258 -184 925 -1048 -980 1489 419 -784 282 -412 -663 1020
510 1020 410 -645 144 -189 -567 510 524 -4 -181 -747 -97 878 154 -128 -66 -883 167 1165 -508
529e08R8J195j504J64J789j410m72J575j444n12K338j004j537J795j90j169J404
546F08m11j317J643L24j564O32L34p96P68L15q17L11j3n37O18L00k58j4p57J46
566d85J333n54p92O69n10j32J505p55j276J246j19r39J525J68j604L80K11m35
584e64J367J62j596J28L06j06J116l59j222J039m9j207J418M08j704Q93P67j610
602h13P31J024j828J84J899p96q68M55n76J63J241k18p09j41l58M32O08k81K62
621D11j44j297N33J428o96n01M33o87K10J293p44j030O32J30R9O77o60n83L71
640a25n23M57J661j023j463R19l12l78K201l15k483J022J122j570O36J374j368
657a68n10J086l21n14M13K71k21l74P15M93j868k97K492o03j373J839r67k312
$$ plain form
529 -508 -410 785 -719 -555 1234 -176 -648 927 -517 -1029 1309 305 -1232 563 373 -796 608
546 608 197 -1120 523 847 -717 -85 249 -547 221 536 -281 30 17 -520 98 398 140 126 -631 -485
566 -485 848 294 -498 171 -339 -471 1034 279 -997 249 130 -809 716 884 -720 -340 -129 -564
584 -564 803 965 -631 -503 -197 -303 813 454 -768 271 222 -985 433 841 -863 30 797 -813
602 -813 -82 942 -886 -702 1197 401 -467 -12 -588 -425 816 598 -111 -252 -610 -178 430 149 411
621 411 267 -1030 -497 931 235 -266 167 -520 -310 983 239 -791 -159 -29 70 747 87 -496 -125
640 -125 -648 -191 1470 447 -1016 -97 -409 -787 1414 1099 -1384 -362 760 -810 -174 1200 -168
657 -168 -678 408 87 -427 -14 257 36 -338 377 870 -998 -1295 1197 594 -779 1060 93 -2219
675b219K756J097k717J282J085k898P48K323j532j51Q73j527M95J372j208L3M82
692B94j070J086P78j920M43J103j459N49J411j292m10L78m95R01M08q31M29p66
710d63p63K433m26k402K415M14l292K220J820l552R93K677l053k02L016j981j545
727a691K416J74j272K71P4j50j94M36J067j302j142K128m28j952K548N29l290
744a778J345J767k297Q55J575k413J10J907j284j25R77j124L45P06j246P88Q90
761I98j784K77J355j167K7J083j063m19J058L8n73l32P23N40j555J43K101j727
779b77j168K986j197k511L497J09l931K718K089m010P82K914k708m75K656j428
795D6j263J831l6j213L38P61k3r64J9J234p40p19J511o21j300J747k8j649J446
$$ plain form
675 -2219 537 1634 -1083 199 1284 -1614 -866 1457 -75 -226 647 -880 -385 987 -221 -188 294
692 294 -776 310 1088 -832 -389 714 -745 -196 1215 -77 -487 -109 -604 297 705 -126 303 -463
710 -463 -1226 1207 781 -1621 794 1208 -2084 136 1956 -1596 -603 2074 -979 -1181 1835 -146 -1691
727 -1691 725 899 -373 -102 -28 -178 -372 64 1131 -171 -1313 815 387 -1565 983 1512 -1778
744 -1778 -433 1334 -963 -108 1467 -946 -836 1071 -213 -338 639 -485 -140 566 -680 108 998
761 998 -786 -509 846 -321 -294 789 -274 -693 365 403 -170 -502 221 761 -794 -651 1450 -277
779 -277 -1445 1541 344 -2167 1330 1439 -2492 226 2315 -1695 -913 2001 -707 -1182 1474 46
795 46 -1217 614 578 -635 -297 464 441 -523 -504 730 -10 -729 782 161 -1139 608 580 -1069 377
814C77L93j583Q12K62p90J246m46j353J634j26j472J820j61k048J944M37k361
831a415J624J145k345N12J245j141M55L90j000N84k2m29J212r62q85K272j131
848A09j940L097k01l020K612O82l283K178J504l357J273K181k654l6J728j292
864d19K17R84j089K05K30p62R80q6p53J384q15j579K095Q8j643J783l61j917K144
883F86j47k078K482J13k586K124J41k627K693O21l300K336J228l625J613J992
899A666k915J137J902l023L45K229j843k8J476j189N0N66j060Q27L63j100J048
916D51j20j346J718j96k051K110N90k388J596N37k497J798J062k536J513J248
932A489k789Q11J453j963J190J288k485N52J428j992O40J631j557K57P24j821
$$ plain form
814 377 770 -813 -1 261 -529 717 271 -1082 552 426 -1046 774 613 -1435 509 946 -1415
831 -1415 209 1354 -991 -479 766 -375 80 470 -530 54 32 -397 815 -147 -1032 1240 109
848 109 -1831 1266 1065 -1955 657 1339 -1944 234 1738 -1619 -346 1835 -819 -855 873 -419
864 -419 -202 782 -307 -102 128 -634 346 260 -493 891 76 -1503 592 680 -963 820 459 -1458 686
883 686 539 -1539 943 1056 -1530 594 735 -1892 801 1422 -1878 458 1686 -1939 -326 1666
899 1666 -1249 -112 1790 -1233 -888 1341 -502 -530 946 -243 -193 373 -687 140 503 -597 451
916 451 331 -1015 703 507 -1544 566 1156 -1232 364 901 -1596 202 1264 -1272 241 1489
932 1489 -1300 -489 964 -999 191 1479 -1006 -454 974 -1018 -378 1253 -304 -47 677 -1144
948a144O24J459j072L52M11j527O72O32j184J345O41k098N69P46j509J412J109
965A438k336N55J340k013M40J835j528j01J252j564r7J708q74n23R53o12k23O74
983C24n28J03N50o58N1L15m14N87kj124P93O40j107O46M81j495N88R67j359O11
1003c1J300j801m42J493p33j8J406j220j005J336k02o69J206O1j128J46J85k11
1021c27O28L16o12m32J64L31n4p0M99j89p48L25K83m05O64L02j281J42J004p74
1041b34j01J093p06o94R04l13n30J256m8j386M58O57n95L20N48q25l06O52j56
1060fk24O77M4r60j21P72P4k57L22l05p33O57O10p67J49P53j033m94J270r4o36
1081c02P68l50j058J011O56j100K39P51r37k34R11k27l10O29l53q21O11O85o04
$$ plain form
948 -1144 -520 939 -133 219 630 -897 -225 407 -777 568 1209 -889 -320 426 -1083 329 1438
965 1438 -898 -343 997 -1016 -576 1259 -269 -370 882 -682 -779 929 55 -468 485 -127 -350 324
983 324 -204 -101 449 -209 -158 157 -257 330 328 -796 -3 637 -470 176 657 -838 -250 717 -642 -31
1003 -31 1269 -532 -974 519 -214 -232 1174 -46 -1051 285 83 -586 620 681 -447 -301 -116 -327
1021 -327 301 617 5 -427 -263 68 14 -56 443 254 -494 -169 114 -291 373 675 -606 -464 540 -234
1041 -234 -335 758 52 -642 262 -51 -581 675 627 -759 -301 356 -239 81 629 -196 -502 150 -6
1060 -6 -230 447 491 -469 -590 182 256 -1 321 16 -717 -60 550 -217 -68 685 -348 -842 428 334 -302
1081 -302 466 116 -942 69 725 -375 -136 615 -322 -556 355 128 -182 447 94 -727 -116 569 -35
1100c5j84O17m49n70P50K26o26N24J91j238L30J282p49m25Q64o91n83J203o1q34
1120d58Q52j0j254N62R98o15k14L93n48j78Q20N9o62K10L80o74j78J033r5q25
1140d04M87N1q41Q70O74j338J33J071j031k97J322n12o49Q73m23p21J076K38r09
1159c30J93L55l91j4L29Q7k07j55J70k65j08Q94j35j108O29N24j040N36Q49j250
1179d37J02R81j182RJ560r31q49J095l73m97J080k45q47O72P7o42M15L73k23k58
1199a20j43K76N7j48M45l15o93R38Q4j195J089O05j698O04J003j583O37J446j954
1218f65j38J917j394n72J868r33q92J443o89p66J498k33j025O85j40k17N89l71
1236c5m3M24p29J46O40p44M76O01j538L42J323j228J02J174j443jJ373j300lJ562
$$ plain form
1100 -35 -219 398 -51 -621 129 355 -271 253 444 -794 -464 818 69 -356 508 -183 -766 437 376 -458
1120 -458 394 384 -870 -308 690 75 -139 254 -294 -472 348 407 -255 -45 335 -339 -517 516 421 -404
1140 -404 83 134 -707 163 837 -501 -368 703 -328 -625 697 185 -464 409 -14 -735 341 579 -330
1159 -330 -137 218 -173 -187 142 229 22 -133 37 -228 -336 558 423 -685 -56 468 -572 -36 813 -437
1179 -437 -335 646 -536 -527 1033 102 -747 348 -25 -522 558 313 -534 138 215 -427 -12 361 138 -120
1199 -120 -263 13 70 -78 367 52 -641 297 381 -814 275 880 -818 -214 789 -794 -157 1289 -665
1218 -665 -803 1114 -280 -852 1016 83 -809 634 -55 -821 677 444 -581 104 -36 -253 336 -35
1236 -35 -78 346 -383 -237 403 -341 135 736 -802 -460 863 -365 -263 911 -532 -533 840 -460 -463 1099
1256A099j310n22J286q58K4J174j224j57J126j056J30J034j195L74Q35j719O89
1273b70J466j835L76J357k175O34J985k426K18K381k497l84K695j902n68K571
1289A626j999j101K771j114j323K172q42j265J712n81p69J516o23q04Q71n34K12
1306g5Q28j240K75R24j505O20J220j849P16J287k464P67K156k451K46K036k585
1323a094K96K592k595j10K752k548n77K832j997m53K638k337q07K952j796q64
1339a116K646j798r61K573j731q11K855j668j333K490j356r41K626j434j336K436
1355A141j098j365K345o96j244J763r19j028J941n17r70J228p77l89J280j014
1371c19J8J310j595RJ541j714M74J869k607M0K683k468l20L057k555q77L365k383
$$ plain form
1256 1099 -211 -733 553 -305 -281 893 -331 -488 638 -418 -288 746 -449 -75 760 -959 -270
1273 -270 1196 -639 -263 1094 -1081 -447 1538 -888 -670 1711 -786 -1170 1525 -377 -945 1626
1289 1626 -373 -1474 1297 183 -1140 1032 190 -1075 637 56 -713 803 180 -624 247 -287 -75
1306 -75 753 -487 -212 712 -793 -173 1047 -802 -86 1201 -1263 -496 1660 -791 -545 1491 -1094
1323 -1094 -798 1794 -801 -911 1841 -707 -1284 1548 -449 -902 1736 -601 -1408 1544 -252 -1116
1339 -1116 1530 -268 -1229 1344 -387 -1198 1657 -11 -1344 1146 -210 -1151 1475 41 -1295 1141
1355 1141 43 -1322 1023 327 -917 846 -73 -1101 840 323 -647 581 -196 -585 695 -319
1371 -319 -301 1009 -586 -577 964 -750 -276 1593 -1014 -974 1709 -759 -1079 1978 -577 -1454 1911 -472
1389d72j298L894j915k236L563j230k243L495r10k660L172l28k735K712J90k468
1405a469K089J20k227K011M64k098J319L58j438J214R4j084J166l26r92J229l60
1422G0m80J348j196p64J934r78p62K063j237j164K155j168j057K689j034j798
1438a379K227q11j385K588q23j760K478q66k001K715l64j994K555n96k511K741
1454H14J62k655K343N73k767J795P71k527J655J204k406Q43J196j794N39R71j288
1471e71N64P37j148K50L87o01N41J5m45P87m63p40R37l44k63J372r82r85J619
1490F67p92r69K153n00j563J803o80j826K481L38k263J635L97k390J425J127j934
1507h91J089J105k213K14J393j134K93J064j132j19O71q15J51Q56l99k1K1o49
$$ plain form
1389 -472 -1770 2124 209 -2027 1536 306 -1937 1558 648 -2012 1160 832 -1903 809 999 -1469
1405 -1469 620 740 -1487 524 988 -1110 209 567 -871 343 437 -647 519 193 -799 430 70
1422 70 -410 938 -258 -1022 912 -66 -828 1235 -2 -1166 989 -179 -1236 1453 419 -1379
1438 -1379 848 37 -1348 1240 417 -1343 1135 269 -1732 983 619 -1375 1180 584 -1927 814
1454 814 976 -1679 664 1237 -1530 265 1036 -1491 164 1368 -1038 -195 1001 -793 -254 717 -571
1471 -571 -7 730 -418 -168 219 -382 159 174 -271 516 53 -687 250 -94 -357 1015 33 -952 667
1490 667 -125 -1094 1059 559 -1004 799 119 -1707 774 1112 -1151 484 881 -1509 -84 1043 -891
1507 -891 198 1303 -910 -696 697 -437 -144 920 -212 -331 340 -475 -324 532 133 112 133 -516
1525e16M06L84m95M01K00o46K62M3n68O91L08p20L40J55p01M08J82n02P23K27
1545E82j003K01K75n15O56L49p78L44J18r53N26P21n76L04J36j097M13P61p62
1564b98L08P37r82j64O16o77K63J045p95n04P13m56l26Q64p6l89M18l36n56N58
1584c7L61k38k2k6j37oK8J32J9l7J97l16l35N95O5o17M73K73o74L02K98q08L99
1607a11P89q59j74Q23o07l11P85k91l06P19l52o77O29J84m08K63N8k73J25m6j50
1628a90K54J33q8j18k36J65K71k32J4K70l14j18K53k05J38M40m79l32M70n6j46
1649a06L26j90k11L29j67k33M01Q3l18J1Mj0K31p6j53Q7m7J7O0j75K07K20m92
1672b02m9M64k34o6L76m28j88O54k97m48P06j7o55L83J67m15L90J95o60J53M67
$$ plain form
1525 -516 -110 274 -221 180 380 -266 -4 39 -529 162 470 -250 90 245 -456 -48 134 -368 355 582
1545 582 -421 -220 55 -460 196 545 -233 111 229 -724 -198 523 -53 251 387 -710 -297 464 -298
1564 -298 10 747 -235 -399 217 -460 -197 848 53 -451 262 -194 -520 344 268 -121 297 -39 -595 -37
1584 -37 324 86 64 38 -99 -105 -77 55 74 37 234 -82 -417 178 243 -374 99 372 -302 0 298 -510 -111
1607 -111 678 -181 -355 468 -139 -450 335 44 -262 457 105 -572 57 241 -167 96 154 -119 6 -40 -190
1628 -190 64 197 109 -9 -245 -80 191 -41 -27 243 -71 -189 64 -141 -3 437 -42 -374 96 40 -106
1649 -106 220 30 -181 148 -19 -252 149 232 -86 -75 -71 -81 150 74 -79 8 -39 -22 38 -137 70 290 -202
1672 -202 -251 213 -21 -87 289 -139 -327 327 30 -418 288 271 -384 -1 166 -249 141 336 -324 -171 296
1693B96l32j18L20j21j32J01o5K0J44Kj98j40K62K41l54o9K90k33q3L99k23j61
1715a54M60l13m86O57J62m91K51J4m85M13K63n13K47L40n71r3M00o4O2J12l69
1736a58n5K53k1K6K6n9M7j82j52M17J10l27J08j01k55N19Q6n38L00K14n83J71
1758a54M58l62R2K02n76Q8O01k60k24K36j81j01K77n5k1J46j78j95M4K10K44k05
1780H6l28K29Nj83M03j3m24L47n5n73N90M68p43L4L32n50K79O15o26j23N31m85
1802a84k03O54o5k32J23l17n7M48L5j68j1j75R4N9j24L45R9n36K7J70j87M65J65
1825D25p27R1L74m19K26M70m89l4J95n29K72O88m68k49K52l67J38N06l39m8K43
1846B11m52n8M49o3J20j7n84J95L96k72K35J20o32K58K90n94M81N66r35r7O02
$$ plain form
1693 296 -36 -154 166 45 -87 14 -51 -31 113 115 -83 -223 39 280 -74 -143 147 -86 -169 230 7 -154
1715 -154 306 -7 -493 164 326 -165 86 100 -385 28 291 -222 25 365 -206 -299 101 37 99 211 -158
1736 -158 -213 40 19 45 71 12 59 -123 -275 142 252 -75 33 -68 -323 196 282 -256 44 258 -325 -154
1758 -154 304 -58 34 236 -340 -252 349 89 -135 101 -80 -181 96 41 20 166 -12 -207 -163 47 291 86
1780 86 -242 -13 -8 -191 212 199 -225 122 67 -506 84 552 -191 -157 175 -375 -96 519 -107 -230 301 -184
1802 -184 -387 267 202 -30 93 -224 -281 167 202 34 23 -152 -58 1 -123 222 321 -215 -188 -18 -205 260 425
1825 425 -302 -211 163 -256 -30 440 -49 -83 112 -417 -145 543 75 -174 78 -289 -151 355 16 -32 211
1846 211 -241 -299 150 87 207 190 -394 -199 197 -75 160 280 -352 -94 196 -398 83 649 -286 -383 219
1867B19n06K48O80q01k21O36m30p5O49k65k40J41l92K10N55l41l3L5n27M41L97
1888C80o14L68L62j032K01P41o08L24N12j158N8R51o57O9P41q79j51P27o64J69
1908a60R29q32m15O68m70J34Q03p21k48O01n91QP74m43l4K49q25L20Q25o93J54
1929C3L97j076L87Q94j026L15R54j429j12J285q60K2J137j280m18J349o78k89
1947c95J159p91n02Q68o48j2J149q24m43P46p34J45J108r88k14R73j055j10J319
1966G51p93j98R00j199j35J452p77l00R95j081k52J263q22j00J225j187n10J252
1984D84o83k8J195j225m55J251q07j04J277j025l72J032j119R3J622j227m95J240
2002F54j203j24J815j223o02J610j259p29J963o87q25J444j019r04J808l91q87
$$ plain form
1867 219 -287 -39 641 -160 -381 255 -175 -250 399 134 -106 35 -357 -147 408 67 34 69 -458 -17 380
1888 380 -234 134 496 -536 -335 406 -202 122 634 -524 -466 485 -172 -103 638 -241 -392 335 -329 -160
1908 -160 769 -63 -478 190 -280 -146 657 -64 -312 289 -302 -294 480 37 3 252 -573 -253 572 -121 33
1929 33 430 -646 -259 635 -391 -76 878 -551 -663 622 -238 -216 921 -359 -777 572 -106 -395
1947 -395 764 -27 -529 339 -309 -321 828 4 -439 307 -427 -282 826 -162 -376 597 -458 -568 751
1966 751 -42 -240 660 -539 -674 778 1 -299 696 -385 -637 626 -196 -296 929 -258 -768 484
1984 484 -199 -227 968 -257 -712 539 -268 -372 905 -120 -492 540 -579 -486 1136 -91 -586 654
2002 654 -549 -673 1142 -81 -683 927 -332 -1061 902 215 -610 834 -185 -1089 719 328 -559
2019e59J218o42q47J256l72m77J210p55p83J081m42j67J146r97n42J191q02k00
2037d83J411r87m85J167j155j59J850j084p57J393j172l94J971j014q19J643j210
2054b84r02K047n76q41J505j192j009J981m53q85J530r25j100J650n28o91J758
2071A085q61j330J534l99p36J663p00j199J451m50r08J548l24r99J083n60p03
2088h05J505m13q24J006o44m51J314p11m56J262j043n79J566p69l94J435j400
2105d01o76K000q94p04J808j255j092K030q37q67K227j041j686J897l85j046K073
2122A151o43j717J621k21j236J793m6j418J040l43r52J575l9j065Q91m47p20J266
2140D90l50n81J186p70q06J319n02m34J334j019p18J556p48o48J578q91p86J527
$$ plain form
2019 -559 659 17 -830 426 54 -423 787 32 -751 330 -112 -279 867 -130 -672 519 -283 -483
2037 -483 928 -59 -544 623 -532 -691 1159 75 -682 711 -461 -855 1116 102 -717 926 -284
2054 -284 -1186 861 285 -556 949 -243 -1252 729 276 -609 921 -4 -1104 546 18 -673 1085
2071 1085 224 -1106 428 29 -707 956 256 -943 508 58 -850 698 374 -625 458 -102 -805
2088 -805 700 287 -537 469 -175 -626 688 -23 -479 783 -260 -839 727 -42 -436 999 -401
2105 -401 -1077 923 29 -675 1133 -122 -1214 816 -21 -888 1339 298 -1388 509 124 -922 1151
2122 1151 508 -1209 412 191 -1045 748 702 -716 324 -19 -971 604 565 -500 391 -56 -776 490
2140 490 140 -441 745 -25 -831 488 -14 -448 886 -133 -851 705 -43 -691 887 -4 -790 737
2158G37q93o59J852q85j123J613o93p78J837q20j197J715o66j094J923m06j326
2175h63J468o00j183J967j28j485J273k96j229J560P0j183J184k65j344J244K58
2192D48q36R70l79j078J100L0p07R89l02q46R06l76m92J320m96r30J073m89n43
2211f38J431o18r25J412o14r91J613l09j064J359n49j203J704n6j346J283j75
2228C14j276J345P4j184J261q4j429J130K86r82J032j00j289J073K39j062J038
2245C86J39j199P88J19r06J083K10j229O46J89q00R17J16r85P37J5r29R19K58
2264D74q37O47j75q91J071J84r30P44o1r36R34J06q54R61n1j198Q83L13q58Q87
2284D13Kj209R06L47j061Q13L58j138N64L23r03P65M32j102L94M10p68N67L28
$$ plain form
2158 737 -156 -815 1037 152 -971 642 -51 -829 1008 188 -1009 706 40 -1054 869 463 -863
2175 -863 605 5 -1178 789 661 -824 449 153 -1076 484 554 -629 555 290 -1054 190 448
2192 448 -388 582 203 -875 225 255 -452 537 235 -611 295 -81 -573 747 251 -679 394 -95 -638
2211 -638 793 175 -750 662 48 -943 670 361 -703 656 107 -1096 608 552 -794 489 314
2228 314 -962 383 457 -727 534 450 -979 151 437 -545 487 387 -902 171 410 -652 386
2245 386 525 -674 114 233 -673 410 620 -609 37 226 -574 343 459 -526 211 226 -703 216 474
2264 474 -363 284 109 -782 289 473 -457 287 226 -710 224 330 -524 437 386 -812 71 384 -474 413
2284 413 415 -794 112 459 -602 211 569 -569 -5 318 -585 180 612 -490 -96 314 -454 113 441
2303D41q48M81K42q76N31M70o68L84R0q53O08M27p24M26K40q36L71L33n43N48
2323B44K64r73K49M37m77M65K28q21K82L39o09M21M23o77J29K16n43M82L84p38
2343b75J45L62n04K95K99o33K68L52o08K36M29n62J00L14n19K92M38o43J3M27
2363B26l93Q7L15l96J37L03n04L9L47k44J52J85m63Q7K44l95K57M28m23o3R6m29
2385d07L46N60m64j35K07m03J23M62k44qK01n15k0N05j45l8J51l60M5L77l04q8
2407a54L42k02l2K21k69l8K84k47nL50j89j80Q8j46J49L19k82j31J85j65L3K15
2429A46k21O2K20l14n9K70j64%K20k21N1K01l84n9M13n0m4Q5l75qL74j13l0K46
2453B46k74j88K01k4O9K47k94k23K38L2j6P9j45NJ49j40l8J39j04K7Q7j50J08
$$ plain form
2303 441 -407 74 316 -560 -29 441 -227 157 247 -606 2 429 -295 131 371 -465 -94 239 -304 244
2323 244 508 -465 -216 221 -256 209 437 -384 -102 237 -372 49 472 -205 -76 140 -403 79 463 -275
2343 -275 -130 232 -272 23 322 -311 -43 309 -299 -63 366 -196 -96 218 -301 -9 429 -214 -201 226
2363 226 -167 -80 235 -161 -24 279 -225 -186 161 -83 69 254 -209 -122 122 -273 -16 412 -11 -74 22 -407
2385 -407 -61 499 35 -100 107 -296 -173 289 45 37 238 -277 -297 208 63 25 176 -184 -139 238 -66 -154
2407 -154 188 -14 -46 175 -94 -132 152 -95 -100 250 61 -119 -31 -177 -28 291 9 -122 63 -102 -69 146
2429 146 -75 -13 207 -107 -166 104 -60 -60 160 -61 -10 191 -193 -252 161 111 67 152 -223 -231 143 30 0 246
2453 246 -28 -216 -15 -39 30 277 -17 -240 -2 30 14 93 -52 -47 102 -38 -76 63 -41 -14 73 -77 31
2476C1R7k95K5K66q9kN6k56O1K73j62q2J91j21m6P7j21J04J57k06l9J32o2RK7
2501B5j22J40J26k60k8J61q0Q4Q5k57P6J72k05j3K42r7r2M4q2O3J62j08j33P1
2525b6O2Po8j7J17n1j11J16l8n3K26j66k30L47K4l18K08R0k79J95P5l21K48K21
2549B58l96j4K74j50K1J32k21KK05j22o4J32j8q6j0L2J06l2q0mp7J26K08k62j54
2574a94L06j07j63L18q2k64K98o1l01L84J06m67J53K09k10J15Q6l12J39K20k18
2595d5LP1j06J02J3j45K00m5k68K20J37j88J60p6l49L22K76l66J1J50k37J30K22
2618A92k44J9J23k29N0K24n5l5j13j34K73J07j91K5q3j03L30m6k70K85p6l42L65
2641G2J49l79K44Rm66M67L12o60J31L36m37K32L74o12J3N22l97j03N03k75l08
$$ plain form
2476 31 128 -167 -142 124 35 33 89 -167 -106 167 5 -77 114 -7 -53 24 -97 7 164 -42 -81 51 -11 -2 25
2501 25 -97 43 169 -91 -119 42 -38 46 131 -126 -50 122 -83 -96 146 49 -43 1 -81 -18 144 36 -97 -26
2525 -26 36 43 -25 -42 75 24 -87 29 -9 -62 164 -2 -232 115 139 -179 29 119 -160 35 110 -211 37 258
2549 258 -138 -152 122 -28 -7 125 -96 -94 111 -11 -75 57 39 -47 -57 -25 81 49 -31 -35 -112 14 222 -40 -194
2574 -194 112 5 -158 160 78 -186 112 51 -250 134 240 -227 -74 135 -75 40 126 -186 -47 173 -45
2595 -45 -42 29 -77 25 38 -107 93 48 -220 0 137 -51 109 33 -316 6 282 -84 -73 77 -160 -30 192
2618 192 -52 -33 90 -139 -89 135 80 45 -68 -202 71 178 -13 12 -71 -174 156 110 -160 125 49 -293 72
2641 72 221 -158 86 95 -371 96 408 -252 -121 215 -222 10 384 -228 -215 307 -90 -193 310 35 -273
2662b73L34l3p9K46j80k66J75J66P2j27k04J40N3j39K62J8l95K12J19l59L81K68
2684C91o76N5M61l01P3L10n10l3M92k88j00L43k54j44L00j46j4K48k98j23L47
2705A33o3q0J03k56N2L64k33j34K21j93j3L04j92r3K27k77p6M42j06k19J43k02
2727a48l3M51j08l58J90mj46K64K9j96O5n1j23K28J16j48p1j13Q2K42j12j36J54
2750G4j34m4K63j69j51L40j35l44M13O4l79K28J23l43K39J59m66J69L73l07o5
2771i2J91k22M9K49j80m6J46k03j2K26p8O6rl36J34L25j83qQ6l17J15K88k41N9
2795GK33l87o9L48j68O3K17m36o0M57k03r3L17k80j47L54k19p7M20k16k74K59
2817D6o7k8K41k04r7K27k12m9L27k05jK49m60j6N88l13k19M48l19k61N57j81k81
$$ plain form
2662 -273 61 28 -51 195 15 -251 -76 90 162 35 -169 -29 24 -115 147 165 -230 -18 101 -258 123 391
2684 391 -285 -230 231 -70 3 313 -197 -230 262 -26 -126 217 -37 -181 119 -27 -41 207 -91 -214 133
2705 133 70 -10 93 -163 -111 253 20 -114 107 -86 -99 205 13 -80 147 -130 -206 236 130 -89 54 -148
2727 -148 -181 270 162 -196 -6 -10 -156 108 137 -59 6 -45 -168 60 176 28 -43 -156 -74 168 56 -80 74
2750 74 -60 -104 159 -10 -161 179 44 -300 113 177 -202 26 149 -194 45 204 -262 -93 280 -27 -92
2771 -92 99 -123 -74 175 -5 -51 95 -108 -120 106 28 94 85 -251 -117 208 25 17 103 -214 -99 189 -52 7
2795 7 240 -147 -216 132 -36 27 244 -192 -252 205 2 -91 226 -54 -201 153 -66 -143 277 61 -213 46
2817 46 -21 -49 192 -12 -109 118 -94 -143 184 -21 -22 227 -233 -249 339 26 -193 255 -64 -325 232 51 -230
2840b30N15j88m79M30R1k43K90j40l39L63L1k30K89q5k44K41j31j39M65j27l74
2861b34K64p4j49L91j01k70L21j70k85M40J0k10K69k94l02N74%l50L74j47m26
2882c69M68M0l23M40q7n46L38J84k20K80j18m26M17O2l47L83l9m35L93M0m16M53
2904A72Q2o29L30L06m44K52J35m84K37K88m09J15K30k60R7K6k53K76Q2k74K29
2925A04pl42K68L1j95M50p5n93K54J34j75M87p7o25L27P4l64N56J82o44J75R5
2947D0m43N68L19p18J20K82l92K49K53m96J79K62l90J69J96l96J56J61k71L09
2967A57R8n80J76L24k54K19P4n09J94K58l16J75J88l35J18J02k85K56P4l60K87
2988F1J74l50J33n0l13M86K68n01O4J5l72M27K81l58J80p0n76L97M21l14J70l6
$$ plain form
2840 -230 285 97 -382 48 139 -104 186 46 -293 70 101 -129 160 75 -169 72 -59 -198 267 140 -234
2861 -234 30 -44 -193 198 97 -173 148 -22 -307 133 143 -67 202 -92 -394 180 180 -170 204 57 -369
2882 -369 99 139 -184 256 169 -377 -39 145 -75 205 87 -339 78 140 -207 176 137 -298 95 135 -281 172
2904 172 254 -375 -45 261 -183 69 204 -280 -43 245 -164 -49 181 -79 18 44 -209 67 149 -125 104
2925 104 97 -245 23 54 -141 309 234 -359 -105 29 -146 341 264 -361 -34 40 -324 232 414 -230 -55 40
2947 40 -403 165 484 -234 -114 168 -224 25 278 -218 -39 223 -167 2 198 -198 -42 119 -152 157
2967 157 255 -325 -149 175 -79 140 214 -295 -101 157 -159 16 204 -131 -13 89 -196 60 134 -226 61
2988 61 235 -115 18 -32 -345 141 409 -92 -28 -13 -385 42 323 -35 145 75 -501 -104 317 3 173 137
3010A37o02L98M09m81J39K63m73J15L16l85J13K79l62Q3L05l18l9J13j82K89J95
3031C12m39pJ52j87K56J50l60J05J03l04J86K40k80P5P0k46K45R0m02J96K09k47
3053h3K23j1n02L25L05l85K03J88n49R2L38k54K29K19n53k1L37j53J32J41l95
3074a74R3K26l10J25K55l17O7J77l19J50K53l92Q0L01k72K0J34k73J67K51l47
3095a05K4K04k62J29J76l19J48J86l67J04K82k71K0J53k65J75K00l46N1K02k25
3116a06J63J02l53J98J80l86J72K72l82R8K35m00J64L49m38m3L89k52n8K47k31
3137h0%K54k32m8K15j40K6P8j90J32J09k44J17J36k33J04P8k96K82J97m32R4K14
3160A41l11J89K05m14J49K64m36Q9L77l37j9K92l27K9L55l37q8L21j32n3J13j97
$$ plain form
3010 137 -465 -67 342 -139 0 263 -210 -95 221 -164 -51 228 -134 -51 254 -64 -103 10 -172 117 312
3031 312 -127 -134 18 -169 87 237 -123 -18 85 -219 -33 207 -73 2 72 -174 71 161 -241 -45 164 -83
3053 -83 140 129 -373 -48 257 -128 75 263 -286 -194 144 -110 119 338 -215 -236 101 -52 80 221 -174
3074 -174 -81 145 -165 -40 215 -102 -35 142 -177 -27 226 -166 -86 215 -57 -37 97 -176 -9 242 -105
3095 -105 -81 123 -139 -10 166 -153 -5 181 -186 -82 200 -71 -51 102 -163 12 212 -134 -83 119 -106
3116 -106 57 159 -194 4 184 -202 -30 242 -140 -42 193 -207 -43 306 -132 -175 214 -38 -96 151 -80
3137 -80 -80 174 -58 -106 109 -31 -5 73 -117 15 124 -120 -3 133 -100 4 82 -214 68 265 -167 -73 141
3160 141 -170 19 224 -190 -41 223 -213 -124 253 -84 -103 189 -138 -109 246 -91 -179 142 10 -43 70 -127
3182a27R1J62j82R4P8k75J51J24k91K71J73n34J26L56l09Q2K52m33L1M05l06n9
3204a20L08k34n7K20j77L3J91k76L4K11j60M3O2k78K02K23l35P3J64l09J95J85
3226A98l81J75K32m65J49M03m45N0K91m45J22N05m91j74M90k37j32L99k32k02
3246a90L09j15j21K50p5r5J8j37K14J57l50R6J57l23K45K33n09J42L99n11L2N13
3268C39m30j14M46l50n2M69l60k19M55j49j63K95k37j16L98k03j47K86j75j24
3288a51K59j57L1K23l27m4L08k04O7J99m34R0M16m07j9M89m54j25N21l64j48N94
3310C63l35l76N44q2l26L36q6j96L07j08j86K36p4p2J90k36J9K96l16l6L97l07
3332d8r9L44l10p3N10l21k75M46j67j91L81j66k39L81j71k43M03m8k63K07j01
$$ plain form
3182 -127 -36 126 -56 38 116 -159 -8 116 -175 96 269 -265 -139 217 -92 -10 242 -191 -160 245 -61 -120
3204 -120 188 -46 -103 117 -60 -27 164 -112 -78 133 -27 16 78 -200 2 225 -110 -37 127 -182 13 198
3226 198 -183 -8 224 -241 -92 311 -134 -84 207 -238 -116 389 -102 -276 214 -23 -155 244 12 -190
3246 -190 119 4 -117 133 58 -37 -19 -156 58 215 -135 -39 118 -205 40 273 -236 -94 305 -206 -174 339
3268 339 -91 -205 241 -109 -161 308 -52 -271 184 35 -128 167 -70 -186 212 9 -138 148 -27 -151
3288 -151 108 -49 -18 205 -122 -166 142 -62 5 204 -230 -140 276 -131 -150 339 -115 -240 281 -83 -231 363
3310 363 28 -348 196 114 -212 124 38 -158 149 41 -145 91 17 -55 135 -101 -82 214 -102 -138 259 -48
3332 -48 -147 197 -113 -186 324 3 -272 174 7 -184 197 31 -208 173 2 -241 162 114 -149 58 -43
3353d3r3L25j19k17K10q6p5K03j50lK06k76n2L46j94n7K73l34o8M79k73k58M79
3376B23j52l17L83p4k67L51nl69K35J32k07P6K9o4Q9q2o2J45p6K0P3k09L2K85
3400A89k41q2L06j87j25K52j35r7L23j86k45K97lj34J80j20j28K25o3j45K14l
3422I2j71Q6k2k0J50r0j19J07j6K0N2j36L6J48j96LJ98j35l9J55j98kK80j95j51
3447a63K43qj64J43l9o7J41o0q6P0k0L3J7j37J12J11k49L9K31j85pJ72k59PL33
3472B08k02j58K59j10j37K29p0p6J67j38j21J93%m3P0j57K5J79j47j5J38j28k
3495c6J10j80Q6J88k25l3K00j54RJ77k49M9K80l10n2L06j76o4K44k50o1L32j94
3518cj25K49j16r5J91j58J6K19k47p4K37j17OK01l19rL32k72n1L67k47j62K90
$$ plain form
3353 -43 -136 189 70 -147 63 -23 -98 105 -45 -48 158 -118 -170 176 -18 -75 198 -136 -204 275 2 -256 223
3376 223 71 -246 137 63 -204 147 142 -227 8 140 -67 9 38 -26 63 -19 -81 64 -12 8 81 -128 -96 189
3400 189 -52 -134 172 -15 -140 112 -23 -120 203 17 -228 69 66 -68 112 -8 -136 89 26 -119 95 92
3422 92 -79 7 -15 -35 115 25 -94 13 -3 17 69 -67 -31 117 -79 -76 122 -13 -52 103 -95 -97 183 -12 -163
3447 -163 80 72 -92 51 12 -55 86 26 -60 10 -10 23 40 -97 15 126 -123 -84 147 -38 -45 127 -132 -125 208
3472 208 6 -152 107 -3 -140 89 19 -57 110 -28 -149 44 44 1 71 -86 -61 118 -29 -44 94 -34 -36
3495 -36 74 -106 -20 168 -57 -90 110 -44 -35 142 -107 -58 222 -88 -140 166 -10 -74 170 -80 -141 191 -3
3518 -3 -128 121 5 -90 101 -57 -41 178 -69 -143 94 -23 -17 184 -135 -144 188 -84 -135 232 -15 -177 113
3541A13j84p5L99k04k83L06m6j54K57q9j26K01j41j09K18l7p4J18j91J6K26k01
3563f0k2K55k22m4K41k72J1L76k87j70L40j67j38L42j78j73L51j71k17L53o2k44
3585a58K35r1j31L52j43k64K61k1j63K51q2j95K34r4j85L11Rk23J48j02j10L07
3607A46m1k46K19l8k04K35lj80K43k7l10K18R4j96J17N6j65J19oj42J32O2r6O8
3631E5j20l9K37j03j35K30r6j91K83p1k20L23o6l45L14J14l09J68O8k75K18J27
3653A67l15J28J50k55J17J21k14J31Q6k95J11K21k20K3J32j74M4J43j76J0J74
3674A09j32k3O4p5J04L9j65Q4P4j56P2P6j31J18N7k43P1J83j49J3O5j23P0O3j52
3699h7R0Q7j51N3L2j40J81P9k97J21J83k51N6J96k24L3J91k67j0K83j35j19J69
$$ plain form
3541 113 -71 -146 253 49 -234 72 26 -128 129 40 -86 115 -26 -135 83 46 -28 90 -101 -85 141 -60
3563 -60 -82 173 -49 -93 148 -124 -113 263 -24 -194 146 -21 -159 183 5 -168 183 12 -205 148 86 -158
3585 -158 77 -14 -145 207 64 -200 61 40 -123 128 46 -149 85 -9 -194 117 126 -97 51 -51 -161 146
3607 146 105 -141 78 40 -164 71 68 -112 131 104 -206 12 106 -90 27 83 -82 37 31 -111 21 83 -13 55
3631 55 -65 -104 133 30 -105 125 29 -162 121 50 -170 153 87 -258 56 170 -139 29 97 -178 40 167
3653 167 -148 -20 130 -125 -8 113 -101 30 116 -179 -68 153 -67 -44 88 -86 -42 101 -75 -65 109
3674 109 -23 -46 18 -57 47 86 -79 5 79 -77 -5 71 -60 58 115 -128 -57 126 -23 -10 55 -68 2 65 -87
3699 -87 3 90 -61 -8 24 -116 65 144 -153 -32 151 -100 -44 152 -72 -39 152 -115 -125 158 23 -96 73
3722G3j23j6J68j13n6J86j34j02J49l1NJ17j78q0J81oj04J05j3q8N2jj0Q7k2q7
3748d1pPJ07L3j52K0R8j20K7J12q7rR1j72j0K19o5j02Q3o0m5J35r6k1J81j42j18
3775a34J45j1l4J67j27j78K16M1j93J57O8k02O2O4j10J18R8k11m5J16OK6Np9J0
3800b5j0k7R6L9p6J1o4p5J95Q3j65qM5q0N5Q0o3L4Pj48M4Q1J8M3o5j30J18J6j09
3829h0J22N2j36N4j2j43J75J14k04J9P9j35Q2Q7j24Q7P0k28L4J93j08KO5j73M0
3854f8K10j59o7J47p5n5J17j8m9M3p4n2J37O9m5r2q6J04O1l7M3J0j46L2N6n7J16
3881F5R2k29l7J43n5MJ12j08k0J13j27p0J63Km4L9r8k4R3k8j3J23n3j14K8k0Q0
3908A7J20j19r9Q3k9J4R7p1q9J35p2q4J72mj46M8N8n3Q3j0j75O6J56o3l0L1p2
$$ plain form
3722 73 -50 -66 102 -11 -67 119 -15 -117 32 1 6 123 -55 -135 46 40 -64 41 28 -60 -8 -9 -19 68 46 -41
3748 -41 -48 -41 66 99 -53 -33 65 -55 -28 84 -3 -12 79 -93 -103 116 51 -51 32 -28 -73 62 -34 -55 126 -16 -134
3775 -134 11 0 -34 133 6 -172 44 85 -108 49 117 -85 -23 41 -69 49 147 -64 -109 7 13 39 44 -35 -25
3800 -25 -35 -62 34 73 -3 8 -56 -131 64 147 -18 -26 19 -61 -6 74 11 45 52 -96 -52 29 47 90 25 -105 13 29 -80
3829 -80 42 94 -42 12 0 -143 32 146 -58 -39 40 -95 -13 74 -50 37 107 -121 -87 106 -2 0 65 -108 -68
3854 -68 142 -17 -84 63 -12 -67 50 32 -17 26 -48 -100 37 106 61 -31 -117 -13 48 11 54 64 -82 -50 6 -51 65
3881 65 157 -72 -109 34 -21 -17 95 -13 -33 80 -47 -117 46 48 4 43 -55 -79 14 -14 -27 96 43 -71 -43 -63 17
3908 17 137 18 -81 2 -27 -13 84 13 -76 59 -13 -97 75 71 -75 -27 31 -22 61 51 -124 -58 98 35 5 36 -36
3935c6k2N7K1K6Oo3n4J0R1P3j02p9R4Jl6M2n1kR9m5r7P2Qo4O7M6r4N0l8j13J55
3966B2J32j56o8M9l9Q3R6j33o0P7k2j4R2J1q8l6jN9P6k9r8pM6N7Po9k9N4Mm4M1
3997A3M2q3j1M6j0J8L4q2l0J22M7j54j7J05j0k1M8q8o3J33J4j16P5O2j48pJ43
4024F2mo8K1n8n2J64O5j95j7J12m3k4J32p6j01R6m1o2J98Kk14O4P2p6J02L0j86
4051i7Q6J21j70qJ48r0j6O9o1k5Q7l2k0L5qj3o5%J53k8j31N5ko8J77Jk26J09J16
4080I7k06P9J90j96m6J17q7L7J31j12r3O5N1K2l6q3R3j3r4J45k8j39J64%k20K08
4106D6J25l25J13K30k68L5K05k90M8L38k76j54K88j20j16L01j41j92K34o7j50
4127a36K39M4k26K9L9j8Q9j4p6l8%J30Mj77J58M3k63J55K18k98L8K33l33N5M02
$$ plain form
3935 -36 -58 -1 20 46 52 -11 -65 -55 36 109 7 -72 22 23 -13 29 -22 -24 75 30 -67 5 13 -51 16 62 -32 18 -20 -133 22
3966 22 154 -2 -70 -21 -60 23 119 -14 -74 3 -19 -33 59 70 -18 -54 -55 4 80 51 -47 -54 -8 49 56 -13 -42 12 16 -28 13
3997 13 55 -28 -39 7 -3 15 49 -33 -63 59 106 -48 -65 40 30 9 57 -31 -94 39 53 -63 12 74 -74 -81 62
4024 62 58 -10 11 -47 -99 65 130 -65 -82 30 -13 -37 95 19 -82 14 -27 -89 109 111 -103 -39 33 -43 59 89 -97
4051 -97 -11 110 -60 -68 80 -10 -26 43 -18 -43 44 12 -8 27 19 6 -59 -59 94 66 -65 -10 -12 -80 97 98 -128 -19 97
4080 97 -109 -30 160 -36 -82 35 -52 -15 116 4 -89 -24 27 49 13 -70 23 10 -84 61 33 -106 58 58 -162 46
4106 46 171 -154 -41 189 -79 -44 161 -129 -81 257 -19 -173 115 -5 -121 180 39 -153 81 14 -136
4127 -136 103 147 -79 -50 -11 -29 60 46 -30 -68 -68 62 66 -111 47 90 -173 -18 200 -98 -60 173 -160 -105 297
4152B97l44j88M01j18k09L16j14k54L21jk73K07M2j86R9M3o1R0r5p6J62l7j2J02
4176A12k33QL02j78j25K84k16j60L99j36k06L53j69l36M21P9l62K18O3l30K54
4197D2J36k92P1J55j84K8J05n2J6m4k3P9o4L1J00k21M1L10l04j29M08k11j93M16
4221B21j90l23M79m6m27L95R5m69K65J93l57J81J68l86R9K80k09j3J10j20K3N9
4243B8l8L9Lo7O7p6k0K35j61j75K64o5j81K80o1k74L02Nl43K84J50l32R9J46k46
4268a37J25J67k41K3J64j50pQ4j3L6o1p4J18j1p8J66j42j05K79j02k36K97K5l16
4292a89K33O2l03K31J60l68J04K60k97%K44j58l7J52j30p2J86K2j34LK1L0l0J6
4316FP2r4n6J20p2l1K25j49k35K64N0k08J87J2k68J64J41k50R6J77k36j5J95j19
$$ plain form
4152 297 -47 -235 166 48 -161 155 41 -213 108 107 -166 41 83 -103 -4 39 -22 68 -27 -103 59 22 10 112
4176 112 -121 -113 189 11 -114 170 -46 -206 193 57 -149 204 35 -301 120 199 -163 55 118 -212 42
4197 42 178 -114 -43 112 -72 -44 61 9 25 -19 -42 37 -27 4 104 -117 -76 234 -70 -199 209 -2 -195 221
4221 221 31 -292 187 141 -286 109 204 -265 0 193 -164 17 185 -201 -102 178 -31 -44 66 -54 -31 28
4243 28 -10 29 32 -35 32 -44 -64 171 10 -165 99 34 -147 133 72 -202 100 105 -238 46 196 -136 -37 109 -137
4268 -137 -12 155 -86 -63 101 -49 -56 28 15 51 -10 -84 34 23 -55 111 -31 -136 143 41 -195 102 127 -189
4292 -189 44 106 -197 34 194 -174 -70 190 -107 -107 137 -21 -58 94 -36 -108 78 100 -34 -31 -10 20 -10 6
4316 6 78 -16 -72 48 -24 -55 170 21 -214 50 100 -108 79 91 -177 -13 128 -122 -26 151 -85 -100 95 -24
4340b4lJ00j35oJ41k1r2QJ1P1l2n6N7k0m2J09m4j08J47j7j78J69R8k16M4J00j22
4367f1R7R3k16j8J84n5l2P3o6m6L1J1M9K1n4k5n9L4J64q0j40J24j2r8J30Mj74
4394a21J71N3k28J05J17j86L0J42r0%O1j47LJ89m5o6Lk3L6L4k7J3j8m5N2j8pJ05
4422I3q0j23J71K7j32N6%j03J73O3k35L6R9j17O3J10j08k5M7j02N8J13o3l7kj0
4448b8P7k6j10J08K4n6N5n2j26J62N9j53R9L0k02N8J52p5N6K8k05J2J76j4l1m
4474A4o3K5K0j3L6%k8L8m3k2J17q4j22J89L1j51P6m3j14K12O8k27O1Q8j72P9J41
4501A13j41LJ00j49J7J55q5q7P4J9J9j2q0pN8K9N2p6j11J07Mp2J68Pk13O4N0q7
4529h1J62O6k65K3J74r4j2J14j32j1J06m9l2O4l6l4N3kM6n4r8R6P9q5L5k1j39
$$ plain form
4340 -24 -27 73 -62 -68 73 52 -40 -32 -21 50 18 -38 19 -1 -43 66 22 -86 61 44 -134 35 133 -83 -39 61 -61
4367 -61 36 129 -87 -105 79 24 -8 65 -1 -47 -16 -5 44 65 11 -14 -73 -39 125 45 -95 29 17 -81 49 53 -121
4394 -121 50 103 -125 -20 97 -89 -59 83 -7 -7 54 -93 -90 99 54 -12 -9 -32 4 38 11 24 6 -39 13 -5 -12 93
4422 93 13 -110 61 88 -44 12 12 -91 82 145 -90 -54 45 -72 -9 101 -7 -32 15 -87 -29 84 21 -16 -18 -28
4448 -28 49 23 -87 21 45 -11 44 -8 -134 28 87 -66 33 63 -139 -81 71 -4 52 80 -125 -113 63 49 18 14
4474 14 -49 -24 -4 -17 19 19 -9 29 -14 -36 81 -3 -125 64 95 -56 20 -23 -137 75 143 -84 -23 65 -107 -28 113
4501 113 -28 -25 75 -74 -57 98 13 -74 0 19 38 26 -54 -61 -3 26 78 2 -109 -2 2 -70 98 105 -108 -44 6 -81
4529 -81 81 147 -118 -95 79 -15 -27 87 -45 -56 50 1 -31 33 -3 -37 16 14 60 6 -92 4 83 -2 33 12 -127
4556a27J57R6j91N1R9j76N0J71j77OJ22j78J8K26j24j37J29m0j3J48r6j17J03
4579@K9l8N6k4l1k3k4R8L8j04K3j6q7J84N0k51O2J57j79N8J80k40qK29j77p0K63
4606A55j23j52J80j8r8J20o2r2J54Lr2Qj9M6N9p1j5O1j08K3J27q9NQ3j92jK38
4633A30p3j14J04j06k9J91r7q7J50o2j07J56j1q3Q5n0r6J61J2j21L6jj0O6n4n0
4659f0J04n2m2J04q5qJ57j53o7K06j03j28K30m3j63J80n5j92K39Q8k32N4P4j51
4683i8R5R8j07L2K8j09MQ6L4k4q2m4J04pl4P7n8o4J00o6k8J68n6j39J10j0q6J74
4711I8n6j60J55K6j88J28J07j74P2M3j79J29J44j83rJ12j29K6R5n3jM7r7l3J13
4736C3mKKj11N5O1m5M3K1q6K8pm5J12K8j25LL5l0P8J7j15M2K6j14Q6R3q3%Pj12
$$ plain form
4556 -127 30 126 -65 -14 85 -91 -41 130 -47 -41 81 -97 -79 147 23 -114 15 -25 -38 110 14 -103 0
4579 0 29 -9 47 23 -8 -31 -55 43 81 -23 0 -16 -103 81 131 -120 -58 99 -80 -22 158 -82 -90 139 -38 -108 155
4606 155 32 -120 60 42 -56 64 2 -90 64 67 -25 -17 -36 10 69 -2 -17 44 -64 -41 86 -3 2 85 -107 -108 130
4633 130 57 -57 47 -59 -88 103 6 -81 69 7 -100 56 45 -38 47 -3 -99 62 74 -47 -11 -12 -22 44 -10 -60
4659 -60 44 -8 -50 54 -31 -39 118 -35 -102 104 1 -127 103 60 -103 77 22 -170 69 157 -75 -21 53 -98
4683 -98 -3 95 -12 20 48 -61 -57 29 63 39 -43 -87 17 10 -24 53 -5 -69 31 -35 -63 105 49 -90 20 10 -76 98
4711 98 42 -118 37 63 -125 3 110 -64 8 51 -128 1 145 -38 -47 65 -64 -38 57 4 3 50 -47 -80 33
4736 33 29 31 33 -78 -23 38 -7 36 57 -29 -1 -8 -53 59 87 -38 -35 0 -30 48 65 -50 -8 18 -96 -10 83 0 0 7 -105
4767a05Q5J26j10m5N9o1RJ03o0lN6j19j5J21rj4K1q9lJ05m9l4O1j7m8K2j7K8P1
4796F9m6p7M6J4j5L7ol3J6j7k7P2L9n3n0j0K1N8J8k9m5pK7POM7l3r4J7P7j4J3
4828B8J1j15K8J04m4n6R9m4r3R5Rn4O9Lj12N1R9q9k1Q1l8l0N9p8j6J30k2j09M0
4857a5K1k4M9K6o6k0M6l5nJ07oj36MP0kK9J3q9m2J10jn7P6%j04J0P2Qj7Po6k8
4889f5Q9K5p7OL9k4k5L2j8RL0j5n9M2M7m5j3O0on7PK1JN1Nj28MR8K1o6M8k0p9
4922f2M9Q5p8L6K2j38J1J74m0j02O2l7p3J50K8j53N6P6j38K3J45p5p5R6m6n6J16
4949E6Kj41P0Q9r2m1Q0k2k1O1m4p0O3N5o6J6O7q1o6R4J4j5N1p1j01J07J04q8j9
4978iL1p3JJ17l6m0O0o7m9R4M1o4k0j6J5L5Pj9m7J4O2l7m5Q1Qj06K9Q3q9J8P9
$$ plain form
4767 -105 -20 106 -4 -49 10 -51 -42 61 1 -2 54 -65 -80 41 32 18 39 -50 -53 52 3 -31 30 13 -35 -13 -30 -2 69
4796 69 23 -54 -8 6 -9 28 22 -11 5 -12 -39 33 72 19 -31 -41 -20 38 56 27 -18 -25 2 9 15 62 29 -65 -48 29 15 28
4828 28 39 -76 -48 56 12 -44 55 11 -82 13 22 -32 37 40 -72 -21 78 -11 -32 49 11 -19 40 -38 -54 76 54 -55 -15
4857 -15 6 -18 31 57 -9 -29 17 -18 -23 84 78 -58 -54 16 14 43 56 -33 -75 35 34 -23 53 53 -51 -41 31 39 22 29 -37 -65
4889 -65 24 49 -28 -22 17 -7 -32 0 -18 -9 21 6 -53 -11 36 -9 -22 38 32 -25 -18 3 4 55 60 -68 -64 34 55 -11 37 17 -62
4922 -62 -13 72 -6 30 52 -86 -75 99 59 -43 19 -18 -91 59 87 -66 -10 66 -72 -49 96 21 -54 42 -4 -60 56
4949 56 58 -83 -13 76 -16 -57 23 1 -20 41 -3 -73 -10 45 -21 -5 62 -19 -85 9 23 8 59 -12 -113 -6 98 10 -9
4978 -9 22 -51 -50 67 31 -9 51 -16 -65 29 70 6 -14 -30 -15 20 27 8 -39 -25 37 0 -45 36 44 -62 -33 50 -39 -21 58
5009E8q6qJ24r3j12J66J3j16O8Mj18J12Q6j23qQ5q6l7J04Nn0J4l9l8J05N7j11
5036b4o1J06Qo6P0J7j04N1O7j18N3J23j67n3J78n2p8J29p2j17J83Kj78J11R0j62
5062f4L9R1j17L9R1j04k8J02o0m5N4L5ok6n7K6M2J6jm1j9M6Mm6P5%r0K1K9k5P0
5093E1nj15M5O5o1OL9n7L5L5m6LK8j5lj6K6M0n0m9P7%o0O2k8o2J28j4j42R3O5
5124G5j41N9P4j44M0J15j30pJ76j31r2J39k0l9Q6n3r5J12L6r9L5M8m7k8M0J4l0
5151gK7J7r2K7R8m8r3J01Mr6R9J3j27R8O5j67N0J42j31l6J36j08j9J23o9p7J49
5178G9l3j15Q2K9n3M1jm6L5J2m8J0J6K0j5n6L6M9n7%L6o1N3M8j02j5J19q8m9J34
5208F0m9n2Q9m2j06J49K7j41N9M8p0K9L6m9QL8k4l5K0M2j0q1O3K5n5J8O0q5J3
$$ plain form
5009 58 -28 -36 88 -5 -117 49 62 -54 14 18 -100 12 98 -25 -33 52 -34 -71 33 38 -12 2 -37 -75 30 87 -24
5036 -24 -85 21 29 -37 33 50 -54 -3 64 -54 -1 122 -45 -98 80 28 -50 79 7 -110 73 75 -103 8 98 -64
5062 -64 -25 66 -51 -12 79 -25 -53 49 -11 -56 -2 33 27 1 -56 -30 12 28 27 -14 -33 13 17 -29 46 46 -44 -23 6 -19 51
5093 51 46 -69 -24 41 -20 -14 25 -32 3 38 -8 -5 23 8 5 -11 15 55 5 -44 33 33 -27 35 7 -55 73 59 -83 10 75
5124 75 -66 -7 67 -77 -37 78 -52 -59 117 -14 -106 33 13 -26 60 7 -88 24 60 -39 -4 44 -3 -31 9 23 -7
5151 -7 20 37 -55 -28 70 22 -71 30 34 -62 37 50 -77 21 86 -81 -31 111 -20 -56 80 -28 -47 76 7 -70 79
5178 79 46 -69 13 42 -11 30 29 -17 18 30 -18 -8 8 28 13 -43 -7 42 -15 -15 21 -40 13 61 -41 -56 63 -25 -74 60
5208 60 11 -41 48 6 -100 49 76 -65 -6 42 -28 1 37 -12 -4 34 10 -25 -5 37 27 -54 9 34 -21 -3 57 -28 -15
5237a5R6j12l5J63q1q5J19l3q3J24j5j26J31L0j59O1P8r5L6L5r0L2P6o7j2L2j5
5264a0rmK4L6n3pK7l5J7P2r5k8J38m5j13J50l7r8J22j3j23J11N4j53M0J00p7j4
5292b3N9p9M0O8n6m2M3J3Ml5mO4o4k4P3l6l7J07p3p2J54l1j44J10L8j06Q6K2j47
5321i2Q3R2j46K8J10j06k2O2l2kQ1m2p1K8M6j4k9M1J8n7MN3p3J5J11r8n3J44n4
5350B5j29J47K8j25J07Lj58R4J11j41PJ31j28k4J01m3l2R5n8q1P3L4m3k3L0J4
5376A5k0j3Nk4K2O0n1l3P9m3p7R9J0p7R1k9j03R9N0j00K7M7o6J9L2n6L8L7m4j3
5406a9J7RMj6NM5l4m5M6om1J02n2q4R7J5r6N5O5r5M1J9q2M3O4o9k8M6Rk2j1K3
5438EjRkmm7L9N6q1kJ07r3l1Q4n4k4J09q6r3J59k6j07J00K6j19J10J1j13Q2N8
$$ plain form
5237 -15 81 -31 -66 97 16 -69 50 17 -66 58 43 -83 48 78 -81 -20 58 -37 -1 34 -56 -24 52 -15 -27 5 -10
5264 -10 -19 -23 1 37 -16 -23 4 -31 -14 58 -37 -65 73 28 -85 65 28 -70 52 39 -84 27 81 -72 -32 68 -9 -23
5292 -23 36 -43 -3 65 9 -33 10 23 27 -8 -12 52 -12 -36 37 1 -36 71 -2 -74 80 49 -95 15 53 -53 33 55 -92
5321 -92 -9 83 -63 -35 75 -31 -53 9 -23 -25 56 14 -57 -29 17 3 -26 15 33 -24 -20 33 -40 -25 86 -12 -65 79 25
5350 25 -104 43 71 -54 53 56 -102 -8 103 -38 -31 100 -28 -52 49 6 -26 69 11 -70 3 37 -6 -29 1 15
5376 15 -5 -18 -13 -37 -15 45 -6 -39 40 -3 -80 19 29 -48 43 14 -89 10 60 -40 -13 34 -32 -13 19 -37 1 38 -6 -19
5406 -19 -2 7 11 -5 0 45 11 -34 12 6 -35 67 15 -69 28 43 -53 2 67 -28 13 32 -50 -7 57 -12 -40 6 15 -7 -18 5
5438 5 4 13 11 7 -40 -1 55 -26 -28 79 -14 -45 39 -15 -39 70 -16 -109 50 24 -83 17 43 -76 34 45 -68 14 72
5467G2j27K3Q5n9mK9l9OL9j8k2JN0kn8J6N7m8j5O6q0J2R1q9m6J32m4q6Q1mo4J05
5499F0m9q0J01J1j00N3K2n3N9%p4P3J3r3N9K5m1M8j8p9Q1K7o8K7J5n5O0k0n8R2
5529C8Kq5M3L3m9M3Lp0O2K4q4M1K8m0L8j1n1N5Kn3O2k8j4N2m4o5J15k5q0P2j4
5560@n2J02j0j19J09K2j12P1K6r5M3M2q2N1P9j21LP7m5J9J9n6jP1m5kL1j7nqj8
5591b3M8Jm4J9mj7O0l4n7P5K4q4M8L6p2M8L0j05P8L4r9K1O2o1J8L2q2N3P3j01
5621b3pN9m6J6L0n8JN7o2KN5j9j5J7m9L2O2n4j9J7j7L1J3m3K0M3m7j7M6pj9J1
5653A0l4J8M1l3j4J3nQJ9m5L6L7n8pL6l6L6Ro2L6O4r1NO6m7jL6o6MR2n0m3O3m3
5687fj6N0k7j6N9m3o3O0J9k2Pj8qL9j9pK4Kj9Jj9L3K0l8mJ1qL5nl7K7L2o3pN7
$$ plain form
5467 72 -55 -32 53 -6 -10 19 -20 -14 25 7 -15 -14 36 34 -24 -8 49 1 -14 52 -28 -16 75 -14 -60 72 28 -58 23 19 -45 60
5499 60 11 -69 32 43 -57 -4 18 -35 24 24 -50 23 36 -57 2 27 -14 34 16 -63 18 45 -23 4 19 -36 24 4 -54 38
5529 38 40 -45 -2 31 -18 25 28 -42 20 44 -40 1 29 -11 27 16 -35 20 22 -31 31 3 -11 41 -3 -68 47 22 -58 14 0
5560 0 -52 50 40 -79 30 52 -60 11 37 -58 -15 27 -55 -4 75 -46 -43 34 -11 8 27 -29 -30 41 -4 -6 25 8 3 -5 -23
5591 -23 25 26 -18 1 -3 -20 40 6 -51 24 48 -36 12 48 -24 24 54 -51 27 61 -38 -17 45 -16 2 34 -48 5 78 -23
5621 -23 -30 29 -17 -1 29 -29 -28 29 -33 -31 24 5 -10 7 -42 -10 52 -2 -21 -4 -21 10 23 -20 0 43 -4 -21 25 18 -1 10
5653 10 -24 -6 35 2 -12 1 -4 4 23 -22 14 51 -7 -14 22 -14 22 31 -31 5 69 -22 -17 49 2 1 37 -29 -25 67 17 -26 37 -6
5687 -6 -22 28 1 -15 44 1 -62 -2 17 -5 2 -16 -24 15 -4 -11 13 15 -4 -3 -22 11 31 -7 -11 0 -8 27 22 -15 12 44 -19 -26 31
5722C1k3KLm7K6N8m6j1L7l1l1M1j4rO4m2n7O4Nm0L5k9j4M1lm4M5K4m5Oj2J2N0
5755D6l9m1J4J6OnNrK2k6j9L9Jj5J0m3J3P4m9l1N4j1l2L4nk6N7l8l9M8J1k1K9
5788C0l7j6M9j9l3L3J0l2K4j5j7O2k7n0N1nj6L5k8j6O4l6n6O9Mn7L4j4j4M7pm7
5820c0L3J8l6pK4kK3j8l5J4J2PJ7n9J5N1m4jO6m4k4M5m7qJ00m8p0O3Ln1N4J4p1
5853c6O7j4p6N4M3n3J1J1k1J7J4m3L0llOl8J1O4n5j5M3j7j0M3l9k8Q0k8o1P4L
5885C1o5M4Kl5L7K2o6KM1j8kJ3nJKj9J2J9J2Jp0L0N3l6k2P5n1l0M8l3k5J10k9
5918D9r8O2M0q9M1N2q0L2M5j08K4Q3m3m9M0kk0L1J7l7LL0k7l9M8L4n8rM8l0j6
5949b6O0m8m2J05j3j14R1L4r9L9M8o8L9N0r5rJ01k5m6M7l1j3J6Rk4L3J5k5m4L3
$$ plain form
5722 31 8 10 13 -34 -8 50 4 -7 30 -1 -32 9 -5 -14 50 8 -49 15 20 -20 15 -14 -28 13 10 -34 11 35 -10 -4 -16 -4 46
5755 46 7 -34 -20 -4 2 -3 2 -7 15 -11 -30 9 10 -5 5 -38 -25 49 0 -31 23 12 -20 14 9 -17 40 2 -37 11 22 1 30
5788 30 -7 -23 26 7 -26 7 17 -15 9 -6 -23 39 12 -38 13 8 -8 27 -1 -17 47 11 -45 24 28 -29 5 -9 -23 24 17 -30
5820 -30 3 21 -15 -22 2 0 23 5 -30 -16 -4 3 20 -39 -24 27 -17 -18 48 4 -20 25 -22 -30 70 22 -48 15 18 -33 21 35 -36
5853 -36 31 17 -59 -5 38 -15 -4 7 -14 3 17 -26 4 1 -2 4 -34 -23 41 -14 -29 14 -3 -13 30 -9 -37 43 15 -46 28 31
5885 31 -34 10 12 -23 14 36 -30 -28 13 -5 -7 6 1 2 4 -15 -3 16 28 29 -41 -11 42 6 -16 59 8 -22 26 -7 -32 78 49
5918 49 -49 13 53 -36 5 57 -23 9 54 -54 -30 53 10 -39 1 -1 -21 10 27 -10 -7 23 -4 -43 5 39 -19 -28 20 -10 -26
5949 -26 34 -14 -56 49 36 -78 13 47 -52 -13 35 -33 6 56 -39 -48 53 28 -18 29 -2 -15 1 10 -14 19 34 9 -35 -2
5979bK5j6rM1j8l1K5k0j3O4j0r6N6L8o3L6L5p4K4L6o2PQ0l3n3L3mj3M6k5k5J3
6011hJ4mrJ4J4k3k6L7J2l8M1k1m6N7K8q6K2Q1p7j8P5n0j6R0o3n4R1J3o9J8M4m8
6043enL9l0%M3l2k8J6L6j9n7N5j1m3N3J3p4O2K9q4OJ02p8k1Q3o6k6Q2m1n6R1Q
6075D2r5N0N0p6M0L6q5JP9k9k9M5j5m0J0L5kk3L5k8n0Q2K0p7J8O2p3%O6n8kQ3
6107G2o6n4R3Nq6N0Mm0M7Jn7K4M5m2j2L2qj4lNJ8j3j2J2j1jL2m1k6P2pn1M5j4
6141al1O5nn7M0K8o5J1O9m7lJ4m5OO0j5n2K1K4k2lK6jj4j0J6l5L3L2p3LQ4m1n4
6175d2P4k3p3J08j4j00Q9L7j09N1O1q3%N9o9J3P3o4n2P0K2m4J1K0l2RK3j5oK8
6205B2ql8K6M3l6k8J2mQN0l1n3N7J1n0L1L2n7OK0m1M9L0n5l6O2j5k2K2kj7K2%
$$ plain form
5979 -2 23 7 -2 39 21 -10 15 -5 -18 46 36 -60 -4 34 -29 7 42 -32 -8 28 -34 -27 53 20 -33 0 -4 -17 29 4 -21 -8
6011 -8 6 2 -7 7 21 -2 -28 9 21 -17 24 3 -43 14 42 -44 -22 59 -18 -36 39 -11 -27 63 0 -54 37 50 -19 -1 43 -5
6043 -5 -10 29 -1 -1 42 10 -18 -2 34 15 -42 13 2 -41 12 25 -49 13 42 -42 -36 66 -12 -33 50 -16 -42 40 -1 -57 34 42
6075 42 -53 -3 47 -29 11 47 -38 -37 42 13 -16 29 14 -26 -16 19 17 -6 29 1 -49 33 53 -24 -6 56 -17 -17 49 -9 -11 72
6107 72 6 -48 45 50 -36 14 18 -22 25 26 -31 -7 38 -4 -16 16 8 -6 -9 -4 14 1 -11 1 -10 -11 21 -20 -46 26 19 -32 13 -1
6141 -1 -32 33 28 -29 11 39 -26 -15 54 7 4 18 -27 -21 39 24 -28 -7 17 -5 -8 18 17 3 -7 9 -26 7 39 -34 -31 53 12 -42
6175 -42 32 9 -64 44 30 -70 19 56 -53 -2 59 -24 -24 35 -34 -21 52 -12 -64 6 28 -16 -5 15 -17 -8 15 0 -6 22
6205 22 14 -24 2 45 9 -19 -7 -11 -3 47 16 -37 20 31 -19 12 44 -13 -7 13 -28 21 51 -4 -40 22 7 -15 7 5 -12 10 10
6238A0j6OOJ3k7j3N0k9l8M4Nj9K8j7o0O0M8p5lM1m3J2M7k4l4M6k6k6N0K3n2rJ8
6271dMmL6k5k9L6J3m1PM7l4k9M1j0j4M5m7m1Q3J3p8K2K0l3L2K7n9K3M6n7k5N8
6303B3j6k5M2k0qJ1Jk0LL6j5l2OL0j4lJ5k7mM2k4m1O1Kn3J3K8j4J0%k5PK9j1q
6338aNJ7j1j4kL5j0nmk8J0L7k6k3L6jm7L4J0l3L3oo7N1N4n9JM1n9nO4m1j4P9m9
6373Bo5Q4J3n1J1K7n3M2K9n8j2N8ol6LN0m9rK7k2j0N5j8o2Q8K0r2K8N1p0K4N7
$$ plain form
6238 10 -6 0 6 19 -8 -21 29 0 -38 6 11 -8 20 3 -57 3 51 -24 -27 14 -29 -17 30 6 -28 18 -8 -34 16 39 -13 -22 -4
6271 -4 0 -4 32 7 -22 14 27 -14 -7 40 6 -23 18 8 -6 39 -8 -49 34 47 -31 -9 11 -22 10 37 -22 1 47 -10 -35 23
6303 23 7 -18 24 4 -4 7 8 -12 -9 27 12 -20 -14 16 2 -1 14 -13 -17 25 1 -40 21 23 -30 -17 11 -3 7 7 -18 -11 18 7 -1
6338 -1 4 21 10 -4 -6 29 19 14 10 -18 -8 29 3 -20 16 15 -32 2 12 -21 12 6 -61 -10 44 -15 -14 27 -32 -37 27 -14 -28 51 2
6373 2 -63 21 34 -17 -6 21 -32 10 39 -19 -31 27 21 -15 -12 38 -11 -20 7 -15 -25 30 12 -50 38 58 -34 -6 45 -25 -1 56
$$ [...]
8191A1
##END NTUPLES=NMR FID
##END=
