##TITLE=1H_LY-810.40
 CCl4, 8 sc, 
 8.4.2019
##JCAMPDX= 6.0         $$ Bruker NMR JCAMP-DX V2.0
##DATA TYPE= NMR FID
##DATA CLASS= NTUPLES
##ORIGIN= UXNMR, Bruker Analytische Messtechnik GmbH
##OWNER= root
$$ XWIN-NMR		Version 3.5
$$ Mon Apr  8 16:25:35 2019 Russian Standard Time (UT+4h)  she@DPX200
##.OBSERVE FREQUENCY= 200.131
##.OBSERVE NUCLEUS= ^1H
##.DELAY= (6, 6)
##.ACQUISITION MODE= SIMULTANEOUS
##.ACQUISITION SCHEME= undefined
##.AVERAGES= 8
##.DIGITISER RES= 18
##SPECTROMETER/DATA SYSTEM= spect
##.PULSE SEQUENCE= zg30
##.SOLVENT NAME= CDCl3
##.SHIFT REFERENCE= (INTERNAL, CDCl3, 0, 15.7039)
##AUDIT TRAIL= $$ (NUMBER, WHEN, WHO, WHERE, WHAT)
$$ ##TITLE= Audit trail, XWIN-NMR		Version 3.5
$$ ##JCAMPDX= 5.01
$$ ##ORIGIN= Bruker BioSpin GmbH
$$ ##OWNER= she
$$ F:/spectra/data/she/nmr/H-F/1/audita.txt
$$ ##AUDIT TRAIL=  $$ (NUMBER, WHEN, WHO, WHERE, WHAT)
(   1,<2019-04-08 16:24:05.87 +0400>,<she>,<DPX200>,
      <created by zg, POWCHK disabled, PULCHK disabled
       configuration hash MD5:
       00 E9 B6 7A A2 85 ED C7 34 08 36 98 17 FE 4E 26
       data hash MD5: 16K
       C7 85 69 08 F3 CB D3 56 C1 B4 C3 81 43 28 29 1E>)
$$ ##END=
$$ 
$$ hash MD5
$$ 7C 85 76 BE B0 A9 93 9B B1 D0 3B 86 C3 29 E4 5D
##$RELAX= 
##$RELAX= 
##$RELAX= 
##$RELAX= 
##$RELAX= 
##$RELAX= 
$$ Bruker specific parameters
$$ --------------------------
##$DU= <F:/spectra>
##$EXPNO= 1
##$NAME= <H-F>
##$PROCNO= 1
##$TYPE= <nmr>
##$USER= <she>
##$AMP= (0..31)
100 100 100 100 100 100 100 100 100 100 100 100 100 100 100 100 100 100 
100 100 100 100 100 100 100 100 100 100 100 100 100 100 
##$AQSEQ= 0
##$AQ_mod= 1
##$AUNM= <au_zg>
##$AUTOPOS= <>
##$BF1= 200.13
##$BF2= 200.13
##$BF3= 200.13
##$BF4= 200.13
##$BF5= 200.13
##$BF6= 200.13
##$BF7= 200.13
##$BF8= 200.13
##$BYTORDA= 1
##$CFDGTYP= 0
##$CFRGTYP= 5
##$CHEMSTR= <none>
##$CNST= (0..31)
1 1 145 1 1 1 1 1 1 1 1 1 1 1 1 1 1 1 1 1 1 1 1 1 1 1 1 1 1 1 1 1 
##$CPDPRG= <>
##$CPDPRG1= <>
##$CPDPRG2= <>
##$CPDPRG3= <>
##$CPDPRG4= <mlev>
##$CPDPRG5= <mlev>
##$CPDPRG6= <mlev>
##$CPDPRG7= <mlev>
##$CPDPRG8= <mlev>
##$CPDPRGB= <>
##$CPDPRGT= <>
##$D= (0..31)
0 1.2 0 0 0 0 0 0 0 0 0 0.03 0 0 0 0 0 0 0 0 0 0 0 0 0 0 0 0 0 0 0 0 
##$DATE= 1554726245
##$DBL= (0..7)
120 120 120 120 120 120 120 120 
##$DBP= (0..7)
150 150 150 150 150 150 150 150 
##$DBP07= 0
##$DBPNAM0= <>
##$DBPNAM1= <>
##$DBPNAM2= <>
##$DBPNAM3= <>
##$DBPNAM4= <>
##$DBPNAM5= <>
##$DBPNAM6= <>
##$DBPNAM7= <>
##$DBPOAL= (0..7)
0.5 0.5 0.5 0.5 0.5 0.5 0.5 0.5 
##$DBPOFFS= (0..7)
0 0 0 0 0 0 0 0 
##$DE= 6
##$DECBNUC= <off>
##$DECIM= 24
##$DECNUC= <off>
##$DECSTAT= 4
##$DIGMOD= 1
##$DIGTYP= 9
##$DL= (0..7)
0 120 120 120 120 120 120 120 
##$DP= (0..7)
150 150 150 150 150 150 150 150 
##$DP07= 0
##$DPNAME0= <>
##$DPNAME1= <>
##$DPNAME2= <>
##$DPNAME3= <>
##$DPNAME4= <>
##$DPNAME5= <>
##$DPNAME6= <>
##$DPNAME7= <>
##$DPOAL= (0..7)
0.5 0.5 0.5 0.5 0.5 0.5 0.5 0.5 
##$DPOFFS= (0..7)
0 0 0 0 0 0 0 0 
##$DQDMODE= 0
##$DR= 18
##$DS= 0
##$DSLIST= <SSSSSSSSSSSSSSS>
##$DSPFIRM= 0
$$ [...]
##$SUBNAM2= <"">
##$SUBNAM3= <"">
##$SUBNAM4= <"">
##$SUBNAM5= <"">
##$SUBNAM6= <"">
##$SUBNAM7= <"">
##$SUBNAM8= <"">
##$SUBNAM9= <"">
##$SW= 24.9337681822398
##$SWIBOX= (0..15)
0 0 2 0 0 0 0 0 0 0 0 0 0 0 0 0 
##$SW_h= 4990.01996007984
##$TD= 16384
##$TD0= 1
##$TE= 0
##$TE2= 300
##$TE3= 300
##$TEG= 300
##$TL= (0..7)
0 120 120 120 120 120 120 120 
##$TP= (0..7)
150 150 150 150 150 150 150 150 
##$TP07= 0
##$TPNAME0= <>
##$TPNAME1= <>
##$TPNAME2= <>
##$TPNAME3= <>
##$TPNAME4= <>
##$TPNAME5= <>
##$TPNAME6= <>
##$TPNAME7= <>
##$TPOAL= (0..7)
0.5 0.5 0.5 0.5 0.5 0.5 0.5 0.5 
##$TPOFFS= (0..7)
0 0 0 0 0 0 0 0 
##$TUNHIN= 0
##$TUNHOUT= 0
##$TUNXOUT= 0
##$USERA1= <user>
##$USERA2= <user>
##$USERA3= <user>
##$USERA4= <user>
##$USERA5= <user>
##$V9= 5
##$VALIST= <valist>
##$VCLIST= <CCCCCCCCCCCCCCC>
##$VD= 0
##$VDLIST= <DDDDDDDDDDDDDDD>
##$VPLIST= <PPPPPPPPPPPPPPP>
##$VTLIST= <TTTTTTTTTTTTTTT>
##$WBST= 1024
##$WBSW= 4
##$XGAIN= (0..3)
0 0 0 0 
##$XL= 0
##$YL= 0
##$YMAX_a= 55198
##$YMIN_a= -61666
##$ZGOPTNS= <>
##$ZL1= 120
##$ZL2= 120
##$ZL3= 120
##$ZL4= 120
##$ABSF1= 10
##$ABSF2= 0
##$ABSG= 5
##$ABSL= 3
##$ALPHA= 0
##$AQORDER= 0
##$ASSFAC= 0
##$ASSFACI= 0
##$ASSFACX= 0
##$ASSWID= 0
##$AUNMP= <proc_1d>
##$AZFE= 0.1
##$AZFW= 0.1
##$BCFW= 1
##$BC_mod= 2
##$BYTORDP= 1
##$COROFFS= 0
##$CY= 11.3945322036743
##$DATMOD= 1
##$DC= 2
##$DFILT= <>
##$DTYPP= 0
##$F1P= 18.9103706918063
##$F2P= -1.10871071338519
##$FCOR= 0.5
##$FTSIZE= 0
##$FT_mod= 4
##$GAMMA= 1
##$GB= 0.15
##$INTBC= 1
##$INTSCL= 1
##$ISEN= 128
##$LB= 0.24
##$LEV0= 0
##$LPBIN= 0
##$MAXI= 10000
##$MC2= 0
##$MEAN= 0
##$ME_mod= 0
##$MI= 1.114404
##$NCOEF= 0
##$NC_proc= 0
##$NLEV= 6
##$NOISF1= 3.799351
##$NOISF2= 2.8
##$NSP= 1
##$NTH_PI= 0
##$NZP= 0
##$OFFSET= 15.70392
##$PC= 1
##$PHC0= -8932.683
##$PHC1= 16.60026
##$PH_mod= 1
##$PKNL= yes
##$PPARMOD= 0
##$PSCAL= 0
##$PSIGN= 0
##$REVERSE= no
##$SF= 200.130013532006
##$SI= 16384
##$SIGF1= 3
##$SIGF2= 2
##$SINO= 400
##$SIOLD= 16384
##$SREGLST= <1H.CDCl3>
##$SSB= 0
##$STSI= 0
##$STSR= 0
##$SW_p= 3612.71676300578
##$SYMM= 0
##$S_DEV= 0
##$TDeff= 0
##$TDoff= 0
##$TI= <>
##$TILT= no
##$TM1= 0
##$TM2= 0
##$TOPLEV= 0
##$USERP1= <user>
##$USERP2= <user>
##$USERP3= <user>
##$USERP4= <user>
##$USERP5= <user>
##$WDW= 1
##$XDIM= 8192
##$YMAX_p= 0
##$YMIN_p= 0
$$ End of Bruker specific parameters
$$ ---------------------------------
##NTUPLES= NMR FID
##VAR_NAME=  TIME,          FID/REAL,        FID/IMAG
##SYMBOL=    X,             R,               I
##VAR_TYPE=  INDEPENDENT,   DEPENDENT,       DEPENDENT
##VAR_FORM=  AFFN,          ASDF,            ASDF
##VAR_DIM=   8192,          8192,            8192
##UNITS=     SECONDS,       ARBITRARY UNITS, ARBITRARY UNITS
##FACTOR=    0.0002004,     1,               1
##FIRST=     0,             0,               0
##LAST=      1.6414764,     0,               0
##MIN=       0,             -61666,          0
##MAX=       1.6414764,     55198,           0
$$ Real data points
##PAGE= N=1
##DATA TABLE= (X++(R..R)), XYDATA
0 0 0 0 0 0 0 0 0 0 0 0 0 0 0 0 0 0 0 1 -7 8 -8 8 -8 8 -8 8 -12 15 -16 16 -16 20 -23 24 -28 30 -33 36 -39 44 -49 52
42 52 -60 67 -74 82 -93 104 -119 136 -158 185 -223 275 -347 458 -637 966 -1663 3661 -18635
61 -18635 -56828 52719 -1814 -45911 55198 -7267 -45206 41772 -5560 -25041 36365 -12827
73 -12827 -20492 23012 -10225 -378 16134 -18525 1785 8530 -12827 13415 3043 -17027 10187
86 10187 -6 -8174 13262 -2509 -8522 4080 -1739 3654 981 -4033 5717 -8382 -2087 16170
100 16170 -11880 -3372 16496 -18627 -1090 22629 -18023 -1801 16977 -19580 3036 16352
112 16352 -16322 5039 6524 -15768 11253 2838 -10927 14389 -8912 -10758 21864 -10790 -7997
125 -7997 22668 -18854 -8303 27143 -16552 -6305 23757 -20505 -6830 24847 -13315 -5428
137 -5428 15753 -13826 -3103 14279 -6373 -1748 3891 -5955 1627 2628 457 2311 -6878 -147
151 -147 6322 -4959 3208 3962 -10688 3018 6347 -6720 4734 2014 -9413 4433 2958 -3609
165 -3609 5303 -3471 -5013 6614 -2327 -627 6202 -7468 -1454 7137 -5514 1723 5839 -8680
179 -8680 140 5886 -4258 2186 2035 -5313 1796 904 -827 3511 -3290 -977 3167 -4916 3458
194 3458 5272 -8986 1982 5382 -8551 4878 6177 -10715 2943 5548 -8794 4766 5754
207 5754 -9163 1427 4250 -4776 2909 2662 -4716 47 1511 -158 910 -182 25 -1877 -1162
222 -1162 4202 -425 -2604 2492 -2646 -1438 5563 -2070 -2330 3327 -3547 -466 5152 -2769 -839
237 -839 1883 -3953 1960 3660 -3538 533 595 -3099 2988 1442 -2496 1383 -1199 -1663 3124 50
253 50 -802 324 -2325 1180 1993 -1673 1286 -522 -2935 2950 606 -2058 2875 -1712 -3234 4078
269 4078 267 -2263 2453 -1647 -2229 3297 26 -1527 1456 -1055 -1476 1549 1128 -472 -971 -183
285 -183 39 -201 1675 119 -2468 1036 621 -1872 2485 828 -3519 1213 983 -1891 2631 299
301 299 -3554 1695 997 -1866 2143 305 -2754 980 704 -748 1596 -199 -2108 475 1054 38
317 38 202 -171 -813 -352 839 708 -416 -64 -459 -1052 1352 1272 -1425 -239 263 -982 1143 1066 -1452
336 -1452 28 240 -1144 1176 1193 -1358 -425 153 -335 1061 423 -1158 -140 139 -172 688 288 -573
354 -573 -383 -311 375 904 -227 -714 -148 -32 413 500 -346 -323 -15 -307 256 798 -203 -733 -99 180 362
375 362 485 -348 -677 245 263 -178 495 186 -931 -123 622 -48 300 119 -1114 124 1089 -570 -138
394 -138 712 -976 -287 1137 -468 -170 783 -1241 -378 1704 -532 -839 985 -662 -599 1359 -400
411 -400 -743 1035 -624 -878 1468 107 -1197 578 78 -697 946 196 -1141 546 449 -1047 558
428 558 891 -1126 -123 777 -693 305 855 -1235 -33 1205 -975 -112 1209 -969 -337 983 -781
445 -781 132 1045 -1211 -262 1193 -651 -172 777 -712 -95 658 -577 118 661 -726 -294 672 -35
463 -35 -205 146 -221 -114 400 -90 -377 399 42 -669 398 408 -608 262 93 -698 743 237 -1103 730
483 730 423 -1159 702 434 -994 756 95 -1145 1096 381 -1285 704 390 -923 658 268 -776
500 -776 576 150 -752 513 493 -626 -153 403 -74 -92 251 -204 -256 528 -78 -539 733 46 -949 635
520 635 364 -740 591 -21 -919 984 216 -1196 796 319 -1110 700 364 -931 650 115 -1013
537 -1013 839 497 -1119 263 592 -672 191 452 -639 102 527 -579 -48 745 -480 -489 708 -21
555 -21 -399 433 -248 -357 739 -167 -627 666 33 -646 506 140 -415 378 -181 -343 693 -111 -585
574 -585 432 38 -242 299 -204 -138 385 -304 -160 474 -156 -232 125 -65 140 64 -370 65 277 -136 -126
595 -126 66 60 -47 -39 29 -58 108 2 -354 341 291 -711 207 491 -629 372 226 -997 838 457 -1366
616 -1366 870 517 -1403 1000 391 -1349 1199 54 -1473 1552 161 -1523 1172 -19 -902 1244
632 1244 -432 -781 1110 -453 -420 820 -417 -68 141 -445 679 -101 -622 613 -475 32 916 -1217
650 -1217 182 1077 -1554 591 1116 -1797 834 645 -1875 1659 445 -2244 1681 183 -1692 1960
666 1960 -571 -1477 2199 -1033 -1040 2263 -1405 -649 1854 -1597 284 1504 -2187 757 1320 -2004 1115
683 1115 543 -1837 1697 -23 -1672 1936 -485 -1332 1845 -788 -618 1524 -1366 23 1486 -1468
699 -1468 257 756 -1193 1023 -39 -1189 1464 -655 -816 1788 -1256 -384 1742 -2002 402 2056
715 2056 -2640 479 1860 -2521 1215 1359 -2952 1625 1127 -2772 1967 691 -2666 1896 266 -1867
731 -1867 2133 -532 -1799 2127 -427 -1070 1602 -1038 -480 1487 -1107 54 1052 -1303 280 691
747 691 -760 704 -263 -816 1201 -397 -472 1038 -1070 99 1223 -1525 494 1217 -1956 718 1205
764 1205 -1857 992 641 -1994 1529 567 -2039 1395 294 -1483 1456 -290 -1124 1507 -651 -716
780 -716 1429 -923 -328 1091 -1089 430 841 -1626 639 909 -1335 763 284 -1276 1131 124
796 124 -1069 1106 -237 -881 1006 -218 -249 607 -889 166 839 -763 266 190 -817 844 59
813 59 -785 985 -374 -814 1147 -261 -411 822 -902 -82 1155 -855 -86 650 -901 386 534
830 534 -904 585 180 -1037 743 333 -751 435 -163 -400 715 -227 -381 394 -205 -9 117 -201
848 -201 313 -185 -347 509 -166 -169 428 -529 66 642 -713 24 682 -592 31 340 -496 333 185 -540
868 -540 328 107 -313 262 -93 11 240 -438 106 399 -282 69 -44 -216 476 -152 -290 465 -318 -161
888 -161 442 -369 192 303 -820 336 584 -717 271 206 -715 642 167 -781 649 15 -777 620 128
907 128 -411 377 -326 -203 629 -246 -227 269 -216 119 103 -220 314 -118 -356 369 -41 -14 234 -525 160
928 160 513 -559 174 357 -593 362 183 -617 684 39 -901 739 151 -692 673 -175 -616 881 -269
947 -269 -626 882 -234 -579 638 -193 -228 517 -427 -173 533 -299 -151 249 -147 35 -33 -172 282 -61
967 -61 -231 141 -120 89 165 -406 143 275 -444 169 227 -358 248 -8 -413 564 38 -591 412 73 -339
988 -339 433 -161 -258 527 -266 -280 576 -173 -244 281 -230 93 332 -432 46 322 -307 73 164 -238 193 -36
1010 -36 -311 393 88 -359 162 35 -104 207 -149 -112 244 -131 -163 155 29 -49 -101 -50 166 -17 -118 42
1032 42 -80 64 107 -286 118 249 -367 -11 299 -210 51 97 -336 224 255 -436 122 301 -358 40 215
1053 215 -206 155 89 -365 193 303 -282 -66 198 -105 7 100 -65 21 95 -166 -75 292 58 -316 46 185
1075 185 -147 59 109 -257 91 145 -325 157 342 -399 -116 332 -135 23 160 -325 36 296 -264 -52 300
1096 300 -181 -180 171 61 19 14 -160 -33 202 53 -161 1 114 -84 -47 160 49 -86 -54 -74 103 230 -138
1119 -138 -175 141 48 -68 78 26 -57 -28 -40 64 170 -26 -216 -36 212 46 -121 19 -20 -97 90 17 -62
1142 -62 167 -128 -300 296 195 -319 9 76 -204 198 102 -281 141 110 -376 146 358 -268 -143 134 -127
1163 -127 101 221 -285 -118 273 -121 -163 290 20 -307 68 118 -69 181 -40 -330 194 258 -270 48 231
1184 231 -273 -31 220 -139 90 137 -374 37 402 -190 -138 175 -138 -20 188 -100 -1 124 -214 -106 278
1205 278 57 -227 -35 72 -44 36 85 -171 10 133 -242 24 359 -248 -224 230 -78 19 173 -285 -15
1226 -15 239 -192 3 217 -116 -75 -30 17 251 -97 -160 124 -65 86 139 -257 130 151 -359 177 282 -263
1248 -263 68 8 -198 362 5 -327 238 4 -174 182 -44 -3 84 -233 71 169 -82 17 -198 -26 340 -255
1270 -255 -50 341 -429 24 357 -477 293 312 -829 343 514 -721 305 287 -726 483 216 -674 541
1289 541 118 -683 438 134 -293 327 -244 -184 392 -174 -20 179 -217 154 -15 -195 440 -145 -358 393
1309 393 -132 -32 395 -484 18 466 -497 146 410 -526 192 158 -489 533 90 -672 444 55 -387 468
1329 468 -185 -283 476 -347 -139 555 -335 -100 240 -369 319 213 -577 295 158 -489 425 60 -436 442
1349 442 -157 -463 657 -24 -528 385 -31 -236 413 -132 -243 307 -140 -162 316 20 -138 -22 -51 155
1369 155 100 -134 -14 -8 -7 135 -61 9 141 -240 -61 330 -67 -61 35 -223 173 215 -326 96 169 -356 152 206
1393 206 -283 234 -28 -471 430 168 -460 271 -4 -333 418 -115 -262 431 -267 -289 473 -141 -78 240 -440
1414 -440 163 391 -479 169 253 -497 278 182 -394 432 -37 -571 485 142 -370 282 -130 -202 380 -128 -89
1435 -89 253 -207 -62 122 -13 204 -165 -227 317 -78 -56 257 -335 32 306 -441 184 365 -562 95 291
1456 291 -411 345 119 -628 395 216 -548 349 143 -464 287 25 -317 385 -6 -427 232 156 -195 74
1476 74 62 -121 31 80 -57 18 151 -141 -173 250 89 -167 73 -1 -82 147 -33 -66 176 -94 -131 127 87
1499 87 14 -77 -106 119 47 -22 44 -85 26 49 -148 147 133 -260 19 101 -41 197 -97 -232 270 -31 -180
1522 -180 252 -81 -145 140 -133 60 229 -239 -91 122 -17 123 -94 -116 236 -136 -96 309 -178 -68 218
1543 218 -320 146 384 -473 -8 397 -339 104 283 -362 151 192 -365 210 238 -269 34 52 -37 163 -84
1564 -84 -88 141 -96 7 76 -83 138 -53 -248 274 76 -222 129 -57 -118 250 -121 -137 284 -164 -176 262
1586 262 -73 -43 147 -266 9 300 -224 -72 240 -165 -74 169 -84 18 93 -219 -22 238 -25 -142 31
1607 31 53 4 -12 40 18 -35 29 -17 -11 195 -29 -268 165 180 -180 94 101 -229 128 107 -216 207 114 -344 85
1632 85 241 -138 26 28 -161 143 74 -145 80 39 -132 7 39 75 10 -182 -7 117 -26 40 -54 -96 143 -64
1656 -64 -91 225 -62 -186 114 -23 45 195 -252 -89 287 -125 -68 227 -135 -62 154 -121 73 236 -227 -124
1678 -124 244 9 -64 78 -38 -52 77 28 -36 80 34 -184 18 262 -31 -148 104 -45 -42 200 -85 -125 194
1701 194 -123 -160 313 48 -257 51 8 -68 198 -28 -223 105 45 -146 126 116 -158 -56 39 11 126 14
1723 14 -210 -4 173 -19 -28 77 -54 -82 62 72 60 21 -142 -93 172 133 -103 -40 32 -44 59 111 -49 -6 15
1748 15 -154 95 254 -141 -158 94 -22 56 152 -143 -78 120 -126 4 240 -87 -193 42 24 81 91 -152 -120
1771 -120 97 51 -34 45 31 -123 -105 120 121 -44 -45 -119 -56 245 39 -184 86 -17 -164 192 118 -141 54 -70
1795 -70 -112 313 99 -238 16 36 -44 133 40 -81 -7 -48 -2 164 84 -92 -169 37 191 3 -25 31 -142 9
1819 9 151 -63 56 59 -301 12 307 -68 -36 7 -230 128 210 -191 44 54 -247 63 197 -46 -6 -124 -159
1842 -159 184 141 -96 -74 -55 -7 63 39 89 -48 -187 43 85 91 127 -240 -143 289 -24 -45 223 -213 -138 251 -87
1867 -87 54 253 -361 -156 359 -31 -8 112 -256 -4 208 -67 82 65 -209 -29 70 139 108 -262 -102 144
1889 144 -46 132 85 -310 78 75 -224 332 108 -442 107 63 -113 371 -131 -368 280 -47 -100 373 -173 -199
1911 -199 172 -170 150 329 -347 -112 159 -93 246 53 -276 130 -71 -99 364 -86 -151 112 -276 211 414
1932 414 -411 -34 200 -372 307 288 -455 188 45 -463 477 236 -475 149 -67 -201 473 -72 -292 220
1952 220 -197 -9 320 -146 10 -49 -345 347 225 -298 135 -166 -218 479 -94 -219 341 -350 -181 515 -143
1973 -143 -51 178 -458 140 463 -311 52 90 -390 256 202 -215 252 -153 -364 379 99 -75 144 -340 -23
1994 -23 379 -186 90 146 -443 137 240 -226 337 -67 -577 387 200 -286 352 -182 -434 478 -12 -221 445
2015 445 -277 -395 441 10 -58 227 -407 -115 382 -95 14 73 -282 25 116 29 238 -175 -276 153 21
2036 21 169 157 -400 13 223 -239 293 165 -494 135 98 -230 531 -28 -601 334 80 -179 497 -193 -390
2057 -390 376 -172 -40 509 -326 -245 244 -173 237 235 -496 56 134 -217 367 35 -380 194 -148 -96 555 -193
2079 -193 -336 212 -187 100 372 -351 -67 154 -267 235 236 -264 22 -127 -76 424 -44 -209 54 -205 157
2100 157 285 -250 116 -15 -400 380 196 -282 244 -238 -278 632 -67 -304 376 -335 -163 581 -227 -79
2120 -79 325 -523 20 553 -242 -29 79 -361 224 232 -207 101 -88 -216 195 53 79 32 -362 63 222 -102
2142 -102 177 -115 -326 293 -12 -136 406 -243 -333 345 -84 50 291 -452 -95 365 -195 111 175 -383 101
2163 101 131 -156 341 -19 -393 193 25 1 317 -287 -182 312 -182 58 323 -347 -48 157 -205 289 168
2184 168 -446 69 148 -142 269 -12 -300 159 -38 -98 309 -81 -240 47 -34 118 141 -216 -62 27 -59 169
2206 169 -8 -121 63 -182 -18 351 -121 -139 101 -209 120 317 -295 -30 187 -293 142 296 -252 36
2226 36 37 -280 301 200 -319 66 16 -150 272 6 -160 133 -150 -85 313 -30 -85 34 -201 136 234 -211
2248 -211 33 40 -213 174 108 -139 134 -146 -199 339 29 -166 110 -175 -38 290 -139 -49 147 -250 -5 220
2270 220 -65 41 -41 -215 179 141 -106 41 -103 -70 142 -56 55 107 -254 -11 178 -64 138 -13 -283
2291 -283 202 116 -157 192 -32 -222 189 -1 -32 252 -191 -205 227 1 -2 115 -195 -24 140 -98 90 107
2313 107 -193 -13 75 24 140 -84 -161 89 10 18 93 -124 -23 45 -97 122 114 -180 -39 29 -18 150 -16 -169
2337 -169 74 23 -54 92 6 -80 -20 -31 79 124 -61 -70 -16 59 111 -33 -30 50 -57 -9 115 4 10 -11 -113 111
2363 111 153 -102 -45 40 -51 73 70 -51 50 -7 -92 78 104 -52 -48 -30 18 82 10 -40 -4 3 -8 -5 58 38 -92 -49
2391 -49 64 35 17 -11 -99 34 87 -61 3 70 -89 -25 56 -6 51 2 -118 46 103 -28 -30 30 4 -4 15 32 31 -10
2419 -10 -46 -8 67 62 -66 -57 75 17 -33 47 7 -38 56 -37 -7 124 -43 -110 74 37 -15 27 -40 -28 70 -26 -43 77
2447 77 -11 -63 4 41 26 -7 -59 -14 38 5 -21 -39 34 9 -66 46 66 -68 -10 5 -30 85 0 -127 90 58 -96
2474 -96 53 43 -69 57 -7 -59 124 21 -129 43 70 -7 -1 -9 13 20 -9 3 14 42 6 -83 38 107 -77 -39 81
2501 81 -77 21 59 -119 43 99 -149 23 112 -98 -23 39 -76 70 33 -106 27 59 -47 -13 17 20 -4 -65 38
2526 38 36 -30 22 -39 -20 105 -68 -75 131 -56 -67 107 -66 -5 112 -124 -15 172 -88 -41 104 -47 26 53 -81
2551 -81 57 52 -78 23 44 3 -2 -67 47 49 -67 18 23 -56 97 -23 -112 144 -7 -164 128 5 -99 122 -65
2576 -65 -80 170 -77 -118 157 -35 -80 76 -44 -1 71 -70 -3 80 -12 -14 -18 26 57 -66 -8 97 -58 -2 63 -94
2602 -94 63 68 -161 67 117 -147 37 69 -87 69 31 -123 105 56 -115 45 56 -28 34 -36 -26 74 -51 -24
2626 -24 44 -28 24 -4 -87 118 13 -149 104 18 -97 107 -46 -77 169 -76 -124 199 -47 -122 156 -73 -37 167
2650 167 -143 -46 211 -112 -72 143 -74 -9 86 -104 37 87 -82 6 31 1 40 -70 37 83 -104 46 80 -105
2674 -105 109 37 -169 186 71 -235 169 50 -185 182 4 -143 205 -44 -175 194 -19 -82 112 -89 -13
2695 -13 104 -127 31 87 -111 36 1 -67 125 -71 -124 157 -41 -69 118 -108 -13 122 -141 34 147 -154
2717 -154 31 86 -102 115 22 -161 133 33 -103 108 -1 -51 67 -47 17 119 -90 -26 61 -34 78 -7 -87
2740 -87 119 -17 -95 137 -27 -69 77 -88 -31 182 -103 -94 125 -40 -22 82 -57 -15 27 -61 11 42 1 -52 -52
2765 -52 59 31 -71 34 -5 -69 74 4 -59 99 -53 -113 118 36 -51 48 -51 -22 100 -27 -27 63 -35 -33 55 36 22
2792 22 -13 -34 29 48 32 -27 -28 47 -4 -29 79 -12 -69 49 -23 -3 121 -65 -83 113 -15 -32 91 -39 -36 63 -55
2819 -55 1 94 -72 -71 37 5 32 -19 -73 25 5 -36 61 -5 -34 22 -83 22 98 -76 -47 60 -4 8 51 -64 17
2846 17 32 -70 35 86 -43 -22 2 1 74 14 -48 39 10 -10 32 10 21 -17 -68 41 72 -34 -2 -19 -27 99 -12 -58
2874 -58 86 -45 -77 105 -5 -18 71 -114 -21 169 -68 -51 83 -82 5 94 -82 34 55 -131 44 96 -57
2897 -57 3 -37 -63 107 0 -63 79 -39 -34 81 -39 34 54 -128 27 121 -55 31 18 -81 93 33 -71 94 4
2922 4 -95 90 17 12 57 -87 -7 106 -26 8 32 -44 43 2 -49 101 -19 -104 59 -7 -9 81 -115 -30 113 -102 6
2949 6 87 -96 16 45 -105 93 52 -162 46 47 -70 84 -7 -91 86 -15 -59 114 -7 -53 50 -16 43 73 -74
2974 -74 2 51 -30 28 10 -31 48 -41 -26 92 -2 -28 21 -35 49 56 -77 16 45 -62 37 40 -16 36 -44 -54 76 10 -46
3003 -46 27 -42 9 52 -72 5 29 -77 11 54 -22 36 -29 -77 89 -10 -71 48 -14 -44 65 -33 -10 75 -74 -41 98
3030 98 -10 -17 27 -53 26 62 -55 11 51 -45 0 32 12 36 -11 -47 42 27 26 -9 -14 35 1 -27 65 -1 -44 27 -10 13 63
3061 63 -60 -47 84 -20 -30 50 -33 -13 29 -50 28 56 -61 -19 34 -8 29 -16 -41 51 4 -28 68 0 -19 30 -44 34
3089 34 71 -56 5 64 -32 23 41 -42 52 20 -80 65 71 -45 20 4 6 66 3 -20 51 -5 -9 13 13 19 -14 -39 43 35 -25
3120 -25 11 -34 -4 64 -47 -22 73 -48 -30 58 -13 -8 22 -75 12 63 -65 -15 42 -36 2 -10 -31 39 0 -56 16 16 17 -1
3150 -1 -38 50 41 -47 29 19 -28 36 -17 -28 94 -18 -74 85 6 -36 65 -12 -8 88 -36 -26 95 0 -36 35 18 9 17 -15
3180 -15 -9 27 20 1 -18 43 16 -79 43 45 -57 27 4 -73 65 11 -103 58 34 -100 50 39 -55 56 -6 -65 73
3207 73 22 -61 38 11 -17 23 0 10 31 -34 -9 23 21 19 -33 1 63 -42 -2 74 -42 7 33 -60 53 83 -101 12 86
3236 86 -60 24 44 -61 44 44 -81 45 48 -63 3 33 -4 28 -21 -9 26 -22 25 5 -17 49 -29 -71 95 2 -92 73
3264 73 -19 -70 90 -43 -68 113 -35 -59 101 -3 -39 64 -50 9 70 -51 4 53 -35 18 28 -24 67 -15 -37 57
3290 57 14 2 30 -41 34 64 -53 40 49 -73 55 10 -70 99 5 -110 116 40 -88 98 4 -66 86 -20 -70 82
3316 82 -30 -69 56 -2 -5 6 -46 20 7 -32 22 -14 -25 52 -52 -16 104 -54 -50 80 -26 -14 68 -59 11 65 -50
3343 -50 7 72 -25 6 19 -5 63 19 -34 41 18 -8 27 -7 6 39 -42 11 50 -21 2 1 -17 41 -1 -46 56 1 -52 56
3373 56 4 -48 44 -35 -39 91 7 -69 38 10 -48 26 21 -31 31 7 -37 28 48 -36 -43 37 24 -35 26 28 -31 28 25 -28 44 38
3405 38 -71 -3 58 -32 5 37 -16 16 42 -17 11 42 -30 -6 43 4 -4 5 -14 31 31 -29 -2 41 -10 -18 17 -10 12 4 -27 -6
3437 -6 28 -19 -36 24 2 -23 2 9 -13 6 -8 -33 22 17 -34 -21 22 7 -18 7 14 -8 -13 11 -3 13 34 -47 -9 62 -21 -44 47
3470 47 3 -7 38 -15 1 46 -15 -13 41 10 -13 -5 7 29 -7 0 17 -11 14 6 -27 33 22 -51 25 30 -28 17 -14 -31 62 -6 -43
3503 -43 54 -8 -27 44 -36 5 58 -74 -3 73 -37 0 44 -35 24 23 -52 40 26 -55 33 7 -7 46 -29 -13 64 -26 -19 53
3533 53 -33 13 30 -63 33 52 -67 17 46 -32 21 17 -30 45 12 -36 53 15 -8 8 -25 33 26 -51 26 11 -40 35 -13 -37 65
3564 65 -27 -60 65 -20 -50 47 -28 -13 59 -63 -11 72 -52 -14 45 -35 16 22 -53 42 44 -49 15 32 -11 38 11 -18 49 -5
3594 -5 -20 34 6 2 4 -19 31 20 -28 -1 16 -6 13 0 -7 41 -3 -29 50 8 -30 27 -14 -1 44 -23 -19 36 -16 -22 15 -5 12
3627 12 -4 -29 6 2 -44 -6 -3 -17 25 -25 -28 38 -4 -24 18 -11 2 28 -28 10 48 -35 3 50 -12 4 13 -17 26 16 -33 44
3659 44 22 -24 26 4 2 45 -19 -19 36 8 -21 17 -6 16 14 -19 6 28 -11 -9 7 -5 26 -21 -13 35 -5 0 22 -12 22 4 -38
3692 -38 31 36 -30 9 -5 -8 35 -13 -28 30 -9 -32 43 20 -20 25 -9 7 39 -15 -7 40 17 4 17 -3 -2 19 -6 17 12 10 11 1
3726 1 24 26 -19 12 18 1 16 6 6 23 -5 -20 28 15 -18 4 -6 15 27 -15 0 13 -4 0 7 4 19 -13 -16 17 22 -6 -25 4 1
3761 1 6 -9 -6 3 -9 -2 16 12 8 -10 -14 15 22 -3 -4 6 7 12 4 15 8 1 -3 11 23 7 -17 1 24 -7 7 6 7 6 -7 -20 10 6 -22 4
3801 4 8 4 19 -8 4 27 -11 -1 2 -17 8 2 -20 20 24 -27 7 12 -5 7 7 -3 15 10 0 7 19 6 -21 -2 30 5 -21 3 0 1
3837 1 8 -9 9 28 -12 12 38 3 9 22 -9 33 26 -25 13 39 -9 1 21 -19 12 -4 -20 23 21 -18 -1 8 11 10 3 -8 24 5 -28
3872 -28 4 17 -2 -15 -6 13 18 -15 15 6 -11 18 -8 -6 37 -13 -26 29 4 -2 20 -6 -2 30 -14 -6 42 -3 -3 20 2 21 13 -18 28
3907 28 3 3 11 9 -3 30 -11 15 52 -22 -11 18 -11 20 19 -44 16 34 -34 8 23 -41 12 7 -26 23 6 -40 17 6 -21 15 -13
3940 -13 -15 27 -23 -22 36 -10 -6 21 -6 28 17 -22 13 12 -13 29 -7 -4 3 -17 -10 52 -10 -3 31 -9 31 19 -30 13 38 -22 12 22
3974 22 -21 17 2 -18 40 16 -19 17 1 22 25 -10 8 37 -23 11 27 -9 -4 -17 -15 22 10 -36 13 19 -27 5 9 -16 15 -3 6
4007 6 23 23 -4 -7 4 17 18 -6 20 9 -8 7 7 -1 22 -12 -4 36 15 -24 18 16 -4 29 12 -6 13 -5 -13 19 12 -6 12 -2 -7 18
4043 18 -13 0 10 -6 -10 14 -6 -6 -12 -18 10 25 -13 -16 11 10 2 -9 -24 12 -20 -4 24 -4 5 -4 -23 6 29 -24 -11 21 -13 2 21
4078 21 -15 1 9 -17 14 18 -1 -5 3 12 6 12 12 14 -1 16 15 3 19 6 -34 7 32 -18 10 17 -19 17 16 -20 21 10 -38 13 18 1 6
4115 6 7 -17 24 -3 -15 21 -4 -25 16 10 -9 3 -6 -13 17 6 -10 -6 -8 2 15 -2 11 2 -6 3 -1 0 32 -22 2 41 -2 1 47 -1 -10
4152 -10 26 -17 1 28 -19 -11 31 -3 -3 5 -10 3 26 -21 9 2 -9 2 -11 17 19 -32 -3 31 -11 15 11 -33 33 24 -38 27 13 -36
4186 -36 25 25 -36 28 -2 -50 36 10 -24 31 10 -27 16 -10 1 26 -5 -8 9 12 4 -9 -1 24 -8 11 30 0 -6 10 -14 15 46
4219 46 -27 10 38 -34 4 29 -21 10 26 -15 27 34 -12 -2 -1 -6 9 -3 -10 5 2 3 7 -10 17 10 -16 29 13 -15 19 7 -14 18
4253 18 8 -11 24 -1 -30 25 5 -17 19 -1 -17 24 0 -13 29 11 -14 16 12 13 8 8 -8 11 8 -1 0 10 17 -10 11 14 -16 10 11
4288 11 -14 27 28 -28 8 34 -28 3 13 -16 2 15 -21 5 1 -24 -8 24 -7 -9 -4 -3 5 9 -11 -8 9 15 -13 7 14 -17 -6 26 -6
4323 -6 0 18 -7 -3 22 15 2 22 0 -11 9 12 7 29 -9 -12 17 17 -10 19 17 4 10 24 8 9 11 1 1 24 7 -7 17 6 4 17 16 -14
4361 -14 -8 4 -13 13 8 -9 1 7 -3 2 14 -1 17 10 -9 -2 26 -13 -16 16 5 -12 6 -7 -19 7 -1 -17 13 7 -19 9 25 -10 2
4396 2 -4 -29 13 12 -1 -4 22 9 3 19 9 -2 -2 -3 3 15 3 -9 4 22 -14 -11 16 -12 2 9 -10 -3 18 -20 -7 26 -8 -2 12 2
4432 2 -2 4 8 -16 6 5 -17 13 -4 -14 -1 1 -5 -3 8 -5 3 6 -10 -5 17 -11 -6 25 6 -7 15 -7 0 12 -12 9 37 15 -1 -6 0 6
4470 6 13 11 -8 5 12 8 -1 13 -4 -24 5 8 11 12 13 -13 10 -3 -25 7 16 -27 0 1 -14 1 -13 -18 6 0 -10 -5 -1 8 1 1 3 12 0 -5 -2 8
4512 8 1 3 -7 9 7 -2 28 5 -4 18 -8 4 16 -2 6 26 3 -2 13 -3 7 13 -4 -3 12 0 -4 -2 2 -1 11 -6 11 1 -3 9 -7 12
4550 12 -1 -11 7 16 -15 -9 -12 -12 7 2 -12 -1 -11 -10 11 -3 2 9 -8 -1 17 7 -8 17 21 -3 -1 -11 9 10 -3 8 8 9 19 -6 6
4587 6 24 4 12 14 -4 8 22 -6 5 16 -6 3 17 -9 8 2 3 4 20 -11 -1 6 -13 1 7 6 8 -9 -4 8 -14 2 -7 -4 7 -15 -5
4624 -5 4 0 -8 -5 9 -2 9 -5 -13 16 -9 -15 9 4 -5 12 -4 0 22 10 0 12 12 4 -7 3 12 -4 -6 16 20 3 0 -1 7 11 3 -4 12 9 2 6
4666 6 0 -1 7 6 3 13 -13 2 2 -11 -7 13 -14 0 15 -20 0 4 -2 4 19 -4 13 7 7 1 9 12 -3 -4 0 -7 -9 14 -1 9 5 3 -1 29 1 -8
4708 -8 15 5 10 21 9 5 19 4 4 18 -3 -3 1 11 12 11 3 -4 8 3 10 1 -2 4 -7 -5 8 11 -3 7 -1 -2 -3 6 0 6 -2 4 4 0 -3 -7 1 9 6 -4
4754 -4 4 15 4 5 14 -1 9 2 8 7 4 2 1 5 16 1 -3 -10 10 9 -9 11 13 3 0 3 20 15 12 12 -1 0 -4 10 0 -2 0 1 -6 -8 -3 -7 8 -3 -7
4799 -7 -6 -13 -2 1 3 15 5 1 2 5 5 3 11 0 2 -7 11 4 -5 -1 2 0 8 11 3 5 4 -11 9 5 7 8 8 -5 0 -7 6 2 -12 12 6 -9 -6 9 -6 25
4845 25 -2 -3 11 1 -4 19 6 14 -2 -4 6 11 11 -6 -13 -4 -2 -3 2 1 -1 5 8 10 -3 6 -6 -8 11 -3 6 14 -9 -5 -5 7 8 10 1 -1 7 3 7 -6 -2
4890 -2 12 4 6 -3 -1 5 4 6 11 7 -5 -7 2 1 4 3 -6 8 19 -4 12 7 7 11 0 1 -2 5 -3 -5 12 4 12 12 -13 6 2 -3 9 1 -6 14 -1 -2 -1 0 6 -1
4938 -1 -4 -3 3 -7 1 -2 2 4 5 15 13 -10 7 20 6 1 4 -2 3 13 7 10 14 -2 11 12 1 2 8 0 17 1 4 11 -8 7 10 12 6 1 0 1 10 2 1 14
4984 14 3 0 1 -2 8 -15 -6 14 4 -6 0 3 1 -1 6 3 -6 2 2 10 4 -2 1 13 -2 1 6 -4 10 4 -12 -1 10 -11 -10 -1 7 3 9 2 3 8 -7 2 5
5029 5 -6 -5 18 4 9 1 -3 2 2 -7 5 15 6 3 -2 11 6 3 8 9 -3 1 -9 -6 -6 0 -8 6 1 0 -18 7 -3 7 2 2 -7 -2 23 -9 2 17 -2
5072 -2 3 18 -6 2 3 3 12 13 6 0 7 6 12 18 9 24 15 4 16 3 -6 -1 3 -12 3 11 2 4 -1 -1 3 -3 10 -7 1 2 1 7 -1 -2 5 3 -5 -2 15 6 1 9 -8
5121 -8 4 12 2 -1 4 -9 -9 6 -3 10 7 -2 10 18 -5 -2 -1 -3 1 3 9 15 1 8 11 3 0 21 14 20 17 -6 4 9 -5 -2 1 -8 1 2 -3 5 4 -4 -2 -8 3 8
5169 8 -8 -2 -9 0 -3 0 -1 2 14 -8 1 15 -9 10 -4 -12 -4 -1 -3 -6 1 3 2 10 -6 11 10 1 0 -9 8 8 11 -3 19 -11 5 8 4 4 1 1 3 0 9 8 2
5216 2 5 12 -3 12 0 -4 0 6 -4 10 10 -14 4 17 2 -9 14 -14 2 5 3 -8 1 -1 2 -9 11 -6 -8 8 3 9 12 8 4 11 6 -6 0 10 4
5257 4 11 -8 8 8 11 -6 -4 5 0 7 7 11 4 -4 5 14 0 14 4 4 1 -2 9 9 9 0 4 11 7 6 1 8 7 11 9 18 -4 0 -4 -9 15 5 -15 -2 3 2 3 15
5305 15 4 -3 4 6 2 6 4 4 4 9 -8 -7 6 1 4 4 -12 1 8 3 -10 10 0 -7 9 2 3 9 -6 3 16 9 -14 13 0 -5 17 5 4 9 -2 -4 18
5348 18 3 4 0 6 1 5 -3 5 7 6 -2 -5 11 1 3 -8 13 -6 -3 0 -5 11 -5 -3 0 6 6 -6 5 4 6 -1 0 21 -9 1 10 -2 9 -1 7 15 10 -2
5392 -2 19 6 5 7 -7 3 7 -9 -6 14 4 7 6 1 8 10 8 4 11 17 3 -2 4 2 8 -2 5 1 6 0 -7 1 -4 -6 -12 -5 -5 4 6 -8 9 -11 -7 8 3 -6 -1 5
5440 5 4 -4 -14 14 19 8 3 -5 16 2 0 8 -7 -2 5 -3 13 9 -14 4 7 3 2 11 -6 19 1 6 9 12 6 3 2 0 9 7 5 6 10 3 11 15 -6 2 -5 12 14
5487 14 -1 6 10 3 6 7 3 7 -2 -6 11 10 11 0 1 8 11 3 -2 12 10 9 20 12 29 -2 8 14 5 5 12 11 10 17 3 5 15 5 17 12 13 4 8 -4 8 19
5533 19 -9 8 9 10 14 10 1 3 2 -13 15 3 1 18 -14 0 10 -1 -1 19 7 2 -4 -10 -3 14 -1 12 12 7 8 7 11 14 2 8 16 15 2 7 2 25
5575 25 9 -4 17 10 12 11 11 8 26 3 -8 20 15 3 3 14 13 1 10 11 18 -7 -8 5 -11 16 2 6 13 12 -9 12 3 11 7 4 3 -1 4 2 3 -5 13
5618 13 6 -4 10 13 2 2 8 6 -1 -2 8 18 17 -4 10 16 3 3 9 10 8 -5 0 13 13 20 5 11 8 -4 -8 17 10 -1 -5 4 2 19 2 -13 14 1
5660 1 -1 3 -1 5 2 7 3 1 -10 -3 5 10 -8 6 0 2 -3 -15 6 8 -2 1 1 -10 6 -9 0 6 0 1 -5 6 8 0 10 9 6 2 11 7 13 10 6 -4 6 1 6 -12
5708 -12 2 15 11 7 -7 8 -5 -4 7 14 6 -1 9 10 11 1 -5 0 -4 -2 -4 2 -1 2 -6 1 0 -6 -3 1 3 0 -10 -8 -7 -8 -18 2 0 -8 -1 4 7 -1 -4 6 10 2
5756 2 4 1 1 7 -2 10 9 6 5 6 11 14 7 -4 10 4 1 11 4 9 -2 8 10 6 -3 -7 3 3 11 -2 5 -11 9 14 -3 -12 10 1 2 6 -4 13 4 -10 -4 7
5802 7 -3 14 -1 6 3 -8 1 13 9 -1 6 7 15 1 10 10 14 -8 -3 -3 4 12 4 0 2 -3 -2 25 12 -4 20 -3 15 18 -5 1 7 3 -1 -2 -5 7 13 -4
5846 -4 21 4 4 -3 -9 -2 10 0 -11 -7 -14 -5 -3 -19 4 -10 -5 7 11 -5 -2 7 -10 -7 -16 -21 8 -6 -10 12 3 6 -1 -10 -8 12 10 -12 9 2 -8 -3 -2
5889 -2 -5 1 -5 2 2 -1 0 -6 6 14 -2 -3 7 -10 0 3 -9 17 4 -4 10 13 -10 7 2 -7 3 -4 -10 -1 -7 -14 2 -4 -12 9 2 -1 -4 -15 -3 -5 -2 -4 -7
5934 -7 -10 1 -4 -4 5 -5 -2 -1 -8 7 25 -11 -1 14 5 9 -3 -10 11 4 -8 12 19 9 15 -2 2 15 6 -3 5 12 0 7 -10 -10 5 6 6 12 2 -13
5976 -13 -6 9 -2 0 -12 -2 -1 -7 4 -13 1 5 -6 5 0 0 6 0 8 1 8 4 2 -2 -5 -9 -3 10 -9 -12 2 12 -12 -1 8 5 -11 0 -4 3 4 2 5
6019 5 8 0 2 9 8 0 -3 -4 -7 15 -10 2 2 0 -11 -4 7 0 0 -8 -8 -5 -2 -10 12 3 3 3 4 -1 3 -4 -6 0 9 -2 -4 10 3 -2 9 -5 3 9 -1 6 25 -5
6067 -5 -1 17 -1 2 19 8 -2 21 2 -7 9 -1 -9 20 7 9 10 0 -7 17 5 11 10 -3 6 1 -4 5 2 -11 1 -6 2 3 -13 12 16 -10 5 2
6107 2 -2 9 -2 7 13 3 -5 5 6 -6 -1 -7 -5 5 -5 6 -3 5 -3 -4 -5 18 -7 2 9 -1 -2 10 7 -1 12 -6 -7 22 9 -6 21 2 11 20 5
6148 5 3 5 -4 3 4 -4 -10 -12 -10 2 -5 2 -4 -8 4 -3 -7 11 9 -11 -4 8 -9 0 -4 -24 12 -4 -9 10 3 -3 4 7 -18 20 5 -12 7 10 -4 7 -1 4
6192 4 17 0 8 6 6 7 15 10 3 10 1 7 20 2 2 18 -3 10 10 -7 15 -3 -6 0 5 -1 7 -11 11 1 4 5 9 -6 -8 4 -9 -2 -13 -5 -7 -2 14
6235 14 -1 -7 -2 0 -4 -11 14 0 8 -14 -4 12 -1 -6 6 4 -10 -2 7 7 -2 -20 0 13 -10 -7 -5 7 1 4 -22 8 10 1 -5 -13 9 -1 -6 11 9
6276 9 10 -5 8 3 4 12 13 10 -4 -12 -1 6 -1 -2 -11 -19 -8 4 -3 -5 3 5 -19 4 5 -3 1 0 14 7 14 -8 5 8 8 4 3 0 -6 -17 4 3 7 3 3 9 4 6
6324 6 -2 -12 7 -5 -6 18 3 -11 -2 19 9 -7 -19 -10 -1 1 -1 9 1 -13 5 -2 -6 14 6 1 5 6 -9 0 6 -20 -3 -6 -8 -7 3 2 -8 5 -15
6365 -15 -3 6 2 10 12 9 3 14 -8 10 20 7 -2 4 -1 3 27 -10 -2 4 -2 -2 11 8 5 2 -8 -5 16 5 -8 6 12 -2 3 6 -4 -7 2 -9 1 25
6407 25 -8 -10 27 2 -12 13 -4 -5 4 -9 -2 24 -1 -5 4 0 -11 17 0 -7 5 -12 8 4 -2 6 -7 6 12 -6 0 2 -2 0 -11 -2 10 -2 1
6446 1 5 6 10 7 12 4 6 6 -2 19 -6 -7 5 -6 11 6 -2 13 11 -8 -12 -5 2 8 2 -12 -1 -15 -15 2 -9 -11 11 -2 -3 6 0 -5 10 4 -16 -1 1 1
6490 1 0 2 -2 8 -1 -2 -12 -4 9 -9 18 0 -1 3 0 -10 13 10 -8 5 8 -20 5 2 -5 15 -1 -10 24 16 -16 -4 -5 -3 -3 -11 -7 -8 -18 -8 6
6531 6 -10 -5 -3 -6 -5 0 -7 0 -4 7 10 -15 11 12 1 2 5 2 8 3 -5 18 5 -9 11 0 -6 0 -3 -26 -2 -8 -1 12 3 -1 3 -5 9 0 -13 -8 10 9 7
6576 7 1 8 20 7 -10 13 -2 10 8 -3 7 1 -4 6 1 -11 4 -1 7 -4 -13 -12 2 6 2 -5 -1 1 -8 -11 7 15 -8 -2 7 0 -5 -2 -4 3 17 -2 2 2
6620 2 -1 9 8 -4 10 -3 3 0 9 0 -9 -6 -1 -7 -10 -3 3 8 -15 -1 7 1 -5 2 9 -8 -9 -1 -3 4 -7 -6 -4 8 -12 14 4 -3 -5 -12 -7 5 -9 -16 -9 8
6666 8 1 -8 0 -3 2 -14 -1 -6 -5 5 -9 -18 10 -6 -4 2 18 13 2 2 3 1 -2 2 -1 8 -1 -9 5 15 -8 -3 4 8 11 9 4 23 1 -6 7 6 11 0 4 -12
6712 -12 2 -3 -11 6 2 3 -1 10 11 -22 -12 -1 -1 6 -8 -3 1 5 -9 2 16 -12 -8 -13 -2 3 -4 -25 7 10 -10 14 -6 -17 11 2 -8 15 -7
6751 -7 -16 5 4 -1 11 -9 3 12 2 -3 -3 7 -10 -3 -12 10 4 -16 -5 -5 7 0 -11 3 4 -4 17 21 -16 8 -16 -26 19 11 -7 2 -8 -3 -16
6790 -16 -9 -2 10 -14 -1 2 -2 -16 1 -6 6 3 -12 -2 1 -3 1 -3 9 -2 -4 -5 0 7 -6 -7 -7 11 -1 -1 4 1 -2 -6 4 -7 9 -7 1 13 -2
6831 -2 -11 12 -12 -14 -1 -21 -1 13 -13 0 8 -5 -4 2 -24 3 15 -17 10 -5 -10 -15 -1 -11 -3 -5 -20 1 16 6 -9 5 -2 -7 -9 4 3
6868 3 6 -8 6 1 4 -12 -2 3 2 -1 6 5 6 12 -8 13 20 -5 6 16 -5 7 12 -5 1 4 -13 -3 15 -10 -13 -4 3 2 -7 -12 -13 15 1 -9 12
6909 12 7 -12 -7 1 -6 -5 -9 -3 1 3 -10 -6 5 -3 -6 6 13 -4 -7 -13 11 -1 -12 -5 10 2 3 3 -2 6 -5 -12 -10 8 6 -6 3 1 17 13 2 -5 2 -6 0 7
6955 7 -1 -6 -1 -8 3 12 -9 -15 -2 0 8 -11 -13 2 -2 -5 7 0 1 -11 -13 -3 0 -14 -8 -7 6 -3 4 7 -5 4 3 13 14 -7 -15 0 5 -4 -5 -3 8 6 0 8
7001 8 -2 2 -7 6 16 1 -8 0 2 3 1 10 -1 18 -9 3 22 5 -9 2 -7 -6 -4 -10 -3 12 0 -14 7 6 -10 5 -15 -4 6 -5 -13 8
7039 8 11 -3 3 -3 18 -6 3 15 8 5 3 -11 -5 8 0 10 3 1 17 -2 2 7 8 2 16 18 5 3 -7 -17 9 1 -2 6 -8 1 4 10 10 -2 7 7 8 3 3
7084 3 -8 -5 5 -5 -1 8 2 -11 5 0 12 14 -10 -3 15 -12 -19 8 -13 -2 -7 -5 -3 7 -14 1 7 -2 -5 -12 2 11 -3 -12 4 2 -7 -5 -1 8 3 -2 5
7127 5 0 -11 -7 7 -27 12 -1 -12 25 11 -15 3 3 -17 8 3 -9 -3 1 -23 -3 5 -19 -8 -3 5 -26 -3 -6 -9 1 15 -25 -7 2 -15 5
7164 5 11 -9 -6 -4 -8 10 9 -18 -3 4 -3 -4 11 1 4 3 -18 16 17 -8 4 4 -1 11 8 -3 3 13 2 -2 14 12 -7 3 17 4 -4 9 -8 9
7204 9 8 -13 5 20 -12 -13 6 -8 1 -1 -10 13 13 -6 0 7 -4 3 -8 -2 1 -2 -13 5 -5 -6 -4 -2 8 6 -11 -9 -1 -4 -3 -4 10 14 2 2 9 3 -6 7
7248 7 6 0 -2 -8 -5 -5 -11 -3 2 -1 9 -9 3 6 3 -5 9 4 -6 -1 0 4 12 -26 -8 15 0 -1 3 -12 2 3 -20 -8 13 -2 -5 2 1 3 5 -7 8 4
7292 4 17 -17 3 16 -1 5 9 -7 12 -8 -3 8 10 -1 -5 8 -5 -1 6 -11 0 8 -1 -5 12 -3 -7 3 4 -6 0 9 -10 -3 -7 -5 -1 4 -21 -18 9
7333 9 9 -7 3 -15 3 11 -23 -2 10 0 -5 -3 6 -10 3 1 -5 -2 -10 4 3 0 8 -4 5 11 -1 -7 5 -1 24 -4 -10 12 7 -4 5 4 2 13 -5
7374 -5 5 4 2 0 17 6 -2 5 4 19 3 -3 3 11 1 -5 -4 0 19 -3 -3 16 6 -1 5 7 3 15 -10 16 18 -7 -12 12 0 -6 13 -17 -5 8 -8
7415 -8 -8 1 -1 -4 -4 7 11 -8 4 -1 -6 11 -7 -10 19 1 -27 22 -3 -1 -7 0 -3 19 -6 -17 21 2 2 8 -7 10 2 4 11 9 -12 9 11 -4 6
7456 6 -9 -4 -11 8 1 9 2 4 3 -29 7 11 -10 -2 -11 -2 3 -14 -16 -8 7 3 -4 -5 4 -9 -7 7 -7 -5 -12 4 8 6 -14 -1 21 -10 -10 8 -6 5 2
7499 2 -15 -10 10 -12 -12 11 -4 -16 -11 -1 -4 -1 7 -9 6 -1 -10 -5 6 -9 -9 -5 -2 12 -7 -7 5 7 -19 -15 1 -9 -3 5 17 -5 17 -4 -8 10
7539 10 -3 -4 0 2 -11 5 14 -11 8 7 -11 9 -8 -6 2 6 -3 -8 2 -8 12 8 -5 -6 9 -3 -8 0 2 -4 -9 -1 -9 6 -4 -11 -1 17 -1 -8 -3
7580 -3 7 3 0 -8 0 2 -7 -14 1 2 -16 -6 -2 -9 1 -14 -5 -9 -1 -2 -11 8 -9 -7 3 11 4 -4 6 1 10 0 -8 4 6 6 -1 18 5 -6 12 -2 7 0
7624 0 -10 0 12 6 -7 7 -5 -13 -1 -9 -6 27 -1 -7 24 0 -2 -2 5 -11 -10 -5 -5 8 -1 -11 -9 4 8 -11 -5 -4 -8 1 -3 -11 8 -6 -5 13 9 -22
7666 -22 7 0 1 12 1 -21 15 12 -6 14 9 3 17 8 -3 9 -1 -2 -1 13 -2 -8 5 -4 -2 1 4 11 5 4 9 -15 17 -6 3 15 3 -3 0 -3 -7
7707 -7 15 -4 -3 6 -15 -11 4 -4 8 0 -9 -4 -2 -6 -3 -4 8 1 -23 -11 -6 -17 1 10 -10 11 -10 -25 -3 7 -20 -7 -11 -4 24 0 -11 11 4
7746 4 1 10 -3 2 4 -6 -8 9 -25 -3 3 -10 2 -11 -12 12 -7 -18 10 -11 -3 8 -14 7 11 -19 1 12 -9 -5 5 -18 4 8 -15 6
7782 6 9 -9 13 17 -14 1 -2 -8 9 4 -16 -1 -3 -2 0 -10 5 4 -5 3 4 4 11 -12 -9 21 6 -19 27 -12 -8 19 -3 1 28 -3 -3 9 -17 -7
7822 -7 3 -1 21 6 -16 12 1 -28 -1 -14 -8 11 -11 -15 10 -15 -2 16 -1 3 -11 -11 15 11 -22 8 -3 -10 -8 -15 12 15 -7 -21 22 -6
7858 -6 -10 4 -17 -1 27 -15 1 4 -24 2 -8 -9 11 -4 -13 18 12 1 10 -20 2 15 -8 1 11 -11 10 -3 -19 9 -8 -17 8 2 -5 2
7894 2 -5 -12 18 -15 -5 22 -8 -1 11 -6 -6 -4 -5 -2 5 -18 -3 -4 -2 17 -6 4 14 -14 7 5 0 2 4 -18 -7 0 -20 -6 3 -9 -5 2 -7 14
7934 14 -5 -18 16 6 -4 14 8 10 5 11 12 12 4 2 -9 -4 11 2 -6 6 -1 -16 -1 -9 5 9 -16 -1 11 -1 -11 -6 -1 10 4 -10 -6 -1 -13 -8
7974 -8 6 11 -1 6 1 -9 2 -5 2 13 -10 15 1 -1 5 -5 -11 -1 2 -1 -8 7 12 3 -3 9 6 -8 -14 6 11 1 1 -4 15 9 -3 -2 -7 6 -4 -3
8016 -3 5 -11 -4 -2 -16 0 -2 -8 3 3 -19 -3 -3 -6 -6 -14 -13 13 -15 -23 5 -6 11 7 -8 -12 8 9 1 3 7 8 -12 9 5 -2 -12 -2 2 5 -3 -15 12
8059 12 10 -10 -2 13 -9 3 -7 -10 12 2 -5 0 3 -8 8 -3 8 8 -1 9 3 9 5 -5 12 30 -9 -6 7 -5 8 0 -5 7 13 -21 8 12
8097 12 -2 -11 0 -7 7 12 -11 23 2 -3 9 6 -3 2 5 8 -5 7 -2 2 10 12 -3 1 21 11 -3 8 6 5 -2 -14 3 15 2 -5 4 -6 10 2
8137 2 9 5 14 7 -1 7 -1 -2 -7 12 7 -7 -4 3 -2 -4 1 -8 -1 11 -12 -2 6 -19 2 -4 -3 3 11 -4 17 13 -5 0 15 0 -6 15 0 0 10 -14 2 20
8181 20 14 -4 3 17 17 -6 11 5 5 2
8191B
$$ Imaginary data points
##PAGE= N=2
##DATA TABLE= (X++(I..I)), XYDATA
0 0 0 0 0 0 0 0 0 0 0 0 -8 8 -8 8 -8 16 -16 18 -24 25 -32 40 -42 49 -57 65 -76 88 -97 112 -126 142 -158
33 -158 177 -198 219 -244 271 -302 335 -370 408 -453 501 -555 616 -684 761 -851 950 -1071
51 -1071 1215 -1390 1609 -1892 2272 -2810 3636 -5083 8308 -28553 25197 37683 -61666 37456
65 37456 18860 -56485 28737 22580 -40468 27745 4257 -32407 22353 4622 -14567 17936
77 17936 -12542 -7916 16581 -9495 2808 10274 -18837 4998 9585 -11094 8461 2828 -13017
90 -13017 5171 2588 -334 2914 -5610 2652 -1222 -5877 14351 -4675 -12336 16590 -8216 -10890
104 -10890 24152 -9795 -14315 20733 -10891 -8004 21498 -12216 -6227 14053 -13325 3222 11682
117 11682 -14297 7168 2168 -15849 18130 719 -18225 19674 -5813 -18488 26853 -4711
129 -4711 -19509 23547 -8494 -17394 26408 -4541 -16868 17213 -5877 -10236 16616 -3037 -8485
142 -8485 6371 -3556 -641 5298 -1716 414 -3861 -2158 7974 -2677 -2191 5532 -8083 -730
156 -730 10037 -5868 -817 5224 -8526 1681 7225 -5206 1782 269 -6490 6133 1617 -4582
170 -4582 5284 -3935 -4732 8694 -2418 -3244 6753 -6173 -3197 8515 -2920 -1837 3816 -4826
184 -4826 181 3747 -2031 1925 -1278 -3154 4161 -2108 -359 6197 -7013 -2236 8486 -6019
198 -6019 -448 8656 -9031 -1866 9423 -6864 -295 8296 -8200 -2117 7600 -3905 -339 4166
212 4166 -4683 -1076 3404 -403 121 -217 -757 -559 -835 3308 686 -4066 1662 117 -2453 4775
228 4775 -285 -4689 3254 -743 -2285 5187 -1462 -3502 2931 -1958 -26 4535 -3320 -1719 2497
243 2497 -2324 1466 2701 -3347 129 771 -1916 2679 907 -2391 430 -985 337 2725 -1729
258 -1729 -462 854 -2583 1969 2215 -3010 1300 311 -3591 3347 1993 -3676 1374 278 -2731 2940
274 2940 1175 -2728 906 91 -1593 1603 1277 -1073 -1073 -34 644 50 800 302 -2359 371 1861
291 1861 -1633 987 1586 -3459 230 2619 -1861 949 1292 -3574 826 2595 -2072 739 1191 -2850
307 -2850 505 1924 -1049 599 269 -2115 460 1707 -248 -363 -184 -603 -9 907 621 -673 -497
324 -497 31 -512 970 1337 -1529 -874 970 -449 494 1215 -1495 -602 979 -674 539 1300 -1458
341 -1458 -848 861 -20 541 452 -1289 -309 712 -53 395 244 -785 -344 149 388 700 -327 -922 41
360 41 356 336 353 -432 -510 172 20 182 608 -285 -840 62 495 277 177 -382 -660 302 550 -204 126 195
382 195 -792 -176 879 39 -194 119 -783 -28 1248 -341 -694 707 -472 -547 1222 -104 -771 727
400 727 -576 -677 1629 -83 -1423 844 70 -905 1155 110 -1225 794 81 -1069 1170 536 -1489
417 -1489 286 686 -731 498 501 -1155 177 874 -858 62 1063 -933 -567 1078 -337 -285 901
434 901 -856 -524 1381 -519 -729 1248 -495 -868 1161 -270 -504 1056 -771 -731 1368 -256 -751
451 -751 840 -372 -503 810 -287 -306 693 -494 -511 756 98 -464 117 -36 -144 331 26 -415 217
470 217 237 -559 177 615 -569 -110 411 -562 322 589 -1069 231 876 -1088 169 934 -1010 189
488 189 661 -1107 547 882 -1352 203 938 -954 213 680 -838 204 503 -752 238 670 -628
505 -628 -313 539 14 -231 182 -59 -288 381 141 -579 408 353 -921 316 747 -800 133 453 -888
524 -888 548 670 -1240 325 840 -1098 238 825 -969 171 614 -942 384 833 -1096 -126 926
541 926 -556 -195 611 -482 -201 646 -371 -335 702 -252 -656 668 261 -616 267 96 -467 540 141
560 141 -769 450 361 -739 302 426 -532 166 140 -445 499 135 -702 337 320 -386 199 14 -279 356
580 356 -83 -312 452 -26 -392 184 69 -7 93 -302 -7 346 -139 -215 110 81 -53 -68 33 -9 7 49 -240
603 -240 131 376 -562 -91 701 -482 -112 544 -795 295 879 -1241 194 1102 -1308 272 1086 -1392
621 -1392 468 861 -1557 879 948 -1776 640 854 -1252 811 277 -1204 955 153 -871 798 -96
638 -96 -505 432 -293 302 252 -832 457 105 -445 887 -683 -535 1388 -1008 -344 1618 -1429 -201
656 -201 1515 -1646 543 1422 -2327 722 1450 -2053 1086 690 -2111 1673 275 -1954 1985 -247
672 -247 -1751 2018 -630 -979 1929 -1488 -492 2114 -1694 -98 1558 -1828 709 1130 -2049 1197
688 1197 716 -1970 1452 267 -1512 1475 -462 -932 1743 -938 -693 1389 -966 195 793 -1414
704 -1414 916 385 -1454 1488 -227 -1389 1849 -925 -912 2446 -1769 -988 2687 -1802 -404 2325
720 2325 -2495 137 2422 -2614 512 2022 -2783 783 1715 -2303 1160 781 -2365 1626 759 -1908
736 -1908 1312 -45 -1262 1575 -434 -854 1328 -865 -408 1234 -747 65 378 -979 892 289
752 289 -1038 919 -330 -637 1437 -914 -504 1661 -1406 -309 1894 -1540 -106 1531 -1790 501
768 501 1527 -2106 521 1351 -1737 753 698 -1579 1106 261 -1362 1281 -170 -1086 1255 -514 -446
785 -446 1207 -1213 -137 1497 -1218 -60 988 -1268 506 849 -1330 622 477 -1183 806 341
801 341 -788 601 -392 -308 1077 -563 -334 619 -705 370 585 -991 543 277 -1077 928 321
818 321 -944 687 -270 -566 1222 -456 -735 935 -500 -162 902 -807 24 667 -958 352 773
835 773 -898 126 317 -548 541 84 -651 390 36 -259 246 -166 96 60 -422 395 131 -441 375
854 375 -197 -259 682 -444 -368 825 -380 -350 578 -355 11 419 -540 95 377 -411 153 118 -195 229 -239
875 -239 -88 494 -248 -172 169 -200 309 76 -450 373 -17 -386 506 -129 -203 440 -569 -21 818 -632
895 -632 -173 553 -620 252 530 -850 278 451 -851 371 485 -659 191 54 -372 585 -36 -495
913 -495 327 -52 -93 238 -228 109 103 -392 287 166 -264 197 -278 -93 628 -398 -220 556 -470 17 499
934 499 -578 292 434 -919 406 606 -834 346 309 -765 622 218 -869 677 200 -824 543
951 543 193 -525 446 -142 -411 559 -100 -378 340 -55 -114 102 -157 170 71 -312 125 61 -61 182 -293
972 -293 -52 407 -344 -84 389 -340 9 222 -400 300 281 -656 223 356 -457 233 108 -428 411 10 -463
993 -463 501 46 -470 303 -15 -130 367 -297 -174 457 -219 -121 290 -202 27 136 -312 245 223 -437 62
1014 62 213 -169 117 -17 -186 227 -13 -219 175 73 -117 -54 -29 144 19 -164 52 16 -18 107 -189 -22
1036 -22 297 -279 -155 386 -140 -159 200 -237 46 353 -371 -74 408 -269 -127 339 -164 -17 208 -296 76
1057 76 389 -254 -169 276 -31 -82 133 -22 -35 77 -96 -77 243 79 -305 -1 267 -103 -61 153 -174 -24
1079 -24 242 -218 -22 375 -309 -242 406 -27 -179 175 -205 -88 351 -155 -205 297 -93 -265 195 109 -104
1100 -104 -5 -104 -48 196 49 -171 -25 131 -41 -62 151 47 -146 -40 21 81 191 -125 -213 154 124 -98 30
1123 30 37 -72 0 20 62 112 -56 -206 -2 231 68 -169 -33 63 -77 83 84 -103 71 -5 -258 224 276 -343
1147 -343 -100 197 -141 81 167 -286 2 230 -286 17 396 -243 -278 220 -8 -30 203 -210 -196 298 10
1168 10 -243 219 93 -334 54 236 -89 40 28 -287 111 332 -230 -103 279 -179 -136 299 -59 -91 160
1189 160 -260 -46 439 -121 -275 221 -12 -97 205 -51 -100 132 -115 -105 271 82 -254 -61 145 -13 -25
1210 -25 83 -107 -65 163 -137 -80 321 -153 -318 269 67 -122 154 -177 -119 292 -117 -129 236 -91 -147 64
1232 64 21 161 -40 -233 137 43 -38 146 -186 -26 259 -261 17 376 -270 -100 185 -171 209 145 -395 141
1254 141 199 -229 147 75 -130 109 -125 -9 241 -116 -72 -17 -73 308 -117 -245 353 -217 -225 480 -292 -78
1276 -78 474 -647 -12 776 -634 -124 587 -637 109 566 -679 192 445 -722 228 451 -462 132 29
1295 29 -322 406 -11 -252 228 -150 -16 175 -233 271 53 -487 329 124 -273 351 -235 -244 581 -282 -179
1316 -179 550 -416 -106 443 -432 227 366 -704 216 417 -492 289 126 -464 412 -34 -371 520 -137 -399
1336 -399 348 -171 36 371 -538 36 420 -493 177 327 -544 226 174 -526 461 226 -682 241 249 -344 281
1357 281 43 -388 267 39 -253 274 72 -259 11 36 104 111 -159 -66 70 -18 106 -16 -82 141 -121 -97 317
1380 317 -19 -212 93 -84 63 290 -263 -84 284 -266 -17 342 -270 4 169 -411 254 376 -526 46
1400 46 248 -379 246 136 -432 308 4 -435 448 64 -347 244 -223 -76 499 -363 -136 430 -416 24
1420 24 421 -411 143 238 -570 317 383 -498 130 129 -288 335 40 -262 245 -98 -155 221 -7 54 -60 -279
1442 -279 294 107 -232 211 -156 -139 406 -263 -94 474 -438 -152 510 -331 26 328 -581 160 492 -560
1462 -560 87 382 -497 112 274 -362 211 155 -471 139 295 -273 -25 112 -120 -18 97 -55 -27 118 -83
1483 -83 -193 215 154 -241 23 109 -93 101 33 -115 122 -12 -159 148 115 -52 -62 -70 124 104 -77 24 -33
1506 -33 -33 101 -90 38 165 -224 -69 212 -59 60 -5 -262 206 124 -257 156 41 -250 132 -5 -60 211
1528 211 -187 -153 227 -7 0 -14 -177 179 12 -210 268 -48 -229 253 -147 -65 406 -346 -238 486 -202 -153
1550 -153 374 -278 -67 332 -292 16 340 -291 -82 195 -60 90 -29 -149 152 -5 -74 119 -61 28 38
1571 38 -210 174 180 -296 39 93 -178 183 -6 -236 232 -42 -274 252 59 -201 121 -135 -97 315 -138 -213
1593 -213 245 -60 -167 192 -41 -88 103 -135 -74 235 -20 -194 36 77 -22 -15 15 11 -51 9 46 -11 115 12
1617 12 -245 103 251 -180 -37 171 -175 22 206 -190 56 198 -308 -9 331 -128 -91 105 -133 82 139
1638 139 -168 15 81 -132 2 87 40 -10 -154 -25 158 -29 -43 -13 -93 106 20 -141 159 2 -241 114 74
1661 74 -76 130 -156 -172 294 -18 -200 195 -50 -171 179 -21 -53 211 -161 -177 257 67 -140 46 -2 -62
1683 -62 86 52 -43 25 29 -138 -16 257 -23 -220 88 71 -69 145 -6 -187 166 9 -202 246 110 -304
1705 -304 6 133 -85 110 8 -226 93 141 -143 45 123 -179 -86 117 19 33 3 -176 -21 198 -5 -103
1727 -103 45 -29 -70 70 85 15 -17 -101 -62 178 130 -128 -88 73 21 26 93 -59 -53 44 -67 58 239 -111 -222
1752 -222 125 74 -18 122 -109 -138 150 -9 -58 203 -52 -242 67 110 10 55 -126 -138 126 98 -57 -10 17
1775 17 -92 -83 130 124 -102 -90 -29 -23 190 56 -251 19 109 -150 126 171 -199 -9 46 -90 236 111 -315 -30
1799 -30 151 -24 87 54 -121 -24 17 5 130 56 -141 -130 67 216 14 -116 27 -54 -7 191 -35 -70 82
1822 82 -199 -23 349 -50 -197 53 -111 63 258 -179 -94 118 -165 15 254 -83 -112 -34 -94 162 163 -171
1844 -171 -105 -3 -1 81 20 0 -45 -149 58 155 19 41 -182 -165 300 91 -188 144 -81 -199 298 61 -100
1867 -100 212 -222 -221 426 73 -184 102 -148 -54 284 -31 -61 92 -166 -22 177 73 54 -205 -141 243 25
1889 25 -5 94 -282 -35 235 -165 139 185 -464 -4 286 -147 177 3 -442 248 204 -239 243 -49 -343 224
1911 224 20 -25 306 -292 -238 320 -25 66 126 -312 49 145 -137 280 22 -317 159 -48 36 428 -320 -240
1933 -240 395 -200 61 414 -446 -31 311 -377 260 410 -553 7 245 -226 331 75 -436 183 24 -134
1953 -134 326 -89 -176 101 -225 216 329 -384 -41 89 -243 376 101 -422 240 -83 -308 512 14 -342
1973 -342 202 -252 -35 549 -275 -224 258 -278 95 358 -281 29 42 -363 332 261 -275 68 -143 -109 456
1994 456 -76 -180 212 -310 -14 433 -211 58 116 -521 271 461 -402 97 66 -468 388 251 -420 263 -28
2015 -28 -494 432 219 -309 135 -202 -194 452 6 -201 103 -211 -49 250 -17 60 -97 -299 199 161 -23 99
2037 99 -323 -103 393 -139 21 263 -469 -31 359 -232 240 148 -656 220 388 -321 269 19 -518 352 143
2058 143 -245 415 -165 -424 360 18 -5 259 -436 -102 395 -178 149 162 -466 95 131 -203 413 -73 -525
2079 -525 251 44 -84 332 -287 -278 315 -139 55 288 -333 -114 89 -94 308 31 -377 85 -24 28 318
2100 318 -231 -105 166 -301 221 344 -405 41 59 -324 523 145 -551 291 -19 -337 562 -27 -394 353
2120 353 -259 -168 643 -169 -320 235 -224 87 372 -256 -49 68 -224 187 141 -103 15 -263 -8 343 -105
2141 -105 -32 5 -325 227 197 -273 231 -56 -427 346 117 -196 243 -293 -236 477 -69 -128 218 -321 -54 320
2163 320 -159 119 88 -439 150 251 -123 209 -157 -298 361 11 -116 300 -233 -203 310 -100 79 219 -413
2184 -413 -34 345 -147 80 87 -333 116 154 -152 201 -7 -303 90 94 36 122 -206 -124 143 -8 69 34 -195
2207 -195 30 -25 -66 316 -63 -291 135 -49 -15 313 -230 -209 282 -171 -36 338 -238 -151 186 -185 146 278
2229 278 -352 -47 196 -129 164 114 -251 86 16 -121 290 38 -234 66 -67 55 271 -201 -122 159 -148
2250 -148 87 192 -194 31 16 -199 288 141 -290 48 -7 -97 279 -62 -200 162 -136 -81 279 -64 -106 34
2272 34 -172 111 194 -177 -42 -4 -99 150 4 -58 108 -178 -88 260 -44 -41 52 -246 114 251 -202 51 89
2295 89 -257 141 131 -132 152 -67 -239 266 112 -135 78 -105 -61 209 -37 -12 129 -160 -53 160 4
2316 4 53 -50 -173 111 108 -44 66 -86 -73 98 -51 40 125 -182 -80 104 -6 69 -9 -191 43 95 -90 43
2340 43 26 -112 -13 18 39 77 -74 -94 21 59 65 -34 -79 43 -1 -25 115 3 -63 14 -68 60 160 -111 -95 84
2366 84 -16 22 83 -67 1 35 -77 67 126 -85 -75 3 24 60 11 -75 -22 24 -4 -1 40 19 -88 -49 90 35 -28
2393 -28 -20 -64 7 98 -61 -35 75 -70 -48 95 19 -17 -2 -92 18 109 -14 -82 35 17 -14 14 24 7 -22 -23 8 59
2421 59 51 -41 -72 98 52 -50 28 11 -47 28 19 -35 94 -14 -124 67 79 -55 3 -14 -51 70 8 -75 57 9 -95
2448 -95 3 46 10 -33 -44 12 38 3 -19 -29 15 23 -71 -1 77 -61 -48 27 -25 44 14 -131 32 92 -108 6 72 -79
2476 -79 3 40 -70 61 46 -132 7 99 -31 -23 22 -8 16 0 -15 9 12 11 -52 23 115 -66 -75 109 -20 -35 88 -88
2504 -88 -18 126 -115 -45 157 -89 -91 87 -33 18 71 -104 -6 84 -60 -36 29 2 -5 -34 10 47 -56 -12 -3 -23 87
2531 87 -26 -110 105 22 -106 90 4 -79 94 -59 -74 176 -56 -116 110 -16 -32 78 -52 13 80 -56 -18 68
2555 68 -9 6 -24 12 87 -57 -8 67 -56 46 37 -112 85 53 -189 77 99 -158 45 20 -137 123 4 -165
2579 -165 118 31 -143 69 8 -67 53 -60 -53 76 -23 -36 -2 -5 40 -52 -39 95 -29 -56 73 -60 -9 85 -126
2604 -126 0 168 -110 -39 132 -84 7 88 -102 43 93 -116 13 103 -33 11 13 -29 85 -20 -45 66 -17 -9
2628 -9 29 -67 63 52 -155 48 98 -116 52 37 -115 122 12 -187 144 27 -201 123 7 -132 154 -64
2650 -64 -140 191 -49 -170 135 -16 -106 96 -63 -22 97 -89 -43 64 -5 9 -34 -10 98 -73 -26 111 -85
2673 -85 25 97 -165 85 157 -241 60 162 -186 77 113 -187 143 74 -213 131 75 -165 81 10 -75 135 -87
2696 -87 -57 114 -106 -36 79 -85 66 10 -163 123 45 -133 106 -32 -74 129 -93 -53 169 -106 -69 144 -86
2719 -86 17 81 -159 70 122 -128 53 67 -99 62 7 -32 126 -53 -70 102 -15 32 43 -107 69 50 -120
2742 -120 109 56 -121 89 4 -79 162 -33 -131 126 27 -83 67 -18 -52 43 -38 -8 61 -4 -49 -30 42 50 -82 -7
2768 -7 38 -64 34 41 -91 52 1 -134 92 85 -102 5 4 -50 80 9 -87 55 -12 -64 51 38 -24 -20 -29 17 63 7
2796 7 -34 -37 59 17 -43 53 18 -83 34 32 -23 98 -33 -120 118 46 -91 61 -21 -73 65 -13 -37 84 -51 -86 68
2823 68 19 -4 -11 -67 17 37 -49 29 21 -59 14 -23 -7 89 -60 -103 70 8 -30 42 -45 -37 66 -51 2 71 -42 -57 39
2852 39 16 39 22 -71 15 38 -19 26 20 -14 13 -34 34 95 -38 -22 15 -6 69 23 -83 59 8 -97 93 37 -84 37
2880 37 -54 -61 158 -37 -115 84 -12 -48 101 -58 -41 77 -93 -17 121 -82 -43 13 -74 85 29 -101 44 3 -82
2905 -82 88 -14 -45 65 -107 -18 151 -55 -44 48 -74 34 78 -92 58 48 -107 56 68 -33 43 -44 -47 124
2929 124 1 -48 54 -53 12 55 -59 61 26 -124 44 59 -49 54 -70 -76 121 -45 -63 103 -70 -66 81
2952 81 -91 7 79 -152 -16 104 -89 13 19 -113 51 18 -96 86 14 -110 27 15 -12 61 -71 -50 83 -9
2976 -9 -4 34 -37 18 -1 -36 81 17 -73 33 2 18 76 -54 -25 63 -53 -3 67 -34 -6 0 -47 77 25 -87 9 -2
3004 -2 -17 43 -38 -11 38 -67 -18 72 -39 -14 -1 -86 65 27 -107 24 11 -64 51 -1 -61 54 -44 -62 98 7 -62
3031 -62 31 -40 -1 73 -44 -25 68 -23 -23 47 15 1 -12 -23 53 42 -12 -5 0 34 31 -23 56 22 -60 33 34 -16 60 -30 -65 85
3063 85 13 -56 57 -7 -30 44 -31 -8 52 -51 -43 55 -10 -4 -3 -53 44 4 -51 28 3 -52 6 -25 -15 64 -67 -47 68 -11
3093 -11 -21 25 -45 5 45 -60 18 82 -61 -13 42 -14 41 -2 -49 42 27 -12 21 15 23 8 -34 32 43 -31 7 8 -4 59 -12
3124 -12 -42 68 -16 -60 62 3 -42 29 -54 -16 86 -41 -53 49 -27 -22 15 -25 1 17 -54 6 27 -9 -15 -39 18 35 -48
3153 -48 -2 45 -40 7 12 -51 59 8 -86 61 40 -58 36 21 -41 67 13 -47 82 13 -72 24 25 -5 11 -5 -13 30 -1 3
3183 3 -7 24 18 -70 17 85 -65 -22 36 -60 7 63 -101 23 59 -85 -2 75 -69 -14 13 -78 40 38 -91 12 23 -45
3211 -45 12 8 -6 17 -28 -14 28 3 -13 -26 -14 52 -2 -48 54 -10 -11 58 -24 7 93 -75 -21 106 -41 -28 80 -49
3239 -49 2 69 -63 16 78 -73 -13 60 -24 14 -17 -41 28 -16 -17 15 -43 13 -11 -87 62 27 -106 33 29 -70 56 7
3267 7 -106 78 -4 -121 59 18 -89 32 -27 -37 67 -53 -55 63 -25 -27 33 -18 17 15 -50 48 27 -28 35 -12 14 67
3295 67 -48 1 82 -68 11 71 -63 46 52 -114 49 85 -125 35 73 -78 51 45 -80 71 11 -107 47 27
3319 27 -34 15 -27 13 40 -44 11 15 -36 26 -21 -58 78 -29 -92 71 10 -57 55 -28 -46 70 -27 -31 70 -42 -38 32
3347 32 -14 30 21 -41 31 41 -26 25 3 -9 23 -12 -4 57 -19 -30 21 -5 23 14 -36 41 32 -67 39 41 -49 23 -8 -55 54 18
3379 18 -89 29 49 -59 10 22 -41 17 34 -31 1 35 -41 -45 34 27 -58 -2 24 -42 -7 37 -33 -2 56 -57 -17 68 -17
3408 -17 -32 36 -4 2 61 -17 -10 63 -19 -15 49 6 -18 26 -1 16 40 -19 -15 44 6 -16 22 5 -4 19 -7 -5 38 -20 -40 29 19
3441 19 -36 -19 19 -8 13 3 -24 4 20 -32 -28 30 1 -33 -8 18 -13 -17 10 -14 3 22 -34 -37 54 -9 -49 30 16 -28 21 -10
3473 -10 -6 34 -3 -26 38 19 -21 8 9 28 8 -15 9 7 8 22 -13 18 37 -30 10 53 -20 0 13 -27 38 6 -60 39 29 -59
3505 -59 26 -6 -50 44 -28 -47 76 -26 -50 44 -33 -18 29 -42 14 52 -49 -7 43 -25 8 -8 -35 58 -5 -41 36 -1 -27
3534 -27 49 -43 2 76 -53 -13 74 -15 11 41 -46 36 27 -39 43 33 -30 13 -2 14 49 -50 -10 22 -34 13 25 -57 37 5
3564 5 -79 47 22 -94 36 1 -53 44 -46 -67 65 -22 -59 53 -19 -21 34 -49 4 48 -55 -11 19 -30 7 20 -28 31
3592 31 24 -32 31 24 -17 0 -12 10 29 -16 -9 40 1 -2 -3 -10 23 12 -30 25 18 -34 6 4 -25 22 -8 -26 34 4 -35 9 3 1 14
3627 14 -25 16 18 -24 5 27 -18 4 8 -33 35 -4 -54 16 26 -36 13 -21 -14 45 -19 -38 18 -7 -8 22 -15 13 26 -41 15 37
3659 37 -29 5 26 -3 32 11 -39 39 24 -15 20 10 5 4 -9 1 44 -10 -5 21 -4 26 -22 -13 35 -9 -18 24 -26 -2 22 -42 11
3692 11 38 -29 -11 24 -25 -3 -3 -44 22 10 -49 20 10 -37 6 -3 -10 26 -7 -34 27 19 -9 12 -1 2 5 -5 11 10 -9 3 -4 22
3726 22 29 -15 10 40 1 7 22 -4 17 25 -20 27 36 -16 -1 8 5 12 3 1 16 -1 -9 -7 5 -9 -15 -21 -4 17 -20 -14 7 -15 3 -18 -4
3763 -4 14 -19 -7 5 2 -11 -17 -15 0 17 -11 -11 19 7 -2 -7 3 10 7 -2 11 28 25 -33 -2 35 13 11 13 -2 16 19 5 17 20 -15 5 18
3801 18 8 14 -2 -2 25 2 -6 10 -3 0 -3 -21 12 12 -38 -11 15 -3 -4 -5 -8 14 -10 -15 -8 14 -17 -14 -4 20 -3 -23 2 4 -6 17 -16
3838 -16 -9 27 -13 -14 33 3 -8 18 -6 6 44 -9 -10 42 -4 3 15 -14 6 18 -12 19 50 -6 -4 32 -2 4 14 0 1 -2 -20 4
3872 4 24 -4 -12 -8 14 2 -13 -10 0 -4 -10 -4 -13 18 -24 -40 24 10 -30 12 -15 -40 14 -16 -19 21 8 -22 36 11 8 27 -19 6 37
3907 37 -8 15 9 9 18 -6 3 40 -5 -15 41 6 8 31 -22 -2 58 -21 -4 45 -17 2 32 -21 15 25 -39 4 27 -23 7 -1 -24
3940 -24 13 -16 -34 32 -4 -31 15 -12 -3 -8 -40 0 25 -21 5 5 -28 10 -16 -30 34 -12 -28 26 14 5 32 -20 -11 27 -32 -12 28
3973 28 -8 11 26 -7 36 15 -21 12 23 -5 9 -4 -5 26 -15 -14 33 -11 -7 11 -28 14 25 -56 -11 15 -26 -3 15 -23 -15 -7 -14
4006 -14 10 1 -29 -12 2 6 -8 -30 -13 8 -21 10 -3 -32 4 -4 -33 22 18 -31 -4 22 1 3 16 -27 11 15 1 25 28 0 -4 18
4040 18 -2 23 -8 -11 28 -4 -5 8 7 -9 2 -1 4 14 -4 -6 2 0 2 7 -4 -9 -17 -6 0 0 -15 -5 -15 -18 12 -27 -25 19 -7 -17 19 -14
4078 -14 -19 15 -32 2 32 -10 -16 11 2 1 16 13 13 -4 15 7 1 9 11 -17 14 42 -6 6 38 -10 13 24 -18 10 42 -22 3 40 4
4113 4 -8 12 -13 22 11 -21 9 16 -2 9 11 -4 4 -4 -23 17 9 -25 -7 1 0 3 -4 -4 -8 -34 9 0 -22 0 -8 -18 28 1 -35 36 -11
4150 -11 -22 46 -11 -21 24 -6 -25 41 11 -20 13 -2 8 14 12 -2 19 -6 17 12 5 13 -28 -1 39 1 -14 34 -27 -3 29 -42 -1
4183 -1 38 -49 -14 39 -41 -11 8 -47 2 10 -29 11 -1 -43 -8 -5 -23 12 -18 -33 2 3 -11 -9 -8 6 -5 -9 24 5 -29 18 -16 -3
4217 -3 53 -25 -15 44 -14 -12 39 -5 -1 41 -1 9 50 -6 -1 30 -3 8 9 -7 -9 21 -11 15 -4 -12 9 -12 12 16 -24 -13 11 -28
4251 -28 1 -2 -36 -7 -10 -40 1 9 -41 -4 -2 -24 16 3 -29 5 16 -22 -7 5 -8 -10 5 -17 21 -4 -9 -15 -2 16 -21 5 24 -3
4285 -3 -7 17 -9 5 16 -28 12 43 -12 -9 28 4 13 28 -12 -16 17 -22 -17 23 -6 -12 -10 -10 -8 7 -6 -12 1 0 -7 -5 5 -13 -15 11 -7 -17
4323 -17 -1 -9 -17 4 -3 -18 17 1 -20 6 12 -10 7 -2 -18 8 12 -2 9 20 -3 1 5 16 -6 -2 -4 1 26 -1 -7 13 9 -17 11 1 -7
4360 -7 -2 21 -14 6 0 -17 -6 15 -10 -8 7 -8 -6 -12 -6 -25 3 -21 -16 0 -2 -28 -11 -4 -15 -13 -3 -14 -7 1 -28 -10 9 -13 -3 1 -9
4397 -9 -6 21 4 -11 21 3 -12 11 30 3 -3 6 8 7 18 -13 -3 26 0 5 34 7 -1 17 -4 4 21 -10 -1 24 4 -15 14 -17 -26 6
4433 6 -22 -12 -7 -3 -21 -8 -1 -23 -12 -6 -8 -7 1 -18 3 -8 -15 -13 9 -4 -14 11 -5 -15 5 1 -5 22 12 -11 5 -3 -7 3 15 9 9 13 2
4472 2 -2 9 -5 -4 3 3 -2 0 12 -3 0 4 -16 4 5 -18 -16 11 -25 -9 12 -11 -2 -17 -13 -7 6 -17 -13 -1 -10 -18 -7 -5 -9 -8 -7 -8 -1 15 -9 -21
4514 -21 13 -13 -13 8 -10 -15 8 -7 2 14 -1 -15 18 8 -1 14 -4 4 32 -7 -2 12 -6 -10 8 -4 3 -3 8 -1 6 11 0 -9 8 -2 -24
4551 -24 11 14 -4 -12 -1 -6 0 18 -27 0 2 -16 -6 2 -21 -2 -1 -15 -8 -14 -19 0 -7 -22 -5 -24 -9 -16 -5 -14 -1 2 5 1 -4 17 -6 -13 19
4590 19 1 5 7 5 -4 16 -3 -8 16 -3 -6 23 5 -2 12 -3 7 28 12 6 5 1 12 12 4 1 8 3 -4 3 -3 -9 -23 5 -1 -20 -1 4 -20 3 -7
4631 -7 -19 -4 12 -20 -8 7 -11 1 -2 3 7 -3 -13 -3 6 -8 9 7 4 5 3 15 10 7 11 7 -6 14 -2 6 10 3 5 14 -7 0 8 -5 -5 16 -6
4672 -6 -8 7 -6 -1 -2 -11 -12 2 -9 -2 7 -14 -18 1 3 -1 -4 3 -4 1 -8 -3 -13 -8 -4 -3 1 11 -13 0 -6 -1 9 -11 -16 20 1 0 4 10 6 18 3 2 19
4717 19 -5 -2 10 8 3 3 -1 9 27 12 1 18 15 14 7 4 11 20 -9 3 -2 -8 -2 -6 3 4 -2 -1 4 -4 -8 -10 -5 -11 -8 -11 -10 -4 -17 -16 -18 -11 -10 -22 6 -9 -8
4764 -8 5 2 2 -2 -10 -6 10 9 3 6 7 -1 9 18 9 3 4 4 15 6 6 9 0 11 7 10 12 0 14 6 3 7 16 -4 5 -2 -3 8 1 -1 9 -6 -9 -10 -10 19 -17 6
4812 6 2 -14 3 -5 4 -9 -6 -12 -10 -7 -13 0 -10 10 6 -4 -8 -3 2 8 -3 7 -3 3 -3 11 11 13 3 0 5 11 16 1 17 14 4 15 14 -6 12 15 8
4855 8 15 9 9 14 9 -5 -12 5 -5 -5 -7 -3 4 -17 -10 -13 -16 -16 -9 -25 -3 -9 -17 -7 -4 -13 -12 -10 -11 8 0 -13 2 -4 8 -3 -2 7 2 -5 -3 13 -3 -2 0 8 6
4902 6 6 3 14 2 8 18 10 9 12 5 7 12 5 15 20 -3 4 10 0 7 3 -2 1 1 -3 7 -5 -1 6 -1 -4 -1 -7 -12 -5 -10 -16 2 -17 -9 -2 -13 -11 -17 6 3 11 -4
4950 -4 1 -11 0 0 -10 -1 9 1 6 -5 3 -5 6 8 5 18 -2 10 -8 7 15 8 11 9 -4 11 7 7 12 8 6 1 -4 -13 8 14 -5 -3 -3 -5 0 -6 -7 -2 -9 -7
4996 -7 -2 -9 -22 1 -6 -3 1 -10 -21 -19 -3 -12 -7 -3 -11 -2 -5 -2 -3 1 -5 7 17 4 -1 11 -6 2 17 11 4 -2 -4 5 -1 8 -1 8 2 7 7 6 1 12 -4 4 9 6
5044 6 5 3 -9 4 -3 1 -16 -3 -5 2 -14 -10 -1 -1 -7 -15 -15 -11 -9 -7 2 -4 -1 -13 -11 2 -10 -4 -5 -8 -3 -9 -8 -8 0 -5 -3 -7 4 -3 29 13 14 14 12 4 16 -3
5092 -3 20 17 12 5 12 14 8 8 5 -2 10 -1 8 5 14 -7 9 6 -2 8 11 -11 -1 2 -5 -6 4 -7 -9 3 -18 -15 -1 -5 -3 4 -8 -20 -5 -27 -9 7
5134 7 -8 -11 2 -23 -11 8 -5 7 -4 -3 5 9 6 13 11 19 18 1 19 15 10 7 8 4 19 12 -2 19 9 6 1 10 1 13 -3 3 13 1 -1 0 7 1 5
5177 5 -5 7 3 -16 -5 3 -9 5 -8 -16 1 -18 -8 2 0 -5 -3 -3 1 2 7 1 0 -10 7 4 -4 13 7 -4 16 19 5 16 4 4 23 5 5 8
5217 8 8 -5 24 1 9 3 6 16 23 3 13 13 16 15 2 0 10 11 -2 5 -1 -8 -1 -6 -7 6 -7 -12 -1 -22 -7 8 -9 -6 -12 -10 0 -8 -19 -3 -8 -13
5259 -13 -2 -8 -10 2 -8 -4 0 -4 3 12 0 10 14 -1 12 20 1 13 16 -1 8 0 15 16 6 5 25 10 3 28 14 15 11 5 5 -5 7 -7 0 -13
5299 -13 -5 -1 -16 1 3 -2 -3 -6 -1 2 -4 6 -12 0 -3 2 -13 4 10 -5 1 2 -5 8 8 -5 3 -3 -16 9 15 -3 10 11 5 20 18 -12 9 7 3 18
5341 18 3 12 14 3 -1 15 22 21 13 0 17 3 2 11 8 -2 7 -3 3 1 -3 -2 7 -13 -12 1 -9 8 -7 -12 -2 0 -10 -15 4 -7 -8 1 -11 3 2
5382 2 -1 8 2 -1 1 -5 3 4 4 9 5 12 11 1 8 19 26 7 9 17 4 6 18 21 6 19 8 18 23 17 9 8 22 18 7 7 15 8 -8 -2 3 8 7 1 10 2 -1 3 -6
5431 -6 2 -4 -3 1 5 -7 -8 3 0 -8 2 -8 13 19 -4 6 10 8 -7 4 5 0 13 -8 9 17 17 9 13 10 7 17 21 12 15 5 13 9 -4 13 22 7 16 -2
5475 -2 -6 11 7 0 4 6 5 12 -5 11 1 6 0 -5 9 12 -9 -3 -3 -5 -9 3 -7 -6 -1 -7 15 6 -2 -6 11 -7 8 -5 1 2 -3 -6 6 23 8 5 13 5 14
5520 14 14 13 20 10 20 18 12 21 29 14 14 25 4 13 18 11 21 11 7 11 11 6 16 7 9 4 10 4 18 14 -6 -1 0 -3 -1 -7 3 -3 -12 -9 13 -2 2 4 -14 -12
5566 -12 -8 -13 10 16 1 15 4 -8 9 -11 -11 14 14 10 -1 14 32 21 7 17 10 10 17 25 8 19 -5 5 15 10 14 18 15 16 18 1 3 31 6
5605 6 2 17 11 15 2 6 10 4 -2 2 7 4 3 -1 -2 14 -8 1 7 -9 -13 -8 -3 -6 -2 -8 4 5 -1 -7 -2 0 4 -5 7 11 17 10 5 15 14 6 -9 11 12 3 14 13 14 12
5655 12 3 5 14 14 -7 4 4 14 2 0 10 15 -3 0 11 7 -6 -7 12 -6 3 -2 1 -3 4 -8 -3 8 -1 -13 -5 -1 -1 -4 3 3 6 0 -10 7 19 -1 3
5698 3 6 3 8 11 7 19 2 3 -1 9 19 4 -1 16 21 13 8 14 24 -1 17 10 20 15 0 11 16 -1 0 12 11 16 6 -14 14 12 -10 -9 19 -5 8
5739 8 -5 0 -1 3 -10 -13 7 0 0 -4 5 -2 -1 -9 -3 10 -8 -2 12 11 3 5 -4 18 9 -3 15 18 2 -3 13 7 15 8 9 13 9 14 -2 26 20 12 -1 -4 12 5
5785 5 16 -2 6 11 6 -6 4 -9 -5 -11 -10 -5 5 -16 0 -1 0 -10 7 10 5 -5 -13 6 -5 -2 4 -11 -8 -3 -4 2 8 -3 2 12 -8 -1 1 -8 22 -1
5827 -1 2 10 13 4 3 10 7 18 7 1 28 11 9 10 8 16 22 6 12 8 7 3 11 22 4 2 3 13 -3 -6 0 11 2 -5 -11 0 8 -7 -24 -4 -12 -7 -18 -15 0
5872 0 9 -17 -12 1 -8 2 -5 -7 8 -4 -3 20 8 5 5 17 2 9 11 6 25 8 -3 6 -2 24 4 1 23 15 8 1 13 13 14 1 6 15 3 6 13 4 9
5915 9 11 -14 8 11 -8 -4 20 -5 21 4 -10 4 4 -13 -15 7 -16 3 -8 -3 -4 -18 2 -5 -10 -3 -6 1 15 -6 -10 15 18 0 4 3 -1 3 -8 10
5955 10 17 0 11 13 11 12 -3 -9 14 9 0 8 10 6 13 3 11 14 2 -2 10 -7 7 -11 -16 9 16 -1 -2 16 6 4 -1 -5 -6 -8 -14 -9 -10 -8 -2 -9 -1 -4 -8 -9
6001 -9 7 2 -15 5 -10 10 -8 4 26 4 2 1 10 -1 15 1 6 17 12 11 6 7 16 3 -1 4 16 8 1 24 5 6 20 4 -6 18 7 -2 3
6040 3 0 -1 1 6 4 1 -5 11 3 -5 5 5 19 -5 -13 -2 -1 -19 -10 1 -5 1 10 -5 8 -13 -7 0 -1 -7 1 -5 -9 2 6 -4 15 7 -18 7 7 5 15 -3
6084 -3 2 19 11 8 0 13 2 -4 4 10 6 11 10 3 17 12 8 -3 7 3 5 0 -9 6 -1 -13 17 -5 -17 -11 4 8 -2 -5 10 2 -7 -6 -2 7 8 -3 -14 4
6128 4 3 -24 7 14 -8 4 -3 -18 7 13 -19 26 -1 -14 1 8 2 7 1 -1 19 -1 2 11 20 -1 17 11 23 7 10 -4 7 15 7 9 8 7 -15 -1
6168 -1 2 3 3 -3 -17 -16 1 -13 -3 5 -13 -7 -15 -17 9 -8 -20 7 4 -8 4 -1 -14 7 -16 -4 8 -7 5 3 8 -6 11 -14 18 20 1 19
6206 19 7 19 11 -1 1 18 11 -2 10 12 0 1 1 3 16 3 7 14 -4 2 7 1 4 0 -7 -4 -7 1 0 -3 2 -5 -6 -5 2 -6 -9 -5 2 -4 0 -4 -3 7 2 3 0 0 -9
6255 -9 9 0 16 7 1 -1 -2 10 14 3 6 14 -1 5 7 12 13 -7 9 22 14 4 6 14 28 24 25 9 0 5 15 11 9 4 4 -4 -6 5 -3 -15 1 -7 -4 2 -1 -2
6301 -2 7 0 -1 1 -8 -18 2 -5 -2 5 7 6 8 -5 5 2 -8 -1 3 17 6 -1 -3 14 5 -2 21 7 19 5 15 14 11 21 8 9 15 15 15 5 17 13 -2
6344 -2 3 14 16 9 -6 15 21 1 8 8 6 -3 4 -7 4 -1 -14 -9 10 -4 -14 -2 -7 -9 5 -12 -5 6 -5 -13 14 1 0 5 2 -8 7 2 -5 14 4
6385 4 -5 19 22 -4 8 9 12 10 16 7 -6 24 8 6 11 4 14 18 3 22 19 7 17 30 1 8 17 14 1 10 4 -3 21 -16 -14 -7 -8 5 -2 -14 -1 17
6427 17 4 -17 -13 -7 2 2 -5 7 3 2 9 5 -7 -4 7 12 11 1 9 10 1 -5 8 9 7 -9 -5 4 11 2 13 8 6 9 -1 18 15 6 6 10 3 13 -3 4 11 2 -12
6474 -12 5 6 -6 -1 0 -4 14 -12 -20 -6 2 -9 -15 -10 -8 1 -9 -12 -5 0 6 -4 0 3 -15 -5 3 1 -4 -3 -2 9 5 -13 8 11 -13 4 12 5 22 13 4 25
6518 25 22 -9 10 21 4 14 11 -9 26 5 1 12 13 2 2 9 6 5 4 5 -2 9 -6 -12 0 7 1 -5 2 2 -7 -9 1 -7 -2 -19 -4 5 -20 -9 3
6559 3 -8 -4 -2 -18 0 12 -26 5 1 -5 9 6 -1 11 2 5 8 -2 18 20 13 13 18 -1 4 24 19 8 4 9 10 0 -1 2 6 -1 2 9 13 7 -4 12 1 0
6603 0 14 1 8 5 -9 -5 -7 -6 6 -4 -16 16 -1 -25 6 5 -8 -5 -4 -1 5 4 -2 8 6 -14 -1 -4 6 8 -1 14 1 16 -2 -8 6 5 3 8 0
6644 0 2 7 10 5 24 3 -14 11 3 -16 -9 6 5 3 -1 2 11 -6 -7 4 -3 15 -7 -8 -5 6 -14 -10 1 -17 -3 -2 -4 -5 -8 -18 -10 2 8 -10 -3 14
6686 14 1 -4 -12 0 -3 -7 -15 2 10 -1 1 9 -5 17 16 4 19 15 -2 19 3 10 18 22 -5 18 14 -10 13 20 -8 1 1 13 7 -2 -1 9 -1 -8 0
6727 0 8 -8 -17 8 -4 -6 -13 7 -16 -4 -4 -20 -7 7 -13 -6 11 -15 2 3 -19 11 10 -5 25 8 -2 4 -2 5 -3 -6 -7 11 1 2 -4 -4 -1 2
6767 2 3 25 7 3 12 6 4 7 -3 -1 8 -5 10 10 1 20 5 -7 10 8 -5 0 9 -5 11 6 -10 -3 4 -24 0 -6 -8 2 -15 -21 -1 -7 -15 -2 -7 -13
6809 -13 -15 -1 3 6 -2 4 0 -6 10 2 5 14 0 -3 16 4 13 4 13 22 19 -4 14 5 -3 13 1 -1 14 14 -6 29 1 -14 11 -8 -2 10 -18 -9 11
6850 11 -7 -10 8 -6 -7 -14 -10 -4 6 -9 -8 0 -9 -14 -12 -1 -5 -23 -8 2 -8 5 -10 -15 10 1 -8 5 10 17 19 0 6 11 -3 4 27 1 19 16 4
6891 4 7 10 4 8 27 8 10 22 6 7 2 14 7 22 6 1 14 1 -9 8 14 0 14 4 -4 12 8 -14 -9 9 -8 -6 -15 -9 -7 -13 -10 4 -6 -11 -8
6932 -8 9 3 -4 -10 -1 -3 4 2 1 14 12 -1 8 6 6 17 7 12 29 7 4 18 -2 10 23 18 22 8 -12 7 10 0 3 9 15 9 5 -6 1 6 -10 -2 -5 6
6976 6 5 -18 -7 6 3 -7 -7 -9 -6 -3 -9 -10 0 2 -3 5 1 -3 -14 -10 -8 -6 9 0 6 0 -11 12 27 -4 -9 -4 16 15 11 5 -1 11 1 6 16 20 -4 12
7020 12 15 10 26 20 -7 13 3 -5 9 14 -1 -5 0 -5 9 -2 -18 0 5 -7 -8 -1 5 -8 -1 0 16 4 -5 -12 0 12 -15 -16 6 1 3 -4 -2 1 1 12
7062 12 6 22 7 -8 4 9 20 4 15 10 1 12 6 6 6 5 9 11 24 20 -1 14 10 9 15 -2 9 7 -4 9 10 6 12 -11 -10 8 -4 -13 2 7 -2
7103 -2 12 0 4 -2 -18 -4 15 -10 -7 -4 6 4 -3 1 -4 4 -8 -5 1 -2 12 0 10 18 -1 4 13 12 15 14 2 17 20 -1 12 24 16 15 14 8 21 16 15
7146 15 12 19 2 7 7 19 0 -12 13 1 0 8 -10 -2 7 -5 -14 24 -11 -25 11 -7 -10 -1 -20 -24 7 -14 -7 9 -3 -7 8 -7 11 9 -11 -3
7184 -3 14 3 -1 4 0 5 7 0 10 16 7 -7 -2 24 0 -7 12 20 -1 22 3 -13 19 -2 -2 22 10 -10 13 -3 19 15 -6 -6 9 1 -3 -3 -9 -2
7224 -2 -3 2 12 -5 -25 0 -9 2 11 -10 -10 -3 -16 5 4 -14 -9 -3 -16 9 9 -6 -6 1 2 -5 -13 3 9 -5 -3 14 11 4 7 -6 24 6 15 22 12 6
7266 6 13 10 13 24 3 -18 32 7 -3 11 1 18 10 3 4 17 5 2 9 15 -1 2 -9 -9 5 -5 -4 -6 1 -6 -5 -3 7 -19 3 7 -1 13 -18 -14 13
7307 13 2 -4 12 15 -9 -1 -4 -6 14 21 -2 20 22 10 18 21 9 -2 24 19 19 30 7 2 35 7 9 19 10 8 26 23 2 34 5 -5 6 19
7345 19 -8 -3 -4 2 -6 1 -1 2 -4 -13 -12 -15 3 -16 -9 2 -5 4 -12 0 2 0 -15 3 3 -5 6 5 -14 10 7 -13 13 11 6 12 4 1 18 10 13 18 4 11 2
7390 2 7 22 9 -4 26 5 -3 17 0 -14 14 -6 2 14 -5 -17 9 2 -4 2 -4 -8 13 0 -7 -4 -6 -11 -28 3 -7 -16 1 -6 -6 -2 -6 -6 -3 -9 -11
7431 -11 9 10 -14 8 6 -4 25 6 -13 5 11 1 6 7 1 11 9 2 18 7 -7 -4 6 10 -8 8 19 7 3 15 0 8 12 -17 6 12 -7
7468 -7 -1 -2 -5 1 -4 -17 0 -5 -16 -10 -2 -8 -19 -9 -9 6 -15 -8 -6 -1 -1 -14 -7 6 4 -3 18 -1 -12 1 3 -4 25 7 -5 19 19 -1 24 18 9 22
7510 22 3 3 9 7 -5 1 18 13 -2 22 10 7 11 12 -4 23 0 -12 22 11 -17 -9 7 -6 1 -5 -13 14 12 -23 1 10 -11 -1 -7 -15 0 -8 -14
7549 -14 -4 5 -9 -12 -4 -11 -11 -9 -11 7 -10 -3 -7 9 5 -10 -2 5 3 14 -1 7 18 15 8 14 18 7 6 15 24 8 7 11 -8 6 9 2 10 10 -7 -13 8 -1 -5
7594 -5 -9 -9 -7 3 -8 -1 -6 -1 -12 -9 2 -4 -3 -5 -5 -1 9 -12 -10 24 -7 -2 6 4 -8 4 5 6 5 5 -4 17 11 13 18 12 7 20 11 6 18 19 -1 15 26
7639 26 1 7 13 6 6 16 4 23 17 2 4 9 15 -7 9 8 -1 6 3 -6 10 5 -16 -3 3 -20 -22 12 -9 -3 -2 -4 -4 1 -26 -7 7 -5 -8 5 -14
7680 -14 7 9 -10 -1 16 11 13 5 -6 6 5 16 24 11 19 5 7 16 15 -1 30 15 10 26 5 2 12 -6 -1 31 8 -5 25 1 5 19 15 6 7
7719 7 -6 -10 12 -2 -10 -9 0 9 -8 -9 -2 -9 -1 2 -14 -7 3 -20 1 5 -6 -6 -16 -8 22 0 -14 10 20 9 5 16 11 12 3 -3 24 15 1 4 -1 23
7761 23 13 -2 22 18 -6 13 13 2 24 -1 -5 20 7 -8 11 -5 2 21 -18 -4 17 -2 -3 21 -11 1 -2 -21 -4 16 -15 -2 -10 -3
7795 -3 -21 -9 -6 3 -14 -7 15 -8 0 -1 -15 14 9 -4 24 12 -12 21 5 1 28 -3 -1 33 8 -6 27 4 -4 30 2 14 29 -17 8
7830 8 11 -15 6 2 -7 20 8 -3 23 6 -4 2 -13 -10 12 -9 2 4 -6 8 -2 -17 14 -5 -25 0 -8 -11 0 -7 -12 11 -22 -19 8 -9
7866 -9 6 17 -13 3 9 -16 17 18 -6 17 -8 -13 18 -12 16 35 -10 -11 25 2 9 17 7 21 28 -3 3 16 5 11 7 3 4 6 -8 14 4
7903 4 0 -4 -8 5 7 -7 4 14 -12 0 3 -9 22 2 -7 9 1 -3 16 -6 0 6 -16 1 17 -10 1 4 -9 15 0 -10 5 24 -2 12
7939 12 7 5 15 -1 11 17 11 3 23 12 19 -2 -4 14 25 2 14 1 9 8 6 -13 15 0 -5 1 0 2 -2 -5 1 0 -20 -21 4 -2 -1 3 -4 4 -12 -2
7981 -2 -8 -3 -4 -3 -4 3 1 -17 14 11 4 5 4 0 17 -4 -17 13 14 0 9 11 12 20 6 -2 14 3 0 9 12 9 19 11 12 19 10 2 10 7 16 -5 7 12 4 4 5 -8
8029 -8 2 -2 3 -1 10 -13 -2 8 4 -4 -20 -13 -11 -5 2 -5 2 2 -9 -7 3 2 1 8 1 2 18 -15 7 13 -12 -4 16 -4 -5 4 -4 9 6 -8 -1 18 -12
8072 -12 6 17 2 21 18 9 5 5 -2 5 5 13 -6 -8 -1 -20 -8 6 -19 6 3 -13 -12 13 -13 -10 -2 -8 13 8 -6 -2 16 -12 -15 -14 -1 5 -5 -4 13
8113 13 2 2 1 -9 6 6 2 31 14 -10 9 9 8 5 5 5 13 -2 -9 0 13 2 9 7 22 17 4 9 6 15 3 4 6 7 -1 11 14 -4 -15 -6 -12 8 6
8156 6 -12 -21 3 -17 -9 -5 -16 -8 -7 -16 -7 0 -19 -15 8 0 -19 -4 3 -6 -3 4 -5 17 9 -8 -3 10 2 -13 9 21 6 14 1
8191A
##END NTUPLES=NMR FID
##END=
