##TITLE=1H_LY-810.24
 CCl3, 8 sc, 
 5.4.2019
##JCAMPDX= 6.0         $$ Bruker NMR JCAMP-DX V2.0
##DATA TYPE= NMR FID
##DATA CLASS= NTUPLES
##ORIGIN= UXNMR, Bruker Analytische Messtechnik GmbH
##OWNER= root
$$ XWIN-NMR		Version 3.5
$$ Fri Apr  5 14:43:18 2019 Russian Standard Time (UT+4h)  she@DPX200
##.OBSERVE FREQUENCY= 200.1316
##.OBSERVE NUCLEUS= ^1H
##.DELAY= (6, 6)
##.ACQUISITION MODE= SIMULTANEOUS
##.ACQUISITION SCHEME= undefined
##.AVERAGES= 8
##.DIGITISER RES= 18
##SPECTROMETER/DATA SYSTEM= spect
##.PULSE SEQUENCE= zg30
##.SOLVENT NAME= CDCl3
##.SHIFT REFERENCE= (INTERNAL, CDCl3, 0, 15.7039)
##AUDIT TRAIL= $$ (NUMBER, WHEN, WHO, WHERE, WHAT)
$$ ##TITLE= Audit trail, XWIN-NMR		Version 3.5
$$ ##JCAMPDX= 5.01
$$ ##ORIGIN= Bruker BioSpin GmbH
$$ ##OWNER= she
$$ F:/spectra/data/she/nmr/H-F/1/audita.txt
$$ ##AUDIT TRAIL=  $$ (NUMBER, WHEN, WHO, WHERE, WHAT)
(   1,<2019-04-05 14:42:08.25 +0400>,<she>,<DPX200>,
      <created by zg, POWCHK disabled, PULCHK disabled
       configuration hash MD5:
       00 E9 B6 7A A2 85 ED C7 34 08 36 98 17 FE 4E 26
       data hash MD5: 16K
       02 9F A0 C5 5B 5E 32 37 86 54 7A 18 FD 51 91 10>)
$$ ##END=
$$ 
$$ hash MD5
$$ A8 41 FB F0 9B 5D 6F 82 F9 34 33 BD C1 FD 20 36
##$RELAX= 
##$RELAX= 
##$RELAX= 
##$RELAX= 
##$RELAX= 
##$RELAX= 
$$ Bruker specific parameters
$$ --------------------------
##$DU= <F:/spectra>
##$EXPNO= 1
##$NAME= <H-F>
##$PROCNO= 1
##$TYPE= <nmr>
##$USER= <she>
##$AMP= (0..31)
100 100 100 100 100 100 100 100 100 100 100 100 100 100 100 100 100 100 
100 100 100 100 100 100 100 100 100 100 100 100 100 100 
##$AQSEQ= 0
##$AQ_mod= 1
##$AUNM= <au_zg>
##$AUTOPOS= <>
##$BF1= 200.13
##$BF2= 200.13
##$BF3= 200.13
##$BF4= 200.13
##$BF5= 200.13
##$BF6= 200.13
##$BF7= 200.13
##$BF8= 200.13
##$BYTORDA= 1
##$CFDGTYP= 0
##$CFRGTYP= 5
##$CHEMSTR= <none>
##$CNST= (0..31)
1 1 145 1 1 1 1 1 1 1 1 1 1 1 1 1 1 1 1 1 1 1 1 1 1 1 1 1 1 1 1 1 
##$CPDPRG= <>
##$CPDPRG1= <>
##$CPDPRG2= <>
##$CPDPRG3= <>
##$CPDPRG4= <mlev>
##$CPDPRG5= <mlev>
##$CPDPRG6= <mlev>
##$CPDPRG7= <mlev>
##$CPDPRG8= <mlev>
##$CPDPRGB= <>
##$CPDPRGT= <>
##$D= (0..31)
0 1.2 0 0 0 0 0 0 0 0 0 0.03 0 0 0 0 0 0 0 0 0 0 0 0 0 0 0 0 0 0 0 0 
##$DATE= 1554460927
##$DBL= (0..7)
120 120 120 120 120 120 120 120 
##$DBP= (0..7)
150 150 150 150 150 150 150 150 
##$DBP07= 0
##$DBPNAM0= <>
##$DBPNAM1= <>
##$DBPNAM2= <>
##$DBPNAM3= <>
##$DBPNAM4= <>
##$DBPNAM5= <>
##$DBPNAM6= <>
##$DBPNAM7= <>
##$DBPOAL= (0..7)
0.5 0.5 0.5 0.5 0.5 0.5 0.5 0.5 
##$DBPOFFS= (0..7)
0 0 0 0 0 0 0 0 
##$DE= 6
##$DECBNUC= <off>
##$DECIM= 24
##$DECNUC= <off>
##$DECSTAT= 4
##$DIGMOD= 1
##$DIGTYP= 9
##$DL= (0..7)
0 120 120 120 120 120 120 120 
##$DP= (0..7)
150 150 150 150 150 150 150 150 
##$DP07= 0
##$DPNAME0= <>
##$DPNAME1= <>
##$DPNAME2= <>
##$DPNAME3= <>
##$DPNAME4= <>
##$DPNAME5= <>
##$DPNAME6= <>
##$DPNAME7= <>
##$DPOAL= (0..7)
0.5 0.5 0.5 0.5 0.5 0.5 0.5 0.5 
##$DPOFFS= (0..7)
0 0 0 0 0 0 0 0 
##$DQDMODE= 0
##$DR= 18
##$DS= 0
##$DSLIST= <SSSSSSSSSSSSSSS>
##$DSPFIRM= 0
$$ [...]
##$SUBNAM2= <"">
##$SUBNAM3= <"">
##$SUBNAM4= <"">
##$SUBNAM5= <"">
##$SUBNAM6= <"">
##$SUBNAM7= <"">
##$SUBNAM8= <"">
##$SUBNAM9= <"">
##$SW= 24.9336934301222
##$SWIBOX= (0..15)
0 0 2 0 0 0 0 0 0 0 0 0 0 0 0 0 
##$SW_h= 4990.01996007984
##$TD= 16384
##$TD0= 1
##$TE= 0
##$TE2= 300
##$TE3= 300
##$TEG= 300
##$TL= (0..7)
0 120 120 120 120 120 120 120 
##$TP= (0..7)
150 150 150 150 150 150 150 150 
##$TP07= 0
##$TPNAME0= <>
##$TPNAME1= <>
##$TPNAME2= <>
##$TPNAME3= <>
##$TPNAME4= <>
##$TPNAME5= <>
##$TPNAME6= <>
##$TPNAME7= <>
##$TPOAL= (0..7)
0.5 0.5 0.5 0.5 0.5 0.5 0.5 0.5 
##$TPOFFS= (0..7)
0 0 0 0 0 0 0 0 
##$TUNHIN= 0
##$TUNHOUT= 0
##$TUNXOUT= 0
##$USERA1= <user>
##$USERA2= <user>
##$USERA3= <user>
##$USERA4= <user>
##$USERA5= <user>
##$V9= 5
##$VALIST= <valist>
##$VCLIST= <CCCCCCCCCCCCCCC>
##$VD= 0
##$VDLIST= <DDDDDDDDDDDDDDD>
##$VPLIST= <PPPPPPPPPPPPPPP>
##$VTLIST= <TTTTTTTTTTTTTTT>
##$WBST= 1024
##$WBSW= 4
##$XGAIN= (0..3)
0 0 0 0 
##$XL= 0
##$YL= 0
##$YMAX_a= 21500
##$YMIN_a= -27434
##$ZGOPTNS= <>
##$ZL1= 120
##$ZL2= 120
##$ZL3= 120
##$ZL4= 120
##$ABSF1= 10
##$ABSF2= 0
##$ABSG= 5
##$ABSL= 3
##$ALPHA= 0
##$AQORDER= 0
##$ASSFAC= 0
##$ASSFACI= 0
##$ASSFACX= 0
##$ASSWID= 0
##$AUNMP= <proc_1d>
##$AZFE= 0.1
##$AZFW= 0.1
##$BCFW= 1
##$BC_mod= 2
##$BYTORDP= 1
##$COROFFS= 0
##$CY= 11.3945322036743
##$DATMOD= 1
##$DC= 2
##$DFILT= <>
##$DTYPP= 0
##$F1P= 18.9103706918063
##$F2P= -1.10871071338519
##$FCOR= 0.5
##$FTSIZE= 0
##$FT_mod= 4
##$GAMMA= 1
##$GB= 0.15
##$INTBC= 1
##$INTSCL= 1
##$ISEN= 128
##$LB= 0.24
##$LEV0= 0
##$LPBIN= 0
##$MAXI= 10000
##$MC2= 0
##$MEAN= 0
##$ME_mod= 0
##$MI= 1.114404
##$NCOEF= 0
##$NC_proc= 0
##$NLEV= 6
##$NOISF1= 3.799351
##$NOISF2= 2.8
##$NSP= 1
##$NTH_PI= 0
##$NZP= 0
##$OFFSET= 15.70392
##$PC= 1
##$PHC0= -8931.535
##$PHC1= 15.60028
##$PH_mod= 1
##$PKNL= yes
##$PPARMOD= 0
##$PSCAL= 0
##$PSIGN= 0
##$REVERSE= no
##$SF= 200.130013532006
##$SI= 16384
##$SIGF1= 3
##$SIGF2= 2
##$SINO= 400
##$SIOLD= 16384
##$SREGLST= <1H.CDCl3>
##$SSB= 0
##$STSI= 0
##$STSR= 0
##$SW_p= 3612.71676300578
##$SYMM= 0
##$S_DEV= 0
##$TDeff= 0
##$TDoff= 0
##$TI= <>
##$TILT= no
##$TM1= 0
##$TM2= 0
##$TOPLEV= 0
##$USERP1= <user>
##$USERP2= <user>
##$USERP3= <user>
##$USERP4= <user>
##$USERP5= <user>
##$WDW= 1
##$XDIM= 8192
##$YMAX_p= 0
##$YMIN_p= 0
$$ End of Bruker specific parameters
$$ ---------------------------------
##NTUPLES= NMR FID
##VAR_NAME=  TIME,          FID/REAL,        FID/IMAG
##SYMBOL=    X,             R,               I
##VAR_TYPE=  INDEPENDENT,   DEPENDENT,       DEPENDENT
##VAR_FORM=  AFFN,          ASDF,            ASDF
##VAR_DIM=   8192,          8192,            8192
##UNITS=     SECONDS,       ARBITRARY UNITS, ARBITRARY UNITS
##FACTOR=    0.0002004,     1,               1
##FIRST=     0,             0,               0
##LAST=      1.6414764,     0,               0
##MIN=       0,             -27434,          0
##MAX=       1.6414764,     21500,           0
$$ Real data points
##PAGE= N=1
##DATA TABLE= (X++(R..R)), XYDATA
$$ [...]
336d12j56Q59n40p2R96k33p89n9K4M77N84m28n76l8J70L54L7k55L32r1q57K55
$$ -412 -568 291 -249 -321 675 442 -347 -406 -382 95 679 251 -325 -363 -193 161 198 -57 275 184 -673 -418
358d18Q93j52k01m9o61J63J009l14o48N96jp91L46O08k58L0N1q08N9J192j73r05
$$ -418 475 323 122 73 -588 -425 584 270 -378 218 217 -574 -228 380 122 152 203 -605 -546 646 473 -432
380d32L95L12p03K18O56m46m4M36q22l23J397L2j238M20M24p90N00O62j022J40
$$ -432 -37 275 -428 -210 446 0 -44 392 -430 -753 644 676 -562 -142 282 -508 -8 654 -368 -228
400b28R60j165m60J630j61j176O81O3p85R45L65j299M28R19j099k66J249k67p01
$$ -228 732 -433 -893 737 576 -600 81 144 -641 304 669 -630 -202 717 -382 -648 601 334 -367
419c67N08k12n04R70K54j200K08R24o94l93Q87j66m98N57l28n96J029K91j255
$$ -367 141 -71 -575 395 649 -551 -343 581 -113 -506 381 215 -283 274 -54 -650 379 670 -585
438e85L06P30o62N1N33n97J38N51p71j88R33j67m71J56j00R7L80l94k06M44p6
$$ -585 -279 451 -211 -160 373 -224 -86 465 -306 -494 439 272 -199 -43 -143 -46 334 -60 -266 178 102
459A02k81R3O7K15L5m97n5M86O4k44j01M1J54k9j40J5Q8J96j11n45L23O67n91
$$ 102 -179 -86 -19 196 231 -266 -321 165 229 -15 -116 -75 79 50 -90 -75 13 209 98 -447 -124 543 -48
482d8l13N78l05j13O56o09l61J155m19j050R93L59r19M98J69q87P14N70j121R2
$$ -48 -361 217 -88 -201 455 -154 -515 640 221 -829 164 523 -396 102 271 -616 98 668 -453 -361
502c61R26n59m13N58m5j86K87k24m10M98M43o10l53O51N1n65L15K24n08L98K39
$$ -361 565 6 -407 151 106 -80 207 -17 -427 71 514 -96 -449 202 253 -312 3 227 -281 117 356
523C56r26L72J007r27n00R99l08m47Q00l97o71J079j7j168P07P38r61n7O17m63
$$ 356 -570 -198 809 -118 -618 381 73 -374 426 29 -642 437 420 -748 -41 697 -264 -321 296 -167
543a67K3O30o14m44R11O8q56L23N19n06n0L88m07J8O67n30n67Q40J95p62K08L10
$$ -167 -144 486 -128 -572 339 407 -449 -126 393 -113 -163 225 -182 -164 503 -27 -594 246 441 -321 -113 197
565A97l61K66J12n70L15M95n76k06M74m3p0lk57J92L10k75k08J68J21O9k21k02
$$ 197 -164 102 214 -356 -41 454 -122 -328 146 103 33 30 -227 -35 275 0 -208 -40 81 150 -71 -273
587b73M03J05l83L3J19J7J58k55k21M49O2l53M0OJ54K30n08m1N85l70j25M30n34
$$ -273 130 235 -148 -115 4 21 179 -76 -297 152 214 -139 -99 -93 61 291 -217 -258 327 -43 -168 262 -272
610b72J60P87j083j90J417p96o55J189p04m49J521r43j002J818m42j342J487j40
$$ -272 -112 675 -408 -598 819 23 -632 557 -147 -596 925 -18 -1020 798 356 -986 501 361
628C61j122J335l57j207J524R0j361Q43J27o60Q54l38o53R79k84n87P70m25j8
$$ 361 -761 574 217 -990 534 624 -737 106 233 -427 427 89 -564 415 131 -456 314 -111 -129
647a29P96j217J6J467j184k48J316j375N6J732j815k58K200j679o63K118j469
$$ -129 667 -550 -534 933 -251 -499 817 -558 -502 1230 -585 -843 1357 -322 -985 1133 -336
664c36m35K149j869o88K609j500j048K217j324o93K220j621q34K498j407j090
$$ -336 -771 1378 -491 -1179 1430 -70 -1118 1099 -225 -918 1302 -319 -1153 1345 -62 -1152
680a152K222j196p48K098j520q42K422j226j140J973r96o46J845j356o71J982
$$ -1152 1070 -126 -874 1224 -296 -1138 1284 58 -1082 891 -105 -751 1094 -262 -933 1049
696A049j097p70J586r26k79J278j402M2J570j406q2J192j468O13J283k169N87
$$ 1049 -48 -818 768 -158 -437 841 -561 -519 1051 -355 -437 755 -713 -100 1183 -986 -399
713c99J774k283L88J898k280M70K007k711K51K761k442n10K504k016l40K518k071
$$ -399 1375 -908 -520 1378 -902 -432 1575 -1136 -885 1876 -566 -1076 1428 -588 -928 1590 -481
730d81o61K604j682r67K319j180p60J859j406o29K146j123r29J622q48m42J395
$$ -481 -1142 1462 -220 -1187 1132 -48 -808 1051 -355 -984 1162 39 -890 732 -116 -558 837
747H37j101l84J507r89n02J215p44j3Q10j243L08J220j380J17J068j348N01J130
$$ 837 -264 -648 859 -130 -632 583 -161 -174 636 -607 -299 921 -459 -342 726 -622 -121 1009
765A009j854M28J643j823kJ621j532R2J453j731J17J824j627l58J572j206L0J326
$$ 1009 -845 -417 1226 -597 -599 1022 -510 -418 1035 -696 -579 1245 -382 -740 832 -374 -344 982
783I82j608N8J652j519j96J598j294j89J401j394j23J759j239p29J390n80l22
$$ 982 -626 -568 1084 -435 -631 967 -327 -516 885 -509 -632 1127 -112 -841 549 -31 -353
800c53R46p96k16R42o89j63P11m82J28K51q79N89P11j060K04N25q23N18N08j152
$$ -353 593 -203 -419 523 -166 -329 382 -100 28 279 -600 -11 700 -360 -156 369 -454 64 572 -580
820e80M93P39j105K05P05o85L32K35r63O24O11r88K64M63p24M61K83q86N43N24
$$ -580 -87 652 -453 -248 457 -228 104 339 -624 0 611 -377 -113 350 -374 87 370 -516 27 551
840E51r15J56M65l97K69L8n57M50K34n03J98M6j33M15l62m00P11l0n19L70n6k13
$$ 551 -364 -208 257 -140 129 167 -390 60 294 -209 -11 35 -98 317 -45 -445 266 236 -283 87 31 -182
862a82M60k87l30N72m1l69J48r3J99K70n65j7N00l31nK80m24K27L66p25Q2P02
$$ -182 278 -9 -339 233 192 -177 -29 -122 77 347 -218 -235 265 -66 -71 209 -215 12 378 -347 -265 437
884D37m29j35K17l64L52L01o69J76L91m91K10J85n16N30K22r84L95O83p01J31
$$ 437 8 -127 90 -274 78 379 -290 -114 277 -214 -4 181 -335 195 417 -567 -172 511 -190 -59
904e9L40p03L96N34q45R0O91n45j21L44k52K06K30n85R4M02k36N1j6k10L87m4
$$ -59 281 -422 -26 508 -337 -247 444 -101 -222 122 -130 76 306 -279 -185 217 -19 32 16 -194 193 149
926A49m83L86J70l37K40k12k55P45j74p11O12J11n89N24n4n81Q09K8j011O46M80
$$ 149 -334 52 222 -115 125 -87 -342 403 229 -482 130 241 -348 176 122 -459 350 378 -633 13 493
947D93q16L17K90o85M53M07q66K12O40n23j26K88j74J72J24m38J27K93k03J3l8
$$ 493 -323 -6 284 -401 52 459 -407 -195 445 -78 -204 84 -90 82 206 -232 -105 188 -15 -2 -40
968d0j07L74j32m52M16J80l67J56m3k37N00l4o00L79K62m00J27O7k10L68n3n31
$$ -40 -147 227 95 -357 59 239 -128 28 -15 -252 248 214 -386 -7 255 -145 -18 49 -161 207 154 -377
990c77L69K83l75Q3M6k04L68k7m81L45K19l80Q7N9j68L82l7n72L46L42m16N0J44
$$ -377 -8 275 -100 -17 29 -175 193 166 -315 30 249 -131 -44 15 -153 229 192 -380 -34 308 -108 -58 86
1013H6k23K28R0m79K00M28l42j73K00j7M5M9k01%K23j2j90o8K36J38l18j09K88
$$ 86 -137 91 181 -298 -98 330 -12 -185 15 -2 43 92 -109 -109 114 102 -88 -156 80 218 -100 -209 79
1036G9nj02J14k25oM57k75m06N21J24m82J46J59k49K87Q5n30J86M53l23k29L25
$$ 79 74 -28 86 -139 -145 312 37 -369 152 276 -206 -60 99 -150 137 222 -308 -122 331 8 -221 104
1058A04l0j16R7j27m8L01j4l72K2L70m5k54N7J32r2L0J7j87J89K49m00j98M52
$$ 104 74 -42 55 -72 -120 181 167 -205 -183 187 142 -112 -55 77 -15 15 32 -155 34 283 -117 -315 137
1081A37M7k81J06k6j24L04p3l50K86K50l84j34K95M2m6j2j67J6K35qk41M4K14
$$ 137 184 -97 9 -17 -141 163 90 -260 26 276 -108 -242 53 95 49 37 -130 -114 121 113 -128 -84 130
1104A30m3k61Q7K08m3o8n8j21J71K64k90k19L42N1k94O9J70o6K3m5k13J63L24
$$ 130 87 -174 -87 121 78 10 -48 -169 2 266 -24 -243 99 150 -144 -75 95 29 52 7 -206 -43 281
1127B81k16k81J95J51j60j5Q3o3M8Q0k56j7M29o5m47J35K70k02N0J05k42J15K52
$$ 281 65 -216 -21 130 -30 -45 38 -25 23 103 -153 -170 259 194 -253 -118 152 -50 0 105 -137 -22 230
1150B30l75j22N26n2m40J68R6j16K17Jl75J81L27l46j57L88K5k75MN8mJ66M0l38
$$ 230 -145 -267 259 207 -233 -65 31 -85 132 133 -242 -61 266 -80 -237 151 176 -99 -95 -37 -41 125 165 -173
1174a73j0L98j27l32K82J52k92M6Q6j89K57J95m92p0M62p5k44J58lp3J30j35j20
$$ -173 -183 215 88 -244 38 190 -102 -56 30 -159 98 293 -199 -269 193 118 -126 32 29 -44 86 -49 -169
1197a69K82J14l21j17K50J17j46o7O5m7M8R7k41L6L93k39l97L71J43k38J67j17
$$ -169 113 227 -94 -211 39 156 10 -57 8 -39 9 106 -135 -99 294 55 -342 29 172 -66 101 -16
1219a6k27L93L7m44K22K46k46o1L7J3K48j46k25J57JK9J38l23N3M51m16k61N80
$$ -16 -243 150 187 -257 -35 211 -35 -96 -59 -46 202 56 -169 -12 -11 18 156 -167 -114 337 -79 -340 240
1242B40j53k48L91l78j81P49k91n43N84j1l94L39q4j89M44k11l93L90N8j15Q9
$$ 240 87 -161 230 -148 -329 420 129 -414 170 159 -235 104 20 -169 275 64 -329 61 119 4 93
1263I3k81J23L24l95%L43l23J39J93o47M34N83r00M6O81o84J33O58q95J25R13
$$ 93 -188 -65 259 -136 -136 207 -116 23 216 -431 3 586 -314 -268 413 -271 -138 520 -375 -250 663
1284F63r28k19J026n40k88O87o27j28Q88n51l75O80k67j87L67l78J05M84o05p0
$$ 663 -265 -484 542 2 -286 401 -226 -354 534 -17 -392 288 21 -166 201 -177 -72 412 -193 -263
1304b63N12l46J12K67o29K87M99p18J05N59n34R1L26o46L38N77p81KN72n22J33
$$ -263 249 -97 15 282 -347 -60 439 -279 -174 385 -149 -58 268 -378 -40 537 -244 -242 330 -192 -59
1325e9L92o46K67N25p98M5O78m98M0L14o30K92N47p34P7N45n64J09M02o58L27
$$ -59 333 -313 -46 479 -319 -274 404 -94 -54 260 -370 -78 469 -265 -188 357 -207 -98 304 -354 -27
1346b7O09r40KQ09n76m9O33p46LQ50p36k86R40m17m26N67l07j18O47m53l42N83
$$ -27 582 -358 -356 453 -123 -172 461 -285 -282 568 -168 -454 486 69 -357 210 -97 -215 432 -21 -363 220
1368B20j79j80L28l07N6M01n74l6O35l77q9L45n51J92O19p44m5P46o11q7N72n90
$$ 220 41 -139 189 -118 -62 339 -235 -271 364 -13 -102 243 -308 -116 503 -241 -286 460 -151 -238 334 -256
1390b56J58O80q96j09R50o39j34P02p41j0Q92q50j79J034o13l69P22n34k9Q08
$$ -256 -98 582 -314 -423 527 -112 -246 456 -285 -295 597 -253 -432 602 -11 -380 342 -192 -221 587
1410E87p57k65Q74n20j98O67n51j1O61p67j23R22n19k74N85n22kP07o30j79O87
$$ 587 -170 -435 439 -81 -279 388 -163 -174 487 -280 -403 519 0 -274 311 -211 -213 494 -136 -315 372
1431C72l85k28M05k51R1L04n61O5M39l16J02J08m30L63K12o60L38M08n95J91K20
$$ 372 -13 -241 164 -87 4 308 -253 -188 251 -65 37 145 -285 78 290 -370 -32 376 -219 -28 192
1452A92n57M64L55q38K14N51n79Q8L90n22K08M10o83M5O59m03k10L70k45l4L69
$$ 192 -365 99 454 -384 -170 381 -198 -110 280 -242 -34 376 -307 -262 397 -6 -216 154 -91 -125 244
1473B44k84j97M02k2l32J14J74k6m5o0p8Q3J87j01j99J33J59j98p8J55N9l2o7
$$ 244 -40 -237 165 143 -189 -75 99 73 28 -32 -110 -27 160 59 -140 -7 152 -46 -124 31 90 58 -9
1496ij28R2J86o6j47j4J01O2j01n8J50K5j21n8%J52J26k50j06K18k0n1M5j11J06
$$ -9 -137 -45 141 75 -72 -86 15 77 -24 -82 68 93 -28 -86 -86 66 192 -58 -164 54 34 -17 28 -83 23
1521B3J29k88k5L17p7j44N9j27J36K08k73q0K54p0r4O5j01J55J26l71ML61j66
$$ 23 152 -136 -161 156 79 -65 -6 -133 3 211 -62 -142 112 42 -52 13 -88 67 193 -178 -174 187 21
1544B1o3J37k50J02L14l79r3M52j64k60K19n8m1K79k17k44L25O6k25N5L6J2O6
$$ 21 -42 95 -155 -53 261 -118 -211 241 77 -183 36 -22 -63 216 -1 -245 80 146 -79 -24 12 24 90
1567I0j85k7K39k2j28om0R8J46k33n6K56r2j62J37l8M4J72k89j15L71m7k28J39
$$ 90 -95 -122 117 95 -33 -39 -79 19 165 -68 -124 132 40 -122 15 -23 21 193 -96 -211 160 113 -115 24
1591B4l4n6J99j81j51L98n8l49J75J02j18J93r5k82K81J22k96P6J51r1K4r7p3
$$ 24 -10 -66 133 -48 -199 199 141 -208 -33 69 -49 144 49 -233 48 170 -126 -50 101 10 34 -63 -136
1614a36K61J8k35M6OM0J69k27j11L50j12k99K67N7j59K23j69k69M10P6l70J48
$$ -136 125 143 -92 -46 -40 0 169 -58 -169 181 69 -230 37 94 -65 158 -11 -280 130 206 -164 -16
1636a6J09j65J23m3j55K88Ll17R3J37pQ7j81j29K86m3k12J87J2q2J07j68q3L80
$$ -16 93 -72 51 8 -147 141 144 -173 -80 57 50 137 -44 -173 113 70 -142 45 57 -25 82 -86 -169 211
1660B11p0l11J65J3n6J90j55j49L14n5l25K25J38j45O9r7j61K88R0k72K4J41o8
$$ 211 141 -170 -5 8 -48 142 -13 -162 152 97 -228 -3 135 -10 59 -38 -199 89 179 -93 -69 72 4
1683Dl2KJ9J13m3j42m2J10J50k8k28L9K01j42o3J39k4k8N4j93PL46q5k91R9R9
$$ 4 -28 -26 -7 106 63 -79 -121 -11 139 111 -117 -78 123 -19 -82 57 33 5 59 -134 -127 219 134 -157 -58 41
1709D1n9O9j3j05J13K8k03M2K24rj54r0O0J16M0r7o6N5O9q5n4J32R8j60j21O0
$$ 41 -18 51 38 -67 46 74 -129 -87 137 128 -26 -116 -56 60 100 3 -63 -8 61 -24 -78 54 152 -8 -129 -69
1735f9J05Q8m4j74QJ48l2q7P3P9n8r3l2P3J75l0k43l6J91K8p8L0j0j4J1o9oJ86
$$ -69 36 124 80 -94 -86 62 30 -57 16 95 37 -56 -88 -15 160 130 -113 -149 42 70 -8 22 12 -2 9 -60 -66 120
1763A20M3k69o3J84P4k7n6p8M8P4q8l6J43P4j67j52J08J87kj01o4m0R9P0j06k
$$ 120 163 -106 -169 15 89 62 6 -72 -24 50 -38 -74 69 143 -24 -176 -68 119 117 16 -48 -88 11 81 -25 -27
1789b7J62j12k08J16J56QMj60j45K36J30j81j1J05q1o7K6N6J10Nk07q2J57J42
$$ -27 135 23 -185 -69 87 95 99 -61 -206 30 160 -21 -32 73 -8 -75 -49 7 117 122 -85 -167 -10 132
1813A32k8j33k5O9k9l7R2L4j9o3j59M6L10k4k60J3N3j2J06j0r8J33m5k56J47K34
$$ 132 104 -29 -54 15 -14 -51 41 75 56 -7 -166 -120 190 166 -94 -81 -28 -40 66 56 -42 91 46 -210 -63 171
1839A71r0o0o6j45K12J38j76j6J00j00n8P1N3J22o8k52M0J47P3K1j68p3J95o7
$$ 171 81 21 -45 -190 22 160 -16 -32 68 -32 -90 -19 34 156 88 -164 -124 23 96 117 -51 -124 71 4
1863Dj34K40L3k17P4p8r3L97J0m29J01J88k00J41J04k26J25L1k89J58K87j40j06
$$ 4 -130 110 143 -74 0 -78 -171 226 236 -193 -92 96 -104 37 141 -85 40 71 -218 -60 227 87 -19
1886a9q1o6K70K7k09J37m0j67J72j8p2L19j80m02K84J76j56J73j33k68L46%l05
$$ -19 -100 -166 104 131 -78 59 19 -148 24 6 -66 253 73 -329 -45 131 -25 148 15 -253 93 93 -212
1909b12L45P6l63J28j1j30M28n0m66K16J30k03J98M4k26J76n8k85L09J70k04L2
$$ -212 133 209 -154 -26 -37 -167 261 211 -255 -39 91 -112 86 130 -96 80 22 -263 46 216 12 44
1931D4j95n1M27j07k58K90j27k64L35o8j41M45k60n06M85J45l00K62j01l58L79
$$ 44 -151 -202 225 118 -140 150 23 -241 94 26 -115 330 70 -436 49 194 -106 156 55 -303 76
1952G6N2l41L46R4m11J09L6o9L93j33m34K61N8j73L02p6k54K79j47k76M65R3l49
$$ 76 128 -213 133 227 -184 -75 -39 -108 285 152 -282 -21 37 -136 166 90 -164 115 -32 -308 157 250 -99
1975i9J20j07j74M82j4m02K66jl28K71R8j62K65j87m20M02K01k37J24j08k21K99
$$ -99 21 -86 -260 222 208 -194 72 71 -257 14 112 -50 215 28 -392 10 211 -26 98 -10 -231 68
1997F8j4j69L08p6l26J86n2JM52l23l93M05l8k09M51j96l44M46j89l93O85M7n77
$$ 68 54 -115 193 117 -209 -23 -75 -74 378 55 -338 67 29 -180 271 75 -269 177 -12 -405 280 327 -250
2020b50K64l5k88N73J6n67L28R1m19L18J62k45J95j39l71L97K08k32O5j51j04
$$ -250 14 -21 -309 264 280 -287 41 132 -287 31 193 -52 143 4 -367 30 238 6 71 -80 -184
2041a84L03j13o7L08k27k13K06j11J22L87m87k46M35j59m2L97l54j49M01l75q3
$$ -184 119 6 -61 247 20 -193 13 -98 24 411 -76 -322 113 -46 -88 309 -45 -194 207 -168 -251
2062b51O08k15l24K28k55P8M98l39k15L39k65q9L87j75qK34m54r0N18j06r8J39
$$ -251 357 142 -182 46 -209 -131 367 28 -187 152 -113 -202 185 10 2 236 -218 -308 210 104 6 145
2084A45l48K8L67k25j6K58k44j39J48n7K23J22m02l8J80o2J78J7k55J68j9k92
$$ 145 -203 -175 192 -33 -49 209 -35 -174 -26 -83 140 262 -140 -178 2 -60 118 135 -120 48 29 -263
2106b63L33J54k72J37j65k62N22J05m73K40L6l91L47J27l48L72No16L14L57k90
$$ -263 70 224 -48 89 -76 -338 184 289 -184 56 92 -299 48 175 -173 199 204 -412 -98 259 -31
2127c1J21K5m09K53K43l14J40J55k97J8N4j0K76o9l32P8N5L7K03j80j40K59k15
$$ -31 90 115 -294 -41 202 -112 28 183 -114 -96 -42 -52 224 155 -177 -99 -44 -7 196 16 -124 135 -80
2150h0j62M25m3k00J57k70j00N50j11l46K76j25j91L54q5j73L66k13l93M10J19
$$ -80 -242 183 140 -60 97 -173 -273 277 166 -180 96 -29 -220 134 49 -124 242 29 -364 46 165
2171A65j90J89k12k35M16l2k59L27o6l12K39o8r0M33j89m12L10M6j83L26j35l03
$$ 165 -25 164 -48 -283 133 101 -158 169 103 -209 30 -38 -128 305 116 -296 14 60 -123 203 68 -235
2193b35L73j11l19M63P3l93J67m4k29M82j1m35K28L6k19K38J6j51K42j88k66L44
$$ -235 138 27 -292 171 244 -149 18 -26 -255 227 216 -219 9 45 -174 64 80 -71 171 -17 -283 61
2215F1O1j22J55k78j31M60j67j98L86j97k66L53j71j11N37l10m53M92k7k40L99
$$ 61 122 0 155 -123 -254 206 39 -159 227 30 -236 117 -54 -165 372 62 -391 101 74 -166 233
2236B33j66l38M35j27l31M86J1l64K01j08j41M68j27l53K87n4j71K93j06j17L16
$$ 233 67 -271 164 37 -294 192 203 -161 40 -68 -209 259 132 -221 66 12 -159 134 28 -89 227
2257B27k91k39M64n1j80K27k88j20M96k07k41M26j66l01L29r7j10M00k37l66L67
$$ 227 -64 -303 161 110 -70 157 -131 -251 245 38 -203 223 57 -244 85 -12 -122 278 41 -325 42
2278D2P3j70J79j03j47K15j22j11K94m9j61L7j20J08K96k63j31K22j58j2K34j91
$$ 42 115 -55 124 21 -126 89 -33 -144 150 101 -60 -23 -143 -35 261 -2 -133 89 -69 -81 153 -38
2300c8jK53l43j19M30p2j74J60j89o5L29j01k11K63m2k21J21M8j5J32j42j93J58
$$ -38 -39 214 -129 -248 182 110 -64 96 -93 -158 171 70 -141 122 80 -141 -20 28 13 145 3 -190 -32
2323c2J14m1mq9K9P5j23J9J79o8r6Nr4J19K17k15j42J97m0j08J56j1q0J16j13
$$ -32 82 41 37 -52 -23 52 -71 -52 127 59 -37 -32 -126 -7 210 -5 -147 50 10 -98 58 47 -33 83 -30
2348c0j51K27J39j84p3N0rP2Mo7L4L4o8o0N7J42k8j80JJ05K7jj4r6M9R5j42j5
$$ -30 -181 46 185 1 -72 -22 -31 41 45 -22 12 46 -22 -82 -25 117 89 -91 -90 15 42 41 27 -69 -20 75 -67 -82
2376h2K13m3j82M1K2J2J49j01j80J48R4j46J2J17m3o1Nm6O8J38r9j66P6J21m4
$$ -82 131 88 -94 -53 -31 -19 130 29 -151 -3 91 -55 -43 74 31 -30 -25 -71 -3 135 36 -130 -54 67 23
2401B3o3M0J8k6J1n5K0J29j6j84mJ78oq1L0l1LM5l3o1J23M9j59n9J31O4p3j3l6
$$ 23 -40 0 18 -8 3 -52 -32 97 81 -103 -107 71 65 -16 14 -17 -14 31 -2 -63 60 109 -50 -109 22 86 13 0 -36
2430c6J1R1j6j24P3J17j20j08J11O6k1j9p3k5J42jj36K9J10m8p0J7N1K4l0o8k9
$$ -36 -25 66 50 -74 -1 116 -4 -112 -1 65 44 25 -48 -73 69 68 -68 -39 71 23 -47 -30 21 45 15 -53 -82
2457h2R4Q1q5r7J09M0r7pN1k7P7l3j54J14J65j53p4J00k5J6N2j24K4J41j02j08
$$ -82 12 93 8 -89 20 60 -37 -44 7 -20 57 24 -130 -16 149 -4 -78 22 -3 13 65 -59 -35 106 4 -104
2483a04J16N8k3n3o0O1P4n2m4nL1O3q2q7J70M0j80M7M7n7J12j4k04J41J28j80
$$ -104 12 70 47 -6 -66 -5 69 17 -27 -32 -1 62 -20 -107 63 103 -77 -30 17 -40 72 58 -146 -5 123 -57
2509e7l0J40o6J8J9j17Q4J22j22o8O7L2K6p2n2J16K9j22M5Kj2J19j11j32K00M5
$$ -57 -87 53 -13 5 24 -93 -9 113 -9 -77 -10 22 48 -24 -76 40 69 -53 -8 -6 -18 101 -10 -142 58 103
2535A03j85N4O8q4R7k2j65J73Q9k04J1J09m7K9Oj26R2J09j49j8P7J0J9p4n7J32
$$ 103 -82 -28 40 -44 53 31 -134 39 128 -76 -65 44 -3 26 32 -94 -2 107 -42 -60 17 27 46 -28 -85 47
2561D7M0j40J5L4RP4r1j00J78J7j90Q6P1p8J01o4j56J95O9j90K5J09p1L6Nj37
$$ 47 87 -53 -38 -4 5 79 -12 -112 66 83 -107 -21 50 -28 73 9 -147 48 117 -73 -48 61 -10 26 31 -106
2587a06J27Q9j84kJ07l5M2m0j15J73L1j73O2P6q4P8k8j61K17N8k59Q8J39j55P8
$$ -106 21 110 -74 -76 31 -4 38 -2 -117 56 87 -86 -24 52 -32 46 18 -143 74 132 -127 -39 100 -55 23
2612B3N3k05J54J32k66J6J92q6j9J4q9J33M5j80M5P8l6N3p4r1K15k4k26J55N0
$$ 23 76 -129 25 157 -109 -93 99 13 -6 8 -81 52 97 -83 -38 40 4 57 -17 -108 107 83 -143 12 62
2637F2j24J35m8j85K44M2k78J38J03j38J01k9j70K25M0k74J23J11j25R8k4j50
$$ 62 -62 73 25 -160 84 126 -152 -14 89 -49 52 23 -147 78 118 -156 -33 78 -47 51 27 -123
2659a23K09K4k48J25P5r8Q9o8r4K06k7j83J27Ro5J22j26o5K63r7k00J77K1q6J17
$$ -123 86 110 -138 -13 62 -36 53 -15 -109 97 70 -113 14 23 -42 80 -46 -111 152 55 -145 32 53 -33 84
2684H4r6r9K08k7j71R9M2n1M2j09J7J68q6r9Q6k3J7P8j42qJ88j09j25J35Rl7M9
$$ 84 -12 -111 97 70 -101 -2 40 -11 31 -78 -61 107 21 -78 8 -15 2 80 -62 -70 118 9 -116 19 28 -9 40
2711D0j10KJ49l7q7L4LM5k6r5Q4Q9j08l6L9JR5l9j42Q9R6j20JO0l5M2k3j11R6
$$ 40 -70 -68 81 44 -43 -9 -6 39 13 -82 2 91 -17 -53 -14 -13 82 43 -99 -10 86 -34 -33 27 -8 34 11 -100 -4
2740dJ33j30m8L6kN1mr5O4O8p7o2N3Q6qr5k6P0K3jk8p2O8P6j57OJ69o3q6P6p1
$$ -4 129 -1 -49 -13 -15 36 32 -63 1 69 -8 -70 -17 69 61 -34 -60 10 33 32 4 -68 0 76 -81 -75 94 31 -55 21 -50
2771e0J6J71j40j21J78lj19Q8pl3J04j26q0J93J2j19L4l2rJ34p2j11J62qj56O3
$$ -50 -34 137 -3 -124 54 51 -68 20 13 -20 84 -42 -122 71 83 -36 -2 -34 -43 91 19 -92 70 62 -94 -31
2797c1N8k9Q6q0j33J49Q0j22J4J8k3N1o6k5J28k5r1Pj2N4J04j42o2J58o4m6R5
$$ -31 27 -2 84 4 -129 20 100 -22 -8 10 -13 38 -28 -53 75 50 -41 -34 -46 8 112 -30 -92 66 2 -44 51
2824E1q8M2J09k22j5K53r2j07J19j09j7K38j95j10L04j36j83K32m9p2J99j82j69
$$ 51 -37 5 114 -108 -123 130 38 -69 50 -59 -76 162 -33 -143 161 25 -158 74 25 -47 152 -30 -199
2847a99L05k7j70J51m5q9J71j27r3K81r5j91J52m5l4K17j80j23K52r4j33J90m9
$$ -199 106 79 -91 60 15 -74 97 -30 -123 158 63 -128 24 -21 -55 162 -18 -141 111 17 -116 74 25
2870B5q1J61j77o4K74o3j62J12o3%J54j50l6K12j60r6J74p9K8J20k43qK52j33
$$ 25 -56 105 -72 -136 138 75 -87 25 -38 -38 116 -34 -70 142 -18 -114 60 -19 9 129 -114 -122 130 -3
2894cm7J40j63K9J86k53K2K88k12j21K04j24J0K17k58o6K99j38j25K14r0m5J41
$$ -3 -50 90 -73 -44 142 -111 -89 199 -13 -134 70 -54 -44 173 -85 -151 148 10 -115 99 9 -36 105
2917A05j92j3K50j06j24J11o8K1J26j66jJ88j40r4J43m2K5P3j89jK18j09q2J16
$$ 105 -87 -100 150 44 -80 31 -37 -16 110 -56 -57 131 -9 -103 40 -2 23 96 -93 -94 124 15 -67 49
2941D9n1k0O6j04L6J34r4q4M2j9R5L1j66M3R9q1j0P0o2P0j2j67J06J67j51k6N4
$$ 49 -2 -22 44 -60 -24 110 16 -68 -26 -45 50 81 -85 -42 57 -24 -34 36 -26 44 32 -135 -29 138 -13 -39 15
2968A5p1O6O7j49M5J39j57m3J18j9J0M2j44RJ61m9q8N7j0Qj1n8O2R4q4r0N3L0
$$ 15 -56 10 77 -72 -27 112 -45 -88 30 11 21 63 -81 -72 89 40 -48 9 -1 7 -4 -62 0 94 10 -80 -27 3
2996CN1j4j03L4O8n4j8N4J7ol9p4P2R4n1o8j1M6L0k0n1N6K4n0k9K1M9M9j06n6
$$ 3 54 40 -63 -29 39 -15 -33 21 38 32 -7 -81 -9 85 34 -34 -45 1 31 11 -40 16 40 -10 -39 -18 31 80 -26 -82
3026h2Q4L3k0lk0j6P9q1n3J22L4j05j9K7K8O9n5q1O4L7o3PK7L7j0q1k7R6L8n6
$$ -82 2 35 15 12 -8 -24 55 -26 -79 43 77 -28 -47 -20 8 77 22 -59 5 42 -21 -14 13 50 40 -41 -68 28 66 10
3056A0m7j6N1O7q9k5R6k3m2j8J4O9K2j00m3R3kj5Nl7N8J5j09K4J07m1m1lm8J10
$$ 10 -37 -53 -2 65 -24 -49 47 24 -18 -36 -22 47 69 -31 -74 19 17 2 7 -30 28 43 -66 -42 65 24 -17 -20 -68 42
3086D2N4j45j5J12m3k7L6m3N6L8j25j4J28j2n5J0k1M6M0j03JQ3k6k4j2j4R2Qj29
$$ 42 96 -49 -64 48 5 -22 14 -29 27 65 -60 -74 54 42 -13 -3 -24 22 62 -41 -40 43 17 -7 -19 -33 59 67 -62
3115f2L0Q4o2K2Ln9Q5J9j46N5J02o7j5J5n4Q0M8j21nR1m0j8J2k1P3nj20M5Q1l7
$$ -62 -32 52 -10 12 15 -44 41 60 -86 -31 71 4 -11 4 -50 30 78 -43 -48 43 3 -15 -3 -24 49 44 -76 -31 50 13
3145A3K3n7m0J05kj35R6O0r1K6J0o2J12J3j66O5R7r5K4K0o8R9K2j71P2J26q3l9
$$ 13 36 -21 -61 44 42 -93 3 63 -28 -2 8 -54 58 71 -95 -30 67 -28 -4 16 -52 47 69 -102 -30 96 13 -26
3173b6K1l2P3K0j21N4O9p0%j7QJ03n4j27J03M1p3N4l5o0J37j2j64J16R2j42J1
$$ -26 -5 -37 36 56 -65 -11 58 -12 -12 -29 -21 82 28 -99 4 45 -28 26 -9 -69 68 56 -108 8 100 -42 -31
3200c1K5m4J10kj55P1P7p6K2J5n1J09l8j31J20M4r4M9m2o3J54j7j69J33P3j30
$$ -31 -6 -50 60 58 -97 -26 51 -25 -3 12 -39 70 32 -99 21 65 -29 20 -22 -85 69 52 -117 16 89 -41
3226d1K3K2n4J21k6j51J07O6r4K8Pn5J01k8j28J10P5j21M0j3k9J16m7j22J19J1
$$ -41 -18 4 -50 71 45 -106 1 67 -27 1 8 -47 54 26 -102 8 83 -38 2 -11 -40 76 29 -93 26 37
3252C7p2N4n8%J37j14j01J66Lj27J04j5r9J74n3j65J47O0j42L8K9m2R9l7j04P9
$$ 37 -35 19 -39 -39 98 -16 -117 49 52 -75 29 14 -85 89 36 -129 18 78 -64 -26 3 -39 60 23 -81 -2
3278bM0n2Pk6NJ24j22r3J70Mj25R4l6n9J56o3j25J37M0j26L9J6k1P7n0j01J04
$$ -2 38 -14 -7 -33 -28 96 -26 -119 51 55 -70 24 -12 -71 85 22 -103 34 74 -52 -13 3 -18 59 9 -92 12
3305A2N6q7J2mqP5o7p6J23K1q1K2nj5R1p9n1R1pn5N5o1J2J18j08r3J64j0j10O7
$$ 12 68 -19 -7 -11 -19 56 -11 -87 36 57 -24 -2 -7 -22 69 -10 -61 30 23 -32 23 -38 -26 92 -16 -109 55 45 -65 2
3335BK1p8R9nj15P7Q6r9o0P6K7rl9mK7NJ7m6m5Q5M8j36J1J19m9n7N0j8j6R5p8
$$ 2 23 -55 44 39 -76 1 87 -12 -72 4 31 22 -17 -21 6 11 28 -18 -63 22 70 -66 -55 64 15 -42 8 -10 -26 69 -9
3366io9J11K5q8mM1JJ7k7n9P4K5n5j6K1K4Ok1l4M4L1n4l7M9N9m1n5L4J6nJ9m2
$$ -9 -78 33 58 -30 -34 7 8 25 -2 -61 13 38 -17 -33 -12 12 18 -3 -37 7 38 -16 -53 -4 55 14 -41 -7 9 4 23 -19
3398a9l1Q0J0j08L4P8k2n0oJ2O0Jo2lK3L0nq4L7J13r7o6R9Kn3P1n6o5J43j2j38
$$ -19 -50 30 40 -68 -34 44 22 -28 -34 -22 38 39 -23 -26 -3 27 22 -62 -25 88 -9 -75 24 26 -27 44 -12 -77 66 54 -84
3429h4O8P7n7k2oJ8K8j0n2J6K3L6k5q7O6R8j42kJ05o1QN9j29K5J60j27p4J33m6
$$ -84 -16 61 4 -18 -24 -6 22 12 -40 -24 -1 35 10 -77 -11 87 -55 -57 48 -13 -5 54 -75 -50 110 -17 -91 42 -4
3458dk3Q6j04qJ69j33q5J49j4o4Q0p2n1J69q4j02J12J2m3M3p8M0R2j08j9P1n5
$$ -4 -27 59 -45 -53 116 -17 -102 47 33 -31 49 -23 -74 95 11 -91 21 33 -10 33 -45 -5 87 -21 -40 31 -24
3485b4N3L7j55O4J46j68l8J74q5m5J00j21%J76j16r4J31qn8M8n4K2P5q3l0P0k7
$$ -24 29 66 -89 -25 121 -47 -85 89 4 -41 59 -62 -62 114 -2 -96 35 27 -31 17 -37 -15 60 -23 -53 17 -10
3512a0M1Qj44J03J21j86KJ44j06J1P9j44M0J63j51n7J67p2m8J01j09KJ49j24p4
$$ -10 31 39 -105 -2 119 -67 -65 79 -27 -16 63 -81 -41 122 -29 -86 81 9 -39 62 -47 -45 104 -20 -94
3537i4J48k2o3N5m5j8J28q1r4J29lo2L2m7L2P4q8l5R9m0mM8j27P0R7j30l5J51
$$ -94 54 32 -31 24 -21 -39 89 8 -86 43 40 -22 10 -37 -5 69 -19 -54 45 5 1 49 -78 -8 89 -41 -76 75
3565G5n3o2P0q6K2J35j31o7J43j9o3M7l1%Q4q2l9J00k2k9K9p7M8R0j23k6J37n2
$$ 75 22 -40 30 -56 -34 101 -30 -97 46 27 -36 11 -20 -20 64 -18 -57 43 21 -8 21 -56 -8 82 -41 -67 70 18
3593A8n3Q4j01J8J37j25r2J77m0r4J07k9m5J00o3q0J13J9p8NJ3NN1p0l1Q0jj5
$$ 18 -35 49 -52 -34 103 -22 -114 63 23 -71 36 7 -38 62 -1 -81 32 51 -27 -22 -9 -4 47 -23 -54 26 25 10
3621A0j6m2P2L5j12J7R1n6rK6p3P1P2j39qJ14n4j9N4o8K5Q9j17l7J22k0o9L5j5
$$ 10 -6 -48 24 59 -53 -36 55 -1 -10 16 -57 14 86 -53 -61 53 -1 -20 34 -34 -9 80 -37 -74 48 28 -41 -6 -21
3650b1L6K2n8k1N9jj2k7j0P5j3r7M0P0l2j0On2P0K5q8%Q2k5m0PMM5rm7j3L8N1
$$ -21 15 37 -21 -42 17 16 4 -23 -33 42 29 -68 -28 42 10 0 6 -46 24 49 -39 -39 43 18 -22 -15 -11 34 25 -22 -35 3 54
3683E4m5n4M9M8m4k6K7pJ3J7r2J6J22p5n9N7KqM5p6mJ04m7r5P6M2k8lj0l6N3K1
$$ 54 9 -45 4 52 8 -18 9 2 15 32 -60 -44 78 3 -56 1 3 -5 40 -36 -40 64 17 -78 -2 40 12 9 -1 -37 16 37
3715C7p5J5M9jn6OM4Nk2j8qK8N6n4p0O1M4o8J5K9k0K1j4o8O1N5o2j4K1mL8j7n4
$$ 37 -38 -23 26 25 -31 -25 19 24 2 -16 -24 4 60 6 -64 -3 41 -27 -12 17 -3 18 4 -64 -3 52 -10 -24 -3 -7 31 14 -40
3748d0L7M4n3l3M6J0J5k2m2L3M5n1j7L3JJ6k0m3O0L2p4j4L7j3N7k5p0M7O0p1k9
$$ -40 -3 41 -12 -45 1 11 26 4 -38 -5 40 -11 -28 5 6 22 2 -41 19 51 -23 -37 0 -13 44 19 -51 -4 56 -15 -44
3779d4N8Pj1ml1J4P6o3m3L8J9jj7rK0J8m3jkL4K4m8o4R1L1q0K3J3j2K6rn3O9L2
$$ -44 14 21 10 6 -25 -11 65 2 -41 -3 16 15 -2 -11 9 27 -16 -17 -19 15 39 -9 -73 18 49 -31 -8 5 -7 19 10 -43 26 58
3813E8j04J8L2pK6j0p2O7M5q6J6M8m1K7j7m9O3N7j00j1N5n%j2l4O5J3p2mN0kJ9
$$ 58 -46 -28 4 -3 23 13 -59 8 53 -33 -17 31 -10 17 0 -49 14 71 -29 -40 15 10 10 -2 -36 29 42 -30 -34 16 14 33
3845C3n0m7R3K7q8K3K4k0K8j9m0N7L4r1NM5J4k8ok7P2j9m5K6J1j9O5p7m6J25n
$$ 33 -17 -64 29 56 -32 -9 15 -5 23 4 -36 21 55 -36 -31 14 28 0 -6 -33 39 20 -25 1 12 -7 58 -19 -65 60 55
3876E5j08M7K1l3N5k0p8R4K5j20L1P7m3kpn4P8L3q5J3L8k2L3o4PQ1k4n9K4J3m
$$ 55 -53 -6 15 -18 37 17 -61 33 58 -62 -31 46 3 1 -6 -60 18 51 -34 -21 17 -5 28 -36 -29 52 28 -31 -7 6 2
3907BM4o3k9J01or1M8L1m2L1l5m1J08Mj10K9N0k0Lj0l4N5K1q2QN5Rk2l7RL4Mm2
$$ 2 46 -17 -46 55 49 -42 6 37 -5 26 -9 -50 58 62 -48 -19 31 11 14 4 -30 25 46 -36 -28 27 36 14 -23 -14 20 24 -18
3940a8K5mJ2Lm3lQ1l3q8O3L2n4N9k1p1Q0M7j27L5P9o0l3M8j5jN1o1l8P8J9o1j4
$$ -18 7 3 15 18 -25 -28 53 20 -68 -5 27 -27 32 11 -60 20 67 -60 -25 54 -6 -39 9 -6 -7 44 -17 -55 23 42 -19 -33
3972c3L7L2l5j9J9PJ1km3j6R7j5r0N3M5o7K2Pm5O5J7j09K6Q9m0l2K9k1ON1n7k6
$$ -33 4 36 1 -18 1 8 19 17 -26 -42 55 40 -50 3 48 -19 3 10 -35 30 47 -62 -36 53 13 -19 10 -11 -5 46 -11 -37
4004c7Q2k1p0L3K7j5L1m3k6N0K1l5k6K6L1l3m3N3K4k8j3J3l7P1K0j02NJ00n5l9
$$ -37 45 24 -46 -13 14 -1 30 -13 -39 11 32 -3 -29 -3 28 -5 -48 5 29 1 -12 1 -36 35 55 -47 -42 58 3 -36
4034c6N4kk9M0l7k9P2K4q2j3O4Ml2pJ4Rj1roMM2pq8K4Q1l1m3M1k1j0N6n7k3J05
$$ -36 18 16 -13 27 -10 -39 33 57 -25 -38 26 30 -2 -9 5 14 3 -6 -12 -8 34 27 -61 -37 44 13 -30 11 -10 -20 36 -21 -44 61
4068F1j9j14M5Q2o9J8J0p0N6O0j21K9R2p4lK4l1K6N9q0k9N9K7m7k2L1J9j8k2L4
$$ 61 42 -72 -27 55 -14 4 14 -56 0 60 -61 -32 60 -14 -17 7 -24 2 61 -19 -48 11 38 -9 -31 0 19 1 -21 13
4098A3lmL9p9l0J43l2j21Q0M5j03P2L3j12Q4N3j51L3J04n8k5K8m3K8N3o5MN9m1
$$ 13 10 6 45 -34 -64 79 47 -74 6 51 -52 20 53 -59 25 78 -73 -40 64 6 -19 9 -34 -6 47 -18 -14 45 4
4127Dk0l%O5pj01N8K6m9O0k2q4J20j8j21J08O4j08K9L2j02R7N7j50J8J16r3pO5
$$ 4 -16 -19 -19 46 39 -62 -4 22 -27 33 11 -73 47 29 -92 16 80 -28 1 33 -69 28 85 -65 -47 69 -24 -31 34
4156C4l3JM4q4j3R8j5k5l4jO5l0l8O5j9m7M1k9k3J17l1j48R9O7j12N9N0j06N4
$$ 34 1 2 46 -38 -51 47 32 7 -27 -28 37 7 -31 34 15 -32 9 -20 -43 74 43 -105 -6 61 -51 8 58 -48 6
4185FN0j16K3J25j02k3N0j9PL3n9MM8j2k5J2nL3k0p8M3O9l7Qjo1P0J8j01O3N1
$$ 6 56 -60 -37 88 -14 -37 13 -6 1 34 -25 -21 27 15 -10 2 -3 30 10 -68 -25 44 7 15 14 -47 23 41 -60 3 54
4216E4q8jO5m4L5M4j16pJ16m6p1P5nk8L0l1PL2jn5nN5K9m3m5O3lo2N5J6o7Q8k2
$$ 54 -34 -35 30 -14 21 65 -51 -58 58 12 -59 16 11 -17 13 -18 -11 21 20 -35 -40 15 44 1 -44 19 16 -46 9 25 -42 46 24
4249B4j28J04P2j10J6N6q5L4O9r3J1Q6n9n5P9kj8J7l7k0N4Nk3k0K7Nl1k8P3J6
$$ 24 -104 0 72 -38 -22 34 -51 -17 52 -41 -30 56 -3 -58 21 19 1 18 -19 -39 15 20 -3 -23 4 9 -22 -50 23 39
4279C9n5OLlN1j5q0M4N5p8LO5l5QJm9K3O2l5n2L3K5jk6pM1pj5nj8M5L5r6j2P6
$$ 39 -16 -10 -7 -10 41 26 -54 -10 45 -33 -30 35 0 8 9 -40 -17 45 10 -42 -9 16 15 -11 -18 23 16 1 -4 -22 23 58 -38 -50 26
4314B6ml3M0l2j2M3j8p4P1M3o0qL0k3J8K5o4J4M6l6m9M4O1m0n3M4J1kJ8k7m3O4
$$ 26 22 -11 29 -3 -15 28 10 -64 7 50 -10 -18 12 -11 7 32 -32 -18 28 -8 -57 -13 48 8 -45 -1 10 8 26 -1 -44 20
4346B0K6p1RN7m5k2K6j5K1M8n6l9M5J6k2j2J3J2nk5J9J6L%n2jO8Jo4J9K2k5PJ3
$$ 20 46 -25 -16 41 -4 -26 0 -15 6 54 -2 -41 4 20 -2 -14 -1 11 6 -19 0 16 19 19 -33 -34 34 35 -29 -10 12 -13 -6 7
4380Gk4L6J9q1RO6j8l0J7JKJ8l6j3L9Kl3j9M7K4k9j8j6L0RKm6J7O2m0m4M0M1l4
$$ 7 -17 19 38 -43 -34 32 14 -16 1 2 4 22 -14 -27 12 14 -19 -38 9 33 4 -14 -30 0 9 11 -35 -18 44 4 -40 0 41 7
4414GJk5k1M9L4q3J8N4k1k5J2RMJ2m3OK5Pj7l1K8K6j4l8M5rj4J9l0j0O5qq2L7
$$ 7 8 -17 -38 11 45 -38 -20 34 13 -12 0 9 13 25 -18 -12 13 20 3 -28 0 26 12 -26 19 10 -4 15 -15 -25 40 32 -50 -13
4448a3M9n3PK8l3K3K3o8LP8j7o0J2K2Pkj5QLJ5pn2N2M0p1nN4j7j8M0m2k4Q5l3
$$ -13 36 -17 -10 18 -15 8 31 -37 -34 44 27 -33 -21 1 8 6 -9 -1 2 17 10 -42 10 50 -21 -26 28 11 -7 33 -9 -33 52 19
4482A9q1Q3L8q6L0J3m3M8K9q6QP0m3k6L1Rqjj7j1L4J0j3m7L0N4m1j0L4j5k7L1
$$ 19 -62 21 59 -27 3 16 -27 21 50 -36 -28 42 -1 -27 4 13 5 4 -13 -24 10 20 7 -40 -10 44 3 -7 27 12 -15 16
4514A6k4pP3l8p1O7L5o1LJ9l5L5J6n1J6N1l1l1NL8Nl5k0K8LPjk5K1M1o6k2P6j9
$$ 16 -8 -15 58 20 -51 16 51 -10 -7 12 -23 12 28 -23 -7 44 13 -18 -13 25 30 -5 -25 3 6 13 12 -13 8 49 -17 -39 37 18
4548A8j9L6m0j8O5k3p7P4L5r0L1K6l7M4Oq1K7P1l7l7K9MorkJK1rj8k7M7K7n3j8
$$ 18 -1 35 -5 -23 42 19 -58 16 51 -39 -8 18 -19 25 31 -50 -23 48 11 -26 3 7 1 -8 -10 -9 12 3 -15 -42 5 32 -21 -39
4582c9N5Mm5L0ok2P0k1r2P7M5p8%L6l9L1K8n5J2N2m9j0K5QJ0j9l5L8J4j8JPj8
$$ -39 16 20 -25 5 -1 -23 47 26 -66 11 56 -22 -22 14 -25 6 34 -21 -9 43 -6 -16 9 17 27 8 -27 11 25 7 8 15 -3
4615cK8l0k8N9Rn5K4j0nL7j5n9O2L3p9J9L2l0K9nm8K9P0o5k8M7oj7MoK1Ql2k0
$$ -3 25 -5 -33 26 35 -20 4 -6 -11 26 11 -48 14 47 -32 -13 19 -11 18 13 -35 -6 64 -1 -29 18 12 -5 -1 -7 14 22 -10 -30
4649c0K3J8K8n7l2Q2Kn3K7Nk6L3rm3M0N0p2j7M1PnRl6%M8m8j3M4Oqk7j3L2J9k3
$$ -30 -7 11 39 -18 -50 32 34 -19 8 13 -13 20 11 -32 8 58 -14 -31 10 17 12 21 -15 -15 33 -15 -28 16 22 14 -13 -26 6 25 2
4684Bk1J1J0Qk2lK6J6o6J7L9j2J8k9l2M0L2n1nM3j7k7K3j1J1N3m1p5P1L2l5j5
$$ 2 -19 -8 2 10 -12 -15 11 27 -39 -22 17 5 23 -6 -38 2 34 -17 -22 21 4 -23 0 -11 0 53 12 -63 8 40 5 -10
4716a0J3lJ1pqJ3K0k2j8JL9Rm5oK6j4pK3k2J6K9o1k0O3Lm3K0nj8O7l9k9L0K6o5
$$ -10 3 0 11 4 -4 9 29 7 -11 -10 29 38 -7 -13 13 -1 -8 15 -7 9 38 -23 -43 20 23 -20 0 -5 -23 44 5 -24 6 32 -33
4751c3K5J6j9L3j7n4M9L8m5j1J0QJ3k2j8M0Ql7MLJ0J6k3k5L9Mk2J0J6lRk5k9N2
$$ -33 -8 8 -11 22 5 -49 0 38 -7 -18 -8 0 13 -9 -27 13 21 -16 -12 -9 1 17 -6 -31 8 12 -10 0 16 13 22 -3 -32 20
4785B0Kl0j3K1lL2k8j8K1Qk7J2J8j4L9m1l1M3K0n2K5Ql4M8rn7N1L4q4LN2j9RJ9
$$ 20 22 -8 -21 0 -3 29 1 -17 4 12 -15 -3 15 1 40 -1 -32 11 31 -21 4 12 -22 26 17 -40 11 45 -39 -36 16 -3 6 25
4819B5n1K3L7m9rM7j2mlk4K0L6m6k0K8K3Nk3k5K4K2m7K3K4j2J9k4m8O4J4n7KL2
$$ 25 -26 -3 34 -15 -24 23 11 7 4 -20 0 36 -10 -30 -2 21 26 3 -22 2 24 -23 0 24 12 31 7 -41 23 37 -20 -18 14
4852A4k7L6Ln6M8K4p1J3M9k6Oj0l5K7L9m9RK0j4ONl7M2K6o9NL1nMOm3K8K4n0j
$$ 14 -13 23 26 -30 18 42 -29 -16 33 7 13 3 -32 -5 34 -15 -6 14 0 6 11 -26 16 42 -27 -22 9 4 8 14 -29 -1 23 -27 -28
4887b8M4qk0Mj6K9K9m6j2K3QlrlK6Ml5lJ9J7rl2JM3kl2J1J5j5J3pj9M8ko3J7M2
$$ -28 16 8 -12 -8 -24 5 34 -12 -24 -1 7 4 -5 -8 18 22 -13 -16 3 20 11 -21 -20 23 21 -11 0 15 0 13 6 -13 35 33 -30 -13 29
4924B9k1KKk8J9J9l4PL0oj7qlK1J7m7kL5j1%j5PK0ok3j5M2Lj0j2mJ3J1k1kPKj1
$$ 29 8 10 12 -16 3 22 -12 -5 25 19 2 -6 -9 12 29 -18 -20 15 4 4 -11 -4 16 10 -13 -28 14 17 7 -5 -9 4 15 -6 -8 -1 1 -10
4962a0oK1J6j8k4MK5J3j4rPJ5k1j4KK6J0j5l2K0K6Jk0nQqLKoJ7Om0pM9qk1kJJ4
$$ -10 -16 5 21 3 -21 -17 8 21 7 -2 5 20 -1 -15 -13 13 23 8 -24 -4 22 23 3 -2 6 -2 1 3 -3 14 20 -20 -27 22 14 -7 -9 -8 6
5001FPk4j0L5nk8OL2J1l0rk0L8K1k8k6K9%lmqK9Ll3j3K5K0j9j5QMK4k5pJ7J6k7
$$ 6 13 -11 -21 14 9 -19 -13 19 30 0 -9 -29 9 30 2 -24 5 5 2 -2 -10 19 22 -11 -24 1 21 2 -13 -5 -1 23 -2 -9 8 24 -3
5038cj7J2L2Ll0j8J6K1j5qJ3KjopJ9Nj8l1K6MJ8k1j1RLJ0k3J2K0j2k4lL2NOl5
$$ -3 -20 -8 24 27 -3 -21 -5 16 1 -7 6 8 7 1 -6 13 18 0 -31 -5 -1 17 -4 -15 -6 -3 7 -16 -4 16 4 -20 -23 9 14 20 -15
5075a5MJ2K0m6J0L4mk1mjK3J7m2j3L9Ql6K1nQJ4j9k6M0J5m5oJ3kK9ol4K3K3l7
$$ -15 -11 1 21 -25 -15 19 15 -6 -10 -11 12 29 -13 -26 13 21 -15 6 1 9 23 4 -22 18 33 -12 -18 -5 -7 22 16 -18 5 28 -9
5110irK6Mkk3OK4Kj0k3jK9Ml2NK0j0pKnK4%l4lL5jl2J7%J1Rj9j9M6%n2J9%K2M
$$ -9 -18 8 12 10 -13 -7 17 19 9 -14 -15 14 18 -14 -9 11 1 -6 -4 -9 15 15 -19 -22 13 12 -20 -3 -3 8 17 -2 -21 25 25 -27 -8 -8 14 18
5150A8k3mK9nk9J9J6j9Kk1LL4Mk9jJ1lJ3j4j7L4kl3LJ1J5pk7ML8Lk7jLRLj2j1
$$ 18 -5 -9 20 15 -14 5 21 2 4 -17 -14 20 24 -5 -6 5 2 15 1 -16 18 16 -17 -14 -3 12 5 -22 -18 20 23 -4 -5 -2 7 10 -2 -13
5188a3K1jj6nJ1K1om2J8L5k2qQNlJ4l8NM5j3m2J9K1j3Kmj4L5Jk0jJ5jqj6NK7J
$$ -13 8 7 -9 -14 -3 18 12 -30 -12 23 1 -7 1 6 3 17 -21 -16 29 16 -26 -7 14 1 3 -1 -15 20 21 1 0 15 14 6 -10 -5 22 23
5226B3j8Oj0J1oj5jM3k3k9J3K5j6Pj1j3L9nn1L0K2k1jqj7M0kl9QM2j7rnOJ6Jl5
$$ 23 5 11 1 12 6 -9 -10 33 10 -19 -6 19 3 10 -1 -14 25 20 -31 -1 21 0 -1 -9 -26 14 12 -27 -19 23 6 -3 -8 -2 14 15 -20
5263b0K1MJ0kl9J6K3%l3L1qoOrj6O6k3o0L1K6mmj1k4L7J7n2OL2j1moj7M0j6j8
$$ -20 1 5 15 13 -26 -10 13 13 -20 11 3 -3 3 -6 -22 44 21 -39 -8 18 14 10 -1 -25 12 29 -23 -17 15 4 0 -6 -23 17 1 -17
5299a7PK4p%k0QJ8Jk6J3J2rnj7K3J1Jm6L2J0j3KrPJ7ok7RK2mk1ojL0j1j4J6RJ0
$$ -17 -10 14 7 7 -13 -5 13 14 -12 1 13 4 -1 -18 5 16 17 -29 3 13 0 2 -7 0 17 11 -16 -7 15 11 -10 -16 -17 13 2 -12 4 13 23
5338B3k7j2J3L4k0k1J8MnqljL0j6j3JK9j6k1POOJ0l5%L7jm3K4RKj8kKK1Ok4j4
$$ 23 -4 -16 -3 31 11 -10 8 12 7 -1 -4 -5 25 9 -4 -3 26 10 -11 -4 2 8 18 -17 -17 20 19 -24 0 9 11 -7 -9 -7 14 20 -4 -18
5376a8K1J6l9J2NONj3j9K2J4j6j6J3J5mnkmK7j8j7J8K2k1j1RJ3j1Qj8MK5j0l7
$$ -18 3 19 -20 -8 -3 3 8 -5 -24 -2 12 -4 -20 -7 8 4 -1 -3 -7 20 2 -15 3 25 4 -7 2 15 4 12 -6 -2 23 13 -24
5411b4RM0j0op%K3J0m1lJ5krOLJ5Ml4NJ5nj6K1k8L1lk8j2L7J3k3OnNJ1l2lK9j2
$$ -24 -15 25 15 9 2 2 25 35 -6 -9 6 4 -5 1 4 19 23 -11 -6 9 4 -12 9 -19 12 9 -19 -31 6 19 -4 2 -3 2 13 -19 -22 7 -5
5450elkPJ2kk2MJ4lrlJ7O%l1J7K2j6Jj5J1K1ql6J6L3k0jPk1K1Ql8PM9k9k8K7r
$$ -5 -8 -10 -3 9 7 -15 -11 3 0 -9 -12 5 11 11 -20 -3 19 3 4 -11 0 21 13 -23 -7 26 6 5 12 -9 12 20 -18 -11 38 9 -19 8 -1
5489ajK7n3MN4l1j2J1L%J7m4J0M7k6j8LrL7pk1OM1l2k4K0rJ5J6m7K4K8n0K0J3
$$ -1 -2 25 -28 -24 30 -1 -13 -2 1 1 18 -26 -16 31 5 -13 -10 -19 18 11 -10 -4 37 5 -19 1 -8 7 23 -24 0 28 -22 -2 11
5524A1k9L5Jl3J2M0m0jJ1j6J8Jk7J8J9k3j5L9j7J0km0J4K7rj6Rj0K9j2k6J9L2
$$ 11 -18 17 18 -15 -3 37 -3 -4 7 -9 9 10 -17 1 20 -3 -18 21 4 14 12 -28 -14 13 4 -12 -3 -13 16 4 -22 -3 29
5557B9l2j7K7j2J1Rm8K8K7k3j3OJ9mj2q%K4j1j3MJ7J3k9rK3J5k3jkLK0j2j5J4
$$ 29 -3 -20 7 -5 6 15 -33 -5 22 -1 -14 -8 11 7 -5 -13 -13 11 0 -13 -9 8 21 -8 -17 6 21 -2 -3 -5 -2 18 6 -9 5
5592EJ3k1oRO%J7l8K3K4l3j3L0qNKk2J8K0l4oJ0JLpkNJ8j8j7LRJ4kk7J4J4j2q
$$ 5 18 -3 -9 0 6 6 23 -15 8 32 -1 -14 16 8 13 15 -7 11 31 -3 -9 1 2 5 -2 -4 1 19 1 -16 -13 -4 10 8 -19 -5 9 -3 -11
5631a1NOMNl4K0J9k2oPK3j9Qk8L0LrmlJ9kk2kJ8J2k1oRJ9nqokK7k5LmJ3Nj3k7
$$ -11 -6 0 4 9 -25 -5 14 -8 -14 -7 16 -3 5 -23 7 10 1 -3 -6 13 11 -11 -13 5 17 -4 -10 -1 18 13 5 -1 -3 24 -1 2 -2 11 16 3 -24
5672b4L7Mqj6QJ3nqlNJ1oj9J1J1jk2kQJ4j5rK7J0j1k2J0J2nomkK2kl1J3K1Ok4
$$ -24 13 17 9 -7 1 14 9 1 -2 3 14 8 -11 0 11 10 -12 -14 -6 8 -7 -16 11 21 10 -12 -2 10 5 -1 -5 -7 15 13 -18 -5 16 22 -2
5711bj0QK3mj8lJ7Qj3j5JK1nj1NJ4Nk0MKjK3m1QJ1J4j1j9J1J3Mj8j1J6J6k1j6
$$ -2 -12 -4 19 15 -3 -6 11 19 6 -9 -8 13 8 -3 2 16 21 1 5 7 6 29 -12 -4 7 21 10 -9 2 15 19 1 -10 6 22 1 -15
5748a5J4J8j4j0KJ4j0nrRK3nl1J2J8pm%kK0ll5K5J5k3mLpL1j0k0PK4oj7KK2qj
$$ -15 -1 17 3 -7 -5 9 -1 -6 -15 -6 17 12 -19 -7 11 4 0 0 -2 18 15 -20 5 20 -3 -7 -4 -11 20 10 -10 -3 21 15 -2 0 22 14 13
5787A3k5QJ8Rj4j8RkJ2j7LJ6lj4lJ9mlk6K8J4qj9mJ1Ppj1J1J4q%j4oK9qk4J0K5
$$ 13 -12 -4 14 23 9 -9 0 -2 10 -7 -4 12 9 -5 -8 11 7 4 -22 6 20 12 -7 -11 0 7 0 -11 0 14 6 6 -8 -14 15 7 -17 -7 18
5826A8k5OJ0j1ROl0K2K8k3nLlkJ1l2K8J7rj9OPQpj7LJ9j2j8J0mL7j1l0K7Pk2j0
$$ 18 -7 -1 9 -2 7 13 -17 5 33 10 5 8 5 3 14 -18 10 27 18 -1 5 12 20 13 -4 -1 18 6 -12 -2 -6 31 20 -10 17 24 2 -8
5864hLoJ1Mk1J2K2j9lLJ4Kj0k8L0Mj7J4j1MJ8j5j9K8KqmorL7k6j1K9%j9MJ5j4
$$ -8 -5 -11 0 4 -17 -5 17 -2 -5 -2 12 14 4 -24 6 10 -7 7 -4 0 18 3 -16 12 14 6 2 -4 -13 24 -2 -13 16 16 -3 1 16 2
5902BK3j1k8K5Kmj2ONRj7k3L5Oj8MnJ7Qj7k6K6J7j8koQPj2j7L4Jj7j0QlJ9rl4
$$ 2 25 14 -14 11 13 9 -3 3 8 17 0 -23 12 18 0 4 -1 16 24 7 -19 7 24 6 4 -2 6 13 1 -16 18 19 2 -8 0 -3 16 7 -27
5941b7K9J8l1KRjJ0Nk1QK4j9j0rK7Jj9j2K9%k0QoJ5Ok2rL2nj2nK3j3lLj7J8Pj4
$$ -27 2 20 -11 -9 0 -1 9 14 -7 1 25 6 -4 -13 14 15 -4 -16 13 13 -7 1 -5 10 16 -6 -15 17 12 0 -5 18 5 2 5 -12 6 13 -1
5980aj3J1J6pLk1K3Ql7PK3Mj0rmQQroPNjj4MK9j0j3OKKKj6j3L8pj9LJ5k1Ojj5
$$ -1 -14 -3 13 6 9 -12 11 19 -18 -11 12 16 6 -3 -7 1 9 0 -6 1 6 5 -9 -5 24 14 1 7 9 11 13 -3 -16 22 15 -4 -1 14 -7 -1 -2 -17
6022a7L3pj6jJ3J3pjqPOqqJ9kMj0j3J6J0k3qJ1OlrQjJ3k1pJ9Klj8J1jKnK%J4j0
$$ -17 16 9 -7 -8 5 18 11 10 2 9 15 7 -1 18 16 20 10 -3 13 23 0 -8 3 9 6 -3 5 4 17 -4 -11 8 10 7 -11 0 -1 1 -4 -2 -2 12 2
6065Bj1MJ5rj2lJ0J3jj1j1J6J4j6kJ8Jk1MJOJ8k7lK0Rl0RMMjMl5L5J1k5k1K6O
$$ 2 -9 -5 10 1 -11 -14 -4 9 8 -3 -14 2 16 0 -2 16 17 -4 0 1 7 25 -2 -5 15 24 -6 3 7 11 10 14 -21 14 25 0 -21 5 11
6104A1L%j5pK5pj7J3KJ1j3j3J6J1j3r%O%nkK0ork4L0qJ1j4k1L4J3k5j8K8Pj3P
$$ 11 14 14 -1 -8 17 10 -7 6 8 19 6 -7 9 20 7 -2 -2 4 4 -1 -3 17 11 2 -22 8 0 11 -3 -24 10 23 -2 -20 8 15 2 9
6142Ij2J2J1k2lJ2JOrj4J4K5m0PJ2Omj2j1K4J3j4j6J8Kk6J4j4J3J7j6j5J4J6j6
$$ 9 -3 9 20 -2 -5 7 8 14 5 -9 5 30 -10 -3 9 15 11 -1 -12 12 25 11 -5 13 15 -11 3 -11 2 19 3 -12 2 18 2
6177Boj0QMPj9J8MnpQmNmk6J9J0j0NjLK2l0pL5j5J1k7NJ2J1k0KJ8qj2MoJ8J0k6
$$ 2 -4 -14 -6 -2 5 -14 4 8 3 -4 4 0 5 1 -25 -6 4 -6 -1 -2 1 23 -7 -14 21 6 17 -10 -5 7 18 -2 0 18 10 -2 2 -4 14 24 -2
6218blJ0Kj1QjMJ6k5j5L9k4rJ9oJ0krk4K8JppmJ7Jpj1R%Qj9jJ2J5k9J2OmOj6Q
$$ -2 -5 5 7 -4 4 3 7 23 -2 -17 22 -2 -11 8 2 12 10 1 -23 5 6 -1 -8 -12 5 6 -1 -12 -3 -3 5 -14 -15 -3 12 -17 -5 1 -3 3 -13 -5
6260eJ5Jl1kM1j0k3J9j0RRk2%K3kk0PPNlqk1K6K2j8j2JJ1j1JrJ4Lj5j3K6kJ6j8
$$ -5 10 11 -20 -22 19 9 -14 5 -5 4 13 -9 -9 14 12 -8 -1 6 11 8 0 -21 5 27 9 -3 -2 9 -2 -1 -10 4 7 -8 -21 5 3 19 1
6299Aj1J8j5MkPJ3Lk1kJ6Lj8kRRj2MoJ6%j9kJ0J2nj6LOJ4j4qJ2J4j5jlPOoj6J9
$$ 1 -10 8 -7 -3 -5 2 15 18 -3 -5 11 14 -4 -6 3 12 0 4 -2 14 14 -5 -7 3 15 10 -6 -3 3 17 3 -5 7 21 6 5 2 9 15 9 -7 12
6341A2J4oj8lMJ2j2kJ0Lj0kj4J2Pj5j5K6RprLNKk0nK4%Oj8KJ1Mk1OJ5j2kkk4L7
$$ 12 26 20 2 -1 3 15 3 1 11 14 4 2 -12 0 7 -8 -23 3 12 5 -4 -1 4 6 -14 -19 5 5 11 -7 -5 6 10 -11 -5 10 -2 -4 -6 -30 7
6382GJ5k1j2K5qj6mkJ1K1j6j0J5oRj4K0Rj0pj3J2K4j5j7J4J1j5j4J0mJ9Jl7K4
$$ 7 22 1 -11 14 6 -10 -14 -16 -5 16 0 -10 5 -1 8 -6 14 23 13 6 -7 5 29 14 -3 11 22 7 -7 3 -1 18 19 -18 6
6417FJ3j8qjK6j1j0MlLJ2k5pL9j9j5J2NmJ5k1KJ3J3j6j3K0pj5J4j5RJ9j3jlMj4
$$ 6 19 1 -7 -8 18 7 -3 1 -2 1 13 -12 -19 20 1 -14 -2 3 -1 14 -7 -5 8 21 5 -8 12 5 -10 4 -11 -2 17 4 3 0 4 -10
6455a0lj0M3oOk0pJ6Jj1k0K2J6j3j1OJ4Pk4rJ9J6k9OJ0q%ooK1Ll3J0J6jMk0jJ3
$$ -10 -13 -23 20 14 20 0 -7 9 10 -1 -21 1 17 4 -7 -1 13 20 -4 -13 6 22 -7 -1 9 1 1 -5 -11 10 13 -20 -10 6 5 9 -11 -12 1
6494AOk6NJ9j2J6k0j7L4npj3K5JorrK3J6l2J3J1ljonK1kk2jJ1J1jk3kK6j2k2K0
$$ 1 7 -19 -14 5 -7 9 -11 -28 6 1 -6 -19 6 7 1 -8 -17 6 22 -10 3 14 11 10 4 -1 20 18 -4 -5 6 17 16 -7 -9 17 5 -17 3
6533CRrJ5j6pK6rk9J8OoMj3j2L0Jj9mJ8rQpj2K3j1j0J5%%J0l1LK5kj1KJQLj9J
$$ 3 12 3 18 2 -5 21 12 -17 1 7 1 5 -8 -20 10 11 -8 -12 6 -3 5 -2 -14 9 -2 -12 3 3 3 13 -18 -15 10 8 -3 -1 0 8 11 -8 -7
6574gK5nj1KOj7J7lj0J0Kk3%J6jplJ7Rol1J6K3rlrJ5rPk0J7R%j4j4J1K1j2k0J1
$$ -7 18 13 2 4 10 -7 10 7 -3 7 9 -14 -14 2 1 -6 -9 8 17 11 -20 -4 19 10 7 -2 13 4 11 -9 8 17 17 3 -11 0 21 9 -11 0
6614@%J1j1%KJ2j4j3J2P%Ol3RJ6jrOJ0JopoL8k8j4J4MqJ6k0JJ6Jk7K9%Kqn%J3
$$ 0 0 11 0 0 2 14 0 -13 -1 6 6 12 -21 -12 4 3 -6 0 10 11 5 -2 -8 30 2 -12 2 6 -2 14 -6 -5 11 12 -15 14 14 16 8 3 3 16
6656A6Ml1QJ5J2k9J6jOj5j5J9MqJk6L2klj1kJ5Lpk2K0J0j8nJ5oPk0KoL0j7LPl
$$ 16 20 -11 -3 12 24 -5 11 10 16 1 -14 5 9 1 2 -24 8 6 3 -8 -10 5 8 1 -21 -1 9 -9 -14 1 -5 2 -18 -16 -22 8 -9 -6 1 -2
6696bJ8k2mJ8Jrj7J6Rj1jN%J7j5njKJ8k5J9rJ3k9K0j1J3Ok7PK4pj2PJ0k3K3k8
$$ -2 16 -6 -10 8 9 0 -17 -1 8 -3 -4 1 1 18 3 -2 -3 -1 17 -8 11 2 15 -14 6 -5 8 14 -13 -6 18 11 -1 6 16 -7 16 -12
6734a2kL1k1j3J4KKNk7J3J1Jj0lJ2j2LoQP%ppLPjj7J4J1jjjj0J1J5l4J0J5mrK
$$ -12 -14 17 -4 -17 -3 -1 1 6 -21 -8 3 4 -6 -9 3 -9 -6 -12 -4 3 3 -4 -11 -8 -1 -2 -19 -5 6 5 4 3 -7 4 19 -15 -5 10 6 -3 -1
6775aoJ8Qj5j1K0lonRMplJ%Kkj1mJ8pnPMlqlOJ2Mj7lJ2j3NJk1K9kj9PK7k2%Kl
$$ -1 -7 11 19 4 -7 13 10 4 -1 8 12 5 2 3 3 5 3 -8 -12 6 -1 -6 1 5 2 -6 -9 -3 9 13 -4 -7 5 -8 -3 -2 -23 6 4 -15 -8 19 -3 -3 -1 -4
6821dRQj9KJ5pjKjNj4J1nK4nj9L%K0j2j3j2L7k0%qJK0qj2%K2pj4MjRlrPQj6pJ0
$$ -4 5 13 -6 -4 11 4 3 5 4 9 -5 6 1 25 20 1 4 4 24 12 -1 -13 24 4 4 -4 -3 17 9 -3 -3 19 12 -2 2 1 10 7 -2 5 13 -3 -10 0
6865@j1J8jj8KOPj1OjJPk4K4OPk2kK0Lj9m%J4Nk8MK2olj4J9Kj0NmJ3jj6MJ2Jj5
$$ 0 -11 7 6 -12 -10 -4 3 -8 -2 -3 -2 5 -19 5 11 18 -4 -6 14 17 -2 -6 -6 8 13 -15 -11 11 5 2 -12 7 9 -1 4 0 13 12 -4 0 12 13 -2
6908b%lnK4qj8J0PJ1j6nJ5j0J1k2J1Mkj9jL6k7J3poNOj5OK2j4rlK0nJ0j3qNNj9
$$ -2 -2 -5 -10 14 6 -12 -2 5 16 0 -5 10 0 11 -11 0 4 2 -17 -18 18 -9 4 -3 -9 -4 2 -13 -7 15 1 -8 -11 9 4 14 1 -7 -2 3 -16
6949a6ORK7k3pPjJ4j3nLK0pj4mJ5%j2j1J7Olk1J1K1j2rnPJ0j8M%J4%k8RQRopo
$$ -16 -10 -1 26 3 -4 3 2 16 3 -2 1 21 14 0 -4 11 11 -1 -12 5 11 8 -13 -2 19 7 -2 -7 0 10 -8 -4 -4 10 10 -18 -9 -1 8 2 -5 -11
6991a1PkNkKPj2j8K1J4mj1kJ0Opj5J5KmJjJ7lnqj0K1rNj0K2j5pmJ4KRj5pQJ5j5
$$ -11 -4 -6 -1 -3 -1 6 -6 -24 -3 11 7 -4 -6 4 10 3 -12 3 5 1 2 1 18 15 10 2 -8 13 4 9 -1 21 6 -1 -5 9 11 20 5 -2 6 21 6
7034Fj0PJ7j8MrJ0Qqj5PJ8k0NpNQmrj2J4Rk6J0L1j7j3J0rOJ0k6J7oK0k2MjNNk1
$$ 6 -4 3 20 2 6 -3 7 15 7 -8 -1 17 -3 2 -5 0 8 4 -5 -17 -3 6 -20 -10 21 4 -9 1 -8 -2 8 -18 -1 -7 13 -9 -5 -6 -1 4 -17
7075a7QJ2J8k5J3mMoJRjkj9J0J6kpj9J3J5j4MmJOjj6LJ4oj3j4J6LKpNLpkJ3oK0
$$ -17 -9 3 21 -4 9 5 9 3 4 13 12 10 -9 1 17 15 8 -11 2 17 3 7 3 4 10 9 -7 -4 10 4 -9 -23 -7 -4 -2 -9 -4 -1 -8 -10 3 -3 17
7118A7j5l3K4K0k9QPj0J1J2m2K5J5j5oPQJLj0PLQj8NPjqj4J5Qj1Rj3KJ6j2k4L1
$$ 17 2 -31 -7 13 -16 -8 -1 -11 0 12 -30 -5 10 -5 -11 -4 4 5 8 -2 5 8 16 -2 3 10 9 1 -13 2 10 -1 8 -5 -3 13 1 -23 8
7157HOj3%qLOj5j0J5RMj6M%LMkj8K5j6kRMPoj8K0K%j1mlK4j4j4L3oj0mNnMJ1k2
$$ 8 14 1 1 -7 -4 2 -13 -23 -8 1 5 -11 -7 -7 -4 0 -2 -20 5 -11 -13 -4 0 7 1 -17 3 5 5 -6 -10 -13 11 -3 -17 16 10 0 -4 1 -4 0 11 -11
7201a1J2J6oj5K0rJJj1RK4j6k0J2KJrJ1Jpq%MkK5l7MJ0Rj2mLJ0J1j5j9J6Kj5l
$$ -11 1 17 11 -4 16 7 8 9 -2 7 31 15 -5 7 9 10 1 12 13 6 -2 -2 2 0 25 -12 -8 2 11 -1 -5 -2 8 19 4 -15 1 3 -12 -15
7241a5J6nOj3jOJ1poNNJ1j7oJ6Mqj4J1mJ9j2nJ7Mj3j3J7mJ0qj6K2J2j2j1OKkn
$$ -15 1 -4 2 -11 -12 -6 5 -2 -8 -3 2 13 -4 -10 6 10 2 -12 -1 -5 14 2 -3 14 18 5 -8 9 5 15 7 -9 13 25 13 2 8 10 8 3
7281COpJ7rj1kK5j1j9KJ4j7OQK%J0k4nJ8Lk0jRMQj3qJ3J0j6qJ1L0l0nJ2j7K0m
$$ 3 9 2 19 10 -1 -3 22 11 -8 -6 8 -9 -3 5 7 7 17 -7 -12 6 9 -11 -12 -3 1 9 -4 -12 1 11 -5 -13 -2 28 -2 -7 5 -12 8 4
7321DrQJ4j4qLPQmj6J8oJ4mk4K6Pk7mJ9l%nNj2K0j6j2J0J2j4j3K2j1J1Kj8OK3
$$ 4 -5 3 17 3 -5 -2 5 13 9 -7 11 5 19 15 -9 17 24 -3 -7 12 9 9 4 9 -3 17 1 -11 -1 11 -3 -16 6 -5 6 8 -10 -4 19
7360A9k6nQJ1oj0kJ8JoJqK0%k0nPOKJkj3K9j4pjJ6j5J0JjKpj0J3K0k3lNJ3k4m
$$ 19 -7 -12 -4 7 1 -9 -11 7 8 2 3 -5 15 15 -5 -10 -3 3 5 6 4 -9 20 6 -1 -2 14 -1 9 10 9 11 4 -6 7 27 4 1 6 19 -5 -9
7402iMJ5Kj6NpJ3joj3L0Nl8J1Qj0J3j1oJ2J3j8j2J0LRoqRPj3pJJ9Kj0LJ5mk5J6
$$ -9 -5 10 12 -4 1 -6 7 6 0 -13 17 22 -16 -5 3 -7 6 -5 -11 1 14 -4 -16 -6 -3 6 0 -8 1 8 -5 -12 -11 8 10 0 3 18 14 -11 5
7443EojJ1mmJ2rmJ0llRlj6J1J1j7MRJ0k1lrJ1RJj6RRj2J1j0J0qNlpkJ6j0k1K1
$$ 5 -1 -2 9 5 1 13 4 0 10 7 4 13 10 -6 5 16 -1 3 12 22 1 -2 -11 0 9 10 -6 3 12 0 11 1 11 3 8 5 -2 -4 12 2 -19 2
7485BJk1K1Kj1qOjOKj2pJ9J5k4mJ0J0lJ2k1RQj5j1J3J2mj3J9j7K5qJj8J4Mj8J5
$$ 2 3 -18 3 5 -6 -14 -8 -9 -3 -1 -13 -20 -1 14 -10 -14 -4 6 3 15 -6 3 11 -4 -15 -2 10 6 -7 12 -5 20 12 13 -5 9 13 -5 10
7524A0j8J5Qk1mL0nj5j6L5prjrJ0J6k0j8J8Qlk0J4Kj8K1j9NQj0kJ6kMj1JNMj5
$$ 10 -8 7 15 -6 -10 20 15 0 -16 19 12 3 2 -7 3 19 -1 -19 -1 7 4 -16 -2 0 -18 3 -16 -11 -3 -13 -15 1 -1 3 -8 -7 -2 2 -13
7563a3lnK9oj4J4MJ2j4kkNLLqpK1qk0J5jmQNj1K4j9kJMlj1kKK0pj8KJ0JopK6j1
$$ -13 -16 -21 8 2 -12 2 6 18 4 2 0 5 8 11 3 -4 17 9 -11 4 3 -1 7 12 1 25 6 4 5 9 6 -5 -7 -5 15 8 -10 -8 2 3 -3 -10 16 5
7607Ek1LK6k0KqPJ0Qj0j9K6j3jRrQkQrnJ7jj2J8j2Pj1J%MJ2j2j1J8Nk1mK2Jj7
$$ 5 -16 -13 13 -7 -5 -13 -6 4 12 2 -17 9 -4 -5 4 -5 3 1 9 0 -5 12 11 -1 17 5 12 1 2 2 6 18 6 -5 13 18 -3 -7 15 16 -1
7648akOOJ1k0j8K7MrMmj0K3j2k0J4J3j0pJJ9oj0j0J9Mj1lnJ2Rk0mJ8%j9J7jqO
$$ -1 -3 3 9 20 0 -18 9 13 4 8 4 -6 17 5 -15 -1 12 2 -5 -4 15 9 -1 -11 8 12 1 -2 -7 5 14 -6 -10 8 8 -11 6 5 -3 3
7688CrOJ3jj0J2%LKk1j0J5J9k3QMNmpKpJ1j8PkK1rLj0Pj1rJ8mj3J7k1J3J5lj9
$$ 3 -6 0 13 12 2 14 14 17 19 -2 -12 3 22 -1 7 11 16 12 5 7 0 11 -7 0 -2 19 10 13 3 10 -1 -10 8 4 -9 8 -13 0 15 12 -7
7729gMOj4KMj5K9%j2nQNJ0j3j2QOj4J0Lkjj1OLJ5j6NOrQJk2J4Jj4J4Pj2J3j0J1
$$ -7 -3 3 -11 -9 -5 -20 9 9 -3 -8 0 5 15 2 -10 -2 4 -10 0 3 1 0 -11 -5 -2 13 -3 2 8 -1 7 8 -14 0 1 -13 1 8 -4 9 -1 10
7771A0j8K1kj6RLPk2J5moPNk2J6Qk8J5J4j3PrPj0K1k1NNkl3J9J8kjq%KJ4rpJ8
$$ 10 -8 13 11 -5 4 7 14 -8 7 3 -3 4 9 -13 3 11 -17 -2 12 -1 6 -3 4 -6 15 -6 -1 4 2 -31 -12 6 4 3 -5 -5 -3 11 2 -5 13
7812A3j5K0j0oJ4j1j5K4rJ1j0oMJ9j4pJ9Kk0J4Nk0J4Jj5PLlRj3KPqj0J0MRj0j4
$$ 13 -2 18 8 2 16 5 -10 14 5 16 6 0 4 23 9 2 21 23 3 17 22 2 16 17 2 9 12 9 18 5 7 14 6 -4 6 10 19 9 -5
7851e%J2rj4OK1mNj9rK2Qk4J7kpNjj1K3j5kPNqNLJmNp%J4j0Jp%MmnJ4MlOj5LJ7
$$ -5 -5 7 -2 -16 -10 11 7 12 -7 -16 6 14 -10 7 5 -2 3 2 -9 14 -1 -3 4 9 1 6 9 10 6 11 4 4 18 8 9 2 2 6 2 -3 11 15 12 18 3 6 23
7898B3k8RLOKloj0J1nj0J4mJJ1k0RoKmQRmpqK1k1J3j1JJ7Mj6kjJ5n%k9L7knrJ5
$$ 23 -5 4 7 13 15 12 6 -4 7 2 -8 6 2 3 14 -6 3 -3 -1 -5 3 12 8 1 -7 14 -7 6 -5 -4 13 17 1 -1 -2 13 8 8 -21 16 14 9 0 15
7942A5pklQ%qQj1J7kJ4j3pMkk%J1kl3J1OJ2Lj7QMj2Pj4jJ4Nmj5J4Lj1%kPOk4N
$$ 15 8 6 3 11 11 3 11 0 17 15 29 16 9 13 11 9 9 20 18 -15 -4 2 14 17 0 8 12 0 7 -7 -8 6 11 7 -8 6 9 -2 -2 -4 3 9 -15 -10
7986a0OJ5j6mKJ5lj9J6RkppJ2kQnlOkJJjNMk6J3K3j2j2oJ8kLj5oJ3KjpnJ2jrj
$$ -10 -4 11 -5 -9 -7 8 5 -14 2 11 9 2 -5 7 5 13 8 5 11 9 10 11 10 15 19 -7 6 29 17 5 -1 17 15 18 3 -3 10 12 11 4 -1 11 10 1 0
8031@J1j1Om%Mmj8J8QJj0Rj4PQrlOKj0LJLlnmJ4J1j3j0PRKQlnMnkjJ5j8lJ1J6
$$ 0 11 0 6 2 2 6 2 -16 2 10 11 1 10 -4 3 11 2 -1 5 7 -3 0 1 4 1 -4 -8 6 17 4 -6 1 10 12 20 17 12 16 11 9 8 23 5 2 13 29
8077B9k2KOj1J0%k6K2J1jrokNqj3J2J0%j1ML%%k2J9J6j3j0oJ4Opj3J0NmMpjRQ
$$ 29 7 9 15 4 14 14 -12 10 21 20 11 5 3 8 0 -13 -1 9 9 -2 2 5 5 5 -17 2 18 5 -5 -11 3 9 2 -11 -1 4 0 4 -3 -4 5 13
8119A3j7jQkLJqK0j0nJ1NrJkjJ%lkJ6j5j2RJ1%nj4J8Qk0MkKkLj3RJ7j6oLPjj3
$$ 13 -4 -5 3 1 4 5 -3 17 7 2 13 18 9 10 8 7 8 8 5 3 19 4 -8 1 12 12 7 -7 11 19 -1 3 1 3 1 4 -9 0 17 1 -5 -2 5 4 -9
8164iO%j3K4j6oJ6Mmj0J2KmljRQj9j6K1J0j8%J8Kj2J6
$$ -9 -3 -3 -16 8 -8 -14 2 6 2 -8 4 6 2 -1 -2 7 15 -4 -20 1 11 -7 -7 11 13 1 17
8191A7
$$ Imaginary data points
##PAGE= N=2
##DATA TABLE= (X++(I..I)), XYDATA
0@%%%%%%%%%%%%%JrJ6j6J6j6J7k5L2l2M0m8N4o2P2q0Q8j04J15j24J38j56J77j98
$$ 0 0 0 0 0 0 0 0 0 0 0 0 0 0 1 -8 8 -8 8 -8 9 -16 16 -16 24 -24 30 -32 40 -40 48 -56 59 -65 73 -83 94 -104
37a04K18k43K71k99L31l67M07m51M99n54O17o86P66q62R74j111J281j496J781
$$ -104 114 -129 142 -157 174 -193 214 -237 262 -292 325 -361 405 -457 517 -594 687 -809 972
56I72k176K771l776N876j6862K1622J3073m7694L4020J0678m1340J9857K3282
$$ 972 -1204 1567 -2209 3667 -13195 8427 21500 -26194 7826 18504 -22836 -2979 20303
69B0303l3686J1607J6594k5477M348J6222j4677N969N419j4208O587N498j0376
$$ 20303 -13383 -1776 14818 -10659 -6311 9911 -4766 1203 6622 -7586 -999 4499 -5877
82e877R950J401j2940Q040K995r888Q996L036r558K860J119k214N109l155m56
$$ -5877 4073 5474 -7466 574 3569 -6319 2677 5713 -3845 -985 134 -2080 3029 -126 -582
97e82M224q714K424J0158j1432J048J2731j5165k894J8027j0633n840J5667j0131
$$ -582 3642 -5072 -2648 7510 -3922 -2874 9857 -5308 -8202 9825 -808 -6648 9019 -1112
111a112p415J4975o275n186J2070p970m440J0425q629O53J3003j4132k655J6180
$$ -1112 -8527 6448 173 -5013 7057 -913 -5353 5072 -3557 -2904 10099 -4033 -6688 9492
125I492j3794l565K0667j3323j0411K0539q961j2981K1275k259j7180J3047K182
$$ 9492 -4302 -7867 12800 -523 -10934 9605 644 -12337 8938 6679 -10501 2546 4728
138D728j2846R930M830j0546K739L122m499K446J608n11O15m818R89N708m563
$$ 4728 -8118 1812 6642 -3904 -1165 1957 -2542 -96 1512 1001 1616 -3202 -2213 3495 -1068
153a068L68N352p596j256Q622m915k235P666n294m359O892k006j689N594m702
$$ -1068 -700 4652 -2944 -4200 4422 -493 -2728 4938 -356 -4715 2177 171 -1518 4076 -626
168f26l020N796k789r71N737m644k576N710l801j696P103l109m308M344j455j609
$$ -626 -3646 2150 -639 -1610 4127 -517 -3093 2617 -1184 -2880 4223 1114 -3194 1150 -305 -1914
184a914M363j714j917K023k245O81K700l223J868K240o717K087O195o226K45O293
$$ -1914 2449 735 -1182 841 -1404 -723 1977 -1246 622 2862 -3855 -1768 4427 -1799 -1554 4739
200D739p225j505Q540m763l358P900l480n764O268N57l913L561j05l933J730J767
$$ 4739 -2486 -3991 4549 -214 -3572 4328 848 -4916 1352 1909 -2004 1557 1452 -2481 -751 1016
216A016p00o9k56N01r69j656L185J102l467J568O16l763L175K820m603R08K571
$$ 1016 316 247 -9 492 -477 -2133 1052 2154 -1313 255 871 -2892 283 3103 -1500 -592 1979
233A979m092R30L569k717J25J710l402N21L232j615k70Q05k094P33J455j315J017
$$ 1979 -2113 -1183 2386 -331 -206 1504 -1898 -1377 1855 240 -30 775 -1319 -586 869 -446 571
250E71N26k204N94N19o21K150n75k718J776L53j660K573o2k900K107K39k906K843
$$ 571 1097 -1107 -513 6 -615 1535 960 -1758 18 371 -1289 1284 1222 -1678 429 668 -2238 605
268F05J719l426N32J284k136J369J957k293m38J415r85l89J268M06o44r10J40
$$ 605 2324 -1102 -570 714 -1422 -53 1904 -389 -827 588 -397 -786 482 888 244 -666 -526
285e26N56k56R50L82k266L18J976j748r4K552j794j548K137q62p82K766r59k626
$$ -526 30 -226 724 1106 -1160 -842 1134 -614 -708 1844 50 -1498 639 -223 -1005 1761 802 -1824
303a824J839O55j528J329N68j658K88M77q08P29J005p90r57L4O58M04k28O2k18
$$ -1824 15 670 -858 471 1039 -619 -331 146 -662 67 1072 282 -675 -641 17 421 193 255 37
322C7o69M67M28n15P05M22j683j89J475j88k03N10r98m05J156j86m52Q42j66r89
$$ 37 -632 -165 263 -252 453 875 -808 -997 478 290 87 597 -401 -806 350 164 -288 554 388 -601
342f01J48M43K81L37m88o73K01M07K27Pl52P2Q7o17K01R65k14o21O4k66R8R41
$$ -601 -453 -10 271 608 120 -553 -352 55 282 289 -63 9 96 -521 -320 645 431 -190 -126 -392 -294 647
364F47k34r02M53L12p16K22P73l55l32J38m49M6J085j18j114K57O11n60jP26l61
$$ 647 413 -489 -36 276 -440 -218 555 200 -132 6 -443 -397 688 570 -544 -287 324 -236 -237 489 128
385A28m07M38l78m03J190K30j419J73Q77o49O4Q17q43l30J046o53p44J506J53
$$ 128 -279 159 -219 -622 568 798 -621 -448 429 -220 -156 661 -182 -512 534 -119 -863 643 796
404G96j536M65O65p91N11O17j222RJ199q27n90J262m0j039M34K40n33O32M12j136
$$ 796 -740 -275 390 -401 110 727 -495 -486 713 -114 -704 558 518 -521 -87 153 -380 252 664 -472
424d72n7J111m61o78Q58Q6p62M01J19o46P36M92j235J3J029n13l32O61l97k28
$$ -472 -529 582 121 -557 301 387 -375 26 145 -501 235 727 -508 -495 534 21 -311 350 -47 -275
444b75O27m89l75R41j9p59J94J63m4L20k78l25M41M8l73J19J73L8J2l93n4N40
$$ -275 352 -137 -512 429 410 -349 -155 8 -36 284 6 -319 122 170 -203 -84 89 127 139 -254 -308 232
466B32N1l75p5J18J34j6j46K6J16P2q0l91K03O48m50n44O12K1m03N51k30n99R43
$$ 232 283 -92 -167 -49 85 69 -77 -51 65 137 57 -334 -131 517 67 -477 135 156 -247 304 74 -525 418
489D18jj207P87P36j056J11N87p83L00Q02r86k55J108l88p00O31J50m02K00k4
$$ 418 417 -790 -3 733 -323 -212 375 -408 -108 694 -292 -547 561 173 -527 104 254 -148 52 28
509B8l64L81M29n46m35O53K19o52J50M33m50O1M37o94M1J032o85p92J041J00p96
$$ 28 -336 45 474 -72 -507 146 365 -287 -137 296 -154 -93 344 -350 -309 723 38 -754 287 387 -409
530d09O09K8q05P77L67j183L93J008r16m05Q60k49l07N93l49n69Q21K51r20J43
$$ -409 200 228 -577 200 567 -616 -223 785 -131 -536 324 75 -232 361 12 -557 264 515 -405 -262
550b62P10m50l10N04j86k01N64k84o59P34L98q64L0N59l33j1K63m45R5N71m66
$$ -262 448 -2 -312 192 6 -195 369 85 -574 160 558 -306 -276 283 -50 -61 202 -243 -148 423 -43
571d3l59N59O3k94M4j13R0L07k46k60K48J40m7j50j73L29J75m38k6K90l4L0j13
$$ -43 -402 157 220 -74 -30 -143 -53 254 8 -252 -4 136 89 -61 -234 95 270 -168 -194 96 62 92 -21
594b1k44L78J79m52PJ95J9J56l34j93N97j56m21M87k28k11P50o30n64J342k91
$$ -21 -265 113 292 -160 -153 42 61 217 -117 -310 287 131 -290 197 -31 -242 508 -122 -686 656 365
615C65j191J128Qr72J241k26j428J517L13j746J086O55j487Q65M39j445J041P28
$$ 365 -826 302 310 -662 579 353 -1075 442 755 -991 95 750 -737 128 567 -878 163 891
633H91j625M69Q19r02M67J94q99P75J90r19O74P5n14P55o55n14J549o50j013J446
$$ 891 -734 -265 554 -348 119 313 -586 189 379 -540 134 209 -305 450 -205 -719 830 180 -833 613
653F13o19p76J802j032j168K277q00j626K179m50j489K070p89j637K525m43k065
$$ 613 -6 -782 1020 -12 -1180 1097 297 -1329 850 400 -1089 981 192 -1445 1080 637 -1428
670a428K140k06j690K061n14j770K361l31k047K108r3j724J929m38j715K250k43
$$ -1428 712 506 -1184 877 363 -1407 954 623 -1424 684 591 -1133 796 358 -1357 893 650
687F50k004J875K8j511J668l97j484J919k68j552J563j36j090J327o37p67J738
$$ 650 -1354 521 549 -962 706 309 -1175 744 476 -1076 487 351 -739 588 -49 -816 922
704I22q37r60J531q18l83J629j556m59K256j602q18K406j489q89K457j754j029
$$ 922 85 -875 656 -162 -545 1084 -472 -931 1325 -277 -1095 1311 -178 -1067 1390 -364 -1393
721a393L073j507j831K824q98j608K595r90j802K642o06j989K302j76j752J767
$$ -1393 1680 173 -1658 1166 268 -1340 1255 265 -1537 1105 499 -1490 812 636 -1116 651
737F51m04j397K022l23j714J590%j194J335l78j043J492l65j138J316j99p31R77
$$ 651 247 -1150 872 549 -1165 425 425 -769 566 188 -855 637 272 -866 450 251 -480 497
755D97p29l37J436r69o42J432q37l82J450j314m39J995j270r17J964r05q78J729
$$ 497 -232 -569 867 -102 -744 688 -149 -531 919 -395 -834 1161 -109 -1026 938 33 -845 884
773H84j032p76K004r93j200J828n29q72J477r30p71J856q58j040J770o45j035
$$ 884 -148 -924 1080 87 -1113 715 186 -686 791 -139 -910 946 88 -952 818 173 -862
790h62J566o96q64J783o35j398J525j2r39R43l19o90J022k71o26Q25k32l64M86
$$ -862 704 8 -856 927 292 -1106 419 407 -532 411 92 -598 424 153 -473 352 120 -244 242
809B42n71J52R02r23k86R16o23pP90r47l9J052q95k73J050n56j96N47p46K03R08
$$ 242 -329 -177 725 -198 -484 432 -191 -198 592 -355 -394 658 -237 -510 540 -16 -212 335 -411 -208 700
830G00r09j94Q22n94J9N97p78J30P92q20j75P79l61q0K76n07K42M53n46LL12k31
$$ 700 -209 -403 419 -175 -156 441 -337 -207 585 -235 -410 369 8 -72 204 -303 -61 392 -154 -151 161 -70
852g0K22r5m67N91J96o79K54K46l85L24%m73M86J34n23J44J35pK33m01j87N91
$$ -70 152 57 -410 181 377 -302 -48 198 -187 137 137 -336 150 284 -239 -95 40 33 266 -135 -322 269
874B69j76k86L63k58n0M74n30j60P98l09m59L97j72O0M14n54j04N85l87q3M20
$$ 269 93 -193 170 -88 -138 336 -194 -354 444 135 -324 73 -99 -39 375 -179 -283 302 -85 -168 252
895B52m37J73M46q49P9R32o27k91O10m99K4P04o89k26Q41l89m39N49j35o4L21
$$ 252 -185 -12 434 -415 -336 596 -31 -322 288 -211 -187 517 -172 -398 443 54 -385 164 29 -35 286
916B86m92n8N55k17j75J52j95K26J35n17K50L76m33O4R2l04N02P6q14M45M69p13
$$ 286 -206 -264 291 74 -101 51 -144 82 217 -300 -50 326 -107 -43 49 -255 247 323 -491 -46 423 -290
938b90K47L34o44M47L64j008L58Q22q37o3O06n66P5O23p35r9Q34m31l93M69p4
$$ -290 -43 291 -353 94 458 -550 -192 630 -207 -270 336 -230 -155 468 -267 -366 468 37 -356 113 39
959C9o9K04l59J0M02k01j25J12r9K04J1m42L00L42m32pJ84k33K97J24o03K30M53
$$ 39 -30 174 -185 -175 227 26 -99 13 -86 118 129 -313 -13 329 -103 -110 74 -159 138 262 -341 -111 342
982C42m20p5K85k29J69J20n05K39M41m32q2K22j80J79J18m87K30L75m18m3K52
$$ 342 -78 -153 132 -97 72 192 -313 -74 367 -65 -147 75 -105 74 192 -295 -65 310 -108 -151 101
1003A01j88J69J20n32K04M75m18j47L26j61M0J81l81N2M86l03k93K83P2q3M8j45
$$ 101 -87 82 202 -330 -126 349 -69 -216 110 -51 -11 170 -211 -159 327 24 -269 14 86 3 51 -94
1025i4j5K43m1j88j3J90J15k86j38L45L4k16Q0m7q5L56j22m68M27K63n21K6L46
$$ -94 -109 134 93 -95 -108 82 197 -89 -227 118 152 -64 16 -31 -116 240 118 -350 77 340 -181 -155 191
1048A91k45O8K00m49L8N58k71l97L81P7k44Q0mp6K23J2l43K7L67l4k99K4K16q9
$$ 191 -54 14 214 -235 -197 361 90 -307 74 151 -93 -13 -17 -93 130 142 -201 -174 193 159 -140 -116 100 11
1072A1n3Q3j38Q4K29k97k43M52J25l90O6J05j29J69N7l53J85L26l58j98L55P7
$$ 11 -42 41 -97 -13 216 -81 -324 128 253 -137 -71 34 -95 74 131 -222 -37 289 -69 -267 88 165
1094A65j66l8p8L2K16Lk58K2K34n4k39Q8K39o8j70J7k9R8K31k46k62L10J67l37
$$ 165 -1 -39 -117 -85 131 134 -124 -102 132 78 -161 -73 166 98 -72 -55 -84 14 245 -1 -263 47 214 -123
1118a23QK44p1r3K4j34J23K83j97l37K09K33j76q6J32k8k6P1j58m3L73l1m77J09
$$ -123 -115 129 58 -35 -11 -145 -22 261 64 -273 -64 169 -7 -93 39 11 -15 56 -102 -145 228 197 -280 -171
1142a71L59j56j05J64j66j2K72k51j94M88K3n11J20K85j50N3Q8l34Q3L85k74k34
$$ -171 188 32 -73 91 -75 -87 185 -66 -260 228 251 -260 -140 145 -5 48 136 -198 -115 270 -4 -238
1164b38L69R4l55j8J82kN5N4k99k8L90n5l77J92K72l01n6J84j14P0K14l82j59
$$ -238 131 225 -130 -148 34 32 87 141 -158 -186 204 149 -228 -36 236 -65 -121 63 -51 19 233 -149 -308
1187c08N08j0l70J39J22j41P6mj59K29J22l22j19K97J14j82j08J20Kj4P5j18n3
$$ -308 200 190 -180 -41 81 -60 16 12 -147 82 204 -118 -237 60 174 -8 -116 4 6 -8 67 -51 -104
1210a04L12j42m16L36K71l15K5P9k30K64J55m51J30L40k78j24J59oJ35o1k85J78
$$ -104 208 66 -350 -14 257 -58 -33 46 -184 80 235 -216 -86 254 -24 -148 11 5 140 79 -206 -28
1232b8J31r7R7j82q3M25k22m19N64M8m61L10p3l18O13n7p14N01K64n36K11J72
$$ -28 103 6 103 -79 -162 263 41 -378 186 234 -227 83 10 -308 305 248 -466 35 299 -237 -26 146
1254A46l26L31k4m81L58K26k86O1r8n6L86k76j97M39k10j27L45m43Q3P14p16l32
$$ 146 -180 151 127 -354 4 230 -56 5 -93 -149 237 -39 -236 203 -7 -134 211 -232 -149 565 -151 -483
1276d83Q88m12l24P84n80l16J010n83o20J098k01p29P13j92m81Q51k28p21P13
$$ -483 405 -7 -331 453 -127 -443 567 -16 -636 462 261 -468 245 53 -428 423 195 -526 187
1295A87K2n00M11j32j46M83m01l13O54j89k22L65m21k6O52n58k27P51l98k76N28
$$ 187 209 -291 120 -12 -158 325 -76 -389 265 76 -146 219 -202 -228 424 -134 -361 390 -8 -284 244
1316B44m29j5P13o60l09P87l33k42N64m71r8O89o00k63Q37l51l25M82l93m2O88
$$ 244 -185 -200 513 -147 -456 331 -2 -244 320 -151 -249 440 -160 -423 414 63 -262 220 -173 -215 473
1337D73n69k75P31l88k55N94m34q6P28o99l37R72l42m72P02l93l73Q97m02o18
$$ 473 -96 -371 360 -28 -283 311 -123 -209 519 -180 -517 455 113 -359 343 -50 -423 474 72 -546
1357e46R17r2p62N79N4l96N41j87n71N88Q0m21L21q7j92M18l37k52O78k05m11
$$ -546 371 279 -483 96 150 -246 295 108 -463 125 205 -216 105 18 -174 244 -93 -345 333 128 -283
1378b83M25k68r7O81n26l93Q46l30m61P08l05k89P51n70m70J050l10o06P89l59
$$ -283 142 -126 -223 458 -68 -461 385 55 -406 302 -3 -292 459 -111 -581 469 159 -447 342 -17
1398a7m35R20m40o04J053k60p68P81j23m54P80l93o11R29j65n96O88k13m24P24
$$ -17 -452 468 28 -576 477 217 -551 230 107 -347 433 40 -571 358 193 -403 285 72 -352 372
1418C72m17m56R56k51o45O46j80l46P17l44n12P44j30n05M80m5j93L37l79j51
$$ 372 -45 -501 455 204 -441 205 25 -321 396 52 -460 284 154 -351 129 84 -109 228 -151 -302
1438c02N89k36j98K82l24J13M05n86O5O07n38j25M92m33J22N10p16q6P73m45k42
$$ -302 287 51 -147 135 -189 -76 329 -257 -192 415 -123 -248 244 -189 -67 443 -273 -359 414 -31 -273
1459b73N79l92r9N32m98k01P49k51m79M34l6k04L38j38l22L77P7l84Q5K61p0j26
$$ -273 306 -86 -185 347 -151 -352 397 146 -333 101 65 -139 199 61 -261 116 193 -191 -106 155 85 -41
1481d1l0J4O5J25q3j94J05J84j79j19K02N3j11m9o9Q8J85j03j58L3J11M9j06o5
$$ -41 -71 -57 8 133 50 -144 -39 145 -34 -153 49 102 -9 -58 -127 -39 146 43 -115 -82 29 78 -28 -93
1505i3J53K6j56k8O7J04Q5k42j10K44L7j34M9l9MJ51j88q7L27m7k38P4JJ1K34
$$ -93 60 86 -70 -98 -31 73 158 -84 -194 50 87 -47 2 -37 -33 118 -70 -157 170 123 -115 -41 -40 -29 205
1530B05k33j72L09j3j90J12j3J0J54k97p6M03j00k16J67j03l0L05k42k29M43m3
$$ 205 -28 -200 109 96 -94 18 5 15 169 -128 -204 199 99 -117 50 -53 -83 222 -20 -249 194 151
1552A51l87K34R8j48J83r6k87L01J47k86NJ44n4K2q5n3K16J1k16QN7M6J23j79
$$ 151 -236 -2 96 -52 131 35 -252 49 196 -90 -85 59 5 27 -58 -111 105 116 -100 -92 -35 11 134 -45
1576d5j27K72j9k28J34O5n6J11j68j57L42M8k96P4J08j18J49o5k06L00O3m01J31
$$ -45 -172 100 81 -147 -13 52 -4 107 -61 -218 124 172 -124 -50 58 -60 89 24 -182 118 181 -220 -89
1599h9K39j66N3K4k54K02K21l32qK37j04n4J5q8K01N4k75K8J30l4R8j03j97L13
$$ -89 150 -16 37 61 -193 9 230 -102 -110 127 23 -31 -16 -104 97 151 -124 -96 34 0 98 -5 -202 111
1623A11J4l53K09J97k44Q8Lk72L19J95m37M2K66j90K7P4j51J53J03l30N7K46o3
$$ 111 125 -228 -19 178 -66 22 25 -247 72 267 -170 -128 138 -52 -25 49 -102 51 154 -176 -119 127 64
1646F4j4r0j31K71L4k75J47J10j56P7m1j33L02J8l85J33J78j44J16k2k21K53N7
$$ 64 50 -40 -171 100 134 -141 6 116 -40 37 -4 -137 165 183 -202 -69 109 -35 81 59 -162 91 148
1669A48l58J64K62k16l5K7j30K02J34k90m0K19n8r0M1L3N2m0j29J2J31Q4n7k24
$$ 148 -210 -46 216 0 -35 -8 -138 64 198 -92 -132 87 29 -61 -20 13 65 25 -104 -92 39 123 66 -158
1693a58M4K40j04j34J56J8j14N7p7m1L07o3l51J17K14r3nJ8j02P1P5j72K4K19
$$ -158 -114 126 22 -112 44 62 -52 5 -72 -113 194 131 -220 -103 111 18 13 31 -71 0 75 -97 -73 146
1717A46l9k01m5J32J07pj04o8O2P7o7n1J14O9j65j10J16J25K6r1j42J6J66Pj50
$$ 146 107 -94 -139 -7 100 93 -11 -79 -17 60 -7 -58 56 125 -40 -150 -34 91 117 26 -116 -100 66 73 -77
1742g7P7P1q4q2L8P9J04m7k43J4K11M2j29j1N4m5J8k2LJ42lk34m9K21O8o5q2m4
$$ -77 0 71 -13 -95 -57 22 126 79 -164 -150 61 103 -26 -37 17 -28 -10 -32 -29 113 110 -124 -173 48 116 51 -31 -75
1770g5L1R9n0n1J05M6j64j08J59J73m7j69n4M2R6O5j04m3J33o9j73J22J83n9p9
$$ -75 -44 55 5 -46 59 105 -59 -167 -8 165 118 -51 -105 -63 33 98 -6 -49 84 15 -158 -36 147 88 9
1795Iq7r2K21J48k13q1J36m4q9P5P0L9m5j82m1K17J16r4j53%R6J2o3P6L3p9m5
$$ 9 -78 -170 51 199 -14 -95 41 -3 -92 -17 53 92 47 -135 -176 41 157 63 -90 -90 6 18 -45 31 64 -15 -60
1822f0n5M5K58k2l17K0J57j4M3J4j31P6M2k14J00K77j36j66nk3J69J35j96r3J45
$$ -60 -115 -70 188 166 -151 -131 26 12 55 69 -62 14 56 -158 -58 219 83 -83 -88 -111 58 193 -3 -96 49
1847D9n0o4R5K7N6p5k04O4K18J8p8j15p8J88K8j81J59Q7k66L5J04j13K62P2m73
$$ 49 -1 -65 30 57 113 38 -166 -102 116 134 56 -59 -137 51 79 -102 57 144 -122 -87 17 -96 166 238 -235
1872b35M0L40j66J0J49k17JJ48k14P4L15j74k06J8K2K01P6k71M4R7j85J24J16
$$ -235 -195 145 -21 -11 138 -79 -78 70 -144 -70 245 71 -135 -117 -95 106 182 -89 -45 52 -133 -9 107
1895A07j45J64m0l95K36L28k47J7J9k92K74J80l46J94J87m05L6K16j49K24O1n03
$$ 107 -38 126 86 -309 -73 255 8 25 44 -248 26 206 -140 54 241 -164 -128 88 -61 163 224 -279
1917b79J35L23k28P6J28k69Q8J01k65K19K55l12o3Ro7L46pl93K11P5l07K69J21
$$ -279 -144 179 -49 27 155 -114 -26 75 -190 29 284 -28 -91 -82 -149 197 190 -203 8 83 -224 45 166
1940A66k94K69m0n26M09L63m30Q8Q6l71K76K60m09J73K13m25L7K51j18J95j5m79
$$ 166 -128 141 101 -425 -16 347 -83 5 91 -280 -4 256 -153 20 233 -192 -155 96 -22 173 158 -321
1962c21K19K90k54J44O9l22J75P3k98L33K25m82J7J46j47L05R2m97J63K15l33
$$ -321 -102 188 -66 78 147 -175 0 73 -225 108 333 -149 -132 14 -133 172 264 -233 -70 145 -188
1983a88J75K10k48R4ml66L05L64l50n1M7k08K52J32k73J79M9l71J73J44j09K93
$$ -188 -13 197 -51 43 39 -327 -22 342 -8 -59 -12 -220 32 164 -109 70 119 -252 -79 65 -44 249
2005B49j65n08M10K30l78L01L1m91L63Q7m58M99K28o94J36K84l32L75J71o27J59
$$ 249 84 -424 -14 216 -162 139 170 -321 42 129 -329 170 398 -296 -160 124 -208 167 338 -289 -130
2026a30L48m12J80L05l46L3O3l24L24L12l68p3L9j14K73L0k44K33q4k94K48O5
$$ -130 218 -194 -14 291 -55 -22 41 -283 41 353 -15 -88 -49 -163 110 140 -104 129 45 -249 -1 64
2048F4o3K85l29l73N25M2k77L40j87l31M25j10k63N55r3n23K64K1q8M45k27m30
$$ 64 1 286 -43 -416 109 151 -126 214 27 -304 121 11 -252 303 210 -313 -49 -28 -116 329 102 -328
2070c28L98l3k40L91o5k39K34k42j81N54k1l52J51j44o9M08j44j95K85j82k06
$$ -328 70 37 -203 188 123 -116 118 -124 -305 249 228 -124 27 -117 -186 222 78 -117 168 -14 -220
2091b20K45M0J8J24l55j02L42l3J6N6k62O6J31k31J88K63l56j8Q1k45L83K39n72
$$ -220 25 65 83 207 -148 -250 92 59 75 131 -131 -65 66 -165 23 286 -70 -88 -7 -252 131 370 -202
2114b02N7K87l63J98L02m05J27J87n34J82N34l54j03J63l20J43L83l19k7K21k51
$$ -202 -145 142 -221 -23 279 -126 1 188 -346 -164 370 16 -87 76 -244 -101 282 -37 -64 157 -94
2135i4o4K03l5J34j7l59R1K12l0R6j02k24K35mk31L51O1l68J30k4j64M60J3n21
$$ -94 -158 45 10 144 127 -232 -141 71 41 137 35 -189 46 42 -189 162 223 -145 -15 -39 -203 257 270 -251
2159b51K05J31k70K81R4l15K22l1m01L63K68l37O7m2k47L64J28l87K09R2l54J63
$$ -251 -46 85 -185 96 190 -125 97 66 -335 28 296 -41 26 -16 -263 101 229 -158 51 143 -211 -48
2181d8J50j81K62m4m98K93K55k76J75Ql68L05J10l92L25K16m75P0J67k08K98J10
$$ -48 102 -79 183 139 -359 -66 189 -87 88 96 -272 33 143 -249 76 292 -183 -113 54 -154 144 254
2203B54m86J21K50k49J19J61k51J21mk94L09J87k86P4p7j81M22j6l67L01J6l91
$$ 254 -232 -111 139 -110 9 170 -81 40 36 -258 51 238 -48 26 -51 -232 190 174 -193 108 124 -267
2225b67L17P6k82L81j02n53M38K55m08K56J6m23L34J30m14L50J62m90J26J71k11
$$ -267 50 126 -156 225 123 -430 8 263 -145 111 127 -296 38 168 -246 104 266 -224 -98 73 -138
2246a38L16K0m80K36J60k61K26N0k58K18q7k91M21J00l69J72n6k27M51k7m26L51
$$ -138 178 198 -282 -46 114 -147 79 129 -129 89 2 -289 132 232 -137 35 -21 -248 203 176 -250 101
2268A01M0m04K84J41k66K69o9m28L36K51l05R0J9k16J95L0j82K38%k51P6K0J3
$$ 101 141 -263 21 162 -104 165 96 -332 4 255 -50 40 59 -157 38 68 -114 124 124 -127 -51 -31 -18
2291a8K56k04k52K71k0j38K43r8j56K52j77k24M48J6l47J40j8j28L01j7l09K10
$$ -18 238 34 -218 53 33 -105 138 40 -116 136 -41 -265 183 199 -148 -8 -26 -154 147 130 -179 31
2313C1P6k64J02J58q4M2p4j72J68J65r7p0m2L1R1p1m7J66k8j81O6oN0J73j76j99
$$ 31 107 -157 -55 103 19 61 -13 -185 -17 148 51 -19 -61 -30 61 -10 -57 109 81 -100 -34 -40 10 183 7 -192
2339a92K20O3j68J27L3j44P5Pj52J86J51k40q7J16K6K6Np7j3O1l6n9Q7R2n7j58
$$ -192 28 91 -77 50 83 -61 14 21 -131 55 206 -34 -121 -5 21 47 52 -25 -38 23 -13 -72 15 107 50 -108
2365a08NJ43L3o5ko9J6J19j07m7J82k4k07N4J08mN2n3j82J24J56j57l1J50o8p3
$$ -108 -103 40 73 8 6 -63 -47 72 -35 -82 100 76 -131 -77 31 27 79 26 -156 -32 124 -33 -64 86 18 -55
2391e5L3oM5R2q4j65Q9J50n2q9M4K4k5rj6PJ02jj97PK01%j29J1K6j9M2j1o5Q4
$$ -55 -22 -28 17 109 25 -140 -51 99 47 -42 2 26 1 -8 -24 -17 85 84 -113 -106 95 95 -34 -23 3 -16 26 15 -50 34
2421C4M6j40o2J64M8j02m4K8k0R2kr7K6J17r5j17J21Q9q5j7m1j1J25Qj31LJ27
$$ 34 80 -60 -122 42 90 -12 -56 -28 -48 44 42 -55 -29 88 -7 -124 -3 86 1 -16 -57 -68 57 65 -66 -63 64
2448F4l0r2L5N6K4n7n7kR4P3j14r6J13P2j11jP4l0RJ2j36Q6J82j70j06J33J3m6
$$ 64 34 -58 -23 33 57 0 -57 -59 35 108 -6 -102 11 83 -28 -29 45 15 24 36 -100 -14 168 -2 -108 25 38 -8
2476hN8o6n0J65o6j47J18Q9p0o2k7N7P7m7q0L4K1M3o7o8J27O7j82J3J12m9K5K6
$$ -8 50 -16 -66 99 33 -114 4 93 23 -39 -66 -9 68 21 -59 -25 -4 39 -28 -96 31 98 -84 -71 41 -8 17 43
2504D3j63O8J90j64r2J84k4q3N5p8L3J43j16j02J15M2j9l9n1R4M4j31KQ1k0M1
$$ 43 -120 -52 138 -26 -118 66 42 -41 14 -64 -31 112 -4 -106 9 51 32 -7 -58 36 80 -51 -49 32 12 53
2530E3m7j19J52J19k30K0J24q6K0M7j40J01J34k06m0J83n0m2L1q6M5J15j14o4
$$ 53 6 -113 39 158 -72 -52 72 -14 6 53 -87 14 148 -58 -98 85 35 -7 24 -62 -17 98 -16 -80
2554h0J20ql6j8n6J00O6j58NR6k3K1k2j15J61M2j89K6J56j01J7L2j34J16J29k23
$$ -80 40 32 -4 -22 -78 22 88 -70 -65 31 8 29 7 -108 53 95 -94 -68 88 -13 4 36 -98 18 147 -76
2580g6j0J82q1k9N7j10R8J03j69m5J61l8m2K3r8J01P3j75K0J46r4K3K1j52J42
$$ -76 -86 96 15 -14 43 -67 31 134 -35 -80 81 43 1 24 -74 27 100 -75 -55 91 -3 20 41 -111 31
2605C1J26k62J0K37j62j9J10j65O1J92k30o9K37n9j09P1l7M0Q4j61kJ32n2Nqj04
$$ 31 157 -105 -95 142 -20 -39 71 -94 -33 159 -71 -140 97 38 -71 0 -37 3 87 -74 -76 56 4 9 1 -103
2631a03J65O0k48R9J38j45N2L7j83J56J41k99N1K17j69K6P0j54J34J14k78N2J99
$$ -103 62 122 -126 -27 111 -34 18 55 -128 28 169 -130 -79 138 -31 -5 65 -89 45 159 -119 -67 132
2654A32j53J3O6j58J39Q3k36O7J58j09PQr8J39M1k18J02J01j12M6j6j12K09j0
$$ 132 -21 -8 58 -100 39 122 -114 -47 111 2 9 17 -81 58 99 -119 -17 84 -28 18 2 -110 99 89
2678H9k53J47J38j83O1L5j54J71M4k12Q8J10j05J0j1l9J63n7j63J24M0n3O8q7
$$ 89 -164 -17 121 -62 -1 34 -120 51 95 -117 -29 81 -24 -14 -25 -64 99 42 -121 3 43 -10 58 -29
2702b9n2J88o3j56J39N1r9M7m8m6J44k2j14M2L5J3k3n6N2Q8j06n9R7JJ5qj25O1
$$ -29 -81 107 44 -112 27 78 -21 26 -22 -68 76 54 -60 -18 17 30 7 -49 3 91 -15 -74 23 24 39 31 -94 -33
2730c3J32j05o1J08l1j8J4r1P4J29j09r2O2L7%J9r4L3R4q2n3N4N9lq4k3Q8J7k9
$$ -33 99 -6 -67 41 10 -8 6 -85 -11 118 9 -83 -21 16 16 35 -59 -26 68 -14 -67 -13 46 43 -41 -64 24 41 12
2759A2j8m7M9R3j06n7J56k3j31P0mj8J48j01j63J79N7j62P4M6n9M4l3j08J74N3
$$ 12 -6 -53 -4 89 -17 -74 82 59 -72 -2 -6 -24 124 23 -140 39 96 -66 8 54 -5 39 6 -102 72 125
2785A25j81K5L2l7J12l8j29J33K5j48M4J02p3M2l6j25J31J08j35l2P0k6L3l3m5
$$ 125 -56 -31 1 -36 76 38 -91 42 67 -81 -37 65 -8 34 -2 -127 4 112 -23 -55 15 -11 22 -11 -56
2810e6J15oj25J8M4K9N7j02q8J66nj09R3qn8J06j13q7K56k6k19J40pr3K07r1j92
$$ -56 59 53 -72 -54 -10 19 76 -26 -114 52 47 -62 31 23 -35 71 -42 -129 127 101 -118 22 15 -78 129 38 -154
2837a54K61pk76K09Q2j83J38m5k08K60Q8k74J06N4j39J37rj60K21qk42J35N8q2
$$ -154 107 100 -176 33 115 -68 70 25 -183 77 165 -109 -3 51 -88 49 40 -120 101 93 -149 -14 44 -38
2861c8J53j03j84K40K6k30J69N0j67J21l6j46K53Mk47J13M6p3J47q9j24J98l4
$$ -38 115 12 -172 68 94 -136 33 83 -84 37 1 -145 108 112 -135 -22 24 -49 98 9 -115 83 49
2884D9j84J82Rp7J22j59p8K77o8j71J58n5r0K07j30j07K93j34k27K50k6r8J97
$$ 49 -135 47 56 -21 101 -58 -136 141 73 -98 60 5 -85 122 -8 -115 178 44 -183 67 41 -57 140
2907A40j56j67K94m3k03K07J0j70J32o9r7K51m2k21J33J5o9J42j13p2J91q5j36
$$ 140 -16 -183 111 68 -135 72 82 -88 44 -25 -122 129 87 -134 -1 14 -55 87 -26 -98 93 8 -128
2930a28J65J6o9P2j14p5K38l9j66J20lo0Q3n8k5J42p7j16Q3L4J8K1j24MJ41o8
$$ -128 37 53 -16 56 -58 -133 105 66 -100 20 17 -43 40 -18 -43 99 22 -94 -11 23 41 62 -62 -58 83 15
2956A5n5Q5m4RK1j28O5J88j34j11R8j2jR7j33j3J56r8j15J65pm6L6r2l2J72k5
$$ 15 -40 45 1 10 31 -97 -32 156 22 -89 9 -3 -4 93 -40 -53 103 5 -110 55 48 2 38 -54 -86 86 61
2983F1j36N9L3l6L1m4L3Q3q9q7Q0L2K0j3j02L3Q9m9m6P5ll6jm0M6R9n9j05K9N6
$$ 61 -75 -16 17 -19 12 -32 1 84 -5 -92 -12 20 40 27 -75 -42 47 -2 -48 27 24 -12 -13 -53 -7 92 33 -72 -43 13
3013A3L8l5o0O1J6n4k2M7L5K0p2q4J06N4o2rRj9M6pp2R4L9j18j8N8K3M6n5j06
$$ 13 51 16 -44 17 33 -21 -43 4 39 59 -13 -97 9 63 1 -8 1 -18 28 21 -51 43 82 -36 -54 4 27 73 18 -88
3043h8P6O7o6k8M9Mjn0k0Q4M3p7l0%K9N3n1n1P8J6p8J1K5M9J2r5m1J02K3n6J5
$$ -88 -12 55 -11 -39 10 14 13 -37 -57 27 70 -7 -37 -37 -8 45 -6 -57 21 37 -41 -30 -5 44 56 -39 -80 22 45 -11 4
3074Dj3J4L9q8jJ16m4n9J8j2O1M9j12n9J34mp2N2k3KN1q8l8J40pj01J6QK4L3o8
$$ 4 -9 5 44 -44 -45 71 27 -32 -14 -26 35 84 -28 -87 47 43 -29 23 0 2 53 -35 -73 67 60 -41 -25 -17 7 40 -28
3105b8k7R2j8n3RON9J2j21J0J18n1k4K2n3N0O6j43J3J46o7r1P7k2L0P0j21l0J37
$$ -28 -55 37 19 -34 -25 -19 40 52 -69 -59 59 8 -16 6 -47 3 69 -74 -61 85 18 -73 4 -18 12 82 -39 -69 68
3134F8n1n0L7jL4Qj14K8J15m1l1ol1O7L3j29L8J22j02l1N7o0P4O1j72K3J61r5
$$ 68 17 -33 4 3 37 45 -69 -41 74 33 2 -4 -35 32 65 -64 -26 96 -6 -37 20 -40 34 95 -77 -54 107 12
3162A2m7Q3p4K7O5j33J6J51r3q0O2oM2L2j07J4R9q4j0L1k3N7Kj42R0R2j09K9K1
$$ 12 -35 48 -26 1 66 -67 -51 100 7 -73 -11 -17 25 57 -50 -36 63 -21 -31 0 -23 34 36 -106 -16 76 -33 -4 17
3191A7p9R8K9j55P0J30j29l7R1m2L9M1j50L7J20q0k4N2m2O8j3j37Q7J17j35J9
$$ 17 -62 36 65 -90 -20 110 -19 -56 35 -7 32 73 -77 -40 80 0 -24 28 -14 54 41 -96 -9 108 -27 -8
3217hL3q7J02N6j87O4J31j45kQ7o6N2L8j64O7J38j26k1O7o4O4K8j43Q3J01j20
$$ -8 25 -62 40 96 -91 -27 104 -41 -43 44 -22 30 68 -96 -29 109 -17 -38 29 -35 29 57 -86 -3 98 -22
3243b2oL1l6P5jj28R3O7j13L0K9n7J18n0j46J60O4j68N7M3j20J28L9j92R3J40
$$ -22 -28 3 -33 42 41 -87 6 73 -40 -10 19 -38 80 30 -116 44 108 -60 -3 40 -80 48 87 -105 -12 128
3269A28j78KR5m9M4mj14P8P9r4nK3k1O9n1j06J56L3j35L8M2o9Q6j3j41J11Q9j49
$$ 128 -50 -48 47 -2 42 38 -76 2 81 -13 -18 5 -16 53 2 -104 52 85 -50 -12 30 -39 47 34 -107 4 93 -56
3297e6J1Q6n5M7j2j12R7P2j06lL8k5M7k0q6J03M3r3JL1j1P4n3j00J20J5q1M9r
$$ -56 -45 41 -14 33 21 -91 6 78 -28 -31 7 -18 29 9 -77 26 69 -24 -23 8 -3 71 18 -82 38 53 -28 21 12
3326A2l4R4o6j10J53N8j70L9Q2q0M1M5j19L9J20j06o3R6L3o3l4J8K5J5j2j7m4
$$ 12 -22 72 6 -104 49 107 -63 -24 58 -22 19 64 -55 -16 104 -2 -65 31 64 1 -33 -15 10 25 13 -4 -48
3353d8N7N5j11j7J29k7j01N0J5j7N4j3r6Q9M9j03nP5k4rk1k8O0N7q6k4L9K3j0
$$ -48 9 64 -47 -64 65 38 -63 -13 2 -15 39 26 -70 19 68 -35 -40 35 11 2 -19 -47 13 70 -16 -40 -1 22 12
3382A2k9%L5L4n2l6L7O0n2o0M1N3k2rnl4O8J3j05K1R3k2o7MK4L1j3m3rM2J7j8
$$ 12 -17 -17 18 52 0 -36 1 61 9 -51 -10 43 21 12 7 -27 41 54 -51 -30 63 41 -26 -22 2 33 20 -23 -32 10 27 9
3414Io1K2J01o2j02J17L5q7L5jo1Q8N0j70L8J19o4m4L3K2J9k8l9J7L1K7k4p2M4
$$ 9 -52 -30 71 9 -93 24 59 -28 7 6 -55 33 83 -87 -49 70 6 -38 -5 17 36 8 -31 -14 17 44 20 -52 -8
3443hR8r7o0J31k5o2O6p8k0J77r2j30J56k5o5P5l3p0J60p4j40J54L9j08O0qq9
$$ -8 90 -7 -67 64 39 -23 43 -35 -55 122 30 -100 56 31 -34 41 8 -62 98 24 -116 38 77 -31 29 21 -68
3470f8J38j9j40R2O2r4K7nj2Q4o5q9J16j7k0N5j04jJ69j29r8J90l9j11J29o5p0
$$ -68 70 51 -89 3 65 -29 -2 -7 -19 65 0 -89 27 10 -10 45 -59 -60 109 -20 -118 72 33 -78 51 -14 -84
3497h4J83o6j43J43K3r4M7ll4P6l8p9J03rl3M1p4K0J34j45n1J68o5o7J10r1m0
$$ -84 99 33 -110 33 56 -38 9 6 -28 48 10 -69 34 25 -8 33 -41 -21 113 -32 -83 85 20 -47 63 -28 -68
3524f8J91j22j19J85qj33J10k1p0J33l9j55J48L7j13M8jl6R6m7j03J11K8r7L1
$$ -68 123 1 -118 67 59 -74 36 15 -55 78 39 -116 32 69 -44 4 3 -33 63 16 -87 24 52 -45 -14
3549a4%%Q0p8o9J12J3o6M0m1j1J28r8q9J58k6q0P7k0o5J26o1j26J63J9j18M1K6
$$ -14 -14 -14 66 -12 -81 31 44 -22 18 -23 -34 94 -4 -93 65 39 -41 36 16 -49 77 16 -110 53 72 -46 -5 21
3577B1l1O2l3q4J06J7p1J4k6K4J03j14o4J50l1r2Q3m2l6J37r6j04J69K2j55P2
$$ 21 -10 52 19 -65 41 58 -13 1 -25 -1 102 -12 -76 74 43 -49 34 -8 -44 93 -3 -107 62 84 -71 1
3603AJ6n9P7j6r6R8L2r4K1K5qL0o4k2Q1Rm6%j6L4M5r3j6J15l4n4M5m3K1R6j19
$$ 1 17 -42 35 19 -77 21 53 -41 -20 5 -3 27 -37 -59 22 31 -15 -15 -31 3 48 -45 -61 54 20 -34 11 -32 -11 85 -34
3634c4k9J27l7p9P8j6k4Q8p2p8J28K6j10J1L5OK8n5l8P8kn0Pj8N4K3j04L5P4n2
$$ -34 -63 64 27 -52 26 10 -14 74 2 -76 52 78 -32 -21 14 20 48 -7 -45 33 31 -19 -12 -30 24 47 -57 -22 52 0
3664@k0K9n0M2N3q7k9R7j1o9J3M5mOm0j7N4J1j7m7L0O3o6k3M7mnK4o4QR0m1p9
$$ 0 -20 9 -41 1 54 -33 -62 35 24 -45 -32 13 9 15 -25 -42 12 23 6 -41 -11 52 -14 -37 10 6 1 25 -39 -31 59 18 -61
3697f1P0K9m8M1m3k9R1j8j00O6P2p7MQj1K6K7o4k0P2mo4J1M1Pl2k4J3J0N1m5o3
$$ -61 9 38 -10 31 -12 -41 50 32 -68 -2 70 -7 -3 5 -6 20 47 -17 -37 35 31 -33 -22 19 26 -6 -30 -17 -7 44 -1 -64
3729f4N6N5p7mN3j1Kj5l7L9Q0q2m0M4QK2j5n0L0N3n4m3P4mJ0m1l5O0M4m1m9M1
$$ -64 -8 47 -30 -34 19 8 10 -5 -42 -3 77 -5 -45 -1 7 29 14 -36 -6 47 -7 -50 24 20 30 -11 -46 14 58 17 -32 9
3761IJ1j0j3j5L2L7o8j3L9R%nn1M4N2o4l0O4On4J0j1J7N6m4n9N0L4k4l3j3M1J8
$$ 9 20 10 -3 -18 14 51 -17 -30 9 18 18 13 -38 6 58 -6 -36 28 34 -20 -10 -21 -4 52 8 -51 -1 33 9 -24 -37 4 22
3794B2m3JL0nJ2l7m8P8M0p2pM6k6L0rl6L1M2p0j5N7j3J0Ko2N0N7q7nO5l3qJ4l4
$$ 22 -21 -20 10 5 17 -20 -68 10 50 -22 -29 17 -9 21 12 -24 7 49 -21 -36 21 8 18 20 -42 8 65 -22 -27 38 5 -3 11 -23
3828b3L5O4r4l2P6Jk3J3m3K6M0n8j4P5k8lj4m4N8M6p6k1O1k4kK2n3L6M0q1j0P6
$$ -23 12 76 -18 -50 26 27 4 17 -26 0 40 -18 -32 43 15 12 -2 -46 12 58 -18 -39 22 -2 -4 18 -35 1 41 -40 -50 26
3860B6Nk3j8l9P9Jo2K3L4l4L0k8n9J11J1j24N2N5n4L2K3q8N4O5j09nJ10m7l8J2
$$ 26 31 8 -10 -49 30 31 -31 -8 26 -8 22 -6 -65 46 57 -67 -15 40 -14 18 41 -47 7 72 -37 -42 68 21 -17 -5
3890ek8N9K9p2rN5j6j1nj2M7ko5J9M3k1J8l1l7P8Or4L4N5n4J5qm2J06J4j31J7
$$ -5 -33 26 55 -17 -26 29 13 2 -3 -15 32 30 -35 -16 27 6 24 -7 -44 34 40 -54 -20 35 -19 -4 -12 -54 52 66 -65 -48
3922d8Q6m4j6K3k5L2K7o0j6P0Kn2kMN4qn8K4L1qK1n1j1Q0k2q7N8O2p1PJ2n4N7
$$ -48 38 -6 -22 1 -24 8 35 -25 -41 29 31 -21 -23 -19 35 27 -31 -7 24 16 37 -14 -25 55 33 -54 4 66 -5 2 14 -40 17
3955A7N4r9j5J00k8p5M6J7j4L6n2l8P0M0o7k9M0K7l3j6L2J1k4Ql8k2R1Qj06M0
$$ 17 71 -28 -43 57 29 -46 0 17 3 39 -13 -51 19 59 -8 -37 3 30 -3 -19 13 24 0 8 -30 -52 39 47 -59 -19
3985a9P3o1j8N1l7RM1r2J1Q2k4n5L9JpM8m7m3R0qp1L3L9j3kk8j2M0K7l7m4M1L2
$$ -19 54 -7 -25 26 -11 -2 39 -53 -42 40 16 -39 0 1 -6 42 -5 -48 42 34 -37 -4 35 22 20 -8 -20 20 47 10 -34 7 39
4018C9l7k8L1L6m5nRj6L5L6q9rJ05m8o8O4J9n3L7j0m7O3L8p4m6Q4Ml9nK8mk0R
$$ 39 2 -26 5 41 -4 -9 0 -16 19 55 -34 -43 62 14 -54 10 29 -24 13 3 -44 19 57 -17 -63 21 25 -14 -19 9 5 -15 -6
4051fkK2J6np4K7P1k3p4N2K0m3N3k9m6R5Qj22L4Q4n3k5M2m7K0P7j02pR9n0n4N4
$$ -6 -8 14 30 25 -49 -22 49 26 -48 4 24 -19 34 5 -41 54 62 -60 -26 58 5 -20 22 -25 -5 72 -30 -37 62 12 -42 12
4083A2Jk8O2n8m3Q2K6o9%J9K0k0m0L1L0k9K1k9n9J36kj40O2P7r6%Q0q9J7R1j15
$$ 12 13 -15 47 -11 -54 28 54 -15 -15 4 24 4 -36 -5 25 -4 17 -12 -71 65 63 -77 -15 62 -34 -34 46 -43 -26 65 -50
4114e0j6J44n0p4N7j6pM4k8k9N1k0l0K5j2O6l0r1N9O4p2L3J6q4P7M1j37N6J12
$$ -50 -66 78 28 -46 11 -5 -12 32 4 -25 26 6 -24 1 -11 55 25 -66 -7 57 -15 18 34 -50 27 68 -69 -13 99
4143I9j19j6P7q0M8Q1j39qJ29n5p1R5l1l2M9n5k0Q7Lo6mL0K6ro0M8J8n3J6J7n0
$$ 99 -20 -36 41 -39 9 90 -49 -57 72 17 -54 41 10 -22 27 -28 -48 39 42 -24 -28 2 28 19 -41 7 25 -28 -12 5 -45
4174d5R1lj33O5J20j23j8J03q7%Q9r1RJ09p5p8P8Rj6M5p0j2P1j2l4J0K0Ok8m7
$$ -45 46 43 -90 -25 95 -28 -46 57 -30 -30 59 -32 -23 86 11 -67 11 20 4 49 -21 -33 38 26 -8 2 22 28 0 -47
4204d7M8P1o9j8L7m6K8N6j09L1Q9q8l7Q5k3l1N3o3k8J24k9p9N0J7m2J9J0k1K6
$$ -47 1 72 3 -15 22 -24 4 60 -49 -18 71 -17 -54 31 8 -23 30 -33 -61 63 34 -45 5 22 -20 -1 9 -12 14
4233A4jm4JM8K0l1n1O3J7o8L3L2n4M7Nj10P8R0r1n5R9n7MP5o9l6R4k9r1Q8L5n6
$$ 14 13 -31 -30 18 38 7 -44 19 36 -32 1 33 -21 26 31 -79 -1 89 -2 -57 42 -15 -11 64 -5 -41 53 24 -67 21 56 0
4265@Mj4qM5Lm1jJ7J5k0k9O1Pn8mK8k4L7J5q6K8Q2p7qM7j5j7Kl0J3P6l1o0K3L8
$$ 0 4 -10 -18 27 30 -11 -12 5 20 0 -29 32 39 -19 -23 5 -19 18 33 -53 -25 57 -20 -28 19 4 -13 -11 -41 -28 48 17 -43 -20 18
4300A8k1pKK2mj3rj2L1L3n6l8O8L0n4J8jm0M5J3n4M2O2j01k0P6j0j7L0l7k0N0
$$ 18 -3 -10 -8 14 10 -3 -12 -24 7 40 -16 -54 14 44 -10 8 7 -33 12 25 -29 13 75 -26 -46 30 20 3 33 -4 -24 26
4332B6lm4J3N3k7o0M9K5l0Lkn4N9K8o1j4P4k8l8J9L0j4K2l3n2N6M1n1k1K9PKl0
$$ 26 23 -21 -8 45 18 -42 7 32 2 5 3 -51 8 36 -25 -39 35 7 -31 -12 18 4 26 -7 -59 -3 38 -13 -34 -5 2 4 -26
4365b6J9K4rj2j8nO1j7n1NO2l9pK3k2K3K7o8j3R1j8n4J1J1%J5jl7M1Lm4mM1K6
$$ -26 -7 17 8 -4 -22 -27 34 17 -34 -29 33 -6 -13 10 -12 11 38 -30 -43 48 30 -24 -13 -2 -2 13 12 -25 16 19 -25 -29 12 38
4399C8l5k3J0K0pJ4l4qM9j5m5L1M4n8mJ9k1L7J7m8j0N7k1m0L0OjQl3RL0J3l8j2
$$ 38 3 -20 -10 10 3 17 -17 -25 24 9 -36 -5 39 -19 -23 -4 -25 12 29 -19 -29 28 7 -33 -3 3 2 10 -23 -14 16 29 -9 -21
4433b1J3L7k8l5N6J4m5RJ5l2N5Or5K2Q3n6k2O4m3KL0m5k0P7j0o7J4M5j0nj3KO
$$ -21 -8 29 1 -34 22 36 -9 0 15 -17 38 44 -51 -29 54 -2 -24 40 -3 -1 29 -16 -36 41 31 -36 -22 23 13 8 -5 -3 3
4466CJ0k6k8M1K5m0m1N5J1l0K8j8l5P6qq5N1N6r0J5M8k6RL4o4rR6m3o0M7Qj3Q
$$ 3 13 -13 -41 0 25 -15 -56 -1 10 -20 8 -10 -45 31 23 -62 -11 45 -45 -30 18 -8 1 35 -29 -38 58 15 -45 2 10 -3 5
4499Ej7J0L1j6j6k6L1L7m2l5N5Jl3J2J0k2M8or4O1O9o3k3M6l0oL8n4jO4k7l6J6
$$ 5 -12 -2 29 13 -3 -29 2 39 -3 -38 17 18 -15 -3 7 -15 33 27 -67 -6 63 0 -23 23 -7 -13 25 -29 -30 34 7 -29 -13
4532a3M3rk1l2L4n%Kj2MM3n1m2P8Mn9K8Mk1N2op7N1N3q7LO5l2J6J7o4MQ8l0o1
$$ -13 30 21 0 -32 2 -3 -3 -1 -13 -9 34 -17 -59 19 23 -36 -8 -4 -25 27 21 -56 -5 48 -39 -36 29 -3 13 30 -34 -30 58 28 -33
4567c3L0K8k1k0J8kJ1%k1oL3L3o2n2P8J8n8L6J1l5L0Jp2N6O2q1k9N3Jj3K4l6R
$$ -33 -3 25 4 -16 2 0 11 11 -10 -16 17 50 -12 -64 14 32 -26 10 21 -14 16 17 -55 1 63 -18 -47 6 7 -6 18 -18 -9
4600iL9m8j7L8J2nk3j8K6K6l9kJ4jK2k3l8O8Nn5J1L5k6L6op0N1M3n7kO2m1k6L7
$$ -9 30 -18 -35 3 15 10 -13 -31 -5 21 -18 -20 -6 -7 15 -8 -46 22 27 -28 -17 18 -8 28 22 -48 3 46 -11 -13 49 8 -18 19
4634A9m5J9O4l1o0L3L0m7K0oJ5jj2k6K9PK5m7l2N8K4o8K5J8l3J5J9l7K9N3q9q
$$ 19 -26 -7 57 26 -34 -1 29 -18 2 -4 11 10 -2 -28 1 8 33 -14 -46 12 36 -32 -7 11 -22 -7 12 -25 4 57 -32 -40
4666d0N4Mk8K3k6rN1k5l6M5J3l3mjK2L7m4j9K4kP%k5K1J1k6nK9Pk6Nl3K7M3l8
$$ -40 14 18 -10 13 -13 -22 29 4 -32 13 26 -7 -11 -12 10 47 3 -16 8 6 13 13 -12 9 20 -6 -11 18 25 -1 4 -29 -2 41 3
4701Cl2N3om2L7Pj9J7j5n9O1M3o0j1J6nNmMOJ1j6k4J8K4J8m2rK7Lk6K7oj9N4n2
$$ 3 -29 24 18 -24 13 20 1 18 3 -56 5 48 -12 -23 -7 -12 -7 -11 -7 -1 10 -6 -30 -12 12 30 -12 -21 6 9 -17 10 4 -15 39 -13
4737a3j9O5J1p2K8J3k3K2J0n7M9L6o3JM1j4rNm1M6M2n8k1L8%rLk2K8Ml9qL2MJ
$$ -13 -32 33 44 -28 0 13 -10 12 22 -35 14 50 -13 -12 29 15 6 11 -30 16 58 0 -21 17 17 8 11 -11 17 21 -18 -26 6 10 11
4772A1j0k9L6J9m0nK5j6Oj6k0M7J9m9oJ4J2Kqk5K7K6n5K1K1j6K2j5m0N0M4q3K3
$$ 11 1 -28 8 27 -13 -18 7 -9 -3 -19 -39 8 27 -22 -28 -14 -2 0 -8 -33 -6 20 -35 -14 7 -9 13 -2 -42 8 52 -31 -8
4805hL5m0K6J3n6L2M7p3k1R0l5k6L0m2J8N2m2l3M9j3j2J2j4J3L8l8l3L4K6k7j
$$ -8 27 -13 13 26 -30 2 49 -24 -45 45 10 -16 14 -28 -10 42 0 -33 16 3 -9 3 -11 2 40 2 -31 3 29 2 1
4836Al8M5K3n2QL5k6lMl5N2L2p0mN6k9nL0n9M1K5n9kN9j5l2K2k7K8M0m7j7M8l1
$$ 1 -37 8 31 -21 -13 22 -4 -7 -3 -38 14 46 -24 -28 28 -1 -6 24 -35 6 31 -28 -30 29 14 -18 4 -23 5 45 -2 -19 29 -2
4870bmJ7k0J4M2p4J2M7j3k8Mj2QN1m2l5O4Ol3q%J7J8l6j0K9lj4lMK2j4l1PM6o
$$ -2 -6 11 -9 5 47 -27 -15 32 19 -9 -5 -17 -9 42 0 -35 29 35 2 -6 -6 11 29 -7 -17 12 9 -5 -8 -4 18 4 -27 -20 26 20
4906B0j1k3j8M9J1n0QL7m0J6j1lL1J2n6QM5j5j6J0rOK6k7j5M2ol0KOJ8Pk0j4L2
$$ 20 9 -14 -32 17 28 -22 -14 23 -17 -1 -12 -15 16 28 -28 -20 25 10 -6 4 -5 1 27 0 -15 27 21 -9 -7 -1 17 24 4 -10 22
4941B2jKk8K1Lj0k1KJ8K0l7nJ0J9nj2nK3Mm2QL2j0mk1oK4J7k0k9K9J2j1k3K6J2
$$ 22 21 23 -5 16 19 9 -12 -10 8 28 -9 -14 -4 15 10 -2 -7 16 20 -22 -14 18 8 4 -17 -23 1 18 -2 -31 -2 10 -1 -24 2 14
4977A4kk2rK3J1j0j1qL5k0lj2J4QMk2lN1ql7%J7Qkpj4K5J2l2mK8kqj7rK5J0l1
$$ 14 12 -10 -19 4 15 5 -6 -14 21 1 -2 -14 0 8 12 -10 -13 38 30 -7 -7 10 18 16 9 -5 20 32 0 -4 24 22 14 -3 -12 13 23 -8
5015hj7L6J0j4j2kJ7Ql9ML3Lj8j8%K9%j3j6J8J2j0k1K3J2Jk0j6J0M2k4k3J8J5
$$ -8 -25 11 21 7 -5 -7 10 18 -21 -17 16 19 1 -17 -17 12 12 -1 -17 1 13 3 -18 5 17 18 -2 -18 -8 34 10 -13 5 20
5049B0loj6J9K0l6j5K2K3lk1j8K4J6rk2J5J7rl8J9J9Nj6k0QK2Kk9MK6j6k1QJ3
$$ 20 17 11 -5 14 34 -2 -17 5 28 25 4 -14 10 26 17 -5 10 27 18 -20 -1 18 23 7 -13 -5 17 19 -10 -6 20 4 -17 -9 4
5084DMLk4j6M7Pm1J1joK8j8k9M4J6m4j9N2oqj4oQL7k8k2L4J3j7j7K4mRok0j2K7
$$ 4 8 11 -13 -29 18 25 -16 -5 -6 -12 16 -2 -31 13 29 -15 -34 18 12 4 -10 -16 -8 29 1 -21 13 26 9 -8 16 12 21 15 -5 -17 10
5121A0Mk7MK8%k2OJ0J0Jk0j9M7ll5J0MkNj3j1L9Km6K0PMjk0j1K6K1m1oL0krj7
$$ 10 14 -13 -9 19 19 -3 3 13 23 24 4 -15 32 29 -6 4 8 6 11 -2 -13 26 28 -18 2 9 13 12 -8 -19 7 28 -13 -19 11 9 0 -17
5159a7jL5pk5mK0Lj3N%J4Nk5MJ9jk0j3PL6ok7%J7J2qj9J6J2j5mj1J2K6j1l3JL5
$$ -17 -18 17 10 -15 -19 1 4 -9 -4 -4 10 15 -10 -6 13 12 -8 -21 -14 22 16 -11 -11 6 18 10 -9 7 19 4 0 -11 1 27 16 -17 -16 19
5197A9kl4K6JoMnk7L3Rm8JM9j3qloQJ4l5OK4pj7%LK9mk5MNMpKpL3j7l5K8K3oj1
$$ 19 17 -17 9 10 4 8 3 -24 9 18 -30 -29 20 7 -1 -4 -10 -2 12 -23 -17 7 0 -17 -17 -14 15 11 -14 -10 -5 -1 -8 -6 -13 20 3 -32 -4 19 13 2
5239Bj9JK7Ol7J2L9j5j7Rj2J8K6o0kN2ol9J1OPjrkJ8klj0PK6k0l4K1PpJ1j9j8
$$ 2 -17 -16 11 17 -20 -8 31 16 -1 8 -4 14 40 -20 -22 30 24 -15 -4 2 9 8 -1 -3 15 13 10 0 7 33 13 -21 0 7 0 11 -8 -26
5277b6L9nm8K7L5k6j4K9j9POk7NM0j8k4K2jJ1qk3K1NPj4j3J8J2j2k8K0K6j4qo
$$ -26 13 8 -40 -13 22 -4 -18 11 -8 -1 5 -22 -17 23 5 -19 3 2 13 5 -18 3 8 15 1 -12 6 18 6 -22 -2 24 10 2 -4
5312dmL8j5k9J8K4k9LJ0j8J8Qm3K5MorJ2lJ3Nl2NK1oj4j6J8K5j6l4K2K3j5j5%
$$ -4 -8 30 15 -14 4 28 -1 2 12 -6 12 20 -23 2 6 0 -9 3 0 13 18 -14 -9 12 6 -8 -24 -6 19 3 -31 -9 14 -1 -16 -16
5348a6J0K1ql0J4J5kj1MJ1j2J6k2JJ9Ll0L5Kj0%j3%K1Ll2oK4J2j7JJNQj6rK1K2
$$ -16 -6 15 7 -23 -9 6 4 -7 -3 8 -4 12 -10 -9 10 13 -17 18 20 10 10 -3 -3 18 21 -11 -17 7 19 2 3 4 9 17 1 -8 13 35
5386C5m2k0J3L0nj8JJ0%lj6OK9k0k3J2K3k1J1j2qK5J8m5nM9j3j7nj0K2J0l0QL2
$$ 35 -7 -27 -14 16 11 -7 -6 4 4 1 -15 -9 20 0 -23 -11 12 -9 2 -10 -18 7 25 -20 -25 24 11 -6 -11 -21 1 11 -19 -11 21
5421B1nj1nMPjk9KN0qk7J6mlLj1j6M4Nl6OkKJ5k8mL9ll9J6Qj1K7k7jJ2nk5POJ0
$$ 21 16 5 0 4 11 10 -19 -17 33 25 -2 14 10 7 10 -1 -17 27 32 -4 2 0 2 17 -11 -15 24 21 -18 -2 6 -5 22 -5 -6 6 1 -24 -17 -11 -1
5462aor%L6j7k3K4j1kK0l3PM1l1j6QJ1MJ1m2QN6l3l0L6k4kL7l1%L6j7l5M3j0k
$$ -1 -7 -16 -16 20 3 -20 4 -7 -9 11 -22 -15 26 -5 -21 -13 -2 2 13 -29 -21 35 2 -28 8 -16 -18 19 -12 -12 24 7 -28 15 5 3
5498CQj6j9L7rl3K4J5j0J5l3J6K3j5j5J6rMK0l2NK1j2k9K8pJ5j6k3J6L6l3kJ7
$$ 3 11 -5 -24 13 4 -29 -5 10 0 15 -18 -2 21 6 -9 7 -2 2 22 -10 -5 16 4 -25 3 -4 11 -5 -28 -12 24 -9 -11 6
5532FpqK2l1j1M2j5j5L1k0LJ1k4J8MMk6K9rMJ2l2J2L0k1k8L1oKK0l8mL9k0j9J7
$$ 6 -1 -9 13 -18 -29 13 -2 -17 14 -6 -3 8 -16 2 6 10 -16 13 4 8 20 -12 0 30 9 -19 12 6 8 28 -10 -14 25 5 -14 3
5568CJ1j2J0l1K0J8k2qJ1Rj3J7k7PJ5%k2QNj0Rk2L1Nk1rK1j1R%j4NL5l9nK5j0
$$ 3 14 2 12 -19 1 19 -3 -11 0 9 -4 13 -14 -7 8 8 -14 -6 -1 -11 -2 -24 7 12 -9 -18 3 -8 1 1 -13 -8 27 -12 -17 8 -2
5605bJ1mj5nM8k0k8J9Qrj8RpK1Jk4K4J0pj3oK3J2k5j0RJ5Jqk1MK4j0k2K0J1j8
$$ -2 9 5 -10 -15 33 13 -15 4 12 3 -15 -6 -13 8 9 -15 9 19 12 -1 -7 16 28 3 -7 2 17 18 10 -11 -7 17 7 -15 5 16 -2
5642brKPJ4qj6NK2j4k2PK2J0k5oPLK3k7OJK2k4KPKPj6j1J1J4rj7K3OqrrJ6QLj5
$$ -2 -11 -9 -2 12 4 -12 -7 15 1 -21 -14 8 18 -7 -13 -6 -3 20 -7 -1 0 22 -2 0 7 9 16 0 -11 0 14 5 -12 11 17 9 0 -9 7 15 18 3
5684COJ3pj2LRMkk4KM3l1k1LK3lrk1K4J0mj7LJ0j3LnKKJ7k6pM4j9kj7J0J4jk6
$$ 3 9 22 15 3 6 15 19 17 -7 -5 38 7 -14 -11 12 9 0 -21 3 13 9 -8 -5 5 -8 -5 -10 -8 -6 11 -15 -22 22 3 1 -16 -6 8 7 -19
5724a9RK8mk2LJ5jj0rJ1J4kj4lRRj0lMMMMj3PJ0qq%J7rqqJJ6rj3J4JojjjK0j3
$$ -19 -10 18 14 -8 -5 10 9 -1 -10 1 15 13 -1 -4 5 14 4 1 5 9 13 17 4 11 21 13 5 5 22 13 5 -3 -2 14 5 -8 6 7 1 0 -1 -2 18 5
5768Ej3OK3j2j6pQ%Lj5RJ1Jj4J3Qm%j7NK2mk0LMQJ1k8KJ9Lk1%J0J1j6kjL8ll8
$$ 5 -8 -2 21 9 -7 -14 -6 -6 -3 -18 -9 2 3 -11 2 10 6 6 -11 -6 16 12 -8 -5 -1 7 18 -10 -8 11 14 -7 -7 3 14 -2 -4 -5 33 30 -8
5809hMJ3J4rj1KJ5onkMNml2J9J9j9KJ2nNj6j0J1K6l4j4K0J6kMk2oL9l7pL5j1J3
$$ -8 -4 9 23 14 3 5 20 14 9 7 11 16 12 -20 -1 18 -1 1 13 8 13 -3 -13 -2 24 -10 -24 -4 12 10 14 -8 -14 25 -12 -19 16 5 18
5848A8j1j8NJ0Jj0%%J3lj1K7Pk5j2LJ3J7k2k0K2M0m2j3J6J2kpk6K5J8k8KJ4jl
$$ 18 7 -11 -6 4 5 -5 -5 -5 8 5 -6 21 28 3 -9 -6 7 24 2 -18 4 44 2 -11 5 17 15 8 -18 7 25 -3 -1 13 12 9
5884Ij0k3K8Kj6mPNJ4%l0K0LqpJ7qLlk2J9K6l1kJ3oJ3Jk2J8J4k0kK1nRk3rK1J3
$$ 9 -1 -24 4 6 -10 -14 -7 -2 12 12 -18 2 5 -3 -10 7 -1 2 -1 -23 -4 22 -9 -11 2 -4 9 10 -12 6 20 0 -2 19 14 23 0 -9 12 25
5924B5j7oLQLj1k1K6J9l3MK3k8J6Kj8MJ8j6j0K9ojj1nJ6Jj8j4J5J4poj2J9Nj7
$$ 25 8 2 5 13 16 5 -16 10 29 -4 0 23 -5 11 13 -5 -1 17 1 -9 20 14 13 2 -3 13 14 -4 -18 -3 11 4 -2 -14 5 10 -7
5961gjNJ1rMj7NL3k8jJ6oqj0nJ6J6j2j4K5%j1Oj6PJ0j4mJ3J3j3rjQJ0rLLj0Qj0
$$ -7 -8 -3 8 -1 3 -14 -9 24 -4 -5 11 5 -3 -13 -18 -2 14 2 -12 13 13 2 8 -8 -1 9 -5 -9 4 17 4 -5 -6 2 12 3 6 9 -1 7 -3
6002cj0L2j1j5KPJmj1rL1Oj9j8K8Pj8mKOKrpK1%mj7JJ3Lj1j2K4J3j8Nj7J8J3j5
$$ -3 -13 19 8 -7 -5 2 3 -1 -12 -21 10 16 -3 -21 7 14 -4 -8 -6 0 2 -7 -14 7 7 3 -14 -13 0 3 -8 -20 4 17 -1 4 -13 5 18 3
6042ClJJ6qqKQOrj8J5K2j5j5J8J%j8KLJ4j2nJ2J0k0qOLNJ7k9%JRqj4K2kj1pLN
$$ 3 0 1 17 9 1 3 11 17 8 -10 5 27 12 -3 15 16 16 -2 0 3 17 5 0 12 22 2 -6 0 3 8 25 -4 -4 -3 6 -2 -16 6 4 -7 -14 -11 -6
6085fNj6KJ6qnnL2k5J9oj3NK1k0j1K4nlRj2qJ5qqK0Kk1R%MK1k0j3RJ4kqpNJ5k2
$$ -6 -1 -17 -15 1 -7 -12 -17 15 -10 9 3 -10 -5 16 -4 -15 9 4 1 10 -2 -10 5 -3 -11 9 11 -10 -1 -1 3 24 4 -9 0 14 12 4 -3 2 17 -5
6127eLOJ1j5mj0RK0k2lK0k3QRorK4j7k4L0opPj0JK2k2j0L4j1okoOK6k0qK3mnK
$$ -5 -2 4 15 0 -4 -14 -5 15 -7 -10 10 -13 -5 4 -2 -11 13 -4 -28 2 -4 -11 -4 -14 -13 9 -13 -23 11 0 -6 -8 -14 -8 18 -2 -10 13 9 4 6
6168FKLKj1j8K1J6rj4qJ5JnRRmj3ooJ5K0m0MJ0Rj7RoRJ2k1jJ2mj5%oPK7k1mK1
$$ 6 8 11 13 2 -16 5 21 12 -2 -10 5 6 1 10 19 15 2 -4 -10 5 25 -15 -11 -1 8 -9 0 -6 3 15 -6 -7 5 1 -14 -14 -20 -13 14 -7 -11 10
6210A0rj4%PjJ2j7MJ0Loj5J1rK3k0J0J9mj9JJ2jRj8lJ5J0j6KNnLlmK4pnj9J8m
$$ 10 1 -13 -13 -6 -7 5 -12 -8 2 5 -1 -16 -5 -14 9 -11 -1 18 14 -5 -4 8 7 16 -2 -5 10 20 4 6 11 6 9 6 2 26 19 14 -5 13 9
6251IkmnPj0lQPJ0oj5pL0j7rj2OJ1Qjk2J8Kk9J5J2qJ2j0k0L2Lj5j1L0j0j5nJ1
$$ 9 7 3 -2 5 -5 -8 0 7 17 11 -4 -11 19 2 -7 -19 -13 -2 6 5 -17 1 3 -26 -11 1 -7 5 -5 -25 7 10 -5 -16 14 4 -11 -16 -5
6290eJ3Mk4j1K2J5pk4J6J6Lk7J6%L%j7MK0mk1rK6lql%LNj0PLJ0j8%lOOj3j0J8
$$ -5 8 12 -12 -23 -1 14 7 -17 -1 15 18 -9 7 7 10 10 -7 -3 17 13 -8 -17 9 6 -2 -5 -5 -2 3 -7 0 3 13 -5 -5 -8 -2 4 -9 -19 -1
6331aJ1k7PQ%J9k7mRlJ0j2%K0nk4QJ0Lqj3J9Ronk0L0j5NnJ6%mmj2K0NnnpJ2%k1
$$ -1 10 -17 -10 -2 -2 17 -10 -14 -5 -8 2 -10 -10 10 5 -19 -11 -1 2 -6 -19 0 9 3 -2 -22 8 -7 -2 -7 9 9 5 1 -11 9 14 9 4 -3 9 9 -12
6374a2LJ2NqjLJ0Ql8%J8Kj2LjJPlj5J1K1l8%K5%mopjK5nk2PJ4mj4%J2Rj0qRL2
$$ -12 -9 3 8 0 -1 2 12 20 -18 -18 0 2 -10 -7 -8 -7 0 -3 -18 -7 14 -24 -24 1 1 -3 -9 -16 -17 8 3 -19 -12 2 -2 -16 -16 -4 5 -5 -13 -4 28
6417B8j8j5qJ8Jj4J3J0Okk5j1K8nqnK4j8RPk8J5J9l2jJ6Lj7NKNJ4l8J1LJ8k3J3
$$ 28 10 -5 -13 5 6 -8 5 15 21 19 -6 -17 11 6 -2 -7 17 -1 8 15 -13 2 21 -11 -12 4 7 -10 -5 -3 2 16 -22 -11 -8 10 -13 0
6455@j1K1j4j0oJ7O%j8j9L5J1k2j0L0k0K%%J2J8m2PK0Knj5PQRj7JL3k1j0pjJ8
$$ 0 -11 10 -4 -14 -20 -3 3 3 -15 -34 1 12 -10 -20 10 -10 -8 -8 -8 4 22 -20 -13 7 9 4 -11 -4 4 13 -4 -3 30 9 -1 -8 -9 9
6493IMk2PK2k4LlkQJ8k8OJ6j7J3nj7K1J7n2JL5ok5J6j8K5mk1J4NRpqLJ6rj6RJ6
$$ 9 13 -9 -2 20 -4 -1 -4 -6 2 20 -8 -2 14 -3 10 5 -12 9 26 -26 -25 10 4 -21 -5 -23 2 -2 -23 -9 -4 5 -2 -10 -7 9 0 -16 -7 9
6533IkKj5pJ5J9m1J7J7qrRj2J4J7j8j0J7Kj5NNMLl0NK7qk7J8j1K3j7qJ3pkPkj0
$$ 9 7 9 -6 -13 2 21 -20 -3 14 6 -3 6 -6 8 25 7 -3 14 16 1 6 11 15 18 -12 -7 20 12 -15 3 -8 15 -2 -10 3 -4 -6 1 -1 -11
6573a1K7j3k2rK3j3J4nLK6k3j9jJ7mMllJ1%k2QJ2JJ0j6LQj3kJ6J3nj1j0RKmj1
$$ -11 16 3 -19 -28 -5 -18 -4 -9 -6 20 -3 -22 -23 -6 -10 -6 -9 -12 -1 -1 -23 -15 -3 -2 8 -8 -5 3 -10 -12 4 17 12 1 -9 0 2 -2 -13
6612a3J1K0oj6MJPlrPKjnmJ1mLj7PJ9j6NjmK8k5j4JK0lj2Lj6K8j3j6PK3roJj0
$$ -13 -2 18 12 -4 0 1 8 5 -4 3 5 4 -1 -5 6 2 5 -12 -5 14 -2 3 2 -2 26 1 -13 -12 8 5 -7 -4 -20 8 -5 -21 -14 9 0 -6 -5 -15
6654a5J7jpJJ4Koj9K2Lk6OQJ3%Jk7J4J1j2k0K3J0Pk2j8K5Oj4kLJ0mKj9RJ7k0J2
$$ -15 2 1 -6 -5 9 11 5 -14 8 11 -15 -9 -1 12 12 13 -14 0 11 -1 -21 2 12 19 -3 -21 4 10 -4 -6 -3 7 3 5 -14 -5 12 -8 4
6693Do%q%j2J2K0k3qJ0J0qLqK2Ll2MJ1KmqKJ4%lpLJ4j0j6J0J7j1N%jQqmj2L3o
$$ 4 -2 -2 -10 -10 -22 -10 10 -13 -21 -11 -1 -9 -6 -14 8 11 -21 -17 -6 -4 -8 -16 -14 0 0 -3 -10 -7 7 -3 -19 -9 8 -3 2 2 1 9 1 -3 -15 18 12
6736A2j5lJ2Lmj5PJ7Oj8rK2mjj2NRoj1QJ%Ll1K1J7k2rQQrJ1j1j3L9nk9J3OJOj8
$$ 12 -3 -6 6 9 5 -10 -3 14 20 2 -7 15 11 10 -2 3 12 6 -5 3 4 4 7 -24 -3 14 -8 -17 -9 -1 -10 1 -10 -23 16 11 -18 -5 1 2 8 -10
6778a0j1K9mj0NKokjJ0J3Lk3jPJ1Lk2LJ9roQMMMj9rL6j8j1nMkJ4j7nK1k1%JkM
$$ -10 -21 8 4 -6 -1 1 -5 -7 -8 2 15 18 -5 -6 1 12 15 -7 -4 15 6 0 8 12 16 20 1 -8 28 10 -1 -6 -2 -4 10 -7 -12 9 -12 -12 -11 -13 -9
6821iJ4k9J1K5j5j1J9Kkj1j7J6Q%j6jK4Pj1oKJJrj0L2j0pj%J4kj7KNkQj6J8K0
$$ -9 5 -24 -13 12 -3 -14 5 7 5 -6 -23 -7 1 1 -15 -16 8 15 4 -2 0 1 2 -7 -17 15 5 -2 -3 -3 11 9 -8 -6 -1 -3 5 -11 7 27
6861B7qj2LJ1j0qj5J2K0nk5J2Pj0lk3K0K2mk1MJ6nj3KnQKj5RJ6j6j2lJ8Lj3Qk
$$ 27 19 7 10 21 11 3 -12 0 20 15 -10 2 9 -1 -4 -27 -7 15 11 -10 -6 10 5 -8 -6 -11 -3 -1 -16 -7 9 -7 -19 -22 -4 -1 -14 -6 -8
6900hJ1j1oLK2o%k1K1j3J2ojqK3nnLJolJMK1j6r%K4j0j1ojRK5k8J2oJ0j5pQJ5
$$ -8 3 -8 -14 -11 11 5 5 -16 5 -8 4 -2 -3 -11 12 7 2 5 6 0 -3 -2 2 23 7 -2 -2 22 12 1 -5 -6 3 28 0 12 6 16 1 -6 2 17
6942A7j1j4RLNj9NJ5Lk2LpJ6Mj8PPPjj3KQmj1jJ4Jj4OoK6j6oJ1j1QRk5K0Pj3q
$$ 17 6 -8 1 4 9 -10 -5 10 13 -9 -6 -13 3 7 -11 -4 3 10 9 -4 -2 6 2 -9 -10 4 5 -9 -3 -9 17 1 -5 6 -5 3 12 -13 7 14 1 -7
6984gRRj3J2pnPjj3LMNjqOJ5j8J%LMmJ0j2J9k2j2RJ9j3j1LOJqkJ2MkorJ8kj2L
$$ -7 2 11 -2 10 3 -2 5 4 -9 -6 -2 3 2 -6 0 15 -3 -2 -2 1 5 1 11 -1 18 -4 -16 -7 12 -1 -12 -9 -3 -2 -10 -12 0 4 2 -4 -13 5 3 -9 -6
7029fjJ4J0k2j7K5l%lNNnLj2NK2ok0J6Pkj1kqJ1Nj8RK6j3k5QKJ0Mj0j2J6j0J3
$$ -6 -7 7 17 -5 -22 3 0 0 -3 2 7 2 5 -7 -2 20 14 -6 10 17 15 4 2 -6 5 10 -8 1 27 14 -11 -3 -1 9 13 3 -9 7 -3 10
7069A0j3J4Nj3pJJ5mj0j5J5LPj4PKjj3QJJ7qj7J5KKm%MOmj4J1Opk0J4J4jkj7O
$$ 10 -3 11 16 3 -4 -3 12 8 -2 -17 -2 1 8 -6 1 3 2 -11 -3 -2 15 7 -10 5 7 9 5 5 9 15 11 -3 8 14 7 -13 1 15 14 12 -5 1
7111AJ3qmQj0K0j8j4LK9j1k0RPkoKnJLolJ9j3Rj7nK2o%lrJ8j5lK2koqOjK5j3l6
$$ 1 14 6 2 10 0 20 2 -12 -9 20 9 -11 -2 5 3 -3 -1 -6 -5 -2 -8 -11 8 -5 4 -13 -18 4 -2 -2 -5 -14 4 -11 -14 8 6 0 -8 -2 -3 22 9 -27
7155b7K6J7j3JQnJPk1J7J1j5j2J0%mNj7K0lJ1j9KK6k6j1NPP%nMj5K0j7mK1nk3
$$ -27 -1 16 3 4 12 7 8 15 -6 11 22 7 -5 5 5 1 6 -11 9 6 17 -2 0 26 0 -11 -6 1 8 8 3 7 -8 12 -5 -9 12 7 -16
7194a6PJ1qMK0l6KL3j3j8J7Lk5J5j0J3J9j7j0NJ6pLj4PmMj9K2LpPj4J8J1j6lJ
$$ -16 -9 2 -6 -2 18 -18 -16 17 4 -14 3 6 -19 -4 -14 -1 18 1 -9 -4 12 5 8 -6 1 -3 1 -18 4 7 0 7 -7 11 22 6 3 4
7232DNNPj5JJ7j1j6J0MLqj0QJ2j1koJ6mj8JK1Ql6J0J2j3K3k0j1J2J1pLQnj6QR
$$ 4 9 14 21 6 7 24 13 -3 7 11 14 6 -4 4 16 5 3 -3 13 9 -9 -8 13 21 -15 -5 7 -6 17 -3 -14 -2 9 2 5 13 8 -8 0 9
7272Ij6J4pk0K1J4mj5RmjJ0k7K1KNj9J0NPj4PPj1J1k3LK7nj2kNl%NrOJ5oj8J4
$$ 9 -7 7 0 -20 1 15 11 -4 5 1 0 10 -17 4 6 11 -8 2 7 14 0 7 14 3 14 -9 -6 21 16 4 2 7 4 4 9 0 6 21 15 -3 11
7313A1J2k9j0J4nJ2J7l2pK6qj1OkJ4j3j9J9J9nrjNMlnMJ4k8QJ9KJ4k7nJ0J1qr
$$ 11 23 -6 -16 -2 -7 5 22 -10 -17 9 1 -10 -4 -6 8 -5 -24 -5 14 9 0 -1 4 8 5 0 4 18 -10 -2 17 19 33 6 1 11 22 14 5
7352EJ6j1mQj4J3J6j7jjLnj1oJ3J5qqLljj2j3J7J5j3j2J9LMj0j3OJ4j0nJ8j0J4
$$ 5 21 10 6 14 0 13 29 12 11 10 13 8 -3 -9 4 19 11 3 6 3 2 -10 -23 -6 9 -4 -16 3 6 10 0 -13 -7 7 -3 -8 10 0 14
7391A4pk5J7J7j3j9K5Olj4JRKnpJ1JJ7k3j8K7Mk1MJ9j2jJ0l1K1J8k0j6K4jrJk
$$ 14 7 -18 -1 16 3 -16 9 15 12 -2 -1 8 10 5 -2 9 10 27 4 -14 13 17 -4 0 19 7 6 16 -15 6 24 4 -12 12 11 2 3 1
7429AMJ9k3oJ1J1nj5NLPj6oJ2PNj7oK1nk6mJ9nJ9j0j0J8Lj1nK2j2j7RoJK0Lk1
$$ 1 5 24 1 -5 6 17 12 -3 2 5 12 -4 -10 2 9 14 -3 -9 12 7 -19 -23 -4 -9 10 0 -10 8 11 0 -5 17 5 -12 -3 -9 -8 12 15 -6
7469fJ4MorOJ5%l1K8j5J1jk0LK2%k0kJ8noJ6j7J8mj7qJ7J%k1J5%MOj8QqKkJJ4
$$ -6 8 12 6 -3 3 18 18 -13 15 0 11 10 -10 -7 15 15 -5 -7 11 6 0 16 -1 17 13 -4 -12 5 6 6 -15 0 0 4 10 -8 0 -8 -6 -8 -7 7
7511GoMLjj1J2j6%K1j2j0J2RrLklJ2lj7NK5%j2RLj2Ooj2RKMk2K8Mj7K0k6OMlj6
$$ 7 1 5 8 7 -4 8 -8 -8 13 1 -9 3 12 3 6 4 1 13 10 -7 -2 23 23 11 20 23 11 17 11 -1 8 10 14 -8 20 24 7 27 1 7 11 8 -8
7554hQJ3%k7J2%J0lqj2J8Rj6qJ2Lj6Rj0J3J0j3rJ6Kj1rJ7Jnj5J9oJ6j9J0klmq
$$ -8 0 13 13 -14 -2 -2 8 5 -3 -15 3 12 -4 -12 0 3 -13 -4 -14 -1 9 -4 -13 3 5 -6 -15 2 3 -2 -17 2 -4 12 -7 3 1 -2 -6 -14
7594a4J2P%pjROlKj4J3J5l2MJ5Ok7QJ3pJ6j1j6J2Jj0PP%Jj2%qJ1qnRRooj5NK4
$$ -14 -2 5 5 -2 -3 6 12 9 11 -3 10 25 -7 -3 12 18 -9 -1 12 5 21 10 -6 6 7 -3 4 11 11 12 0 0 -8 3 -5 -10 -1 8 2 -4 -19 -14 10
7637A0rno%J5pmJ7j1q%Rj2K4j6qJ1klNJ7rkrJJ4J0j8j5J0OPJj4K2%k5NKjJ2Lk1
$$ 10 1 -4 -10 -10 5 -2 -6 11 0 -8 -8 1 -11 13 -3 -11 0 -2 -5 0 17 8 6 -3 -2 12 22 4 -11 -1 5 12 13 -1 21 21 -4 1 3 2 14 17 -4
7680dJ1Nj6JLKjPj6J7Jk7K0KmpKomMOoRJ0j3mMJ2llpjLJ7oj9K2pmpJ2j4K3rj4
$$ -4 7 12 -4 -3 0 2 1 8 -8 9 10 -17 3 5 1 -6 -4 -10 -14 -10 -4 -10 -1 9 -4 -8 -4 8 5 2 -5 -6 -3 14 8 -11 11 4 0 -7 5 -9 14 5 -9
7725iJ8Jj1OJ1pLj1jNLj6JJ2J%k0J4J0%qJ4j3joo%K8j0j3JJ0qJ%j5J4jj4QJ6k1
$$ -9 9 10 -1 5 16 9 12 1 0 5 8 -8 -7 5 6 6 -14 0 10 10 2 16 3 2 -4 -10 -10 18 8 -5 -4 6 -2 -1 -1 -16 -2 -3 -17 -9 7 -14
7767a4J8j3PJK0j9kjmNJK%NpqJ2OloKQjj3J2k%Pj3jJ5jk7NK4j3J0j6MlJ9l0kJ6
$$ -14 4 -9 -2 -1 19 0 -2 -3 -7 -2 -1 1 1 6 -1 -9 3 9 6 0 2 10 9 -4 8 6 6 13 0 -1 14 13 -14 -9 15 2 12 -4 0 -3 16 -14 -16 0
7811@Rj4%oJ1kj6J7j0Pj4J1kJ4Kk2K1Oj3koKRnkNJqK2j0rJ4Kj5oL0k3jMj1L2j4
$$ 0 9 -5 -5 -11 0 -2 -18 -1 -11 -4 -18 -7 -9 5 7 -15 6 12 -1 -3 -9 -7 2 -3 -5 0 1 -7 15 5 -4 10 12 -3 -9 21 -2 -3 1 -10 22 8
7853Hj3RJ2rpLpJ6ok7K2knmOrK7k0j9J3QmlqJ0Mj4LJ0nklNQLjl2K9kPjrRJ5pj2
$$ 8 -5 4 16 7 0 3 -4 12 6 -21 1 -1 -6 -10 -4 -13 14 -6 -25 -12 -4 -8 -11 -19 -9 -5 -19 -16 -6 -11 -13 -16 -11 -3 0 -1 -33 -4 -6 1 0 -9 0 15 8 -4
$$ [...]
8191a1
##END NTUPLES=NMR FID
##END=
