##TITLE=1H_LY-810.1
 CCl4, 8 sc, 
 4.4.2019
##JCAMPDX= 6.0         $$ Bruker NMR JCAMP-DX V2.0
##DATA TYPE= NMR FID
##DATA CLASS= NTUPLES
##ORIGIN= UXNMR, Bruker Analytische Messtechnik GmbH
##OWNER= root
$$ XWIN-NMR		Version 3.5
$$ Thu Apr  4 15:40:49 2019 Russian Standard Time (UT+4h)  she@DPX200
##.OBSERVE FREQUENCY= 200.1316
##.OBSERVE NUCLEUS= ^1H
##.DELAY= (6, 6)
##.ACQUISITION MODE= SIMULTANEOUS
##.ACQUISITION SCHEME= undefined
##.AVERAGES= 8
##.DIGITISER RES= 18
##SPECTROMETER/DATA SYSTEM= spect
##.PULSE SEQUENCE= zg30
##.SOLVENT NAME= CDCl3
##.SHIFT REFERENCE= (INTERNAL, CDCl3, 0, 15.7039)
##AUDIT TRAIL= $$ (NUMBER, WHEN, WHO, WHERE, WHAT)
$$ ##TITLE= Audit trail, XWIN-NMR		Version 3.5
$$ ##JCAMPDX= 5.01
$$ ##ORIGIN= Bruker BioSpin GmbH
$$ ##OWNER= she
$$ F:/spectra/data/she/nmr/H-F/1/audita.txt
$$ ##AUDIT TRAIL=  $$ (NUMBER, WHEN, WHO, WHERE, WHAT)
(   1,<2019-04-04 15:39:23.45 +0400>,<she>,<DPX200>,
      <created by zg, POWCHK disabled, PULCHK disabled
       configuration hash MD5:
       00 E9 B6 7A A2 85 ED C7 34 08 36 98 17 FE 4E 26
       data hash MD5: 16K
       7D 79 2B 60 25 6C 68 78 BA E3 3A 62 07 0C 1A 23>)
$$ ##END=
$$ 
$$ hash MD5
$$ 7D C3 93 B7 CC EC 2A DE DD 91 6B 6F 9F 86 41 A1
##$RELAX= 
##$RELAX= 
##$RELAX= 
##$RELAX= 
##$RELAX= 
##$RELAX= 
$$ Bruker specific parameters
$$ --------------------------
##$DU= <F:/spectra>
##$EXPNO= 1
##$NAME= <H-F>
##$PROCNO= 1
##$TYPE= <nmr>
##$USER= <she>
##$AMP= (0..31)
100 100 100 100 100 100 100 100 100 100 100 100 100 100 100 100 100 100 
100 100 100 100 100 100 100 100 100 100 100 100 100 100 
##$AQSEQ= 0
##$AQ_mod= 1
##$AUNM= <au_zg>
##$AUTOPOS= <>
##$BF1= 200.13
##$BF2= 200.13
##$BF3= 200.13
##$BF4= 200.13
##$BF5= 200.13
##$BF6= 200.13
##$BF7= 200.13
##$BF8= 200.13
##$BYTORDA= 1
##$CFDGTYP= 0
##$CFRGTYP= 5
##$CHEMSTR= <none>
##$CNST= (0..31)
1 1 145 1 1 1 1 1 1 1 1 1 1 1 1 1 1 1 1 1 1 1 1 1 1 1 1 1 1 1 1 1 
##$CPDPRG= <>
##$CPDPRG1= <>
##$CPDPRG2= <>
##$CPDPRG3= <>
##$CPDPRG4= <mlev>
##$CPDPRG5= <mlev>
##$CPDPRG6= <mlev>
##$CPDPRG7= <mlev>
##$CPDPRG8= <mlev>
##$CPDPRGB= <>
##$CPDPRGT= <>
##$D= (0..31)
0 1.2 0 0 0 0 0 0 0 0 0 0.03 0 0 0 0 0 0 0 0 0 0 0 0 0 0 0 0 0 0 0 0 
##$DATE= 1554377963
##$DBL= (0..7)
120 120 120 120 120 120 120 120 
##$DBP= (0..7)
150 150 150 150 150 150 150 150 
##$DBP07= 0
##$DBPNAM0= <>
##$DBPNAM1= <>
##$DBPNAM2= <>
##$DBPNAM3= <>
##$DBPNAM4= <>
##$DBPNAM5= <>
##$DBPNAM6= <>
##$DBPNAM7= <>
##$DBPOAL= (0..7)
0.5 0.5 0.5 0.5 0.5 0.5 0.5 0.5 
##$DBPOFFS= (0..7)
0 0 0 0 0 0 0 0 
##$DE= 6
##$DECBNUC= <off>
##$DECIM= 24
##$DECNUC= <off>
##$DECSTAT= 4
##$DIGMOD= 1
##$DIGTYP= 9
##$DL= (0..7)
0 120 120 120 120 120 120 120 
##$DP= (0..7)
150 150 150 150 150 150 150 150 
##$DP07= 0
##$DPNAME0= <>
##$DPNAME1= <>
##$DPNAME2= <>
##$DPNAME3= <>
##$DPNAME4= <>
##$DPNAME5= <>
##$DPNAME6= <>
##$DPNAME7= <>
##$DPOAL= (0..7)
0.5 0.5 0.5 0.5 0.5 0.5 0.5 0.5 
##$DPOFFS= (0..7)
0 0 0 0 0 0 0 0 
##$DQDMODE= 0
##$DR= 18
##$DS= 0
##$DSLIST= <SSSSSSSSSSSSSSS>
##$DSPFIRM= 0
$$ [...]
##$SUBNAM2= <"">
##$SUBNAM3= <"">
##$SUBNAM4= <"">
##$SUBNAM5= <"">
##$SUBNAM6= <"">
##$SUBNAM7= <"">
##$SUBNAM8= <"">
##$SUBNAM9= <"">
##$SW= 24.9336934301222
##$SWIBOX= (0..15)
0 0 2 0 0 0 0 0 0 0 0 0 0 0 0 0 
##$SW_h= 4990.01996007984
##$TD= 16384
##$TD0= 1
##$TE= 0
##$TE2= 300
##$TE3= 300
##$TEG= 300
##$TL= (0..7)
0 120 120 120 120 120 120 120 
##$TP= (0..7)
150 150 150 150 150 150 150 150 
##$TP07= 0
##$TPNAME0= <>
##$TPNAME1= <>
##$TPNAME2= <>
##$TPNAME3= <>
##$TPNAME4= <>
##$TPNAME5= <>
##$TPNAME6= <>
##$TPNAME7= <>
##$TPOAL= (0..7)
0.5 0.5 0.5 0.5 0.5 0.5 0.5 0.5 
##$TPOFFS= (0..7)
0 0 0 0 0 0 0 0 
##$TUNHIN= 0
##$TUNHOUT= 0
##$TUNXOUT= 0
##$USERA1= <user>
##$USERA2= <user>
##$USERA3= <user>
##$USERA4= <user>
##$USERA5= <user>
##$V9= 5
##$VALIST= <valist>
##$VCLIST= <CCCCCCCCCCCCCCC>
##$VD= 0
##$VDLIST= <DDDDDDDDDDDDDDD>
##$VPLIST= <PPPPPPPPPPPPPPP>
##$VTLIST= <TTTTTTTTTTTTTTT>
##$WBST= 1024
##$WBSW= 4
##$XGAIN= (0..3)
0 0 0 0 
##$XL= 0
##$YL= 0
##$YMAX_a= 30912
##$YMIN_a= -38229
##$ZGOPTNS= <>
##$ZL1= 120
##$ZL2= 120
##$ZL3= 120
##$ZL4= 120
##$ABSF1= 10
##$ABSF2= 0
##$ABSG= 5
##$ABSL= 3
##$ALPHA= 0
##$AQORDER= 0
##$ASSFAC= 0
##$ASSFACI= 0
##$ASSFACX= 0
##$ASSWID= 0
##$AUNMP= <proc_1d>
##$AZFE= 0.1
##$AZFW= 0.1
##$BCFW= 1
##$BC_mod= 2
##$BYTORDP= 1
##$COROFFS= 0
##$CY= 11.3945322036743
##$DATMOD= 1
##$DC= 2
##$DFILT= <>
##$DTYPP= 0
##$F1P= 18.9103706918063
##$F2P= -1.10871071338519
##$FCOR= 0.5
##$FTSIZE= 0
##$FT_mod= 4
##$GAMMA= 1
##$GB= 0.15
##$INTBC= 1
##$INTSCL= 1
##$ISEN= 128
##$LB= 0.24
##$LEV0= 0
##$LPBIN= 0
##$MAXI= 10000
##$MC2= 0
##$MEAN= 0
##$ME_mod= 0
##$MI= 1.114404
##$NCOEF= 0
##$NC_proc= 0
##$NLEV= 6
##$NOISF1= 3.799351
##$NOISF2= 2.8
##$NSP= 1
##$NTH_PI= 0
##$NZP= 0
##$OFFSET= 15.70392
##$PC= 1
##$PHC0= -8933.531
##$PHC1= 19.60024
##$PH_mod= 1
##$PKNL= yes
##$PPARMOD= 0
##$PSCAL= 0
##$PSIGN= 0
##$REVERSE= no
##$SF= 200.130013532006
##$SI= 16384
##$SIGF1= 3
##$SIGF2= 2
##$SINO= 400
##$SIOLD= 16384
##$SREGLST= <1H.CDCl3>
##$SSB= 0
##$STSI= 0
##$STSR= 0
##$SW_p= 3612.71676300578
##$SYMM= 0
##$S_DEV= 0
##$TDeff= 0
##$TDoff= 0
##$TI= <>
##$TILT= no
##$TM1= 0
##$TM2= 0
##$TOPLEV= 0
##$USERP1= <user>
##$USERP2= <user>
##$USERP3= <user>
##$USERP4= <user>
##$USERP5= <user>
##$WDW= 1
##$XDIM= 8192
##$YMAX_p= 0
##$YMIN_p= 0
$$ End of Bruker specific parameters
$$ ---------------------------------
##NTUPLES= NMR FID
##VAR_NAME=  TIME,          FID/REAL,        FID/IMAG
##SYMBOL=    X,             R,               I
##VAR_TYPE=  INDEPENDENT,   DEPENDENT,       DEPENDENT
##VAR_FORM=  AFFN,          ASDF,            ASDF
##VAR_DIM=   8192,          8192,            8192
##UNITS=     SECONDS,       ARBITRARY UNITS, ARBITRARY UNITS
##FACTOR=    0.0002004,     1,               1
##FIRST=     0,             0,               0
##LAST=      1.6414764,     0,               0
##MIN=       0,             -38229,          0
##MAX=       1.6414764,     30912,           0
$$ Real data points
##PAGE= N=1
##DATA TABLE= (X++(R..R)), XYDATA
0@%%%%%%%%%%%%%%%%%%%%%%%JnJ1j5J6j6J6j6J6j6J7k1K4k7L1l2L6m0M3m8N3n8
$$ 0 0 0 0 0 0 0 0 0 0 0 0 0 0 0 0 0 0 0 0 0 0 0 0 1 -4 7 -8 8 -8 8 -8 8 -8 9 -12 12 -15 16 -16 20 -20 23 -25 28 -30
45c0O6p3Q1r5J09j26J48j77K17k73L57m95P40j242K620j1802k8254O0932j0923
$$ -30 36 -37 44 -51 58 -68 80 -97 120 -153 204 -291 449 -793 1827 -9975 -38229 22703 11780
64A1780m3215N2125Kn2078L1815J7334l5120K0228J5575k9793N278J1022j1455
$$ 11780 -31435 20690 20692 -31386 429 17763 -17357 2871 18446 -11347 -6069 4953 -6502
77f502J1198K695j3649Q314k476r406J6933m95j3856J1334j958j2676J2758M032
$$ -6502 4696 7391 -6258 2056 -420 -9826 7107 6612 -7244 4090 2132 -10544 2214 6246
91F246q142M650m228l696Q447n446J664J0911j5675l079J7835j4012l660K4551
$$ 6246 -1896 2754 -1474 -5170 3277 -2169 -505 10406 -5269 -8348 9487 -4525 -8185 16366
105A6366j5373j6254K3046n698j3752K2098l248j8129J3173j128r062J5306l221
$$ 16366 993 -15261 7785 2087 -11665 10433 7185 -10944 2229 1101 -7961 7345 4124
118D124r406J0878j0525n353K3234j0230j3848K2870j0995k0030K9764P98k6665
$$ 4124 -5282 5596 -4929 -10282 12952 2722 -11126 11744 749 -19281 10483 11281 -15384
131a5384K1636N576l0263J5872J8647k2928K999J4924j7247k250J5424n066m255
$$ -15384 6252 11828 -18435 -2563 16084 -6844 -3845 11079 -6168 -8418 7006 1940 -2315
144b315N092k915k591J81K634N751n527m660P300m687m254J2990l090j0559R674
$$ -2315 2777 -138 -2729 -2548 86 5837 310 -4350 2950 -1737 -5991 6999 3909 -6650 3024
159C024j576r883J2287K555j1416O854N8j0339J0946M269j1730O544K463j2468
$$ 3024 1448 -8435 3852 6407 -5009 1845 1903 -8436 2510 6779 -4951 1593 4056 -8412
173h412P987P698j1073L863N824j2004J891J0064n854j182M577n502j001M218
$$ -8412 -425 7273 -3800 63 5887 -6117 -4226 5838 -16 -1198 3379 -2123 -3124 1094
187A094p88J453n21l425K906j660k944Q489q63r151O436J662r135P793N639j1228
$$ 1094 306 1759 1238 -2187 719 -941 -3885 4604 3741 -5410 1026 2688 -6447 1346 6985 -4243
203d243K573O475r480J418R691n923l417M976l627j533N633m51k360O5j123O45
$$ -4243 -1670 4805 -4675 -3257 6434 511 -2906 2070 -1557 -3090 2543 2092 -268 -203 -1326 -681
219f81M20K71L192k448m471L855N41k827N332m18p101L919K582n403M249L495
$$ -681 -261 10 3202 754 -3717 138 679 -2148 3184 2766 -4335 -416 2166 -3237 1012 4507
235D507p030P32L664m450K160M843n000j774L314k061J9L310j408j358M47j187
$$ 4507 -2523 -1791 1873 -2577 -417 4426 -574 -2348 966 -1095 -1076 2234 826 -532 -85 -1272
251a272N34J440K90N36k189j810K939J26j406L115j349m090L237Q76l047M024
$$ -1272 -738 702 992 1528 -661 -2471 468 594 -812 2303 954 -3136 101 977 -2070 1954
267A954J184o046J167L254k806J743K748m421j023L159j428j59K914j292k366
$$ 1954 3138 -2908 -1741 1513 -1293 450 3198 -1223 -2246 913 -515 -674 2240 948 -1418
282a418M02N24P18Q93j35r26j541L30K181o32p05J928j656k479K746Q59j789K090
$$ -1418 -1016 -492 226 1119 984 58 -1483 -1153 1028 396 -309 1619 -37 -2516 230 1089 -700 1390
300A390j82l791J730K532k192N08J795k525q68J943l58N3J444j092j776L99J153
$$ 1390 1208 -2583 -853 1679 -513 -5 1790 -735 -1603 340 -18 35 1479 387 -1389 -990 163
317A63O13k32l25j42j035q0J698J04o20O84j326j643K374J449j682J82J46j910
$$ 163 776 544 219 77 -958 -1038 660 764 144 828 -498 -2141 233 1682 0 182 328 -1582
335a582Q92J970j009k46Q42j669p86J957O78o15j37p97o01R90Q66k35m19k17j73
$$ -1582 -690 1280 271 25 867 -802 -1588 369 1047 432 295 -502 -1103 -113 753 518 99 -118 -291
354b91l24K54J152J06j159k51K05j84Q81O43j253l66R09n80m50J320J71j045Q8
$$ -291 -615 -361 791 897 -262 -513 -308 -492 389 1032 -221 -587 322 -258 -708 612 783 -262 -174
373a74on48R11R07j050o97P60j19o12Q33O84q41m38L04m83K63J472m84j663O18
$$ -174 -180 -728 183 1090 40 -657 103 -16 -628 205 889 48 -390 -86 -569 -306 1166 682 -981 -363
393c63P11q96O30J059j364n26J093p72k56K028n03k138Q91R19r81P30P84j654
$$ -363 348 -548 82 1141 -223 -749 344 -428 -684 1344 841 -1297 -406 513 -468 262 1046 -608
411f08j45J398p95n07J565k60j617N99Q35p08L52O55j214l52J465l43j160J124
$$ -608 -753 645 -150 -657 908 648 -969 -370 465 -243 109 764 -450 -802 663 320 -840 284
429B84N03j370K76P79r28K85J086j177n29J406m32r54J061K58q46K77J3n79P55
$$ 284 787 -583 -307 472 -456 -171 915 -262 -791 615 183 -771 290 548 -298 -21 -8 -587 168
448A68N79p86m27L04K14N3p6J11L8m86J4M33j49K81K48j106j46J301j73o79N08
$$ 168 747 -39 -466 -162 52 105 29 140 178 -308 -294 139 -10 271 519 -587 -733 568 395 -284 224
469B24k55m77P52L3o05M91J91o97jN08J67k34l84J79K61k46K30M2o61N86N70j268
$$ 224 -31 -508 244 277 -328 163 354 -343 -344 164 331 97 -287 -108 153 -93 137 179 -482 104 674 -594
491e94J09J290q54m86J123p15n38J352n31j014J388O5j442P21O46p74M25J67r91
$$ -594 -485 805 -49 -535 588 -127 -665 687 156 -858 530 595 -847 -126 520 -254 171 338 -653
510f53M10Q77n65l68M02m4j94QK09J46k52p6O3l03M82N68j047l34J152l56n72
$$ -653 -243 634 69 -299 103 59 -135 -127 82 228 -24 -100 -37 -340 142 710 -337 -671 481 125 -447
531d47R48l89q16J147j12j233J172O18j566K93J021r22R3Q53j003j95J250n81
$$ -447 501 112 -704 443 331 -902 270 888 -678 -385 636 -286 -193 660 -343 -538 712 131
549A31q37R37K02p20K77J06m07L73L69o08j77N72j6m88J53M03k03k48J63l1j2
$$ 131 -706 231 433 -287 -10 96 -311 62 431 -177 -354 218 202 -286 -133 270 67 -181 -18 -49 -61
570f1M13k26o81M20O63n04k75M09k24j86N06j76l17N48j11p49M29N97l76j44m8
$$ -61 352 126 -555 -135 528 24 -251 158 -66 -252 254 78 -239 309 198 -551 -122 475 99 -45 -93
591i3k08M33K08n45J38L31m21J21J86n28M91M84j061J20J007q34l15J019o28k56
$$ -93 -301 132 340 -205 -67 264 -157 -36 150 -378 113 597 -464 -344 663 -171 -486 533 -95 -351
611c51J117r14p97J539j05j066Q55j59p58J096j90r41J102l5j174R30K31q18Q41
$$ -351 766 -148 -945 594 489 -577 278 119 -639 457 267 -674 428 393 -781 149 380 -438 403
630D03k08j124J206M52j227M73J53o64R14n4q61R23k42r08J150j80p29J422q33
$$ 403 195 -929 277 729 -498 -25 128 -536 378 324 -537 386 144 -764 386 206 -523 899 66
649F6j507K172N3j933J702J38k055J806N06k296J575R66k211R15Q37j610J195
$$ 66 -1441 731 784 -1149 553 691 -1364 442 948 -1348 227 1193 -1018 -103 734 -876 319
666C19M00j832J510N07k153J475N75k047J905N09k963J871J472k946J243J676
$$ 319 719 -1113 397 904 -1249 226 801 -1246 659 1168 -1795 76 1548 -1398 -155 1521
682A521k759R16J768k594P11J969k314J71J620j673N76J124k076P61J506j957
$$ 1521 -1238 -322 1446 -1148 -437 1532 -782 -611 1009 -664 -88 1036 -1040 -279 1227 -730
698g30M66J175j765P60J098j926Q37J153j913P14Q44j634J361N24k476J728J170
$$ -730 -264 911 -854 -94 1004 -922 -85 1068 -845 -131 713 -921 440 964 -1512 216 1386
715A386k888J523J533l162J538K115l706P72L139l166l25L109k308q01K663j694
$$ 1386 -1502 21 1554 -1608 -70 2045 -1661 -889 2250 -916 -1241 1868 -440 -1241 1422 -272
731b72q32K394j192j029J442p35QJ128j530J73J462j653J59J645j754M8J777j912
$$ -272 -1104 1290 98 -931 511 -224 -216 912 -618 -445 1017 -636 -477 1168 -586 -538 1239 -673
749f73k16K278j479q77J743r25m11J484j232l59J553j120l59J405j149j56J518
$$ -673 -889 1389 -90 -967 776 -149 -560 924 -308 -667 886 -234 -593 812 -337 -493 1025
766A025j464m25J957j031r26J464n39n60J088o95m21J055n75j68O10r37N38R49
$$ 1025 -439 -864 1093 62 -864 600 61 -499 589 -106 -527 528 -47 -215 395 -542 -4 945
784I45j753L40J777j849l87K161j453q23K334j182j626K325L9j946J190O13j303
$$ 945 -808 -468 1309 -540 -927 1234 -219 -1042 1292 110 -1516 809 848 -1098 92 705 -598
801e98M78N57o73J75L29k81k19k3N71J08r04K56O99p23J6P07o67m4O89p19j26
$$ -598 -120 437 -236 -61 268 -13 -232 -255 316 424 -480 -224 475 -248 -232 475 -192 -236 453 -266 -392
822c92Q49l49k77K55m46M00N13r04Q9P95p75p2P60n96m9O92o66k94P70q9k78J
$$ -392 457 108 -169 86 -360 40 553 -351 -262 533 -242 -314 446 -150 -199 493 -173 -467 303 214 -64 -63
844f3j52M50o5n70O13P4p68P38Q8j167J019O74j573L76J123j132q8R40o84m1O95
$$ -63 -215 235 170 -400 213 287 -481 257 345 -822 197 871 -702 -326 797 -335 -423 517 -167 -208 487
865D87o42k23M96KJ18k98l59P54k23p00R46Qr18Q97j39j130J350L40j547Q10N09
$$ 487 -155 -378 118 120 238 -60 -419 335 112 -588 358 366 -552 345 206 -924 426 766 -781 29 538
886E38j212Q48L87j329R88N31j597P60Q35j356O61O53j550P31J083j584J94J206
$$ 538 -674 174 561 -768 220 751 -846 -86 749 -607 54 707 -843 -112 971 -613 -419 787
904G87j073J9Q05r10J99P81q86J0N84m90L30N8p87P60L01j104P14M59j124O96
$$ 787 -286 -267 538 -372 -173 608 -278 -268 316 -174 156 214 -573 187 488 -616 98 557 -567 129
924A29L53j359R40Q84j549L52Q89j183L96Q11j198M42Q97j380J15J050q42J87
$$ 129 482 -877 63 947 -602 -250 639 -544 -148 663 -535 -93 804 -576 -461 589 -253 -66
942f6P07j189K40R89j046L8J020q31j10O28q58K36R90q70k01O79o34J17O09p74
$$ -66 641 -548 -308 681 -365 -327 693 -138 -248 380 -478 -242 748 -122 -323 356 -278 -161 448 -326
962c26K41P67j080p7R85o04m6P20r35j09J089o83m18R30l63m52O05l35j89P34
$$ -326 -85 682 -398 -475 510 -94 -140 580 -355 -464 625 -58 -476 454 91 -361 244 -91 -280 454
982D54l78m80M84rp9J94l80O9M28m90k8N35l78j7L32o66J13R43o33m36P55m11
$$ 454 76 -404 80 71 -8 186 -194 -125 303 -187 -215 320 -58 -75 257 -409 -296 647 14 -422 333 -78
1004g8l36Q16l50m15Q27l38q25P74L57n69K42jn37M25L34m60P1L20k78k34J39
$$ -78 -414 402 52 -363 464 126 -699 75 432 -137 105 104 -433 -8 326 -134 -63 257 -21 -255 -116
1025a16K06J18j39j40o0m7L22J29m98R8M73m93k24O41j19l06L93l21m23Q15J28
$$ -116 90 208 69 -71 -131 -178 144 273 -225 -127 346 -147 -371 270 151 -155 238 -83 -506 309 437
1046D37q48L52M11o39J18M87m22J1M38n31k96P12J37n30L4J85j89O7K68j71j69
$$ 437 -411 -59 352 -287 -169 318 -104 -93 345 -186 -482 230 367 -163 -129 56 -133 -66 202 31 -138
1067a38K91q9m73L47N50m59l50L90j04j67N37j67n84M94K32p04K65O32n03k44
$$ -138 153 64 -409 -62 488 29 -321 69 -35 -202 335 168 -416 78 310 -394 -129 503 0 -244
1087b44L44k30l9N66k28n74L87K91m59K3M27j73k61J93l8k04M36J48o59MN85k61
$$ -244 100 -130 -169 397 169 -405 -18 273 -186 -163 264 91 -170 23 -15 -219 217 365 -294 -290 295 34
1109C4k85M82j03l99L76l2m45N43L20p79o3N86j97j69L39j99k70L47K2l58K67
$$ 34 -251 231 128 -271 105 73 -372 171 491 -288 -351 235 38 -131 208 9 -261 86 108 -250 17
1130A7L85m35l72M43J27k54K09J4m91K85M82n93q3P29l79n79O11J02m44M65J0
$$ 17 402 -33 -405 38 165 -89 120 134 -357 -72 410 -183 -266 463 84 -495 116 218 -226 239 249
1151B49p70M36N62o23r9N64k84l22L54J2k01K76M9m84NN71n6n14K73K78m96O3
$$ 249 -521 -85 477 -146 -245 319 35 -287 67 79 -122 154 203 -281 -276 295 239 -275 -2 276 -220 -157
1173a57M55m22k3O15o00m41R17Np23M53J35n84M22K71o16K57M50n86j68M81J5
$$ -157 298 -124 -147 468 -132 -573 344 349 -374 79 214 -370 52 323 -293 -36 414 -172 -340 141 156
1194A56j32j0r3m6J45J25j26k06K87J34n46J18O15m40j90N20n20j47R25m81o73
$$ 156 24 14 -79 -125 20 145 19 -187 100 234 -312 -194 421 -19 -209 311 -209 -356 569 88 -585
1215e85R26o9q29O89J80o58N42R7q21M76M94n55K5J87j84J47p3j44L82j72k25
$$ -585 341 272 -557 132 312 -346 196 293 -528 -52 442 -113 -88 99 -85 62 -11 -155 227 55 -170
1236a70L33l70k3Q20n88n78R66k72o62R39j88p52R62j74j008J006K86r78N14J50
$$ -170 163 -207 -230 590 2 -576 390 118 -544 395 207 -545 417 243 -765 241 527 -451 63 213
1256B13o74O47J30p19N16J28n71M10q0k02O68m79n13Q85l03m43R67o57n83J370
$$ 213 -461 186 316 -403 113 241 -330 80 0 -202 466 -13 -526 359 56 -387 580 -77 -660 710
1276G10o54r83J642l15j319J406j85j304J621N6j745J285M96j575R67N78j355
$$ 710 56 -927 715 400 -919 487 302 -1002 619 675 -1070 215 711 -864 103 681 -674
1293f74Q07M35j332P13O78r98M17J96p81P75R7q92Q48M6r47Q67o7q12J209k13
$$ -674 133 568 -764 -51 627 -371 46 242 -539 236 333 -559 289 335 -612 255 188 -624 585 372
1313C72j304J216J58j175J163Kj326J289J14j514J318M28j531R66K66j366J303
$$ 372 -932 284 442 -733 430 432 -894 395 509 -1005 313 741 -790 176 442 -924 379
1330C79L71j664J056N22j541J045M92j487J146L83j792J165Q13j690R46O37j838
$$ 379 750 -914 142 664 -877 168 660 -827 319 702 -1090 75 888 -802 144 781 -1057
1347a057J096R96j979Q16J251j917L93J304j546M17J292j679LJ444j118q4J035
$$ -1057 39 1035 -944 -128 1123 -794 -401 903 -643 -226 1066 -613 -610 834 -284 -368 667
1364F67r63J5P90r19K02Q02q47J80L46q71P65M86j300O77N87j385P91P34j566
$$ 667 -296 -281 509 -410 -208 594 -253 -73 273 -598 167 653 -647 30 617 -768 23 757 -809
1383h09R03R13k026O79J504j839L64J425j929K90J783j855q4J946j633m68J835
$$ -809 94 1007 -1019 -340 1164 -675 -311 1114 -815 -525 1258 -597 -681 1265 -368 -836 999
1400I99j296l80J825j368p41J836q55p38J496q06o41J365q15n91J447o21o98J041
$$ 999 -297 -677 1148 -220 -961 875 20 -718 778 -28 -669 696 -119 -710 737 116 -582 459
1418D59o52k74J191p68n14J119o68m10J042o33k07R77r35l52J203o01k72Q76q85
$$ 459 -193 -467 724 -44 -558 561 -107 -517 525 -108 -315 662 -273 -625 578 -23 -295 581 -304
1437c04j24J075r31j38J206r53l17J104r93n8J428j224n12J556r35n95J544q61
$$ -304 -428 647 -284 -422 784 -169 -486 618 -375 -433 995 -229 -741 815 -120 -715 829 -32
1455c2p62J638p64j084J665k34j240J199n8j067J155L4j169Q54L33r36M66L21
$$ -32 -794 844 80 -1004 661 427 -813 386 328 -739 416 450 -719 135 468 -468 -2 319
1473C19n60L29N3m62L26J89j95N2k03J9L63l48k4M89m30j24M11m71P6P93o42m23
$$ 319 -241 88 141 -321 5 194 -1 51 -152 -133 230 -118 -142 347 -83 -207 204 -267 -191 602 -40 -463
1495d63P67l47l68Q09k87m82P36l06o66P95K06o25L24%m46M47J58m71K34K48l86
$$ -463 304 -43 -411 398 111 -371 365 59 -607 188 394 -231 93 93 -353 94 252 -219 15 263 -123
1516a23kJ54o9J72m0k61J21J25q8K7n9j2J66o7k02J55J18j30n1M0J4J17l8j85
$$ -123 -125 29 -40 132 92 -169 -48 77 -11 16 -43 -55 111 44 -158 -3 115 -15 -66 -26 -12 105 67 -118
1540a18kJ50Q9j29m2J25k6j74P6J05k0J02q5l19J64L08j88p4J77j37j01J35p0
$$ -118 -120 30 119 -10 -52 73 47 -127 -51 54 34 136 51 -268 -104 204 16 -58 119 -18 -119 16 -54
1563e4RK68r5l52R0K16m2k9M7o0m3K4l4l9K05R4k72j24K35J2q3J14r2j05K41r0
$$ -54 -45 223 128 -224 -134 82 40 11 58 -2 -45 -21 -55 -94 111 205 -67 -191 44 56 -27 87 -5 -110 131 41
1589D1k81K95J83l46NJ87j88J25J66l52lL99k13j98K83m4j39R7k9o7K00Pk36m5
$$ 41 -240 55 238 -108 -103 84 -104 21 187 -165 -168 231 18 -180 103 59 -80 17 -12 -79 121 128 -108 -153
1613a53J70J08j02j19J39J0j53Q7M8j02K05j0m20J68L78k59r1K29k03n1K39j81
$$ -153 17 125 23 -96 43 53 -100 -13 35 -67 138 128 -292 -124 254 -5 -96 133 -70 -121 118 -63
1635f3n7L47j21l13J31J29j2P7j36p7J26jq5O7K6L2m7k12J12K49j11j13N5j20
$$ -63 -120 227 106 -207 -76 53 41 118 -18 -95 31 30 -55 12 38 70 23 -189 -77 172 61 -52 3 -117
1659a17J09J34k03j3K70j78j80K05Nl5J54k13j99L38P4k62Q1J25j45j8O5m3R3
$$ -117 -8 126 -77 -90 180 2 -178 27 32 -3 151 -62 -261 77 151 -111 -30 95 -50 -68 -3 -46 47
1682D7J06j62j82J48J98j17j00R0j2r1R8K3j00J56J2l11M0L42o7j98J03l6r6J99
$$ 47 153 -9 -191 -43 155 38 -62 28 16 -75 23 46 -54 102 114 -197 -157 185 118 -80 23 -13 -109 90
1706I0j3j76J51Q2k78j5K68K0j09k3r0j7K07L0k01M9J41j92p3J78P7l1n0j52k2
$$ 90 77 -99 52 134 -144 -159 109 129 20 -3 -93 -110 97 127 -74 -25 116 -76 -149 29 106 75 25 -127 -149
1731a49K07J02j79m6P2l9n6Q8P3J3l7j19q9J45K26j23k02P5O3r2Q6Q5j07M5j4
$$ -149 58 160 -19 -65 7 -32 -88 0 73 86 49 -70 -159 -14 212 89 -113 -38 25 -67 19 104 -3 42 28
1756B8k32J33L05j18k04M2rKJ78n4j28J08k4j75P9K17pj36j18k6J30J17%j35m2
$$ 28 -204 -71 234 116 -88 -46 -55 -53 125 71 -57 51 27 -148 -69 148 141 5 -113 -139 -9 108 108 -27 -69
1781f9Q7l8j05K04J39k34j12O3n3J95J94l31j21K44j09q3K64k5j63N3j02q4L30
$$ -69 18 -20 -125 79 218 -16 -128 -65 -118 77 271 -60 -181 63 -46 -129 135 110 -53 0 -102 -186 144
1804A44J09k81j04O9L0P7K9j9mj13n4O8O6J66%l53l7K82k4k0J25j95j00J99j39
$$ 144 253 -28 -132 -63 -33 44 73 54 50 -63 -117 -49 17 183 183 -170 -207 75 51 31 156 -39 -139 60 -79
1829g9%L48j17l58Q4O6M0K53j38k78J57L0j25J94Q1j30j0j50p3L14J15j81n8j28
$$ -79 -79 269 152 -206 -122 -56 -16 237 99 -179 -22 8 -117 77 158 28 18 -132 -205 109 224 43 -15 -143
1853a43K6K25p5n1J98k15k14K46QL0K89l55l43M38P7k67L24n8l91K52M0k46L77
$$ -143 -117 108 33 -18 180 -35 -249 -3 5 35 324 -31 -374 64 141 -126 198 140 -251 1 41 -205 172
1876A72J52m75k5J27kK46k4k67R7l7j29K76Kj15K01l20k74N61Q7l58K51j34m01
$$ 172 324 -151 -176 -49 -51 195 171 -96 1 -36 -165 111 113 -2 199 -121 -395 166 253 -105 146 12 -389
1899c89M94R7m05M03M6o01K40K52k42L78n7o21L23K64l50K89J45m89J87R8l68
$$ -389 105 202 -203 200 246 -355 -115 137 -105 273 216 -405 -82 182 -168 121 266 -223 -36 62 -306
1920c06M34K55n27K3R6k20M20J06m75K43L5m38M23J72l97L89q3p37O02M31o51
$$ -306 128 383 -144 -121 -25 -245 175 281 -194 49 84 -354 69 241 -156 233 150 -587 15 446 -205
1941b05K89J99p34L66M54o08K93L96p55K3M70l04K82K01p06J44L80l96L04K65
$$ -205 84 283 -451 -85 369 -239 54 450 -305 -282 188 -116 166 367 -339 -195 185 -211 93 358
1961C58n85K04J81o16M98N27p48N6K81n51L93N15p07Q3M18o58J29N96m49J26K65
$$ 358 -227 -23 158 -458 40 567 -181 -125 156 -395 -2 513 -194 -111 307 -351 -222 374 -75 51 316
1982C16p68J80O81m36J9L08o32J25M94m81K18M42o76q0M13l30L38L49p93Q2M95
$$ 316 -452 -272 409 -27 -8 300 -332 -207 287 -194 24 466 -210 -290 123 -207 131 480 -313 -231 264
2003B64n56K62N60p50P4M83q03K42R27p51k49O00o32K1R03n97k99O91n50k93P78
$$ 264 -292 -30 530 -220 -146 337 -466 -224 703 -48 -297 303 -329 -308 595 -2 -301 390 -160 -453 325
2024C25k31j78M23n71k01P29k08j56L60m87j07N13l32M5N67n85k41M49l22K18
$$ 325 94 -84 339 -232 -433 296 88 -68 292 -195 -302 211 -121 -76 491 -94 -335 114 -208 10
2044A0N53p23j64N75m89M2P13n85j42N06o73L2R32n04l11M88n83l1Q73n03k29
$$ 10 563 -160 -324 251 -238 -196 517 -68 -210 296 -377 -345 587 83 -228 260 -323 -354 519 16 -213
2065b13O41o21k73P82k99r4N86p40l01Q60k77k07O09n65l13P00l31j94P51m23
$$ -213 428 -193 -466 316 17 -77 509 -231 -532 328 51 -156 453 -112 -425 275 -56 -250 501 78
2085G8m70M63j75k3N89m14l67M17k17l8M63k98q8K85n40Q4O52l67p9K78o46J59
$$ 78 -392 71 -104 -127 462 48 -319 98 -119 -157 306 8 -80 205 -335 -251 401 34 -45 233 -413 -254
2107b54P16n72J2N68p53j17P37m86O6P22q87l21R05l74j73P70o43l76P58m17k23
$$ -254 462 -110 -98 470 -283 -400 337 -149 -83 639 -248 -569 336 -38 -211 559 -84 -460 298 -119 -342
2128c42Q78l74n38M83k52j12P21l22m25M25k62j03M96k39q2L22n27o0O36k75p8
$$ -342 536 162 -376 107 -145 -257 464 142 -283 142 -120 -223 273 34 -48 274 -253 -313 323 48 -30
2149c0L01n88L7O52m64l9N36n78j64N89m21O2O49p07k75O98l46o6O44n96k54O98
$$ -30 271 -317 -280 372 -92 -131 405 -173 -337 252 -169 -107 542 -165 -440 258 -88 -154 490 -106 -360 338
2171C38n24j51Q50m21m42N78m32j68R01l85n16O25l23l40P53k21l42N72m21m41
$$ 338 -186 -337 513 92 -350 228 -204 -372 529 144 -372 253 -70 -410 343 122 -220 352 -69 -510
2191e10P55n4l53M58l82l58O90j41l59N95k53m58M84j29j48N92l56m82N39j28
$$ -510 245 191 -162 296 -86 -444 246 105 -254 341 88 -370 114 -15 -163 429 73 -409 130 2
2211Bj94N55l40l40N70l39k89P38j99m44N11l51l04Q46k33n68O14k17m60O97j11
$$ 2 -192 363 23 -317 253 -86 -375 363 164 -280 231 -120 -424 422 189 -379 235 18 -442 255 144
2232A44m37O33k64o31P24P6m89N09j89n67O54N4n37N60K3o42M20N1l68N62k3o61
$$ 144 -293 340 76 -555 169 245 -244 265 76 -491 163 217 -320 240 263 -379 41 92 -276 286 263 -398
2254c98L87J32l78M60pm95M20l4m73N37J57n13L00o0m49N83J51n80L24J00m98
$$ -398 -11 121 -257 203 196 -299 121 87 -386 151 308 -205 95 35 -414 169 320 -260 64 164 -334
2275c34L65J79l98L57L3n93L32K87l29K49j1m82L69J45l60K95J33m70K02Q9l08
$$ -334 31 210 -188 169 202 -391 -59 228 -101 148 137 -345 24 169 -191 104 237 -233 -31 58 -250
2296b50M48R3n69K13J86l32L20J35m67K52J51n21L11L67m27P7J28l89K44L28l99
$$ -250 198 291 -278 -65 121 -211 109 244 -223 29 180 -341 -30 337 -90 -13 115 -274 -30 298 -101
2317a01M1K27l13L7K39j84J26J20l80M1K51j28J00M9l03J40J63k72J50K15k91
$$ -101 -60 167 -146 -109 130 -54 72 192 -188 -147 104 -24 76 125 -178 -38 125 -147 3 218 -73
2338g3k3J36k08K01K49l74p1K47j49L0J99k06k8J67k15%K76q4j15K5j15Q8J87
$$ -73 -96 40 -168 33 282 -92 -163 84 -65 -35 164 -42 -70 97 -118 -118 158 74 -41 -16 -131 -43 144
2361A44j25o8J07j16QR4r6J20Q0k66j8J97n7J6R6k20J8K03j85j9K35q4j42P4p5
$$ 144 19 -49 58 -58 -50 44 -52 68 148 -118 -136 61 4 20 116 -104 -86 117 -68 -87 148 64 -78 -4 -79
2386g9OK36r9j77J14J5p2N5K4j0K3r8m0J15M2J3p6j13J03J25j24k8R6p8k5R4p2
$$ -79 -73 163 64 -113 1 16 -56 -1 23 13 36 -62 -102 13 55 68 -8 -121 -18 107 -17 -45 51 -27 -52 42 -30
2413c0QJ29j42j17J74P4j01Nl1l6R1Ko0L4K2j3o2l0J24N0j07k3K7k4O0Qr9P1R4
$$ -30 -22 107 -35 -152 22 96 -5 0 -31 -67 24 26 -34 0 22 9 -53 -83 41 91 -16 -39 -12 -36 24 32 -67 4 98
2442I8j59n8J64Ol0K5j12j4J44k9q6O9J9m9l2KL7O5l6r0nP8O9p7p5J00Mq9P5N
$$ 98 -61 -119 45 51 21 46 -66 -80 64 35 -51 18 37 -12 -44 -42 -5 60 24 -66 -71 7 76 -1 -76 24 28 -61 14 19
2472A9m7P0k7j38J32J23j54o2J08l8K3N6j12KR3m7o1N7N7op1o1J07J6n1K5l0k5
$$ 19 -28 42 15 -123 9 132 -22 -84 24 -14 9 65 -47 -45 48 1 -60 -3 54 48 -23 -84 23 39 -12 13 -17 -42
2500d2J21n7j49J69P0j72L2N4q2R8N7k00N7J36j04n9R7mppp9L0R9l4m4l4K8J11
$$ -42 79 22 -127 42 112 -60 -28 26 -56 42 99 -101 -44 92 -12 -71 26 22 15 8 -71 -41 58 24 -20 -54 -26 85
2528H5r5q0J43kj23J00l2j00K02k9k51J75J48k24N7J10j71Q2J19k16M3J91j33
$$ 85 -10 -90 53 51 -72 28 -4 -104 98 69 -182 -7 141 -83 -26 84 -87 -5 114 -102 -59 132 -1
2551aq9R9k0K6L3r0J1Q1n5Lqk9J19n1j54J36P9j31N1Nj28J65N5k27R6J51k13N0
$$ -1 -90 9 -11 15 48 -42 -31 50 -5 -2 -10 -39 80 29 -125 11 90 -41 10 15 -113 52 107 -120 -24 127 -86 -36
2579c6J24j58Q1J24k53L4K38j54p2J09q3L2J14j76J4J36q1l0M9q9J24O2k36J07
$$ -36 88 -70 11 135 -118 -84 154 0 -72 37 -46 -14 100 -76 -62 74 -7 -37 12 -77 47 109 -127 -20
2603b0J57k10K4J57k00P4K05k90m3L22j39j63K19j05q5J98r7j15J83l0j16O7n
$$ -20 137 -73 -49 108 -92 -18 187 -103 -146 176 37 -126 93 -12 -97 101 4 -111 72 42 -74 -7 -12
2626a2N0N2j83L1J58j19J5J12k25R5J86k64NK93k19j13K52j65l1K83k54j56L70
$$ -12 38 90 -93 -62 96 -23 -8 104 -121 -26 160 -104 -99 194 -25 -138 114 -51 -82 201 -53 -209 161
2649A61j05k02K47j01j31K56r8k11K80pk19J47L3j18J28o3r3J71l1p6K9o8O2J67
$$ 161 56 -146 101 0 -131 125 27 -184 96 89 -130 17 50 -68 60 -3 -96 75 44 -32 -3 -71 -9 158
2673A58k11m2K13j48p4K47j58j00K65j75j79L47j7k71J74kj32J88Pk19J29O8j36
$$ 158 -53 -95 118 -30 -104 143 -15 -115 150 -25 -204 143 126 -145 29 27 -105 83 90 -129 0 68 -68
2696f8P0K1l5R0r0j00J78nj13J03n7p5J72p1j38J67M1j45L9K4o7J07kj30O9O1
$$ -68 2 23 -12 78 -12 -112 66 61 -52 51 -6 -81 91 20 -118 49 90 -55 -16 8 -59 48 46 -84 -15 46
2722D6p8j3O3jL3n4r8P7R5l2m9m6J6P6l4j6M2ln6mK2L1P8p6j35R0Q7o1NM3j04
$$ 46 -32 -45 18 17 50 -4 -102 -25 70 38 -11 -57 -41 35 1 -15 27 24 -32 -36 -14 17 95 19 -116 -26 61 0 5 48 -56
2753e6L3Q2j03mJ81r1j85J26P8q5P3J7j68P8J26j64k2K02r4j09Q0qj0J17p3j18
$$ -56 -23 59 -44 -48 133 42 -143 -17 61 -24 49 66 -102 -24 102 -62 -84 118 24 -85 -5 -13 -23 94 21 -97
2779i7R6L3o1L6QJ2mr6QJ13J5m7j6q1M0J19p0l4R2p5n7O4j0M8Q2j57q6J59qj4
$$ -97 -1 32 -29 7 15 27 23 -73 -65 48 63 16 0 -81 -41 78 8 -26 66 -9 -66 -2 -12 36 118 -39 -125 34 26 12
2809A2N6r2m6J27q1m7J83n3j35O0l0J2J61r1j46J36l5o5J45l7r4J66j34j60K61
$$ 12 68 -24 -70 57 -24 -71 112 59 -76 -16 -46 -34 127 36 -110 26 -9 -74 71 34 -60 106 -28 -188 73
2834G3M1j83J10l6j65K27L1k09J46P7k53Q4J23j04J10J8k37R3J30r6M7L9j48J02
$$ 73 114 -69 41 5 -160 67 98 -111 35 112 -141 -57 66 -38 72 90 -147 -54 76 -20 27 66 -82 20
2858B0nj32J86P9k11J9N8j07J76N9k39Q2Q3j63Q1J11j24P2Nk17J49J42j35K8J8
$$ 20 15 -117 69 148 -63 -44 14 -93 83 142 -97 -15 68 -95 -14 97 -27 45 50 -167 -18 124 -11 17 35
2883C5j58J27R0j86J14J14k47M6J24j13J18N5k81R1J71j71R9R9k40P6J43k44R5
$$ 35 -123 4 94 -92 22 136 -111 -65 59 -54 64 119 -162 -71 100 -71 28 127 -113 -37 106 -138 -43
2906d3K43k51n9J65j35P0J86k33m8J81j03n4J75q7qO3j63K4J74p6l4N0j10N1Q7
$$ -43 200 -51 -110 55 -80 -10 176 -57 -105 76 -27 -81 94 7 -1 62 -101 -77 97 21 -13 37 -73 -22 65
2931F5j19L9J48j70m1P8n9J05Q5j99j1J26r2L8R5j14L4M6j77O0J99j34m7O1j15
$$ 65 -54 -15 133 -37 -78 0 -59 46 131 -68 -79 47 -45 -7 88 -26 8 54 -123 -63 136 2 -45 16 -99
2956i9Q1J52j69j6J22j24KJ20r7L6O4j80OK13p0p5O1r6JJ50q8n9J36n4r2O2J5
$$ -99 -18 134 -35 -51 71 -53 -51 69 -28 8 72 -108 -102 111 41 -34 27 -69 -68 82 -6 -65 71 17 -75 -13 2
2983BJ9N4j04l1O5j4J6K4m8M7J3j47L9J47l8j8qj06O9R3r6L1N1j07%M5k8R3N2
$$ 2 21 75 -29 -60 5 -9 7 31 -17 30 43 -104 -65 82 44 26 18 -88 -19 74 -22 9 60 -47 -47 -2 -30 63 115
3012A15j91KJ16m9L7K1j15L6Q9j20J8J31r7l0L9n4O6Q9j55k2J17n5KM0q0K5P7
$$ 115 -76 -74 42 -7 30 51 -64 -28 61 -59 -41 90 -7 -37 2 -52 14 103 -52 -74 43 -12 -10 30 -50 -25 52
3039E2r2j5J16l2l8Pn8N3Q1r4qO6o0%K6n7J03N9j61j4J04n6L7N1j09PQ7j02k0
$$ 52 -40 -55 61 29 -9 -2 -60 -7 74 -20 -28 38 -22 -22 4 -53 50 109 -52 -66 38 -18 19 70 -39 -32 55 -47 -67
3068f7J43l3m3mp2O3J14j03l8P4q2N8L1r8N7Q5j59pJ53p7kN7j23L0J54j34m9J27
$$ -67 76 43 0 -4 -76 -13 101 -2 -40 34 -48 10 41 -57 0 85 -74 -81 72 -5 -7 50 -73 -43 111 -23 -72 55
3096E5m4m6P7q0K0J15j06o2J07k7j4N0p7K2Q0j04k6J17n4J4K7j27N9J50j56k1
$$ 55 11 -35 42 -38 -18 97 -9 -71 36 9 -5 45 -32 -10 70 -34 -60 57 3 17 44 -83 -24 126 -30 -51
3122e1J27j07k0J25j25mJ79j39r6J53j3o0Q5p9k5J21n5o1P0kl2K4p8N8Q9j13j7
$$ -51 76 -31 -51 74 -51 -55 124 -15 -111 42 29 -31 54 -25 -50 71 16 -45 25 23 -9 15 -63 -5 84 -29 -46
3149d6Q2p1J2R9j47K2J72j57p5J77o2m1J24j40l8J94r5j07J70l6r3J05o7m0J54
$$ -46 36 -35 -23 76 -71 -49 123 -34 -109 68 6 -35 89 -51 -89 105 10 -97 73 37 -56 49 -18 -58 96
3174I6n5j06O9J9j5K6n5KJ03j11k7J05o5PR5j65kK11j44q7J87o9j08J65q2j05
$$ 96 41 -65 4 23 8 34 -21 -19 84 -27 -54 51 -14 -7 88 -77 -79 132 -12 -99 88 19 -89 76 -6 -111
3200a11K31m5j95J23L5p7R1m5q0J10rr2R1k5k9P5j03nJ66q8j09J29m4n2J51j00
$$ -111 120 75 -120 3 38 -39 52 7 -73 37 28 -64 27 2 -27 48 -55 -60 106 18 -91 38 -6 -58 93 -7
3226gr9K11p4j66J71J4j31J63n0j61K03Nj90J30N1j33R1j2j03J31L4j38N3J2k7
$$ -7 -106 105 31 -135 36 50 -81 82 32 -129 74 79 -111 19 70 -63 28 16 -87 44 78 -60 -7 5 -22
3251b2P0o5m2J55r8j09J66m3q0J71j11j70K85j3k36J70N9k09J50M7k05J46J06
$$ -22 48 -17 -59 96 -2 -111 55 12 -68 103 -8 -178 107 94 -142 28 87 -122 28 75 -130 16 122
3274A22k10M2J27j08M2J9j12J07L5j24M4N9q7R4l9j17J63K2j76J13L2j19J16r
$$ 122 -88 -46 81 -27 15 34 -78 29 64 -60 -16 43 -44 50 11 -106 57 79 -97 16 48 -71 45 36
3298C6j32J57M0k15J07P1j34J17L5j99J08J21k11N4J28j21J1O9j12N9J09j23J
$$ 36 -96 61 101 -114 -7 64 -70 47 82 -117 -9 112 -99 -45 83 -38 -27 42 -70 -11 98 -25 -24
3321b4L8l4O1j6j18J34K6j74J04P4j43R7N6k14J05J62j98j6J70r5m8R2o0j0J05
$$ -24 14 -20 41 25 -93 41 67 -107 -3 71 -72 25 81 -133 -28 134 -64 -80 90 -5 -53 39 -21 -31 74
3346G4o6p2P0QJ6l2n0Q2J7r6M4M2n2N1j1j06Q7Q8j14jO8o2J6N3j01L4J17j34m4
$$ 74 8 -64 6 14 30 -2 -52 30 47 -49 -5 37 -15 36 25 -81 6 94 -20 -21 47 -15 1 54 -47 -13 104 -30 -74
3375g4J35n7j0O6r0m3J37l3j04Q6M0o8j4L1QOlqn4M5Q5o9q9J11K3j09N8K1m7M6
$$ -74 61 4 -6 60 -30 -73 64 31 -73 13 53 -15 -29 2 10 16 13 5 -49 -4 81 12 -77 34 57 -52 6 27 -20 26
3405B6J8j09L3J09n2o3K4L5qj4k6N6%l8L1l5k3J11n5r8J05K7r1K5L3l4L8rn3L9
$$ 26 44 -65 -32 77 25 -38 -14 21 13 -1 -27 29 29 -9 22 -13 -36 75 20 -78 27 54 -37 -12 21 -13 25 16 -37 2
3435BL1k8j2j9J1P2o3m3Q4j0o2O2m5j4J04p8o6R6%m2N4n8k5J25p7j01J67j7j15
$$ 2 33 5 -7 -26 -15 57 -6 -49 35 25 -37 25 -20 -34 70 -8 -74 22 22 -20 34 -24 -49 76 -1 -102 65 48 -67
3464f7J30l6j13J62lj97J31J01j51K8O6r7O9L6j19O9L2n6M2l3m4J25m4j25J50
$$ -67 63 27 -86 76 73 -124 7 108 -43 -15 51 -46 23 59 -60 9 41 -15 27 -6 -50 75 31 -94 56
3489E6Kj24J12k1j41J88Nj85J27O8j40N7M5j11J03K3j59J03N5j04P0j8r6J45l
$$ 56 58 -66 46 25 -116 72 77 -108 19 87 -53 4 49 -62 41 64 -95 8 63 -41 29 11 -85 60 57
3514E7j66J27M8j46R4J8j53J72N3k38J16J33k04Q9Q5j86J12J03k29P5J70j66j
$$ 57 -109 18 66 -80 14 32 -121 51 104 -134 -18 115 -89 0 85 -101 11 114 -115 -40 130 -36 -37
3537c7J13j50O5J42j80OJ34j04m6J07o5J0P3j27K1R3n5OK8j14R8N7j59P2R7j34
$$ -37 76 -74 -9 133 -47 -41 93 -11 -57 50 -15 -5 68 -59 -38 55 0 6 34 -80 18 75 -84 -12 85 -49
3563d9M5O9j42Q7J23k30K8J84j28j8R4r7LJ30j36j9J37p4n5Q0o9OJ19j37jJ38
$$ -49 -4 65 -77 10 133 -97 -69 115 -13 -31 63 -34 -31 99 -37 -56 81 7 -48 32 -37 -31 88 -49 -50 88
3589H8j23nJ23j29J7J50j53q5K29o8j10J38o4q6J61o2j05J48j3j15P8ml6J05n6
$$ 88 -35 -40 83 -46 -29 121 -32 -117 112 44 -66 72 8 -78 83 21 -84 64 51 -64 14 10 -26 79 23
3614B3r4R7On2M2j8l1Q7o8m5Q2pm9M7o9L9R1j04n3J44o1p2J25p6n5J52n8j38J67
$$ 23 -71 26 32 -20 22 4 -27 60 -8 -53 29 22 -27 20 -49 -10 81 -23 -76 68 7 -65 60 -16 -71 81 23 -115 52
3643E2J2j34R5J4r7R5pj02O3P3r8L3krN3k9p6R7Qp6N9j4n7R9j0j31R1O4r7J3M0
$$ 52 64 -70 25 39 -58 37 30 -72 -9 64 -34 -1 -3 -12 41 12 -64 33 41 -35 24 10 -47 52 42 -89 2 66 -31 -18 22
3674B2m5O2Jp0K4N6m2l3J5PK6lm4K3Q%j9oK6K4n0m3O9jJJ9p3J5R6n3p0R4Mq1M5
$$ 22 -23 39 40 -30 -6 50 8 -25 -10 -3 23 20 -24 -1 7 7 -12 -18 8 32 -18 -61 8 7 8 27 -46 -31 65 12 -58 36 40 -41 4
3709DPm7Q7J3j25K1Q8n5k6M9k5j2L7l0j9O8Jo9mK7K9mk8NJJ4k0J6J9J2n3j4ML3
$$ 4 11 -36 51 64 -61 -40 48 -7 -33 16 -9 -21 16 -14 -33 35 36 -33 -37 -10 19 15 -13 -8 -7 7 -13 3 22 34 -19 -33 -29 4
3743DN4m2o0M3Mj5KJ3pOqm1M4N0k9o4KM2K0j2lrRj0k0J7M1%l9l7J6M8J6l8j3K2
$$ 4 58 16 -44 -1 3 -12 -10 3 -4 2 -6 -47 -3 47 18 -46 -44 -2 18 6 3 -6 3 -7 -27 -10 31 31 -8 -45 -29 19 35 -3 -16 6
3779Fj4k1L1J9jMm3l0O4M3p3j2L4j3qL9k1mM5n7m6P1L5l0k3l6QN9Qn2K2J0m1O
$$ 6 -8 -29 2 21 20 24 -19 -49 15 58 -15 -27 7 -6 -14 25 4 0 45 -12 -58 13 48 18 -5 -41 -33 26 34 -18 4 14 -27 -21
3813b1J6OK9j2r2K9Q4m2j0J8k8J4K1m0qO5j1o1PL4K5ol5LPMJ7k7NN9m7n4M2N0
$$ -21 -5 1 30 18 -74 -45 39 -3 -13 5 -23 -9 12 -28 -36 29 18 -43 -36 -2 23 17 -18 -15 -8 -4 13 -14 -9 50 3 -51 -9 41
3847D1l2pom4N9K7o3PN6m8j3J8oL5J4r4K9O6k6%kl8K1K9o4K6P6n4m1K4j8M8L4
$$ 41 9 2 -4 -48 11 38 -25 -18 38 -10 -23 -5 -11 24 38 -56 -27 39 13 13 11 -27 -6 23 -41 -15 61 7 -34 -10 -28 20 54
3880E4o0m8Q9l8l1M7j9J1J9n4k9R0mn3K8j9RM6m1j9O1j1n6J9kK1L9o9j2P5l0k4
$$ 54 -6 -54 35 -3 -34 13 -6 5 24 -30 -59 31 27 -26 2 -17 -8 38 -3 -22 39 28 -28 -9 -11 10 49 -20 -32 43 13 -11
3912a1J9l5J9N9q4l2J17l4o5O0k3j1O0k7p9Q8mo8N7Qk5M2n6k9O2L3m4mj7KN8l5
$$ -11 8 -27 -8 51 -33 -65 52 18 -47 13 -10 -21 39 12 -67 21 17 -51 6 14 -11 31 -25 -54 8 41 -3 -7 -24 -22 36 1
3944Am4Q5j3q4M0J7k5P0l0r0O7O2q9LN5k3j3K0l5J1N9l3m1JL6J5l3k7N2J2n6L5
$$ 1 -43 42 29 -55 -15 2 -23 47 17 -73 -6 56 -33 -30 25 2 -11 9 -26 -15 44 11 -30 -29 7 22 -11 -38 14 26 -30 5
3976Elj9O1l8q6P2O4q0J2M4o5K6M1q4L5Q2q5n4Q9mk1M4o9j6R1nr6N0M1o4K7J7
$$ 5 2 -17 44 6 -80 -8 56 -24 -12 32 -33 -7 34 -50 -15 67 -18 -72 17 13 -8 36 -33 -49 42 37 -59 -9 32 -32 -5 12
4008A2l4M1Mm0l2M8L5k6n1M1K1n3L2L2m0%M7p5j2J23l6j00R1J2r7O0N7r9N5N8
$$ 12 -22 19 23 -17 -49 -1 34 8 -43 -2 19 -34 -2 30 -10 -10 37 -38 -50 73 37 -63 28 40 -57 3 60 -39 16 74
4038G4j16kR0rm2J1k8PK8qj0J9k2Mj8qP0J1j07L4N0l7J0M9q7J9P6j08LJ15m7p2
$$ 74 -42 -44 46 37 -5 6 -22 -15 13 5 -5 14 -8 -4 -22 -30 40 51 -56 -22 28 -9 1 50 -37 -18 58 -50 -47 68 21 -51
4070e1P8m2j5J08o3r2J10Mr8P2K3o2M4J6r3L3Q3n0l1J5L0ol0K7J3k9ML0q5N3J12
$$ -51 27 -15 -30 78 15 -77 33 37 -61 11 34 -28 16 32 -61 -28 55 5 -26 -11 19 13 -17 10 23 -6 -2 28 -57 -4 108
4101A08j29o8J61l4j20J62k9j59J54K6j90J38R7j83J2J11j10M1J00j24j6J06o2
$$ 108 -21 -89 72 38 -82 80 51 -108 46 72 -118 20 117 -66 -54 57 -53 -12 88 -36 -52 54 -8
4124hk2N8l3QQn3N0M2p5M7j8o8J05Kj21J21M1j60O8P5j47J21P4k12L7J74j49k6
$$ -8 -30 28 -5 3 11 -42 8 50 -25 22 4 -64 41 43 -78 43 84 -76 -8 67 -80 41 115 -97 -60 114 -35 -61
4152f1J67j25n2J46q6n2J38l2j02N1K8jlm8L9J5o4N5K7r1R5L6j98R0J62j82kJ51
$$ -61 106 -19 -71 75 -11 -63 75 43 -59 -8 20 19 16 -32 7 22 -42 13 40 -51 44 80 -118 -28 134 -48 -50 101
4180A01j68%J97j81n6K46j27j31J67oj13J40m8j29J41J1r3O7K8n7J3l3RP2k8k4
$$ 101 -67 -67 130 -51 -107 139 12 -119 48 42 -71 69 21 -108 33 44 -49 18 46 -11 2 -31 -22 50 22 -2
4206bJ7o1N0Q8j40KJ34j18k9J47q5n3J62j23j13K11lj74J21J5j31J03L2j16Q0
$$ -2 15 -46 4 92 -48 -46 88 -30 -59 88 3 -50 112 -11 -124 87 84 -90 31 46 -85 18 50 -66 14
4231A4N0j09j4P4Lkk9pL2l2RP2p5lR5j36l4J83n1j29J29k0j13J44J2j71J17Q4
$$ 14 64 -45 -59 15 18 16 -13 -20 12 -20 -11 61 -14 -17 78 -58 -92 91 40 -89 40 20 -93 51 63 -108 9 93
4259I3j85M6J33q2j9N0q2JJ11l8o4M0K1l0k2L1M4l2k3K0m5K9Q5q5o7J16k3j01
$$ 93 -92 -46 87 5 -14 36 -46 -45 66 28 -36 4 25 -5 -27 4 48 16 -7 13 -32 -3 82 -3 -70 46 23 -78
4287g8J18J5j14R4rj19J10Q1j44nR7o8nR0n6l2M7k4m4K9N9j1o4NM2k1KL6m7k4
$$ -78 40 55 -59 35 26 -93 17 98 -46 -51 46 -22 -27 63 7 -25 22 -2 -46 -17 42 31 -33 -28 14 -7 -5 31 -16 -40
4317d0Q0m6p6J25L4j27K8N0p7M2P3r4j8R8o7n0R5J4n4oKJL0K4l5n2L5N1n5j8P0
$$ -40 40 -6 -82 43 77 -50 -22 28 -49 -7 66 -28 -46 52 -15 -65 30 44 -10 -16 -14 -13 17 41 6 -46 -11 40 -15 -33 37
4348C7l2n6P5k9j5Q0m5r6Q1N7p8K3L2p2L1M6o8J2O8l8n1K4L5j4rRkk6K1nj8K9
$$ 37 5 -51 24 -5 -20 60 15 -81 0 57 -21 2 34 -38 -7 39 -29 -17 51 13 -38 -14 21 7 -2 7 5 -21 0 -5 -23 6
4380FM6o9m0Q2j0l0M8j1o9O7Nq8O6O8q4j8M5pJ4Ql5j7L1K5k5j6J6J7l8lN0m0r
$$ 6 52 -17 -57 25 15 -15 33 22 -47 20 25 -63 3 71 -13 -31 14 7 21 29 -6 -23 8 33 8 -8 8 25 -13 -16 34 -6 -15
4413a5L9n6oR3l2p7O5J7n0K5J7m9N4J9r8K3O5l2j5K1j9Lkj3RM1nj8l4qO9j2n4
$$ -15 24 -32 -38 55 23 -54 11 28 -22 3 20 -29 25 44 -54 -31 34 2 -13 8 -11 -8 -10 -23 -14 27 22 4 -30 -38 31 19 -35
4446c5M6j2k9M4j8k3O1rq6M6O8o3K1On8L8M1n5j6N7qk3oLM0k8j3NLjL7m7k1R7
$$ -35 11 -1 -30 14 -4 -27 34 25 -61 -15 53 -10 11 17 -41 -3 38 -17 -33 24 16 -7 -13 -10 30 2 -11 -6 -3 -4 33 -14 -35 62
4480F2n0q1Q9K4p7N0Nq7O5O8j07J4P1p7j5P9l8RL8n5m5P2K8l6k1lK3kk4L5Ll5
$$ 62 12 -69 20 44 -33 17 22 -65 0 68 -39 -25 46 -31 -46 33 -5 4 42 -13 -58 14 42 6 -15 -18 5 3 -21 14 17 -18
4512a8K8k2m0Q9J5r6K3O3o7K2M3o7K1P1j03k0R3k8k4L4l1j5N9k8j8L5Ol4oj2N6
$$ -18 10 -12 -52 37 52 -44 -21 42 -25 -3 40 -27 -6 65 -38 -58 35 7 -17 17 -14 -29 30 2 -16 19 25 -9 -15 -27 29
4543B9Mo3K6J3l1O4j8r6O8N4r9K2J06j06k8J04p6JJ18q5r3J10L1r0M6%m7M9mm2
$$ 29 33 -30 -4 9 -22 42 24 -72 -4 50 -49 -27 79 -27 -55 49 -27 -26 92 7 -86 24 55 -35 11 11 -36 13 9 -33
4573c3L0L9k2k4k8N8K6n3pN4m2pN0p8L1Q4q4m8P6nn2Q9m9n1P7k5o1R5Lo7J9J2
$$ -33 -3 36 14 -10 -38 20 46 -7 -14 40 -2 -9 41 -37 -6 78 -6 -54 22 17 -35 54 5 -46 31 6 -55 40 43 -24 -5 7
4605Gl5P5j5q8N1K8m7L3orK0k6k9N6Jj5K5n1k3R8l9p2R0Pr1N3M2r5Q0M2j23K0
$$ 7 -28 47 32 -56 -5 23 -24 9 3 -6 14 -12 -41 15 16 1 26 -25 -48 50 11 -61 29 36 -55 -2 40 -55 25 67 -56 -36
4637c6R0n9j8O2l2j3K2l3lM5rk0j8nP2k4m3L4J5n7N0J0n7O4Jr7N0N5n4QJ3p3N5
$$ -36 54 -5 -23 39 7 -6 16 -17 -20 25 16 -4 -22 -27 45 21 -22 12 27 -30 20 30 -27 37 38 -59 -9 46 -8 0 13 -60 -5
4670eM6p4K3O5p0j5M8k7J0O9p7m2P5%m2M2pl3L4l6lN3j0l0j1qK1M9m6k6N5l5k1
$$ -5 41 -33 -10 55 -15 -30 18 -9 1 70 -7 -49 26 26 -16 26 19 -14 20 -16 -19 34 24 -6 -17 -25 -4 45 -1 -27 28 -7 -28
4703b8N1j9PK9o7j6O6J6n0J9j4pL2k3j5M9k4l4J9LJ1M6o9l7O5kl7M6ml7L6j4n0
$$ -28 23 4 11 40 -27 -43 23 39 -11 8 -6 -13 19 -4 -19 30 6 -28 -9 -6 5 51 -18 -55 10 8 -29 17 13 -24 12 -2 -52
4736e2O9M1r0OL4k6K2L4n4mM4n1j1O8j4j0ln0J7P2j9m1J7j0J4jnJ6J8l3l4K3K1
$$ -52 17 58 -32 -26 8 -18 4 38 -16 -20 24 -27 -38 30 16 6 3 -47 -30 42 23 -18 -1 -11 3 2 -3 13 31 -2 -36 -13 8
4769HJ3ll4kL1pj4M0k4j5Ql2L1L8k0m6L2jLJ8m1mN0l1l7Q3l1k1K1k4k6R6j6p2
$$ 8 21 18 -16 -18 13 6 -8 32 8 -7 1 -31 0 38 18 -28 4 3 6 24 -17 -21 29 -2 -39 44 13 -8 13 -11 -37 59 43 -29
4803b9K8K2m5K6K3n9M3K1p9J5Q5m3j0J4l8ON8l7j2L5j0m3ML0jQj3j5LK7jqk0K8
$$ -29 -1 21 -24 2 25 -34 9 30 -49 -34 51 8 -2 12 -26 -20 38 1 -11 24 14 -29 -25 5 4 12 -1 -16 -13 14 13 5 -15 13
4837A3k4l8P1K8n9K1oo3N3O8q6pO4n0k0P7m3k3P1p0k4P7%m5jJ0j4L9j8k2M4k2
$$ 13 -11 -49 22 50 -9 12 6 -57 -4 64 -22 -29 35 -15 -35 42 -1 -24 47 -23 -47 30 30 -15 -16 -6 -20 19 1 -21 23 1
4869Ak4J2lJ1M1n3k4O4j2l9O1l7k2M8l7l0P0K5p8MK8k4L4Pn7K9K9m2PK7J9l1j2
$$ 1 -23 -11 -14 -3 38 -15 -39 25 13 -26 35 -2 -24 24 -13 -43 27 52 -26 -22 6 -18 16 23 -34 -5 24 -18 -11 16 35 4 -8
4902hJNK0jln2L6L3m3j4N0m0k1N6l0l0R4l1r3Q7Qo6K8M0o0K5L7p3OQ4m7l7L9j3
$$ -8 -7 -2 18 17 14 -38 -2 31 -12 -26 24 -16 -37 19 -11 -41 53 22 -71 16 24 -42 -14 26 -34 -9 28 -45 -39 45 -2 -39 0 -13
4936a3J4L2l2j4L4j0l9J6L4k1j2j2J1K7ooj9lL0Kj7J0L0m6k0M6j9OL4m6k2M6J6
$$ -13 1 33 1 -13 21 11 -28 -12 22 1 -11 -23 -12 15 9 3 -16 -19 11 13 -4 6 36 -10 -30 16 -3 3 37 -9 -31 15 31
4969C1m6kL4j2qKkJ4J5j5m6J6M9l5rJ3Lj5J9pmK0J3o8j7Q4j8k2K0%m4N1J0o0O9
$$ 31 -15 -17 17 5 -3 -1 -3 11 26 11 -35 -19 30 -5 -14 -1 2 -13 6 -1 -5 15 28 -40 -57 27 9 -13 7 7 -37 14 24 -36 33
5004C3J5q5QP1n1J2L4p1MO9k3m2L9Ln3L5K7l7L3qm7J5N2j4l5J2Pmj6OLJ2kOl5
$$ 33 48 -37 -29 42 -9 3 37 -34 -30 39 16 -26 13 16 -37 -2 25 -12 21 13 -34 -19 33 19 -16 -4 3 -1 -17 -11 -8 4 2 8 -27
5039b7M0K7m6k4M3k4pK1Jj9K6k9l0M3J1onkrK8j5lJ7Oj8rpL2K8m3l3K9QJ0Ol2
$$ -27 13 40 -6 -30 13 -11 -18 3 4 -15 11 -18 -48 -5 6 0 -5 -7 -16 12 -3 -6 11 17 -1 -10 -17 15 43 0 -33 -4 4 14 20 -12
5075a2jM5j8m9O0kl6K6ll5L9K2q1L4O0m5k2M2k4rM6m6k2N7Kn5K3MQj0J0%j1J3
$$ -12 -13 32 14 -35 25 23 -13 13 10 -25 14 36 -45 -11 49 4 -18 24 0 -9 37 -9 -31 26 28 -27 -4 0 8 -2 8 8 -3 10
5109A0j3l0K7N6m7m3M3Ok9N3j4n3O2Lp8M9N2p2pM4l7K0N1m9m7Q3j3n8N4J2m4L0
$$ 10 -3 -33 -6 50 3 -40 3 9 -20 33 19 -34 28 31 -47 2 54 -18 -25 19 -18 2 53 4 -43 40 27 -31 23 35 -9 21
5141B1j6m0O1Rl9qRmJ9j5mK9l1PrpL5K2n9jM9k9jL1m3mM3k4l8N8J3p1L1Qj5K9
$$ 21 5 -35 26 35 -4 -12 -3 -7 12 -3 -7 22 -9 -2 -11 -18 17 39 -20 -21 28 -1 -2 29 -14 -18 25 1 -37 21 34 -37 -6 2 -13 16
5177A6mk2J4L0l3j5K2mJ8m1J5J9nj9J6l1K0M2m6k7O6Ko7N3ol8O4nq0N7L8p9J6
$$ 16 12 -10 4 34 1 -14 8 4 22 -19 -4 15 10 -9 7 -24 -4 38 -8 -35 31 33 -34 19 13 -25 39 34 -46 11 49 -30 -14
5210a4N2m6J4Ql1RL5k3k5QJ8J0j0k7J9Mj5qJ0J4K6l4m3O2Pl8J9Rk8L8J0p0M1M4
$$ -14 38 -8 6 14 -17 -8 27 4 -21 -13 5 15 5 -22 -3 1 -14 -22 -12 2 28 -6 -49 13 20 -18 1 10 -18 20 30 -40 1 45
5244D5o8j1N3j8rL9m8j1N0j0l5K7K7l1l%J7Nj5Nj3j1L8j5m4N6J9o6RN2n9K6M5
$$ 45 -23 -34 19 1 -8 31 -17 -28 22 12 -23 4 31 0 -3 -3 14 19 4 9 -4 -15 23 8 -36 20 39 -27 -18 34 -25 1 46
5277D6o3j2Q5m2m9N6k0l1L8k1k1O4%n9K3L1k1OJl4L1Kj9j0J7J8k2l1M4K3m4J6
$$ 46 -17 -29 56 14 -35 21 1 -30 8 -13 -34 30 30 -29 -6 25 4 10 11 -23 8 10 -9 -19 -2 16 -6 -37 7 30 -14 2
5309BJ8m9L5M2p3mO2l4l1N2j1l4N8j6n8M9K5n6LM4k5j7J9%PJ5j7k0J7RRk7%L5
$$ 2 20 -29 6 48 -25 -29 33 -1 -32 20 9 -25 33 17 -41 8 33 -23 -20 24 -1 -18 1 1 8 23 6 -14 3 12 21 -6 -6 29
5343B9j9l9K9rOJ0j6j5M1Lm0J9J0k4J6J5m1K4L5m3JK6pk4KNQOjj9%K9mk4MK5k2
$$ 29 10 -29 0 -9 -3 7 -9 -24 17 20 -20 -1 9 -15 1 16 -25 -1 34 -9 -8 18 11 -13 -11 -6 2 8 7 -12 -12 17 13 -11 -7 18 -4
5380dRJ8l1jL5k6k4N2jm7KL6k6OQpKL9k3n7M4K8l9%J3j1MK3j4l5O2j9m5L0K8l3
$$ -4 5 23 -8 -9 26 0 -24 28 27 -20 -18 18 -8 -2 6 -1 1 40 17 -40 4 32 -7 -7 6 -5 -1 22 8 -27 35 16 -29 1 29 -4
5416dRJ0l0J6J5k6j2L9qj9%J2%Mk0NJ9Mj1k6J4L0k1j9L1j2LJ5k8j0M0J0o2K3K9
$$ -4 5 15 -15 1 16 -10 -22 17 9 -10 -10 2 2 6 -14 -9 10 14 3 -23 -9 21 0 -19 12 0 3 18 -10 -20 20 30 -32 -9 20
5451B0k3J9ql1L6L3o1oM2j5lJ2k0K6Nl3pK2j6J5nk5L6J4m8J3K1k8J8J6m0K8L6
$$ 20 -3 16 8 -23 13 46 -15 -21 21 6 3 15 -5 21 26 -7 -14 8 -8 7 2 -23 13 27 -21 -8 13 -15 3 19 -21 7 43
5484D3o3J0L4l9J5J0k2RL4n0J0K9roJ3k0pM1l5pK3mRPm8L6K2n0LL6k3RJ4n0L1
$$ 43 -20 -10 24 -15 0 10 -12 -3 31 -19 -9 20 11 5 18 -2 -9 32 -3 -10 13 9 18 25 -23 13 35 -15 -12 24 1 10 24 -26 5
5519EM2o1k0M6jk4M1m5J7M7o2j1M0mk5L1j8j0M7m4qL7Mj8J8l3RM2l6k5M0j9k3
$$ 5 47 -14 -34 12 11 -13 28 -17 0 47 -15 -26 14 10 -15 16 -2 -12 35 -9 -17 20 24 6 24 -9 0 42 6 -19 21 2 -21
5552b1L8l0RM2l4l8N5rk0L0k5j4M8j5m0M2Kk8K4j7rM4j1l8L2m%%k2JL4rl6K2L
$$ -21 17 -13 -4 38 4 -34 21 12 -8 22 -3 -17 31 16 -24 18 20 -8 16 -1 -10 34 23 -15 17 13 13 13 -9 -8 26 17 -19 3 6
5587FqJ5j2j8L7j1l2K2J6j3NroL0Nn3L3J1k8J1%j9K4Om2K3K7k7J2%j1K2J2m8J7
$$ 6 -2 13 1 -17 20 9 -23 -1 15 2 7 -2 -8 22 27 -26 7 18 -10 1 1 -18 6 12 -30 -7 20 -7 5 5 -6 16 28 -20 -3
5622cK3j7Mj5pK3K8m8J1J4kj2Oj3K9Pl8kM2k6pJ9l0J6J4j2jJNqj2jJ6J1l1j0L8
$$ -3 20 3 7 -8 -15 8 36 -12 -1 13 11 -1 5 -8 21 28 -10 -12 30 4 -3 16 -14 2 16 4 3 4 9 1 -11 -12 4 15 -16 -26 12
5659A2Mjk3KJ6Pj9kK1j6Ppj4L5Nl9jK7lqOj6J1K4l8qL3Qqj3j2J8Ljj2J3J3j6p
$$ 12 16 15 -8 -6 10 17 -2 -4 17 1 8 1 -13 22 27 -12 -13 14 11 3 9 -7 4 28 -10 -18 15 23 15 2 -10 8 11 10 -2 11 24 8 1
5698AkQRj8rK0PqrJ1j1J3qrKJ4qj7JK0Pj0j8J2nJ4j7OjK4k6j7K5NjqrJ7K1j2k4
$$ 1 -1 7 16 -2 -11 9 16 8 -1 10 -1 12 4 -5 -3 11 3 -14 -13 7 14 4 -14 -2 -7 7 -10 -4 -5 19 -7 -24 1 6 5 -3 -12 5 26 14 -10
5739a0J1J8j6j6J8qQpj6J4K4Km2K4jJ2k0J5pmJ2j8OROj6JJ4pP%k2K2J4l3jJ0N
$$ -10 1 19 3 -13 5 -3 5 -2 -18 -4 20 22 -20 4 3 15 -5 10 3 -1 11 -7 -1 8 14 -2 -1 13 6 13 13 -9 13 27 -6 -7 3 8
5777HNj2j3K2qPj9MJ2ommL5j6lnLpK1ql1K5K4l2lNJ1kqlmK2Kl7kL2Lj8JJ3Nk0
$$ 8 13 1 -12 10 2 9 -10 -6 6 0 -4 -8 27 11 8 3 6 -1 20 12 -19 6 30 -2 -5 0 11 9 1 -2 -6 16 18 -19 -21 11 14 -4 -3 10 15 -5
5819eJ0JoJ5k1j4J8K8k8pPj1K4Nm4K0M0m0%J3k5J1J8k1pL5j2k4%J6klkrK0P%j0
$$ -5 5 6 0 15 -6 -20 -2 26 -2 -9 -2 -13 11 16 -28 -8 32 -8 -8 5 -20 -9 9 -12 -19 16 4 -20 -20 -4 -6 -9 -11 -20 0 7 7 -3
5857c%K2j6k3K5K3l0P%j4L7jm9J4M7l6l5N3k0j1K6l4JL8%l4JJ0KqJ1k7L4Kk1J8
$$ -3 -3 19 3 -20 5 28 -2 5 5 -9 28 27 -22 -8 39 3 -32 21 1 -10 16 -18 -17 21 21 -13 -12 -2 0 -8 3 -24 10 12 -9 9
5893Ij1K6nm6PN1l3mJ2k1JL3l6j0O0l2k5L4rk7L7j5j6K5J0m0J4J4l%j2kK1Pk6
$$ 9 -2 24 19 -27 -20 31 -2 -6 6 -15 -14 19 -17 -27 33 1 -24 10 1 -26 11 -4 -20 5 15 -25 -11 3 0 0 -12 -14 7 14 -12
5928a2OMJ1qj6J8K5k5k6L7k8QK6j9m1P3j3n6M4Ok5J8Jl0J9K2l9NK7rpJ1k5RRM
$$ -12 -6 -2 9 1 -15 3 28 3 -23 14 -14 -6 20 1 -40 33 20 -36 8 14 -11 7 8 -22 -3 19 -20 -15 12 3 -4 7 -18 -9 0 4
5964Dj8jK3Kk1pM3qk6J5j2j8N1l1k3L8K1o6L3L9m8LK6m9J0M3l6qM1jl4L4Kk8R
$$ 4 -14 -15 8 10 -11 -18 25 17 -9 6 -6 -24 27 -4 -27 11 32 -34 -1 38 -10 -7 19 -30 -20 23 -13 -21 20 19 -15 19 21 -7 2
5999BLlj6J9K2l3j4L2qk2K1Jk4L0Rn3L6K9n5NK0oKK2m0nM2j3l8L4J0l1RJ2l0L8
$$ 2 5 2 -14 5 27 -6 -20 12 4 -18 3 4 -20 10 19 -34 2 31 -24 -19 1 -5 -3 19 -21 -26 16 3 -35 -1 9 -22 -13 -1 -31 7
6035GJ1m4K1K0j2k0J9kmJ2j0j6QK1mk8J2K3pj3J5j6pK9k4j0N7j9l7K1RrnJ1j8
$$ 7 18 -26 -5 15 3 -17 2 0 -4 8 -2 -18 -10 11 7 -21 -9 14 7 -6 9 -7 -14 15 -9 -19 38 19 -18 3 12 3 -2 9 -9
6070iK8kj9KJ8nprrJ8Lk0J0Jpj1J4oK0qroJ9j1ORl0J9J9l6jL8k3qK0okJ6k7qJ5
$$ -9 19 17 -2 0 18 13 6 -3 -12 6 9 -11 -1 0 -7 -18 -4 -10 10 2 -7 -13 6 -5 1 10 -20 -1 18 -18 -19 19 -4 -12 8 2 0 16 -11 -19 -4
6111dK2k6NJ5oj%nJ0ONl1kK0jk0J6Jk0J3Nj9J6K5m6j2O4j9k5K6j9j0L0k6k6M4
$$ -4 18 -8 -3 12 6 5 5 0 10 16 21 -10 -12 8 7 -13 3 4 -16 -3 2 -17 -1 24 -22 -34 30 11 -14 12 -7 -17 13 -13 -39 5
6147EK1n0RL8l0J3J7k9kK9j0l0K0PqmkONJj9PJ1nj1KL6k7JJ3j2KK2j9l7K9Rj3
$$ 5 26 -24 -15 23 -7 6 23 -6 -8 21 11 -19 1 8 0 -4 -6 0 5 6 -13 -6 5 0 -11 -9 27 0 1 14 2 4 26 7 -30 -1 8 -5
6185eJ0J1k7K5pl6K8J2%k3KQPloMQj5J1k5J6J6j3j8K4Lj8Mkj2K8J3m3J8K1j8j1
$$ -5 5 16 -11 14 7 -29 -1 11 11 -12 -10 -2 5 2 -4 0 8 -7 4 -21 -5 11 -2 -20 4 7 -11 -7 -9 -21 7 20 -23 -5 16 -2 -13
6222a3KOOK3l6rK5J1k3rL2j4qJ5%OOj9j7J1K4j2k0J1Mj4J5Kj2J3Kl2K3J6j0j3
$$ -13 -11 -5 1 24 -12 -21 4 15 -8 -17 15 1 -7 8 8 14 20 1 -16 -5 19 7 -13 -2 2 -12 3 5 -7 6 8 -24 -1 15 5 -8
6258hRKNRj2j4J6J1m3K2J7j6jJ7k4rL4k7KJ3Nk0PLj2K0Ql0PJ5Rl1OK5j0qPJ1j1
$$ -8 1 3 8 17 5 -9 7 18 -25 -3 14 -2 -3 14 -10 -19 15 -12 -10 3 8 -12 -5 -2 -14 6 14 -16 -9 6 15 -16 -10 15 5 -3 4 15 4
6297DOkj4J8J4k4qJ3oj0QJrK7Mm3J1K1k0ONJj1J9j8kK0Mm4K9J4l1J1J3k7OJ6O
$$ 4 10 8 -6 12 26 2 -6 7 1 -9 -1 0 -9 18 22 -21 -10 11 -9 -3 2 3 -8 11 -7 -9 11 15 -29 0 14 -17 -6 7 -20 -14 2 8
6335Hk4K0mj4MJ1NqJj7JK8km0K5OokJ7j0oL0l6j2N8k1l1RL6l8MJ5j6K6Ll8OL4
$$ 8 -16 4 0 -14 -10 1 6 -2 -1 -18 -17 11 9 -31 -6 0 -6 -8 9 -1 -7 23 -13 -25 33 12 -19 -10 26 -12 -8 7 -9 17 20 -18 -12 22
6373B2jj0j3kJ2Kj8J2Qj2kmj3K6J0l2J0J0rJ8j1k0K1J1l3jK9j0lJ1j7jK2mk4K7
$$ 22 21 11 -2 -4 8 10 -8 4 12 0 -2 -6 -19 7 17 -15 -5 5 -4 14 3 -17 4 15 -18 -19 10 0 -3 8 -9 -10 12 8 -16 11
6409A1l%lk6K2pkJ4pJ1Kkl3L3Ml7J9J3j6KK8m9K0L9k5k6L9j3j0K2j3j9K1ok0J4
$$ 11 8 8 5 -21 1 -6 -8 6 -1 10 12 10 -23 10 14 -23 -4 9 -7 -5 23 -26 -6 33 8 -18 21 8 -2 20 7 -12 9 3 -17 -3
6445cQlj0Pj0J6%oj4J9jpnJ2Ok2J4Rk3J6Rm6J8N1l5j6L3pj7K5j7k6M8lm5K5K2
$$ -3 5 2 -8 -1 -11 5 5 -1 -15 4 3 -4 -9 3 9 -13 1 10 -13 3 12 -34 -16 35 0 -16 17 10 -7 18 1 -25 23 20 -25 0 22
6482B2l9J8Qk0K1J1l3J1J7o%qj5K6Mk7K7k2j0K6k0kM0j8l0L0Kk6K5ql8M8Ll5K0
$$ 22 -17 1 9 -11 10 21 -12 -1 16 10 10 2 -13 13 17 -10 17 -5 -15 11 -9 -11 29 11 -19 11 13 -13 12 4 -34 14 17 -18 2
6517BK2l4lJ0k4K6Pk6QJ4m%kj1K9pl0L4Kk5K4nl4M5ll9K1K1m4K6Kk7K9J9k9JJ8
$$ 2 24 -10 -13 -3 -27 -1 6 -20 -12 2 -2 -2 -4 -15 14 7 -23 11 13 -12 12 7 -27 18 15 -24 -3 18 -26 0 2 -25 4 23 -6 -5 13
6554A3moOkJ2j3k0J9Nj1J8k5pL8j0m0L1Kk3K6kl4M3j3k1J5J7rjj3k1L3K0l9PK4
$$ 13 9 3 9 7 19 6 -14 5 10 -1 17 -8 -15 23 13 -27 4 6 -17 9 7 -27 16 3 -18 -3 14 5 4 -9 -30 3 23 -16 -9 15
6590A5k4J0J4k8J5K1l2kK1nlNj2J2Jk8J8J4k4K0mj2L0kk1lJ9j7OJ2l4K0J6l6L
$$ 15 -9 1 15 -13 2 23 -9 -11 10 5 2 7 -5 7 8 -20 -2 12 -12 8 4 -8 22 20 -1 -4 15 -2 4 16 -18 2 18 -18 -15
6625a5K2j6LJ1j6J8Kj7RKj2K8j9j1K5kk1j5L3j5JNljMp%MJ2j6joJ5kJrlJ2qJj
$$ -15 7 -9 -6 5 -11 7 9 -8 1 3 -9 19 0 -11 14 12 -9 -24 9 -6 -5 0 -3 -4 0 -7 -7 -3 9 -7 -8 -14 1 -1 0 -9 -12 0 -8 -7 -8
6666hOnpJ2Qj4K6j0l7K8J0jj2J6j8MRk1J0J6j6j0J1LpJ1j4J7KnmNmJ7j7j7J8r
$$ -8 -2 -7 -14 -2 6 -8 18 8 -29 -1 9 8 -4 12 -6 -2 7 -14 -4 12 -4 -14 -3 0 -7 4 -10 7 9 4 0 5 1 18 1 -16 2 -7
6704gjJ2Lk6J7Lj3K2kk7J7MLJ0j0k0J1RlLj0LQlj9K7Mj4Mj0J1Mqj5K3Jj6K0j8
$$ -7 -8 4 7 -19 -2 1 -12 10 8 -19 -2 2 5 15 5 -15 -4 5 2 5 -5 -2 6 3 -16 11 15 1 5 -5 6 10 2 -13 10 11 -5 15 -3
6743crL9k9j7K6Nj1knJOJnPLj1%%PJ2pj8J7kj6L4j4j4J6Nl0J7J9l5K0mj4K4pr
$$ -3 -12 27 -2 -19 7 12 1 -1 -6 -5 1 2 -3 4 7 -4 -4 -4 3 15 8 -10 7 5 -11 23 9 -5 11 16 -14 3 22 -13 7 3 -11 13 6 -3
6783cj0L1k9L%J2J0j1k0K5Om%j6lJ8Jk0L6j8j0PKk4K5Qk3J7J5j8kOj0NJ0l3RK8
$$ -3 -13 18 -11 -8 -8 4 14 3 -17 8 14 10 10 -6 -9 9 10 -10 26 8 -2 5 7 -17 8 16 -7 10 25 7 5 11 1 6 16 -17 -8 20
6821B0k5kJ1k0K0j3PnJ8Kj4Jj2K3Kk4J5kPPpj1OOk8J7J8j2nPj5J8J7l9lK1ooJ3
$$ 20 -5 -7 4 -16 4 -9 -2 -7 11 13 -1 0 -12 11 13 -11 4 2 9 16 9 -2 4 10 -18 -1 17 5 0 7 -8 10 27 -12 -15 6 0 -6 7
6860GPj0jj0pK0Qk1jPLKJnkPjj5J7J1kj8LRmj5J1j1QJ1poJ1Lk3J0%OOj5NJ3J0
$$ 7 14 4 3 -7 -14 6 14 -7 -8 -1 2 4 5 0 -2 5 4 -11 6 17 15 -3 0 9 5 -10 1 -10 -2 9 2 -4 7 10 -13 -3 -3 3 9 -6 -1 12 22
6903B2k3j0QJ1nJ2j7J2j0Oj0MK2oj6pK7j4j1pJ9j5K4qk4K4J6j9njMmK1j8J0j2
$$ 22 -1 -11 -3 8 3 15 -2 10 0 6 -4 0 22 16 0 -7 20 6 -5 -12 7 -8 16 8 -16 8 24 5 0 -1 3 -1 20 2 12 0
6939@lpJ3Oj9KkRPj1Oj3J1NJrJ0J3l1J1jJ2j3Oj5J4J0j7MNj0J9Jj4mJ2%j1kJ7
$$ 0 -3 -10 3 9 -10 -8 -10 -1 6 -5 1 -12 -1 4 5 -4 6 19 -12 -1 -2 10 -3 3 -12 2 12 -5 -1 4 -6 13 14 0 -4 8 8 -3 -5 12
6979A2k1J8kpLjjj5J7J5k2J1pJJ0j1Jj1J7Qk4PK0j9rPNMnMj8K3lk6J5J6Rk7Pj
$$ 12 -9 9 7 0 3 2 1 -14 3 18 -4 7 0 1 11 0 1 -10 7 15 -9 -2 18 -1 -10 -3 2 6 1 5 -13 10 7 -19 -4 12 21 -6 1 0
7019@PKMk9J5J6k0mJ3jnmlK6j1J0l0NK1Nrj5J5m%Lk3J7Oj6%J6kj0J1KrQMj3lJ5
$$ 0 7 9 13 -16 -1 15 -5 -9 4 3 -2 -6 -9 17 6 16 -14 -9 12 17 8 -7 8 4 4 7 -16 1 7 -9 -9 7 5 -5 6 8 -1 7 11 -2 -5 10
7061A0j6j0J2J2j2QpmJ7j2oJ5llj2NRnPjk0PRnoONoJPRlmk3J5J2jj9K0j1J4pJ0
$$ 10 -6 -16 -4 8 -4 4 -3 -7 10 -2 -8 7 4 1 -11 -6 3 -2 5 4 -16 -9 0 -5 -11 -5 0 -6 -5 2 11 8 4 -19 -4 8 7 -12 8 -3 11 4 14
7104A4k5J8Jk5JK6qrJ6j3K2rj4KJ3rmj5RK0omr%NRj3LJ3kk2J9LrNJk9J8J2ppJ2
$$ 14 -11 7 8 -17 -16 10 2 -7 9 -4 18 9 -5 -3 10 1 -3 -18 -9 11 5 1 -8 -8 -3 6 -7 -4 9 7 -15 4 7 -2 3 4 -25 -7 5 -2 -9 3
7146CplJ1qJ0oLknK0npM%lqJ8j5rK4k1nK8Jl0J3RnpOjLJ1j2j0RK0k5rNJ6j0KL
$$ 3 -4 -7 4 -4 6 0 3 1 -4 16 11 4 8 8 5 -3 15 0 -9 15 -6 -11 17 18 -12 1 10 5 -2 4 3 6 17 5 -5 4 24 -1 -10 -5 11 1 3 6
7190FMLomlJ6j9mO%%Qlk3K2J4k2NJ7k2OqRnK1qk1QK2j4j4K2j4%M%JJ4ok1lK5r
$$ 6 10 13 7 3 0 16 -3 -7 -1 -1 -1 7 4 -19 3 17 -5 0 17 -5 1 -7 2 -3 18 10 -11 -3 19 5 -9 13 -1 -1 3 3 4 18 12 -9 -12 13 4
7233DJrMJRrpPJ2j8mK4j3%j0kMKnj2J4K0oj5RLRknk6K0Qj3j3K3oJ4j9MJ3MorM
$$ 4 5 -4 0 1 10 1 -6 1 13 -5 -9 15 2 2 -8 -10 -6 -4 -9 -21 -7 13 7 -8 1 4 13 11 6 -20 0 8 -5 -18 5 -1 13 -6 -2 11 15 9 0 4
7277DJ4j3j1MjjLJ1qj2J7k5QL5j9jpJ3j2QKrKLrlQ%Qlj4NJ5oj1j2J5J6Kl2K6r
$$ 4 18 5 -6 -2 -3 -4 -1 10 2 -10 7 -18 -10 25 6 5 -2 11 -1 7 9 0 2 5 -4 -7 1 1 9 6 -8 -3 12 6 -5 -17 -2 14 16 -16 10 1
7319ArJ5j6MJ5j3kJ2pj2pK7%J0j9j8J8PpOj2pK5j2JJ4nQk1lJ1J1j7rL0nj6J6l
$$ 1 -8 7 -9 -5 10 -3 -5 7 0 -12 -19 8 8 18 -1 -19 -1 6 -1 5 -7 -14 11 -1 0 14 9 17 -4 -7 4 15 -2 -11 19 14 -2 14 11
7358A1k4K3Kk5J3J7lj6J5kj2J0j0mJ0Nj6oRK5l0%OknJ6qj2K8jm0K8J5k2oK6j5
$$ 11 -13 10 12 -13 0 17 14 -2 13 11 -1 9 -1 -5 5 10 -6 -12 -3 22 -8 -8 -2 -4 -9 7 -1 -13 15 14 -26 2 17 -5 -11 15 0
7395@POj8J2K0l4KK3j5%qlOJ7k1NkoK6rk2J7Mj6J5mj0K0j0j7LK4m3J5J7oKJ1p
$$ 0 7 13 -5 7 27 -7 -5 18 3 3 -5 -8 -2 15 -6 -1 -3 -9 17 8 -14 3 7 -9 6 2 -8 12 2 -15 -12 12 -31 -16 1 -5 -3 8 1
7434Aj5L2ok8K0PqkoKmJnlKJ7j5nJ1K8l2NJ0j2kJ2opL1k0lJ3rnJ4j7kRJJmQll
$$ 1 -14 18 12 -16 4 11 3 1 -5 -3 -7 -6 -11 -14 -12 5 -10 -15 -4 24 -8 -3 7 -5 -7 5 -1 -8 23 3 0 13 4 -1 13 -4 -6 3 4 5 1 9 6 3
7478CK%j4JOJ1j5J2lk2K0J0j6KJ%MOj9QQpj3QKoRklOjppK1Pjj2Rj0lK0j9nOJ1
$$ 3 5 5 -9 -8 -2 9 -6 6 3 -19 1 11 -5 -3 -2 -2 2 8 -11 -3 5 -2 -15 -7 -5 -11 -2 -4 -7 -1 -2 -9 -16 5 12 11 -1 8 -2 -5 15 -4 -9 -3 8
7523Hj0nJ4pj3J0RoPMj3JRrjN%plKlJ8j0j5PK6k9KJ5LoOMj9KJ9k3mJ0lmkOjLj
$$ 8 -2 -7 7 0 -13 -3 6 0 7 11 -2 -1 8 -1 -2 3 3 -4 -7 -5 -8 10 0 -15 -8 18 -11 -9 6 9 3 9 13 -6 -4 15 -8 -12 -2 -5 -9 -11 -5 -6 -3 -4
7569dPqJ6j1oOQr%kj5K1kk1K6J3j9j0J7j0NmQj0%J7k0J1NJ3k3Pjj2J0Lj2%J3j7
$$ -4 3 -5 11 0 -6 0 8 -1 -1 -3 -18 3 1 -20 6 19 0 -10 7 -3 2 -2 6 -4 -4 13 -7 4 9 22 -1 6 5 -7 3 6 -6 -6 7 -10
7609a0OkJ0jj3J4joRkp%Qj2%MlQ%%lkj8J5RJ2j1Ok2K1nKj3Q%Nqj1K5kk1J6Qj3
$$ -10 -4 -6 4 3 -10 4 3 -3 6 4 -3 -3 5 -7 -7 -3 -6 2 2 2 -1 -3 -21 -6 3 15 4 10 -12 9 4 6 -7 1 1 6 -2 -13 12 10 -11 5 13 0
7653@J3pj7J9Pk3OJ1mkJ6k3QMmj1J7qoJ7j9J0J0rj0Pj3J8mj8J2J7k7j1K9j1mJ9
$$ 0 13 6 -11 8 15 -8 -2 9 5 3 19 -4 4 8 4 -7 10 2 -4 13 -6 4 14 5 -5 2 -11 7 3 -15 -3 14 -13 -24 5 -6 -10 9
7691Irj3L1j7k4K9lj8J8kmJ7j0j7PJ4k6PRjJ2prJJ8j4Mj3J1J1j3mN%oK3rqJ2k
$$ 9 0 -13 18 1 -23 6 3 -15 3 1 -3 14 4 -13 -6 8 -18 -11 -2 -3 9 2 -7 -6 12 -2 2 -11 0 11 -2 -6 -1 -1 -7 16 7 -1 11 9
7731Ik4J9J6j7%J0j8K2qk0MR%j3llJ8Lqj0K7k2J2lNnJ7k4%K4j7nJ1j2MJ4l3K2
$$ 9 -15 4 20 3 3 13 -5 17 9 -11 -7 2 2 -11 -14 -17 1 4 -4 -14 13 -9 3 0 5 0 17 -7 -7 17 0 -5 6 -6 -2 12 -21 1
7769AJ6j9QJj3J0J2k1MJ3mrLJL%j6j2L3k6J7J5k5J2Rj6lK5k1j5J9KM%j4j9M1j8
$$ 1 17 -2 6 7 -6 4 16 -5 -1 12 8 -1 2 3 6 6 -10 -22 11 -15 2 17 -8 4 13 -3 -6 19 -2 -17 2 4 8 8 -6 -25 16 -2
7807bj4J8pJ0Lpj7K3JnlrJ5kk2RJ8k0JK0j6J0MonLRjMj4oK7j9j1J9rkKrRJ5j6
$$ -2 -16 2 -5 5 8 1 -16 7 8 3 0 -9 6 4 -18 -9 9 -11 -10 10 -6 4 8 2 -3 0 9 8 12 -2 -8 19 0 -11 8 -1 -3 -1 -10 -1 14 -2
7849bqK0j1J4JrJJ2j3j6J5oJ2j0j1MK5k5JK2j4j1K4j7jK2j2k5J6OpJ7j9nJ6on
$$ -2 -10 10 -1 13 14 5 6 18 5 -11 4 -2 10 0 -11 -7 18 -7 -6 16 2 -9 15 -2 -3 19 7 -18 -2 4 -3 14 -5 -10 6 0 -5
7886eJ1J3k2J7pqJ7Jk5J1OqKmJK3k3nRKqJJkR%nJ1opMj1pK9ok6J3mjQOj1J0j3
$$ -5 6 19 -3 14 7 -1 16 17 -8 3 9 1 3 -1 0 23 0 -5 4 6 -2 -1 0 -2 7 7 2 13 7 0 4 -7 -14 15 9 -17 -4 -8 -9 -1 5 -6 4 -9
7930iLPJ3nj2J0qJ0pj2MkLJ1k4J4%NJjMj5J6pnRmOpJ2rmPj5J8k2J3%J5omNpQm
$$ -9 -6 1 14 9 -3 7 -1 9 2 -10 -6 -8 -5 6 -18 -4 -4 1 2 1 5 -10 6 -1 -6 3 -1 5 -2 10 1 -3 4 -11 7 -15 -2 -2 13 7 3 8 1 9 5
7975ElmNoPl%JJ2k4%OMPj2MQj1nJLPpmJ1J0j6PNj4RrlkJ0J0rJkJ0Rj1%OrjOKn
$$ 5 2 -2 3 -3 4 1 1 2 14 -10 -10 -4 0 7 -5 -1 7 -4 -9 -8 -5 2 -5 -9 2 12 -4 3 8 -6 3 -6 -9 -11 -1 9 0 1 -1 9 18 7 7 13 4 3 9 11 6
8024FJ1j0pM%MmOj0J1j5J0J5k3Pj2M%Mj5J2k%oK0j0Qj6J1lJ9j1j3kKMJ0ojrNk
$$ 6 17 7 0 4 4 8 4 10 0 11 -4 6 21 -2 5 -7 -3 -3 1 -14 -2 -4 -4 -10 10 0 8 -8 3 0 19 8 -5 -7 -5 -1 9 3 2 -7 -2 -4
8066dJ2K%mnmQJ2j7Oj4NJQOJj4nQJQomJjJ7k0J4%j8NNqM%RmnP%mqRj4J2Kmj5J3
$$ -4 8 10 10 6 1 -3 5 17 0 6 -8 -3 -2 6 12 13 -1 -6 2 3 11 5 1 2 1 18 -2 12 12 -6 -1 4 -4 0 0 9 5 0 7 7 3 -5 4 -10 2 4 0 -15 -2
8115brKQroK7rk9L7rj9J7J4prNQjNpj7J2pnOJ2j1mKK3j1QpolMJj3K2nqLkPpNj6
$$ -2 -11 -9 -1 -10 -16 11 2 -27 10 1 -18 -1 13 6 -3 2 10 9 14 7 -10 2 -5 -10 -4 8 -3 -7 -5 18 7 15 8 2 -1 3 4 -9 13 8 0 3 1 8 1 6 -10
8162a0OQNl2J7NlK0k1PJrPj8K0Lk2J4J6j4mRj1PRoj5J7J0
$$ -10 -4 4 9 -23 -6 -1 -4 16 -5 2 3 -6 1 -17 3 6 -16 -2 14 0 -4 5 -6 1 10 4 -11 6 16
8191A6
$$ Imaginary data points
##PAGE= N=2
##DATA TABLE= (X++(I..I)), XYDATA
0@%%%%%%%%%%%%qJ6j6J6j6J6k4L2l2M0m8N6o4P2q1Q9j04J20j36J52j69J87k11
$$ 0 0 0 0 0 0 0 0 0 0 0 0 0 -8 8 -8 8 -8 8 -16 16 -16 24 -24 32 -32 40 -41 48 -56 64 -72 80 -89 98 -113
35a13K36k60K90l22L59l99M40m87N39n96O62p36Q18r12J020j146J297j479J704
$$ -113 123 -137 153 -169 190 -209 231 -256 283 -313 349 -387 431 -481 539 -607 690 -789 915
54I15j993K375k909L712n068P936k3076K6462K2558o2605L9245J9268n5246J6900
$$ 915 -1078 1297 -1612 2100 -2968 4968 -18108 8354 30912 -31693 7552 26820 -28426 -11526
68a1526L9184l8735M810K5811k8322m942K3580j1377K190P721j4928K970P309
$$ -11526 27658 -11077 -6267 19544 -8778 -13720 9860 -1517 673 8394 -6534 -3564 3745
81C745j0884J1634N060j7519O331O755j3750R221Q957j2134R27K039n706Q212
$$ 3745 -7139 4495 9555 -7964 -1633 5122 -8628 593 9550 -2584 -1657 382 -5324 2888
95B888n24m792R396r184q844J8970n208j2339K1125o319k2919K1360N923k0231
$$ 2888 2364 -2428 6968 -2216 -11060 7910 2702 -9637 11488 5169 -17750 3610 9533 -10698
109a0698J5872N280k2898R820R315j2777J0183L181j5039Q380j4r868J9148j866
$$ -10698 5174 10454 -12444 -2624 6691 -6086 4097 7278 -7761 619 605 -9263 9885 8019
123H019k1431J7867K128k3787K2498J1918l1212J1178J7412k8488O310K6696k1619
$$ 8019 -13412 4455 6583 -17204 5294 17212 -14000 -2822 14590 -13898 -7588 19108 -2511
136b511p959K0286j1932q403J8246k437j0120N769n12l747K594K159L082l911
$$ -2511 -10470 9816 -2116 -10519 7727 5290 -4830 939 427 -3320 -726 1433 4515 604
150F04o455O859O21o488R727Q79j3373O882N148j0796P922O944j3527K418O493
$$ 604 -5851 1008 1629 -4859 4868 5747 -7626 -744 4404 -6392 1530 8474 -5053 -2635 3858
165C858r760O272Q406j2888J130P903j0668L272J1418j0724k186R223q975j808
$$ 3858 -5902 370 8776 -4112 -2982 4921 -5747 -2475 8943 -1781 -3967 5256 -3719 -5527
179e527J2337m590n946N784l020k780N842k82j402M42l327J810J608l409N411
$$ -5527 6810 2220 -3726 2058 -962 -3742 2100 1818 416 858 -2469 -659 949 -2460 2951
194B951J474r908L687O195q453L392Q204j0589j809R677o611k458J0570m367p081
$$ 2951 4425 -5483 -1796 4399 -4054 -662 7542 -3047 -4856 4821 -1790 -4248 6322 1955 -5126
209e126O027m62l285N444K15m411M60K82M07J372m26J323j331m418L377L118l705
$$ -5126 901 439 -2846 2598 2813 -1598 -1138 -856 -449 923 497 1820 489 -3929 -552 2566 -1139
226a139K546J409p037K283N532n065R67M862o435j508N990k867o70N147m181l634
$$ -1139 1407 2816 -4221 -1938 3594 -1471 -504 4358 -2077 -3585 2405 -462 -1132 4015 -166 -3800
242c800M602k62j584L118j070k624J106o2K05J683l52n68j279j451K847J341k449
$$ -3800 802 540 -1044 2074 1004 -1620 -514 -576 -371 1312 960 392 -887 -2338 509 1850 -599
259e99J543K8m080K498K966l407J622K271n624L5N167k152p19L023l589k069M219
$$ -599 944 972 -3108 -610 2356 -1051 571 2842 -2782 -2747 2420 268 -451 2572 -1017 -3086 1133
276A133k18j635K387r06k861J038J526K51L55o42j101o96N93K133l20j677J237
$$ 1133 915 -720 1667 761 -2100 -1062 464 715 1070 428 -673 -1369 -776 1357 1037 -640 597
293E97n15k414K441J968k480N84Q21l247J076L516k101j064K083j799j394K525
$$ 597 82 -2332 109 2077 -403 181 1002 -2245 -1169 2347 246 -818 1265 -534 -1928 597
309E97L01r68R57p96j745Q88J595J89o76o70m7l25Q9J545J71j367J97l35j244
$$ 597 898 -70 887 91 -1654 -766 829 1018 342 -328 -375 -700 -611 934 1105 -262 -65 -400 -1644
328a644K053J755k220p88R52j147M86K191j016j272R27q38p94K065P73j423m70
$$ -1644 409 2164 -56 -844 108 -1039 -553 1638 622 -650 277 -561 -1355 710 1483 60 -410
345d10j83k43J070Q25o58p12j05P5O7L08P55p3j310k42P69J00L83M48j159o30
$$ -410 -593 -836 234 1059 401 -311 -416 -341 -274 34 789 716 -594 -836 -67 33 416 864 -295 -925
365i25J115o1o30J041K79j326o0N61k96N43P79j083r01R18L23o33N45O39r28o29
$$ -925 190 129 -501 540 819 -507 -567 -6 -302 241 1020 -63 -964 -46 277 -356 189 828 -100 -729
385g29N96M9J3J027m19j700N33J305p39k7J037j115r29J357o9o87J469j51k260
$$ -729 -133 -84 -71 956 537 -1163 -630 675 -64 -91 946 -169 -1098 259 190 -497 972 821 -1439
404a439P39J658r64o9R10j335n05J649l04r76J234Q1j721M85J323o76k54P11q52
$$ -1439 -700 958 -6 -75 835 -500 -1005 644 340 -636 598 679 -1042 -557 766 90 -164 547 -305
423c05n52J445J5j384P84Q54j350j15J187o54k64J080p90q93J396M4j227Q17O25
$$ -305 -857 588 603 -781 3 857 -493 -608 579 -75 -339 741 -49 -942 454 498 -729 88 713
442G13j068M0M67m67M40O23q84n18N64L28o2j40l7N5l23oN52q0j37K05p15k44
$$ 713 -355 -315 152 -315 125 748 -136 -654 -90 238 176 36 -1 54 -269 -275 277 197 60 265 -450 -694
464f94J324Lj079L62K16n61N70L12p53K36M09o59l8O32O6l74l10J93L75k15n3
$$ -694 630 633 -446 -84 132 -429 141 453 -300 -64 345 -314 -352 280 346 -28 -338 -145 230 15 -38
485c8K07m80K36O69r67k71J403n19r78J090j53r11J143M0j315J037N75j535L91
$$ -38 169 -311 -75 594 -373 -644 759 240 -738 352 199 -712 431 471 -844 193 768 -767 -376
504c76J129q56q5N08q00J66J021n62o09M98J02k63P8J65P1k28j53J93j10K00M87
$$ -376 753 -103 -188 320 -480 -314 707 145 -464 34 136 -127 -49 116 187 -41 -194 -1 -111 89 576
525E76q11n28J188K7r52P12J05r91Q41M25j305O90R94j511j49J417o95m97R95
$$ 576 -235 -763 425 452 -500 212 317 -674 167 592 -713 -23 971 -540 -689 728 33 -464 531
544E31o09n92J227k11j099Q25N27r02P4M44l96J68M13n42k82O38O6n34J01M42
$$ 531 -78 -670 557 346 -753 72 599 -303 -229 215 -181 -13 400 -142 -424 214 280 -254 -153 289
564B89j96l36J84J37r6K00q4n65L14P34m91n05M95nl11M16K0m54L69R9o71L18
$$ 289 93 -243 -59 78 -18 182 98 -467 -153 581 90 -415 80 75 -236 180 200 -254 115 214 -457 -139
586a39O98m42l84J76o3K38K96n43o1M91l40j13L70l35J17N61q25k37J132n04p34
$$ -139 559 117 -267 -91 -154 84 380 -163 -224 267 -73 -186 184 -151 -34 527 -298 -535 597 93 -641
607f41J048j78p27R52l39j061J327M03j443N49N01r17P00L63j150O89N16j279
$$ -641 407 229 -498 454 115 -946 381 784 -659 -110 391 -526 174 537 -613 76 592 -687
625f87N56P83j008L59L80j139Q04Q76j371M7P67o97M68L86j062N59L76j072P89
$$ -687 -131 652 -356 3 383 -756 48 924 -447 -400 367 -330 138 524 -538 21 397 -675 114
644A14M84j138R00J6j694J654R27k301R07J173k130R30J474k300N96J811k151
$$ 114 598 -540 360 376 -1318 336 1263 -1038 -131 1042 -1088 -158 1316 -984 -388 1423 -728
661g28QJ745j508K26J225j787O02J361k089N28J602k020P04J493k718P02K509
$$ -728 -720 1025 -483 -257 968 -819 -217 1144 -945 -417 1185 -835 -131 1362 -1356 -654 1855
678A855k679j19K587k281m09K560j997n66K576j778r42K258j146n70J644j536
$$ 1855 -824 -943 1644 -637 -1046 1514 -483 -1049 1527 -251 -1193 1065 -81 -651 993 -543
694e43k19K066j576n78J808j316k54J700j552j59J760j594k39J632j402K52J340
$$ -543 -762 1304 -272 -850 958 -358 -612 1088 -464 -623 1137 -457 -696 936 -466 -214 1126
711A126k194N86K108k568J39K530k602p7K981k873p86L798k181j895L462j175
$$ 1126 -1068 -482 1626 -942 -803 1727 -875 -952 2029 -844 -1630 2168 -13 -1908 1554 379
727C79k124K829n85j909K328l25j881J606O2q67J175q92o33J755j021p65J892
$$ 379 -1745 1084 499 -1410 918 593 -1288 318 380 -487 688 -204 -837 918 -103 -868 1024
744A024j067r56K012j078j131K348p24j754J838r6j197J420m97j057J580m27j090
$$ 1024 -43 -999 1013 -65 -1196 1152 428 -1326 512 416 -781 639 142 -915 665 238 -852
761h52J466m55r26J525p10j107J924l75j592J429J86j173R83q7q82J033j33p30
$$ -852 614 159 -767 758 48 -1059 865 490 -1102 327 513 -660 323 236 -646 387 254 -476
779d76P62m33j71J143j207m40J975j184j224K221n49j665K071j95k171J939Q73
$$ -476 286 -147 -318 825 -382 -822 1153 -31 -1255 966 417 -1248 823 628 -1543 396 1269
796A269k321O97J298j378K7R87o83j35N21l17k13J54L35J31p67RQ91n20l69Q02
$$ 1269 -1052 -355 943 -435 -408 579 -104 -239 282 -35 -248 -94 241 372 -395 -386 505 -15 -384 418
816D18l93m32P62l72m44Q95j80o25L94j34N2N88p19k62R48n01m66Q59k99m60P33
$$ 418 25 -407 355 -17 -461 434 254 -371 23 -111 -59 529 -190 -452 496 -5 -471 388 89 -371 362
837C62l54n33Q05O8n50Q6QK25J19n78L34M11p89L32N24j049M83J022j413j72J474
$$ 362 8 -525 280 348 -202 -116 -108 117 236 -342 -8 403 -386 -54 470 -579 -96 926 -487 -659 815
858H15q49o18J146l80n37P91l74m67O51N0j84j00l06N16J60q08O28M01j073M96
$$ 815 -34 -652 494 114 -423 368 -6 -473 178 228 44 -56 -362 154 314 -494 134 535 -538 -42
878d2M79j134P96Q44j613K52J157j169K09R43j239L08J070j455J19J387j204r3
$$ -42 437 -697 99 943 -670 -418 739 -430 -221 722 -517 -209 861 -594 -475 912 -292 -385
896c85J149j276N3J476j300m79J574p74o29J076n65l25R74o57m12Q80l46j69L87
$$ -385 764 -512 -459 1017 -283 -762 812 38 -591 485 -80 -405 569 -88 -500 380 34 -135 252
915B52o73L59O58j052K32R00j049J14Q54j140L04J252j395k84J367q89k55J145
$$ 252 -421 -62 596 -456 -224 676 -373 -259 595 -545 -241 1011 -384 -668 699 -190 -445 700
933G00r15k23J177j034m09J375n73m84Q97p94k75J247p35n07J170n17o51Q47m22
$$ 700 -215 -438 739 -295 -704 671 98 -386 511 -283 -558 689 -46 -553 617 100 -551 296 -126
952a26k23J052o41o62Q69k75l08P52m99k49Q59p32m72J176l11n88P73n19m72J131
$$ -126 -349 703 62 -600 269 -6 -314 438 -61 -310 549 -183 -655 521 210 -378 395 -124 -596 535
972E35l03q44R12mp70N82N1m62O10j19o64M91K13l10J76j83j23M79k89k85N98
$$ 535 232 -612 300 296 -474 108 159 -303 307 188 -476 15 228 -82 94 -89 -212 267 -22 -307 291
993B91k09l46M35l49j49R17m12p67P57Mn72O82Jo98O12O2r11O40O41p40l9K84
$$ 291 82 -264 171 -178 -327 590 178 -589 168 172 -400 282 283 -415 197 259 -652 -12 629 -111 -150 134
1015A34m48K54M81m77j24L83k09k59K41J95J7j73j70M4N2K03J06m02o2M96k94
$$ 134 -314 -60 421 -56 -180 203 -6 -265 -24 171 188 15 -155 -111 -59 144 250 -152 -214 282 -12
1036a2l64O21K8n13K92qm75O32L07q93J30O32n15j42O23l02k70M53k89l63O55
$$ -12 -376 245 273 -240 52 44 -431 201 508 -385 -255 377 -138 -280 343 41 -229 224 -65 -428 227
1057B27K24o54n3L68j34l8K56j40k37K20N8l79K16N53m29n02M64J20k83L54Ro27
$$ 227 451 -203 -256 112 -22 -60 196 56 -181 39 97 -282 -66 487 58 -444 20 140 -143 211 220 -407
1079d07L31M55o27M2P01m35m56M56mj90M40j23o14L30M49m22j34M38j12l62J96
$$ -407 -76 379 -248 -206 495 60 -396 60 56 -134 306 183 -431 -101 348 -74 -208 230 118 -244 -48
1100d8J30j82K27J81n75j06O71j18m71M12Q6n02K64K28m50K98M13o97k13P25o2
$$ -48 82 -100 127 308 -267 -373 298 180 -291 121 207 -295 -31 197 -253 45 458 -239 -452 273 211
1121B11l95L04n0l47L14J65l74J26L79l78l55M27K72l40J8J48l81J21N47m45l19
$$ 211 -184 120 70 -277 37 202 -172 -46 333 -45 -400 27 299 -41 -23 125 -256 -135 412 -33 -352
1142c52O83j47p09N51L57n66K06K26o59K27P20n61l45O23j20m61L51J76k94J43
$$ -352 331 184 -525 26 383 -183 23 249 -410 -183 537 -24 -369 254 134 -327 24 200 -94 49
1162D9J03l81l8N57k0n64J59M04l91j16N27k54k94N44k62n90Q01K72q75K26M54
$$ 49 152 -229 -267 290 270 -294 -135 269 -122 -238 289 35 -259 285 23 -567 234 506 -369 -143 311
1183C11n85J82M76n71NN48m53k93N63O8l15K3k0l0J52Q1j15j78J70J96m28j2O41
$$ 311 -274 -92 384 -187 -182 366 -87 -380 183 251 -64 -41 -61 -91 61 142 27 -151 19 215 -213 -225 416
1206D16l15m55N25j60l72P70j43q85P60L16r63M45N49p53K15L97p49K29O92n76
$$ 416 101 -354 171 11 -361 409 266 -619 141 457 -506 -61 488 -265 -50 347 -402 -173 519 -57
1226e7k19M20j86K2P8j89K55jl61L05o3k39O58k83p88Q46J95r05O65K71r46O28
$$ -57 -276 144 -42 -20 58 -131 124 123 -238 67 4 -235 423 140 -648 198 393 -512 153 424 -522 106
1248A06L36j090O49P17j100J33O33o98L11M66p94K45M44o38K14K98m21M40j15
$$ 106 442 -648 1 718 -382 -249 384 -314 -3 463 -331 -86 358 -280 -66 232 -189 251 136
1267A36p19P79J49p74P39r7r12J127rj327J268L92j675R45O58j519J015P82j912
$$ 136 -583 196 345 -429 310 213 -699 428 419 -908 360 752 -923 22 680 -839 176 958 -954
1286i54O96J242j629L32J190j330J41J011j232K03J135j022r7O81p46L68N37r96
$$ -954 -258 984 -645 -313 877 -453 -312 699 -533 -330 805 -217 -314 367 -379 -11 526 -470
1304d70M35N61j057M89N16r80P13L94j449P95Q30j366N91O94j441P08Q35j576
$$ -470 -35 526 -531 -42 474 -506 207 601 -848 -53 777 -589 2 696 -745 -37 798 -778
1322g78O80J094j626L14J041j359N91J013j691L60J240j473L31J164j463L45J081
$$ -778 -98 996 -630 -316 725 -634 -43 970 -721 -361 879 -594 -263 901 -562 -217 864
1339H64j670M28J512j626P3J324j587K40J624j719j16J805j546m63J808j096m86
$$ 864 -806 -378 1134 -492 -419 905 -682 -442 1182 -537 -653 1152 -394 -857 951 -145 -631
1356f31J596j211o86J745o56q29J242n55n78J039n51l36R89o09l66P19o20K02
$$ -631 965 -246 -932 813 157 -672 570 15 -563 476 -75 -411 578 -31 -397 322 -298 -96
1374i6Q31j183O8J112j179Q2J249j334L8J437j641j35J982j407o59J834j271o54
$$ -96 735 -448 -380 732 -447 -365 884 -450 -412 1025 -616 -751 1231 -176 -835 999 -272 -926
1392i26K099j199j054K128q94j343J968m79j249J787n88j435J799p6j435J353
$$ -926 1173 -26 -1080 1048 154 -1189 779 300 -949 838 250 -1185 614 538 -897 456
1408D56q1j229J283j09j128J306m7j221R80K1p74J076k84r86J077j14q51J007
$$ 456 375 -854 429 320 -808 498 451 -770 210 231 -543 533 249 -737 340 226 -625 382
1426C82j48p33R39m15p81J236j47q40Q71l57o07J132m30p18J222m74q69J205l89
$$ 382 234 -499 440 25 -756 480 333 -507 364 7 -600 532 102 -616 606 132 -737 468 79
1445G9o82J364o22j118J565k36j211J395j29j321J406Jj530J385M47j638Q40O33
$$ 79 -603 761 139 -979 586 350 -861 534 405 -916 490 491 -1039 346 793 -845 -5 628
1463F28j266O95N95j288M64Q15r93J04O88o06M9L22m64J94L56l24l6qn7L47j91
$$ 628 -638 57 652 -636 -172 643 -350 -246 442 -164 -115 207 -257 -63 293 -31 -67 -75 -132 215 24
1484B4k39M65k14l73M97j78j98P13m05o93P83M4o15O56L1p31N44J23p69O37M49
$$ 24 -215 250 36 -337 160 -18 -216 497 92 -601 182 226 -389 267 298 -433 111 234 -535 102 551
1505E51p83Q3L24m33K61L47n07M1L67l43j04K92m0J5J3k42P3K13j17m0J9n1J33
$$ 551 -232 -149 175 -258 3 350 -157 -116 251 -92 -196 96 56 71 84 -158 -85 128 11 -29 -10 -61 72
1528G2j4j98J30J61j79p1R4J8N1k9j52QJ83M6j49o5J23J5j51N0J62n9ql8k26J36
$$ 72 58 -140 -10 151 -28 -99 -5 13 64 35 -117 -109 74 120 -29 -94 29 44 -107 -57 105 46 38 0 -226 -90
1554i0L47j76k16K03o7j39J45L8o4J74o4l47J21K85o9r8M3l6m2L9j3mJ29O5k62
$$ -90 257 81 -135 68 1 -138 7 45 -19 155 91 -256 -135 150 81 -17 26 -10 -52 -13 -26 -30 99 164 -98
1579i8j10K44R1j62O6oj39J66L9k84K11K44l58r7L00j04m0J98k68q7M06j19l17
$$ -98 -208 36 127 -35 31 25 -114 52 91 -193 18 262 -96 -193 107 3 -37 161 -107 -194 212 93 -224
1602b24K72O6k29J02N7j14J45K8k28qK02P7j40j07J09N4j38L5J43j18O1N5l30
$$ -224 48 114 -115 -13 44 -70 75 103 -125 -133 69 146 6 -101 8 62 -76 -41 102 -16 45 100 -230
1625b30Q0M49k31k35K71r7j68K64n9j66K89n5l59J62K23q1pp5r5J37M0j03N9K6
$$ -230 -150 299 68 -167 104 7 -161 103 44 -122 167 112 -247 -85 138 57 50 -25 -120 17 57 -46 13 39
1649C9k1k4j24P2K58j26j92Q1kK0J54j66r0K50r5k31K32P9j37P3r8j72K92J38
$$ 39 18 -6 -130 -58 200 74 -118 -37 -39 -19 135 -31 -121 129 34 -197 35 114 -23 50 -48 -220 72 210
1673B10l02PJ89j31p5J32j7kR5j35j62J79J97j19j71J02L8r2N6P8r9O5N6k55R
$$ 210 -92 -85 104 -27 -102 30 13 11 106 -29 -191 -12 185 66 -105 -3 35 -57 -1 77 -22 43 99 -156 -147
1698a47L61o0k84R7O0r8J39L6j96P4J36k21n0K90J8k10k3J6nJ79K9k25NJ57j24
$$ -147 214 154 -130 -33 27 -71 68 104 -92 -18 118 -103 -153 137 155 -55 -78 -62 -67 112 141 -84 -79 78 -46
1723d6q6K00Q4j38o3n2JK02Q0k18q9J26lo1Q3P6m9p6n2l7J51J53j05k41P4J39
$$ -46 -132 68 152 14 -49 -101 -100 102 182 -36 -125 1 -2 -63 20 96 47 -29 -81 -118 33 186 81 -160 -86 53
1749E3p1J4Q9p9n3N1j36Q3L01j41k87R2R7rJ04k9j95R1O0j60Q4K15o7j88o8O4
$$ 53 -18 -4 85 6 -47 4 -132 -49 252 111 -176 -84 13 4 108 79 -116 -25 35 -125 -41 174 107 -81 -149 -85
1775h5J51O0p2j28n2J27J3p2J22J30k67j06J57K0Q3J37k84j97L13L7j85J99M2
$$ -85 66 126 54 -74 -126 1 14 -58 64 194 -73 -179 -22 -2 81 218 -66 -263 50 87 -98 101 143
1798A43k59M8M3q2K49R2l26j14J66R5K6j0n6l1m5k7J25O2L7m5k89k5L47K6j59
$$ 143 -116 -68 -25 -107 142 234 -92 -206 -40 55 81 71 15 -16 -61 -88 37 99 136 91 -198 -223 124 150 -9
1823iQ2j16j37K24%j14K64n5m07J08K40k4J19q6l12J29J71j25J01J03j98m7ml8
$$ -9 73 -43 -180 44 44 -70 194 139 -268 -160 80 56 175 89 -223 -94 77 -48 53 156 -42 -89 -93 -131
1847a31K71J00k79q3JO1K00l4j68J44j03k34K70J36j51J58j95l57M32K44l70J32
$$ -131 140 240 -39 -122 -121 -60 140 106 -62 82 -21 -255 15 151 0 158 -37 -394 38 282 -88 44
1869D4J14m15J57K62k62J78K09m85r5L47OQ1jl03N5J29j24K02Q8k45R1q4k91M93
$$ 44 158 -257 -100 162 -100 78 287 -198 -293 54 60 141 140 -163 -108 21 -103 99 187 -58 33 -51 -342 151
1893A51K34n40J02J23l77L57L02n24J67K43n66J32M86k90R0J06n84K13N02l69
$$ 151 385 -155 -53 70 -307 50 352 -172 -5 238 -328 -196 290 0 90 196 -388 -175 327 -42
1913d2L5K64m73K8L64l28J79L75n71j15L57j61J99K22n32N6K91l90K39L72m86
$$ -42 -7 257 -216 -188 176 -152 27 402 -169 -284 73 -88 111 333 -199 -143 148 -242 -3 369 -117
1934a17J02J75o07L81O54o89q2M53n97J15O88n41r7N43n94j93O91j88j08K83n52
$$ -117 -15 160 -447 -66 588 -101 -183 270 -327 -212 476 -65 -162 381 -213 -406 285 97 -11 272 -280
1955b80m6O13k88m5L75n29m6M61m45J61O31o95k74N98l60P3O27o28k56O25m40
$$ -280 -326 287 -1 -46 329 -200 -246 215 -230 -69 562 -133 -407 191 -169 -96 531 -97 -353 272 -168
1976a68j25P27l59k76M17n04m6Q12l52l50M19l96j11O60l16j74N08n28k83O55
$$ -168 -293 434 75 -201 216 -288 -334 478 126 -224 195 -201 -312 348 32 -142 366 -162 -445 210
1996B10j60n1M21o71j82P54l48j24O40o00k97P19m86j34R82n72o67P63k15l22
$$ 210 50 -1 420 -251 -433 321 -27 -151 489 -111 -408 311 -175 -309 673 101 -566 197 -18 -340
2016c40Q69l47o86P19j54n29P78J4n67L71k27l55P58Kn09L26k07k72N84j04k92
$$ -340 529 182 -504 215 61 -468 310 324 -243 128 -99 -454 304 306 -203 123 -84 -356 228 124 -168
2037a68N13l84m39N91m0j44N26n43m31P42j69k82O78l79n04O36l08k62R38l05
$$ -168 345 -39 -478 113 73 -71 455 -88 -519 223 54 -228 450 71 -433 203 -105 -367 571 266
2057B66p24N85j97k92Q68k67o53O39k14n10Q18m1n13N25l77n17R29J0o10N13j94
$$ 266 -458 127 -70 -362 506 239 -414 225 11 -499 319 278 -235 290 -87 -604 325 335 -275 238 44
2078D4n71P44J7n10O04j46o92N09J74k97M67k46n56M89Q9k57M08j67l36L38k43
$$ 44 -527 217 234 -276 328 182 -510 -1 173 -124 343 97 -459 30 119 -138 270 103 -233 105 -138
2099a38j12O86k69m30L89l24q6P78l94m28O49m32l81Q62k04m01O83n39n93J029
$$ -138 -250 436 167 -263 126 -198 -284 494 100 -328 321 -111 -492 370 166 -235 448 -91 -684 345
2119C45m5n90O51k81o77Q11mn42P15q7q12M89J63l33N61j29o62M37Q0l04M66r4
$$ 345 300 -290 361 80 -597 214 210 -332 383 296 -516 -27 136 -197 364 235 -427 10 90 -214 252 158
2141A58l73L34k27k32O90j31m30L49k82j95P39k80l98N70l25m04O95j40l14N96
$$ 158 -215 119 -108 -340 350 219 -211 138 -144 -339 400 120 -278 292 -33 -437 258 118 -196 400
2161D00m40n20P96n2m22N73l11n34P45j14n02P99j67p54N64J3m03P50j25p97N63
$$ 400 -40 -560 236 184 -238 335 24 -510 235 121 -381 418 251 -503 61 74 -329 421 296 -501 62
2182F2R9n38O30O8o31M32l4n80O91K18o55L09k6m76O26J19n79M01L9n87M48J76
$$ 62 161 -377 253 321 -310 122 88 -492 199 417 -238 71 45 -431 195 314 -265 136 175 -412 36 212
2204B12l73L98p8o36M99K05m00M03r3n36N09L9m89O06M3o73L90M9m35O60N0p91
$$ 212 -161 237 159 -477 22 227 -173 230 137 -399 110 149 -340 266 309 -364 26 75 -360 300 350 -441
2226d41M63K11o25N33K13o66M18J06p22N71L98o84K46J69o41M93L71o78K90L00
$$ -441 22 233 -392 141 354 -312 106 212 -510 61 459 -225 21 190 -451 42 413 -265 25 325
2246C25o94K50L96m58L05J93p27K55M42m17J97J96n50K32K56m84L28L67o30Q6
$$ 325 -369 -119 277 -181 124 317 -410 -155 287 -130 67 263 -287 -55 201 -283 45 412 -218 -132
2266a32K78m41L64L42o54R3L78m77J74M02m53Q5K63n47J92M94l94j3J95m23K02
$$ -132 146 -295 69 411 -243 -150 228 -249 -75 327 -126 -41 222 -325 -133 361 -33 -46 149 -274 -72
2287g2L68m25J10K78m79O3L30k91J95K23n73P9M20l20R4K77m48M4L47m22J09M73
$$ -72 296 -129 -19 259 -220 -157 173 -118 77 300 -273 -194 226 -94 0 277 -171 -127 220 -202 -93 380
2309C80m08j75L21k73O8M23l59j59L42k16j04L33j50m4J60k82m8L62r7q5Q7k11
$$ 380 -28 -203 118 -155 -87 336 -23 -182 160 -56 -160 173 23 -21 139 -143 -191 171 74 -11 76 -135
2331a35L8K61k25PK62k73j16K54j22K6K75l27j86L67p8j06K11j37j35K17j06r7
$$ -135 -97 164 -61 -54 208 -65 -181 73 -49 -23 252 -75 -261 106 28 -78 133 -4 -139 78 -28 -125
2353a25K90p6k00P9k1L4J88j44j33J45n4m6J28m9k8J21k14n3K69k5r5Q5j53m1
$$ -125 165 89 -111 -32 -53 -19 169 25 -108 37 -17 -63 65 16 -12 109 -105 -158 111 86 -9 76 -77 -118
2377a18K25r4j17K47o3k18J01L8l0J48n5k11J13Q8q9L9L9m0Qo9k7J23N0o8m2p7
$$ -118 107 13 -104 143 80 -138 -37 1 -29 119 64 -147 -34 54 -35 4 43 3 11 -58 -85 38 88 20 -22 -99
2403i9P7J43j15r2J27l3p6J14k8m6R3p4j34J73R8j26m1J4k7Q5L1q5J8L3k7m2j
$$ -99 -22 121 6 -86 41 8 -68 46 18 -28 65 -9 -143 30 128 2 -39 -25 -52 33 64 -21 -3 30 3 -39 -40
2430d0J07K1j15m8Q9j6K3L5j00J7J11j33q1J87L6r8J6o4k6J32J0j25O5O0r4k0
$$ -40 67 88 -27 -75 14 -2 21 56 -44 -27 84 -49 -130 57 93 -5 11 -53 -79 53 63 -62 3 63 -31 -51
2456e1M8L6Pm1o9J0Q8M3r0o1Q2N2r8J8P2p3L2J4j04Q6J29j55r1J40Mk0L4n9l4
$$ -51 -3 33 40 -1 -70 -60 28 71 -19 -80 2 54 -44 -26 46 -27 5 19 -85 1 130 -25 -116 24 28 8 42 -17 -51
2485e1J08l9p1M9N9op3m3Q7M5p5oPl6R8k1j32J02J20j69k7J23o0L2P6j68j3J86
$$ -51 57 18 -53 -4 55 49 -24 -67 20 65 -10 -16 -9 -45 53 32 -100 2 122 -47 -74 49 -11 21 97 -71 -84 102
2513A02q6r1J03K1m8No1K7R2n0n0rK4R1m7j02J00O0j54O0N8j11J15N1k50R6K25
$$ 102 16 -75 28 49 1 6 -55 -28 64 14 -36 -45 -21 70 23 -79 21 81 -73 -13 45 -66 49 100 -150 -54 171
2540A71k12m1J67j35oJ57j53l0K00j00j31J33J3l2M8r0j1J11m4l8L0l1P1Oj68
$$ 171 -41 -82 85 -50 -56 101 -52 -82 118 18 -113 20 33 1 49 -41 -52 59 15 -23 7 -24 47 53 -115
2565a15J11J24j54k3Q4r4Q8J05k27J9K23j76o2J96j03m6J57j71n0K55q6j67J45
$$ -115 -4 120 -34 -57 27 -67 21 126 -101 -82 141 -35 -97 99 -4 -50 107 -64 -114 141 55 -112 33
2588C3k2n9J34j08o6J63m3q4P9n6L4J03j91J2K25j69j08K33j16n7K32k02j69L54
$$ 33 11 -48 86 -22 -88 75 32 -52 27 -29 5 108 -83 -71 154 -15 -123 110 -6 -63 169 -33 -202 152
2612A52m7k53K03J2j54J56rj66J66L1j74P0M0nM6j42j9K10j01o9J26j31j1K33
$$ 152 105 -148 55 67 -87 69 60 -106 60 91 -83 -13 27 22 68 -74 -93 117 16 -53 73 -58 -69 164
2636A64j82j18L03j33k16K66l4j69K65j24k36L41J5l04J96N1k13K13J2k86K14
$$ 164 -18 -136 167 34 -182 84 50 -119 146 22 -214 127 142 -162 34 85 -128 85 97 -189 25
2657B5J34k76Q1J33j53N8M6j42J21O5j52K9J0pJ47j24j41K53n5j71K19m8k01K35
$$ 25 159 -117 -36 97 -56 2 48 -94 27 92 -60 -31 -21 -28 119 -5 -146 107 52 -119 100 52 -149 86
2681H6l0k65L17Q8l47J10J42j78J20P8k42Q9J25j38K2Q1p2M0l1r5J58M4j74O1
$$ 86 56 -209 108 196 -151 -41 101 -77 43 121 -121 -32 93 -45 -23 58 -14 26 -5 -100 58 102 -72 -11
2705a1M4j00J31j3j68J31J03j85PJ02p2N9L6j26L1J08r2k7P1j1jk0p8Q1R0o7n6
$$ -11 33 -67 64 51 -117 14 117 -68 -61 41 -31 28 64 -62 -31 77 -15 -42 29 18 17 -3 -81 0 90 23 -33
2732c3J4PM7j3n1N0Jo4K0L0J1M4p0r9O9J26p8m4O9p0pR6o5m8J48m2j90J04J43
$$ -33 -19 -12 35 22 -29 21 22 -42 -22 8 19 63 -7 -106 -37 89 11 -33 36 -34 -41 55 -10 -58 90 48 -142 -38 105
2761A05j21PN3j23J7J59j10p4J90n3j60R2N7n2P2k4j37Q2Q5p1NM0k9j8l4j2J23
$$ 105 -16 -9 44 -79 -62 97 -13 -87 103 50 -110 -18 39 -13 59 35 -102 -20 65 -6 -1 39 10 -8 -42 -54 69
2788F9%r3Jk5L6R8n1q2R4l4q4P8L1j5N0j15j07J95L8j02M5m3p0J34j1j03J41J8
$$ 69 69 -24 -23 -48 -12 86 35 -47 47 13 -71 7 38 23 73 -42 -149 46 84 -18 27 -16 -86 48 37 -66 75 93
2816I3j95M6R1m4J06m3j76J02P3j11Q4L4j33J05k8j65K32J06k68N0P4j56J44J24
$$ 93 -102 -56 35 -9 97 54 -122 -20 53 -58 26 60 -73 32 4 -161 71 177 -91 -41 33 -123 21 145
2840A45k35M6J52k10NK13j06mM2j67M0J97r7m3O0j08L5R0j19P5J32k08m5J56p7
$$ 145 -90 -44 108 -102 -97 116 10 6 48 -119 -79 118 21 -22 38 -70 -35 55 -64 11 143 -65 -110 46 -31
2865c1N2J02k07kJ69j28PJ59j32j4O3j62Q7K06j59p3R3j18P0J48j65rJ59j96k3
$$ -31 21 123 -84 -86 83 -45 -38 121 -11 -25 38 -124 -37 169 10 -63 30 -88 -18 130 -35 -44 115 -81 -104
2890a04J97r2J3Q3k31K4K62j36o3J54j78j0K08j76j6K54k03j59K26m1n4J87j73
$$ -104 93 1 14 97 -134 -110 152 16 -47 107 -71 -81 127 -49 -65 189 -14 -173 53 12 -42 145 -28
2913b8j24K36n6j08J69l6r9P2q4j9J97n4j18O3n3PJ20r8k6J45j21j08J35pK1Q6
$$ -28 -152 84 28 -80 89 53 -46 26 -58 -77 120 66 -52 11 -42 -35 85 -13 -39 106 -15 -123 12 5 26 112
2939A12j80m5J76n2n2J33j13m3J07j10OK05j08j37J11m7NJ45j32p2J41o1o1J47
$$ 112 -68 -113 63 11 -41 92 -21 -64 43 -67 -61 144 36 -101 10 -37 -32 113 -19 -91 50 -11 -72 75
2963G5o0o6J03j19l3K44p1j68R5j3n2J45m9j13J30j2j14Q1M3k5K6p2n8R2L5n3
$$ 75 15 -51 52 -67 -100 144 73 -95 0 -13 -65 80 31 -82 48 36 -78 3 46 21 47 -25 -83 9 44 -9
2989iL8l2J4K2r9J6J65o3q7K8n6L7J16p5m9Q0o8m9R5j3K4M6j66k1J60kn6M4q5
$$ -9 29 -3 11 33 -66 -50 115 52 -35 -7 -63 -26 90 15 -34 46 -22 -71 24 11 35 81 -85 -106 54 52 -4 40 -45
3018d5JJ11r0m1J35o0q3Q3j3kQ3j14o5J48mo3N8o7qR3o7n1J09Kr1K2rK2Q1p8m7
$$ -45 -44 67 -23 -64 71 11 -72 11 -2 -4 79 -35 -100 48 44 -19 39 -28 -36 57 -10 -61 48 50 -41 -19 -28 -6 75 -3 -50
3049e0Q6l1m1P0m3M0P0j65m1J49k7k4P6j00l5J08o2m2J43k9j10L0nK5J11j01p5
$$ -50 36 5 -36 34 -9 31 101 -64 -105 44 17 -7 69 -31 -66 42 -20 -62 81 52 -58 -28 -33 -8 103 2 -73
3076g3Q2pk4P5o4nR4j24m3J69m0q1P6p0j9J49p3j17J42Pj08P2j6l6J14p5r6J18
$$ -73 9 2 -22 53 -11 -16 78 -46 -89 80 40 -41 35 -35 -54 95 22 -95 47 54 -54 18 2 -34 80 5 -91 27
3104B7Nn7L9k4j6Q3n9n9J25k8m7M0p3PJ54j05j05J61o2p5J42p2n8J56q5j33J44
$$ 27 32 -25 14 -10 -26 57 -2 -61 64 36 -11 29 -44 -37 117 12 -93 68 6 -69 73 1 -57 99 14 -119 25
3131B5N7j41O9ko5R4qq9P3K7n9K0l8J6J02q1p3J07l7k5Q5q2l7J61r6j21J92pj34
$$ 25 82 -59 10 8 -57 37 29 -60 13 40 -19 1 -37 -21 81 0 -73 34 -3 -28 57 -25 -62 99 3 -118 74 67 -67
3160f7J15m7j17J93j4j67J33M4j38O0K9p3J03Mj38O6N8o5L7l2j7R0n9p6J10mn0
$$ -67 48 1 -116 77 63 -104 29 73 -65 -5 24 -49 54 58 -80 -14 44 -21 16 -16 -33 57 -2 -78 32 28 -22
3187b2Q6r4p1K14o0j82J90J7j91J55Kj59J88J7k28J04J31j19K8K5r2P2L8j10Q2
$$ -22 64 -30 -101 113 53 -129 61 78 -113 42 44 -115 73 90 -138 -34 97 -22 6 31 -61 11 49 -61 21
3212B1K8q0M5k3m8J52l4j73J36K9j06J06k3j32J75Rk13J36R6j73R7M9j89J57O5
$$ 21 49 -31 14 -9 -57 95 61 -112 24 53 -53 53 30 -102 73 82 -131 5 101 -72 25 74 -115 42 107
3237A07k16Q2J43j75K7Q7j29R3Q0j62J6Q5n5M4j3q1J24qj62J53L2j37J00Mk00
$$ 107 -109 -27 116 -59 -32 55 -74 19 99 -63 -47 38 -17 27 14 -67 57 49 -113 40 72 -65 35 39 -161
3262a61K25P9k77J06J70k41N2J59k03N5J63j95k0J90r7k3M2p9N2P9j31L3R4r4
$$ -161 64 143 -134 -28 142 -99 -47 112 -91 -36 127 -68 -88 102 5 -18 24 -55 -3 76 -55 -22 72 -22
3286b2L6L5j37J02R8j76L6J16j30L4P8j39Q3J23k22K0J64j32L4R4j73M2J78k01
$$ -22 14 49 -88 14 112 -64 -28 88 -42 -8 70 -69 14 137 -85 -65 99 -33 1 95 -78 -36 142 -59
3310e9k6J96j10n8J07p3JJ15j19k7R7n3K0L1r6O4Q3j76M5J47j42J4J13j62J0K04
$$ -59 -85 111 1 -57 50 -23 -22 93 -26 -53 44 -9 11 42 -54 10 93 -83 -38 109 -33 -19 94 -68 -58 146
3336A46j63r7K01n2j04R8j1o3Q5k1r0O3M2j4k3k7M4L2q9J6P2n1QL0r8M1J48j43
$$ 146 -17 -114 87 35 -69 29 18 -45 40 19 -71 -8 34 20 -3 -30 14 46 -43 -27 45 -6 2 32 -66 -25 123 -20
3364b0n6J08m1j9O6o7j1J22j08n8J23j8o2P4m9m5J05Mj24O1P4o9m9O6J8k7Qj5
$$ -20 -76 32 -9 -28 38 -29 -40 82 -26 -84 39 21 -41 33 -16 -61 44 48 -76 -15 59 -10 -59 7 25 -2 6 -9
3392ik7M2N6m6q9Q5N7j23L0Q3q2QM8p5J1J06m3p5L8K5nk9j5M5J1m2J4lj3N4nr9
$$ -9 -36 6 62 16 -73 12 69 -54 -24 59 -23 -15 33 -42 -31 75 32 -43 -5 20 15 -14 -29 16 27 -15 -1 -4 -17 37 32 -67
3424f7O3P0q5j5P1o0K0K7n6J9N5l6l7J2J2M7m4m5O6ln0M0Rm2P7k1j05J01L4q9
$$ -67 -4 66 -19 -34 37 -23 -3 24 -32 -13 42 6 -31 -19 -7 40 -4 -49 17 14 -36 4 13 -29 48 27 -78 23 57 -32
3454c2N1j8p5J31j6j37J14P3j64O0P5j49J10P3k07Q8J50j70j4J14q4K2N8j06J3
$$ -32 19 1 -74 57 41 -96 18 91 -73 -13 62 -87 23 96 -111 -23 127 -43 -57 57 -27 -5 53 -53 -40
3479d0J04q7J7L6o8Q1Pj40J17P1j56N3O1j28J01P4k03O8J38j48qJ15j14L6P7j38
$$ -40 64 -23 -6 30 -38 43 50 -90 27 98 -58 -5 56 -72 29 103 -100 -32 106 -42 -50 65 -49 -13 64 -74
3505g4N2J18j18MN9r6P9O6j90Q1J27j68K7J06j42Q2R1k03M3J85j73j8J48j42J3
$$ -74 -22 96 -22 -18 41 -55 24 90 -100 -19 108 -60 -33 73 -69 13 104 -99 -56 129 -44 -62 86 -56 -43
3530d3J59j60l0K18j37r5J53p6l1J62j38q2J86p0q4J21m4k5O7p6l2J32m8o4O4
$$ -43 116 -44 -74 144 7 -88 65 -11 -42 120 -18 -100 86 16 -68 53 9 -16 51 -25 -57 75 27 -37 27
3555B7o9L3Q3j25JJ31j12k9J28j09QJ45j55p2K33r3j20J44n1o4J57r5r4J62k5
$$ 27 -42 -9 74 -51 -50 81 -31 -60 68 -41 -33 112 -43 -115 118 25 -95 49 -2 -66 91 -4 -98 64 39
3580C9j01Q4j0m9J10r2p2J71o0r0J27m1p0J50q9j33K22pj83J21J8j33J41Pj47
$$ 39 -62 22 12 -37 73 -19 -91 80 20 -70 57 16 -54 96 7 -126 96 89 -94 27 45 -88 53 60 -87
3605h7J10N8j59N3P2o2N6qj05Q4M7p1J8J3l7M9j7p1Q9L0q7K7nj2P8o8o6J35rj30
$$ -87 23 81 -78 -25 47 -15 41 33 -72 12 59 -12 6 19 -18 31 14 -57 32 62 -25 2 -3 -15 63 -5 -71 64 55 -75
3635g5J03Or5J17pj59J19Q2j60L5R4j09N6M5j18M4R4q6rN3k7K1lq2O7M1q3L3K3
$$ -75 28 34 -61 56 49 -110 9 91 -69 -34 60 -49 7 52 -66 -22 72 -14 -23 30 3 24 21 -61 6 47 -36 -3 20
3664B0n1N3K5j26N7J02j02j7P1m7J9L7n4qP8m5n7L3K8NJ1n6OM7k9J0jnK6m1l9
$$ 20 -31 22 47 -79 -22 80 -22 -39 32 -15 4 41 -13 -21 57 12 -45 -12 16 21 32 -24 -18 29 0 10 9 4 30 -11 -50
3695e0N6K7k4Ll0j6P2rq9P1M2j02K0O7n5L5L4j05J3J13m3n5L8mj5J2Nk6M9Mo7
$$ -50 6 33 9 12 -18 -34 38 29 -60 11 53 -49 -29 38 -17 18 52 -53 -40 73 30 -25 13 9 -6 6 11 -15 34 38 -29
3726b9j4O5K4l7k6%K9Kj6mK6Jj8l8L0K6J4l7n7O1K5k3LJ0j8qJ%J7M2l7n4MN1J1
$$ -29 -43 22 46 9 -17 -17 12 14 -2 -6 20 21 3 -35 -5 21 35 -2 -59 2 27 4 7 17 -1 -9 -8 -8 9 51 14 -40 -36 15 26
3761B6k2j4rK3kk0K4K5j4k4l6L3M9nn6rL5%j5J8J1mk0k2oO3L4o7m4M3PjK1j6k1
$$ 26 4 -10 -19 4 2 -18 6 31 17 -7 -43 -10 39 34 -22 -31 4 4 -11 7 18 14 -6 -28 -34 29 63 -4 -48 -5 2 1 22 6 -15
3796a5J2jl9N7N6p2k8JLM6K3o9J0L2l7KL2kJ7j9o4L2P9l7m5K3j3QK3k5mL8j0n5
$$ -15 -3 -4 -43 14 70 -2 -30 -29 -26 20 43 -26 -16 16 -21 -19 13 11 28 9 -55 -23 56 19 -26 -3 -16 -8 15 -10 -14 24 14 -41
3830d1QM6J9k9l3K1K8j3nqj6M8k2n8N1O3m9l4L0k6K5M3p7rP1l3l1L7NJ1nn7kQ6
$$ -41 -33 13 32 3 -30 -9 19 6 1 -7 -23 25 3 -55 -4 59 10 -24 6 -20 5 48 -29 -38 33 0 -31 6 11 22 17 -40 -42 44
3864D4k7m4K4j8PN3m3l0J04n3p5N8J4j1N3p6k5P5%o4L6K5l6J6k9k2P4K0p6RK5
$$ 44 17 -27 -3 -21 -14 39 -4 -34 70 17 -58 0 14 3 56 -20 -45 30 30 -34 2 27 -9 7 -22 -44 30 50 -26 -17 8
3895HkK3k7m4P4rn4K8QJ1J0l7k5O8j8k8K3oJK6l4n2J05mr4M4K8l6N3kr9N6O4q9
$$ 8 6 29 2 -42 32 23 -31 -3 5 16 26 -11 -36 32 14 -14 9 3 4 30 -4 -56 49 45 -49 -5 23 -13 40 38 -61 -5 59 -30
3929c0J7N3m4Rj1l2N7L5p7KM%N5k5m8N6J8q4M5L5m3K3Pq8M6P0o8j3N6k5k7M6l9
$$ -30 -13 40 -4 5 -6 -38 19 54 -23 -21 -17 -17 38 13 -35 21 39 -45 0 35 -8 15 22 -66 -20 50 -18 -31 25 0 -27 19 -20
3962b0PN3l6n4K7K6J4k9j7M3K0n3kL6l2M2Lr5N4P5p6l4Q7m6j8O0m4m0R4m1o8Q4
$$ -20 -13 40 4 -50 -23 3 17 -12 -29 14 34 -19 -21 15 -17 25 28 -67 -13 62 -14 -48 39 -7 -25 35 -9 -49 45 4 -64 20
3994B0L7j00N6j5o4Q4L2q9J4N8n4j0M7rj5L2n4rN9K5n5k4L4L0m8nN2l3j6M2n3
$$ 20 57 -43 13 -2 -66 18 50 -39 -25 33 -21 -31 16 7 -8 24 -30 -39 20 45 -10 -34 0 30 -18 -23 29 -4 -20 22 -31
4025c1m1J23Nj19M9P9r1MP5p5mR3j03l0J29k5p5J7J9j5N1k1j9J9k6J1lJL9Or4
$$ -31 -72 51 56 -63 -14 65 -26 -22 53 -22 -26 67 -36 -66 63 38 -37 -20 -1 -16 35 14 -5 14 -12 -1 -4 -3 36 42 -52
4056e2MR3n4MM2o4l0R5o0k8J07l6r6Q1Nn6Q8j9j20J11O0j23M0O3q9J1O1q5L3Q0
$$ -52 -48 45 -9 -5 37 -27 -57 38 -22 -50 57 21 -75 6 11 -45 43 24 -96 15 75 -48 -8 55 -34 -23 38 -47 -14 66
4086F6m4p1M4L6k2j6J8K4n5%N3p1J9J08r6j15J70L1j64J15L8j74R6J12j82N5J64
$$ 66 22 -49 -5 31 9 -7 11 35 -20 -20 33 -38 -19 89 -7 -122 48 79 -85 30 68 -106 -10 102 -80 -25 139
4113A39j86n6J65o4l8R6o1p3J25m0n3O1kl6J7l7L4N4o2%K1n6N1O0j18N0Q8j38
$$ 139 -47 -103 62 -2 -40 56 -5 -78 47 7 -46 15 13 -23 -6 -43 -9 45 -17 -17 4 -52 -1 59 -59 -9 79 -59
4141e9J2J21j00J0J16j60l9K14r7j28J84m8j20J33j4r1J22pj27N8N8l2jj6OK9
$$ -59 -47 74 -26 -16 100 -60 -99 115 18 -110 74 26 -94 39 25 -66 56 49 -78 -20 38 6 5 -11 -5 24
4167B4m2K7L1p6L3Q1j70L1K02j65o6J86j13p9K09r6j38K15l3k13J74P5j63R3M6
$$ 24 -18 9 40 -36 -3 78 -92 -61 141 -24 -90 96 -17 -96 113 17 -121 94 61 -152 22 97 -66 27 73
4192G3j60P8R3j40K5P2m8j2J4nM3j2m8J8j3K5Q0j09l9J39o7r8J55j6j07J21l6
$$ 73 -87 -9 84 -56 -31 41 -7 -19 -5 -10 33 21 -27 -9 -22 3 83 -26 -65 74 7 -91 64 48 -59 62 26
4219B6j44J71N9k15Q7R7j44N7P7j10J0J02j03k9R3Nl7pk8M4oj8M7l9m4R0n3p4
$$ 26 -118 53 112 -103 -16 81 -63 -6 71 -39 -29 73 -30 -59 34 39 2 -5 -33 11 5 -13 34 -5 -49 41 -12 -86
4247h6J67mj64R3M9j26R9Q1j99O1J34j58k2J79p9p3P6n2k9J09k9q3M2M1l3%PL9
$$ -86 81 77 -87 6 55 -71 28 109 -90 -29 105 -53 -75 104 25 -48 28 -24 -53 56 27 -56 -14 27 -6 -6 1 40
4275D0l5m6L5Nj0P9m5j00J05K4j16O3O9j14L9O1j21N1J30j35o3J23k4n0Q9l5o6
$$ 40 5 -41 -6 -1 -11 68 23 -77 28 52 -64 -1 68 -46 -7 54 -67 -16 114 -21 -84 39 15 -35 54 19 -47
4302d7O7jn5M1M1k8m8lM8J4k4K7k8m8P5rq1Q2N8j25JR6p0K0O0r1j9Q2j1p7O9L3
$$ -47 20 19 -36 5 46 18 -30 -33 15 29 5 32 4 -44 31 22 -59 23 81 -44 -43 53 -17 3 63 -28 -47 35 24 -53 16 49
4334D9o9j2L3kJ9Nm3k6L3O5n7k7P6l8o6O4J3m4P3k3j07P0Q3q9j0N1l9pN2m5j3
$$ 49 -20 -32 1 -1 18 23 -20 -46 -13 52 -5 -32 44 6 -60 4 17 -27 46 23 -84 -14 69 -20 -30 21 -18 -25 27 -18 -31
4365c1Q0l3n3M0J7pk8QRJj3Mk5K3N5m4o4Q5J7o3N1j1o4N8L0o3J5P5p7m4P5Kk1
$$ -31 49 16 -37 3 20 13 -15 -7 2 3 -10 -6 -31 -8 47 3 -61 24 41 -22 29 18 -46 12 42 -21 -6 69 -8 -52 23 25 4
4398DK9l9l4N5J6k5j2J9J6l9oN9l6j9K8j7k2Q8l4q5O7L7p3J6N4o3K5L8q3PP9k7
$$ 4 33 -6 -40 15 31 6 -6 13 29 -10 -16 43 7 -12 16 -1 -23 65 31 -54 13 50 -23 -7 47 -16 9 47 -36 -29 50 23
4430B3l7K7rNj1kJ2K5j2k8k3K5M3k0m8M2Ol9L9J0l9K6J4p7L1Q2o0l3N9m4JM6m4
$$ 23 -14 13 4 9 -2 -4 8 33 21 -7 -30 -5 38 18 -30 12 18 -21 18 28 -11 15 29 -48 -17 65 5 -28 31 -13 -12 34 -10
4463a0j9L3K0l7J0OK9j8l4K6Nk5K6j0k0N6j9p4N8O5r1K1L4o1L0P7j02k8R9m2m5
$$ -10 -29 4 24 -13 -3 3 32 14 -20 6 11 -14 12 2 -18 38 19 -55 3 68 -23 -2 32 -29 1 78 -24 -52 47 5 -40
4494d0O5jm3O1n7k4N6L7n6k4J0K2J6l6L0J4m7K0K2m5N2K5r3QP9n4pN9o1J0N3p1
$$ -40 25 24 -19 42 -15 -39 17 54 -2 -26 -16 6 22 -14 16 30 -17 3 25 -20 32 57 -36 -28 51 -3 -10 49 -12 -2 51 -20
4526b0m4J12j1p0L9Jk7N0j9l2K8Nl2J8kK2J9q3L1M1l0J7J1p2K0R2r0k4J17p1o0
$$ -20 -64 48 37 -33 6 7 -20 30 11 -21 7 12 -20 -2 -4 18 37 -46 -15 26 -4 13 24 -48 -28 64 -26 -50 67 -4 -64
4557f4R5j3o2R9l3j16R0O6r0K0L9m8K2J3m4K5L0k3k3mL1L0n1j0M7k1k9N2l0k0
$$ -64 31 18 -44 55 22 -94 -4 62 -28 -8 31 -17 5 18 -26 -1 29 6 -17 -21 10 40 -11 -21 26 5 -24 28 -2 -22
4587b2R3n2q0Q3J8p2N1ko2P6Lq1P5K6r8K0M7k9M1J1p6mP9m3NK3k5Nj6j9M2J6l4
$$ -22 71 19 -61 22 40 -32 19 17 -45 31 34 -47 28 54 -44 -24 23 -6 35 46 -30 -34 45 2 7 30 5 10 -6 -25 17 33 -1
4620aJol4P6Qr8N4N3q8J0P6q1L3N7r9j0J18n9m4N3om9L6j0nL9j7k4j%N1kp0L5
$$ -1 0 -6 -40 36 44 -54 0 53 -35 -25 51 -30 3 60 -39 -49 69 10 -34 19 13 -36 0 -10 -15 24 7 -17 -18 -18 33 31 -39 -4
4654dM0o3L1M0p2L7L6r8L5J01q7j8M0m5J9N7o1k4R3o3n5R6j6l0O0n0n4Q1J9q3
$$ -4 36 -27 4 44 -28 9 45 -53 -18 83 -4 -22 18 -27 -8 49 -12 -36 57 -6 -61 35 19 -11 49 -1 -55 26 45 -38
4684c8M5J7m7L5pqL3Kn0lMK4L8n2l2M3jl4M3J7l0J4k4l8P6K5o3J3Rj5K5kl0L5
$$ -38 7 24 -23 12 5 -3 30 32 -18 -21 -17 7 45 -7 -39 4 3 -31 12 29 -1 13 -11 -49 27 52 -11 2 11 -4 21 19 -11 24
4718B4rm3J8K0pM3m7n8O9K0n0L4J4n2K5J2l9L9M7r4k3P6j6J2J7n2%N0k6j8M2j
$$ 24 15 -28 -10 10 3 46 -1 -59 10 30 -20 14 28 -24 1 13 -26 13 60 -34 -57 19 3 15 32 -20 -20 30 4 -14 28 27
4750B7l8Jj5J7M5j4o1K1L0j3J2j2J0%j4k0L2K2j2j8l5K7L7j2l2K5ok1J0KJ0L6
$$ 27 -11 -10 -25 -8 37 23 -38 -17 13 0 12 0 10 10 -4 -24 8 30 18 0 -35 -8 29 17 -15 10 4 -17 -7 -5 5 41
4782D1l3n5M0J9l%j4j4L4qk8M7K8p9K0%k8O1K1r0J5O0n5QO0p1J1N1o0pQ5l1n2
$$ 41 8 -47 -7 12 9 9 -5 -19 15 7 -21 26 54 -25 -5 -5 -33 28 49 -41 -26 34 -21 -13 47 -24 -13 38 -22 -29 56 25 -27
4815b7L0kk3N2j4m2M8pm5J7L4lj8j0k2L1J2J2k7k0L1J1m6L2L8o1%K8m5L9O2q8
$$ -27 3 1 -22 30 16 -26 22 15 -30 -13 21 18 0 -10 -32 -1 11 23 -4 -24 7 18 -28 4 42 -19 -19 9 -36 3 65 -23
4847b3l2Q0k5l3O6j5m2M2j4m9P9J1o1MJ3j6K9Ll7L5pk5J6jjK7k3m4O5J1p2N2j
$$ -23 -55 25 0 -33 33 18 -24 18 4 -45 34 45 -16 -12 1 -15 14 17 -20 15 8 -17 -1 -2 -3 24 1 -43 22 33 -39 13 12
4880A2l0M5no4O7L2q8ML8j8L3J3o8J6L8k8j7N3ml9%KL0J2j8j0m5L3M9l4k6N0j5
$$ 12 -18 27 22 -42 25 57 -31 -27 11 -7 26 39 -29 -13 25 -3 -20 33 29 -10 -10 -8 22 34 16 6 -39 -6 43 9 -17 33 18
4913A8n5N7nl2N5j0q9O8N9r1J1N4n9OM3n5MQ4m0o9M6K3l6J6J2l3J2J9l3J9L1j0
$$ 18 -37 20 15 -17 38 28 -61 7 66 -25 -14 40 -19 -13 30 -25 -21 63 23 -46 0 23 -13 3 15 -18 -6 13 -20 -1 30 20
4945B0m0j2K3L6j5j5J0k5J7K1m0K6K1k0l9K9J6j0kj3k3N5J7n9RL4k2nLjK1nj5
$$ 20 -20 -32 -9 27 12 -3 7 -18 -1 20 -20 6 27 7 -32 -3 13 3 1 -12 -35 20 37 -22 -13 21 -1 -6 -3 -4 17 12 -3
4978cj1KM2j6m0M0Mk6MK1j4RK0o3pO6Kn8L1J1m4L7J9l6J7M5r5JQ7k2l7M8l8qN1
$$ -3 -14 -12 30 14 -26 14 18 -8 -4 17 3 12 32 -31 -38 28 30 -28 3 14 -30 7 26 -10 7 52 -43 -42 45 23 -14 34 -4 -12 39
5013C9Lp7M8K7o1LN0k5OJ1m5QN0k0l5J7L0j4k5J4J3j0jj4j9L0L2l3l7O4k9mJ4
$$ 39 42 -35 13 40 -21 -18 32 7 13 24 -21 -13 37 17 -18 -1 29 15 -10 4 17 7 6 -8 -27 3 35 2 -35 29 0 -4 10
5046A0Ok1K7j1l3L3K6m0M%j0K6Ol7J6J2k4OJOM3m3m0M9Rk4J6ll2L9Jm9M0L9n6
$$ 10 16 -5 22 11 -22 11 37 -3 1 1 -9 17 23 -14 2 14 -10 -4 -3 3 46 3 -37 12 21 -3 13 10 -22 17 18 -31 9 48 -8
5081hoM0l4J1M6o7j2P7l0n7O4lm0M2j7l4M7J9n1rM2k7QLJJpMk9K8L9l1n5N9J6
$$ -8 -14 26 -8 3 49 -18 -30 47 17 -40 24 21 -19 23 6 -28 19 38 -13 -22 20 -7 1 4 5 6 -1 3 -26 2 41 10 -45 14 30
5116C0m1K9Lm3K1M3o6RO7n5l6O4k5k1P0l8n6P5qo0M6J0k9NJ2k9L6J9l3j3PK8j9
$$ 30 -11 18 21 -22 -1 42 -24 -15 52 -3 -39 25 0 -21 49 11 -45 30 22 -38 8 18 -11 -6 6 -23 13 32 -1 -14 -7 21 2
5149BkMLjk1KJ7LQl4qN8k1k9K4Jj6K2Nm6M8J4p2K6L2k1J7j2k1K4J6k2rK3KJj2
$$ 2 0 4 7 6 -15 -13 4 7 15 -19 -27 31 10 -19 5 6 -10 12 17 -29 19 33 -39 -13 19 -2 15 3 -18 6 22 0 -9 14 16 17 5
5186Ej3L0%k3J6k0oM2l0m0O9%o7L5M2m5K4K6p0K0N5n7j8N4k8j3K3j4nM0l0k9K7
$$ 5 -8 22 22 -1 15 -5 -11 31 1 -39 30 30 -37 -2 40 -5 19 45 -25 -5 50 -7 -25 29 1 -12 11 -3 -8 32 2 -27 0
5219@J9mj5%J2oj1J0jMJ6k0m2N1L1o6J9K0l7L5J6o1J4P0o2k1P7k5n1O5m4k0O8
$$ 0 19 15 0 0 12 6 -5 5 4 8 24 4 -38 13 44 -22 -3 17 -20 15 31 -30 -16 54 -8 -29 48 23 -28 37 -7 -27 41
5252D1j6o0K8M2l6nmPJ8j2j4Rj2K9%l5K6L1m6j7O9l7j4M8o1pQ5m2n7O0Om4K8O
$$ 41 25 -35 -7 35 -1 -6 -10 -3 15 3 -11 -2 -14 15 15 -20 6 37 -9 -26 43 6 -8 40 -21 -28 57 15 -42 18 24 -20 8 14
5286A4l6M9Oo4RN5k3j6J5k0J8J1k1mJ3Klk4K5J4j6k1M0m1K4L4m9k1O5k5p4Q0K0
$$ 14 -22 27 33 -31 -22 33 10 -6 9 -11 7 18 -3 -7 6 8 5 -19 6 20 4 -17 23 -18 6 40 -9 -30 35 10 -64 16 36
5319C6o6L8J0m8L6L5n5kM2j6k2J4%RJj6nQJ9pk7J6K1nk7K4Jj4J6rl1M6jl7ML1
$$ 36 -30 8 18 -30 6 41 -14 -16 26 10 -12 2 2 11 12 -4 -9 -1 18 11 -16 0 21 16 -11 13 14 0 16 7 -24 22 21 -16 -12 19
5355A9l0J5J1k7RK7ql1K8J0l6NJ5KoMk1%L2Nm7J1M3k7j5K0j0NK4k4k3L3J7n1J3
$$ 19 -11 4 15 -12 -3 24 16 -15 13 23 -13 -8 7 9 3 7 -14 -14 18 23 -24 -13 30 3 -12 8 -2 3 27 3 -20 13 30 -21 -8
5390hL6j8k2J5pNK3ll5OL7l1k6M6j7oL2j9l3O0qn0K1M2l6mK1m0J8K7l6nL1qj0
$$ -8 28 10 -12 3 -4 1 24 21 -14 -8 29 -2 -28 18 1 -5 27 8 -25 35 27 -23 -2 40 4 0 21 -19 -1 26 -10 -15 16 8 -2
5425bJ5qjJ4l5J1QOlj7kL0qk6K1KlQnk6L3K3n4J6M2k9oJ8l4PL8m8oN7l2j3koK8
$$ -2 13 5 4 18 -17 -6 2 8 5 -12 -14 16 8 -18 3 5 2 10 5 -21 12 35 -19 -3 39 10 4 22 -12 -5 33 -15 -21 36 4 -9 -11 -17 11
5464A1J0k2k1K1nJ4lk4K4L5o0mM4k3kK7l2%N5n4j4L7Rl4L7k8JM1m0l5M6J1l1J1
$$ 11 21 -1 -22 -1 -6 8 5 -19 5 40 -20 -24 20 -3 -5 22 -10 -10 45 -9 -23 14 23 -11 26 -2 -1 40 0 -35 11 22 -9 2
5498Bj2RK6j4l3L4pj5Nj0J9J7k1j0K0j1j2L7l7j6P4n1k6N9ll7L0j2l0M9j5l9L2
$$ 2 -10 -1 25 11 -22 12 5 -10 -5 -15 4 21 0 -10 10 -1 -13 24 -13 -29 45 -6 -32 27 24 -13 17 5 -25 24 9 -30 2
5531BJ1l4J9Nk7L9nl3K5jj4J8jj5L1k0k3K9J9l9J4j4nN1k4m6M4Nk1K4j1l8M7l
$$ 2 13 -21 -2 3 -24 15 10 -23 2 1 -13 5 4 -11 20 0 -23 6 25 -14 0 -14 -19 32 8 -38 6 11 -10 14 3 -35 12 9
5565Im6N0Kl0J3PrJ7J2n1K4K3k4pK0j7J4J2n1K7J9pjqj4K3J3l6J6J5j1lJ4l6L3
$$ 9 -37 13 15 -15 -2 5 -4 13 25 -26 -2 21 -3 -10 10 -7 7 19 -32 -5 14 7 6 -2 -16 7 20 -16 0 15 4 1 15 -21 12
5600A2Qm3K1K5j9oljJ1J1l0K0K4k1pLmK7qj5j7L4k0Olj6K0J6m1nN0l1MjoNJ9m2
$$ 12 20 -23 -2 23 4 -2 -5 -6 5 16 -14 6 30 9 2 5 1 28 20 5 -12 22 2 8 5 -11 9 25 -16 -21 29 -2 2 1 -5 0 19 -23
5638b3mL7kj4QoQRk9OJ2oMMlqRnj0L3j5j4RkRJ5k9LRqj1J9j2J8J5k9qK3kj2R%
$$ -23 -27 10 8 -6 2 -4 4 13 -16 -10 2 -4 0 4 1 -7 2 -3 -13 20 5 -9 0 -2 7 22 -7 -4 5 -3 -14 5 -7 11 26 -3 -11 12 10 -2 7 7
5680Gj4L4j3l0J3K0k0j2J6JJ4k9kK1Oj0qNJ0Pj5j7K4N%qj0J5J0k1JJ6nkqpK4o
$$ 7 -7 27 14 -16 -3 17 -3 -15 1 2 16 -13 -15 6 12 2 -6 -1 9 16 1 -16 8 13 13 5 -5 10 20 -1 0 16 11 9 1 -6 18 12
5718A2k4jJ2J0Kj4k0J8J6j5kJ7jj6l%RJ7k1rJ9mljJ7oJlj4PK5ol1JJ4Pj4J5pQ
$$ 12 -12 -13 -1 9 11 -3 -23 -5 11 -4 -6 11 10 -6 -9 -9 0 17 -4 -13 6 2 -1 -2 15 9 10 7 -7 0 25 19 -12 -11 3 10 -4 11 4 12
5758A2Ml0OJ5Rj8j2K4j9K1jj2kJ6k4PJ2Rrmj4J7J1j1j7PJ2MmqJ5Pk2j7K1LJ0p
$$ 12 16 -14 -8 7 16 -2 -14 10 -9 12 11 -1 -3 13 -11 -4 8 17 8 4 -10 7 18 7 -10 -3 9 13 9 1 16 23 1 -16 5 8 18 11
5796A1k0J4J7j2j0J6Pj3qjjJ8oqk0J7J6j9KJ2Qk2QJ5j7J7j1k2J8J3k3jJ3qjJ8
$$ 11 -9 5 22 10 0 16 23 10 2 1 0 18 12 4 -16 1 17 -2 0 12 20 -2 6 21 4 21 10 -12 6 19 -4 -5 8 0 -1 17
5832A7k9ML9l6j1K2JrJ5k1rM2jk6J2Pj7j0J5j4K3jj5qlK9ml3J8L1k3k0K3j0J0
$$ 17 -12 -8 31 -5 -16 6 7 -2 13 -8 -17 25 24 -2 10 17 0 -10 5 -9 14 13 -2 -10 -13 16 12 -21 -3 28 5 -15 8 -2 8
5867HMl5jM8lm4K4K0j2mOk8L8Nm8J9K2j4RqjN%j3pJ2OJ5k5KL0k0k1K5qlK1l2q
$$ 8 12 -23 -24 24 21 -23 1 21 9 5 11 -17 21 26 -22 -3 19 5 14 6 5 10 10 -3 -10 2 8 23 -2 0 30 10 -11 14 6 3 24 -8 -16
5906a6N7j9l9K3K4m2J3J5m1L9J6m9J3K9j9j1JKJJ5qj5J5jJ2j1k7N3k0k6K5pj7
$$ -16 41 22 -17 6 30 -12 1 16 -25 14 30 -19 -6 23 4 -7 -6 -4 -3 12 4 -11 4 3 15 4 -23 30 10 -16 9 2 -15
5939a5K7j7k6M5Ql1KK5j9nK2k6J5K8l9j6L8j2j1Lj2J6MplJJ5kj1j8K9J2l5J1P
$$ -15 12 -5 -31 14 22 -9 -7 18 -1 -6 16 -10 5 33 -6 -22 16 4 -7 -4 -16 0 4 -3 -6 -5 10 8 -3 -21 8 20 -15 -4 3
5974Cj3K6pk9J1L2l9J7L1m5NQj6qM9pn2M6j0k3J7J5j2nJj1%L1%k1j1K7Ml8L7Q
$$ 3 -10 16 9 -20 -9 23 -16 1 32 -13 -8 0 -16 -24 25 18 -34 12 2 -21 -4 11 -1 -6 -5 -16 -16 15 15 -6 -17 10 14 -24 13 21
6010B1k9J0J0k6J7L3m0j9M5j7k1M0k6j2M5k0m6L5K8m1NK2l8L3J5k8k0L7oj3QJ8
$$ 21 -8 2 12 -14 3 36 -4 -23 22 5 -16 24 -2 -14 31 11 -35 0 28 -13 -8 14 -24 9 24 -4 -24 13 7 -6 2 20
6042B0j7pMoJ0Okl1J0L0k0j6L2ok3J9oj2L7km9K3J7k3OJ9k8QK7k2JJ4Kl1LK5K
$$ 20 3 -4 0 -6 4 10 8 -23 -13 17 -3 -19 13 7 -16 3 -3 -15 22 20 -29 -6 11 -12 -6 13 -15 -7 20 -2 -1 13 15 -16 -13 12 14
6079A4jj4kKRqMNOmj8%L2k6kJ6j9J0J2l4J4K0Ll7K5KnJ5qk2J4K0k1LMlj0MmQk
$$ 14 13 -1 -3 -1 8 0 4 9 15 11 -7 -7 25 -1 -3 13 -6 4 16 -18 -4 16 19 -18 7 9 4 19 11 -11 3 23 2 5 9 6 -4 0 -4 4 2
6120BmqmJ8J5l6K6Kj7KJ5rJJ2j9j9M7j3l9K6J0l9L6J1l8K2K5m1mM8k4j6J9k4O
$$ 2 -2 -10 -14 4 19 -17 9 11 -6 -4 11 2 3 15 -4 -23 24 11 -28 -2 8 -31 5 16 -22 0 25 -16 -20 28 4 -12 7 -17 -11
6155a1K6ok4K1Rk2Nj5OJ0RqoJ2Nj2j5L1j9j1K4oLJ1k6j9K9J3j1oJ4j5POj5JJ8
$$ -11 15 9 -15 6 15 -7 -2 -17 -11 -1 8 0 -6 6 11 -1 -16 15 -4 -15 9 3 6 17 -9 -28 1 14 3 -3 11 -4 3 9 -6 -5 13
6192A3j5j7J3J9nj0j3J1Rlj2J5llMj2K4Llj5lQKJ5l5LL5l1j5K8Ok1OjmJ5J1j6
$$ 13 -2 -19 -6 13 8 -2 -15 -4 5 2 -10 5 2 -1 3 -9 15 18 15 0 -3 5 7 22 -13 -10 25 -6 -21 7 13 -8 -2 -3 -7 8 19 3
6230Cj3J9j0j4OJpJ4%j1NK9j0m1L9j1jJ4rmJ3oj9LK9j7j7J7kj1J5mj1J4Rk5J1
$$ 3 -10 9 -1 -15 -9 -8 -15 -1 -1 -12 -7 22 12 -29 10 -1 -2 12 3 -1 12 6 -13 -10 19 2 -15 2 0 -11 4 0 -11 3 12 -13 -2
6267bJ2kj2JNoK7j9j6K7Lk3LJ5jj5Oj2lK7Pm4J1K1j3oJ1OMj3qoJ4Orj4J3J1j3
$$ -2 10 8 -4 -3 2 -4 23 4 -12 15 18 -5 -2 13 12 -3 3 -9 -12 15 22 -22 -11 10 -3 -9 2 8 12 -1 -9 -15 -1 5 -4 -18 -5 6 -7
6306gMNpNNj5jK5j2k3J6NjJNk2K5%k6J3K4j0k3J8nMLj8qK9j4nRLNqOj5rL3rk3
$$ -7 -3 2 -5 0 5 -10 -11 14 2 -21 -5 0 -1 0 5 -17 8 8 -18 -5 19 9 -14 4 -1 3 6 -12 -20 9 -5 -10 -1 2 7 -1 5 -10 -19 14 5 -18
6348a8J1K2j9j2L3j8JJ2j6j6K5J2m0J9K2k3KJ0qmJ5rj2J3JmmlJ6krJ0nnKJ0j3
$$ -18 -7 15 -4 -16 17 -1 0 12 -4 -20 5 17 -23 -4 18 -5 -3 7 -1 -5 10 1 -11 2 3 -1 -5 -8 8 6 -3 7 2 -3 -1 9 -4
6385dJ7%k0qL1j6J5nk2J7J5l7RK6j8Pmj2LK4j5j9K7Oj4Mq%Mpj3J5mjLj4L4jl4
$$ -4 13 13 -7 -15 16 0 15 10 -12 5 20 -17 -8 18 0 7 3 -9 -6 18 3 -16 11 17 3 7 -1 -1 3 -4 -17 -2 -6 -7 -4 -18 16 15 -19
6424a9JL6l6J4J5j8j3M7k3l9M9rl1L7Ml7J8J7m4K2K3j7mJ5j0MMqj2K0mkj1J7Q
$$ -19 -18 18 -18 -4 11 -7 -20 27 4 -35 14 5 -26 11 15 -22 -4 13 -31 -9 14 -3 -7 8 -2 2 6 -2 -14 6 2 0 -11 6 14
6459A4k0jJ8mj2J2j4nL8j7m7L5K3l7L4ql6N0qm0K7K5l3oJ4j1ORj6LJ7j3KrPQJ3
$$ 14 -6 -7 11 7 -5 7 -7 -12 26 9 -38 -3 20 -17 17 9 -27 23 15 -25 2 27 -6 -12 2 -9 -3 6 -10 -7 10 -3 -1 -10 -3 5 18
$$ [...]
8191b
##END NTUPLES=NMR FID
##END=
