##TITLE=1H_LY-80.X.1.B
 CD3CN, 8 sc, 
 28.04.2021
##JCAMPDX= 6.0         $$ Bruker NMR JCAMP-DX V2.0
##DATA TYPE= NMR FID
##DATA CLASS= NTUPLES
##ORIGIN= UXNMR, Bruker Analytische Messtechnik GmbH
##OWNER= root
$$ XWIN-NMR		Version 3.5
$$ Wed Apr 28 11:21:35 2021 Russian Standard Time (UT+4h)  she@DPX200
##.OBSERVE FREQUENCY= 200.131506
##.OBSERVE NUCLEUS= ^1H
##.DELAY= (6, 6)
##.ACQUISITION MODE= SIMULTANEOUS
##.ACQUISITION SCHEME= undefined
##.AVERAGES= 8
##.DIGITISER RES= 18
##SPECTROMETER/DATA SYSTEM= spect
##.PULSE SEQUENCE= zg30
##.SOLVENT NAME= CDCl3
##.SHIFT REFERENCE= (INTERNAL, CDCl3, 0, 15.7039)
##AUDIT TRAIL= $$ (NUMBER, WHEN, WHO, WHERE, WHAT)
$$ ##TITLE= Audit trail, XWIN-NMR		Version 3.5
$$ ##JCAMPDX= 5.01
$$ ##ORIGIN= Bruker BioSpin GmbH
$$ ##OWNER= she
$$ F:/spectra/data/she/nmr/H-F/1/audita.txt
$$ ##AUDIT TRAIL=  $$ (NUMBER, WHEN, WHO, WHERE, WHAT)
(   1,<2021-04-28 11:19:51.87 +0400>,<she>,<DPX200>,
      <created by zg, POWCHK disabled, PULCHK disabled
       configuration hash MD5:
       00 E9 B6 7A A2 85 ED C7 34 08 36 98 17 FE 4E 26
       data hash MD5: 16K
       6E 59 EB B6 A2 BD 3D 61 78 01 55 1D AD 95 06 BA>)
$$ ##END=
$$ 
$$ hash MD5
$$ E5 88 71 0B 38 2D 38 4E 0A 81 0E F9 AF 58 C8 DF
##$RELAX= 
##$RELAX= 
##$RELAX= 
##$RELAX= 
##$RELAX= 
##$RELAX= 
$$ Bruker specific parameters
$$ --------------------------
##$DU= <F:/spectra>
##$EXPNO= 1
##$NAME= <H-F>
##$PROCNO= 1
##$TYPE= <nmr>
##$USER= <she>
##$AMP= (0..31)
100 100 100 100 100 100 100 100 100 100 100 100 100 100 100 100 100 100 
100 100 100 100 100 100 100 100 100 100 100 100 100 100 
##$AQSEQ= 0
##$AQ_mod= 1
##$AUNM= <au_zg>
##$AUTOPOS= <>
##$BF1= 200.13
##$BF2= 200.13
##$BF3= 200.13
##$BF4= 200.13
##$BF5= 200.13
##$BF6= 200.13
##$BF7= 200.13
##$BF8= 200.13
##$BYTORDA= 1
##$CFDGTYP= 0
##$CFRGTYP= 5
##$CHEMSTR= <none>
##$CNST= (0..31)
1 1 145 1 1 1 1 1 1 1 1 1 1 1 1 1 1 1 1 1 1 1 1 1 1 1 1 1 1 1 1 1 
##$CPDPRG= <>
##$CPDPRG1= <>
##$CPDPRG2= <>
##$CPDPRG3= <>
##$CPDPRG4= <mlev>
##$CPDPRG5= <mlev>
##$CPDPRG6= <mlev>
##$CPDPRG7= <mlev>
##$CPDPRG8= <mlev>
##$CPDPRGB= <>
##$CPDPRGT= <>
##$D= (0..31)
0 1.2 0 0 0 0 0 0 0 0.06 0 0.03 0 0 0 0 0.0002 0 0 0 0 0 0 0 0 0 0 0 0 
0 0 0 
##$DATE= 1619594391
##$DBL= (0..7)
120 120 120 120 120 120 120 120 
##$DBP= (0..7)
150 150 150 150 150 150 150 150 
##$DBP07= 0
##$DBPNAM0= <>
##$DBPNAM1= <>
##$DBPNAM2= <>
##$DBPNAM3= <>
##$DBPNAM4= <>
##$DBPNAM5= <>
##$DBPNAM6= <>
##$DBPNAM7= <>
##$DBPOAL= (0..7)
0.5 0.5 0.5 0.5 0.5 0.5 0.5 0.5 
##$DBPOFFS= (0..7)
0 0 0 0 0 0 0 0 
##$DE= 6
##$DECBNUC= <off>
##$DECIM= 32
##$DECNUC= <off>
##$DECSTAT= 4
##$DIGMOD= 1
##$DIGTYP= 9
##$DL= (0..7)
0 120 120 120 120 120 120 120 
##$DP= (0..7)
150 150 150 150 150 150 150 150 
##$DP07= 0
##$DPNAME0= <>
##$DPNAME1= <>
##$DPNAME2= <>
##$DPNAME3= <>
##$DPNAME4= <>
##$DPNAME5= <>
##$DPNAME6= <>
##$DPNAME7= <>
##$DPOAL= (0..7)
0.5 0.5 0.5 0.5 0.5 0.5 0.5 0.5 
##$DPOFFS= (0..7)
0 0 0 0 0 0 0 0 
##$DQDMODE= 0
##$DR= 18
##$DS= 0
##$DSLIST= <SSSSSSSSSSSSSSS>
$$ [...]
##$SUBNAM2= <"">
##$SUBNAM3= <"">
##$SUBNAM4= <"">
##$SUBNAM5= <"">
##$SUBNAM6= <"">
##$SUBNAM7= <"">
##$SUBNAM8= <"">
##$SUBNAM9= <"">
##$SW= 16.9725357007746
##$SWIBOX= (0..15)
0 0 2 0 0 0 0 0 0 0 0 0 0 0 0 0 
##$SW_h= 3396.73913043478
##$TD= 16384
##$TD0= 1
##$TE= 0
##$TE2= 300
##$TE3= 300
##$TEG= 300
##$TL= (0..7)
0 120 120 120 120 120 120 120 
##$TP= (0..7)
150 150 150 150 150 150 150 150 
##$TP07= 0
##$TPNAME0= <>
##$TPNAME1= <>
##$TPNAME2= <>
##$TPNAME3= <>
##$TPNAME4= <>
##$TPNAME5= <>
##$TPNAME6= <>
##$TPNAME7= <>
##$TPOAL= (0..7)
0.5 0.5 0.5 0.5 0.5 0.5 0.5 0.5 
##$TPOFFS= (0..7)
0 0 0 0 0 0 0 0 
##$TUNHIN= 0
##$TUNHOUT= 0
##$TUNXOUT= 0
##$USERA1= <user>
##$USERA2= <user>
##$USERA3= <user>
##$USERA4= <user>
##$USERA5= <user>
##$V9= 5
##$VALIST= <valist>
##$VCLIST= <CCCCCCCCCCCCCCC>
##$VD= 0
##$VDLIST= <DDDDDDDDDDDDDDD>
##$VPLIST= <PPPPPPPPPPPPPPP>
##$VTLIST= <TTTTTTTTTTTTTTT>
##$WBST= 1024
##$WBSW= 4
##$XGAIN= (0..3)
0 0 0 0 
##$XL= 0
##$YL= 0
##$YMAX_a= 1016126
##$YMIN_a= -1019593
##$ZGOPTNS= <>
##$ZL1= 120
##$ZL2= 120
##$ZL3= 120
##$ZL4= 120
##$ABSF1= 10
##$ABSF2= 0
##$ABSG= 5
##$ABSL= 3
##$ALPHA= 0
##$AQORDER= 0
##$ASSFAC= 0
##$ASSFACI= 0
##$ASSFACX= 0
##$ASSWID= 0
##$AUNMP= <proc_1d>
##$AZFE= 0.1
##$AZFW= 0.1
##$BCFW= 1
##$BC_mod= 2
##$BYTORDP= 1
##$COROFFS= 0
##$CY= 11.3945322036743
##$DATMOD= 1
##$DC= 2
##$DFILT= <>
##$DTYPP= 0
##$F1P= 15.9154993809931
##$F2P= -4.1035820241983
##$FCOR= 0.5
##$FTSIZE= 0
##$FT_mod= 4
##$GAMMA= 1
##$GB= 0.15
##$INTBC= 1
##$INTSCL= 1
##$ISEN= 128
##$LB= 0.24
##$LEV0= 0
##$LPBIN= 0
##$MAXI= 10000
##$MC2= 0
##$MEAN= 0
##$ME_mod= 0
##$MI= 1.114404
##$NCOEF= 0
##$NC_proc= 0
##$NLEV= 6
##$NOISF1= 3.799351
##$NOISF2= 2.8
##$NSP= 1
##$NTH_PI= 0
##$NZP= 0
##$OFFSET= 15.70392
##$PC= 1
##$PHC0= -11117.13
##$PHC1= 6.401015
##$PH_mod= 1
##$PKNL= yes
##$PPARMOD= 0
##$PSCAL= 0
##$PSIGN= 0
##$REVERSE= no
##$SF= 200.130013532006
##$SI= 16384
##$SIGF1= 3
##$SIGF2= 2
##$SINO= 400
##$SIOLD= 16384
##$SREGLST= <1H.CDCl3>
##$SSB= 0
##$STSI= 0
##$STSR= 0
##$SW_p= 3612.71676300578
##$SYMM= 0
##$S_DEV= 0
##$TDeff= 0
##$TDoff= 0
##$TI= <>
##$TILT= no
##$TM1= 0
##$TM2= 0
##$TOPLEV= 0
##$USERP1= <user>
##$USERP2= <user>
##$USERP3= <user>
##$USERP4= <user>
##$USERP5= <user>
##$WDW= 1
##$XDIM= 8192
##$YMAX_p= 0
##$YMIN_p= 0
$$ End of Bruker specific parameters
$$ ---------------------------------
##NTUPLES= NMR FID
##VAR_NAME=  TIME,          FID/REAL,        FID/IMAG
##SYMBOL=    X,             R,               I
##VAR_TYPE=  INDEPENDENT,   DEPENDENT,       DEPENDENT
##VAR_FORM=  AFFN,          ASDF,            ASDF
##VAR_DIM=   8192,          8192,            8192
##UNITS=     SECONDS,       ARBITRARY UNITS, ARBITRARY UNITS
##FACTOR=    0.0002944,     1,               1
##FIRST=     0,             0,               0
##LAST=      2.4114304,     0,               0
##MIN=       0,             -1019593,        0
##MAX=       2.4114304,     1016126,         0
$$ Real data points
##PAGE= N=1
##DATA TABLE= (X++(R..R)), XYDATA
$$ [...]
3408d795R456M397p249p862L608R262l13r371m069P684O592n227q597Q21Q480
3423B817K173p618n180M915P171j924q255j379P425M649n424o425L033P666L12
3438C956o877k512N705M688l086n283J133N850J864m462l685K857M530k94n022
3453f38j596M630K938l404m468J729M456m84m526j664L350K020k595k449R12J821
3469C2m30j508m57N93Q49j0p65m72M75J203j48q90J66J402P6n61J17R28J66n54
3489B12O22O12O4j069L56J759Q8j942m65J156J434j366k130M16K431N88l426j692
3507b352K382K571j885l921N01L828R48l920k292K446L227j392l546k08L185K347
3523A919k169l536R42M340J442l902l353L415N366j334o252n86O520L299n166
$$ plain form
3408 -4795 4661 9058 1809 -6053 -2445 6817 6504 -2867 -6936 748 7340 2113 -6484 -5663 2817
3423 2817 4990 -2628 -7808 -2893 4278 2354 -5901 -7280 145 4794 -630 -7055 -4022 3644 3956
3438 3956 -2921 -5433 272 4960 1874 -3409 -2276 3574 5438 976 -2709 148 4678 4384 -638
3453 -638 -2234 2396 5334 1930 -2538 -809 3647 3163 -1363 -3027 323 2343 -252 -2701 -1789 32
3469 32 -398 -1906 -2363 -1770 -921 -931 -1696 -2168 -1693 -490 -638 -1528 -1362 40 116 -445 -328 600 766 212
3489 212 834 1446 1510 441 797 2556 2644 702 237 1393 2827 1461 -669 -253 2178 2766 -660 -2352
3507 -2352 30 2601 716 -3205 -2704 1124 2072 -1848 -4140 -1694 1533 141 -3405 -3613 -428 1919
3523 1919 -250 -3786 -2844 1496 2938 -964 -4317 -902 4464 3130 -3122 -3708 2812 6111 945
3538I45n228L389O377p44o373j677M856M137l430n407n7O405K335n714n341L370
3554b157O750q07q134j928O639M858m825p084J845P934J294p217m137N358P036
3569E425k462q271j008Q577M353o337p190L940R088K66r002l839P367O903m000
3584C810r101O72R005L680p751p136M765R381j125j0258l532R129P141o984r763
3599h067K822J0860J253j0146n551P602Q604m172r947k80R343M796p202q049L378
3614d756J0383P55j0107m905Q340R076n083j1000O65J1865L793j0177p421P100
3628a472J0137k404j1474k251J0659O354p812r767L590J0857J113j0055n795P884
3642d36Q555m325j0473j3J0185M132p842q040M377J0091l69r898m292Q282Q017
$$ plain form
3538 945 -4283 -894 5483 4739 -1634 -3311 1545 5682 2252 -3155 -3212 3193 5528 -186 -5527 -2157
3554 -2157 4593 3786 -4348 -6276 363 5221 396 -6688 -4843 3091 4385 -2832 -6969 -1611 5425
3569 5425 2963 -5308 -6316 2261 6614 277 -6913 -2973 6115 6381 -2621 -6460 907 7810 3810
3584 3810 -5291 -4619 4386 8066 315 -6821 -2056 7325 6200 -4058 -7590 1539 8680 1696 -8067
3599 -8067 -5245 5615 6868 -3278 -8829 -1227 7377 3205 -6742 -7022 2321 7117 -85 -8134 -4756
3614 -4756 5627 6382 -3725 -8630 -290 8786 3703 -7297 -6632 5233 9026 -1151 -8572 -1472
3628 -1472 8665 6261 -5213 -7464 3195 9549 1737 -8030 -4440 6417 7530 -2525 -8320 -436
3642 -436 8119 3794 -6679 -6692 3493 7625 -217 -8257 -3880 6211 5842 -4056 -8348 -66 7951
3657G951n225j0147J305J0796L217r716o813O883R518l070r926j248R279M975
3671G779o847p604K809R375Q05q767m818O456Q039l343r224q84R458M472p689
3686A7p647M987Q514p89q979k894P643N965m902p623J320P996K252o854n545M355
3702b184P991j771p820k062P349M894n217p235K726P780P75p546l581N633N904
3717E636k849p541J46P125L117n961n343L860O692j164p211j390O203L431l785
3732I66n212J759N351Q88m692l073L255M536q88n242j253M828L167l300m865J712
3748b063N661j33n476j488M437K938l148m011J471L719K37l562j453K470J875
3763A474r17k446k46K328J094j533j712P61K199k19j651m06J597Q82j198l91L03
$$ plain form
3657 7951 2726 -7421 -6116 4680 7897 -1819 -8632 -1749 7769 4699 -5227 -6475 2804 7779
3671 7779 932 -6672 -3863 5512 6317 -2450 -7268 -812 7227 3884 -5340 -6224 3234 7706 17
3686 17 -7630 -2643 5871 5082 -3897 -6791 852 6817 1915 -5708 -4388 3608 5860 -994 -6539 -2184
3702 -2184 5807 4036 -3784 -5846 1503 6397 1180 -6055 -3329 4451 5226 -2320 -5901 -268 5636
3717 5636 2787 -4754 -4608 2517 5634 -327 -5670 -1810 4882 3718 -3493 -4883 1320 4751 966
3732 966 -4246 -2487 2864 3752 -940 -4013 -758 3778 2890 -2352 -3605 1223 4390 1090 -3775 -2063
3748 -2063 3598 3465 -2011 -3499 938 3876 728 -3283 -1812 1907 2144 -1418 -2871 -401 1474
3763 1474 557 -1889 -2135 193 1287 -246 -1958 -1197 1002 783 -868 -1274 323 1205 7 -384 -81
3780h1J121k74q31L24M29J9l97l96R08Q9o62l21N71Q43j074j565J015J600n07
3799H11k304k78K537P60k747j459J672K566j157k653o0K434J474j868k238Q44
3815a666K989O65l392j808K843L749j612m510n2N078K104m499l493L566M597j532
3831C027n156m70M763K688l859m276J690N183L03n047l144L509N034k048o376
3846d179m38O221K688n176n030L131O437q30o771k011N641N103m024o374J381
3861d231P501J909o707m629N382O646k316p366m55P134L608n423o032L379P001
3876E401K72o945l567N147O207k630q046o55P865L846o953p055M004Q798r58r643
3892d912k518Q093N568n774q073K512Q863J482q452m707N886P772k306q596j339
$$ plain form
3780 -81 1040 766 -65 259 688 707 310 -86 822 911 249 -72 499 1342 268 -1297 -282 1318 811
3799 811 -1493 -1771 766 1526 -1221 -2680 -1008 1558 401 -2252 -2312 122 1596 -272 -2510 -1666
3815 -1666 1323 1988 -1404 -3212 -369 3380 1768 -2742 -2794 2284 4388 -111 -3604 -38 4559 3027
3831 3027 -2129 -2599 2164 4852 993 -3283 -1593 3590 3893 -1154 -4298 -789 4245 2197 -4179
3846 -4179 -4617 1604 4292 -884 -5914 -2783 3654 2824 -3947 -5958 -317 4786 762 -5612 -4231
3861 -4231 3270 5179 -1528 -6157 -775 5871 3555 -3811 -4266 2868 6476 1053 -4979 -1600 5401
3876 5401 5673 -1272 -4839 308 6515 3885 -4161 -4816 3049 6895 -58 -7113 -3109 5689 4731 -4912
3892 -4912 -7430 663 6231 457 -7616 -5104 3759 5241 -3211 -7918 -2032 5740 3434 -5162 -6501
3907f501Q363N472o449p855L667R442M65r036m118P600P306m112r771R48R351
3922D772L338p707o827M761R270j337j0559k367Q425N834o476q428K267R901J049
3937E916r675m826O931P503l332r182q59Q920M844p054p335M059R161J49r374
3952d154l684Q530P517n751q863K439R164K019p762n133N550P247j914q320j422
3967d537P170M952n175p341J614Q451J460q727m316O052O417l471q042m03Q197
3982B301L344p284n644M308O602n49p386k223O245N100m173o610J907O796J967
3997D701n830m377M149O442j613o097p54N548L539l648n473J564O597J071o145
4012c26l410M127N143j997o583l72O156J886n440l317K715M236q48m731k064M164
$$ plain form
3907 -6501 1862 7334 885 -6970 -3303 6139 6604 -2432 -6550 1050 8356 4244 -5527 -4579 4772
3922 4772 8110 403 -6424 -1663 7607 6270 -4289 -6656 1769 7603 1127 -7301 -5034 4867 5916
3937 5916 -3759 -8585 -1654 5849 2517 -6665 -7524 1396 6240 -814 -8149 -4090 5071 5220 -4154
3952 -4154 -7838 692 8209 2458 -6405 -3966 5198 7217 -545 -5678 -128 7119 5205 -3115 -4537
3967 -4537 2633 7585 2410 -4931 -3317 5134 6594 -2133 -6449 -397 6020 2549 -5493 -5896 2301
3982 2301 5645 -1639 -7283 -2975 3627 3078 -4308 -6531 -286 4814 641 -5969 -4062 2734 4701
3997 4701 -1129 -5506 -1357 5085 3472 -2625 -3379 2169 5708 2060 -3413 -1849 4748 5819 -326
4012 -326 -3736 391 5534 3537 -3046 -3418 2738 4624 -816 -4133 -1418 2818 1970 -2761 -4825 -661
4028f61L186k717l768N64L539J773l256l595K547M668o55m437m03L402L015k348
4044H54l736J656M391j65l640j013K657K575q89l663M7L370Q53k238j652R53J864
4061B224M3l054o67K639O28k118j753J006J226L65j389j239J237R57j101r87P34
4078a249N45K47q20o58J209O13q55o0J251J76q57R9R69Q42o48j263J350J526r79
4097A438j311P78Q01J13p01j290O34J665l82j678q79J003J347o10k982j97L527
4114A276Q40l875k291K650K933j292l791j85M359J610l733k643K611L584m56m100
4130b503j299M362L610l632l576J434M756R28m334k926L699M729k418n064K08
4145b026M497K473l626n041J834O406k64o467k306M883M590l663o622J301P277
$$ plain form
4028 -661 2525 -192 -3960 -3396 143 1916 -1340 -4935 -2388 2280 1625 -2812 -3215 187 3202 854
4044 854 -2882 -1226 3165 3000 -640 -1653 1004 3579 2690 -973 -926 2444 3297 1059 -593 360 2224
4061 2224 2267 -787 -1454 1185 1813 -305 -2058 -1052 174 539 -850 -2089 -852 105 -996 -1983 -1249
4078 -1249 -704 -457 -1277 -1935 -726 -113 -968 -1028 223 399 -458 -359 610 1452 804 -459 891 2417 1438
4097 1438 127 905 1706 1819 1118 -172 462 2127 1745 67 -812 191 1538 928 -2054 -2251 1276
4114 1276 2116 -1759 -4050 -1400 1533 241 -3550 -3735 624 2234 -1499 -4142 -1531 2053 1597 -2503
4130 -2503 -3802 560 4170 538 -3038 -1604 3152 4080 -254 -3180 519 5248 2830 -2234 -2026
4145 -2026 2471 4944 1318 -3723 -1889 4517 4253 -2214 -4520 363 4953 1290 -5332 -4031 3246
4160C246R72o654l516M687M979j974o292p75O448L337n064m721J833O599J337
4175D442o425m223N895O522l584o966O43P195K986o173n936M447P435j610p218
4190b570j468N963M424l883p233J036P878J537p469m230M517O950j662q772j428
4205f410P892L752n854o149L242P416O57p925m211O882O522m078p281M92P846
4220B793L371o703o206N232P757k179p434j510O726N221m806p499J779Q067J390
4235E999p011m560M754P264j702r368j454R031L800o706o952L710Q452k36q905
4250c884k986P403N203m868o603J100P315K503o547n536N285O622j965p061j503
4265e522O724M967m834o929K475Q090J61o871l260M559O601k590p516k7O983K668
$$ plain form
4160 3246 4218 -2436 -5952 -1265 3714 1740 -4552 -5327 1121 4458 -606 -5327 -3494 3105 4442
4175 4442 -1983 -6206 -311 6211 2627 -4339 -3696 3499 6485 312 -5624 -1177 6258 4648 -2570
4190 -2570 -4038 1925 6349 2466 -4767 -3731 4147 5684 -1785 -6015 -1498 5452 3790 -4982 -6410
4205 -6410 1482 5234 -620 -6769 -3527 3889 4546 -3379 -7590 -708 5814 1736 -5545 -5053 2793
4220 2793 6164 -539 -6745 -1513 6244 4065 -3369 -4879 1847 7068 2262 -5237 -3458 4609 5999
4235 5999 -1012 -5572 -818 6446 4744 -4624 -6078 2953 6753 47 -6905 -3195 5257 5021 -3884
4250 -3884 -6870 533 5736 868 -5735 -4635 2680 5183 -1364 -6900 -1615 5007 3042 -4019 -5522
4265 -5522 1202 6169 1335 -5594 -3119 4971 5132 -1739 -4999 -440 6161 3571 -3945 -3972 3011 5679
4281E679n557n247K831P254n38p140k244O012L923m030n374J097N838J656n689
4296a529l480L976M894j935m809j630N088M186m110n147K230N697n3n007k978
4311d607M436M742k603n083O03M945Q22l222l088J666M501l24m202j805L732L145
4327C658k098m110JM263J579l983k356K891K752r82l668o67L332K448k704k908
4343b552J596K653P3k389j858K085K710j570k636L68K313J107j880j736L52K602
4359A238K10k168o94J443J230m05j739p81K520P32j832j131J267R78m9j477j41
4376g99J594l84j153K57R73k67m16K18N6l34J04J87L85l1p34J1P94j44m53k0p8
4397b34L66O74o84j092N59J199j39j540n18J019J667r96k214O28K261L20k115
$$ plain form
4281 5679 122 -5125 -2294 4960 4422 -2718 -4962 1050 4973 943 -4431 -3334 2504 4160 -1529
4296 -1529 -5009 -1033 3861 1926 -2883 -4513 575 4761 651 -4496 -2266 3431 3378 -1629 -4607
4311 -4607 -171 4571 1968 -3115 -2512 2433 3255 33 -3055 -1389 3112 2788 -1414 -3219 513 3658
4327 3658 1560 -2550 -2549 1714 3293 -690 -3046 -155 2597 1615 -2053 -2720 612 3060 356 -2552
4343 -2552 -956 1697 1770 -619 -2477 -392 2318 748 -1888 -1520 793 1900 20 -1716 -1364 1238
4359 1238 1448 -720 -1414 29 1259 854 -885 -1666 854 1586 -246 -1377 -110 868 819 -658 -799
4376 -799 795 411 -742 -485 488 221 -195 23 79 -255 -151 36 421 390 -344 -333 461 317 -136 -156 -234
4397 -234 132 806 122 -970 -411 788 649 -891 -1409 -390 1277 281 -1933 -1305 956 1276 -839
4414h39j422J663K462o33l094k26L028J364k258k461J281L601p7l993r76L778
4430A198K285k330l596M32M188J115l743k416K679L495j088m518j204M702L374
4445D573m246m720K235N572m06n296k360M620M093l206n154J103N501J088m362
4460i65m032L325N502p57n936j684N753L667l710o038J950O949Q27o586l238N443
4476D70N388l306o312L76O398K555n552m656L592O002j057o596k513N869M620
4491E278m028o640J630O920J187o118m263M358O213j989o924j135O590M218m896
4506D01o209K326P365J052p475l415O073N990l293p426P85P432K276o295m483
4521d896M136O174r36o693k283N821M643l914o633J102P074J992o804m688M923
$$ plain form
4414 -839 -2261 -598 1864 1231 -1863 -2089 939 2303 45 -2416 -1135 2466 2389 -1604 -2580 1198
4430 1198 3483 1153 -2443 -2011 2177 3292 -451 -2867 -188 3307 2219 -2299 -3503 1199 4573
4445 4573 327 -4393 -2158 3414 3008 -2288 -4648 -28 4065 859 -4295 -3192 2309 3397 -965
4460 -965 -4997 -1672 3830 3073 -2863 -4547 1206 4873 1163 -4875 -2925 4024 4851 -1735 -4973 470
4476 470 5858 2552 -3760 -3384 3014 5569 17 -4639 -1047 4955 3898 -2698 -5211 658 5278
4491 5278 1250 -5390 -3760 3160 4347 -1771 -6034 -1676 4537 2548 -4376 -5511 1079 5297 401
4506 401 -5808 -3482 3883 4935 -2540 -5955 118 6108 2815 -4611 -3826 3606 5882 -413 -4896
4521 -4896 -760 5414 4478 -2215 -4498 1323 5966 2052 -4581 -3479 3595 5587 -1217 -5905 -982
4536i82O329k379p787q14P328L522n355o178K757P080K05o885l022N637N479k826
4552B109o963J48P391K525o150m711M187O536p69o906j638O027M223m089n864
4567c944J472O831J277o216l946M316N890k602o625m38O363K667n089n082L162
4582a964N543q64n932j706M552L785k739n073O38N299J854m638l795L198N480
4597C638j033n703r24N162L169l560m393K285M768K58m410j926L663L052j547
4612B499l996J6L804J331k892k992J619L416j94l623j803L033K245j881l366M06
4628b378L260Q98l001k087J761K409m52k398r92K503J878j969k257R88K931J41
4644A235j979r39J735J220k61j610O3J436R66j09j738Q4J603N21r75j793J100
$$ plain form
4536 -982 5347 2968 -4819 -5633 1695 5217 -138 -6316 -3559 3521 3726 -3159 -6181 -544 4935 2109
4552 2109 -4854 -4706 2685 5210 -940 -5651 -1464 5072 4303 -2603 -4241 1786 6009 1920 -3944
4567 -3944 -2472 4359 5636 -580 -4526 -210 5680 3078 -3547 -3985 2378 5045 -44 -5126 -1964
4582 -1964 3579 2715 -3217 -4923 -371 3414 675 -4398 -3760 1539 3393 -1245 -5040 -1842 3638
4597 3638 2605 -3098 -4022 1140 4309 749 -3644 -1359 3409 3667 -743 -2669 994 4046 2499
4612 2499 -1497 -1481 2323 3654 762 -2230 -611 2805 2611 -1012 -2815 218 2463 582 -2784 -2378
4628 -2378 882 1780 -1221 -3308 -1547 862 410 -1988 -2980 -477 1401 -568 -2825 -1837 1094 1235
4644 1235 -744 -1683 52 1272 1011 -599 -536 900 1866 1757 19 103 1706 2227 1252 -541 559
4661E59J414o94j661j79J456J37j211o14N14N01n45o54P2K4k9K25j91o87K25M72
4681h66K91l13k77L92L34L01k36k51K25N67N89l28m40K96Q36M12p31r49J182R08
4701A942n18j282k24J339P15r88j666K86J720K23j802j430J158K188j127k337
4717a803m14K442J374k694j910J302K665j91k680j121K267K441j218k828l49L508
4733G91K086l215k903K365M381o35m844p18M492K663l137l942J985M380J60m619
4749g10j944L176L389j876m621m1M364K152m010m226K129N364k75n801k264M486
4765g08M415l381n291J126N936J265n546l446L923N830j708o277o71O380L196
4780E043m628m969K524O534k64o212k091N355M533l393n619J57O344K190n245
$$ plain form
4661 559 1973 1279 -382 -561 895 1032 -179 -793 -279 222 -323 -977 -905 -881 -910 -685 -876 -1563 -1338 -866
4681 -866 -575 -888 -1165 -773 -439 -138 -374 -625 -400 167 756 428 -12 284 1120 1532 801 -148 1034 1942
4701 1942 1424 142 -82 1257 1972 984 -682 -396 1324 1547 -255 -1685 -527 1661 534 -1803
4717 -1803 -2217 225 1599 -1095 -3005 -1703 962 771 -1909 -3030 -763 1678 460 -2368 -2717 791
4733 791 2877 -338 -3241 -876 3505 2870 -1974 -2692 1800 4463 1326 -2616 -631 3749 3909 -710
4749 -710 -2654 522 3911 2035 -2586 -2627 1737 3889 -121 -4347 -2218 3146 2871 -2930 -5194 -708
4765 -708 3707 326 -4965 -3839 2097 3362 -2184 -5630 -1707 4123 2415 -3862 -4533 1847 5043
4780 5043 415 -4554 -2030 4504 4240 -1972 -4063 1292 5825 2432 -3187 -3030 3314 5504 259
4795B59m694L292N931p42o699k317O185L973m376o387K247O633P48o651l396M982
4811a012N377k881o459K66O160K772n003m908L120O252J48o567k430N765N136
4826E736l740n884M41O912K067o008m277M730N569j487o671j239N874L710m557
4841A176n744K192O193R07o750l182M887M868k511o341P3O059K219m669n205L279
4857b549N945k55o367k159N480M299l248o103J251O512J933n965l607M464N322
4872D953k316n602j61N499K432l979m057J713N112L43m872k780L819M657k199
4887B562n708L3N342J973m568m094K968M812q71n364j021M481K767l323l853J474
4903b390M419L75l966k145K833L504j239l912j47L909J914l090k643J695L513
$$ plain form
4795 259 -4435 -1143 4788 4046 -2653 -4970 1215 5188 812 -5575 -3328 3305 4053 -2598 -5994 -1012
4811 -1012 4365 1484 -4975 -4709 1451 4223 -780 -5688 -2568 3684 3832 -2735 -5165 600 5736
4826 5736 1996 -3888 -3447 3465 5532 -476 -4753 -23 5546 4059 -2612 -3851 2023 5733 1176
4841 1176 -4568 -2376 3817 4724 -2026 -5208 -321 4547 2036 -4305 -4232 1827 4046 -623 -5828 -2549
4857 -2549 3396 3141 -3226 -5385 95 4394 1146 -4957 -3706 2806 4739 -1226 -4833 -369 4953
4872 4953 2637 -2965 -3126 2373 4805 826 -3231 -1518 3594 3937 -935 -3715 104 4761 2562
4887 2562 -3146 -3113 2229 4202 -366 -4460 -1492 3320 2449 -2915 -3936 545 3312 -11 -3864 -2390
4903 -2390 2029 2404 -1562 -3707 -874 2630 1391 -2521 -2668 1241 3155 65 -2578 -883 2630
4918B630R1l882q82K608K333j067l607K75L242J124k918j975J798K647p53l120
4934a456l30K601J108k039j616Q50J703j50j464q49J347J119k64j636m22J530
4950C2R09q54j517P52J593k26j304k15J137N55o79n10J07Q05j19q7j18l49M12
4969C24J41l1n01J15J37L98l30n42P9L21q8O1j56k82M48K02k85l72j58P32K03
4990D16n89o73M91P89J56r01q31N70J336j69j283j69J261J011j023k000R65K051
5008A408L7k225p63J946J566j558j758N42J556P34j473j512R75J802M45k494j314
5025b086J796K289r20k984N3L313J222l190k018K061L218j094l751l08L106K208
5041B915k495k849O89L865N96l626k336K886L679j596m233m37M124K063l315l340
$$ plain form
4918 2630 2721 -1161 -2043 565 2898 1831 -1776 -1501 1741 2865 -53 -2028 -230 2417 1664 -1456
4934 -1456 -1786 815 1923 -116 -1732 -882 821 671 -793 -1642 -295 824 560 -1076 -1498 32
4950 32 941 87 -1430 -678 915 689 -615 -830 307 862 183 -327 -220 585 466 379 261 -88 324
4969 324 465 434 -67 48 185 583 253 -289 -210 111 23 84 -72 -354 94 296 11 -361 -519 213 416
4990 416 -173 -846 -355 434 590 -311 -1142 -572 764 595 -688 -857 404 1415 392 -1608 -643 1408
5008 1408 1445 -780 -1543 403 1969 411 -1347 -805 751 1485 12 -1500 -525 1277 1722 -772 -2086
5025 -2086 -290 1999 1079 -1905 -1852 1461 2683 -507 -2525 -464 2754 1660 -2091 -2399 707 2915
5041 2915 420 -2429 -1740 2125 2721 -905 -3241 -355 3324 1728 -2505 -2942 1182 3245 -70 -3410
5057c410K000M119o0m763j661M103L413k511m873M38N579J697n027l483L555M999
5073D115j648n407p49N693K540l924m351J831N302J18m913k731M056M588k092
5088B428n915N1N569K581n011n113L592O230j068o465j664N912L410m165n098
5103d726J787O026P85n531k916L608N335j875o079o79O033K810m271m821K469
5118b045O218J4o189k324N259M343l277n625Q94N874J675n488m010L605N895j587
5134C232o204j115N456L271m120n207J965N669K42n166k671M080M236j756n649
5149c737n93N313L020l953m612K503N415J75n982k019N124M220l496n166J367
5164b421N735R48m926k854L332M060j109n144o17M764K472l098m539J459M692
$$ plain form
5057 -3410 -1410 2709 2649 -2114 -3775 328 3741 1230 -3643 -3205 2374 4071 -956 -4439 -884 4115
5073 4115 2467 -2940 -3689 2004 4544 620 -3731 -1900 3402 3520 -1393 -4124 -68 4520 2428
5088 2428 -3487 -3436 2133 4714 -297 -5410 -1818 4412 3344 -3121 -4785 1127 4537 372 -4726
5103 -4726 -2939 3087 3872 -1659 -4575 -967 4368 2493 -3586 -4265 1768 4578 307 -4514 -2045
5118 -2045 4173 4187 -2002 -4326 933 5276 1999 -3626 -2732 3142 4817 -671 -4681 -1076 4819 3232
5134 3232 -2972 -4087 1369 4640 520 -4687 -2722 2947 3189 -1977 -4648 -568 3668 1912 -3737
5149 -3737 -4330 983 4003 50 -4562 -2059 3356 3531 -2451 -4470 654 4874 1378 -3788 -2421
5164 -2421 3314 4262 -664 -3518 -186 3874 2765 -2379 -2996 1768 4240 1142 -3397 -1938 2754
5179B754Q77m773k899L463L947j792m980J7M429J968l952l713K686M340n7m898
5195b583j243L657L088k547l846J480M191P68l900j954K763L230j181l472l67
5210a916L623J595k655k362J053L219J56l586j244K654K537j589l562N27L095
5225A545M70k871j606J965K002j114k071l05J756R64j282j592K69K090K38j230
5241g72j027Q59J993o16k022K25J881N44p79r86P39J073j28j094M79O73L18q57
5259E03Om2K57L73m54k34k7p4j1K88m35l36l33M71j14k64n48J49Q51l47n70n05
5281a396R06J9j13n12j49P87L55j00p98K92P72J313j322j366J009K126j61k233
5299e71l9J744J348j473j850J025K054m53j830o83J513J217q61k349j78K124Q33
$$ plain form
5179 2754 3631 -1142 -4041 -578 3369 1577 -3403 -3386 1043 3011 -941 -4654 -1968 2372 2315 -2583
5195 -2583 -3826 -169 2919 372 -3474 -1994 2197 2965 -935 -2889 -126 3104 1923 -1549 -1916
5210 -1916 1707 3302 647 -1715 -662 2557 2713 -873 -2117 537 3074 1485 -2077 -1550 1545
5225 1545 2015 -856 -2462 -497 1505 391 -1680 -1985 -229 735 -547 -2139 -1870 220 458 -772
5241 -772 -1799 -940 1053 437 -1585 -1360 521 1065 286 -700 39 1112 984 -110 369 1042 1360 503
5259 503 509 467 724 1097 643 409 382 308 297 585 150 -186 -519 -48 -162 -426 -974 -825 26 -321 -891 -1396
5281 -1396 -490 -471 -584 -1096 -1245 -458 -103 -203 -1001 -709 63 1376 54 -1312 -303 1823 1662 -571
5299 -571 -610 1134 2482 1009 -841 184 2238 1785 -45 -728 785 2002 1141 -1208 -1386 738 1571
5316A571j666j947N14K559J00l015j126K501K321j703k716O9K922J280k652j824
5332b812J643K915l91l100n29K736K354j943l483J371L793N44l189k050K741L024
5348C624j226l963l64L771J945k650l452R36M138N43m650k457L845L597k710m855
5364c928Q55M934J096m301l314L002M373j047m617j325M209L277k846m705J213
5379c124N444J378m497l596L645N108j256o271k35O243K459m788m115K719N558
5394D672m98n787k019M542L988k897n203L66N640J916n771l918L708M742j171
5409B310n865j060N119L681m207n312K099N766O82n429l100M132N563k125o669
5424d415L44O643K043m889m466L466O102j122o225j144N396L339l196n061R99
$$ plain form
5316 1571 -95 -2042 -1528 1031 1131 -1884 -3010 -509 1812 109 -2607 -2538 384 1664 -988 -2812
5332 -2812 -1169 1746 1355 -1745 -2274 462 2816 873 -2610 -1239 2554 3098 -91 -2141 600 3624
5348 3624 2398 -1565 -1929 1842 3787 1137 -2315 -1379 2759 3302 -1348 -3805 40 3637 927 -3928
5364 -3928 -3073 1861 2957 -1344 -4658 -1656 2717 1670 -2947 -4272 -63 3214 368 -4337 -3124
5379 -3124 2320 3698 -799 -4395 -750 4358 3102 -3169 -3404 2839 5298 510 -3605 -886 4672
5394 4672 4174 -1613 -3632 910 4898 2001 -3202 -2836 2804 4720 -1051 -4969 -1261 3481 2310
5409 2310 -3555 -4615 504 4185 -22 -5334 -3235 2531 3213 -2216 -5316 -1184 4379 2254 -4415
5424 -4415 -4071 2572 4615 -274 -4740 -1274 4828 3706 -2519 -3663 1733 5072 1876 -3185 -2186
5439b186N859J197n327l314L747M531j371n835j289N717L077m601n050K247N588
5454B990j8n183k826M681M161l104m950O28M993J684m016l681K528N212m42n400
5470b743j021M625L196k913m313J031N430P91m805k343L409L997j865m429o07
5485b560M649K503m067l776K205L990j76m476j732L817L018k839l692Q24L248
5500I36J388l088k780K060L724o05l930q64K918K499j842l621R80M381K90l861
5516a415j240K772K698j562l009M77L148P27k573j454J567K094l82k241r25K272
5532I54J329j302k248N49J519P00k060j274J400J507r44j690L93R91O23r11j245
5549a709O08J744m71j218K09Q16L18k58r67N02R37j76o84L20P14m89Q4J93J1k17
$$ plain form
5439 -2186 3673 4870 -457 -3771 -24 4507 3136 -2699 -3988 1729 4806 205 -4845 -2598 2990
5454 2990 2972 -2211 -5037 -356 3805 701 -4249 -3621 1372 3056 -960 -4641 -2113 3099 2657 -2743
5470 -2743 -3764 861 4057 1144 -3169 -2138 3292 4083 -722 -3065 344 4341 2476 -1953 -2560
5485 -2560 2089 4592 525 -3251 -1046 2944 2768 -1708 -3440 377 3395 556 -3136 -2312 936
5500 936 2324 -764 -3544 -1484 2240 1635 -2295 -3159 -241 2258 416 -3205 -2225 2156 2446 -1415
5516 -1415 -2655 117 2815 1253 -1756 -1279 1869 2596 23 -1431 136 2230 1848 -393 -1318 954
5532 954 2283 981 -1267 -718 801 1501 -559 -1833 -433 1074 130 -1560 -1167 -176 447 -464 -1709
5549 -1709 -1101 643 172 -1046 -837 -21 297 39 -928 -426 511 335 -349 -29 685 196 280 473 484 267
5569B67j03J39O19q0q75N18Q2j44j94k93m93P73N81j035n53N74Q21k6j477o47
5589a546J861P94j735j099J442J191n40j692k34J650J204j283j768R08J731L29
5605A213j570j412J636K178p21k624k05K647J180k026k043R98K760J70l025j060
5621a904K516J456j095k806j19L362J151l157k173K181K626n77l325q57L409K027
5637B715k720k651J013L027O61k629k387K076L595j041l817o03L710K441k815
5652E75l872J331M896J99m947j345L675K801k002m202K83M574J437l905k608K079
5668a031L684J26m645j825L968L447k824m165P84M768J472m565l581L766M524
5683C903j423n306r24M968K846l403m704J814N636jn128k549M242M316k617n044
$$ plain form
5569 267 164 303 922 842 -33 485 567 423 229 -64 -557 216 797 -238 -791 -217 604 578 -899 -1546
5589 -1546 315 1109 -626 -1725 -283 908 368 -1324 -1558 92 1296 13 -1755 -847 884 1213
5605 1213 -357 -1769 -133 2045 1324 -1300 -1505 1142 2322 296 -1747 -749 2011 2181 -844 -1904
5621 -1904 612 2068 973 -1833 -1952 1410 2561 -596 -2769 -588 2038 1461 -1864 -2721 688 2715
5637 2715 -5 -2656 -1643 1384 2045 -584 -2971 -895 2700 1659 -2158 -2761 949 3390 575
5652 575 -3297 -1966 2930 3129 -1818 -3163 512 3313 1311 -2891 -2608 1966 3403 -502 -3110 -1031
5668 -1031 2653 2779 -1866 -3691 277 3724 900 -3265 -2481 2287 3759 -806 -4387 -621 3903
5683 3903 2480 -2826 -3750 1218 4064 661 -4043 -2229 3407 3406 -1722 -4271 -29 4287 1670 -3374
5699c374m4N646J665m595l459K722M968n83n309j884N136L765l594m947J094N515
5715B722J514n565l624M640M828k308n625N0N036K790m246m419K567N367n36m886
5731a695k260M075M230k253n798L22N782J800m709m253L516N115r29o164j052
5746d273N609K864m086m235J753M884O95m639k682L938L636j771n119M59M402
5761A435K380l618n088L228M799j52m459j791L531L881j686n287J262M372P41
5776C548l755l345K281M634m14n570l97L951K398l320l475J725L596M51m040j531
5792c263K769K547r52l294l72L276K029k804k954J530L848k35l552j440L242K724
5808C099k437l257J011L526M61k901j237J569K714p07k943k23K355J544j770k463
$$ plain form
5699 -3374 -3418 2228 3893 -702 -4161 -1439 3529 2946 -2363 -4247 889 4654 1060 -3887 -2793 2722
5715 2722 4236 -1329 -4953 -313 4515 2207 -3418 -3368 1668 4458 212 -4207 -1640 3727 3191 -1695
5731 -1695 -3955 120 4350 2097 -3701 -3379 2403 4203 -506 -4759 -1243 3872 2943 -3221 -4273
5746 -4273 1336 4200 114 -4121 -2368 2516 3211 -1428 -4110 -172 3464 1693 -3426 -2967 1435
5761 1435 3815 197 -4891 -1663 3136 2984 -1475 -3266 265 4146 2460 -2827 -1565 2807 3548
5776 3548 -207 -3552 -1271 3363 2949 -2621 -3018 933 3331 11 -3464 -1739 1857 2308 -1732 -3263
5792 -3263 -494 2053 1101 -2193 -2565 711 2740 -64 -3018 -1488 2360 2125 -1427 -2867 375 3099
5808 3099 662 -2595 -1584 1942 2403 -498 -1735 -166 2548 1841 -1102 -1325 1030 2574 804 -1659
5824a659P61K600j7k563j284K183J661j227j865j69J704Q99j805r71O13J735q3
5841E13j739m73J425J278j461j262J195J193Q6j192l86R27R62p56o08N49L60j47
5859D64N7m7k22L81J32k85k90J97L85n44j99M31q9m69k48O37O8r65m53J060L96
5880C97r50j141Q11J296n16j337l9J362M68q60j004O82J855m02j363o12J397J484
5898A528p59j539J16J805J022j906j563J077K481l32k394o20J998J758j702k513
5914a543N44K790R28l093k310K134K832j311l411L4L164J429k750k681J626L120
5930A502k39l376p86K355K518j387k974N5L367J445k410k992K059L913o02l900
5946a452r72L844K476k617l766J372M135L65l845k070K624L589j180m570k29L567
$$ plain form
5824 -1659 -898 1702 1685 -878 -2162 21 1682 455 -1410 -1579 125 1024 -781 -1752 -1139 596 513
5841 513 -1226 -1699 -274 1004 -457 -1719 -524 669 755 -437 -823 104 1066 310 -298 251 611 464
5859 464 521 474 252 633 765 480 190 387 772 228 29 460 371 -98 -346 291 359 -606 -1059 1 397
5880 397 -553 -1694 -883 413 -103 -1440 -1479 -117 351 -509 -1513 -831 1024 622 -741 -1353 44 1528
5898 1528 769 -770 -654 1151 2173 267 -1296 -219 2262 1930 -464 -1084 914 2672 970 -1543
5914 -1543 -999 1791 2719 -374 -2684 -550 2282 971 -2440 -2406 758 2187 -563 -3244 -1618 1502
5930 1502 1263 -2113 -2899 -544 1974 587 -2387 -2332 1035 2480 70 -2922 -863 3050 2448 -1452
5946 -1452 -2424 1420 3896 1279 -2487 -1115 3020 3385 -460 -2530 94 3683 2503 -2067 -2296 1271
5962A271K007l017l960J583M470K60m491k264L555L508k184m499M31M441J942
5977C053l767l578K394M565o42m429j557M612L196k746m441J292M821J026m431
5992f32k709L474M019j237m839o70M474K898l463m796J756N195M88n302k688M210
6008A78M084k783n520P00N161J834m982l402K846M824j056m944j235M325L326
6023C356l114m310R44N426J070m417l475L894M707j479n414j01N110K515m188
6038E24l685K026N218j70n207j911L871M225l029m884O87M783J117m152l414L217
6054g84M229j418m969q84M340K545l079l583P77M413Q48m251k406L145M082j641
6070A364m592q1M489K210l611l338K386M102m86m119p60L604K256k032l322P13
$$ plain form
5962 1271 3278 261 -3699 -2116 2354 2614 -1877 -4141 -586 2922 738 -3761 -3330 1111 3053
5977 3053 -714 -4292 -1898 2667 2025 -2404 -3961 651 3847 1101 -3340 -2048 2773 3799 -632
5992 -632 -3341 133 4152 2915 -1924 -2594 1880 4778 1315 -3481 -1725 3470 3958 -1344 -4032 178
6008 178 4262 1479 -4041 -3341 1820 3654 -1328 -4730 -1884 2940 1884 -3060 -4295 30 3356
6023 3356 242 -4068 -3124 2302 3372 -1045 -4520 -626 4081 2602 -2812 -2913 2197 4712 524
6038 524 -3161 -1135 4083 3913 -1294 -3205 666 4891 1862 -3022 -2335 2448 3565 -587 -4001 -784
6054 -784 3445 2027 -2942 -3826 514 3059 -20 -3603 -2826 1587 2435 -1816 -4222 -1077 3005 1364
6070 1364 -3228 -3309 1180 3390 -221 -3559 -1173 2929 2443 -1676 -2436 1168 3424 1392 -1930 -1217
6086a217L688P72l160k365K136L282r67l521p16L266J650k544k965J083L230J86
6102A838l181j580K407K377j453k711K8K465J360k226j957J300K665l40k225n31
6118a764J946J661j045k025M19K254M47j712j396J479J853l13k279k32J539J440
6134B272j701j418O56J854n35j787n29J540N61q13j208L83J155l75m76m77L72
6151e26L27K04p41k05L26P62m00o91K75P37l3o13K72O76J13n87k09R27r0o81L02
6172A45N61L65q79l18N73P08l48r07o1R90Jr26m70O65J220q83j520j78J818L34
6192H90j392j100J008J352q27j282l09J609J045j045j739M11K165P36j831j506
6208a815J623K497j093k810J15K916R85k510j977J950K586n74k851n99K080J925
$$ plain form
6086 -1217 2471 3243 83 -2282 -146 3136 2169 -1352 -2068 1198 2848 304 -2661 -1578 1652 1838
6102 1838 -1343 -2923 -516 1861 408 -2303 -2275 190 1550 -676 -2633 -1333 1332 992 -1233 -1764
6118 -1764 182 1843 798 -1227 -808 1446 1893 181 -1215 264 2117 1804 -475 -707 832 2272
6134 2272 571 -847 -191 1663 1128 -659 -1188 352 913 100 -1108 -725 430 55 -421 -898 -526
6151 -526 -199 5 -736 -941 -615 147 -253 -944 -669 68 35 -578 -306 370 483 -104 -313 614 524 -157 145
6172 145 706 1071 192 -126 447 1155 807 -100 -161 829 830 -96 -566 99 1319 436 -1084 -1262 556 890
6192 890 -502 -1602 -594 758 -69 -1351 -1660 -51 994 -51 -1790 -1379 786 1522 -309 -1815
6208 -1815 -192 2305 1212 -1598 -1483 1433 2418 -92 -2069 -119 2467 1893 -958 -1557 523 2448
6224B448j757k686P08L049Q22l021k090K154K943r71l840l46L247J774k883k741
6240c190J907L454k04m018p19L022K387k090k936L5L704J566l315k634K309L741
6256C019r22m032q76L724K466k288l560R15L767J029l917k452K914L494j341m414
6272b474l13M269J852l298l462J999M075K1m285j967L947K895k537l725O48L929
6288A574J666l834k689K034L798m15m258j491M121L303k624m421J108M807N97
6303C276m311k635L317L655j267m410l78M243J933l400l273J633M576J52m670
6318a559j838L394L655k238m255P1M859J292l895l049K430M268p18m049j532L817
6334F53K996k987m232J295M609Q27m591k353L228M021j780m236n0M094J911l558
$$ plain form
6224 2448 691 -1995 -1287 1762 2584 -437 -2527 -373 2570 1599 -2241 -2587 660 2434 -449 -3190
6240 -3190 -1283 2171 1967 -2051 -2770 252 2639 549 -2387 -2352 1352 2918 -397 -3031 -722 3019
6256 3019 2097 -1935 -2811 913 3379 1091 -2469 -1554 2213 3242 -675 -3127 -213 3281 1940 -2474
6272 -2474 -2787 1482 3334 36 -3426 -1427 2648 2669 -1616 -3583 364 3259 722 -3003 -2355 1574
6288 1574 3240 -594 -3283 -1249 2549 2134 -2124 -3615 506 3809 1185 -3236 -2128 2679 3276
6303 3276 -1035 -3670 -353 3302 2035 -2375 -2753 1490 3423 23 -3250 -1617 2959 3111 -1559
6318 -1559 -3397 -3 3652 1414 -2841 -2770 2089 3381 -514 -3563 -1133 3135 2417 -1632 -3164 653
6334 653 3649 662 -3570 -2275 2334 3161 -1430 -3783 -555 3466 1686 -2550 -2600 1494 3405 -153
6350a53l044K027L806k16l536j972L240L052k020l963Q1M355J346l599k884K769
6366g11L866j149m154m03L426K139k563k949J241L551J02l123k119K798K516j075
6382A393l317k51L314J641k498k838J367L191k35l221r23K639K088j686k631Q4
6398a883K931Q33k606j788J848K406q35k308k12K217J313j721j898J044K330p4
6414A597j749j074J214J560l79j727o49J944R08j418j729O77K234O8j908q60J494
6431B03J095r23j440K36J436J45j469j07L62J089l50p83n51Q67M97k72o36k13
6449h14J220Ro45n41L37R39k93m37l4M42J84m19K00L2J31q2M7m7L80l47J06j06
6471B62L19m65l19J07P37k81p71m3Q85l3j049k6K46Q80l13r91l56J137P89j096
$$ plain form
6350 -153 -3197 -1170 2636 2420 -1116 -3088 152 3204 1184 -2779 -2698 1657 3003 -596 -3480 -711
6366 -711 3155 2006 -2148 -2551 875 3014 451 -2498 -1257 2294 2396 -727 -2846 -48 2468 1393
6382 1393 -1924 -2175 1139 2780 282 -2556 -1189 2002 1767 -1454 -2377 262 2350 664 -1967 -1883
6398 -1883 1048 1881 -725 -2513 -665 1741 906 -1402 -1614 603 1916 195 -1703 -659 1671 1597
6414 1597 -152 -1226 -12 1548 1169 -558 -1207 737 1645 227 -1502 -825 1409 1477 -431 -1291 203
6431 203 1298 375 -1065 -829 607 752 -717 -824 -462 627 277 -506 -1057 -190 307 35 -601 -814
6449 -814 406 415 -230 -771 -434 505 212 -225 -259 183 367 -52 148 180 311 229 276 229 609 262 368 262
6471 262 581 116 -203 -96 641 360 -411 -454 431 398 -651 -677 -431 449 136 -855 -1211 -74 715 -381
6491c81o45R7J202L47r26r39J057J582q28j842J54K503N61j945j715J772J807
6508A861p00j767k54K179Q22j684j389L58K225K25k152j662J817K133r46k787
6524a721k08K803J346k683k422J484L122l25l362o97K593K258k081k777O21L265
6540A216R89l196j938K525K854p85l724lL425J856k679k437J413K854M77l386
6556e39j588K826K688j556l629j15L522J482l146l113K144L669p38m140q05L600
6572E62K478l125l472J452L960K84l855j732K581L160j057l665l09L689J983l058
6588a24l081J422M809l57m013j334L475K720k018l608K69M148R13l079k702K036
6604e24L818p95m041p57L123K467k648l672J474L853K24l734k181K552L107j033
$$ plain form
6491 -381 -1026 -929 273 620 -306 -1245 -188 1394 566 -1276 -1122 1381 1942 -3 -1718 54 1861
6508 1861 1161 -606 -860 1319 2141 457 -932 -574 1651 1876 -276 -1938 -121 2012 1066 -1721
6524 -1721 -1929 874 2220 -463 -2885 -1401 1721 1396 -1966 -2663 -70 2188 107 -2670 -2049 1216
6540 1216 2205 -991 -2929 -404 2450 1665 -2059 -2062 1363 3219 540 -1897 -484 2370 2847 -539
6556 -539 -2127 699 3387 1831 -1798 -1913 1609 3091 -55 -3168 -1024 2645 1907 -2233 -3038 562
6572 562 3040 -85 -3557 -2105 1855 2139 -1716 -3448 -867 2293 1236 -2429 -2738 951 2934 -124
6588 -124 -3205 -1783 3026 2669 -1344 -2678 797 3517 1499 -2109 -1840 2308 3221 142 -2560 -524
6604 -524 3294 2499 -1542 -2299 824 3291 643 -3029 -1555 2298 2522 -1212 -3393 -841 2266 1233
6620A233l684n70L532J798k631l315J526M012J78l922j636L526K966k220l638
6635b845Q61L804J058k996k413K332L366p00l600r78K991K412j933l187N40L714
6651B426L36l395k425K735L167j266l789m13L690J330k959k476J622L116k88l204
6667a793j217K751K276j803k889O60L011O63k190k161K138K458n41k613n23K315
6683E42K090j845k419P37K980O7k216j635K104J892p08k753J92K415P13k244j652
6700a740J165K017j07k727j23J611R50j060j418j14J519P09j154j272R15J699
6716H70j98j913m40J610J346j651p40P07J222l5j036l26O53R36m34m48k94Q07
6734F36M13n03o74N24O05O0r44k88N68M27m72q47J17M22O7l06k00L14l33J06j87
$$ plain form
6620 1233 -2451 -3021 511 2309 -322 -3637 -2111 1901 2079 -1843 -3479 47 3013 793 -2845
6635 -2845 -1984 1820 2878 -118 -2531 -199 3167 2467 -1133 -2111 880 3292 1359 -1828 -1288 2426
6651 2426 2762 -633 -3058 -323 2844 1578 -2211 -2624 1066 2396 -563 -3039 -1417 1699 1411 -1793
6667 -1793 -3010 -259 2017 214 -2675 -2015 996 1659 -531 -2692 -554 1904 1363 -1250 -1773 542
6683 542 2632 787 -1632 -895 2085 2152 -64 -1699 405 2297 1589 -1164 -972 1443 2156 -88 -1740
6700 -1740 -575 1442 1335 -1392 -1515 96 1046 -14 -1432 -1546 -27 682 -472 -1744 -829 870
6716 870 672 -1241 -1681 -71 1275 -376 -1116 -409 813 778 -258 -584 69 1005 571 123 -171 636
6734 636 1049 546 -128 396 1001 1061 117 -171 397 824 352 -495 -378 44 111 -195 -395 -81 -414 -308 -495
6755d95k59k09O86k20n9J54j9J61k0L90k72j21K05L68K14n57r0Q80K28r49j32
6776a16L41N57k76k16j08o0P07m00k49l59L12Q84m50j085l49J517J45j003j110
6795a318P61J297l27j881J52J414O92j137j390Q82J117M42j832m72J516J319r93
6812B42j466j50K485O32j809j571J650J787m24k136m27J638J793j596j911L56
6828i07K624K57k511j400J778K404j124k837k57K775R97j965k137J034K599J26
6844A456l028r90K559J963j492k570L29K484J615l160k258K631K798p45l301o49
6860b358L391J869k724k857K100K848m05k720j355K741K157j313l390L70L105
6875A459J108k494k322J456K953j64l474j035K882K163j943l180N82L605O45l217
$$ plain form
6755 -495 -754 -963 -277 -497 -556 -402 -421 -260 -280 110 -162 -283 -78 290 504 -53 -143 737 965 16 -116
6776 -116 225 782 506 290 182 122 829 429 180 -179 133 1017 567 -518 -867 650 795 -208 -1318
6795 -1318 -557 740 413 -1468 -1316 98 790 -347 -1737 -855 262 704 -1128 -1600 -84 1235 242
6812 242 -1224 -1374 1111 1743 -66 -1637 13 1800 1376 -760 -1187 451 2244 648 -1263 -907
6828 -907 1717 1974 -537 -1937 -159 2245 1121 -1716 -1973 802 1799 -166 -2303 -1269 1330 1456
6844 1456 -1572 -2562 -3 1960 468 -2102 -1773 711 2326 -834 -3092 -461 2337 1592 -1709 -2358
6860 -2358 1033 2902 178 -2679 -579 2269 1864 -856 -2211 530 2687 1374 -2016 -1646 1459
6875 1459 2567 73 -2249 -793 2160 1996 -1478 -2513 369 2532 589 -2591 -2009 1596 2241 -976
6891i76k200K637K655r78l552j27L371J799k896k500J629L389l93k857j486K645
6907A60K577j728k982M61K987J096k621k279J454L363m20l645q59L273K033k458
6923D12k962R65L412N18l312j679K542K141j120k511n15K935R74j773k269J177
6939a065K645Q4k724j438K395K558j411l040M46K733J013k555j875J622K789n17
6955A660l049m90K483J641j740k579J028K733L97k967j335J967K185r22k648q8
6971a724K567J108j829k063J045K264j55k215j007J972J932j301k154L84J889
6986G13R37k169j359J380K294j002j997L4J720J106j446j688O48J874n9j600o63
7003a277J088J668m98k098k08J851O55j071j189Q83J113mj568m14J430P84j091
$$ plain form
6891 -976 -3176 -539 2116 1138 -2414 -2541 830 2629 -267 -2767 -1138 2251 1858 -999 -2485 160
6907 160 2737 1009 -1973 -1512 1475 2571 -50 -2329 -875 2488 2068 -1577 -2436 837 2870 412
6923 412 -2550 -1585 1827 2345 -967 -2646 -104 2037 917 -1594 -2109 826 1800 27 -2242 -1065
6939 -1065 1580 1664 -1060 -2498 -103 2455 1044 -1996 -1550 1183 2196 -359 -2234 -612 2177 1660
6955 1660 -1389 -1879 604 2245 505 -2074 -1046 1687 2084 -883 -2218 -251 1934 1012 -1636 -1724
6971 -1724 843 1951 122 -1941 -896 1368 1213 -1002 -2009 -37 1895 594 -1560 -1176 713
6986 713 1650 -519 -1878 -498 1796 794 -1203 -1169 551 1657 211 -1477 -829 1045 986 -614 -1277
7003 -1277 -189 1479 981 -1117 -1325 526 1181 110 -1079 -196 917 913 -655 -1069 361 1145 54
7020E4p30L07P22L41o76q13P57O28m52o39O7P55J43j56p30n7Q62n2o73k11N12
7041d1L47pp17j01O22J28r5p63M96K40Q6m68J3N22O0n58J93N51p40J88N29j44
7063C41j91n80L09P76l06n56p5N69Q4k76k62J06M14J83n53k23Q5M95R1p57k75
7084f01N48P07n44p31j2J027J5n76p70P46P45l58q46k55P41J180o88j200K26J307
7104F61L30j285o54J113Q94n88j438L50J377O85j324j045N97J704k50j552o78
7121a103J122J523j175j686K95K184J44j668j263J241J808q97j829j87J965R03
7137A377j318j634O22J865L27k318r12J735J955p63k336l47K934Q95k397j798
7153b113J663K420k63k664p19K465J326j581j809K70K532L28k076j806J782K522
$$ plain form
7020 54 -676 -369 353 694 18 -795 -38 590 138 -501 -434 321 464 308 -422 -479 383 331 -342 -553 -41
7041 -41 306 299 -418 -519 103 231 136 -627 -131 109 195 -273 -260 262 322 -236 -43 508 -232 -44 485 341
7063 341 150 -430 -121 655 349 -207 -282 287 371 95 -167 -61 353 536 -17 -240 -155 340 431 -326 -601
7084 -601 -53 654 110 -621 -633 394 409 -167 -937 -191 554 196 -650 -905 -164 1016 328 -872 -646 661
7104 661 991 -294 -948 165 1059 471 -967 -617 760 1445 121 -924 -327 1377 1127 -425 -1103
7121 -1103 19 1542 367 -1319 -1024 1160 1304 -364 -1627 -386 1422 525 -1304 -1491 474 1377
7137 1377 59 -1575 -953 912 1239 -1079 -1991 -256 1699 936 -1400 -1747 1187 2082 -315 -2113
7153 -2113 -450 1970 1707 -957 -1676 789 2115 534 -1275 -1005 1527 1855 -221 -2027 -245 2277
7169B277j072k760k04K145J508j955k304J257K606j16k575j192K201J863j316
7184C63k540M57K684J000k642j840J802K797p32l028m21K993J655k272k216R51
7200i89K744L41k820j164K463J709r25k487j51K165J451k144k459J655K579n26
7216A442k814o87K318J780j568k427L13K677N16k529j231J759K103p94k729k14
7232b085K429J462j733j949R65K086L05k177j000J791J928j137j923K71J761J173
7248B167k132j352P94K160n9k424m72K163R12j204j867N50J691M25j845j086J283
7265b96J562n81j838m70J666J087j212j742Q41J947P7j983o21J341J671j155j651
7282a357N41J701K54j364q85J173J301n36j197l45J201J077o84j384m1J299O77
$$ plain form
7169 2277 1205 -1555 -1759 386 1894 -61 -2365 -1108 1498 1382 -1193 -2385 -184 1679 363
7184 363 -2177 -1720 964 1964 -678 -2518 -716 2081 1349 -1679 -2100 893 2548 276 -1940 -989
7200 -989 1755 2096 -724 -1888 575 2284 1359 -1128 -1279 886 2337 193 -2266 -611 1968 1442
7216 1442 -1372 -2059 259 2039 471 -1956 -1643 1034 1550 -979 -2210 -451 1652 858 -1871 -2085
7232 -2085 344 1806 73 -1876 -911 1175 1480 -697 -1697 94 2022 885 -1038 -767 994 2167
7248 2167 35 -1317 -523 1637 1578 -846 -1318 845 1757 553 -1314 -764 927 1352 -493 -1579 -296
7265 -296 1266 685 -1153 -1623 43 1130 -82 -1824 -983 964 1041 -942 -1563 -222 1449 294 -1357
7282 -1357 -816 885 1139 -225 -1110 63 1364 828 -369 -714 487 1564 880 -504 -545 754 1431
7299A431j430r40Q10J209p60j022o9J065O28j182p49N17Q25j24q57k31N44R16
7317E81n15j141K14R41K92q13l34Q48K50j33o53J18M71L77l23m32J50O42p0K4
7337D94l99J27M15k01m82K00J06J98k54k36J10Kj2o0n8P8j98J58L9l84j83n3J69
7360d24K00l63o1N71o4j31L2k77L00N88l16o5m08O92K58k10l31P5N92j08q79J01
7382b28O05L56j88p96K13P36o2p53l39O22M79l31r01K63N71L01p39q42L86O88
7402D1L40r61o49J030O65l18j209k23J429O54p66r25K83J474Q0j351m18J106R61
7421A243j003j103O37J383j42r59q45Q39J293k29j468n74J255R12q19j471M17
7438f34J548L22j347j305J253J424r78j575o2J555J032j652j487J236J565J74
$$ plain form
7299 1431 1 -939 -129 1080 320 -702 -771 294 922 -260 -1009 -492 333 209 -648 -879 -335 581
7317 581 66 -1075 -861 80 372 -441 -775 73 323 190 -463 -345 126 503 180 -252 -102 540 470 494
7337 494 95 222 637 436 -46 154 260 458 204 -32 78 80 68 8 -50 28 -170 -12 27 -357 -540 -593 -424
7360 -424 -224 -587 -648 -77 -141 -272 -240 -517 -217 371 55 -10 -418 274 532 322 -9 66 658 550 -329 -228
7382 -228 377 733 545 -251 -38 698 636 -117 -456 166 645 314 -587 -324 247 548 -191 -1033 -647 41
7402 41 381 -580 -1229 -199 466 148 -1061 -1284 145 799 33 -892 -609 865 945 -406 -824 282 1243
7421 1243 240 -863 -226 1157 1015 56 -789 50 1343 1114 -354 -928 327 1239 420 -1051 -634
7438 -634 914 1236 -111 -1416 -163 1261 283 -1292 -1354 201 1233 -419 -1906 -670 895 1069
7454A069k018p31J688J442j184j813N55K118L24j775j126J369J902o66j995p9
7470i20J638J398j588j784N94J912K83j961j432J894J992j296k119Q1K216O62
7486A570k168j287J415J896n77k314k56J932J357j223k012L22K296M81k092j371
7502b031J897K037j002k267L1K153R17j622j509Q73K088k62j953o56J823J177
7518A694r30k008L63J903M78j699j532J521J679m16k277j09J869J144j635j427
7534a382K81K251k04j794j015J431J654p65j825l9J963R42j835j247R95J832l50
7551H93j757j38J445Q78j041j363K11J816P8j073p84R28J125m64j643l22J913
7568G02O24j164j572P97J662J2j857l11J228P06p16j020k30J493O21j350o02O68
$$ plain form
7454 1069 -949 -1680 8 1450 266 -1547 -992 1126 1450 -325 -1451 -82 1820 1154 -841 -920
7470 -920 718 2116 528 -1256 -662 1250 1533 -428 -1860 34 2026 730 -1389 -1308 908 1570
7486 1570 -598 -1885 -470 1426 849 -1465 -1721 211 1568 345 -1667 -1345 951 1432 -660 -2031
7502 -2031 -134 1903 901 -1366 -1335 818 1735 113 -1396 -523 1565 1303 -650 -1306 517 1694
7518 1694 764 -1244 -881 1022 1500 -199 -1731 -210 1469 1053 -1224 -1333 536 1680 45 -1382
7534 -1382 -1101 1150 946 -848 -1863 -432 1222 457 -1368 -1407 556 1498 -337 -1584 -589 1243 893
7551 893 -864 -1002 443 1321 280 -1083 -872 944 1022 -51 -835 93 1218 754 -889 -1211 702
7568 702 1326 162 -1410 -613 1049 1061 -796 -1107 121 827 111 -909 -1139 354 975 -375 -977 -309
7586c09J062l45j159k8Q71Q74r36q99M04J081R0q74k38L35J081n88q85r3J081
7605E25M80r81p76L26Q88J13p49n42Q57M38n29p84M82P00M6o82j63J52L57J93
7625C51p02j08L73M44k64m77J61N68j09k68m43N95L15n18k3K54J6o0j6j52J34
7646G1j6k74O9j25J18P2J28m1p4K83n31L52J28k89J70K5j68L2nj15N2L79j99j70
7670a28j2L32j11J43p31J59P22o1n03k38P09K17m27n24J94N22O6l83n40O01M02
7691D09m47m17l29J106Ok71q54O05P53j44p07n12Q13O91o07q05L8J110N20j031
7711g3q60P28R39mj336k7J088L51n12q87J33Q02M24r59o47M85J212k97j343j89
7731i72J417M19q02r72M90J419k50j296o13J145J195p09j495P0J555N63j347j037
$$ plain form
7586 -309 753 408 -751 -779 92 966 30 -869 -465 616 706 -168 -406 -71 1010 422 -463 -556 525
7605 525 1005 24 -752 -426 462 575 -174 -716 141 579 50 -734 -252 448 494 -188 -351 -199 158 351
7625 351 -351 -459 -86 358 94 -383 -222 346 237 -31 -474 121 436 -82 -105 149 165 105 89 -63 71
7646 71 55 -219 -150 -275 -157 -85 43 2 -72 211 -320 32 160 -129 41 66 -102 -70 -75 -190 -138 241 42 -128
7670 -128 -140 192 81 224 -507 -348 374 313 -190 -428 281 498 71 -453 -259 263 329 -54 -594 7 409
7691 409 -38 -455 -784 322 328 57 -797 -192 561 417 -290 -802 11 702 95 -710 -672 438 958 -73
7711 -73 -933 -205 734 730 -606 -633 455 806 294 -593 -460 342 766 -193 -840 -355 857 560 -783 -972
7731 -972 445 864 62 -910 -420 999 749 -547 -1160 -15 1180 471 -1024 -954 601 1164 -183 -1220
7749a220R80J003j87j164l28J207J246j106j432M04J675L5j554p19J011J402n91
7766F62j455j14J480Q46j332j356P22J636J22j860n64J202J328j023j575L08J601
7783F28M53j492j103J069J529m25j692k16J388J337j409j738J165J542K29j765
7799e00o81J222J439q03j630K79J842N18j856j095R44J553j96j693k87J356R95
7816A407q05j925L87J611M89j864p52J285R97k13j780q8J205J252j123j559Q15
7833f61J552N9j574o74J362J262j219j218L74J749J46j320r49J169J310p24j077
7850d33l76J120Q18r68j096L91J469O5j329n58J073R59o66j425J90J236L25j068
7868b73p05P02J044l45j049l70Q63R08m40j473O64O39L77n21r91J032O52k15q18
$$ plain form
7749 -1220 -240 763 576 -588 -916 291 1537 431 -1001 -597 1078 1113 -441 -1160 -149 1253 662
7766 662 -793 -907 573 1419 87 -1269 -547 1089 1211 -649 -1213 -11 1317 294 -1281 -973 628
7783 628 1081 -411 -1514 -445 1084 659 -1033 -1249 139 1476 67 -1671 -506 1036 1265 -500
7799 -500 -1181 41 1480 677 -953 -674 1168 1686 -170 -1265 -321 1232 1036 -657 -944 412 1407
7816 1407 602 -1323 -936 675 1164 -700 -1452 -167 830 617 -1163 -1251 -46 1206 83 -1476 -661
7833 -661 891 950 -624 -1298 64 1326 107 -1111 -737 1012 1158 -162 -1111 58 1368 644 -433
7850 -433 -809 311 1129 161 -935 -544 925 990 -339 -897 176 1135 469 -956 -766 470 795 -273
7868 -273 -978 -276 768 423 -626 -996 -133 775 335 -1138 -474 165 542 21 -970 62 714 499 -319
7887c19m01R09O13l74j003M14Q31mo61m19O24Q47l25j146N9Q90J36n46o21M81
7907a5M08n2o40j36M76J95m80j51q6L64O50q65l63M68M08k95k58J05K00N53m37
7928D9n29K84N88k17o6m9KQ3j36K23k8J00K5J30l20R0%k48K18j59k25L02j08l3
7952b4r0J36j81K5K9j39o3J29J13O3J16n39O6N92l19n6o0N28r4k49m65M89N38
7975E45o6o80l33R42M73n74m25O6N16K89p22l13M44N40r1j037m2Q02K61m00o22
7996d27O5R76l35p70PK29J054j023p93K44J174K04j142n58P35O01k6r89J6J110
8016C52N67q36q62N71J009J49j358k71Q21J052m59j365L1J280M86j139q42M82
8034c32J334j96j350l30J139Q61q26j333K75J369K04j426m04P25J095o19j231
$$ plain form
7887 -319 -720 189 802 428 -575 -161 670 666 5 -414 210 1057 732 -414 -355 535 671 125 -496 -15
7907 -15 393 341 -299 -435 41 236 -244 -395 -481 -117 533 -332 -695 -227 181 -114 -372 -267 -67 486 49
7928 49 -480 -196 392 175 109 60 62 145 9 232 204 304 329 459 139 229 229 -19 199 40 -185 117 9 -24
7952 -24 -114 22 -159 -134 -105 -244 -307 -178 -65 -2 114 -425 -359 233 -86 -142 -202 326 232 -17 -482 7 545
7975 545 479 -201 -534 408 881 307 -118 -52 464 753 31 -282 162 702 611 -426 -468 334 595 195 -427
7996 -427 -362 614 279 -491 -484 -255 799 -224 -1017 -773 401 605 -537 -1095 -360 241 215 -774 -758 352
8016 352 919 83 -779 -208 801 950 -408 -679 142 1194 735 -630 -599 681 1167 28 -814 -332
8034 -332 1002 806 -544 -874 265 1126 300 -1033 -758 611 815 -611 -1015 -290 805 186 -1045
8051a045o3J224Q55r08j044K2J639kq61r41Q82J442m22j576j08J664N34j481p77
8070i66Q21J474k82j352n41J055J062q44j463L59J533J78j300p53P85J153j53
8087G66j618n09J341R15j032j122J72J806j2j498o70J276J621q49k007L27J493
8104D00J019j447j247R39J538n31j369l78J368J203j090j470N29J671L49j473
8120A1q56N44J527l67j834j50J688P48j254j215O58J561l87j355m77J106J323
8137A271j093j304L89J250O48j223j071P19J351q6j712j93J408P64q57j129N00
8154c68J322K36j506p97J323Q15m64j147R0J249M43j061q40P68Q11l2j377l62
8172h97J190N19q26p77O3R64M05p94p92P07R44m54r12n9P60O09o01p75K95
$$ plain form
8051 -1045 -1108 116 971 63 -981 -959 680 678 -183 -1124 -242 1200 778 -798 -906 758 1292 -189 -966
8070 -966 -145 1329 1047 -305 -846 209 1271 427 -1036 -677 856 1034 -266 -1019 -234 919 766
8087 766 -852 -1361 -20 895 -137 -1259 -1087 719 707 -791 -1461 -185 1436 587 -1420 -1093 400
8104 400 1419 -28 -1275 -336 1202 671 -698 -1076 292 1495 405 -1065 -536 1135 1484 11
8120 11 -845 -301 1226 859 -975 -1125 563 1311 57 -1158 -500 1061 674 -681 -1158 -52 1271
8137 1271 178 -1126 -737 513 1161 -62 -1133 -414 937 851 -861 -1054 354 1118 261 -868 -368
8154 -368 954 1190 -316 -1113 210 1025 561 -586 -496 753 1196 135 -705 63 874 842 -535 -897
8172 -897 293 812 -14 -791 -728 236 641 -153 -945 -238 706 252 -660 -719 41 650 49 -726 -431
8191d31
$$ Imaginary data points
##PAGE= N=2
##DATA TABLE= (X++(I..I)), XYDATA
0@%%%%%%%Qj6J6j6K4l2M0n6P2q8J10j34J60j94K35k79L26l87M58n31O12p12Q24
30D40r41J073j224J389j571J773j993K237k509K804l120L469l859M281m734N234
46B749n786O384p035P752q542R410j0368J1430j2615J3947j5452J7167j9140K1445
60A1346k4177K7469l1533L6707m3544N3036o7212R0929j40173M18904q31781m47418
72i47447J552936J56984j041067k67479O87219O2130j99519N4575j81083l91540
82e14291N41064O26921p56312r16975R07745J043016q96644j045465Q11761Q66037
92F66857n80855o07281L58566L07576j10389O4202J5635m37116N3992P98489m4387
103D85289j053541N6410J203017j9367j177678J0971R98065l712p03032K060L45781
$$ plain form
0 0 0 0 0 0 0 0 0 8 -8 8 -8 16 -16 24 -32 40 -48 62 -72 88 -106 129 -150 176 -211 247 -284 328 -384 440
30 440 -501 572 -652 737 -834 939 -1054 1183 -1326 1478 -1642 1827 -2032 2249 -2485 2749
46 2749 -3037 3347 -3688 4064 -4478 4932 -5436 5994 -6621 7326 -8126 9041 -10099 11346
60 11346 -12831 14638 -16895 19812 -23732 29304 -37908 53021 -87152 331752 -500029 -947447
72 -947447 605489 762473 -278594 -546073 141146 203276 3757 58332 -122751 -514291
82 -514291 26773 653694 -102618 -1019593 -111848 931168 34524 -1010941 -199180 666857
92 666857 86002 -521279 -162713 144863 34474 98676 114311 -322805 -268813 529676 485289
103 485289 -568252 -511842 691175 671808 -505870 -494899 503166 499454 -203578 -201518 144263
114A44263m7695l0069J49039k58739l29599M76590M74991o83931o03067P65497
124E7280O26629p57792n83104O33424M33318m73518k50463K72300L1418r9586
134a10094J94046p328m12590P8881O33871j16390p74606J69426Q26728j77305
144C04639p23643J97962N68496j78149l42646J81211J15112j85712J21958K37715
154B96943l10006l03023M65250L59635n89534l84164O39701L25220o23663k36476
164c60117N10394J06412l81328M149K21566j58454j12893K93037J2871m24691
174b89054N5141N13604j30901n65118J97064N45697k45076m37603K77217K94521
184B15492k62425j21459K60648j9717k52421J66191K73406k76041k57301L91561
$$ plain form
114 144263 96568 66499 215538 -43201 -372800 103790 578781 -105150 -708217 57280
124 57280 683909 -73883 -656987 -23563 409755 -63763 -314226 -41926 -10508 -110094
134 -110094 83952 76624 -335966 -257085 376786 260396 -514210 -344784 481944 304639
144 304639 -419004 -221042 347454 169305 -173341 7870 122982 -62730 59228 296943
154 296943 -13063 -316086 149164 508799 -80735 -464899 174802 500022 -123641 -360117
164 -360117 150277 256689 -124639 -120490 101076 -57378 -170271 122766 135637 -289054
174 -289054 -233913 279691 148790 -416328 -219264 326433 81357 -356246 -79029 215492
184 215492 -46933 -168392 92256 72539 -179882 -13691 259715 -16326 -273627 117934
194A17934K39695m61218j80852M91987R5593m63907J6270L95552j19907l06764
204a75617J91177K06850k62702j35870L11820N1877l65090K2591L68716j20813
214I2939l46482J97132K65447k77910j74273L20234O9485l30572K2825L15130
224A53955r8063k94547J54633K71546j95763k07236K49442J19826k74898Q100
234a13005K91395j20919k67403K32568K43619k99477j97577L45695J64993l48906
244f9017j27816L24462P6146k80679J629K12651j04528j30173J97689J7907k90808
255a72537O8696L42940j39271l79476J60982L70913j69538l43180J53787K72671
265A65987j42553j72806J32073L9550j19667J16507J11579k58412r9453L67532
$$ plain form
194 117934 357629 -103589 -284441 207546 303139 -160768 -144498 251054 131147 -175617
204 -175617 15560 222410 -40292 -176162 135658 187535 -177555 -154964 213752 92939
214 92939 -253543 -56411 209036 -68874 -243147 77087 146572 -184000 -161175 153955
224 153955 55892 -238655 -84022 187524 -8239 -215475 33967 153793 -121105 -113005
234 -113005 178390 57471 -209932 22636 266255 -33222 -230799 114896 279889 -69017
244 -69017 -196833 127629 203775 -76904 -75275 137376 32848 -97325 100364 118271 -172537
255 -172537 -103841 239099 99828 -279648 -118666 252247 82709 -260471 -106684 165987
265 165987 23434 -149372 -17299 22251 -97416 19091 130670 -127742 -227195 140337
275A40337J04786m12632j01492M24982J09337l86216r5703L19750O8104k14151
285d2898j913R5930q7063L2447J88472j46734k80407K25547L43706k60188l81339
296c14440K45938L81709k07521l51065J45982K61713r4105j38277M4280j7112
306d2898j4546J70010n380l09355J260M02085J9370m38086n2978M19222Q6325
317B35029l50593r5429K48548P5855j15369j7139k0828n5562J58977J48652k61268
328d9127k34549L18033L07791l16137l44607K71709L46812j95355l05419J05854
338i4995K14656k2927q6055m9399o9914R1727K18618j07975l43808Q4366M13405
349B47699m3430m31244j3120L93127O6537l04992j00291J75535R7667k3979n7923
$$ plain form
275 140337 245123 -167509 -269001 155981 265318 -120898 -216601 103149 171253 -42898
285 -42898 -44811 51119 -35944 -3497 184975 38241 -242166 -16619 327087 66899 -314440
296 -314440 -68502 313207 105686 -245379 -99397 162316 68211 -70066 -25786 -42898
306 -42898 -57444 112566 107186 -202169 -200909 201176 220546 -217540 -270518 148704 235029
317 235029 -115564 -210993 37555 113410 -1959 -19098 -39926 -95488 63489 212141 -49127
328 -49127 -283676 34357 342148 26011 -318596 -46887 299925 104570 -200849 -94995
338 -94995 119661 96734 10679 -38720 -108634 -16907 201711 93736 -250072 -165706 247699
349 247699 204269 -226975 -240095 153032 219569 -85423 -185714 -10179 87488 63509 5586
360E586j25741n447K57222Q5950l44213j64467L80900K32656l59844k73413K93739
371a7072K79865j93411k37500Q2819J50264J9769l1881j06242j03557J65721K36414
382B45189j85718l42745J64471M02856j14199m10679M9115L64580J3501k71618
392h5247n8662J44614P5987M71o4889j45048K6081K66710L1797l43990r3909L69027
404A22942J44858l47067j78266K83365J81713j88447j48836Q2372Q1210J9567
414E3411R652j04909j11796J64849K05870j91512k78135J83694L17545j49970
424I8699l20282R8726K79022m5758j99444M511R6460J9962J4647k5568j21364
435a00389J4102K10913J2725k64480m0685K81870O8605k57973q2136K06557P8266
$$ plain form
360 5586 -120155 -125602 131620 217570 -126643 -291110 89790 322446 -37398 -310811 -17072
371 -17072 262793 69382 -168118 -85299 64965 84734 52853 -53389 -156946 8775 245189
382 245189 59471 -283274 -118803 284053 169854 -240825 -191710 172870 186371 -85247
392 -85247 -143909 705 76692 77163 12274 -132774 -106693 160017 191814 -152176 -246085 122942
404 122942 267800 -79267 -257533 25832 207545 19098 -129738 -47366 33844 53411
414 53411 63063 -41846 -153642 11207 217077 25565 -252570 -68876 248669 98699
424 98699 -221583 -122857 156165 110407 -89037 -84526 11934 31896 46543 20975 -100389
435 -100389 -86287 124626 137351 -127129 -167814 114056 182661 -75312 -157448 49109 127375
446A27375j33166m9397N3237N209K4872M9093r2759j08146J36789J56232j59754
457I585j89332J57701J94136j41890j80941J09675J37579p9207q0354M8977Q938
468e133k6883O2334J2684j24281p600J69676R707j89610p109J91483O749j64523
480g2506J913J25428j3426p1119L8961J9825o3036L3185Q8405p4945j03894J05277
492A4068J10026j23166j04459J28747Q5250j27351n5866J13906J3561j02579K4457
503b3406Q4550o5327p0602R4579M7791j20818k8388J27743J860j26477K3721J12786
515E8012n1915r3327Q0515P0642j02671m2988J19615K1326j21013M151J19194
526F1541j9915r6728M2458O8969n5511k7160P6994r146r1526M7132J07767p6232
$$ plain form
446 127375 -5791 -55188 -1951 3258 28130 77223 -15536 -123682 13107 169339 9585
457 9585 -179747 -22046 172090 30200 -150741 -41066 96513 17306 -63048 -14071 -5133
468 -5133 -32016 30318 43002 -81279 -88879 80797 90504 -99106 -106215 85268 92017 -72506
480 -72506 -70593 54835 41409 -29710 9251 29076 -33960 -775 87630 12685 -91209 14068
492 14068 124094 928 -103531 25216 110466 -16885 -72751 41155 54716 -47863 -23406
503 -23406 61144 -4183 -74785 19794 67585 -53233 -81621 46122 47982 -78495 -54774 58012
515 58012 6097 -87230 -6715 63927 -38744 -81732 37883 59209 -61804 -57653 61541
526 61541 41626 -55102 -12644 56325 814 -26346 50648 41502 -50024 -2892 104875 28643
538B8643j17064R4269J16640j01218j10082R1147Q5245p9963n4233N4790K796
549A0970l7442M3059J4561r7175p676J37902K670j71309j0550J81549J9483j69796
561h3754k8997J38969L7122q7152l0683L0332K0343L7474R320q9351l6300J34578
573E1901P6070j50308j03660J52156J26342j26153j24452Q6179J05722l6126o5989
584h318j3684P971N0483N4313p8547j21682Q1478J68796p3352k06699M1073K09630
596A11462j0461j93788k6578J40986M8064p4759o2091n516N4302Q1759k8185j44652
608a09457r174J89010N6196j98024r1872J85947J24982j38703j26875Q3830J14050
619G9910r975o6912n0973J0917J03978O1096j28109j26439J29128J80454j08978
$$ plain form
538 28643 -88421 5848 122488 21270 -88812 2335 87580 7617 -46616 8174 10970
549 10970 -26472 16587 31148 -66027 -73703 64199 66869 -104440 -114990 66559 86042 -83754
561 -83754 -112751 26218 63340 -23812 -54495 -24163 -3820 33654 42974 -46377 -82677 51901
573 51901 127971 -22337 -125997 26159 152501 26348 -98104 -11925 93797 57671 -8318
584 -8318 -22002 -14031 36452 90765 12218 -109464 -27986 140810 67458 -139241 -98168 111462
596 111462 101001 -92787 -119365 21621 69685 -5074 -67165 -72681 -18379 63380 35195 -109457
608 -109457 -118631 70379 126575 -71449 -163321 22626 147608 8905 -117970 -34140 79910
619 79910 69935 3023 -47950 -37033 66945 128041 -68 -126507 2621 183075 74097
630G4097k12628O6546K10864k3649j85938k5053J22252N2014n1273p2578l8941
641h4287O2136J11868l9948j76657o382K08957N3388k13953r8398J87147J29711
652A33582j30750j34947O3535J21044J6455p5087p9732K0670J34469N2382j51762
663c0141j13050J50363J69343j15071j94650O9876J95503j3415j60180l7770R8695
674A9503P5691k4659r7063n9639Q8381J28880o6266j87415J8959K09134K5141
685A30647k11110p6412J74217J05066j21595j21257M6387J08532K8065p7761r4970
696a10191L0522J42570K8805j60217q0259J59049J29178j24753j49868Q3269J55349
707A03454k2266j21566k5901P5429P2969p451r5426n7229J01624J17524q5678
$$ plain form
630 74097 -138531 -71985 138879 115230 -70708 -95761 26491 78505 27232 -45346 -84287
641 -84287 -22151 89717 49769 -126888 -133270 75687 129075 -84878 -183276 3871 133582
652 133582 2832 -132115 -68580 52464 68919 -6168 -85900 -65230 69239 121621 -30141
663 -30141 -143191 7172 176515 61444 -133206 -63330 132173 118758 -41422 -79192 19503
674 19503 95194 70535 -26528 -86167 2214 131094 64828 -122587 -103628 105506 130647
685 130647 -80463 -156875 17342 122408 813 -120444 -74057 34475 62540 -15221 -110191
696 -110191 -79669 62901 91706 -68511 -148770 10279 139457 14704 -135164 -51895 103454
707 103454 81188 -40378 -66279 9150 82119 74668 -20758 -77987 23637 141161 55483
718E5483j61977N2263J81268j7005j80698k4797J47453M7130j03844o5762L9435
729c1051N8418J8324m6560p8235J2967J13657K0460j33558n7312J30918Q3756
740I1784j11884r6314Q2682R5632m0553p1157L274M0871L6022O381n4136m4710
752f2108O7092Q5208n9318j05293M9889J20388k9411j14681J2300R4048J641o0937
764a182q595K0001O138J5144k946n1678j2726O9735K1989q5583l8825Q0646M1706
777E3824p5576m4679N5851L2002l9500j8206J8776n4J302K0227j4862l4880K4456
790b1319M9416k2468m8819K6955N1346k2292l7274K7015K6994k3640o372K7045
802B6587q174k4107K5692K4332l5387k2577L8063J4978m1191r213L7954m350l9064
$$ plain form
718 55483 -106494 -54231 127037 110032 -70666 -95463 51990 99120 -4724 -70486 -31051
729 -31051 27367 45691 -869 -79104 -66137 47520 67980 -65578 -122890 8028 91784
740 91784 -20100 -116414 -33732 61900 21347 -49810 -46536 -5665 30357 36738 -17398 -62108
752 -62108 4984 90192 30874 -74419 -24530 95858 66447 -48234 -35934 58114 59755 -1182
764 -1182 -9777 10224 16362 31506 28560 -23118 -35844 33891 55880 -29703 -68528 12118 53824
777 53824 -21752 -66431 -10580 21422 -18078 -36284 -17508 -17562 -16260 3967 -10895 -45775 -21319
790 -21319 28097 5629 -43190 -16235 35111 12819 -24455 2560 29554 5914 -458 26587
802 26587 18413 -5694 19998 44330 8943 -13634 24429 39407 -1784 -10997 26957 22607 -16457
815a6457J2378L1271k9952l2115L5366K4204m2706k2502L8396J4623l2203r874
827b9571J9573j032o093J3630n919k5777K1088M2754k6982n3120L2986O2864k6660
840A7741n6881K3990N0687j0988l0403M964R223K403J9134j133m5306l949O9692
853D9174J4615q5350l0331Q5826L8121p9809m7513N8007M6607l4260m4454m23
865b9790K4362K5491k815n0746k8519O2139N6154o3942p9710N3594R2598l3836
877B4980r2456J1176Q1607J8940n0390l7183J6702N0257K6143m6658o1730L8126
889b0486R7417j3816j14140j1907J15044L9650r8244o0188O6837O8605k7796o5103
901b4127j5948M6204N1093k2535q2651j6272R4387N2453r2121q5485O9776R9633
$$ plain form
815 -16457 -4079 27192 -2760 -34875 491 24695 -18011 -40513 -2117 12506 -19697 -29571
827 -29571 -9998 -11030 -17123 -3493 -9412 -35189 -14101 28653 1671 -51449 -18463 44401 17741
840 17741 -39140 -15150 35537 24549 -5854 -890 8333 10736 29870 28737 -16569 -20518 49174
853 49174 63789 -21561 -51892 33934 72055 -7754 -55267 2740 49347 15087 -29367 -29790
865 -29790 -5428 20063 17248 -33498 -62017 122 56276 -7666 -87376 -33782 58816 24980
877 24980 -67476 -56300 25307 44247 -6143 -43326 -26624 23633 49776 3118 -58612 -20486
889 -20486 76931 63115 -51025 -62932 52112 91762 -6482 -66670 167 68772 40976 -24127
901 -24127 -40075 6129 57222 34687 -47964 -64236 30151 82604 -9517 -95002 -25226 74407
913G4407m0800j03575K532Q9856L3241o0150o1973K0771P9317K5000p9632o6381
925h7387O7037J00865l8087j14864Q662J16232K5578r4917n2185N9892O9787j1612
937D9001o6582l3744N1152P3849k4163j03205j0884J13557M7048j07659p9000
948i0630Q1783R5903m7254r9476K128Q0223L5836n1592o6374J1235Q1955L1468
960F5205q5269p3654P0059J02613m1495j14426Q854J09985K5430q5560n0601M8562
972b0297O6791n16o5884m3827N3748Q5159k4302j10547j0777J18955M5643j08129
984a3983p2512Q2110R0411m5713r2668K190P5096L5716m5415o6065O052Q0391
996C5610L3138p9863p0539O2915R5400l8815j06642O771J00645K6775p7403n3897
$$ plain form
913 74407 33607 -69968 -67436 22420 55661 -4489 -66462 -45691 33626 58626 -21006 -87387
925 -87387 -20350 80515 42428 -72436 -63774 52458 78036 -16881 -69066 -9174 60613 49001
937 49001 -17581 -51325 -173 73676 49513 -53692 -64576 48981 96029 -11630 -90630
948 -90630 -8847 87056 39802 -59674 -57546 22677 58513 6921 -59453 -48218 33737 65205
960 65205 -20064 -93718 -23659 78954 37459 -76967 -68113 41872 67302 -18258 -68859 -20297
972 -20297 46494 45978 -19906 -63733 -9985 75174 50872 -59675 -70452 48503 94146 -13983
984 -13983 -86495 -4385 86026 40313 -52355 -50165 24931 60647 15232 -50833 -44781 35610
996 35610 68748 -11115 -81654 -18739 76661 37846 -68796 -62025 38620 65395 -12008 -65905
1008f5905M1486O7570o59o7832l7839N7345P2539l5246r3937N938J01671K4550
1020F9681r2680m8955P0739O5592l7702o7553K111N7887L0145l7523n6249J0120
1032c4387P2064K0762p3779m8316O1797O6214m3245p4386J9544P0247N674n5771
1044a3582k8748L1954M3262m879m8473k3349M3910M6332l2054n9576J8016O3905
1056C6718k737n9687j1891M6800K3067k5555k5271J608K1005J8952j1927l5059
1068b3977k52M5359J3115m9870k4753M7117L1989l9847l3472K7040K8745j4373
1080F821j9160M696Q444L112L260q219j4022J0692K3194q462k6742P489K6518
1093A7621o975k2255P752J5887p711q666R138N87j0603N448J1914j0763j4820
$$ plain form
1008 -65905 -24419 43151 42492 -25340 -63179 -5834 66705 31459 -62478 -56540 45131 69681
1020 69681 -22999 -71954 -1215 64377 26675 -40878 -38767 19120 49265 11742 -44507 -34387
1032 -34387 37677 58439 -15340 -63656 -1859 64355 21110 -53276 -33732 36515 42189 -13582
1044 -13582 -42330 -10376 32886 28007 -20466 -43815 95 46427 14373 -45203 -27187 36718
1056 36718 33981 -25706 -37597 9203 32270 6715 -18556 -16948 4057 23009 11082 -23977
1068 -23977 -24229 21130 34245 -15625 -40378 6739 38728 -1119 -34591 -7551 21194 6821
1080 6821 -12339 -7643 801 3913 7173 -1046 -15068 -4376 18818 10356 -16386 -8897 17621
1093 17621 10646 -11609 -3857 12030 4319 -4347 4791 5378 -5225 223 12137 1374 -13446
1106a3446J2655J3018j3514r414J5146K158j8482L502J8206q731j8504J2924J9146
1119A4664j4441k1171J3186K1372r078j8639M700J2733K110k344o372p575J0365
1132d90J8633j1105k5975R297L1909o78l1808p284K7274J4097j8325j7935O231
1145f159J8625R280j6046k6617P524L8949J618m6295j5706M3769K5846l5016l5633
1158c5861K0190L7334o288l4670j1274K3243K7160m390l7941j7125M1993L6443
1170C8814l6098m9226K4709N7873m451n5538j4108M8647L2038k9996m1496O442
1182b2390M4641K2878l7552m6873K5529O4196r442p2541j1724O7564L2438n3397
1194C327m9745K9682N4326o976n0506k0348L2258M2289j0035n9314j8220O4469
$$ plain form
1106 -13446 -791 12227 -1287 -10701 4445 6603 -11879 -8377 9829 1098 -17406 -4482 14664
1119 14664 223 -20948 -7762 13610 4532 -14107 -9407 3326 5436 3092 -3280 -10855 -490
1132 -490 18143 7038 -18937 -9640 22269 21591 -10217 -17501 9773 23870 5545 -12390 -6159
1145 -6159 12466 21746 5700 -20917 -13393 25556 27174 -19121 -34827 8942 34788 -228 -35861
1158 -35861 -15671 21663 15375 -19295 -30569 -7326 19834 15444 -22497 -39622 2371 38814
1170 38814 2716 -46510 -21801 36072 31621 -23917 -38025 10622 42660 12664 -28832 -22390
1182 -22390 22251 45129 7577 -39296 -13767 50429 40987 -31554 -43278 24286 56724 3327
1194 3327 -46418 -16736 37590 30614 -19892 -40240 -7982 34307 24272 -35042 -53262 11207
1206A1207M2895n7821o4409L7830P6274j0507p6088j4566O7055L7516m6190n1059
1218d7863J7401N9123J8685n1890m7732M0311O9375j7775p5643p386P1503L4261
1230F2370n5445n4093L3956O3314o982o0101k4478M2255M9610j9788o8387q108
1242d5877P2361L0769o6507n5737M3695O8869j6797p4510j2338O5276L5419m5877
1254a254n1005J5476N8560J7494n5696m3735M6597O4664k2976o9159l716O5148
1266B0398L2970m6878n0433K8234O0042l00n4771k8174M1240N3903k1028p0535
1278c5332j356P2690K2865o2922m4128L8971N4653j5848o0306j0753N0417L0419
1290C9370l1904m8168J534N3776K5965n3735m9387M3820O2146k3030o5600k818
$$ plain form
1206 11207 54102 -3719 -68128 -30298 45976 35469 -40619 -55185 11870 49386 3196 -47863
1218 -47863 -30462 28661 47346 -4544 -52276 -11965 57410 39635 -36008 -43394 28109 62370
1230 62370 6925 -47168 -13212 50102 43120 -16981 -41459 796 50406 30618 -37769 -45877
1242 -45877 26484 57253 -9254 -64991 -21296 47573 30776 -43734 -56072 9204 44623 -1254
1254 -1254 -52259 -36783 21777 39271 -16425 -60160 -13563 51101 28125 -41034 -44750 20398
1266 20398 53368 6490 -43943 -15709 44333 44033 -10738 -38912 2328 56231 35203 -35332
1278 -35332 -36688 36002 58867 -4055 -48183 -9212 45441 29593 -30713 -41466 8951 39370
1290 39370 7466 -40702 -39168 14608 40573 -13162 -62549 -18729 43417 20387 -45213 -48031
1302d8031O0942K8533m6166m4395K7839N2648L89m4477k5362L3459N0173j6199
1314B9353o1964R48O5313J9405n2537l6225L3193M7742j2147n0388q120L9931
1326A4504K4006k2593l8845k712M4721K2061m8670m1610L7238N0049k2157n3279
1338c7287j303M8899J8478m3037l0928K8979L4944p507l1123j3579K5458L3269
1350B5263j5432l9877P113M1430Q360l1076j8345K2073L0490q973l2431j360K7746
1363A4981J3127j3586k2308J83K9124Q704l3527j5672K6550J8396j7965k2614
1375a4607M022K1107K442k1662r013J3033P122m402p891p342P945J4894j0162
1388d514j7366R508J3575l751p178K17O190M861l831k982M973J524Q9N116k239
$$ plain form
1302 -48031 12911 41444 -4722 -49117 -21278 31370 31759 -12718 -38080 -4621 45552 29353
1314 29353 -32611 -31663 33650 53055 518 -35707 -2514 45228 33081 -17307 -25427 14504
1326 14504 38510 15917 -22928 -25640 19081 41142 -7528 -49138 -11900 38149 15992 -37287
1338 -37287 -38590 10309 28787 -14250 -45178 -16199 18745 11238 -19885 -33464 -8006 25263
1350 25263 9831 -30046 -22933 18497 26857 -4219 -22564 -491 29999 21026 -11405 -12765 14981
1363 14981 28108 14522 -7786 -7603 21521 30225 -3302 -18974 7576 25972 8007 -14607
1375 -14607 -10585 10522 12964 -8698 -17711 -4678 2444 -1958 -9849 -17191 -9246 5648 -4514
1388 -4514 -21880 -12372 1203 -2548 -9726 -9509 -3319 1542 -2289 -5271 -298 1226 1315 6431 4192
1403D192m521Q440L936r417K597Q406o691n626Q610M560p240q121M582J1015p735
1418F987j7398P996J4817r639j1901L779J613P34K833q129r114R298J1094n784
1432b814j4937j357K0225R398k3688j2741K3738J6762j3685j4395L281J5626J2117
1445A7530j2783j9580J0216K6263J16k4025j1841K2076K4406j7626l1948J1109
1457f087L0592k544k4069j0938J1876K1130k396l0188j0264K6571J9278j7984
1469D977l1382K038L8075R324m1135k1185L4110K8224j8838l3358l32L6035K0008
1482B6561l1931l2076K2441M0119l868l8493j3325L5821L2426k5485m0271J2657
1494a5424M1750O817l2114k5599J9911M1562n022m9503j1294M5051K7391l4070
$$ plain form
1403 4192 -329 8111 12047 2630 5227 13633 6942 1316 9926 14486 7246 -875 3707 14722 6987
1418 6987 -10411 -2415 12402 2763 -9138 -5359 -3746 -3012 -179 -8308 -17422 -8124 2970 -2814
1432 -2814 -17751 -19108 1117 10515 -13173 -25914 -2176 14586 901 -13494 -10213 5413 17530
1445 17530 4747 -14833 -4617 21646 21762 -2263 -14104 7972 32378 14752 -17196 -6087
1457 -6087 24505 21961 -2108 -13046 -1170 19960 17564 -12624 -22888 3683 22961 4977
1469 4977 -26405 -24367 13708 23032 -18103 -39288 -5178 23046 4208 -29150 -29482 6553 26561
1482 26561 -5370 -37446 -15005 25114 21246 -17247 -30572 5249 37675 12190 -28081 -15424
1494 -15424 26326 33143 1029 -24570 -4659 36903 31881 -17622 -28916 16135 43526 9456
1506I456m3942J5255N1963J500n4583j9096M1475L0672k3865m1481r36M5238K1794
1519C3450m2227l9092K8579M8941p191n0950j5497M8633L5405l6650m5194K0021
1531b1772M8419M739m0146k7731K9853M7412j1905n4217o736N2182K7340l9861
1543G577m4885K3478N5446n503n6458j2815M4204K7354k5406m0788J962M4710
1555A8876J7686m2104l5707K6579M5626o642n2056j5921M9967L2978l9266m3952
1567d3936K1454M6662J215m2067k3219L4092M0437j8721m5697O44M4726K0165
1579C5755l3855l5874K1270M6478m447m4888j1679L4872K7206j8367l8358j03
1591b1990M2150J6716l7413l1133K3152L9545n858m4898j3082M1112K6182l1996
$$ plain form
1506 9456 -34486 -19231 32732 34232 -20351 -39447 2028 32700 8835 -32646 -33582 11656 33450
1519 33450 -8777 -47869 -19290 29651 22460 -28490 -43987 4646 40051 3401 -41793 -21772
1531 -21772 26647 31386 -8760 -36491 -6638 40774 28869 -25348 -32084 20098 47438 7577
1543 7577 -37308 -13830 41616 36113 -20345 -33160 11044 38398 12992 -27796 -25834 18876
1555 18876 36562 -5542 -41249 -14670 30956 24314 -27742 -43663 6304 39282 16 -43936
1567 -43936 -22482 24180 25395 -16672 -39891 -5799 34638 15917 -29780 -29136 15590 35755
1579 35755 1900 -33974 -12704 33774 29327 -15561 -27240 7632 34838 16471 -21887 -21990
1591 -21990 20160 36876 -537 -31670 -8518 31027 25169 -19729 -32811 8301 34483 2487
1603B487l5600J4293L7751M495l6275k2598K8331L4787j5841l8899N52L6234J6249
1616B5966k8056k8414J7614L5625l154l2353j1273K4596K5715j1207l4267k398
1628b1606L7533J5550l2518k5815K1330L3533p600l6682n761L3118J5460k4415
1640B127k1879R717K4407M449k3895j7895J8307K5754j0077k9548j668K8169J2676
1653B0644k3692k1108J6520K4529p481k2606l148J8111J2657r961j9619K793K2339
1666I978N191j9775j1476J4537J7500p206j9972J745J8935L201j4038o151O468
1679a063Q381L22r146n972P832Q983m809j0872m56J1135M028j1015o446Q985P203
1694G090p447o177M090M852j063l782l66L627J155l686j53L481j20l249n59L524
$$ plain form
1603 2487 -33113 -18820 18931 23426 -12849 -35447 -7116 27671 11830 -27069 -26517 9717 25966
1616 25966 -2090 -30504 -12890 22735 19581 -12772 -24045 551 26266 15059 -19208 -21606
1628 -21606 15927 31477 -1041 -26856 -5526 28007 20407 -16275 -22036 11082 26542 2127
1640 2127 -19752 -10035 14372 18821 -5074 -22969 -4662 21092 11015 -18533 -20201 7968 20644
1653 20644 -3048 -24156 -7636 16893 9412 -13194 -16342 1769 14426 4465 -15154 -12361 9978
1666 9978 15169 -4606 -16082 -1545 15955 8749 -11223 -9478 9457 12658 -1380 -7531 -1063
1679 -1063 7318 7640 -1506 -7478 354 9337 4528 -6344 -6800 4335 8363 -2652 -9098 -113 7090
1694 7090 -357 -6534 -2444 2408 1345 -2437 -2803 824 1979 -1707 -1860 1621 1501 -1748 -2307 1217
1710A217K685l828m633M226N877l861o547K141N813N15l859m220J888O441N52
1725D407p009m603O168R304l549j3033k96J5174M734j4083q931J0137J2814m149
1739G085j4725k404J5002R574j2762j5549O791J9436R51k0303r295J8878J5554
1752A8233j4205j9595N746J9785L393j6570j2267J0376J8076j370k1019r154J8742
1765A71J8862j3237k6186N049L0319M716k8938j4720K2124K2436j1188k6204K25
1778a6571K5735J1645j9604k1716J0365K8212J996k8995j4439K5887K5609j7349
1790A0775l1467M490L2526Q946k8582k1531J9856K9459p202l3188q583K9957K1913
1803B7369k2787l2439J0244L6879L519l5474j7924K7103K8529j5012l4132j19
$$ plain form
1710 1217 3902 74 -4559 -333 5544 1683 -4864 -2723 3090 3605 -254 -4474 -2586 3855 4407
1725 4407 -2602 -7205 -1037 8267 4718 -8315 -8611 6563 11297 -2786 -11717 -1580 11234 7085
1739 7085 -7640 -10044 4958 14532 1770 -13779 -6988 12448 13399 -6904 -16199 2679 18233
1752 18233 4028 -15567 -9821 9964 13357 -3213 -15480 -5104 12972 11602 -9417 -18571 171
1765 171 19033 5796 -20390 -15341 14978 19694 -9244 -23964 -1840 20596 9408 -16796 -16571
1778 -16571 9164 20809 1205 -20511 -10146 18066 20062 -8933 -23372 2515 28124 10775
1790 10775 -20692 -16202 16324 25270 -3312 -24843 -4987 24472 17270 -15918 -24501 5456 27369
1803 27369 4582 -27857 -17613 19266 22785 -12689 -30613 -3510 25019 10007 -24125 -24244
1815b4244L4367J5704k6973k7641J5665L5287L4l6697j4198L2173K8534k0546
1827A1465l6803O199L9683J0299l5186k5041K5763L5863j1590m0529m358L8368
1839A4133J8732l0979l1448J7627L6514j536l6701j4620K8023K6546j6694l4374
1851b4777M40L5163J5830l0444k9221J8922L7871m707l9982j0816L6056K4257
1863B8592k4981l2429J2006L6316M573l2913j8344K5024L0603j1480l4899k253
1875b0185L4584J6054k7739k6721J7659L2406m159l2737j0011K6219K0558j5857
1887A0071k8684J714K8776J0770k5462k3299J6255K9879n532l3462p798K9922
1899C150J8288k1570k5712J0238K7740K276k4341j3005J8256K1790p272k4618
$$ plain form
1815 -24244 10123 25827 -1146 -28787 -13122 22165 22199 -14498 -28696 3477 32011 11465
1827 11465 -25338 -19139 20544 30843 -4343 -29384 -3621 32242 20652 -19877 -24235 14133
1839 14133 32865 1886 -29562 -11935 24579 23043 -13658 -28278 -255 26291 9597 -24777
1851 -24777 -24337 10826 26656 -3788 -33009 -14087 23784 19077 -20905 -31721 4335 28592
1863 28592 3611 -28818 -16812 19504 24077 -8836 -27180 -2156 28447 16967 -17932 -20185
1875 -20185 14399 30453 2714 -24007 -6348 26058 21899 -10838 -20849 5370 25928 10071
1887 10071 -18613 -16899 11877 22647 -2815 -26114 -9859 20020 14488 -18974 -26772 3150
1899 3150 21438 -132 -25844 -15606 12134 14410 -9931 -22936 -4680 17110 9838 -14780
1911a4780k892K4506J4852j8053k1815J0417K6108J051k5015j0160K0738J8508
1923B3465j2520k3203J946K3226P564j9610j5798J1851J9501m370k2134n229J7895
1936B584J2163j2636j8078L535J8728M724j7240j3043J0904J7617m002j8542l496
1949a6782J7745J0673j3006j4993P310J8247J361j5938o926J3467J3083p324j4739
1962g822J950J5863M703j3119q257R192J1157m374j1444p31Q496L941n613p318
1976c376N97O983K554p815p814M436R234k267j0825j580R346K944q130m553N825
1991d441M773l709m143K509L831K43j212m55J027J490Q77Q2M74J435K98p93P13
2008B999K116p91k505J512L510n74m581q43M710J683m989m320J988M110m07n363
$$ plain form
1911 -14780 -17672 6834 21686 3633 -18182 -7765 18343 19394 -5621 -15781 4957 23465
1923 23465 10945 -12258 -10312 12914 20478 868 -14930 -3079 16422 12052 -10082 -15311 2584
1936 2584 14747 2111 -15967 -12432 6296 11020 -6220 -19263 -8359 9258 5256 -13286 -16782
1949 -16782 963 11636 -1370 -16363 -9053 9194 10555 -5383 -12309 1158 14241 6917 -7822
1962 -7822 -5872 9991 14694 1575 -6682 2510 13667 9293 -2151 -2882 5614 9555 3942 -3376
1976 -3376 -2779 4204 6758 -1057 -8871 -4435 4799 2532 -8293 -9873 -527 2417 -5713 -10266 -4441
1991 -4441 332 -3377 -7520 -5011 -1180 -937 -2149 -2604 -1577 -87 790 872 1346 2781 3079 2286 2999
2008 2999 5115 4324 1819 3331 6841 6267 1686 843 5553 7236 2247 -2073 -85 4025 3618 -1745
2024a745l486L764N152k959r005j235R666M566r048r070O592J1074k550j2793
2038a1077j145J2669O413r005r776N646J3675J197j2669o158J0917J2021m494
2051H214j3855l71J5364P415j2821j3570Q210J7649j434j8928o813J6865J2789
2064A8714j3346j8853N221J9541J475j9599j0021J3832J5819p736j9805k286J7953
2077I09J0386j3928j7191P240K2120K084k2662j0803J9391J9178j0377k2705J678
2090a4680K4156R755j9512j7017J3035K3698k658k5543p462K4604J8029j7985
2102H420k5073P993K7044K314k5863j2440J9287J9993j0899k4857j930K2893J1891
2115A8773j8336k2674Q744K7429K205k8505j4227K3275K3374j5026k9566L203
$$ plain form
2024 -1745 -5231 -1467 3685 726 -8279 -9514 152 4718 -4330 -13400 -6808 4266 1716 -11077
2038 -11077 -12222 447 6860 -2145 -11921 -6275 7400 8597 -4072 -10230 687 12708 8214
2051 8214 -5641 -6012 9352 16767 3946 -9624 -1414 16235 14801 -4127 -10940 5925 18714
2064 18714 5368 -13485 -8264 11277 12752 -6847 -16868 -3036 12783 5047 -14758 -17044 909
2077 909 11295 -2633 -19824 -12584 9536 11620 -11042 -21845 -2454 16724 6347 -16358 -14680
2090 -14680 9476 19231 -281 -17298 -4263 19435 16777 -8766 -16228 8376 26405 8420
2102 8420 -16653 -8660 18384 20698 -5165 -17605 1682 21675 10776 -14081 -16011 6882 18773
2115 18773 437 -22237 -13493 13936 16141 -12364 -26591 -3316 20058 5032 -24534 -21331
2127b1331L1863R273k6663j9321J8484K7145o248k8384n912K7841J8469j9499
2139E717k5670R419L0375L918k8891j5688K2493K4901j1849k9060m68K8308J1547
2152B5052k4389k2743J4573K8766l269l0844j0246K5468J9716j7692k8216N983
2164a7841K9813O082k7202j7404J9928K5051q881k8848l040K7530J4447j9646
2176a1k2226J1366K6942J098k6050j1924K1468K2522j1688k6828J340K7788R912
2189B3709k3813j8666J6330K4134p107k6037k815K3036J1900j7110j9624O753
2201i310K0892K827j9667j1719J3297J8116o681k2438l032K1585J1583j7292j8148
2214a9987R939K1006o07k0452p269J6828J4129r946j6854K385J9075O416j5568
$$ plain form
2127 -21331 10532 19805 -6858 -26179 -7695 19450 13202 -15182 -21094 6747 25216 5717
2139 5717 -19953 -10534 19841 23759 -5132 -20820 1673 26574 14725 -14335 -14803 13505 25052
2152 25052 663 -22080 -7507 21259 17990 -12854 -23100 2368 22084 4392 -23824 -17841
2164 -17841 11972 18054 -9148 -26552 -6624 18427 9546 -19302 -22342 5188 19635 -11
2176 -11 -22237 -10871 16071 17169 -8881 -20805 663 23185 11497 -15331 -13991 13797 23709
2189 23709 -104 -18770 -2440 21694 14587 -11450 -14265 8771 20671 3561 -16063 -9310
2201 -9310 11582 14409 -5258 -16977 -3680 14436 7755 -14683 -17715 3870 15453 -1839 -19987
2214 -19987 -10048 10958 10351 -10101 -17370 -542 13587 3641 -13213 -10828 8247 14663 -905
2227i05j2282J0594J6329l494j6634k621J5347Q606j0882j2744M508J3753K148
2240A1723j2240q408P579J1822k278j4498l575J2314Q205j0460j2327N090J4541
2253G488l02j4044n121J0618Q571o328j0250J948J0181K880p794o089N037Q492
2267E287q95p929l048P206O680l685p831R45Q029K251o977m735N109O425k350
2282D482o597l09N228K315m603k785J677L282m77l354j412K404K036j579k807
2297b499m28K313Q81j432n25N05l1n56K51J237o12q31Q84J846p78j619j8K268
2315H56J493j322k591L94L873J981l766m546L266O499j979q251k42R225K680q710
2331a140n847O077P548l074q262o92P459L974n525p203K087Q546K588q748p550
$$ plain form
2227 -905 -13187 -2593 13736 10242 -6392 -9013 6334 14940 4058 -8686 -4178 9575 11723
2240 11723 -517 -8925 -1346 10476 8198 -6300 -9875 2439 10644 184 -12143 -7053 7488
2253 7488 7186 -6858 -11979 -1361 7210 882 -9368 -7420 2761 5641 -2153 -8242 -3205 5287
2267 5287 4392 -3537 -6585 621 7301 3616 -4215 -3270 4759 7010 33 -4702 407 6832 4482
2282 4482 -2115 -2424 2804 5119 516 -2269 -592 2690 2213 -1141 -2553 -149 1887 308 -2499
2297 -2499 -2927 -614 267 -1165 -1690 -1185 -1216 -1772 -1521 -284 -896 -1727 -843 1003 225 -1394 -1412 856
2315 856 2349 1027 -1564 -1170 2703 4684 918 -3628 -362 6137 4158 -4093 -4335 4890 7570 -1140
2331 -1140 -6987 -910 6638 3564 -4698 -5390 2069 6043 518 -6685 -4598 3948 6536 -2212 -9762
2346i762P041J1297l031j2840k300J3063P001j0941j1065P075J4291r96j4781
2359e948n984J3075J1125q277j4727K219J6826L582j5086r951J1217J4778n273
2372G576j7220j400J5936Q477j1955j3827O111J6365J218j6979q050J3245J5037
2385A4534p427j9225k14J9458Q565j6561j5639J0771K0301l000k1724n019J8896
2398C716J3153j3706j8626N552K0702L806j8851j1939J3656J7494n656k1037l299
2411a5035K0338J2121j5679j9793Q410K2917J035k3013r728J8920J7060j1213
2423F340k1745K592K2515O983j8867j5084J2043K0912k506k2664o889K0197J5808
2436A9635j4278k1739N273K4449M842k2835j3846J6373K0287p750k3549l048K2339
$$ plain form
2346 -9762 -2721 8576 5545 -7295 -9595 3468 10469 -472 -11537 -4462 9829 8833 -5948
2359 -5948 -11932 1143 12268 3991 -10736 -8517 8309 11891 -3195 -13146 -1929 12849 7576
2372 7576 -9644 -11044 4892 13369 1414 -12413 -6302 10063 11281 -5698 -13748 -503 14534
2385 14534 7107 -12118 -12332 7126 15691 -870 -16509 -5738 14563 11563 -10161 -15180 3716
2398 3716 16869 3163 -15463 -9911 10791 14597 -4254 -16193 -2537 14957 9301 -11736 -15035
2411 -15035 5303 17424 1745 -18048 -9638 13279 14314 -8699 -18427 493 17553 6340
2423 6340 -15405 -12813 9702 16685 -2182 -17266 -5223 15689 13183 -9481 -16370 3827 19635
2436 19635 5357 -16382 -11109 13340 18182 -4653 -18499 -2126 18161 10411 -13138 -16186 6153
2449F153J2739j7696k0624R659K4533k16k5000j0126K0758J8135j3404k2582M282
2462a3389K3488N358j9942j3434J3081K0090m180k1473n288J9707J4615j3679
2474D954k0791N240K3890M197k2145j2693J7678J9237j0005k2891M74K2853P955
2487A7953j8571j5898J1688J9214k785k0838n886J6977J3400j1887j8372L903
2499a1102J9238M259j6913j1890J1496J6299n290j7681k104J7194Q937j2087j4353
2512a3997O331J7456R53j6248o721J3004J2655p016j5081J279J5750N074j3469
2525c0r391Q600J2317k977j2577l080J0372P380p553j0737J872J0982K999r743
2539a566q562O263J0870k800j1910j958J0572N112p668q011M408R127p48q100
$$ plain form
2449 6153 18892 1196 -19428 -9769 14764 14548 -10452 -20578 180 18315 4911 -17671 -13389
2462 -13389 10099 15457 -4485 -17919 -4838 15252 11072 -10401 -15689 4018 18633 4954
2474 4954 -15837 -10597 13293 17490 -4655 -17348 330 19567 9562 -13329 -12855 9998 17953
2487 17953 -618 -16516 -4828 14386 11601 -9237 -15123 1854 15254 3367 -15005 -11102
2499 -11102 8136 12395 -4518 -16408 -4912 11387 6097 -11584 -13688 3506 12443 356 -13997
2512 -13997 -7666 9790 10743 -5505 -12226 778 13433 6417 -8664 -7385 8365 13439 -30
2525 -30 -9421 -821 11496 8519 -4058 -7138 3234 10614 3061 -7676 -5804 5178 8177 -1566
2539 -1566 -10128 -3865 7005 4205 -7705 -9663 909 6021 -1647 -9658 -5250 3877 3129 -4971
2553d971k155N707N412j576o197j200O686M125m346n469K433O674J343o320l589
2568c443N599M974l370n197R84M351J381l496l773K041L633j089l415j642K073
2583c89K322j417l329j60K311j20j788N2o83M18J351j59k086M44J554J257p36
2600a158j620Q35K528O05j829M09J120N45N40M13j118p6J755J428n61l349n02
2617c5M898J409n730l266M774L876l170n939j34O039J708o735m132M411M646j703
2633I17n670k867N306N932m413p704J983Q006K537o954o338N781J0073k477j0356
2648f244n28R920N379o223q738L060J2042J400j1981n053R919R546n320j3096
2662e917J46J4149M355j3038r011Q346J1053k641j3101m968J1941R826r534j3466
$$ plain form
2553 -4971 -7126 -1419 3993 2417 -3780 -4980 1706 5831 1485 -3984 -1551 5123 6466 146 -3443
2568 -3443 2156 7130 3760 -1437 -453 3898 5279 1783 -1990 51 3684 2595 -820 -2462 -389
2583 -389 1933 516 -2813 -2973 -662 -782 -2570 -2518 -3201 -2783 -1432 -1591 -3677 -3233 -1679 -422 -1158
2600 -1158 -2778 -1943 585 1190 -639 -230 890 1435 1975 2388 1270 1194 2949 4377 3816 467 -35
2617 -35 4863 6272 542 -2724 2050 5926 2756 -3183 -3317 2722 4430 -2305 -6437 -2026 2620 917
2633 917 -4753 -7620 -2314 3618 -795 -8499 -6516 1490 4027 -2927 -9265 -3484 6589 4112 -6244
2648 -6244 -6772 3148 8527 2304 -6434 -3374 8668 10068 -1913 -6966 2953 12499 7179 -5917
2662 -5917 -5771 8378 12733 -305 -9316 -970 10083 7442 -5659 -10627 1314 11140 1606 -11860
2676a1860K546J4437L637j3784j1130J0916J6031o567j7567N73J5973P663j2462
2689a594j3092Q041J6914j487j5627m600J3698J1062o618j4983L2J7835O503j5631
2703D53j1605J0027J6163k189j9160n458J7707J1466j3822j6462N648J7735K252
2716A2755j7688j1199J3740J6191q867j8954J93J7652Q096j4004j5550Q795J9037
2729A0197j944j8309n264J4405J3498p985j8073K065J9806O062j6306j2121J0625
2742c344J7931k289j9915n426J9884J2289j4837j6753O921J9101J957j9384j0166
2755a4031J6111J4516r969j7603M68J6479P796j3654j6198Q046J9109j527j9395
2768i852o811J5089J4607j0092j9610L743K0782L377j7402j0114J2230J6209m437
$$ plain form
2676 -11860 -9314 5123 8760 -5024 -16154 -5238 10793 4226 -13341 -12768 3205 10868 -1594
2689 -1594 -14686 -6645 10269 8782 -6845 -11445 2253 13315 6697 -8286 -8254 9581 16084 453
2703 453 -11152 -1125 15038 12849 -6311 -11769 5938 17404 3582 -12880 -7232 10503 12755
2716 12755 -4933 -16132 -2392 13799 4932 -14022 -13829 3823 11919 -2085 -17635 -8840 10197
2729 10197 8253 -10056 -15320 -915 12583 4598 -13475 -11410 8396 14458 -1848 -13969 -3344
2742 -3344 14587 12298 -7617 -13043 6841 19130 4293 -12460 -5539 13562 15519 -3865 -14031
2755 -14031 2080 16596 6627 -10976 -10508 5971 13767 113 -16085 -8039 11070 9543 -9852
2768 -9852 -16663 -1574 13033 2941 -16669 -12926 7856 11233 -6169 -16283 -4053 12156 7719
2781G719j8245k155J8281Q915j2844j3327O710J6816J827j7451q355J5578J2910
2794A6379r677j5327J600J5636N847j4511j2224R918J4519l673j5801l951J2545
2807A280J0637j0256j5564N193J6056J41j4272o371J0565J1154n520j4115J089
2820i983J3588L901r550p396M664J1054J103j1493m601J0660P854o001r757J342
2834d615J1138L975j0702p145Q916Q185m675q541k54P547M146o733o909M094O562
2849D989j448n571k983L379N605k162p305K57N786J654m075l525Q89N853O84n779
2865c752j293M047K676j510k986k20M216K306l378k663L531K524j262j727k96
2880B13J694J366j740m97J352r14k13Q69q64j834J191J237o02j695j014N88J783
$$ plain form
2781 7719 -10526 -12681 5600 14515 1671 -11656 -4946 11870 13697 -3754 -12109 3469 16379
2794 16379 6702 -8625 -7025 8611 14458 -53 -12277 -2359 12160 8487 -7314 -11265 1280
2807 1280 11917 1661 -13903 -8710 7346 7487 -6785 -13156 -2591 8563 3043 -11072 -9983
2820 -9983 3605 7506 -2044 -9440 -4776 6278 7381 -4112 -8713 1947 9801 3800 -5957 -4615
2834 -4615 6523 10498 -204 -7349 1567 9752 5077 -3464 -3718 3829 7975 1242 -5667 -1573 4989
2849 4989 3541 -2030 -5013 -1634 3971 1809 -5496 -5239 547 2201 -1874 -5399 -4510 1343 2027 -3752
2865 -3752 -5045 -998 1678 168 -2818 -3038 1178 3484 106 -2557 974 3498 2236 509 213
2880 213 1907 3273 1533 1036 2388 1474 1261 2130 1266 -568 623 1860 1258 -437 -1451 -863 920
2897I20j314k216J332Q43r10M92j31k151J467K441j612k278M05K244K587k321
2913b02l523K059M302j114m013M44L213K594j139m956M31N380J211m364k731J819
2929e89M994L38o369k199O197L151m610n176J155O034K474o345n804N375O402
2944E028k356p608j861P235N840o238q750L846J0110o81q692l719P206P443l744
2959C059r537J047R441L141p303o651L441J0321Q87j1065m788R715Q465o713j1164
2974g704J539J3095L263j2664q246J0358J0910n493j2600r66J1722O494r654j0584
2988a0530N841J2066j64j1889o234J0033J1074o098j3591J072J4228M512j1617
3001a297j0039P178J3614j439j5017l788J3417Q807q354j3311K714J5352K867
$$ plain form
2897 920 -394 -2610 -1278 -435 -1345 -853 -984 -3135 -1668 773 -839 -3117 -2712 -468 2119 -202
2913 -202 -3725 -1666 2636 1522 -2491 -2047 1166 3760 2621 -2335 -1904 3476 4687 323 -2408 -589
2929 -589 4405 4743 -1626 -3825 2372 5523 913 -4263 -3108 2926 5400 -945 -6749 -1374 5028
2944 5028 2672 -4936 -6797 438 6278 40 -8710 -4864 5246 4565 -4127 -7846 -640 6803 3059
2959 3059 -6478 -5431 4010 7151 -152 -6803 -3362 6959 7846 -3219 -8007 1708 10173 3460 -7704
2974 -7704 -6165 6930 10193 -2471 -10717 -359 10551 5058 -7542 -8508 3214 9708 54 -10530
2988 -10530 -4689 7377 7213 -4676 -10910 -877 10197 4099 -9492 -8420 5808 10320 -1297
3001 -1297 -11336 -4158 9456 8017 -7000 -10788 2629 11436 3082 -10229 -7515 7837 10704
3014A0704j4409q214J1707J1978n698j4884n60J4410O813j1814j1297O826J3511
3027I073m94j3116o448J0553J2235p300j4626R43J5410N733j3101j1643Q507J5478
3041A1204l362j5826k962J4263Q684j0275j2429M077J4705K096j3949p782J0173
3054a383J2092m154j4755k075J4338P496j1563j1808O582J4654k95j4698o158
3067a1727J2044J1090p843j3812K268J4465M081j2132r932Q302J3824l163j4583
3080g118k484J2662Q691r321j2090M020J3943J048j3018o892J0004J0904m798
3093E551j2878j601J2700O717j0699j1000O158J3384j209j3455m110J1802Q755
3106A0115q793j1169L979J1563J469j0242n676P322R151l636j0050q69R224N950
$$ plain form
3014 10704 -3705 -11919 -212 11766 6068 -8816 -9376 5034 11847 33 -11264 -4438 9073
3027 9073 8579 -4537 -10985 -432 11803 4503 -10123 -9180 6230 11963 -1138 -12781 -4274 11204
3041 11204 7842 -7984 -10946 3317 12001 1726 -10703 -6626 8079 10175 -3774 -11556 -1383
3054 -1383 10709 6555 -8200 -10275 4063 11559 -4 -11812 -5230 9424 9129 -5569 -11727
3067 -11727 317 11407 3564 -10248 -7980 6485 10566 -1566 -11498 -3196 10628 7465 -7118
3080 -7118 -9602 3060 11751 2430 -9660 -5640 8303 9351 -3667 -10559 -555 10349 5551
3093 5551 -7327 -8928 3772 10489 -210 -11210 -5052 8332 7123 -6332 -10442 1360 10115
3106 10115 1322 -9847 -5868 5695 7164 -3078 -8754 -1432 7719 4083 -5967 -6836 2388 8338
3120H338o695q806L186J0402P90j0037m580Q400P339m577r601J155R766K650q552
3135h22n749N497O830j664p652j675P116L695n726n708K549O624J66o561j984
3150e064M131M303k687m868K72M782J529k978l204J662M903m92l678j548L348
3165D11L123j821l439J322L409k23k692p51K068J191j004j286J46L16J22j21k3
3182G48r12m88P15K86j109l89P79O0n42o97J47m89N70J023k75j521l88K057J128
3201G03j826j882K272K653q34l204L08L581J395k700k469K103L124L50l587j603
3217a616L405K840k226m300L15M791J713m344l722K577M028n40m838k306M029
3232a94L823k912n831N65N787K583o074n208M075P323j658p865q37P598L957n856
$$ plain form
3120 8338 1643 -7163 -3977 6425 7215 -2822 -7402 998 8337 3760 -5841 -4686 5080 7730 -822
3135 -822 -6571 -1074 5756 4092 -3560 -5235 1881 5576 -150 -5858 -3309 3315 3481 -3080 -5064
3150 -5064 -933 3370 683 -4185 -3913 869 2398 -580 -3784 -2122 2781 2289 -1389 -2937 411
3165 411 3534 1713 -1726 -404 3005 2782 90 -661 1407 2598 1594 308 454 770 892 771 748
3182 748 -164 -652 63 349 -760 -1149 -370 -310 -852 -1549 -1402 -1891 -1321 -298 -573 -2094 -2482 -425 703
3201 703 -1123 -3005 -733 1920 1086 -2118 -1810 1771 3166 466 -2003 100 3224 3574 -13 -1616
3217 -1616 1789 4629 2403 -1897 -1582 3209 4922 578 -3144 -567 3461 2921 -1917 -4223 -194
3232 -194 3629 717 -5114 -4549 1238 3821 -2253 -7461 -3386 3937 2279 -5586 -6423 1175 5132 -724
3248g24o352M087P674J08o907l169N824O389k662p565p04P848M561o227p878M047
3264a650R326K04j0317m404Q599P335n808r896J604J0152K017r735o722O450R456
3279F611k748j0908k061J0257O170p818r674L796J1450P50j0930m806Q976R468
3293H533m672j1557J44J2024N139r211q907N840J2217r71j2566m271J1412R294
3307A2448q447j1995L271J3298K333j2787p301Q677J0515m360j2428j706J1478
3320B996O912r712j0758L429J3028J280j3029o620J0786J0569o470j3453J486
3333i556J4032M123j1807q697Q597J1960k420j2163k624J1288P602p554j0428
3346g647L193J2686K318j1159p850Q796J1060m128j2937j447J2207O262r919j0789
$$ plain form
3248 -724 -7076 -2989 4685 4793 -2114 -5283 541 6930 4268 -3297 -4001 3847 8408 2181 -5697 -1650
3264 -1650 7676 7880 -2437 -6841 1758 9093 3285 -6611 -5007 5145 7162 -2573 -9295 -2845 6611
3279 6611 3863 -7045 -9106 1151 7321 -497 -10171 -6375 5075 5825 -5105 -9911 -935 8533
3293 8533 3861 -7696 -7552 4472 9611 400 -8507 -2667 9550 8579 -3987 -8258 3154 12448
3307 12448 4001 -7994 -4723 8575 10908 -1879 -9180 -503 10012 5652 -6776 -8482 2996
3320 2996 9908 196 -10562 -7133 5895 7175 -5854 -12474 -1688 8881 2411 -11042 -9556
3333 -9556 4476 8599 -3208 -11905 -3308 8652 6232 -5931 -8555 2733 10335 2781 -7647
3346 -7647 -4454 8232 10550 -609 -8459 337 11397 7269 -5668 -7115 5092 11354 1435 -9354
3360i354N293J2162l1j2901n836J0183R477o204j2269R69J2431L435j1049p904
3374a1598P590J0994k946j0866k356J0022O524o370r420K835J0953K516r443o342
3388g907P416J0135l049j1997j134J1797N767r135q899N132J0875j287j1039l451
3402f776R159O739n854r777J433R308K912r033o925N927Q527k279r530j917Q256
3417A70N681o642p897K865R535L50p642l792O395O363l174p379M06Q092L260o445
3433A46n367M414P383j280p350j268O257L604m256n282J980N673M18n411l240
3448c579L690M127j805n224p15M447K359l996m258K629M095j308m052o08L969
3463b29J405k487k171J702K082o22j161j5J007J083j11q21k51R04J233m54j019
$$ plain form
3360 -9354 -4061 8101 8070 -4831 -10667 -484 8993 2789 -9480 -8511 3920 7355 -3694 -11598
3374 -11598 -4008 6986 4040 -6826 -9182 840 7364 994 -8426 -5591 5362 7878 -1565 -7907
3388 -7907 -491 9644 6595 -5402 -6536 5261 11028 1893 -7006 -1874 9001 7714 -3325 -6776
3402 -6776 2383 9122 3268 -6509 -5076 4232 7144 -1889 -8814 -2887 5640 3361 -6169 -8086 170
3417 170 5851 -791 -8688 -5823 3712 4062 -3580 -7372 -977 5386 2212 -5167 -4761 3331 6591 146
3433 146 -5221 -807 6576 5296 -2054 -3322 2935 6539 2283 -2999 -1019 4654 5072 -339 -3579
3448 -3579 111 4238 2433 -2791 -3506 941 3300 -696 -4954 -2325 1770 462 -3590 -4198 -229
3463 -229 1176 -1311 -3482 -1780 302 -320 -1481 -1496 -489 594 483 -338 -589 315 1548 1094 75
3480G5M97J367j22r50L05P25j98o84J50N68p02o51K28J038l88j821o92J513J005
3499A263j827j891P90K348j45l010r45K439K281k286l119J306L817O20m022j276
3515c657L237L002j798l176N74L684J932k846l427K022L931N94m129k580L857
3530A220M157k483n841O63O180J431n970l976L992N748k226o667n72N644K923
3545D223m486m828J340O467J048o444l903M860N974k098p196r30P638L836o078
3560e77o184L945P505l23p224l195O680O239l975p911R10Q448K725p088o111N015
3576a121Q378j673r277k101Q185N514o142p928K023R068J424q534n512O374Q076
3591F754l109r851j536R891N483q247q630M872J0762r37j0377l334R039O998n803
$$ plain form
3480 75 572 1939 1817 867 1172 1897 1699 1015 1165 1733 1031 380 608 1646 1258 -563 -1255 258 1263
3499 1263 -564 -2455 -1665 683 538 -2472 -3417 -978 1303 -983 -4102 -2796 1021 1641 -2381 -3657
3515 -3657 -420 2582 784 -2392 -1818 1866 3798 952 -2475 -453 3478 4072 -57 -2637 1220
3530 1220 5377 2894 -2947 -2284 3896 5327 -643 -4619 -627 5121 2895 -3772 -4344 1300 4223
3545 4223 -263 -5091 -3751 2716 3764 -2680 -6583 -1723 4251 2153 -5043 -5973 1665 5501 -577
3560 -577 -6761 -2816 4689 4366 -2858 -6053 627 6866 2891 -5020 -4110 4338 7063 -25 -6136 -1121
3576 -1121 7257 5584 -3693 -5794 2391 7905 1763 -6165 -4142 4926 6350 -2184 -7696 -1322 6754
3591 6754 3645 -6206 -7742 2149 7632 -615 -9245 -4373 6389 5452 -4925 -8259 780 7778 1975
3606A975q900J783R719K731q341o674N944R119j171j0401l062R660O969o910j0066
3621g625K890J1692J293j1221n869Q674R093m889j0989K96J0873M302r380q071
3635h931N582J0479j133j1176l664R550P557o246r868K304J0237K347r145o364
3649h471O353R259j994j0388k125R503O226o731r327L107J0796J127j0549m917
3663h131Q464Q229m671j0476J039J0031L376q560o633N183Q570j201q791l315
3677f886P455O682m595r619J544R602K581q663n983O075Q623k878r415n10Q438
3692B451M477o210o879K813Q003P20p732l892N855O630l229q168j19P928L880
3707F528o829n950L908P780q35p961k501O959M842m372p066J512P802J471o720
$$ plain form
3606 1975 -6925 -5142 4577 7308 -1033 -7707 -1763 7356 6185 -4216 -7278 2382 9351 2441 -7625
3621 -7625 -4735 6957 8250 -2971 -8840 -166 8927 4038 -6951 -6655 4218 8520 -860 -8931
3635 -8931 -3349 7130 5997 -5179 -8843 707 8264 2018 -7850 -5546 4691 7038 -2107 -8471
3649 -8471 -2118 7141 5147 -5241 -7366 2137 8363 1632 -7695 -4588 6208 7335 -3214 -8131
3663 -8131 333 8562 3891 -6585 -5546 4485 7861 -699 -7332 -2149 6421 5220 -3571 -6886
3677 -6886 569 7251 2656 -6963 -5419 4183 6764 -1899 -7882 -1807 6816 3938 -5477 -5987 2451
3692 2451 6928 718 -6161 -3348 4655 5375 -2357 -6249 -394 6236 3007 -5161 -5280 2648 6528
3707 6528 -301 -6251 -2343 5437 4602 -3359 -5860 1099 5941 1569 -5497 -3985 3817 5288 -1432
3722a432m316N118O090k323p080j16O558K546n134m311K787N483l04n389j927
3737c750L822L971k263m825l21M999K197l953m348K957N057j032n471p71M876
3752A145K602l693l721K264L718l73l854n67K936J683j600k496N30K700M43k010
3768b93j034J126J946n14j956j18J825N88j285o62N22J023m48o92j08N50rp01
3786b40r3N02J94p87k23L98N04o95j127R17J630p32k351J37K497P11k662j073
3804b493K380J997j568k453O96K930N63k247j676J505K931l65k860j340L062L039
3820D101k450m233R71M730R07m909k477L931L851k720n156O62M742J454m246l822
3836d664K819M864p19n338j649M503L913l114n831J209O259J684n820l527M314
$$ plain form
3722 -1432 -5748 -630 5460 3137 -3943 -4059 2499 5045 -89 -4400 -1613 3870 3566 -1823 -3750
3737 -3750 72 4043 1780 -3045 -3366 1633 3830 -123 -4471 -1514 3543 2511 -2960 -3731 1145
3752 1145 3747 54 -3667 -1403 2315 1942 -1912 -2479 457 2140 540 -1956 -1426 1274 1717 -293
3768 -293 -1327 -201 1745 1231 -725 -843 982 1570 285 -377 145 1168 720 28 -80 470 461 -240
3786 -240 -333 169 363 -424 -647 -249 255 -440 -1567 -650 980 248 -2103 -1966 531 1242 -1420 -2493
3804 -2493 -113 1884 316 -2137 -1441 1489 2052 -195 -1871 -366 2565 2200 -660 -2000 1062 4101
3820 4101 1651 -2582 -1611 3119 4026 -883 -3360 571 4422 1702 -3454 -2792 1950 3404 -842 -4664
3836 -4664 -1845 3019 2300 -3038 -4687 -184 3729 615 -5216 -4007 2252 3936 -1884 -5411 -1097
3851a097N440j600o311j025P082L529n080n791K543P238M03o892l531O155N999
3866G062l927p131J040P049K253o763n033M191O339j039o987k573N998M909l988
3881A400p467R14Q096K376p641n679N701P817k357r588o78R314M619p428o907
3896g508M538Q425J37q807l313P454O528m056q038M69Q545L621p576o574N318
3911h37Q743j868r394k751Q449N706n909q870K371R099J386q291n739O295Q354
3926F744l458j0396l55R656M298p744p286M585R096l90r519l001Q029O341n010
$$ plain form
3851 -1097 4343 2743 -3568 -4593 2489 6018 938 -4853 -2310 4928 5331 -1561 -5092 1063 7062
3866 7062 3135 -3996 -2956 4093 6346 -417 -5450 -1259 5080 4041 -2946 -5519 479 5388 1400
3881 1400 -6067 -5153 2943 5319 -2322 -8001 -2300 5517 3160 -6428 -7106 2208 6827 -601 -7508
3896 -7508 -2970 5455 5592 -3215 -6528 926 7454 3398 -4640 -4171 4374 7995 419 -6155 -837
3911 -837 7906 6038 -3356 -6107 2342 8048 2139 -6731 -4360 4739 6125 -2166 -7905 -1610 6744
3926 6744 3286 -7110 -7465 2191 6489 -1255 -8541 -3956 5140 4750 -4769 -7770 259 6600 1590
$$ [...]
##END NTUPLES=NMR FID
##END=
