##TITLE=1H_LY-805.60
 CCl4, 8 sc, 
 1.4.2019
##JCAMPDX= 6.0         $$ Bruker NMR JCAMP-DX V2.0
##DATA TYPE= NMR FID
##DATA CLASS= NTUPLES
##ORIGIN= UXNMR, Bruker Analytische Messtechnik GmbH
##OWNER= root
$$ XWIN-NMR		Version 3.5
$$ Mon Apr  1 15:55:05 2019 Russian Standard Time (UT+4h)  she@DPX200
##.OBSERVE FREQUENCY= 200.1316
##.OBSERVE NUCLEUS= ^1H
##.DELAY= (6, 6)
##.ACQUISITION MODE= SIMULTANEOUS
##.ACQUISITION SCHEME= undefined
##.AVERAGES= 8
##.DIGITISER RES= 18
##SPECTROMETER/DATA SYSTEM= spect
##.PULSE SEQUENCE= zg30
##.SOLVENT NAME= CDCl3
##.SHIFT REFERENCE= (INTERNAL, CDCl3, 0, 15.7039)
##AUDIT TRAIL= $$ (NUMBER, WHEN, WHO, WHERE, WHAT)
$$ ##TITLE= Audit trail, XWIN-NMR		Version 3.5
$$ ##JCAMPDX= 5.01
$$ ##ORIGIN= Bruker BioSpin GmbH
$$ ##OWNER= she
$$ F:/spectra/data/she/nmr/H-F/1/audita.txt
$$ ##AUDIT TRAIL=  $$ (NUMBER, WHEN, WHO, WHERE, WHAT)
(   1,<2019-04-01 15:53:37.93 +0400>,<she>,<DPX200>,
      <created by zg, POWCHK disabled, PULCHK disabled
       configuration hash MD5:
       00 E9 B6 7A A2 85 ED C7 34 08 36 98 17 FE 4E 26
       data hash MD5: 16K
       08 B5 AE 76 4F 5A F7 7A AE 4E DE 42 24 A7 9E 62>)
$$ ##END=
$$ 
$$ hash MD5
$$ 6E 20 05 75 77 87 AE 06 61 2B 9C 50 BC D6 18 F0
##$RELAX= 
##$RELAX= 
##$RELAX= 
##$RELAX= 
##$RELAX= 
##$RELAX= 
$$ Bruker specific parameters
$$ --------------------------
##$DU= <F:/spectra>
##$EXPNO= 1
##$NAME= <H-F>
##$PROCNO= 1
##$TYPE= <nmr>
##$USER= <she>
##$AMP= (0..31)
100 100 100 100 100 100 100 100 100 100 100 100 100 100 100 100 100 100 
100 100 100 100 100 100 100 100 100 100 100 100 100 100 
##$AQSEQ= 0
##$AQ_mod= 1
##$AUNM= <au_zg>
##$AUTOPOS= <>
##$BF1= 200.13
##$BF2= 200.13
##$BF3= 200.13
##$BF4= 200.13
##$BF5= 200.13
##$BF6= 200.13
##$BF7= 200.13
##$BF8= 200.13
##$BYTORDA= 1
##$CFDGTYP= 0
##$CFRGTYP= 5
##$CHEMSTR= <none>
##$CNST= (0..31)
1 1 145 1 1 1 1 1 1 1 1 1 1 1 1 1 1 1 1 1 1 1 1 1 1 1 1 1 1 1 1 1 
##$CPDPRG= <>
##$CPDPRG1= <>
##$CPDPRG2= <>
##$CPDPRG3= <>
##$CPDPRG4= <mlev>
##$CPDPRG5= <mlev>
##$CPDPRG6= <mlev>
##$CPDPRG7= <mlev>
##$CPDPRG8= <mlev>
##$CPDPRGB= <>
##$CPDPRGT= <>
##$D= (0..31)
0 1.2 0 0 0 0 0 0 0 0 0 0.03 0 0 0 0 0 0 0 0 0 0 0 0 0 0 0 0 0 0 0 0 
##$DATE= 1554119617
##$DBL= (0..7)
120 120 120 120 120 120 120 120 
##$DBP= (0..7)
150 150 150 150 150 150 150 150 
##$DBP07= 0
##$DBPNAM0= <>
##$DBPNAM1= <>
##$DBPNAM2= <>
##$DBPNAM3= <>
##$DBPNAM4= <>
##$DBPNAM5= <>
##$DBPNAM6= <>
##$DBPNAM7= <>
##$DBPOAL= (0..7)
0.5 0.5 0.5 0.5 0.5 0.5 0.5 0.5 
##$DBPOFFS= (0..7)
0 0 0 0 0 0 0 0 
##$DE= 6
##$DECBNUC= <off>
##$DECIM= 24
##$DECNUC= <off>
##$DECSTAT= 4
##$DIGMOD= 1
##$DIGTYP= 9
##$DL= (0..7)
0 120 120 120 120 120 120 120 
##$DP= (0..7)
150 150 150 150 150 150 150 150 
##$DP07= 0
##$DPNAME0= <>
##$DPNAME1= <>
##$DPNAME2= <>
##$DPNAME3= <>
##$DPNAME4= <>
##$DPNAME5= <>
##$DPNAME6= <>
##$DPNAME7= <>
##$DPOAL= (0..7)
0.5 0.5 0.5 0.5 0.5 0.5 0.5 0.5 
##$DPOFFS= (0..7)
0 0 0 0 0 0 0 0 
##$DQDMODE= 0
##$DR= 18
##$DS= 0
##$DSLIST= <SSSSSSSSSSSSSSS>
##$DSPFIRM= 0
$$ [...]
##$SUBNAM2= <"">
##$SUBNAM3= <"">
##$SUBNAM4= <"">
##$SUBNAM5= <"">
##$SUBNAM6= <"">
##$SUBNAM7= <"">
##$SUBNAM8= <"">
##$SUBNAM9= <"">
##$SW= 24.9336934301222
##$SWIBOX= (0..15)
0 0 2 0 0 0 0 0 0 0 0 0 0 0 0 0 
##$SW_h= 4990.01996007984
##$TD= 16384
##$TD0= 1
##$TE= 0
##$TE2= 300
##$TE3= 300
##$TEG= 300
##$TL= (0..7)
0 120 120 120 120 120 120 120 
##$TP= (0..7)
150 150 150 150 150 150 150 150 
##$TP07= 0
##$TPNAME0= <>
##$TPNAME1= <>
##$TPNAME2= <>
##$TPNAME3= <>
##$TPNAME4= <>
##$TPNAME5= <>
##$TPNAME6= <>
##$TPNAME7= <>
##$TPOAL= (0..7)
0.5 0.5 0.5 0.5 0.5 0.5 0.5 0.5 
##$TPOFFS= (0..7)
0 0 0 0 0 0 0 0 
##$TUNHIN= 0
##$TUNHOUT= 0
##$TUNXOUT= 0
##$USERA1= <user>
##$USERA2= <user>
##$USERA3= <user>
##$USERA4= <user>
##$USERA5= <user>
##$V9= 5
##$VALIST= <valist>
##$VCLIST= <CCCCCCCCCCCCCCC>
##$VD= 0
##$VDLIST= <DDDDDDDDDDDDDDD>
##$VPLIST= <PPPPPPPPPPPPPPP>
##$VTLIST= <TTTTTTTTTTTTTTT>
##$WBST= 1024
##$WBSW= 4
##$XGAIN= (0..3)
0 0 0 0 
##$XL= 0
##$YL= 0
##$YMAX_a= 145830
##$YMIN_a= -101755
##$ZGOPTNS= <>
##$ZL1= 120
##$ZL2= 120
##$ZL3= 120
##$ZL4= 120
##$ABSF1= 10
##$ABSF2= 0
##$ABSG= 5
##$ABSL= 3
##$ALPHA= 0
##$AQORDER= 0
##$ASSFAC= 0
##$ASSFACI= 0
##$ASSFACX= 0
##$ASSWID= 0
##$AUNMP= <proc_1d>
##$AZFE= 0.1
##$AZFW= 0.1
##$BCFW= 1
##$BC_mod= 2
##$BYTORDP= 1
##$COROFFS= 0
##$CY= 11.3945322036743
##$DATMOD= 1
##$DC= 2
##$DFILT= <>
##$DTYPP= 0
##$F1P= 18.9103706918063
##$F2P= -1.10871071338519
##$FCOR= 0.5
##$FTSIZE= 0
##$FT_mod= 4
##$GAMMA= 1
##$GB= 0.15
##$INTBC= 1
##$INTSCL= 1
##$ISEN= 128
##$LB= 0.24
##$LEV0= 0
##$LPBIN= 0
##$MAXI= 10000
##$MC2= 0
##$MEAN= 0
##$ME_mod= 0
##$MI= 1.114404
##$NCOEF= 0
##$NC_proc= 0
##$NLEV= 6
##$NOISF1= 3.799351
##$NOISF2= 2.8
##$NSP= 1
##$NTH_PI= 0
##$NZP= 0
##$OFFSET= 15.70392
##$PC= 1
##$PHC0= -9366.242
##$PHC1= 12.20026
##$PH_mod= 1
##$PKNL= yes
##$PPARMOD= 0
##$PSCAL= 0
##$PSIGN= 0
##$REVERSE= no
##$SF= 200.130013532006
##$SI= 16384
##$SIGF1= 3
##$SIGF2= 2
##$SINO= 400
##$SIOLD= 16384
##$SREGLST= <1H.CDCl3>
##$SSB= 0
##$STSI= 0
##$STSR= 0
##$SW_p= 3612.71676300578
##$SYMM= 0
##$S_DEV= 0
##$TDeff= 0
##$TDoff= 0
##$TI= <>
##$TILT= no
##$TM1= 0
##$TM2= 0
##$TOPLEV= 0
##$USERP1= <user>
##$USERP2= <user>
##$USERP3= <user>
##$USERP4= <user>
##$USERP5= <user>
##$WDW= 1
##$XDIM= 8192
##$YMAX_p= 0
##$YMIN_p= 0
$$ End of Bruker specific parameters
$$ ---------------------------------
##NTUPLES= NMR FID
##VAR_NAME=  TIME,          FID/REAL,        FID/IMAG
##SYMBOL=    X,             R,               I
##VAR_TYPE=  INDEPENDENT,   DEPENDENT,       DEPENDENT
##VAR_FORM=  AFFN,          ASDF,            ASDF
##VAR_DIM=   8192,          8192,            8192
##UNITS=     SECONDS,       ARBITRARY UNITS, ARBITRARY UNITS
##FACTOR=    0.0002004,     1,               1
##FIRST=     0,             0,               0
##LAST=      1.6414764,     0,               0
##MIN=       0,             -101755,         0
##MAX=       1.6414764,     145830,          0
$$ Real data points
##PAGE= N=1
##DATA TABLE= (X++(R..R)), XYDATA
0 0 0 0 0 0 0 0 0 8 -8 8 -8 16 -16 19 -24 32 -36 41 -49 58 -72 81 -96 110 -129 145 -163 186 -211 239 -268
31 -268 301 -339 380 -422 471 -526 583 -647 716 -793 878 -973 1075 -1192 1321 -1470 1636
48 1636 -1827 2049 -2311 2627 -3009 3494 -4121 4974 -6205 8134 -11614 19783 -74905 2062
62 2062 126138 -101755 16546 98246 -99630 -47465 99648 -35170 -19640 67224 -33911
73 -33911 -50641 30848 4356 12356 14568 -25377 -3686 -1932 -17003 39101 10657 -35330 15793
86 15793 -3883 -36012 37828 24129 -27343 4104 -11323 -17998 32706 1799 -8608 21216
98 21216 -35045 -18770 48234 -15807 -10089 49455 -44605 -44570 63131 -1182 -28754 46902 -21974
111 -21974 -49125 40202 7788 -15381 33075 -17243 -30988 17613 -8733 15981 37546 -46786
123 -46786 -17348 38883 -36182 4942 66996 -48314 -36784 57059 -32161 -28361 78716 -12356
135 -12356 -63689 36612 6746 -35291 39143 18710 -41708 -1442 15705 -10590 1800 19301
147 19301 3911 -24999 -13385 23100 2655 -9327 24027 -11600 -36309 27080 14040 -25845
159 -25845 26070 8624 -44959 11514 22408 -19216 20975 9589 -43356 8329 23930 -19482
171 -19482 15815 15232 -36023 1354 19181 -17531 13902 21532 -29981 -11508 17408 -3685 5270
184 5270 12573 -13244 -10522 3245 2857 6287 2026 598 -1567 -17463 502 23562 -3973 -8287
198 -8287 10074 -15673 -10682 25762 565 -13820 14501 -6276 -22155 15285 15289 -7966 692
211 692 -3170 -13079 4620 13685 2094 -6004 -4552 -257 -4368 120 16487 2098 -16949 389
225 389 1869 -6913 16431 9177 -21805 -1313 10706 -11823 5290 17966 -12108 -9806 6973
238 6973 -6970 1138 18328 -3669 -15667 1868 3558 -1798 6065 5345 -6605 -6846 1813 756
252 756 759 10311 914 -16440 -1984 10662 -1913 2865 7727 -12404 -7235 10293 -2257 -620
266 -620 13902 -6522 -16440 5608 6179 -220 7771 -3053 -13720 2041 7697 -961 2736 3708
280 3708 -7236 -7940 3218 7425 2660 186 -3415 -9240 -102 11859 1049 -5803 3730 -3017
294 -3017 -9230 6878 7593 -4027 1998 -1261 -11758 3852 12983 -3292 -4847 2629 -4566 -3564
308 -3564 6852 3785 -2042 33 -2707 -6442 2358 10434 1165 -8072 -1796 1024 -2384 4883 6197
323 6197 -5492 -3354 2245 -5545 918 12857 -1315 -11183 518 1462 -989 7787 2057 -9014
337 -9014 -802 3185 -3591 2739 7947 -3400 -7945 -19 2374 2494 4718 -1309 -7923 -718 5458
352 5458 -393 -872 4605 -1628 -7067 1172 4129 54 2857 -5 -8352 -278 8023 -1177 -3182
367 -3182 4058 -1654 -5369 2995 2552 -1662 3716 170 -8547 259 8089 -890 -3212 2764 -1681
382 -1681 -3951 3444 2174 -2108 2874 438 -7713 -41 8450 12 -4082 1068 -1980 -2481 5367
397 5367 1790 -4506 2059 1325 -6726 882 8254 -1301 -4528 793 -1907 -349 6167 -394 -6097
412 -6097 2098 2552 -4437 946 5365 -2219 -3282 1447 -1296 -116 5213 -1092 -6308 2386 4094
427 4094 -3803 -641 3982 -1731 -1669 2127 -2397 -929 5496 -808 -5693 2307 3060 -2986 138 2706
443 2706 -1588 -679 1032 -2500 -357 5082 159 -5576 -142 3883 -596 -779 1801 -1961 -1658 3037
459 3037 -1001 -2190 4877 378 -6828 1237 4911 -1850 -225 1000 -4023 720 4826 -2734 -2671 3808
475 3808 29 -3566 1103 2089 -451 -284 -683 -1542 993 2873 -985 -3433 1739 3269 -2929 -1706
491 -1706 3137 -460 -1061 2011 -2464 -1733 5062 -514 -4899 3002 2255 -3640 718 1668 -1889 1689
507 1689 822 -4446 876 4818 -1565 -3140 1063 874 -319 579 -256 -927 911 859 -2005 -605 3486
524 3486 159 -4099 477 2707 -813 372 224 -3043 1400 3701 -3492 -1966 4408 -564 -3341
539 -3341 1919 662 -1368 2035 -690 -3419 2705 2934 -3800 -1261 3262 -521 -1538 1008 -829
554 -829 -158 3016 -1364 -3504 2626 2394 -2671 -593 1518 -436 285 209 -1639 842 2072 -1769 -1913
571 -1913 1598 2038 -779 -2132 -34 1532 321 41 -724 -1528 1822 1517 -3185 233 3351 -2179
587 -2179 -2003 1858 -279 935 1657 -3788 -834 3996 -1206 -1550 1468 -1178 1090 1313 -3997 1107
603 1107 4017 -3406 -399 2597 -3286 1572 2879 -5790 1554 5911 -5708 -1660 4930 -2941 793
618 793 3636 -6191 439 6259 -4875 -1183 4746 -3697 158 3504 -5068 1362 5122 -5741 -992
633 -992 5013 -2504 406 1389 -4966 2594 4231 -4361 452 1492 -2948 3083 -246 -4050 5911 -64
649 -64 -7154 5003 1482 -4807 6160 -1448 -7820 8301 1461 -8936 6256 2022 -6751 5937
663 5937 -729 -7310 8571 429 -8550 7224 461 -6982 7326 -1777 -6958 10780 -1353 -10730
677 -10730 9065 1331 -8191 8232 -815 -8893 9272 752 -9295 7165 1955 -6919 4742
690 4742 -553 -4127 6791 -2158 -5581 6191 -591 -2906 4369 -4386 -1249 7355 -4760 -2680
704 -2680 6419 -4153 -1061 4910 -5841 1612 6623 -8682 212 7646 -7364 1523 6248 -10208
718 -10208 3140 9664 -12142 -22 11419 -9301 -1091 9325 -9427 -365 10444 -8844 -2120
731 -2120 9701 -6266 -2374 6238 -5066 1491 5472 -8081 694 6425 -5797 1391 3891 -7145
745 -7145 3500 5110 -8695 2091 6748 -6754 -75 4157 -4535 2352 3074 -5836 1734 3199
759 3199 -3533 1636 5 -2690 4854 -1382 -5389 5736 859 -4873 3918 -1091 -3684 6251 -1352
774 -1352 -5599 5599 226 -4250 3712 -1472 -1789 5807 -4049 -3932 7118 -2245 -3925 6236 -3165
789 -3165 -3643 7809 -3280 -6086 8411 284 -7353 3911 1545 -3523 3557 254 -4467 2131
803 2131 2383 -1924 -700 889 1383 -956 -2492 2133 1711 -2260 904 89 -2596 3146 1557 -4509
819 -4509 1152 2862 -2598 -381 939 -597 2031 -724 -3179 2001 1411 -1449 952 -1177 -1289 3290
835 3290 -895 -2865 3014 644 -2809 692 172 62 1992 -1779 -1807 1900 268 2 127 -1958 1771
852 1771 1900 -3915 -31 3648 -1695 -758 1181 -2177 883 2657 -2423 -649 2015 -847 -650 -273
868 -273 297 2716 -1232 -3064 2013 371 -834 2622 -2164 -2461 4643 -1086 -4234 4186 1079 -3585
884 -3585 1959 -580 -2010 4171 -796 -3905 2908 513 -1874 1978 -1597 -864 4027 -2616 -2833 4444
900 4444 -694 -2326 2665 -2163 -755 4787 -2804 -3116 4323 -740 -2165 2464 -1460 -203 3052
915 3052 -3379 -1429 4085 -1131 -918 1481 -2812 915 3219 -3760 -210 3987 -2608 -1125 1701
930 1701 -2162 1993 2547 -4548 -87 3174 -2411 364 1688 -2480 1903 1171 -4610 1782 3507 -2947
946 -2947 366 857 -2989 2628 1602 -4463 1899 2928 -3391 180 1100 -1807 2543 453 -4084 2085
962 2085 2008 -2956 1121 750 -1967 2517 -262 -3917 3031 2062 -3479 798 995 -1722 2281 48
978 48 -3620 2132 2250 -2608 -76 960 -535 855 -707 -1257 1922 620 -1438 -134 -335 885
994 885 1398 -2326 -506 2792 -1282 -1377 1641 -888 451 2173 -3340 -1470 4165 -633 -2322 2057
1010 2057 -489 -1226 1991 -1400 -1351 3483 -159 -3382 1058 1313 -629 546 -580 -1150 1531 441
1026 441 -1634 0 1189 194 -1161 -1026 1101 1374 -745 -694 -92 83 1260 -365 -1947 1301 1767
1043 1767 -2017 -644 1685 -289 -127 319 -1696 403 2533 -1138 -2096 1434 962 -1097 -180 306
1059 306 124 674 -369 -1578 387 2162 -212 -2248 168 1651 -457 -615 609 -340 -46 834 -1352
1076 -1352 -681 2726 141 -2952 322 1682 -486 239 -14 -1550 851 1561 -1873 -749 2404 -140
1092 -140 -2324 328 1250 -14 285 -434 -1620 834 2093 -1365 -1488 1932 482 -1945 450 951
1108 951 -578 902 -169 -2564 1171 2915 -1892 -1656 1974 -129 -1104 982 -244 -474 1750 -686
1124 -686 -2487 1440 2352 -1361 -1344 842 83 -102 824 -646 -782 1487 8 -2517 943 2776 -1307
1141 -1307 -1755 869 -191 278 1741 -1567 -1605 2439 47 -2514 1371 1729 -1481 -553 128 -626 1372
1158 1372 1226 -1965 -1225 1637 761 -1351 -200 1314 -239 -1108 153 17 174 1617 -1033 -2582
1174 -2582 1843 2059 -2210 -251 1502 -1155 -57 866 -1467 659 2214 -1941 -1962 1786 1048 -602
1190 -602 -375 -338 220 473 -304 -421 105 1128 -182 -2231 512 2660 -1125 -1210 942 -1119 388 2215
1208 2215 -2302 -949 3419 -1477 -2579 2674 239 -1166 1724 -1736 -1623 3423 19 -2770 1195
1223 1195 765 -916 350 -559 285 1473 -1203 -946 652 -247 1517 15 -2961 1827 1979 -3259
1239 -3259 730 2228 -2415 1162 1283 -3955 2063 3627 -4292 -548 3025 -2226 481 1843 -3005
1254 -3005 1164 2357 -3318 109 2317 -1166 687 -405 -2335 2801 694 -2883 1867 -19 -1814
1269 -1814 2899 -1563 -2514 5145 -1080 -4814 4168 81 -3188 4570 -1631 -4521 5978 -296 -5594
1284 -5594 4961 861 -4590 3706 -529 -3772 5344 -34 -5228 3467 753 -2686 3076 -1326 -2176
1299 -2176 4284 -2131 -2989 4429 -869 -1715 2973 -3322 -735 5381 -3479 -2163 4733 -2787 -1203
1314 -1203 4130 -3694 29 5046 -5086 -1570 5300 -3038 -269 3512 -5003 834 4895 -5394
1328 -5394 244 5067 -4623 184 3345 -5001 2691 4344 -7034 1059 4712 -5389 2158 3513
1342 3513 -6606 3044 4105 -7923 2728 5856 -6700 1313 3715 -6530 3265 4933 -7560
1355 -7560 1325 5161 -5599 865 3802 -4319 1939 2324 -5377 1941 3352 -3290 1253 129 -2911
1370 -2911 3850 -156 -3791 4182 -146 -3685 3686 -1420 -2365 5987 -2821 -5028 6246 -906 -3921
1385 -3921 5674 -2434 -3921 6753 -2874 -4766 7690 -1430 -5427 5555 -1935 -3479 7262 -2778
1399 -2778 -5420 6688 -1109 -4613 5484 -1389 -3231 5125 -2954 -3433 6451 -1189 -3772 3715 -2028
1414 -2028 -1498 4808 -2884 -2025 4742 -2558 -2283 3689 -1659 -89 2895 -4048 -662 4167 -2035 -471
1430 -471 1948 -2568 1087 1639 -3601 2101 2746 -3825 650 1124 -2862 3442 1041 -5187 2827 2243
1446 2243 -4664 2440 1761 -4147 3134 1123 -5568 3631 3239 -5266 1425 2229 -3719 2574 1778 -4790
1462 -4790 2183 2848 -4211 691 2571 -2221 788 539 -2732 1752 2007 -2149 -239 406 -355 992
1478 992 -637 -501 1845 -767 -1532 742 -220 1132 1447 -2813 -658 2480 -1242 -436 1954 -1353
1494 -1353 -166 1167 -2555 474 3423 -1623 -1478 989 -1160 743 1633 -2039 189 1977 -2007
1509 -2007 -900 1480 -225 631 217 -2202 717 1846 -1302 -328 585 -475 693 -148 -1452 1214
1525 1214 1104 -1502 -213 535 76 712 -746 -1310 1328 926 -998 -311 -45 326 375 -919 156 1395
1543 1395 -394 -907 -370 -375 1567 924 -1968 -37 1296 -1223 -109 1119 -573 653 315 -2569 337
1560 337 2619 -687 -892 280 -781 554 644 -1166 715 1216 -1371 -793 317 211 1281 -286 -1828
1577 -1828 808 880 -1072 327 315 -389 1011 -859 -1491 1743 993 -1447 -113 -10 6 1232 -795
1594 -795 -1259 1517 269 -1331 556 272 -74 792 -1119 -910 1906 392 -1295 -112 -105 368 884 -1016
1612 -1016 -265 1342 -624 -901 493 78 1011 497 -2357 -159 2147 -742 -528 1085 -842 -148 949
1629 949 -1503 65 2362 -989 -1821 665 400 340 544 -1022 -323 1087 -457 -765 585 622 180 -949
1647 -949 -1090 1166 1150 -704 -431 -121 -165 762 -158 -899 1058 488 -1565 -143 807 407 599 -910 -1445
1666 -1445 1209 1077 -989 -44 461 -344 8 -287 -407 1299 599 -1742 -576 1040 501 58 -428 -561
1684 -561 371 341 -475 -118 746 472 -837 -1057 517 1399 -97 -944 -437 192 635 197 -626 130 699
1703 699 -732 -922 626 1093 168 -906 -960 304 1174 327 -721 -375 315 60 -504 -30 1133 403
1721 403 -1192 -926 528 1112 586 -690 -1072 238 624 -228 -180 764 197 -854 -728 240 1071 787 -757
1740 -757 -1497 171 1214 -4 -507 274 -2 -492 -137 -3 711 1062 -967 -1803 633 1289 73 -87
1758 -87 -461 -599 533 156 -650 853 772 -1296 -1132 491 1009 824 -311 -1570 -257 1190 216 -335
1776 -335 342 211 -705 -708 234 1064 821 -540 -1565 -280 1401 836 -628 -274 42 -456 -127 354 430
1795 430 870 -367 -1955 -244 1878 716 -546 -709 -625 222 764 -137 174 663 -771 -1274 144 1151
1813 1151 1128 -366 -1657 -421 1007 677 72 -149 -391 -75 -451 -528 1291 1241 -959 -1469 -345 819
1831 819 1372 27 -1156 -236 161 -241 337 634 407 -133 -1511 -742 1704 1247 -469 -697 -975 39
1849 39 1286 -120 -419 963 -618 -1474 399 863 903 422 -1945 -1196 1676 723 -176 422 -874 -523
1867 -523 696 -668 323 2067 -802 -2158 208 537 999 1143 -1460 -1262 949 -29 -138 1001 76
1884 76 -226 -761 -1405 1380 2119 -904 -836 -446 -1074 1556 1371 -1752 525 892 -2373 148 2016 -306
1902 -306 451 -258 -2830 943 2587 -986 -166 320 -1721 498 832 -1018 1780 676 -3084 -69
1918 -69 1452 -89 1656 -238 -2977 889 1476 -1266 1088 868 -1647 -23 -439 -720 2875 617
1934 617 -2743 97 -37 -212 2443 -497 -1980 1686 -878 -2027 2836 872 -1567 718 -1751 -1550
1950 -1550 3671 566 -2278 899 -849 -1175 2274 -356 -507 2186 -2233 -2352 2736 467 -223 1583
1966 1583 -2953 -1423 3555 -694 -1066 2597 -1674 -2008 1939 -833 443 3065 -2484 -2576 1997 -5
1982 -5 532 1762 -2459 -748 1922 -1861 438 2945 -1597 -1130 308 -1902 1849 3041 -2605 -963
1998 -963 982 -1739 1326 1802 -1927 928 409 -3564 1459 2886 -1535 624 -532 -3419 2644 2489
2014 2489 -2868 1156 991 -3536 1031 1931 -1496 2150 333 -4419 994 2533 -956 1311 -331
2029 -331 -2995 1573 952 -1607 2319 560 -2853 335 -8 -153 3281 -655 -3292 925 291 -328
2045 -328 2323 -559 -1423 1134 -1773 -786 3459 31 -1311 200 -2397 366 3641 -1347 -1279 1515
2061 1515 -2199 -513 2594 -896 500 1493 -3762 -871 3566 -323 -6 889 -3061 80 2706 -1495
2077 -1495 450 2050 -2658 -1025 1532 -515 1688 1439 -3394 -898 1971 -159 774 578 -1820 21
2093 21 188 -1046 1845 1380 -1455 -702 -1068 -24 2919 66 -2002 535 -836 -692 2302 -150 -521
2110 -521 1520 -2503 -1866 3218 639 -673 905 -2595 -924 3315 -713 -946 2424 -1946 -2052 2086
2126 2086 -423 423 2528 -2882 -2347 2642 195 -57 1606 -2020 -1035 1630 -1166 264 2470 -1280
2142 -1280 -1490 169 -620 1938 1561 -2412 -564 717 -939 1393 896 -1543 877 -523 -2475 2302
2158 2302 1830 -1515 505 -1278 -1943 3262 877 -2404 1778 -261 -2752 2114 663 -1259 2738
2173 2738 -1405 -3882 2783 1572 -1609 2030 -1000 -2761 2469 174 -1782 3011 -58 -3165 1137
2188 1137 -25 -297 3158 -1395 -3075 1992 10 -921 2351 -821 -1479 1631 -1714 -747 3601 -497
2204 -497 -1942 732 -1460 377 2913 -1608 -1113 1620 -1716 -181 2166 -1119 496 956 -3373 371
2220 371 3203 -1302 -22 774 -2892 1042 2315 -2428 958 2026 -3312 -174 2010 -1435 1648
2235 1648 1275 -4070 406 2678 -1839 848 1363 -2764 530 1180 -2340 1865 2243 -2940 -540 915
2251 915 -968 2034 792 -2780 746 804 -1767 1481 939 -1378 895 -928 -2114 2838 1197 -2068
2267 -2068 643 -648 -1429 2549 52 -1899 1950 -394 -2577 1669 954 -680 1394 -1516 -2107 2425
2283 2425 662 -1252 1078 -822 -1176 1478 -614 -255 2309 -1131 -2048 1019 -6 515 1700 -1966
2299 -1966 -1226 1933 -715 -552 1911 -779 -830 773 -1567 297 2863 -1201 -1664 857 -595 301
2315 301 1582 -1222 -469 1277 -1359 -670 1643 -19 -39 -134 -1739 622 1815 -809 -379 419 -1044
2332 -1044 408 674 -949 1011 957 -2230 -350 1458 -177 552 103 -1923 483 1448 -939 125
2348 125 995 -832 -413 155 -209 1224 619 -1637 -651 616 530 659 -442 -738 555 -169 -686 905
2366 905 465 -429 13 -1049 -258 1928 84 -1453 361 -122 -457 838 -257 -353 1160 -592 -1631
2383 -1631 915 933 -276 103 -639 -509 953 16 -815 433 342 -539 -239 -20 501 807 -711 -927 381
2402 381 564 306 -189 -717 203 592 -591 -108 849 39 -606 -271 -118 736 774 -915 -901 381 544 170
2422 170 -211 -112 262 -193 -561 178 640 358 -235 -1075 -166 1303 188 -876 220 229 -391 181 -184 -142
2442 -142 886 -70 -1328 67 957 50 -214 -184 -128 287 12 -510 123 717 9 -742 -384 743 564
2461 564 -542 -486 4 230 453 -257 -598 630 353 -826 -126 753 129 -106 -408 -532 815 848 -794
2480 -794 -570 450 209 -75 -170 -80 442 74 -676 -153 637 518 -316 -842 62 809 -136 -432 161 112 161
2501 161 111 -757 106 1113 -363 -950 370 480 -34 58 -523 -76 722 -262 -667 283 506 83 -509 -479
2521 -479 595 557 -534 -173 93 15 454 -252 -782 833 629 -1220 -94 810 -239 242 -102 -936 738
2540 738 1011 -1065 -298 866 -105 -224 48 -468 458 456 -823 -223 584 232 -15 -616 -272 953 -87
2559 -87 -771 394 249 -129 353 -754 -387 1440 -256 -1363 704 455 -504 487 -365 -600 1147 -145
2577 -145 -1223 783 597 -507 104 -356 -101 1166 -386 -1014 605 294 -130 160 -645 175 999 -939
2595 -939 -471 1091 -265 -124 363 -929 329 1334 -1349 -585 1539 -446 -418 716 -954 63 1530
2612 1530 -1119 -935 1383 -84 -781 406 -231 125 625 -859 -221 855 -44 -109 -408 -447 1192 198
2630 198 -1473 548 682 -968 580 161 -1229 1108 553 -1957 642 1501 -1148 -234 464 -742 808
2647 808 584 -1474 255 1086 -723 -123 200 -387 720 -73 -1135 725 690 -773 -1 -77 -162 1021
2665 1021 -427 -1078 990 542 -674 200 -344 -50 1240 -616 -916 1221 27 -952 566 -86 -269
2682 -269 894 -683 -971 1363 567 -904 -21 -47 57 585 -420 -437 682 -93 -464 118 -93 642 241
2701 241 -1329 38 1316 -429 -529 368 -411 153 827 -889 -355 1220 -164 -966 376 416 -36 93
2719 93 -390 -296 684 187 -603 -125 573 333 -671 -423 478 451 -130 -342 -417 182 652 -289 -515 597 233
2740 233 -632 -78 231 312 388 -596 -861 657 869 -445 -410 178 -55 65 47 -150 247 494 -587 -812
2760 -812 758 860 -447 -489 -13 -186 426 311 -724 66 791 -583 -716 624 483 -104 -299 -631 222
2779 222 833 -234 -368 292 -52 113 -117 -437 874 716 -1177 -366 645 -15 439 163 -1124 280
2797 280 910 -976 -145 1081 -411 -490 -51 -414 760 833 -1085 -576 563 26 178 148 -432 396 -23
2816 -23 -912 451 733 -138 -60 -690 -475 1289 240 -1001 464 1 -683 625 -165 -314 1369 -557
2834 -557 -1697 1109 770 -655 639 -463 -1116 1355 153 -1245 1092 329 -1174 247 -23 -77 1415
2851 1415 -552 -1541 817 340 -349 692 -453 -461 1066 -888 -778 1768 38 -1047 456 -625 -137
2868 -137 1625 -631 -1250 1057 -117 -853 786 -9 -92 721 -1196 -683 1471 188 -516 71 -679 207
2886 207 867 -833 31 960 -873 -402 524 -300 941 529 -1806 -7 1283 -538 230 482 -1170
2903 -1170 510 676 -1360 785 1413 -1398 -593 643 -421 909 749 -1634 -48 1018 -739 150
2919 150 705 -515 155 -183 -1119 854 1087 -788 -189 -112 -479 900 163 -958 727 395 -1161 129
2937 129 584 -22 550 -404 -1160 717 677 -588 21 -31 -208 400 -376 -251 994 -3 -962 -40 120 492
2957 492 645 -880 -659 813 4 -261 488 -219 -150 141 -846 280 1409 -453 -938 136 -151 451
2975 451 884 -842 -420 761 -426 -463 833 361 -53 -197 -905 164 1098 -117 -529 -15 -108 69 36
2994 36 -306 541 577 -748 -529 133 301 482 -157 -672 193 395 -294 -49 300 179 -48 -707 -145 902
3014 902 301 -495 -335 -117 422 564 -499 -478 559 -139 -451 385 279 9 -94 -774 -21 1101 217
3033 217 -639 -294 -129 371 387 -463 -7 502 -481 -488 393 392 357 -261 -885 -22 706 -4 -147 38 -90 94
3055 94 -213 -460 552 709 -524 -452 -52 163 461 -122 -533 332 144 -515 2 263 314 166 -777 -466
3075 -466 874 341 -324 0 -370 30 653 -435 -258 867 -253 -803 335 297 28 334 -722 -596
3093 -596 912 306 -585 124 99 -39 92 -296 106 717 -221 -544 -15 89 575 50 -791 209 582 -454
3113 -454 -81 274 -123 395 -97 -1095 589 1046 -668 -356 376 -394 263 300 -763 321 692 -799 -434
3132 -434 589 223 110 -259 -688 287 544 -352 -104 41 -53 302 -486 -319 967 115 -854 146 78 -39
3152 -39 687 -402 -714 882 125 -906 425 361 -295 222 -528 -502 966 259 -867 72 102 -124 267
3171 267 -405 -94 762 -330 -655 359 96 219 165 -860 31 949 -572 -472 634 -346 -18 416 -972
3190 -972 98 1261 -744 -695 831 -54 -165 475 -580 -5 818 -501 -582 562 197 -133 -257 -453
3208 -453 564 434 -638 10 213 -344 549 -89 -768 1057 392 -1461 265 848 -574 439 36 -1111
3226 -1111 789 739 -1218 109 867 -706 -30 197 -542 625 382 -1094 90 625 -190 113 -153 -410
3244 -410 681 64 -865 291 341 -197 149 -531 -117 1016 -419 -785 795 16 -578 603 -492 -363
3262 -363 1357 -450 -1225 1042 387 -668 488 -154 -574 896 -142 -831 629 418 -465 -65 -165
3279 -165 285 607 -732 -380 715 -119 -116 398 -742 229 953 -1058 -482 1224 -240 -572 501 -397
3297 -397 22 865 -700 -518 946 24 -602 108 -176 287 378 -713 -164 786 -108 -225 34 -290 383
3316 383 135 -739 297 618 -366 -24 -122 -192 875 -14 -1101 453 585 -708 202 242 -639 562 263
3335 263 -1182 396 1128 -761 -506 525 -121 -76 358 -413 -199 530 -9 -633 4 629 36 -668 -95
3354 -95 499 -3 -152 120 -311 98 549 -605 -485 817 211 -726 -38 191 136 174 -282 -328 407 364 -295
3375 -295 -224 164 313 -26 -432 -11 500 180 -450 -286 319 251 -73 -229 55 287 143 -237 -296 310 474
3396 474 -503 -410 408 293 -13 -120 -209 247 302 -207 -248 184 310 80 -520 -207 771 75 -917 256 312
3417 312 -376 431 -45 -831 699 626 -1145 9 988 -376 -359 246 -260 168 407 -563 -363 536 284
3436 284 -251 -484 197 559 -369 -408 486 -17 -45 325 -698 -131 1126 -431 -850 875 142 -465 430
3455 430 -396 -244 1088 -465 -904 909 149 -462 490 -448 -316 1020 -509 -821 1045 130 -682 280
3473 280 -189 -128 918 -516 -687 811 48 -320 246 -461 164 797 -932 -253 1102 -481 -403 610
3491 610 -538 154 966 -1052 -498 1284 -261 -622 504 -365 40 645 -700 -201 823 -252 -196 87
3509 87 -312 671 168 -1146 464 679 -822 257 219 -824 879 444 -1381 575 1043 -1216 38
3526 38 652 -862 562 573 -1293 418 1183 -948 -170 609 -535 369 220 -1102 431 798 -761 -42
3544 -42 280 -394 491 0 -895 722 454 -907 170 129 -331 666 -299 -912 891 257 -905 314 102
3563 102 -285 716 -245 -681 950 162 -949 386 254 -263 412 -447 -506 947 82 -690 331 -33
3581 -33 -44 446 -621 -168 930 -440 -548 659 -338 43 696 -964 -193 1308 -675 -801 994 -137
3599 -137 -424 709 -644 -472 1151 -202 -926 579 211 -388 151 -221 -11 605 -275 -491 277 217 51
3618 51 -80 -473 331 516 -603 -224 459 -36 88 -44 -567 401 429 -650 -20 433 -149 148 -127 -470
3638 -470 571 345 -774 -98 445 -152 122 -57 -386 453 227 -690 12 398 -69 -85 -279 -51 534 -11
3658 -11 -678 127 270 -62 195 -276 -299 684 -76 -787 357 573 -317 -91 -9 -156 458 259 -592 -90 600
3679 600 -29 -284 134 270 66 -206 -180 62 330 207 -386 -348 340 307 -251 -21 214 136 -42 -316 -45
3700 -45 502 148 -482 -155 303 208 75 -204 -302 268 156 -501 -13 457 -9 -373 -223 69 355 240 -421
3721 -421 -316 293 273 -238 -98 193 112 -186 -284 74 373 195 -376 -392 158 365 23 -263 -146 174 86 -370
3743 -370 -78 432 72 -349 -237 -31 299 398 -427 -481 408 169 -351 105 205 -73 -8 -331 -194 535 215
3764 215 -478 -242 131 219 79 -263 -140 325 -92 -385 162 287 120 -69 -460 -93 532 106 -410 -105
3784 -105 155 30 -101 -115 168 231 -268 -316 -26 271 416 -308 -527 218 281 -182 29 116 -76 90 -123 -413
3806 -413 526 569 -573 -390 208 49 274 -6 -403 214 318 -479 -17 401 39 66 -296 -423 515 397
3826 397 -532 -167 167 -44 109 -179 -223 365 147 -504 33 364 8 21 -377 -235 542 129 -463 161 198
3847 198 -215 30 -225 -154 498 -4 -704 28 454 96 -64 -197 -130 312 -105 -332 180 209 50 -163 -424
3868 -424 320 635 -449 -393 279 -145 19 300 -450 90 686 -592 -483 622 172 -249 121 -279 -78
3887 -78 533 -236 -404 428 130 -283 -67 -32 301 322 -529 -233 449 19 -65 -99 -299 300 342 -591 -132 561
3909 561 -98 -290 31 -109 308 214 -691 -109 577 -80 -144 84 -246 230 246 -595 44 611 -120 -316 -22
3930 -22 -46 329 160 -513 18 355 -249 -158 50 140 384 -141 -641 341 486 -346 9 87 -348 367 178 -728
3952 -728 342 597 -722 -282 533 -85 119 211 -598 -62 676 -176 -423 305 255 -138 -166 2 174 120 -192
3973 -192 -245 -16 232 319 -461 -377 604 75 -487 209 186 -190 346 -191 -494 642 408 -753 -36 446 -215
3994 -215 13 48 -326 274 257 -585 -19 546 2 -115 -190 -251 420 305 -403 -133 317 -100 -69 28 -30 423
4016 423 -98 -571 157 461 25 -31 -270 -235 568 115 -585 319 333 -470 -9 162 -214 361 212 -840 -8
4037 -8 850 -224 -462 224 115 -142 63 -73 53 408 49 -359 -254 359 474 -421 -308 493 -54 -367
4057 -367 374 -106 -272 676 -316 -882 851 565 -1031 89 394 -490 485 368 -703 303 615 -795
4075 -795 -89 631 -163 -138 -31 -352 285 604 -467 -328 189 0 27 -82 -48 379 -112 -422 108 145 176
4096 176 306 -601 -302 900 -198 -603 681 31 -547 595 -251 -561 1051 166 -1144 314 571 -449
4114 -449 199 120 -526 273 175 -517 136 435 -130 -260 -311 210 652 -434 -402 382 -293 -19 531 -600 -62
4135 -62 918 -756 -684 1125 18 -557 555 -391 -429 1059 -298 -873 780 117 -775 399 155 -228
4153 -228 512 -259 -638 508 431 -280 -109 -100 135 183 -382 93 360 -296 28 -27 -399 752 507 -1131 162
4174 162 865 -697 48 727 -833 33 767 -996 -126 1310 -426 -698 575 -184 -110 611 -416 -376
4192 -376 589 11 -348 140 192 226 -262 -560 415 418 -279 233 -112 -429 644 107 -786 619 518 -1030
4212 -1030 103 410 -379 480 312 -1111 180 874 -547 -169 534 -368 -224 99 -268 246 583 -381
4230 -381 -480 151 293 103 -266 -58 249 -155 -117 317 -241 89 352 -759 -339 1037 -103 -710 435
4249 435 -115 -413 730 -85 -690 759 90 -1018 270 607 -309 17 -18 -386 298 414 -317 -145 136
4268 136 82 -232 -219 427 266 -338 -228 -11 -62 484 162 -722 1 647 -498 -193 608 -71 -298 179 -297
4289 -297 -43 708 -109 -644 200 316 -221 -21 120 -23 -14 -92 -200 29 501 120 -639 -128 557 21 -159
4310 -159 212 -174 -140 357 -175 -191 603 -61 -762 69 386 -124 150 11 -410 221 347 -361 -211 459 35
4331 35 -476 -53 285 72 25 -123 -340 98 453 -160 -360 357 179 -495 8 302 -3 242 -97 -579 78
4352 78 603 -194 -351 192 106 -130 -49 161 221 27 -182 -301 -32 542 183 -502 -105 390 -183 -126 279 -129
4374 -129 -128 293 -377 -170 787 -46 -641 212 205 -109 246 -91 -345 384 218 -565 -77 399 56 -231 -140 30
4396 30 187 61 -104 -185 7 284 -181 -301 469 279 -501 -103 135 -25 314 90 -643 114 471 -419 -153
4417 -153 455 -132 -185 57 -189 169 449 -231 -441 152 219 39 -229 -130 288 -36 -296 72 -74 64 263
4438 263 -410 -328 662 33 -581 342 168 -373 175 -79 -451 596 360 -760 -20 458 -67 -69 54 -233
4458 -233 76 203 -162 -102 325 112 -247 -203 377 374 -274 -207 20 -56 242 228 -449 58 551 -439 -257 574
4480 574 -172 -250 177 -363 -16 808 -280 -596 453 133 -297 96 129 -35 305 -226 -380 150 320 63
4500 63 -258 -204 199 -5 -386 226 301 -198 91 -206 -427 570 407 -768 -141 559 -292 -25 321 -397 -26
4521 -26 408 -512 -201 664 -12 -451 -20 133 69 93 -218 -169 130 116 -78 -196 89 325 -254 -479 297 128
4543 128 -200 88 -261 -202 544 -55 -598 560 272 -475 112 97 -227 517 -19 -674 275 580 -343 -53
4563 -53 253 -262 97 89 -285 336 385 -306 -344 -33 296 291 -348 -146 263 -80 -104 282 -193 36 439 -495 -340
4586 -340 825 20 -563 242 33 -273 444 -118 -519 460 274 -506 -31 385 58 39 -186 -102 193 50
4606 50 -66 8 -128 243 43 -422 119 589 -374 -353 150 -108 205 351 -530 -164 566 -292 -213 528 -83
4627 -83 -124 195 -365 -45 789 -244 -592 278 73 -151 212 -107 -204 394 -104 -405 151 348 -4 -243 -193
4648 -193 254 232 -176 -22 107 -90 100 -79 -316 459 299 -665 -196 372 -25 72 135 -466 36 450 -350
4669 -350 -35 482 -75 -204 -60 25 313 190 -481 -182 155 6 128 14 -200 243 52 -533 232 521
4689 521 -147 -112 -102 -207 312 273 -505 -69 338 -199 -39 199 -42 158 16 -516 20 501 -2 -245 7
4710 7 -153 8 147 -142 30 224 -141 -261 28 293 213 -292 -381 138 236 22 23 -148 -60 176 -227 -172 471
4733 471 248 -510 -94 51 29 353 -38 -473 137 261 -280 -9 171 -33 -32 -163 -202 351 439 -378 -257 136
4755 136 -41 113 85 -188 164 61 -406 -18 405 31 -113 -99 -227 254 373 -260 -128 211 -46 -117 44
4776 44 -15 233 35 -438 -117 403 55 -93 -190 -45 137 88 -126 51 135 -50 -108 -143 157 388 -225 -437
4798 -437 155 146 -77 215 -177 -262 390 -15 -473 390 337 -445 -76 61 -53 452 112 -560 120 370 -245
4819 -245 -72 191 -111 122 -39 -342 253 445 -247 -154 7 65 218 -103 -218 243 129 -347 9 107 87
4840 87 244 -262 -332 317 179 -226 23 -14 -46 164 -141 -157 383 64 -395 -39 159 111 168 -243 -141 317
4862 317 64 -90 151 -86 45 99 -433 100 509 -169 -347 216 -26 25 395 -405 -269 560 -112 -465 409
4883 409 134 -220 147 -185 -155 483 86 -555 146 300 -158 -44 44 -60 183 -93 -296 21 252 84 -257
4904 -257 -171 98 186 -121 -94 161 -2 -69 -156 -171 268 205 -394 -180 201 64 131 83 -262 10 214 -256 -129
4927 -129 326 28 -238 -123 -46 261 190 -232 -174 171 150 -46 -81 -24 162 46 -278 58 344 -31 -100 -127 -223
4950 -223 197 97 -312 -18 324 -144 -318 175 64 98 146 -345 -166 406 149 -371 -25 39 -142 47 -24
4971 -24 -91 113 6 -415 1 442 139 -217 -115 -14 125 221 -144 -131 118 114 -295 -78 363 111 -202 -154
4993 -154 -16 147 263 -42 -290 159 240 -247 -139 196 53 -12 -31 -207 60 366 -119 -280 141 106 -65
5014 -65 -53 -116 83 121 -310 -143 272 210 -161 -161 -131 157 282 -156 -167 173 29 -181 21 18 134 111 -290 -115
5038 -115 404 171 -212 -97 -50 66 157 -242 -130 392 13 -235 30 112 64 76 -196 -188 266 165 -101 -146 164
5061 164 89 -102 -143 133 179 32 -185 -144 88 330 -116 -304 252 119 -279 38 124 -36 213 -143 -445 246
5083 246 353 -324 -153 49 -91 224 54 -379 145 360 -348 -150 325 56 -1 9 -257 146 385 -119 -253
5104 -253 143 66 -37 -95 -6 233 104 -228 -122 74 193 98 -174 -105 310 65 -243 97 104 21 56 -192 -43
5127 -43 407 46 -390 37 174 -47 16 -24 -27 213 0 -240 46 235 -6 -113 -210 119 365 -32 -215 64
5149 64 85 -48 55 -150 -10 320 -222 -318 328 141 -91 69 -174 -27 405 -73 -317 202 150 -207 -36
5170 -36 22 62 250 -99 -321 142 246 -83 -132 1 122 51 -191 -139 173 158 -46 -151 -102 301 129 -358 -60
5193 -60 143 -100 0 27 -203 246 268 -426 11 478 -161 -165 138 -177 8 266 -250 -140 390 -40 -191 6
5215 6 87 60 6 -185 -35 202 -5 -124 -78 16 218 -79 -307 283 142 -194 -25 -2 -82 264 65 -414 165
5238 165 284 -325 -104 141 -13 118 -9 -334 156 391 -208 -163 86 42 59 33 -221 4 194 -98 -176 54
5260 54 173 30 -337 -100 228 11 -93 67 -119 114 238 -369 -216 453 -10 -363 130 100 -50 212 -149
5281 -149 -270 370 131 -331 -20 184 -50 -49 -62 -46 205 67 -163 -33 41 138 -45 -203 5 229 -146 -163
5303 -163 82 30 10 29 -308 -11 322 -112 -184 137 19 -5 55 -141 106 240 -112 -287 161 155 -107 -94 -40
5326 -40 36 117 18 -220 64 171 -20 -192 33 243 42 -159 37 13 26 103 -151 -183 279 190 -266 -34 253
5349 253 -89 -92 18 -103 131 268 -258 -263 316 84 -227 -56 82 -62 35 -99 -151 175 220 -174 -150 193 139
5372 139 -11 -13 -50 66 140 -153 -126 199 117 -160 -52 27 164 130 -189 -135 140 103 -84 -175 122 226 -40 -150
5396 -150 10 79 57 -96 -155 -54 257 -51 -286 -5 262 -46 -51 -22 -55 172 2 -256 61 192 -109 -67 -86
5419 -86 46 168 -53 -234 130 58 -164 22 -113 -24 233 -158 -269 176 155 -140 -41 38 -9 197 -134 -335
5441 -335 288 259 -227 -24 73 -22 171 -66 -292 166 136 -229 -53 94 -52 87 -135 -131 164 67 -206 6
5463 6 -18 112 169 -303 -71 324 -53 -119 80 -122 32 146 -346 -58 393 -155 -205 147 -20 -22 167 -349 -93
5486 -93 386 -93 -196 196 -2 31 -9 -286 14 394 -108 -175 137 33 36 119 -271 17 307 -206 -96 148
5508 148 -40 45 45 -234 159 280 -248 -143 159 -81 59 -29 -177 195 299 -231 -86 182 -68 65 -53
5529 -53 -207 213 197 -307 -38 178 -48 82 -55 -133 276 149 -326 26 200 14 49 -103 -178 340 44 -300
5551 -300 72 89 -103 85 -85 -122 283 32 -356 90 170 -88 -42 -66 -95 215 16 -293 60 251 -60 -88
5573 -88 -35 44 214 -99 -199 55 114 -24 -55 -88 94 180 -76 -181 178 59 -41 -36 -100 15 188 -154 -142 200
5597 200 48 -103 -105 -94 40 183 -169 -131 162 24 -60 -35 -12 71 97 -160 -94 237 52 -115 -64 -14 168 78
5621 78 -204 -38 196 -16 -73 -52 25 102 45 -219 37 184 -49 -70 -57 70 99 -8 -183 -108 204 0 -201
5644 -201 -56 68 119 -39 -88 11 123 57 -144 20 159 20 -104 -96 108 147 14 -116 -34 141 79 -60 -103
5667 -103 95 124 -47 -148 21 217 36 -234 -107 138 107 -71 -117 -31 116 95 -87 -81 139 128 -57 -55 136
5690 136 123 42 -169 -88 160 44 -183 -91 72 86 -29 -40 -56 203 116 -166 -141 156 109 -94 -53 12 84 60 -72
5715 -72 -72 134 149 -183 -74 95 85 -36 -110 -108 38 139 -190 -165 96 111 -102 -6 41 99 76 -89 -152 105 127
5740 127 -65 -101 0 81 21 -134 -25 101 62 -123 -118 86 101 -22 -139 -118 183 14 -98 -32 73 154 -71
5763 -71 -152 2 94 36 -78 -79 42 185 9 -184 61 80 -53 -32 -53 45 235 -126 -178 129 121 -73 -68 -36 -21 160
5789 160 -59 -203 156 191 -168 -61 89 -30 58 -90 -165 147 157 -176 -106 95 64 57 -116 -23 54 72 -116 -160
5813 -160 -37 123 28 -257 2 166 -5 -33 6 -46 113 132 -222 -51 316 -40 -150 91 42 59 90 -171 -52
5836 -52 291 17 -246 76 85 27 -35 -164 19 137 -86 -182 -32 108 -10 0 -152 135 158 -160 -68 77 -13
5859 -13 112 -94 -256 44 220 -179 -86 174 -19 7 -16 -216 89 228 -172 -170 109 64 23 -103 -143 57 67
5882 67 -137 -45 77 100 26 -206 -90 329 27 -182 71 51 -59 103 -79 -142 281 40 -269 74 184 -53
5904 -53 14 -19 -119 153 87 -241 -15 249 3 -41 -60 75 171 4 -196 -23 112 77 -11 -201 24 103 -93
5927 -93 -111 150 -7 -3 1 -222 -16 294 -190 -215 109 25 -109 -23 -128 31 238 -144 -244 171 165 -75 -102 -1
5951 -1 -7 103 -55 -61 73 97 31 -173 -26 211 27 -214 -24 123 -72 40 -97 -128 188 72 -269 -50 262
5974 262 -155 -100 41 -42 160 206 -190 -111 154 9 -122 3 8 35 8 -156 -37 168 103 -207 -140 153 130 -20
5998 -20 -139 92 61 -15 -39 -116 106 144 -128 -241 127 149 -125 9 44 -47 55 -72 -158 105 229 -162 -176 102
6022 102 71 28 -53 -165 41 159 -33 -153 70 60 -33 -139 -70 144 113 -72 -163 9 136 55 -74 -58 111
6045 111 158 -160 -13 148 79 12 -59 -101 74 146 -159 -67 137 51 -94 -39 37 78 86 -165 -153 144 153 -93 -78 49
6071 49 76 37 -46 -44 127 92 -98 -89 143 137 -39 -180 62 56 26 80 -105 -11 229 -74 -212 118 180 -75 -96 29
6097 29 -38 160 60 -334 27 271 -93 -15 99 -5 4 -23 -147 42 223 -83 -120 40 80 77 -13 -28 25 128
6121 128 -41 -98 -1 175 11 -69 -139 121 71 -137 77 2 60 77 -125 -84 198 43 -170 -13 12 92 94 -149
6145 -149 -146 202 50 -99 -25 -11 25 -8 -58 -16 180 21 -200 -17 67 65 27 -119 -81 154 11 -156 67 123 13
6170 13 36 -176 22 192 -52 -148 61 135 50 -37 -84 81 134 -68 -147 82 141 45 -49 -137 100 75 -37 -100 62
6195 62 34 33 -124 -53 156 47 -140 -86 5 124 59 -101 -120 84 118 -143 -56 120 -24 -65 -111 -77 162 132 -216
6220 -216 -65 154 66 -91 -5 -67 48 114 -120 -138 139 88 -138 -86 85 73 52 -74 -21 87 87 -67 -150 104
6244 104 138 -30 -108 35 89 16 -93 -122 73 157 -6 -127 30 122 -21 -127 -33 104 98 -54 -109 10 111 -29
6268 -29 -79 47 66 -7 -71 -58 38 173 23 -247 -44 119 83 -83 1 19 10 -12 -134 1 116 -33 -130 -31 127
6293 127 47 -14 -107 53 19 44 -35 -53 164 18 -128 -112 193 22 -5 -11 -21 16 162 -90 -97 184 129 -136 -17
6318 -17 89 83 12 -66 -105 74 201 -73 -130 25 139 -32 -7 -21 62 52 -72 -127 43 156 19 -156 -70 134
6342 134 -5 -115 0 66 1 14 -112 37 196 10 -225 -7 46 65 43 -88 -25 165 65 -146 24 111 3
6365 3 -140 -79 39 90 -26 -42 -40 50 83 -79 -67 98 119 -152 -16 123 9 78 54 -199 9 214 -157 -119 138
6390 138 74 -56 30 -41 47 183 -1 -268 98 166 -119 -78 66 34 33 -46 -47 87 169 -10 -139 -43 140 19 -143
6415 -143 41 93 -1 36 -75 -93 146 59 -223 23 184 -65 -57 -52 -65 139 128 -184 -31 182 -11 -37 36 -67
6439 -67 58 68 -184 -104 234 4 -111 3 9 63 -38 -156 68 133 -29 -29 -59 -14 170 43 -232 135 136 -115
6463 -115 0 3 -66 146 -87 -173 118 181 -174 -124 45 19 88 -8 -141 20 118 -99 -69 -29 84 25 -141 -30
6487 -30 220 16 -82 33 -89 23 124 -159 -146 284 56 -106 82 -15 -52 120 -101 -173 212 20 -177 15
6509 15 8 -42 51 -60 -88 133 -3 -141 -27 -4 81 29 -147 51 197 -28 -63 137 -37 81 16 -240 34 226
6533 226 -132 -36 65 -75 37 17 -167 -15 146 -159 -79 82 59 -5 -24 -142 61 148 -76 -68 109 11 11 -77
6557 -77 -109 130 100 -144 21 33 56 78 -117 -116 165 102 -246 32 69 11 87 -95 -106 206 39 -173 32 14 1
6582 1 24 -97 -15 152 -29 -108 41 0 57 17 -197 -12 121 -51 -141 70 -53 49 30 -50 32 147 -74 -118
6606 -118 55 36 -7 -36 -92 -2 89 -61 -35 72 66 10 -61 -50 77 23 -119 -91 -30 -51 27 -93 -46 214 64 -195
6632 -195 85 76 41 130 -138 -105 114 51 -166 -25 145 1 -6 -59 -50 132 15 -74 -8 79 1 -38 -43 43 102 -22 -114
6659 -114 41 36 24 17 -123 39 117 -26 -110 -4 32 34 -1 -123 89 116 -98 -20 45 -30 62 -142 -50 141 70 -63
6685 -63 -107 -17 80 109 -36 -106 65 15 -139 21 67 -5 11 -113 -38 172 34 -165 24 101 30 -10 -68 -43 111
6710 111 94 -85 9 38 36 10 -81 30 57 -66 -30 19 7 49 -4 -170 61 182 -56 6 53 -69 26 45 -124 42
6736 42 127 -176 -119 96 73 -8 18 -107 58 133 -6 -86 9 25 40 -60 -77 111 37 -145 -28 78 70 47 -96
6761 -96 -144 90 90 -198 -6 75 -40 31 -37 -91 184 68 -164 -17 102 -52 -29 -76 -45 120 7 -133 56 121
6785 121 79 -12 -144 -46 110 -3 -86 92 25 -43 20 -135 -26 149 -67 -99 110 83 21 15 -142 12 191 -18
6809 -18 -97 93 0 -44 42 35 4 106 -75 -101 71 32 5 -65 -57 85 63 -65 -15 148 6 28 -55 -77 165 67 -119
6836 -119 -13 134 44 1 -45 -98 52 68 -85 -71 84 17 -107 -32 -50 43 79 -68 -53 57 25 -112 12 40 105
6861 105 -32 -80 10 86 22 -41 -17 41 63 -39 -111 136 22 -38 -8 -28 86 105 -23 -119 19 124 -18 -73 -51
6886 -51 52 -24 -28 -70 93 75 -32 -80 6 115 53 -62 -31 9 76 -38 -96 4 67 -22 -190 -74 99 41 -9 -26
6912 -26 -30 121 66 -95 -51 31 3 -139 -22 73 4 -22 -78 -80 121 105 -117 -43 53 53 -11 60 37 48 79 -92 -65 115
6940 115 39 -66 -75 56 34 -2 -58 17 42 58 -92 -125 3 78 17 -87 -86 44 56 -18 -6 70 50 -47 -54 33 99 -21
6968 -21 -107 -25 96 100 -54 -74 5 126 -8 -13 9 62 36 -101 -57 48 44 -32 -76 -49 72 59 -47 -83 100 21 -5
6995 -5 4 35 39 63 -131 -94 69 44 -63 -50 24 10 -26 -12 -70 72 135 -106 -66 58 50 -64 3 -15 80 112 0 -85
7023 -85 108 78 -48 -91 67 97 35 -52 -114 59 155 12 -70 99 42 -59 -44 -40 51 -24 3 -176 -4 173 47
7048 47 -150 39 55 -33 -11 -26 -6 51 91 -89 -22 106 -21 -101 -8 60 69 -12 -68 -44 85 32 -122 -2 42 93 -32
7075 -32 -93 65 104 5 -37 -50 -23 56 -8 -33 27 118 -109 -22 98 13 79 -37 -184 -9 86 -90 -98 22 98 4 -89
7102 -89 -32 111 39 -45 -126 8 137 60 -108 -33 151 -41 -96 -8 -29 47 85 -157 -5 188 24 -123 72 31
7126 31 -21 13 -80 -44 154 1 -162 108 66 10 -46 -14 -18 36 74 2 -72 45 -6 -63 -51 88 167 -57 -111 64 32
7153 32 57 24 -180 3 85 -107 -69 141 36 -20 73 -57 44 136 -121 -158 49 89 22 -23 30 -15 80 -55 -24
7178 -24 77 117 6 -121 55 104 32 -67 5 42 -10 25 -51 -69 142 115 -97 38 117 -28 31 -25 -91 47 66 -107
7204 -107 16 38 -39 -74 -52 59 139 13 -119 -13 105 65 -36 -54 27 32 -10 -43 59 54 -13 -40 -95 25 115 6
7230 6 -142 88 63 -58 -14 7 16 97 -9 -123 25 196 -33 -156 -6 -6 -25 49 58 -79 40 2 -108 -60 125
7255 125 -18 -83 -9 77 32 33 -63 -121 104 110 -77 -25 106 51 -101 24 100 61 45 -39 -107 10 94 -40 -68 90
7281 90 27 -86 -28 -69 25 89 -139 -111 51 96 -7 8 82 95 -51 -30 -20 99 66 -78 -29 -29 111 45 -83 -62
7307 -62 103 -14 -41 39 19 71 8 -97 25 191 40 -95 48 -3 -25 44 -64 -7 76 50 -72 34 59 60 -18
7332 -18 -93 17 62 31 -39 -69 67 115 -15 -131 130 55 -155 8 38 -86 75 23 -190 52 147 -105 28 84
7356 84 -33 -40 5 -88 85 53 -37 -113 20 6 -27 14 -20 66 29 -46 16 74 65 105 -137 7 141 72 -34 -14 -34 -24
7384 -24 46 -89 -23 117 -35 -109 62 95 14 10 -30 -98 155 68 -39 29 82 39 -65 -50 54 93 -64 11 -9 -22
7410 -22 86 -16 -181 70 82 -161 -42 123 -4 -16 49 -77 64 173 -29 -109 53 22 -4 26 -24 21 44 -63
7434 -63 -77 50 167 29 -139 16 73 1 -96 12 65 2 55 -15 2 142 7 -148 18 139 40 48 -10 -93 111
7459 111 105 -139 -5 136 20 -82 -5 -10 59 53 -60 -38 64 57 -40 -150 95 22 -107 -33 -22 42 74 -28 -185 45
7485 45 135 -37 -82 70 25 -25 -9 -48 -37 96 -33 -84 36 157 -28 -158 14 37 -7 -15 -12 -20 146 37 -154 -53
7511 -53 106 -11 -110 -21 -55 34 34 -80 -63 125 55 -92 19 104 8 -68 -26 58 81 25 -71 -55 107 51 -105 -29 86
7538 86 30 -76 -32 -58 74 30 -96 -102 58 41 -100 75 47 4 25 -22 -104 -3 42 -80 -39 10 92 2 -90 -65 44
7565 44 9 3 14 -50 104 51 -172 0 148 -27 -85 30 -69 19 142 -99 -33 123 14 -112 25 41 12 -8 -71
7590 -71 -15 118 94 42 -124 84 127 -21 -127 46 20 -42 9 -24 87 90 -27 -127 113 74 -70 -20 33 -3 -6 30
7616 30 -46 50 105 -104 -42 22 -5 -13 -67 -54 58 32 5 -39 43 -11 -49 -129 23 67 23 -58 15 8 2 77 -121 -15 79
7645 79 -58 -103 25 62 -28 69 -39 -34 124 44 -128 -34 82 -38 -44 -8 -33 118 -20 -103 -23 24 88 -27 -42 -5
7671 -5 101 -29 -101 55 82 -53 -16 -64 47 158 17 -164 85 87 -86 21 -20 -82 65 33 -146 134 103 -71
7695 -71 -34 10 -31 50 -7 -67 47 13 -30 -137 -12 66 56 -70 -11 83 5 21 12 -127 15 136 -122 -70 204 -47
7721 -47 -95 2 -8 -18 98 -79 -58 208 20 -39 38 -47 9 47 -48 -54 126 -60 -115 47 -1 112 40 -64 -27 104
7747 104 -36 -20 -10 -92 60 11 -80 79 185 -92 -44 82 -15 38 81 -86 11 103 -79 -86 94 16 15 -36 -71 64
7773 64 63 -26 -33 73 -30 54 -13 -94 70 -36 -114 10 6 24 106 -79 -154 101 75 -141 6 -21 -43 94 -36 -81
7799 -81 99 28 -126 24 3 -51 123 -85 -111 119 -4 -88 58 54 81 31 -151 2 54 -63 -89 20 9 66 77
7824 77 -150 -48 111 -29 -112 81 4 -53 -14 -62 -33 141 -23 -60 45 12 48 -55 -103 69 1 -60 -18 11 84
7849 84 23 -11 -69 75 90 -101 -32 82 3 48 -43 -38 82 72 -132 13 118 35 61 25 -48 59 71 -142 33 106
7875 106 -23 24 -40 -7 135 78 -63 -3 38 1 -33 -63 -5 118 -13 -102 52 25 52 -15 -82 1 94 -16 -74 23
7901 23 63 4 4 -21 18 67 -19 -74 123 -17 24 14 -53 61 4 -90 -69 72 73 47 -36 -37 100 44 -128 -54 33 29 -28
7930 -28 55 13 51 90 -90 -36 66 20 -8 -16 -55 132 33 -139 74 70 8 -53 -75 9 115 -6 -72 -54 51 156 30
7957 30 -24 3 104 -12 -84 69 61 1 9 -31 39 111 -70 -2 35 -7 -18 21 -81 32 111 -98 -61 47 28 -50 -10
7984 -10 -40 41 130 -48 -117 58 67 48 -13 9 93 5 -31 -69 33 3 27 -35 -84 52 -21 -48 60 37 -27 -31 -53 -110 55
8013 55 86 -72 -22 37 1 -1 13 70 10 -65 -58 0 49 17 -67 -94 14 75 -49 -28 29 -31 -23 53 -12 86 100 -73 -19 90
8043 90 57 16 26 1 -2 138 10 -59 55 -17 -73 -19 -33 78 82 -33 -17 6 57 6 3 -10 109 45 -93 -24 42 -10
8071 -10 61 -67 -75 113 99 -106 -17 77 1 11 38 -22 98 -3 -93 10 83 9 -22 -66 23 50 41 -12 -8 79 -41 -71
8099 -71 -45 88 117 -29 -59 104 37 -10 33 -51 4 27 -25 -145 111 39 -7 7 29 -6 21 -21 -58 37 96 -13 -131
8126 -131 12 48 -33 -56 -27 40 38 -38 -77 51 91 72 -99 75 29 25 -43 28 18 63 15 -63 -18 121 -10 -98 10
8153 10 0 38 42 -11 -70 45 114 -86 5 55 6 -26 -48 -41 75 56 -70 -81 33 79 -89 -7 23 86 -53 -50 31 -18
8181 -18 91 8 -42 -16 88 -11 -86 80 57 -14
8191a4
$$ Imaginary data points
##PAGE= N=2
##DATA TABLE= (X++(I..I)), XYDATA
0 0 0 0 0 0 0 0 0 0 0 0 0 0 0 0 0 0 0 0 0 2 -4 6 -8 8 -8 10 -12 14 -16 19 -22 26 -28 32 -36 41 -48 53 -57 65 -74
41 -74 80 -89 98 -109 117 -133 142 -156 168 -183 193 -203 206 -198 164 -73 -164 823 -3203 23169
61 23169 145830 -58250 -58137 110144 -68916 -78701 112035 4578 -63235 58910 -14222
72 -14222 -64622 39896 27381 -9692 9793 -24932 -12197 15751 -8139 22985 17789 -43512
84 -43512 1446 18117 -28920 24871 33970 -38411 -10138 8840 -14695 27020 12983 -25936
96 -25936 11114 -13965 -24565 48109 4205 -34549 35489 -18712 -53200 60719 24883 -51213
108 -51213 27356 1997 -54749 37127 31857 -31763 16063 -3037 -38370 22792 13322 -3268
120 -3268 27756 -34554 -34065 48583 -8420 -19641 57925 -29408 -59669 58184 3614 -46261
132 -46261 61892 7456 -79064 27737 37349 -38840 20697 27832 -45971 -9576 29874 -5243
144 -5243 -4084 15301 -1216 -22782 -10022 25420 11144 -17638 10323 -966 -33862 20896
156 20896 29325 -28755 6194 18644 -40322 2143 38532 -17627 -744 16308 -36983 -771
168 -771 38433 -15533 -3994 19396 -30337 -7849 31712 -10382 -2451 21463 -25625 -17918 26705
181 26705 3687 -5447 9497 -11957 -12753 9565 6810 3010 337 -5051 -2326 -9030 778 23139
195 23139 -1579 -18354 7132 -4166 -11610 23499 6848 -22126 7075 3519 -19926 12937
207 12937 20529 -13168 -7667 1867 -8093 5382 14935 -1664 -10319 -4678 2146 1357 879 10996
221 10996 1298 -18865 -1691 10815 -3568 8116 9169 -21362 -6494 17811 -5325 -2281 16478
234 16478 -10312 -15648 10650 1630 -2664 14180 -3250 -18748 2963 10053 -1308 2166 3329
247 3329 -7441 -6820 4339 4849 146 4768 -270 -14623 -1943 15043 629 -4150 5153 -8787
261 -8787 -8621 12850 3451 -5903 8648 -3833 -16919 6998 12533 -3101 1202 -1936 -12332 2920
275 2920 11976 -1191 -2314 1860 -6139 -5957 6008 8607 119 -4313 -3795 -5068 1720 11740 1249
290 1249 -9684 712 1197 -6883 5836 9601 -6080 -3530 1311 -7501 3068 13745 -3805 -9620
304 -9620 2745 -315 -2985 6859 4004 -4937 -2453 -748 -3197 3182 9046 -555 -10051 -2086 4845
319 4845 123 2494 4800 -5926 -5814 4166 -728 -391 10037 -1385 -13335 870 6808 -609
333 -609 3962 1595 -9607 -1933 6532 -1097 266 6061 -3798 -8641 1970 5692 1656 1414 -2294
348 -2294 -7067 60 7276 683 -3164 2348 -832 -6303 1691 6340 -488 -870 -166 -6181 -336 8918
364 8918 -139 -5911 2609 523 -5124 2800 4521 -2529 422 741 -6649 81 9008 -397 -5999
379 -5999 1678 458 -3694 2929 3492 -2967 63 1219 -5606 -70 8798 129 -6752 441 938 -1842
395 -1842 4219 2454 -5411 -260 3004 -4552 64 8182 -1304 -6967 1078 1412 -519 4458 80
410 80 -6741 1226 4570 -3297 -625 5214 -1915 -4727 1969 1179 -777 3649 -499 -6164 1721 5532
426 5532 -3219 -2337 4168 -696 -3064 2076 -309 -1652 4241 98 -5995 1574 4600 -2736 -1389
441 -1389 3048 -1183 -1868 1405 -786 -593 3927 137 -5718 -246 4965 -139 -2381 1239 -849 -1936
457 -1936 2770 634 -2779 2958 1355 -6250 600 6506 -1699 -2841 1613 -2228 -260 4895 -1780
472 -1780 -3950 3440 1177 -3844 879 2908 -924 -1168 -150 -678 939 2289 -941 -3290 1246 3436
488 3436 -2403 -2585 3258 621 -2385 1472 -642 -2134 4021 802 -5359 1875 3777 -3694 -617
503 -617 3034 -1569 -8 1563 -3307 128 4913 -1379 -4202 1354 1918 -674 4 -38 -868 513 927
520 927 -1415 -698 2743 355 -3925 144 3643 -775 -1322 675 -1886 481 3762 -2470 -3008 4166
536 4166 652 -4194 1458 2269 -1835 759 429 -2979 1798 3429 -3431 -2173 3695 220 -2539 1009
552 1009 404 -676 2081 -602 -3443 2114 3112 -2781 -1493 2197 -128 -614 535 -1131 236 1887
568 1887 -1345 -2001 1751 1946 -1211 -2135 310 1983 253 -801 -517 -932 1203 1833 -2573 -766 3480
585 3480 -1386 -2975 2446 950 -695 1258 -2587 -1543 4307 -165 -3053 1687 60 -535 1688
600 1688 -2739 -329 4621 -2462 -2544 3550 -1697 -859 3725 -3949 -1052 6463 -3922 -4174 6072 -925
616 -925 -2431 3969 -3953 -1924 7059 -2971 -4082 5526 -1655 -2640 4379 -3046 -1350 5868 -3966
631 -3966 -3250 6156 -1210 -2586 2526 -3200 562 5345 -4025 -2107 3459 -2308 869 2040 -4221
646 -4221 3162 2441 -7384 2883 5018 -5849 2549 2268 -8058 5330 5437 -9576 2776 6220
660 6220 -7655 2361 3701 -7821 5205 4569 -9786 3901 5150 -8401 4124 3330 -8425
673 -8425 6962 3339 -12212 5925 6731 -9970 4148 4275 -9973 5784 5488 -10577 3809 6117
687 6117 -8269 1988 3620 -5439 4376 1305 -7213 4952 2625 -5487 3268 -722 -3549 6768
701 6768 -1935 -5815 6556 -916 -4486 5651 -2756 -2287 7282 -5762 -3910 9388 -4353 -3638
715 -3638 8131 -6584 -2134 11406 -8406 -5560 13265 -5446 -6994 10698 -4876 -5446 11402
728 11402 -4818 -7023 10576 -2715 -6702 7459 -1891 -2768 6358 -5469 -2844 8464 -3858
741 -3858 -2840 5837 -5008 -469 7160 -6849 -1731 8653 -5280 -3578 6375 -2960 -966 4542
755 4542 -4858 -727 5120 -3338 -674 2335 -2892 2685 1070 -5820 3914 3528 -6106 1893 2261 -4627
771 -4627 4141 1440 -6784 3909 3217 -5692 2361 1541 -3481 4301 -1023 -5671 6269 971 -6341
786 -6341 4974 439 -5748 6203 309 -7696 6461 3298 -8664 2334 4709 -4328 1388 2042
800 2042 -4536 1237 3551 -2381 -1317 1329 828 -619 -2092 1515 2396 -2497 -542 1450 -2016 1603
816 1603 2427 -4258 -199 3933 -2208 -1586 2161 -405 546 100 -2955 1518 2505 -1968 -18 244 -1487
833 -1487 2526 294 -3455 2230 1854 -3263 325 1618 -560 1016 -975 -2189 2105 1022 -1155
848 -1155 217 -1044 583 2191 -2989 -1075 4229 -1042 -2521 1795 -912 -232 2820 -1896 -1849 2482
864 2482 -361 -1384 657 269 1569 -625 -3338 1775 2011 -1748 1306 -525 -3116 3663 923 -4873
880 -4873 2945 2882 -4476 668 1715 -2471 2741 823 -4614 2123 2427 -2840 1138 332 -1955 3192
896 3192 -842 -3945 3990 1174 -3827 2124 110 -2176 3996 -1066 -4382 3997 1211 -3625 2074
911 2074 295 -1786 2639 -1716 -2545 4259 41 -2762 1691 -1186 -569 3533 -2506 -1907 4307 -1497
927 -1497 -2785 2691 -653 41 2863 -3640 -1622 4388 -1421 -1479 2646 -1838 -137 2157 -3685 460
943 460 4570 -2890 -1693 2273 -2116 865 2774 -3941 78 4021 -3016 -1345 2692 -1341 779
958 779 1435 -3871 901 3467 -2918 -307 2222 -1951 948 1119 -3604 1840 3331 -3689 -482 2537
974 2537 -1663 722 1116 -3384 1218 3177 -2645 -1138 1942 -472 -74 45 -1212 1416 1026 -1945
990 -1945 -185 603 402 1149 -1653 -1169 2780 -458 -2327 1680 261 -827 1715 -1961 -2134 4060
1006 4060 507 -3526 1580 846 -1989 1542 70 -1913 2578 672 -3681 753 2523 -997 -226
1021 -226 43 -1122 1122 863 -1610 -54 1516 -39 -1152 -666 1136 1313 -1016 -1098 401 339 730
1038 730 -85 -1789 821 1941 -1660 -1273 2032 60 -1016 440 -836 -64 2307 -781 -2498 1391
1054 1391 1588 -1351 -465 814 46 171 -248 -1139 452 1891 -307 -2292 214 2032 -276 -1229 516
1071 516 119 -510 662 -672 -853 2153 427 -2999 152 2542 -592 -833 283 -1031 388 1727
1087 1727 -1358 -1249 2251 305 -2449 293 1926 -232 -576 -235 -1009 644 2077 -1053 -1913 1658
1103 1658 1019 -2118 43 1605 -620 -139 337 -1874 669 2979 -1659 -2499 2011 777 -1582 677
1119 677 487 -881 1003 -154 -2251 1177 2526 -1540 -1897 1138 723 -423 441 -298 -995 1087 499
1136 499 -2007 462 2827 -1254 -2391 1211 773 -333 1102 -899 -1870 2086 901 -2577 783 2210
1152 2210 -1629 -1091 862 -95 648 1000 -1853 -1334 1877 1062 -1479 -527 1350 -47 -1291 231 644
1169 644 -32 830 -492 -2258 1539 2519 -2188 -1197 2018 -658 -824 1218 -780 -209 1894 -1442 -2178
1186 -2178 1985 1472 -1161 -714 -16 248 486 -218 -466 183 712 -89 -1747 273 2648 -845 -2102
1203 -2102 1125 98 -430 1930 -1313 -1903 3081 -252 -3204 2355 1433 -2247 941 -168 -1943 2861
1219 2861 897 -3393 764 1830 -1292 -14 251 -199 1190 -896 -1379 1218 396 320 272 -2470 802
1236 802 2774 -2751 -764 3061 -1942 -616 2292 -2857 298 4242 -3550 -2351 4086 -1107 -1372
1251 -1372 2506 -2035 -430 2960 -2540 -1129 3250 -985 -789 671 -1933 1799 1871 -3267 652 1704
1267 1704 -2325 1736 384 -3231 3619 917 -5594 2947 2852 -4290 2590 1034 -5261 4230 2476
1282 2476 -6511 3009 3576 -5557 1853 2454 -4372 3320 2142 -6014 2097 3221 -3674 1668 859 -3325
1298 -3325 3223 111 -4189 3859 1126 -3661 2412 -899 -2430 5002 -1446 -4371 4692 -501 -3509
1313 -3509 4217 -1409 -2531 5032 -2873 -3770 6045 -940 -3266 3987 -2789 -1738 5803 -3443 -2691
1328 -2691 5979 -2913 -2877 4832 -3025 -574 5552 -5487 -1902 6744 -3744 -1442 5224 -5152 -487
1343 -487 6248 -6114 -825 7762 -5400 -2471 6046 -4666 -299 6623 -6147 -2085 7142 -4087
1357 -4087 -2179 5476 -3245 -1015 3904 -4309 -76 5032 -3278 -997 2027 -2677 2163 1896 -4422
1372 -4422 2376 2113 -4678 2341 1546 -3714 4191 7 -6366 5099 2325 -5907 3908 896 -5671
1387 -5671 5217 870 -6573 5949 1906 -7465 4070 1996 -5400 5326 565 -7281 5438 2406
1401 2406 -6426 3981 1673 -5181 3808 260 -4897 5397 1117 -5860 3035 792 -3077 4147
1415 4147 -764 -3949 4372 -392 -4013 3728 228 -2235 2808 -2259 -2104 4761 -863 -2579 2493
1430 2493 -1444 -656 2638 -2661 112 3607 -3419 -1153 3002 -2101 1205 2493 -4925 924 4275
1445 4275 -4291 192 3730 -3914 718 3134 -4954 1343 4960 -5092 -960 4252 -3074 232 3324
1460 3324 -4182 217 4248 -3686 -975 3768 -1881 -872 1733 -2017 711 2588 -2363 -1081 1482
1475 1482 -272 498 65 -1032 1322 -148 -1933 1025 679 -43 1022 -2087 -1298 3044 -276 -1607
1491 -1607 1853 -651 -1283 1582 -1299 -379 3317 -1196 -2708 1560 57 -133 1785 -1572 -968 2202
1507 2202 -1226 -1553 2072 260 -527 307 -1551 191 2226 -1084 -1123 1131 -262 38 410 -1211 760
1524 760 1334 -1516 -589 1178 44 121 -346 -1175 1142 1229 -1278 -635 500 225 290 -596 -57 1263 -328
1543 -328 -1323 133 312 1027 766 -1957 -627 1764 -621 -665 1418 -290 -399 501 -1722 -60 2859
1560 2859 -532 -1898 562 -103 96 867 -813 -17 1331 -1222 -1028 1001 520 556 -150 -1826 493
1577 493 1503 -968 -187 831 -485 342 -149 -1379 1320 1465 -1759 -495 809 -99 771 -321 -1447
1594 -1447 1178 909 -1604 257 778 -496 353 -478 -951 1613 655 -1796 -157 595 99 620 -751
1611 -751 -736 1193 -246 -1259 774 528 163 327 -1776 -400 2472 -358 -1415 1090 -191 -771 999
1628 999 -619 -472 2034 -656 -2227 1002 1148 -264 198 -768 -605 1183 -107 -936 731 639 -380
1645 -380 -775 -730 1053 1306 -1034 -906 367 107 463 45 -947 560 677 -1360 -227 1295 263 -135
1663 -135 -692 -1130 1076 1360 -1177 -525 741 -247 -193 187 -288 782 510 -1617 -608 1514 579 -452
1681 -452 -539 -446 340 492 -383 -243 652 171 -790 -764 718 1320 -307 -1277 -125 594 523 111 -607 -161
1701 -161 575 -424 -734 782 1065 -357 -1092 -560 624 1189 16 -964 -377 475 209 -356 -12 836 156
1720 156 -1251 -649 900 1125 134 -1037 -905 460 939 -168 -306 468 60 -889 -430 677 978 270
1738 270 -986 -1281 462 1485 21 -859 50 138 -438 -22 322 479 577 -917 -1573 894 1725 -202
1756 -202 -755 -349 -336 557 491 -514 332 751 -1149 -970 957 1093 180 -776 -1251 -55 1504 321 -719
1775 -719 48 157 -639 -436 593 961 284 -935 -1324 98 1502 657 -1077 -609 317 -113 -33 519 267
1794 267 149 -534 -1500 133 2111 505 -1350 -734 -159 425 831 -145 -304 424 -606 -993 559 1292
1812 1292 444 -783 -1539 -44 1513 590 -409 -360 -420 -5 97 -175 988 970 -1313 -1494 384 1199 939
1831 939 -345 -1457 -251 782 130 226 515 -134 -509 -1007 -362 1769 1107 -1215 -1098 -299 382 1354
1849 1354 53 -1029 509 -185 -1312 676 1281 114 -250 -1581 -990 1923 1126 -887 -160 -515 -696
1866 -696 989 130 -256 1431 -721 -2398 697 1468 406 446 -1356 -1477 1272 754 -512 694 19
1883 19 -828 -335 -593 1175 1957 -1261 -1683 278 -146 1012 1560 -1814 -598 1409 -1513 -297 2511
1900 2511 -261 -920 35 -1885 737 3136 -1008 -1449 750 -975 126 1605 -859 416 891 -2727
1916 -2727 -423 2568 -122 111 4 -2685 564 2536 -1183 -46 1214 -1844 -403 874 -489
1931 -489 1773 748 -3217 -254 1572 -253 1545 -41 -2674 1136 647 -2057 2102 1597 -2640 -83
1947 -83 -29 -1391 3120 1244 -3407 162 745 -1203 1961 558 -1722 1378 -945 -2594 2973 1525
1963 1525 -1855 714 -1499 -1799 3754 525 -2594 1873 -483 -2624 2221 734 -988 2229 -1663
1978 -1663 -3266 2629 1320 -914 1251 -1731 -1692 2438 -589 -817 2824 -1297 -2333 1190 -511 802
1994 802 2832 -2587 -2293 1981 -507 311 2157 -1935 -645 1298 -2555 668 3772 -1780 -1257 624
2010 624 -2389 1734 3435 -3101 -760 2077 -2699 159 3197 -1601 76 1096 -3752 429 3920
2025 3920 -1262 -619 453 -2700 1065 2383 -1723 831 1175 -3052 -32 1674 -317 1864 -183
2040 -183 -3791 828 1957 -729 1454 -89 -2330 945 -180 -1089 3043 367 -2857 206 -584 30
2056 30 3497 -887 -2918 1527 -630 -1152 2910 -104 -1344 1337 -2438 -1353 4189 215 -2024 758
2072 758 -1839 -574 3429 -783 -1381 1920 -1869 -1706 2517 247 103 1103 -2937 -1324 3085 392
2088 392 -621 459 -1718 -409 1270 -582 1079 1361 -2035 -1099 352 269 2295 185 -2893 256
2104 256 558 -784 1923 418 -1854 829 -1114 -1929 3335 1465 -2251 85 -1081 -1177 3416 227
2120 227 -2390 1718 -781 -2554 2462 952 -1060 1643 -1913 -2769 3163 1292 -1538 901 -1214
2135 -1214 -1638 2105 45 -776 2045 -1077 -2252 1042 404 950 1294 -2582 -1224 1830 -276 570
2151 570 1198 -1853 -49 646 -1903 1578 2473 -2271 -798 266 -1492 2446 1718 -3153 454 1208
2167 1208 -2642 1494 2109 -2013 1059 -11 -3717 2355 3019 -2489 370 306 -2850 1985 1783 -2430
2183 -2430 1619 865 -3567 800 1855 -943 1835 -520 -3564 1916 1692 -1664 1461 -66 -2390
2198 -2390 1502 37 -1366 3022 86 -3211 826 293 -304 2575 -1069 -2367 1860 -373 -1028 2323
2214 2323 -450 -1125 1174 -2161 -376 3808 -919 -1901 1245 -1742 110 3069 -1936 -778 2505
2229 2505 -2582 -1189 3199 -834 -298 1624 -3349 -560 3818 -1251 -999 1780 -2245 -488 2367
2244 2367 -1613 412 2519 -2815 -1502 2217 -459 645 1170 -2761 -102 1976 -1425 516 1592
2259 1592 -1788 31 313 -1766 2120 1951 -2818 -286 796 -1246 1896 904 -2536 977 797 -2551
2275 -2551 1322 2026 -1466 263 -449 -2086 2247 1581 -2050 269 222 -1395 1398 472 -1050 1554
2291 1554 -521 -2477 1266 1134 -351 1012 -1433 -1759 2163 289 -1389 1559 -265 -1624 952
2306 952 -366 -333 2422 -852 -2472 1163 530 -309 1377 -855 -1242 1396 -563 -961 1752 196 -986
2323 -986 -7 -968 362 2011 -808 -1124 769 -491 -17 1010 -780 192 1041 -1899 -577 2084 20
2340 20 -543 245 -1414 113 1896 -779 -789 1011 -617 -745 667 182 565 418 -1632 -602 1262
2357 1262 604 40 -507 -858 434 321 -622 758 579 -831 -229 -400 -140 1748 225 -1825 119
2374 119 690 -458 522 207 -721 748 -108 -1518 860 1357 -713 -466 -171 -400 877 392 -952 256
2392 256 532 -604 -262 291 393 519 -663 -998 565 765 2 -374 -561 133 730 -427 -394 735 32
2411 32 -762 -79 258 548 488 -925 -876 688 743 -51 -303 -152 146 -3 -444 252 597 16 -450 -769 -29
2432 -29 1256 201 -1073 42 476 -348 9 167 -96 572 -8 -1218 78 1170 -114 -544 -56 -2
2450 -2 178 115 -416 59 606 -1 -821 -198 853 494 -682 -507 302 372 190 -238 -516 347 512 -787
2470 -787 -259 841 56 -429 -248 -228 635 766 -879 -748 665 400 -232 -169 -93 207 120 -628 -43 696
2490 696 342 -420 -697 146 878 -45 -570 231 214 -106 98 -409 -94 1040 -285 -1146 454 694 -249
2509 -249 -107 -287 -112 712 -25 -787 359 686 -213 -535 -298 544 591 -530 -477 403 59 229 -46 -742
2529 -742 422 774 -1061 -388 1063 -134 -318 92 -697 434 1042 -980 -697 1081 -25 -524 179
2546 179 -124 221 421 -743 -333 744 164 -350 -422 -217 794 63 -938 377 630 -389 140 -240
2564 -240 -485 1170 138 -1594 537 981 -733 117 83 -718 828 325 -1326 529 956 -755 -199
2581 -199 68 -123 884 -115 -1108 567 693 -461 -23 -276 -71 936 -555 -858 1128 108 -694 414
2599 414 -459 -90 1286 -999 -1057 1574 -17 -1101 637 -355 -455 1393 -595 -1337 1443 382 -1189
2616 -1189 331 199 -163 496 -545 -461 918 29 -542 -107 -254 745 485 -1456 165 1153 -811 7
2634 7 665 -1056 528 1027 -1706 39 1837 -1040 -818 887 -333 225 720 -1352 -162 1390 -617
2651 -617 -499 544 -226 339 305 -1065 436 951 -894 -284 341 -248 611 -109 -1178 859 863 -995 -74
2670 -74 220 -280 913 -224 -1205 1038 476 -1170 456 483 -502 568 -204 -1059 1152 850 -1251 -227
2688 -227 546 10 398 -195 -630 592 192 -579 264 134 237 206 -989 -180 1397 -197 -957 518 15
2707 15 -98 727 -611 -670 1121 -4 -1231 395 754 -267 -142 -210 -234 482 177 -622 -123 612 174
2726 174 -596 -395 636 469 -354 -401 -124 260 569 -185 -589 415 321 -711 -33 496 168 38 -515 -686
2746 -686 721 933 -515 -589 285 150 -71 107 -57 -1 263 -448 -626 725 941 -598 -728 248 185 225
2766 225 314 -614 -163 755 -376 -731 765 591 -433 -397 -327 274 832 -273 -641 319 71 -171 70 -260
2786 -260 410 559 -1079 -542 1054 196 -153 164 -875 -22 1127 -656 -488 1151 -336 -778 308
2803 308 66 423 702 -1031 -770 870 299 -145 199 -345 121 231 -721 211 937 -428 -455 -247 -300 1144
2823 1144 434 -1301 96 554 -680 442 376 -603 777 -97 -1728 950 1328 -1056 22 120 -1056
2840 -1056 1027 739 -1374 508 727 -1361 19 707 -293 754 -200 -1633 729 929 -696 340
2856 340 -110 -797 855 -200 -1078 1431 421 -1571 299 250 -382 1366 -226 -1609 943 499 -1041
2873 -1041 668 423 -571 388 -612 -739 1473 412 -1059 -36 -168 88 1021 -537 -561 967 -504
2890 -504 -819 812 70 132 495 -1462 -357 1664 -298 -521 602 -903 -65 1086 -976 -6 1556
2907 1556 -1167 -1120 1123 -59 167 702 -1361 -450 1449 -409 -412 866 -519 -283 266 -740 566
2924 566 1241 -947 -734 440 -295 494 459 -1089 269 776 -1079 -174 1001 -138 -1 -184 -982 623
2942 623 976 -706 -272 267 -302 177 24 -290 769 165 -1125 41 522 224 336 -718 -750 898
2960 898 301 -582 288 -96 -396 276 -366 7 1197 -347 -1297 313 397 135 593 -626 -758 810 24
2979 24 -658 735 375 -601 -255 -483 145 1112 -66 -896 33 116 7 142 -186 300 434 -677 -591 528
2999 528 458 95 -212 -587 149 535 -256 -173 278 117 -222 -471 -82 790 260 -830 -259 234 334 385 -425
3020 -425 -594 514 122 -517 315 358 -317 -148 -466 -6 1014 91 -947 -230 205 298 333 -383 -266 429
3040 429 -278 -565 534 454 -39 -348 -689 101 964 -47 -467 45 25 13 -23 -276 391 576 -605 -650 225
3061 225 374 383 -115 -608 232 315 -427 18 491 118 -117 -552 -258 905 374 -652 -176 -22 4 642 -225
3082 -225 -585 699 59 -943 300 615 -208 86 -425 -561 902 486 -825 -92 299 -83 80 -92
3100 -92 -1 490 -174 -693 151 399 320 -26 -749 41 730 -340 -379 482 -124 38 139 -685 313 1108 -709
3121 -709 -726 585 -32 -78 439 -477 -152 747 -578 -575 763 298 -259 -135 -452 235 645 -382 -337 204
3141 204 26 130 -164 -342 800 249 -1083 51 603 -228 336 -159 -832 648 441 -991 265 642
3159 642 -489 -88 -121 -446 746 349 -1066 -17 488 -143 81 -118 -335 611 -182 -848 439 460 -139
3178 -139 43 -524 -142 946 -277 -715 686 72 -309 489 -471 -216 1146 -472 -1057 917 346 -509
3196 -509 349 -224 -289 878 -191 -757 641 399 -395 -162 -227 379 522 -608 -224 411 -249 207 157 -794
3216 -794 587 703 -1380 18 1200 -534 -215 397 -914 345 1125 -1117 -373 1112 -573 -445 549
3233 549 -353 197 609 -1001 -152 1014 -228 -294 116 -310 485 298 -827 262 673 -352 -11 -127
3251 -127 -237 844 -85 -961 755 357 -743 404 22 -580 996 -97 -1329 820 818 -981 60
3268 60 289 -589 682 195 -989 416 630 -670 -122 128 121 411 -594 -577 847 81 -505 367 -349
3287 -349 -139 911 -644 -810 1241 113 -964 522 39 -350 652 -405 -768 875 314 -849 251
3304 251 233 -36 339 -505 -267 819 -39 -452 179 4 112 183 -610 68 764 -272 -394 173 -108 458
3324 458 213 -1061 284 879 -729 -231 556 -562 94 538 -891 0 1224 -642 -904 725 170
3341 170 -321 244 -207 -350 493 154 -648 30 623 110 -704 -149 631 90 -285 57 -83 -79 434 -363 -492
3362 -492 743 382 -799 -96 439 32 -11 -173 -283 277 375 -356 -213 286 238 -62 -303 67 560 143
3382 143 -512 -225 378 273 -164 -313 99 266 40 -201 -229 311 427 -398 -400 418 347 -263 -296 -110 152 319
3404 319 -217 -256 192 185 -65 -423 -154 678 185 -875 122 692 -377 91 299 -705 278 842 -936 -339
3424 -339 1114 -179 -742 365 22 18 390 -440 -437 504 303 -369 -354 213 514 -327 -492 540 226 -327
3444 -327 163 -304 -313 957 -33 -1104 677 476 -734 188 67 -474 774 -70 -1071 725 525 -751
3462 -751 200 46 -486 779 -118 -1002 838 460 -972 152 276 -336 663 -239 -876 818 361 -634
3480 -634 234 -134 -121 776 -596 -622 1068 -194 -829 628 -41 -216 893 -626 -765 1267 -9 -1020
3498 -1020 491 118 -307 560 -407 -446 864 -130 -514 220 -63 356 311 -955 152 1046 -760 -265 647
3517 647 -621 361 745 -1257 62 1384 -1008 -435 997 -575 -108 819 -1097 -114 1272 -830 -711
3534 -711 926 -241 -63 498 -840 109 1075 -704 -468 609 -225 65 284 -738 363 703 -870
3551 -870 -53 618 -335 226 34 -859 680 634 -1047 75 525 -409 433 78 -808 663 509 -1074 226
3570 226 703 -477 205 -30 -626 784 319 -889 201 305 -275 350 -324 -399 865 -139 -879 615
3588 615 125 -324 624 -527 -500 1255 -190 -1235 921 328 -800 462 -110 -733 941 162 -1159
3605 -1159 556 590 -569 50 100 -159 489 -117 -665 347 300 -142 -118 -253 206 552 -551 -350 577 92
3625 92 -151 -40 -414 212 408 -558 -225 527 -80 -157 68 -391 430 508 -802 -272 745 -76 -134 90 -285
3646 -285 250 332 -652 -122 582 -112 -215 -39 -10 394 -30 -628 91 479 -183 40 -107 -296 464 167 -796
3667 -796 244 699 -428 -412 250 11 203 244 -521 -154 618 -24 -422 150 276 -53 -215 -105 189 257
3687 257 56 -333 -235 405 328 -305 -157 208 97 -164 -227 -53 480 63 -614 -184 444 158 -79 -239 -279
3708 -279 243 222 -430 -107 483 -61 -392 -156 167 269 160 -456 -294 356 308 -253 -185 204 106 -195 -165 226
3730 226 373 19 -384 -246 204 383 -16 -247 -62 155 56 -296 -104 396 38 -446 -117 211 309 221 -429
3751 -429 -461 399 348 -411 63 308 -114 -66 -93 -126 483 220 -615 -220 245 194 21 -259 -187 280 60 -449
3773 -449 76 393 -63 -250 -263 -55 582 126 -590 -163 221 34 -71 -94 84 223 -188 -354 138 332 188
3794 188 -279 -529 211 491 -241 -155 225 -95 -41 29 -261 395 568 -553 -493 426 225 -11 -6 -359 42 375
3816 375 -300 -152 497 8 -169 -159 -156 427 448 -503 -284 364 41 -55 -59 -202 293 138 -617 -90 473 -35
3838 -35 -123 -222 -191 461 222 -556 43 324 -160 -103 -59 -109 478 26 -697 49 628 -51 -240 -156 -67 257 39
3861 39 -311 130 190 -151 -204 -142 300 555 -327 -520 422 71 -192 254 -206 -183 644 -379 -657 643 368
3882 368 -581 -70 6 -147 489 -6 -535 369 229 -388 -56 135 77 209 -419 -361 457 199 -358 -63 -146
3903 -146 127 350 -442 -250 597 18 -449 87 53 109 212 -451 -240 635 -34 -392 101 -63 86 226 -395
3924 -395 -103 625 -142 -484 124 112 228 213 -450 -112 512 -181 -269 188 114 178 -120 -646 281 643 -340 -248
3946 -248 193 -184 151 328 -636 130 732 -525 -495 639 100 -264 95 -378 -104 687 -131 -686 195 317
3966 317 -204 -96 -22 106 39 -197 -131 92 239 185 -386 -387 525 229 -605 29 385 -269 96 -54 -373 429
3988 429 516 -726 -217 576 -123 -166 181 -167 78 360 -447 -180 667 47 -350 -102 -50 315 297 -443 -222
4009 -222 359 8 -155 -4 -6 114 -118 -475 143 518 -116 -336 -108 -150 472 199 -611 39 479 -406 -153
4030 -153 446 -40 2 255 -632 -122 875 -190 -688 207 292 -130 19 -59 -11 241 -77 -349 -76 355 325
4051 325 -372 -428 460 111 -504 340 128 -409 493 17 -800 667 777 -1031 -265 670 -360 81 452
4070 452 -624 8 735 -623 -307 784 -52 -389 144 -215 145 569 -391 -520 298 215 -61 0 -66 160
4090 160 26 -440 134 281 -6 142 -426 -388 837 91 -799 499 334 -687 333 262 -642 645 388
4109 388 -1144 197 952 -428 -104 316 -466 132 335 -450 62 492 -246 -325 -31 223 574 -320 -537
4128 -537 510 52 -276 478 -303 -443 819 -425 -763 1028 272 -927 306 16 -561 865 89 -1072
4146 -1072 540 432 -865 183 516 -351 192 -45 -692 450 631 -426 -195 18 69 223 -242 -40
4164 -40 397 -254 -243 161 -260 390 597 -1078 -281 1073 -450 -422 810 -460 -386 834 -542 -540 1301
4183 1301 -153 -1108 533 190 -349 494 -122 -602 414 166 -430 161 222 31 -141 -457 293 528 -386
4202 -386 -95 187 -412 343 347 -732 254 744 -867 -188 803 -267 -36 409 -949 -159 1065 -519 -475
4221 -475 615 -206 -380 365 -81 -11 489 -322 -518 283 310 42 -282 -163 323 4 -224 329 -61 -163
4241 -163 245 -467 -446 1040 154 -909 306 227 -462 468 191 -791 402 380 -1061 102 904 -272 -311
4260 -311 177 -284 167 458 -300 -355 206 80 -184 -97 323 347 -464 -318 254 117 189 156 -623 -105 640 -297
4282 -297 -419 595 51 -544 155 -43 -57 511 -48 -776 112 519 -148 -103 215 -84 -143 -53 0 92 337 38
4304 38 -631 -134 640 117 -300 31 -43 -213 250 30 -351 416 100 -810 89 630 -152 -137 15 -426 123
4325 123 447 -280 -286 445 49 -539 -37 435 115 -182 -125 -223 57 437 -205 -466 282 292 -502 -28 417 -33
4347 -33 -96 27 -448 84 640 -113 -520 170 213 -215 34 197 82 -72 -187 -193 72 462 118 -505 -213 465
4369 465 -37 -261 196 -4 -187 223 -190 -340 613 64 -729 101 456 -199 44 46 -382 297 283 -430 -134
4390 -134 466 37 -299 -64 115 118 -1 -206 -135 107 260 -113 -329 264 328 -495 -222 360 13 81 61 -552
4412 -552 42 627 -341 -325 439 -46 -370 101 -11 53 402 -202 -520 228 305 -64 -209 -104 205 34 -287
4433 -287 86 170 5 172 -223 -320 607 256 -660 79 397 -409 -13 218 -345 320 377 -692 -229 677 -36
4454 -36 -305 95 -136 -40 277 -145 -148 259 68 -328 -224 326 277 -256 -294 129 67 74 149 -440 -107 621 -288
4477 -288 -427 575 48 -476 188 -71 -178 709 -65 -709 308 334 -354 -31 116 -107 149 -32 -338 185
4497 185 359 -59 -289 -129 159 159 -289 49 283 -255 -129 25 -281 429 483 -679 -279 728 -88 -270
4517 -270 406 -216 -282 502 -200 -322 566 58 -636 77 340 11 50 -179 -128 229 149 -101 -145 -6 327 -163
4539 -163 -442 316 306 -297 -18 -47 -223 425 117 -659 308 467 -575 -176 396 -275 219 209 -735 9 662
4560 662 -330 -294 321 -130 -84 137 -136 104 339 -324 -376 145 244 95 -272 -325 340 51 -239 198 -94 -196
4582 -196 350 -234 -419 668 213 -687 85 352 -343 225 74 -478 250 373 -591 -157 491 47 -153 -85
4602 -85 -132 188 136 -223 -63 -26 88 92 -265 -1 501 -239 -459 276 59 32 212 -463 -293 625 -81 -400
4624 -400 455 68 -437 160 -145 -223 653 -173 -722 290 331 -359 148 -13 -343 309 69 -395 180 400
4644 400 -177 -270 -148 213 255 -226 -105 137 -81 -15 76 -232 265 323 -680 -269 573 27 -132 104 -382
4665 -382 -137 437 -160 -199 429 22 -384 -26 117 222 192 -427 -211 363 27 -22 54 -150 43 158 -353
4686 -353 27 510 -215 -327 65 -117 215 281 -419 -219 446 -122 -226 248 -1 -19 -16 -382 -69 532 -52
4707 -52 -464 7 34 0 146 -95 -136 182 -41 -275 74 296 96 -305 -351 236 338 -110 -89 -71 -90 247 -51
4730 -51 -311 311 235 -514 -160 370 5 123 24 -401 122 341 -271 -152 298 -49 -293 -14 -116 254 342
4751 342 -410 -317 327 45 -1 -13 -160 65 199 -330 -60 363 -50 -302 -35 -135 135 333 -294 -285 279 79
4773 79 -148 54 84 75 88 -339 -132 401 59 -308 -112 39 181 45 -200 2 160 -93 -94 -23 143 384 -145
4796 -145 -527 189 327 -147 44 -26 -283 305 25 -515 227 395 -572 -167 246 -85 215 166 -569 -87 480
4817 480 -223 -120 280 -95 -74 36 -283 205 389 -249 -262 125 45 164 -42 -272 128 192 -312 -42 222
4838 222 -2 0 -132 -322 322 305 -324 -98 223 20 137 -11 -167 271 126 -434 -31 247 138 20 -239
4859 -239 -208 320 50 -239 139 35 -71 27 -223 -6 526 -156 -506 230 107 -82 267 -268 -382 492 50
4880 50 -593 337 328 -425 -66 12 -224 355 107 -542 42 403 -226 -130 109 15 138 -31 -308 4 397 -16
4902 -16 -258 -141 165 276 -74 -131 69 36 -44 -46 -59 226 155 -360 -242 265 113 -110 11 -187 12 251 -201
4925 -201 -195 328 51 -303 -38 80 152 173 -248 -142 179 135 -124 -120 25 172 23 -250 -15 318 -9 -223
4947 -223 -9 15 135 214 -228 -134 335 -88 -368 187 169 -97 -51 -283 -197 465 227 -432 -122 279 1 -50
4969 -50 97 -7 61 73 -279 -57 452 30 -360 -66 147 76 159 -167 -169 116 162 -269 -140 340 99 -227 -64
4992 -64 85 73 74 -150 -177 147 298 -253 -141 279 44 -155 -50 -114 53 330 -104 -323 164 187 -134 8
5014 8 2 21 73 -136 -165 314 192 -186 -118 50 151 194 -180 -227 147 73 -150 -11 91 75 58 -289 -135 353
5038 353 153 -315 -128 34 56 127 -119 -134 273 17 -354 4 189 33 -62 -113 -85 160 152 -212 -122 159 67
5061 67 -158 -135 126 179 -45 -174 -170 70 240 -96 -310 137 202 -264 -52 216 -150 84 -53 -330 246 388
5083 388 -340 -243 184 22 73 133 -195 17 390 -232 -210 326 88 -175 -9 -104 144 309 -104 -255 152 113
5105 113 -135 -62 -4 175 163 -248 -118 99 205 27 -188 -121 278 77 -212 27 157 -41 -89 -108 -98 347
5127 347 94 -445 -103 242 -33 5 -7 -167 76 49 -268 68 255 -45 -123 -98 5 285 -71 -294 25 97
5149 97 -25 -26 -83 -16 249 -160 -337 258 250 -214 8 -85 -68 283 -4 -396 167 279 -270 -45 159 -12 93
5172 93 -58 -317 136 345 -194 -159 53 61 7 -122 -77 168 61 -121 -107 12 271 181 -304 -97 235 -57 -117
5195 -117 128 -150 83 201 -342 -127 431 -15 -348 74 -41 -53 164 -146 -180 343 117 -303 5 184 38
5216 38 -70 -136 26 223 6 -154 9 72 204 -12 -253 187 268 -276 -72 176 -22 176 44 -389 32
5237 32 346 -267 -227 171 -103 -68 85 -177 121 414 -194 -300 211 90 -20 -16 -84 27 164 -125 -197 109
5259 109 112 -51 -229 -90 205 26 -185 8 1 -22 155 -154 -223 376 105 -457 76 257 -142 46 -25 -224
5281 -224 288 215 -397 -48 229 -128 -142 51 59 184 81 -272 -45 107 68 -74 -163 68 222 -43 -230 156
5303 156 89 -54 -62 -174 1 317 -72 -380 166 101 -118 2 -61 -62 195 -65 -311 187 201 -130 -143 36 52
5326 52 115 -6 -198 29 207 -38 -269 -5 276 36 -274 7 154 30 27 -90 -170 256 172 -296 -27 285
5348 285 -25 -150 84 -12 -49 132 -220 -262 268 178 -214 -58 98 -49 -26 -116 -123 76 148 -260 -238 200 141 -138
5372 -138 -111 -3 1 94 -33 -95 129 24 -209 -130 59 93 18 -139 -149 146 135 -146 -94 92 153 -97 -218 95
5396 95 155 -67 12 -16 -12 209 98 -299 -1 297 -51 -97 -37 -2 166 52 -215 14 238 -67 -207 -66 119
5419 119 97 -58 -232 117 167 -134 -113 -39 9 187 -117 -303 192 281 -228 -71 52 -54 135 -28 -325 204
5441 204 248 -285 -62 146 37 105 -61 -274 154 252 -241 -79 93 35 48 -85 -139 146 125 -198 31 64 21
5464 21 8 -256 -88 335 8 -236 52 101 14 91 -200 -149 395 -47 -322 218 14 -46 130 -185 -195 354 8
5487 8 -374 174 82 -92 35 -110 -116 349 -73 -325 197 83 -99 -37 -181 -57 244 -172 -179 189 25 -34 12
5510 12 -150 44 318 -249 -242 195 -41 -62 70 -203 111 220 -277 -156 222 28 7 16 -224 139 188 -279 -94
5533 -94 211 -12 -20 -24 -180 172 182 -392 -72 298 -56 -79 -66 -105 194 110 -305 -14 267 -108 -16 -28 -125 197
5557 197 104 -328 -8 229 -98 -75 -37 -159 169 115 -278 51 279 -117 -96 20 -33 124 6 -244 55 215
5579 215 -91 14 -3 81 153 -126 -217 152 193 -52 -50 -37 45 119 -26 -191 120 116 -190 -42 13 17 91 -178 -155 189
5605 189 177 -46 -20 12 41 93 -103 -131 210 67 -159 -79 50 156 67 -168 -55 186 12 -124 -45 44 92 2
5629 2 -163 -21 221 -32 -126 58 52 43 28 -209 23 262 -17 -174 29 165 17 -63 -91 -6 75 18 -158 -1
5653 -1 141 65 -160 -88 63 119 -53 -153 35 60 48 -165 -102 78 122 25 -93 36 114 -45 -186 -36 93 139
5677 139 -101 -190 29 94 -23 -87 -81 152 103 -104 -116 160 105 -37 -168 -28 105 115 -164 -132 65 36 -77 -73
5701 -73 49 52 54 -144 -95 170 152 -139 -69 81 124 22 -99 -49 155 150 -130 -88 121 53 -63 -125 -29 131 126 -127
5727 -127 -161 145 12 -128 -77 53 81 13 -193 -78 59 58 -116 -129 57 73 -13 -131 -72 154 61 -142 -63 86
5751 86 106 -8 -253 -74 156 1 -137 -64 96 30 -46 -187 22 136 -29 -87 -96 111 153 -70 -183 87 66
5774 66 -54 -83 -70 74 119 -56 -214 152 173 -184 -74 -12 -36 107 -44 -184 133 220 -203 -130 187 15 79
5797 79 -10 -194 59 184 -57 -155 64 53 -39 -52 -75 133 17 -99 -116 65 115 35 -152 -98 241 -15 -154 6
5821 6 -4 80 103 -202 -136 336 10 -321 49 39 -50 105 -121 -133 219 1 -240 5 159 29 33 -76 -44 247
5845 247 -11 -165 11 36 53 -74 -187 79 164 -154 -202 78 34 -6 -26 -166 47 182 -118 -183 114 15 -119
5868 -119 16 -98 95 197 -156 -261 188 40 -12 -58 -91 28 142 -134 -88 83 85 -34 -141 -31 243 79
5890 79 -249 86 149 -14 64 -91 -105 260 75 -316 6 214 -48 -10 22 -83 120 121 -197 -57 199 -77 -168
5913 -168 -39 1 118 69 -181 -1 89 24 -82 -69 22 138 -133 -216 149 61 -44 -38 -138 26 278 -163 -307
5936 -307 171 87 -161 24 33 -63 152 -18 -247 133 189 -102 -167 -25 95 93 -16 -66 45 65 -1 -141 -37 202
5960 202 108 -204 -42 172 -9 -68 -31 -103 100 115 -257 -65 306 -102 -185 26 -35 0 130 -180 -133 219 5
5983 5 -203 48 74 -1 -3 -76 -35 130 18 -231 -44 172 105 -146 -97 61 10 -12 -53 -115 48 140 -68 -175 143
6008 143 223 -55 -22 -16 58 46 -36 -187 70 207 -110 -211 81 126 27 -23 -85 44 150 -37 -164 45 138 -55
6032 -55 -108 -56 163 86 -79 -79 23 81 24 -75 -60 117 69 -111 -38 172 51 -106 -56 -79 96 101 -179 -173 123 71
6058 71 -71 -28 10 -6 10 -84 -108 164 121 -152 -117 131 69 -16 -62 -7 31 39 -83 -86 116 151 -88 -165 38 177 -66
6085 -66 -47 -55 -46 177 64 -227 70 121 -174 -165 69 -62 58 101 -205 -5 241 -87 -228 142 16 -60 71 -98
6109 -98 6 182 -41 -168 90 19 54 -28 -38 10 122 -47 -150 41 102 -27 -111 4 173 140 -58 -79 90
6132 90 -39 70 -37 -97 167 23 -178 62 89 14 53 -88 -145 162 103 -216 -40 145 -36 5 -11 -75 198
6155 198 33 -180 -7 106 16 38 -108 -91 109 41 -184 77 65 -97 -16 -80 -30 179 -44 -226 58 96 -43
6178 -43 -1 -51 -32 141 -30 -166 139 193 -29 -105 -89 78 77 -36 -174 56 140 -28 -73 -14 111 75 -168 -105 90
6203 90 108 30 -90 -121 118 166 -109 -43 136 7 -74 2 -29 44 98 -153 -125 182 30 -110 -8 18 60 45 -124
6228 -124 -92 118 55 -99 -116 71 4 -6 -99 -82 113 44 -44 -113 88 72 -105 -77 88 86 24 -76 -164 50 87 4
6254 4 -73 -28 117 -12 -160 77 75 -2 -37 -116 22 179 71 -170 -21 92 20 -62 -11 31 96 29 -110 -40 170
6279 170 61 -95 -93 28 49 -46 -91 55 97 -1 -126 -39 171 53 -149 -121 -32 30 15 -107 -94 63 85 -172 -146
6304 -146 122 46 -125 -75 -6 42 172 -10 -119 109 101 -114 -36 124 13 -55 -61 -118 67 160 -40 -158 30 130
6328 130 15 -82 -48 100 82 -42 -60 54 167 13 -91 -11 37 55 -116 -30 32 -17 70 -69 -106 130 77 -155
6352 -155 -82 153 31 -51 -18 -124 84 50 -127 26 170 -3 -91 -105 25 74 -37 -92 -35 136 -7 5 -89 84
6376 84 166 -104 -40 107 48 -20 17 -94 32 219 -105 -140 156 112 -144 69 34 -82 195 15 -238 76 127
6399 127 -141 -45 90 -70 18 6 -117 39 85 -39 -182 25 177 -9 -135 -21 124 3 -31 -81 -88 83 47
6422 47 -173 7 208 -30 -89 66 -15 119 83 -240 -111 242 -12 -210 35 25 21 19 -130 -51 163 14 -143
6445 -143 60 74 -13 -8 -70 102 186 -84 -127 26 -1 128 19 -285 22 198 -122 -37 35 -129 25 71 -233 138
6469 138 202 -163 -221 73 -53 10 -4 -149 80 81 -96 -24 29 -13 29 -101 -140 123 69 -130 33 31 8 130 -116
6494 -116 -142 155 59 -243 32 50 -108 74 -15 -138 196 113 -207 -10 167 12 22 -71 -76 205 0 -229 -45
6517 -45 57 13 -20 -138 20 132 -99 -94 28 -24 35 11 -228 0 230 -93 -144 124 -23 19 79 -135 -9 219
6541 219 -90 -129 159 39 -60 60 -67 -24 130 -112 -127 110 31 -13 -38 -53 121 91 -154 -50 112 -40 35
6564 35 -16 -155 87 46 -197 -2 102 -9 17 -18 -111 139 72 -181 -64 119 -53 -6 -73 -65 75 -22 -178 16
6588 16 81 -14 22 -66 1 176 -58 -186 43 56 -54 40 -47 -66 101 -100 -121 114 100 -43 -33 -70 0 161 -37
6613 -37 -182 77 33 1 -141 -70 84 108 -125 -116 57 19 5 -24 -65 161 149 -128 10 92 -31 -9 -13 -77 133 41
6639 41 -153 -7 110 -3 -53 -10 -8 58 40 -179 -32 89 2 -10 -95 -57 140 -29 -91 45 71 4 -38 -91 16
6664 16 111 -76 -137 116 69 36 -60 -119 12 121 -88 -106 33 66 -47 -71 -53 122 94 -139 -37 29 90 68 -23
6689 -23 -112 144 55 -116 42 122 -8 97 -34 -36 176 81 -159 -54 110 -23 -18 -88 -57 59 68 -56 -13 99 57
6714 57 -50 -82 36 114 -114 -58 32 29 19 -61 -143 -50 120 -71 -150 61 -8 -18 28 -112 50 154 -117 -148 115
6739 115 57 -49 -10 -45 77 182 -25 -113 51 105 9 3 -51 57 -12 -126 -9 123 26 63 -29 -113 155 118 -139
6764 -139 -19 101 -72 -42 -15 -52 187 77 -178 -41 151 39 -32 -46 15 33 44 -93 -11 107 -57 -8 -64 1
6788 1 127 -49 -151 -28 50 -78 -1 -44 -5 149 -99 -130 122 75 -58 -15 -57 12 175 -35 -150 19 81 -140
6812 -140 -32 74 48 65 -79 -113 113 100 -13 -94 -50 49 60 -54 32 124 8 -59 11 -22 63 155 -134 -21 182
6837 182 73 -88 -25 5 36 64 -141 -76 123 -4 -112 -48 27 65 38 -44 8 78 7 -67 -118 -49 61 -3 -130 22
6863 22 87 -37 -40 -37 -42 61 15 -31 26 65 -109 -57 13 30 44 -23 -121 52 158 0 -90 22 34 36 -44 -5 81 75 -90
6892 -90 -173 38 67 41 -88 -21 44 88 8 -60 8 93 14 -121 -96 77 51 -131 -21 35 83 68 29 -54 78 0 -103
6919 -103 -55 114 38 -25 -46 -62 143 44 -67 -56 71 14 -15 30 63 76 28 -163 -72 58 72 -85 -42 98 73 47
6945 47 -20 -58 35 41 -89 -80 39 59 -60 -131 33 42 54 -54 -48 55 84 -70 -72 42 46 -93 -55 -40 78 75 -58 -129
6973 -129 9 39 43 -40 -29 52 -24 -59 -10 54 57 -2 -84 72 118 51 -15 16 106 68 -36 -7 13 99 149 -67 -47 94
7001 94 166 -128 7 94 -14 -20 -18 -20 90 156 -99 -117 128 95 -95 -13 -28 13 71 -31 -67 39 102 -93 -46 91
7027 91 85 -27 -36 -30 102 46 -49 -113 31 125 -23 -42 13 -5 25 -25 -28 16 121 -15 -109 65 141 -31 -13 51 23 -9
7055 -9 73 -116 -11 110 39 -61 54 11 -23 -23 -47 -18 76 7 -47 -30 57 55 -4 -123 61 109 -21 -9 28 -26 18 -2
7083 -2 -96 96 157 -89 -109 106 72 78 8 -135 -23 146 -79 -112 96 30 -49 14 17 71 124 2 -96 95 112 77 -80
7110 -80 20 126 35 -22 -41 0 -26 35 -79 -87 213 113 -145 103 77 -8 42 9 -81 31 139 -122 -101 145 14
7135 14 -11 42 -5 42 114 -131 -74 6 3 -72 8 59 87 -67 -179 41 2 3 -23 -100 29 90 -107 -118 68 12 -71 -18
7163 -18 -92 -10 168 -143 -148 44 81 -63 -58 -16 8 47 -60 -18 29 20 18 -93 -14 85 84 -103 -43 88 -20 27 46 -67
7191 -67 78 27 -110 -38 107 14 -65 -36 -71 9 74 -28 -47 100 38 -123 -54 27 36 33 -102 1 34 90 49 -21 27
7218 27 72 -3 -91 46 67 16 -21 -1 83 139 -30 -142 27 109 -60 -58 21 8 58 23 -37 60 140 -35 -151 107 59
7245 59 21 -12 34 4 -7 1 -45 -1 165 88 -126 -35 126 36 -56 -18 -37 88 30 -95 -88 124 -20 -142 -79 61 66
7272 66 24 -77 -110 25 75 -44 -133 81 20 -184 -56 38 39 52 -91 -34 38 129 -50 -48 -1 -30 12 -106 -53 83
7298 83 48 -125 -69 71 62 80 -62 -43 178 -14 -39 43 12 43 4 -37 28 149 6 -110 -33 56 42 64 -45 -59
7324 -59 34 1 -127 14 76 34 -45 -122 74 24 -35 -10 -30 47 66 -39 -182 12 62 -79 33 117 -23 91 13
7349 13 -244 -13 110 -77 -85 75 12 -17 -17 8 97 94 -41 -90 39 31 -26 -60 82 35 62 -65 41 9 19 34 -102
7376 -102 5 156 58 -62 8 -1 47 111 -45 -125 181 5 -163 -19 73 -31 -30 -13 -112 125 31 -96 11 14 -11
7401 -11 -80 -106 94 75 -164 -56 26 8 38 -9 -124 35 157 -108 -79 105 -19 -64 23 -89 25 138 -27 -82
7425 -82 41 61 30 -17 -10 47 62 2 -51 15 82 69 -73 -49 180 92 -153 -32 103 12 60 -10 28 47 3 -141 0
7452 0 134 26 -9 14 -57 -8 98 -93 -72 114 4 -49 -25 56 16 -5 -82 -55 38 79 -62 -65 55 31 -105 -24 57
7479 57 -67 60 27 -95 53 114 -126 -114 74 110 -34 -21 92 -1 63 47 -139 44 118 -40 -90 67 119 -34
7503 -34 -14 -11 -6 86 36 -74 -29 138 45 -153 -9 16 -6 -4 -5 -7 69 -14 -133 -31 100 24 -113 -75 -20 -2 -15 -32 -30
7532 -30 50 55 -76 -50 90 -2 -60 36 48 51 119 -23 -78 57 74 -84 -61 33 22 14 -24 -1 38 102 -88 -91 29 76 24
7561 24 -78 -15 63 -34 -31 41 -33 42 21 -67 30 189 44 -154 34 19 35 61 -38 -39 69 11 -170 34 53 -67 -52
7588 -52 -65 -13 23 -10 -130 -86 57 62 -87 -65 69 38 -76 -61 53 -26 54 -32 -88 45 47 -174 0 37 -18 35 15
7615 15 -108 -15 63 -71 -71 64 61 -11 -50 39 75 33 14 -30 56 15 -49 -78 -67 93 -2 -75 -59 33 -50 11 -65 -93 81
7644 81 5 -148 12 85 1 -3 -23 4 4 133 -143 -20 64 -32 -127 39 15 -18 -29 -71 -54 70 14 65 -32 30 147
7671 147 -71 -30 72 80 12 15 -28 2 100 -20 -186 151 127 -49 -34 30 -27 13 62 -105 60 120 -113 -45 43 23
7697 23 73 0 -89 75 157 -76 -28 8 -36 15 -55 -106 77 75 -117 21 -7 26 51 -98 -118 131 -13 -86 36 24
7723 24 36 147 -75 -101 215 77 -123 -12 -6 -27 9 -30 -78 100 -26 -150 56 32 43 28 -99 11 139 -42
7747 -42 -57 35 -23 -36 32 -139 -16 157 -50 -170 67 39 -36 54 -34 -22 115 -66 -52 63 40 6 1 -91 46 121
7773 121 -84 -110 22 0 14 82 -114 0 52 -197 -55 66 19 -35 -15 -61 94 86 -122 -44 92 -56 6 40 -119
7798 -119 104 66 -109 -24 112 19 -56 -67 -38 85 -6 -50 58 92 -1 16 -37 0 163 -7 -163 3 22 -27 32
7823 32 -71 -69 62 -59 -88 34 13 -4 -19 -43 -64 92 -74 -120 50 43 5 45 -24 8 74 -127 -77 122 50 44 -89
7850 -89 -68 35 113 -117 -31 117 7 -30 7 -28 82 73 -147 -82 101 34 27 29 -28 90 32 -61 -7 26 4 3 -68 -38
7878 -38 6 18 -86 -27 67 -18 -2 -31 7 114 -15 -67 31 63 -66 -83 -11 -18 31 -8 -70 -68 39 -37 -3 -59 16 118
7906 118 -56 -82 48 -6 37 36 -38 9 112 -80 -68 110 64 -76 -9 2 73 56 -62 -109 39 -38 16 53 -10 88
7932 88 42 -38 -66 74 -7 -11 34 -16 50 68 -96 10 76 -15 -77 -70 -35 101 7 -90 10 53 14 -13 -66 12 50 -71
7960 -71 -128 -35 74 -36 -1 -96 63 75 -25 -95 32 53 14 -7 -24 -48 79 -19 -60 108 70 -53 -106 9 48 120
7986 120 -60 -9 -59 78 -14 -15 -12 64 11 -41 -41 96 61 64 -49 -99 85 -17 -39 29 131 -22 -13 -46 -10 67 37 -115
8014 -115 -38 98 -6 -68 -103 -12 14 -51 -65 72 49 34 -10 -103 -5 106 16 -56 67 -26 31 19 -77 -11 110 -82
8040 -82 -131 127 103 -27 19 29 45 112 -123 -62 101 109 -76 4 50 -32 59 -87 -110 72 60 -107 -83 -6 68 12 -157
8067 -157 -8 98 -9 28 -68 -3 103 68 -122 -15 47 -58 -1 90 4 27 60 -51 4 93 19 -86 -26 3 43
8092 43 42 -39 10 -22 33 10 -28 39 90 -19 -111 81 105 -25 -20 -7 29 42 -35 -61 78 115 -102 -38 20 34 37 40 -109
8121 -109 53 104 -29 -112 34 53 -11 -61 -27 17 -73 46 -160 -61 86 18 -100 12 39 52 -50 22 -48 -4 -3 -67
8147 -67 -55 138 34 -91 -27 50 -34 -38 8 -74 77 67 -36 -69 54 35 -72 -22 50 57 62 0 -16 56 44 -81 -75 49
8175 49 68 -31 -82 20 45 9 -27 -48 7 50 -23 -135 34 -14 -63 -15
8191a5
##END NTUPLES=NMR FID
##END=
